##TITLE=1H_ES-ZN-MeCel
 
 8 sc, 
 22.11.2022
##JCAMPDX= 6.0         $$ Bruker NMR JCAMP-DX V2.0
##DATA TYPE= NMR FID
##DATA CLASS= NTUPLES
##ORIGIN= UXNMR, Bruker Analytische Messtechnik GmbH
##OWNER= root
$$ XWIN-NMR		Version 3.5
$$ Tue Nov 22 16:37:25 2022 Russian Standard Time (UT+4h)  she@DPX200
##.OBSERVE FREQUENCY= 200.1313499994
##.OBSERVE NUCLEUS= ^1H
##.DELAY= (6, 6)
##.ACQUISITION MODE= SIMULTANEOUS
##.ACQUISITION SCHEME= undefined
##.AVERAGES= 8
##.DIGITISER RES= 18
##SPECTROMETER/DATA SYSTEM= spect
##.PULSE SEQUENCE= zg30
##.SOLVENT NAME= CDCl3
##.SHIFT REFERENCE= (INTERNAL, CDCl3, 0, 15.7039)
##AUDIT TRAIL= $$ (NUMBER, WHEN, WHO, WHERE, WHAT)
$$ ##TITLE= Audit trail, XWIN-NMR		Version 3.5
$$ ##JCAMPDX= 5.01
$$ ##ORIGIN= Bruker BioSpin GmbH
$$ ##OWNER= she
$$ F:/spectra/data/she/nmr/H-F/1/audita.txt
$$ ##AUDIT TRAIL=  $$ (NUMBER, WHEN, WHO, WHERE, WHAT)
(   1,<2022-11-22 16:36:31.95 +0400>,<she>,<DPX200>,
      <created by zg, POWCHK disabled, PULCHK disabled
       configuration hash MD5:
       00 E9 B6 7A A2 85 ED C7 34 08 36 98 17 FE 4E 26
       data hash MD5: 16K
       9A EE 4E AC A7 A5 4E F6 B3 84 2D A1 E2 88 8C B8>)
$$ ##END=
$$ 
$$ hash MD5
$$ 5C D9 A4 A4 53 D0 47 8D AA 34 A1 F2 F3 7E 56 8C
##$RELAX= 
##$RELAX= 
##$RELAX= 
##$RELAX= 
##$RELAX= 
##$RELAX= 
$$ Bruker specific parameters
$$ --------------------------
##$DU= <F:/spectra>
##$EXPNO= 1
##$NAME= <H-F>
##$PROCNO= 1
##$TYPE= <nmr>
##$USER= <she>
##$AMP= (0..31)
100 100 100 100 100 100 100 100 100 100 100 100 100 100 100 100 100 100 
100 100 100 100 100 100 100 100 100 100 100 100 100 100 
##$AQSEQ= 0
##$AQ_mod= 1
##$AUNM= <au_zg>
##$AUTOPOS= <>
##$BF1= 200.13
##$BF2= 200.13
##$BF3= 200.13
##$BF4= 200.13
##$BF5= 200.13
##$BF6= 200.13
##$BF7= 200.13
##$BF8= 200.13
##$BYTORDA= 1
##$CFDGTYP= 0
##$CFRGTYP= 5
##$CHEMSTR= <none>
##$CNST= (0..31)
1 1 145 1 1 1 1 1 1 1 1 1 1 1 1 1 1 1 1 1 1 1 1 1 1 1 1 1 1 1 1 1 
##$CPDPRG= <>
##$CPDPRG1= <>
##$CPDPRG2= <>
##$CPDPRG3= <>
##$CPDPRG4= <mlev>
##$CPDPRG5= <mlev>
##$CPDPRG6= <mlev>
##$CPDPRG7= <mlev>
##$CPDPRG8= <mlev>
##$CPDPRGB= <>
##$CPDPRGT= <>
##$D= (0..31)
0 1.2 0 0 0 0 0 0 0 0.06 0 0.03 0 0 0 0 0.0002 0 0 0 0 0 0 0 0 0 0 0 0 
0 0 0 
##$DATE= 1669120591
##$DBL= (0..7)
120 120 120 120 120 120 120 120 
##$DBP= (0..7)
150 150 150 150 150 150 150 150 
##$DBP07= 0
##$DBPNAM0= <>
##$DBPNAM1= <>
##$DBPNAM2= <>
##$DBPNAM3= <>
##$DBPNAM4= <>
##$DBPNAM5= <>
##$DBPNAM6= <>
##$DBPNAM7= <>
##$DBPOAL= (0..7)
0.5 0.5 0.5 0.5 0.5 0.5 0.5 0.5 
##$DBPOFFS= (0..7)
0 0 0 0 0 0 0 0 
##$DE= 6
##$DECBNUC= <off>
##$DECIM= 32
##$DECNUC= <off>
##$DECSTAT= 4
##$DIGMOD= 1
##$DIGTYP= 9
##$DL= (0..7)
0 120 120 120 120 120 120 120 
##$DP= (0..7)
150 150 150 150 150 150 150 150 
##$DP07= 0
##$DPNAME0= <>
##$DPNAME1= <>
##$DPNAME2= <>
##$DPNAME3= <>
##$DPNAME4= <>
##$DPNAME5= <>
##$DPNAME6= <>
##$DPNAME7= <>
##$DPOAL= (0..7)
0.5 0.5 0.5 0.5 0.5 0.5 0.5 0.5 
##$DPOFFS= (0..7)
0 0 0 0 0 0 0 0 
##$DQDMODE= 0
##$DR= 18
##$DS= 0
##$DSLIST= <SSSSSSSSSSSSSSS>
$$ [...]
##$SUBNAM2= <"">
##$SUBNAM3= <"">
##$SUBNAM4= <"">
##$SUBNAM5= <"">
##$SUBNAM6= <"">
##$SUBNAM7= <"">
##$SUBNAM8= <"">
##$SUBNAM9= <"">
##$SW= 18.0517283424941
##$SWIBOX= (0..15)
0 0 2 0 0 0 0 0 0 0 0 0 0 0 0 0 
##$SW_h= 3612.71676300578
##$TD= 16384
##$TD0= 1
##$TE= 0
##$TE2= 300
##$TE3= 300
##$TEG= 300
##$TL= (0..7)
0 120 120 120 120 120 120 120 
##$TP= (0..7)
150 150 150 150 150 150 150 150 
##$TP07= 0
##$TPNAME0= <>
##$TPNAME1= <>
##$TPNAME2= <>
##$TPNAME3= <>
##$TPNAME4= <>
##$TPNAME5= <>
##$TPNAME6= <>
##$TPNAME7= <>
##$TPOAL= (0..7)
0.5 0.5 0.5 0.5 0.5 0.5 0.5 0.5 
##$TPOFFS= (0..7)
0 0 0 0 0 0 0 0 
##$TUNHIN= 0
##$TUNHOUT= 0
##$TUNXOUT= 0
##$USERA1= <user>
##$USERA2= <user>
##$USERA3= <user>
##$USERA4= <user>
##$USERA5= <user>
##$V9= 5
##$VALIST= <valist>
##$VCLIST= <CCCCCCCCCCCCCCC>
##$VD= 0
##$VDLIST= <DDDDDDDDDDDDDDD>
##$VPLIST= <PPPPPPPPPPPPPPP>
##$VTLIST= <TTTTTTTTTTTTTTT>
##$WBST= 1024
##$WBSW= 4
##$XGAIN= (0..3)
0 0 0 0 
##$XL= 0
##$YL= 0
##$YMAX_a= 741817
##$YMIN_a= -709538
##$ZGOPTNS= <>
##$ZL1= 120
##$ZL2= 120
##$ZL3= 120
##$ZL4= 120
##$ABSF1= 10
##$ABSF2= 0
##$ABSG= 5
##$ABSL= 3
##$ALPHA= 0
##$AQORDER= 0
##$ASSFAC= 0
##$ASSFACI= 0
##$ASSFACX= 0
##$ASSWID= 0
##$AUNMP= <proc_1d>
##$AZFE= 0.1
##$AZFW= 0.1
##$BCFW= 1
##$BC_mod= 2
##$BYTORDP= 1
##$COROFFS= 0
##$CY= 11.3945322036743
##$DATMOD= 1
##$DC= 2
##$DFILT= <>
##$DTYPP= 0
##$F1P= 2.36226072786647
##$F2P= -0.459571619588291
##$FCOR= 0.5
##$FTSIZE= 0
##$FT_mod= 4
##$GAMMA= 1
##$GB= 0.15
##$INTBC= 1
##$INTSCL= 1
##$ISEN= 128
##$LB= 0.24
##$LEV0= 0
##$LPBIN= 0
##$MAXI= 10000
##$MC2= 0
##$MEAN= 0
##$ME_mod= 0
##$MI= 1.114404
##$NCOEF= 0
##$NC_proc= 0
##$NLEV= 6
##$NOISF1= 3.799351
##$NOISF2= 2.8
##$NSP= 1
##$NTH_PI= 0
##$NZP= 0
##$OFFSET= 15.70392
##$PC= 1
##$PHC0= -17943.73
##$PHC1= 9.80072
##$PH_mod= 1
##$PKNL= yes
##$PPARMOD= 0
##$PSCAL= 0
##$PSIGN= 0
##$REVERSE= no
##$SF= 200.130013532006
##$SI= 16384
##$SIGF1= 3
##$SIGF2= 2
##$SINO= 400
##$SIOLD= 16384
##$SREGLST= <1H.CDCl3>
##$SSB= 0
##$STSI= 0
##$STSR= 0
##$SW_p= 3612.71676300578
##$SYMM= 0
##$S_DEV= 0
##$TDeff= 0
##$TDoff= 0
##$TI= <>
##$TILT= no
##$TM1= 0
##$TM2= 0
##$TOPLEV= 0
##$USERP1= <user>
##$USERP2= <user>
##$USERP3= <user>
##$USERP4= <user>
##$USERP5= <user>
##$WDW= 1
##$XDIM= 8192
##$YMAX_p= 0
##$YMIN_p= 0
$$ End of Bruker specific parameters
$$ ---------------------------------
##NTUPLES= NMR FID
##VAR_NAME=  TIME,          FID/REAL,        FID/IMAG
##SYMBOL=    X,             R,               I
##VAR_TYPE=  INDEPENDENT,   DEPENDENT,       DEPENDENT
##VAR_FORM=  AFFN,          ASDF,            ASDF
##VAR_DIM=   8192,          8192,            8192
##UNITS=     SECONDS,       ARBITRARY UNITS, ARBITRARY UNITS
##FACTOR=    0.0002768,     1,               1
##FIRST=     0,             0,               0
##LAST=      2.2672688,     0,               0
##MIN=       0,             -709538,         0
##MAX=       2.2672688,     741817,          0
$$ Real data points
##PAGE= N=1
##DATA TABLE= (X++(R..R)), XYDATA
$$ [...]
$$ plain form
2128 -1906 633 1138 -1369 -691 1762 574 -1513 -439 767 30 51 536 -594 -899 740 769 -700
2145 -700 -38 802 -933 -1088 1741 1344 -2136 -1199 2164 477 -2118 638 2181 -1760 -2343 2464 2257
2162 2257 -2690 -1674 2669 585 -2670 685 2804 -1676 -2847 2166 2524 -2264 -1641 2250 434
2177 434 -2336 711 2516 -1424 -2418 1687 1855 -1700 -762 1742 -425 -1885 1374 1899 -1834 -1516
2193 -1516 1904 598 -1905 649 1936 -1831 -1979 2580 1670 -2862 -875 2862 -379 -2851 1758
2208 1758 2813 -2835 -2637 3391 2008 -3569 -912 3624 -530 -3658 1823 3663 -2705 -3361 3126
2223 3126 2568 -3327 -1359 3532 2 -3745 1056 3786 -1668 -3440 2007 2613 -2251 -1458 2575 374
2239 374 -2897 345 2883 -708 -2456 877 1558 -1147 -589 1444 -163 -1638 495 1420 -544 -773
$$ packed form
2128a906K539N05k507O78K453j188k087J074J206p37K1M85j130l05J639K9j469
2145g00O62Q40j735j55K829l97l480R37L363j687k595K756J543l941n83M807k07
2162B257m947J016M343k084l255L355K119m480j171N013L58m788O23L891j816
2177D34k770L047J805l940r94M105J68l555R38K504k167j460L259N25l733L18
2193a516L420j306k503K554J287l767j48M559r10m532J987L737l241k472M609
2208A758J055n648J98O028j383n577K657M536m154l128N481J840o368o56O487
2223C126n58n895J968M891l530l747M801K730n454j772N447O06m864P93M033k201
2239C74l271L242K538l591j748L333O81k705N58K033j607j475K133R25j964k29
$$ plain form
2255 -773 573 -115 -700 862 836 -1234 -720 1243 231 -1054 579 971 -1344 -998 1851 906 -1900
2272 -1900 -551 1711 -141 -1496 943 1436 -1572 -1412 1828 1207 -1706 -711 1472 -67 -1351 773
2288 773 1331 -1188 -1278 1186 919 -957 -306 698 -429 -583 939 508 -1054 -265 789 -250 -387
2305 -387 974 47 -1544 182 1779 -458 -1530 969 985 -1666 -445 2364 38 -2755 366 2678
2321 2678 -875 -2230 1580 1607 -2400 -1068 3055 607 -3276 -145 3040 -532 -2579 1421 2048 -2268
2337 -2268 -1616 2818 1203 -2935 -641 2665 -190 -2257 1097 1870 -1871 -1525 2248 1086 -2197 -399
2353 -399 1869 -461 -1443 1298 1136 -1812 -773 1899 252 -1607 462 1185 -1289 -803 1894 468
2369 468 -2128 -77 1932 -527 -1525 1247 1083 -1964 -768 2361 406 -2382 46 2084 -731 -1679
$$ packed form
2255g73J346o88n85J562k6k070N14J963j012j285J633L92k315L46K849r45k806
2272a900J349K262j852j355K439M93l008J60L240o21k913R95K183j539j284K124
2288G73N58k519r0K464k67j876O51J004j127j54J522m31j562P89J054j039j37
2305c87J361r27j591J726J597k237j072K499J6k651J221K809k326k793L121K312
2321B678l553j355L810K7m007J332M123k448l883L131L185l572k047M000O27m316
2337b268O52M434j615m138K294L306k855k067L354P73l741L46L773j162l283J798
2353c99K268k330r82K741j62k948J039K672j647j859K069P23k474M86K697j426
2369D68k596K051K009k459r98K772j64l047J196L129j955k788K428K038k815r48
$$ plain form
2385 -1679 1472 1345 -2067 -1053 2322 713 -2182 -174 1870 -542 -1553 1228 1335 -1640 -1076 1677
2401 1677 686 -1433 -108 1110 -532 -856 985 663 -1113 -443 881 33 -522 451 166 -892 12
2418 12 1043 -185 -860 414 423 -806 -2 1203 -289 -1406 472 1318 -647 -926 957 437 -1324
2435 -1324 -29 1627 -205 -1693 378 1419 -623 -935 996 465 -1370 -142 1537 -93 -1394
2450 -1394 278 954 -575 -462 930 10 -1174 223 1115 -428 -740 613 132 -894 387 1098 -766
2467 -766 -1078 986 722 -1119 -151 1314 -511 -1493 1036 1544 -1336 -1282 1538 763 -1721 -62 1938
2484 1938 -579 -2094 1069 2021 -1344 -1611 1609 1007 -1882 -298 2159 -303 -2272 698 2085 -1026
2500 -1026 -1593 1321 923 -1660 -272 1891 -212 -1895 557 1557 -834 -933 1155 317 -1403 223
$$ packed form
2385a679L151j27l412J014L375j609k895K008K044k412j011K781J07k975N64K753
2401A677r91k119J325J218j642l24J841l22j776O70J324q48n55R73k85j058R04
2418A2J031j228o75J274Rj229Q04J205j492j117J878Q46j965k79J883n20j761
2435a324J295J656j832j488K071J041k042l12J931n31j835J228J679j630j301
2450a394J672O76j529J13J392r20j184J397Q92j543l12J353m81j026J281P11j864
2467g66l12K064k64j841R68J465j825r82K529N08k880N4K820p75k484J659K000
2484A938k517j515L163R52l365k67L220o02k889J584K457k462j969K970J387l111
2500a026n67K914l98k583J388K163k103j683K452J000k391r9K088q38j720J626
$$ plain form
2516 223 1481 -577 -1275 825 795 -1044 -150 1277 -412 -1415 809 1329 -1054 -947 1259 384 -1491
2533 -1491 223 1678 -694 -1727 1008 1509 -1259 -1042 1488 472 -1757 68 1930 -458 -1922
2548 -1922 733 1612 -973 -1115 1266 590 -1505 -156 1625 -85 -1503 267 1130 -469 -660 694
2564 694 297 -847 -56 817 -5 -556 58 180 -134 196 222 -376 -207 385 27 -328 339 282 -728 -265
2584 -265 974 220 -1039 -45 956 -316 -847 740 771 -1122 -722 1308 576 -1334 -255 1256 -243
2601 -243 -1152 739 1102 -1073 -963 1197 671 -1160 -205 1052 -290 -956 731 838 -946 -609 929
2618 929 226 -805 281 638 -738 -483 1013 268 -1058 74 900 -520 -684 1036 472 -1398 -264
2635 -264 1545 -67 -1465 530 1283 -1094 -1055 1603 828 -1929 -527 2047 90 -1940 510 1801
$$ packed form
2516B23J258k058o98K100l0j839Q94J427j689j003K224N20k383J07K206q75j875
2533a491J714J455k372j033K735N01k768K17K530j016k229J825J862k388j464
2548a922K655Q79k585j42K381o76k095J349J781j710j418J770Q63j599j91J354
2564F94l97j144P91Q73q22n51O14J22l14L30K6n98J69N92l58l55O67n7j010M63
2584b65J239p54j259R94J001j272n31J587L1j893M00K030p32j910J079J511j499
2601b43r09J891L63k175J10K160n26j831R55J257j342o66J687J07j784L37J538
2618I29p03j031J086L57j376K55J496p45j326J132Q26j420j64J720n64j870J134
2635b64J809j612j398J995P53k377L9K658p75k757J402K574j957k030K450J291
$$ plain form
2651 1801 -1138 -1598 1661 1349 -1948 -983 2040 461 -1996 187 1881 -810 -1746 1260 1500 -1466
2667 -1466 -1107 1510 566 -1479 -7 1406 -472 -1295 737 1100 -808 -729 781 281 -724 143 707
2684 707 -406 -603 486 385 -419 -64 375 -306 -300 579 231 -672 -74 630 -196 -498 548 390 -868
2703 -868 -298 1012 143 -989 79 853 -423 -688 776 549 -994 -425 1025 202 -920 77 701
2720 701 -397 -560 629 436 -681 -298 575 112 -370 133 185 -342 -30 410 -44 -300 182 71 -359
2739 -359 209 532 -426 -605 559 523 -714 -270 879 -91 -1068 403 1209 -680 -1204 930 982 -1169
2757 -1169 -598 1461 190 -1697 217 1806 -566 -1699 899 1390 -1231 -960 1589 517 -1834 -124
2773 -124 1889 -231 -1698 609 1380 -966 -992 1304 631 -1480 -298 1491 -4 -1291 364 995
$$ packed form
2651A801k939m60L259l12l297R65L023j579k457K183J694k691r36L006K40k966
2667a466L59K617r44k045J472J413j878q23K032L63j908P9J510n00j005Q67N64
2684G07j113j97J089j01q04L55M39o81OQ79l48r03N98P04q26l02J046j58j258
2703h68N70J310q69j132J068P74j276k65J464k27j543N69J450q23j122R97O24
2720G01j098j63J189j93j117L83Q73m63m82N03N2n27L12M40m54k56M82j11m30
2739c59N68L23r58j79J164l6j237M44J149r70r77J471Q06j889n24K134N2k151
2757a169N71K059j271j887J914J589k372j133K598M91k621K71K549j072k351J710
2773a24K013k120j467K307P71k346k6K296o73k111J182J789j495j287J655O31
$$ plain form
2789 995 -678 -682 951 408 -1054 -182 956 -103 -776 411 486 -708 -237 882 3 -880 230 703
2807 703 -503 -423 804 163 -975 93 1054 -307 -921 584 665 -822 -367 1089 116 -1183 126
2824 126 1147 -326 -934 572 678 -805 -431 969 236 -1031 -86 907 -92 -714 282 514 -463 -370
2842 -370 554 283 -522 -211 383 75 -193 46 59 -142 20 119 -29 39 106 -239 -161 475 189 -577 -89 628
2864 628 -80 -635 380 645 -683 -612 927 526 -1034 -308 1112 -42 -1106 424 1077 -769 -1020
2881 -1020 992 822 -1117 -514 1185 124 -1195 262 1159 -593 -1085 772 861 -899 -517 966 147
2898 147 -1003 220 997 -447 -864 625 621 -701 -253 799 -116 -824 414 739 -616 -542 731 205
2916 205 -809 184 831 -530 -777 775 618 -949 -300 1003 -74 -1050 454 1013 -756 -910 943
$$ packed form
2789I95j673mJ633n43j462Q72J138j059o73J187P5j194M71J119q79q83J110M73
2807G03j206Q0J227o41j138J068R61j361o14J505Q1j487M55J456r73j299J309
2824A26J021j473o08J506J06j483L74J400p33j267R45R93r99o22R96K32r77R3
2842c70R24k71q05L11N94l08k68K39J3k01J62R9j48O8O7l45P8O36k86p66M88P17
2864F28p08n55J015K65j328P1J539m01j560P26J420j154j064J530O53j846k51
2881a020K012j70j939O03J699j061j319J457Q97j752m92J857Q9j760L82J483q19
2898A47j150J223P77j444m17J489mj322M48J052r15p08J238L25j355P4J273n26
2916B05j014R93O47j361k47J552j57j567O49J303j077r76J504N59j769j54J853
$$ plain form
2933 943 656 -1067 -325 1125 -73 -1158 390 1121 -630 -997 791 753 -914 -397 1009 71 -1035
2950 -1035 178 1017 -349 -857 478 621 -576 -345 657 80 -677 83 609 -177 -433 228 172 -275
2968 -275 32 274 -188 -242 222 62 -226 131 199 -347 -159 492 71 -554 58 503 -300 -414 514 331 -704
2989 -704 -230 794 70 -770 118 684 -374 -584 617 480 -778 -349 820 155 -786 103 687 -377
3007 -377 -592 574 459 -690 -298 697 57 -621 204 513 -488 -394 632 224 -671 -22 581 -274 -475
3026 -475 528 325 -713 -151 781 -54 -721 321 599 -579 -425 829 270 -932 -58 946 -193
3043 -193 -842 481 693 -734 -518 952 335 -1034 -110 999 -177 -891 445 769 -723 -617 877
3060 877 419 -938 -150 889 -140 -776 421 660 -628 -497 728 277 -715 -40 613 -222 -490 469
$$ packed form
2933I43k87j723P42J450j198j085J548P31j751l67J788l8j667N17J406r38j106
2950a035J213Q39j366n08J335J43j197K31J002n77p57P60N26p86k56O61n6m47
2968b75L07K42m62n4M64j60k88L57O8n46J88O51m21o25O12M45q03j14R28j83j035
2989g04M74J024p24q40Q88N66j058k10J201j37j258M29J169o65r41Q89N84j064
3007c77k15J166j15j149L92R95o40o78Q25L09j001R4J026m08q95O49O03q55k01
3026d75J003k03j038N62R32q35o67J042K78j178J54J254n59j202Q74J004j139
3043a93o49J323K12j427K16J470o17j369R24J109j176p14J336L24j492J06J494
3060H77m58j357P88J039j029o36J197K39j288J31J225m51r92O75O53q35k68R59
$$ plain form
3078 469 395 -557 -203 563 29 -474 219 362 -418 -238 539 113 -552 53 474 -244 -346 430 216 -587
3098 -587 -109 647 -61 -604 218 484 -419 -346 591 196 -688 -53 691 -89 -588 319 453 -514 -292 646
3118 646 135 -676 39 603 -202 -470 411 275 -544 -116 599 -55 -567 201 415 -369 -256 515 45 -597
3138 -597 83 563 -249 -439 382 252 -532 -69 633 -88 -641 246 568 -371 -385 542 182 -668 20 738
3158 738 -190 -688 356 567 -513 -348 666 146 -756 65 776 -226 -673 402 477 -575 -248 688
3176 688 46 -763 142 654 -322 -528 451 289 -584 -88 656 -102 -635 240 506 -363 -317 485 124 -577
3196 -577 40 590 -206 -533 316 373 -438 -153 549 -9 -587 163 550 -302 -422 407 238 -529 -33 593
3216 593 -144 -586 289 484 -397 -297 495 98 -590 109 589 -281 -501 402 335 -477 -140 560 -73 -574
$$ packed form
3078D69p4r52L54P66n34n03O93J43p80J80P77m26o65O05M21p18j02P76k14q03
3098e87M78P56p08n43Q22K66r03P3R37l95q84O35P44p80m99R07J34r67K22R38
3118F46n11q11P15N64q05k68Q81j36q19M28P15o54n12P68K14p84J13P71m70o42
3138e97O80M80q12j90Q21j30p84M63P02p21n53Q87L22r39j4R27l60q50O88P18
3158G38r28m98J044K11j080J65J014n20r02Q21P11j002m47J075P5j052L27R36
3176F88o42q09R05N12r76k06R79j62q73M96P44p58n33Q75K66q69M6Q02l61p01
3196e77O17N50p96l27Q49N7q11K85P02n58n78P50L87q52j20Q29j69p67M96O26
3216E93p37m42Q75J95q81J00P92l97o88O99M80q70k20R03o7q12L37P00o33n01
$$ plain form
3236 -574 249 522 -350 -407 454 177 -503 11 533 -194 -527 327 433 -420 -273 484 63 -534 119 533
3256 533 -300 -485 395 341 -482 -164 534 -46 -554 224 509 -376 -416 442 238 -505 -32 550 -195 -508 331
3277 331 443 -424 -285 481 79 -513 117 497 -299 -434 405 328 -464 -132 495 -90 -487 256 435 -386
3297 -386 -346 442 185 -492 -6 487 -189 -463 326 401 -449 -276 466 87 -506 109 483 -289 -450 410 332
3318 332 -466 -164 498 -49 -495 205 454 -377 -371 446 199 -477 -11 476 -181 -435 343 340 -444 -232 456
3339 456 39 -451 149 396 -324 -356 423 212 -469 -95 443 -92 -432 261 346 -410 -280 471 119 -503 12
3360 12 463 -214 -428 377 332 -459 -216 511 58 -514 124 464 -313 -387 442 299 -488 -128 521 -41 -466
3381 -466 244 408 -391 -316 478 175 -498 -12 461 -172 -389 305 299 -423 -209 443 57 -434 102 375 -270
$$ packed form
3236e74Q23K73q72n7Q61k77o80N14N22p27l33Q54J06q53J47P57m21n97O53M14
3256E33q33j85Q80n4q23L18O98n80n08P78K85q85m0Q58k04p43M73N82p45l13Q39
3277C31J12q67J39P66m02n92O30L80p96j35Q39p7p92L32O27n85l97P43J79q21
3297c86M0P88k57o77M86M93o76k74P89P5q50J73P42l79n93O15L74p72j61Q60p8
3318C32p98L02O62n47m46P00K49q31OQ17k47o76M66M87o57k54P78lp84K12O88
3339D56m17m90O00K47p20l2P79k11o81L74N38n35l40O93Q5p56J30P51l52o22N15
3360A2M51o77k14Q05m5p91K43P27m53n72O38L40p77p4Q29j43p87L60O49n62m25
3381d66P10J64p99P5P94l03o73M86M73o33k17O94op22K14O52l86m91N36K73o45
$$ plain form
3402 -270 -302 381 199 -453 -99 440 -67 -389 225 301 -365 -212 462 118 -453 43 439 -198 -351 352 261
3423 261 -476 -140 510 12 -500 162 405 -328 -294 446 180 -513 -54 491 -100 -445 230 318 -380 -209 449
3444 449 78 -483 45 418 -180 -326 323 217 -431 -118 453 -9 -430 148 354 -275 -225 388 116 -459
3464 -459 -11 464 -123 -373 281 284 -400 -166 507 22 -528 100 471 -261 -352 400 228 -521 -90 540 -94
3485 -94 -570 194 440 -348 -313 462 161 -541 -38 533 -104 -477 251 363 -356 -251 448 127 -484 7 480
3506 480 -127 -390 255 257 -357 -159 422 35 -442 80 378 -204 -276 313 150 -403 -48 403 -93 -372 194
3527 194 264 -320 -157 378 13 -431 98 404 -222 -301 311 179 -388 -47 434 -77 -418 189 349 -270 -239
3548 -239 368 104 -413 30 428 -118 -385 212 286 -299 -159 333 24 -395 75 382 -165 -304 240 182 -329
$$ packed form
3402b70l2O83j82o52L54N39n07l22O14P6o66J53O74l44n71M96L96o37j53P03r1
3423B61p37L36O50m98n12O62K43p33L4P40k66o93M59N45n91l45O75Q8o98J71O58
3444D49l71n61N28L73n98j46O49j06o48L13N71m62m21N78K06o29N0O13k72n75
3464d59M48M75n87k50O54Lo84K34O73m85n50O28L71p32r1P52j72p49M31O30o34
3485i4m76P64K46p88L5P75l01p02N03N71o37l73P28J12p19J05O99l21o11M91M73
3506D80o07k63O45Ko14J98N81l87m77N22K98n82p2N89j63n53L55M51m96k79N66
3527A94P0n84J63N35l65m44N29L06o26p9O12j32n67L41M81n11l41O07J60o19L1
3548b39O07k64n17M43L98n46k67N97P4n85J40M92l09m19M70L07n47j39N44n8n11
$$ plain form
3569 -329 -49 357 -97 -362 182 282 -270 -191 335 37 -354 114 366 -219 -295 314 200 -379 -39 430 -90
3590 -90 -419 253 375 -331 -273 413 134 -444 40 484 -175 -450 293 390 -384 -250 438 92 -487 69 471
3611 471 -207 -445 299 344 -393 -205 446 32 -466 98 441 -228 -373 332 260 -383 -92 439 -82 -448 194
3632 194 355 -291 -240 382 106 -406 54 398 -205 -365 327 263 -394 -126 408 -47 -419 174 386 -303 -318
3653 -318 347 182 -426 -56 427 -108 -426 224 372 -319 -276 391 159 -417 19 412 -145 -380 267 321 -335
3674 -335 -196 401 59 -385 100 363 -210 -295 315 191 -350 -59 361 -79 -332 206 261 -330 -171 339 43
3695 43 -363 106 313 -223 -273 334 194 -376 -74 377 -83 -365 213 323 -328 -236 397 147 -413 11 411
3716 411 -153 -360 300 307 -368 -189 438 84 -447 75 417 -231 -351 365 266 -403 -140 442 -10 -432 161
$$ packed form
3569c29K80M06m54k65N44J00n52P9N26k98l91M68K52n85p6O09j14n79L40M69n20
3590i0l29O72J22p06N8O86k79n78M84M44o59k75P43R7p74J34O88l46n79N56M02
3611D71o78k38P44M5p37J88O51m14m98N64L43o69j45P05p2o43K91N31n21l66O42
3632A94J61o46N1O22k76n12M60L44o03j60O92o4o57K68N34m55l72N93K12o89j5
3653c18O65j65o08L70M83n35l18O50J48o91M3O67k32n76M36L93n57k35O47N4o56
3674c35J39N97l42m44M85K63n73q5O10j24n41K91M20m40k53N38N5n91J59N10k96
3695D3m06M69K07n36n0O07j40n70L02M51m60k82N78J10o51R2O33k50n60M24M00
3716D11n64k07O60Po75J79O27l54n31N22L42o48j20P16r9o69K63N82m52m22N93
$$ plain form
3737 161 356 -295 -272 377 157 -426 -31 391 -134 -360 249 270 -348 -163 391 35 -402 85 363 -240 -292
3758 -292 347 205 -415 -80 418 -51 -398 191 337 -297 -256 395 166 -449 -21 424 -133 -385 258 309 -389
3779 -389 -195 455 77 -453 59 412 -215 -341 332 211 -419 -108 441 -27 -386 166 329 -283 -242 382
3799 382 134 -413 -10 410 -131 -330 238 245 -364 -136 410 22 -410 85 344 -223 -275 344 166 -406 -54
3820 -54 419 -60 -415 182 309 -329 -231 407 94 -450 15 441 -169 -385 282 268 -415 -170 465 25 -468
3841 -468 102 402 -252 -334 352 207 -452 -75 462 -63 -443 182 362 -303 -260 387 137 -442 -12 430 -123
3862 -123 -376 219 269 -355 -189 399 39 -444 62 372 -201 -332 301 176 -403 -83 417 -63 -425 163
3882 163 325 -276 -215 369 105 -434 14 408 -157 -361 258 261 -352 -130 408 2 -425 106 357 -227 -284
$$ packed form
3737A61J95o51K3O49k20n83L95M22n25k26O09K1o18J85N54l56m37M87K78o03n2
3758b92O39j42o20L35M98m69l47N89J46o34M1O51k29o15M28M45n57k52O43N1o98
3779c89J94O50l78n30N12L53o27j26O73j21o30L11N49m68l59N52J63o12M1O24
3799C82k48n47M03M20n41j99N68Po09K28N46l88m32M95K59n67n2O19j78n72L52
3820e4M73m79l55N97J27o38R8O38l13n44M65M26o10k16O67j4o83K45O35m40m93
3841d68N70L00o54q2O86j45o59L77N37n25l80O25J80o65M3O47k50n79M30M42n53
3862a23k53N95N0o24J66N88l60m83N06L10n73j31O33j25n79L20N00m80l62N88
3882A63J62o01O1N84k64n39M48L94n65k04O19Lo13K22N38m06m27N31K51n84n7
$$ plain form
3903 -284 324 155 -411 -65 397 -92 -405 167 311 -299 -235 335 73 -396 25 375 -161 -338 249 238 -341
3924 -341 -127 360 -22 -396 135 350 -245 -243 329 142 -394 4 407 -138 -384 242 289 -333 -169 394 9
3945 9 -435 117 400 -255 -349 320 210 -397 -63 421 -62 -423 178 373 -290 -290 351 123 -425 -24 434 -143
3967 -143 -398 242 324 -346 -204 402 61 -443 46 420 -209 -381 301 262 -372 -147 415 -26 -452 144 371
3988 371 -279 -315 345 151 -422 -29 412 -132 -411 232 311 -348 -217 379 44 -431 71 386 -202 -355 301
4009 301 259 -366 -146 388 -17 -401 149 368 -238 -308 330 191 -371 -66 386 -84 -372 193 316 -290 -237
4030 -237 335 93 -397 22 360 -164 -339 243 241 -340 -143 330 -31 -361 130 321 -268 -264 309 134 -366
4051 -366 -16 339 -117 -308 218 246 -309 -144 353 54 -362 77 338 -192 -291 281 211 -351 -82 357 -49
$$ packed form
3903b84O08j69n66L46M62m89l13N72J44o10O4N70k62m69M21L50n36j77N87j1n79
3924c41K14M87l82l74N31K15n95KN72j87n36L98M03n45k46O26M7o22J64N63l85
3945Im44N52K83o55r4O69j10o07L34M84m83l61O01J95o63%O41k28n48M01M58n77
3967a43k55O40Q2o70J42O06l41n04M89L74o29j72O82l9o34K25N62m41m26N96K27
3988C71o50l6O60j94n73L93M41n44k79O43P9o59J31N96l35m75N02L15n88j53O56
4009C01m2o25K20N34m05l84N50K19o06p0O38j39n62L05M52m70k88N65J23o06N3
4030b37N72k42m90M19L38n24j75N82kn81J97M73l61l30M91J91n89MN73j75n00
4051c66L50L55m56j91N26K8n55J65M97k99m16M39K61n30r9N72p0n62K69M39m06
$$ plain form
4072 -49 -361 151 306 -281 -250 352 111 -385 -18 355 -144 -354 248 276 -337 -172 371 40 -390 83 355
4093 355 -221 -296 314 215 -373 -58 387 -43 -367 202 324 -315 -229 361 119 -390 -5 395 -131 -341 250
4114 250 290 -344 -174 389 62 -396 60 363 -217 -306 304 202 -372 -123 384 -28 -375 155 315 -268 -263
4135 -263 356 135 -412 -8 392 -135 -356 253 274 -360 -179 399 43 -402 82 366 -212 -316 314 206
4155 206 -372 -89 399 -38 -394 147 322 -272 -244 351 127 -402 -38 378 -105 -335 219 280 -325 -178 371
4176 371 64 -384 45 355 -196 -290 296 214 -364 -98 397 -37 -359 142 319 -268 -206 341 112 -389 17
4197 17 375 -130 -334 239 245 -341 -157 383 21 -403 92 352 -232 -302 291 167 -385 -87 394 -51 -392
4218 -392 146 306 -264 -241 349 130 -406 -11 383 -109 -331 225 269 -320 -178 377 42 -367 83 342 -191
$$ packed form
4072d9l12N12J55n87L1O02k41m96L67L73m99k10O02K8o13J65N43l31m30M73K72
4093C55n76p5O10r9n88L15M45m30l24N69J22o39Q6N90k42n09L85M00n26k10N91
4114B50M0o34J70N63l27m58M56L03n80q9O10j02n74K49N07m12l47N30J60n83N
4135b63O19k21n47M04M00n27k21O09K1o34J81N78l56m45M84K84n78j04O30j08
4155B06n78K83M88m37l56N41J75n94K8N95k24n29L64M16m83k30N54O1o05J47N49
4176C71l07m48M29L10n51r4N86q2n78K66M95m34l22N01J77n87O2N47k29n01M06
4197A7L58n05k04N73On86J84N40l62m24M95K60n84p0N93j24n52K98M81m45l41
4218c92N38J60n70K3N90k19n36L95L94m92k22N56M4n89J42N55l35m09M50K59n33
$$ plain form
4239 -191 -286 287 192 -366 -68 377 -65 -382 177 281 -276 -200 344 62 -404 20 358 -147 -319 240 215
4260 215 -336 -142 379 12 -384 102 341 -219 -272 301 166 -351 -60 408 -52 -379 161 310 -249 -215 337
4281 337 110 -376 8 378 -119 -316 220 228 -321 -139 364 -5 -377 99 329 -213 -248 293 134 -377 -34
4302 -34 368 -86 -351 208 268 -301 -170 366 54 -375 68 368 -175 -308 276 208 -345 -94 402 -16 -378
4323 -378 121 336 -226 -265 314 168 -397 -54 414 -76 -403 206 319 -294 -217 363 81 -393 28 394 -158
4344 -158 -342 251 243 -334 -109 389 -13 -397 147 345 -232 -256 326 146 -362 -27 384 -100 -345 214 285
4365 285 -296 -201 377 77 -393 61 375 -175 -323 260 235 -339 -142 378 11 -401 127 370 -225 -291 309
4386 309 182 -364 -63 373 -64 -382 172 315 -253 -217 352 93 -383 44 366 -164 -319 249 237 -308 -100
$$ packed form
4239a91r5N73r5n58K98M45m42l17N59J04n57P6N44k82m66M24L38n05j72N59k5
4260B15n51J94N21l67l96M86K39n60n3N73j35n17K91M68m60l27N40J49n59L4N52
4281C37k27m86L84L70m97j97N36Qn49J82N03l69l72M76K30n42l5N41j59n11L43
4302c4M02m54k65N59O0n69J31N36l12m29M43L00n43j33N84o8n53K51M96m18l62
4323c78M99K15n62l9N79j46n65L43M68m90l27O09J13o13P7N80k82m74M21L66n52
4344a58j84N93qn77K25M98m02l84N44J98n77k4N82j80n08L35M11m84k45N59P1
4365B85n81R5N78l00m70M54L14n50j48N83k5n74J97N20l67m12N28K43n95o6O00
4386C09j27n46L01M36m37l18N54J43n68L6N69k59m76M27L22n30j55N68j2n45K08
$$ plain form
4407 -100 354 6 -353 146 325 -223 -266 299 160 -333 -28 351 -98 -332 190 275 -285 -202 326 70 -376
4428 -376 41 348 -146 -315 229 217 -308 -110 352 -9 -355 113 314 -235 -237 304 139 -318 -12 361 -112
4449 -112 -304 227 250 -299 -169 325 31 -364 92 305 -206 -254 278 172 -351 -78 349 -68 -348 168 273
4470 273 -265 -233 326 114 -364 -5 358 -122 -315 238 240 -301 -157 374 27 -355 103 336 -200 -287 300
4491 300 179 -333 -80 361 -58 -355 198 288 -275 -215 340 91 -393 35 363 -175 -321 276 249 -370 -152
4512 -152 395 29 -399 106 354 -246 -304 316 188 -394 -84 409 -52 -381 177 336 -285 -252 365 172 -392
4533 -392 -39 399 -96 -365 235 310 -303 -199 373 81 -382 38 367 -176 -297 270 207 -336 -123 380 -24
4554 -24 -352 126 288 -246 -224 310 116 -348 -8 342 -107 -293 233 254 -293 -151 351 54 -368 82 326
$$ packed form
4407a00M54l48l59M99J79n48m3N65j39m93L05L79m49k34N22Q5n60Q3N28k56m46
4428c76M17L07m94j69N44j2n25J98M62l61l46M68K01n49kN41j65m57L06L73m73
4449a12j92N31K3n49J30M94k94l95M56K13n11m8N32j06n23K73M27m17k80N16J05
4470B73n38L2N59k12m78L59L63m80j93N53Kn41J44N31l47l82M58K33n36q7N87
4491C00j21n12K53M41m19k97N53R0n63O0N55k49m84M28L28n38j46N97k7o19K18
4512a52N47l66m28N05K48o00n8O20j28n82L10M93m61l29N58J59o21L3O17j93n64
4533c92L53M38m95k69O00P5o13J04N72k92m63M20L29n43j21N67o3n43K13N03m04
4554b4l28M78J62n34K2N34j94m64L40L50m49j86N26K1n47J42N02k97m22M50K44
$$ plain form
4575 326 -176 -272 294 201 -332 -84 355 1 -345 113 318 -239 -224 310 125 -335 -36 325 -88 -291 181
4596 181 215 -265 -139 285 38 -303 66 283 -156 -199 250 121 -299 -29 287 -87 -271 191 217 -252 -120
4617 -120 323 28 -332 89 305 -174 -243 266 180 -324 -64 366 -48 -375 131 316 -248 -240 319 131 -380
4638 -380 -41 393 -95 -367 187 287 -305 -205 352 78 -388 23 373 -158 -312 257 214 -324 -99 356
4658 356 -14 -366 134 301 -241 -216 302 127 -367 -17 390 -117 -334 220 254 -308 -172 385 43 -411 57
4679 57 375 -188 -358 261 236 -369 -138 419 16 -423 90 394 -211 -309 310 215 -390 -97 398 -12 -376
4700 -376 136 337 -222 -230 310 145 -344 -14 355 -68 -294 165 240 -235 -158 275 42 -284 57 271 -140
4721 -140 -202 199 122 -260 -45 297 -80 -278 160 226 -226 -160 270 45 -317 46 309 -124 -269 227 210 -296
$$ packed form
4575C26n02r6N66r3n33K48M39l54l46M58K05n57J5N34j85m60K99L61m13k03M72
4596A81L4m80J26M24k47l41L69K17m39m3M49j29m20K70L16l74j84M62K6m69J32
4617a20M43k95l60M21K16m79o9N09q6n04K60M30m14l27N06J85n64QN59j88n11
4638c80L39M34m88k72N54J00n92J00N57k74m66M11L50n31j54N69m3n38K25M55
4658C56l70l52N00J67n42K5N18j75m94L50M07n07k17N54L4n62J36N57l42m54M68
4679E7L18n63j70O19k5o05K31N57m03m39N13L04o05r8O19r5o05K93M95m10l64
4700c76N12K01n59qN40j65m89L30L69m23k26M59P5m75P7M33k33l26L41K14m11
4721a40o2M01p7l82K15L42l77j98M38O6m52O6M30k25l62L63K63m33j45M96j7n06
$$ plain form
4743 -296 -94 319 -7 -339 129 315 -204 -213 269 130 -314 -39 313 -70 -292 165 236 -217 -168 267 66
4764 66 -285 52 263 -150 -225 206 141 -259 -53 290 -61 -281 152 217 -228 -162 288 67 -317 53 309 -153
4786 -153 -284 246 243 -318 -142 347 23 -363 122 352 -224 -308 309 210 -379 -96 377 -23 -392 143 339
4807 339 -250 -270 315 155 -352 -43 373 -77 -349 170 279 -270 -214 304 85 -333 31 322 -120 -274 209
4828 209 222 -292 -106 328 10 -307 125 286 -211 -229 275 133 -321 -37 330 -74 -309 182 246 -283 -183
4849 -183 335 66 -358 34 336 -162 -298 237 197 -296 -130 327 17 -325 122 312 -162 -231 253 147 -287
4870 -287 -52 303 -42 -264 140 217 -206 -146 256 64 -260 36 248 -123 -212 186 145 -259 -43 258 -53
4891 -53 -258 159 212 -243 -151 280 60 -297 38 290 -155 -251 252 178 -321 -101 340 -12 -339 116 282 -229
$$ packed form
4743b96K02M13l26l32M68J86n19rM82j39m44K75L52l83k22M57P1m53M9M35k01
4764F6l51L37K11m13p5M31o5m00K06L43l51k20M33O5m45O6M50k21l84L70K56m62
4786a53j31N30ln61J76M89l24l86M85K30n76q4O17r9n89K83M73m00l69N35J96
4807C39n89k0N85j60n07L09M16m50k72N19J09n49N6N18k19m18L64K91m42j54M83
4828B09J3n14J86M34l18l17M32J61m97j8N04j42m54K84L67m04k35M91O4n29J00
4849a83N18k69m24L92L02m98j36N35m0m93J66M57l10l42M47J90m74o9M84j06m34
4870b87K35L55l45k22M04P7m23O0M02j92l24K96K12l71q9L98m1m04K16L01l11
4891e3k05M17N3m55R2M31k20l57L35K52m45r6N03p4m99K20M41l52l27M55J66n11
$$ plain form
4913 -229 -225 278 167 -338 -59 355 -64 -315 154 271 -268 -193 315 116 -331 -9 325 -123 -308 198 221
4934 221 -280 -150 312 26 -328 58 297 -179 -249 250 158 -330 -75 327 -55 -307 153 246 -274 -179 327
4955 327 95 -353 21 350 -126 -280 249 243 -290 -119 337 37 -355 74 326 -173 -270 241 188 -330 -96
4976 -96 343 3 -321 120 277 -208 -232 251 120 -305 -51 302 -48 -271 156 200 -217 -134 268 76 -271
4997 -271 54 270 -128 -202 212 114 -252 -29 263 -40 -232 150 209 -201 -112 266 40 -285 41 268 -154
5018 -154 -242 227 151 -293 -85 303 -39 -297 128 261 -223 -188 271 115 -306 -1 322 -81 -287 173 228
5039 228 -241 -145 302 47 -326 50 291 -128 -235 215 165 -291 -78 320 -24 -310 126 263 -212 -179 291
5060 291 92 -325 -10 330 -121 -289 211 210 -287 -140 338 12 -364 81 338 -182 -275 273 204 -339 -87
$$ packed form
4913b29MN03j11n05K79M14m19k51M69J17n39P5N08j99m47L22L34m48j85N06K3
4934B21n01J30M62k86l54L86K39m76p0M99r2m88K55M02l82k52M60R3n20R5N06
4955C27k32m48L74L29m76j54N29on33J71M56l00l92M29K52m99r7N11n3n18K34
4976i6M39l40l24M41J57m85k4M83j31m25K54L53l50k23M27M4m17Q3M02j92l47
4997b71L25K16l98p4M14r8l66K23K92l03j92L82N9m10Q9L78k26l25L26K27m22
5018a54q8M69p6m44K08L88l42k58M25J33m84L5M59j56m21L05L23m03k06M60N5
5039B28m69R6M47k55l73L76K41m19j07M50n0m56K13L98l44k86M36J37m75L3M70
5060B91j99m17L15L40m51j68N00jm97J47M78l26l76M45K57n20r3N48o9n43K52
$$ plain form
5081 -87 353 -12 -384 124 325 -212 -257 292 174 -343 -60 391 -43 -346 150 298 -223 -220 294 109 -333
5102 -333 -9 325 -99 -291 172 217 -260 -108 295 31 -291 57 236 -155 -216 233 106 -265 -25 280 -83
5123 -83 -258 148 216 -197 -133 271 35 -281 44 287 -124 -222 210 166 -258 -69 317 -22 -287 117 270 -193
5145 -193 -194 235 100 -270 -22 282 -80 -278 140 201 -225 -140 240 42 -260 62 246 -135 -185 206 128 -242
5167 -242 -24 250 -68 -223 160 213 -219 -132 254 23 -272 75 260 -163 -227 252 166 -281 -77 304 -32
5188 -32 -319 139 278 -232 -236 289 138 -350 -46 360 -72 -327 166 295 -268 -208 317 102 -352 -4 340
5209 340 -98 -299 213 238 -275 -138 319 44 -316 64 291 -161 -235 248 168 -293 -55 308 -47 -287 136
5230 136 255 -225 -193 277 79 -311 6 296 -131 -294 198 210 -270 -134 321 38 -337 60 308 -179 -271
$$ packed form
5081h7M40l65l72N08K01n37m5N49j18n17K83M51m34l03M96J48n21LN14j85m42
5102c33L24L34m24j92M63M5m77J52M03k64l22L48J79l91o1M49j27l71K40L05l63
5123h3j75M06O8m13O4M04k36l16L25K43m11r8M32m4m24J89L86l39k65M04J53m63
5145a93jM29j35l70K48L04l62j98M18O1m26Q5L80j98l02L22J84l81n0L91p8l70
5167b42K18K74l18j55L83N3m32Q7L86k31k95L47J85m23o4M79q6m47K04L81l36
5188c2k87M58J39n10mN25j51m88L04M06m32k55M93J29n63O0N25k15m54L48L44
5209C40m38k01N12K5n13J37M57k75l60L80K27m52p4M83q0m61K38L63l55k40M23
5230A36J19m80L2M70j98l90L17K90m27j63M92J2m80J36M55k83l75L97K48m87r2
$$ plain form
5251 -271 239 182 -302 -114 332 4 -325 102 277 -200 -219 250 150 -285 -37 282 -54 -258 144 200 -214
5272 -214 -144 246 50 -256 33 219 -114 -191 171 124 -224 -72 216 -35 -239 114 198 -197 -135 228 53 -265
5294 -265 33 266 -123 -215 197 161 -250 -78 273 0 -305 96 268 -193 -203 255 127 -293 -46 280 -60
5315 -60 -264 140 213 -227 -156 236 47 -291 32 260 -123 -225 208 161 -258 -77 244 -4 -269 117 209 -183
5337 -183 -166 258 84 -295 16 289 -101 -262 198 214 -256 -132 317 39 -316 47 307 -173 -265 236 183
5358 183 -311 -104 344 -6 -344 90 289 -212 -254 267 146 -333 -55 308 -44 -298 130 257 -233 -176 270
5379 270 109 -299 1 296 -82 -247 180 197 -234 -103 265 26 -279 77 254 -165 -209 227 124 -280 -27
5400 -27 303 -67 -275 156 215 -217 -146 283 66 -306 28 291 -116 -245 195 188 -263 -112 289 29 -273 65
$$ packed form
5251b71N10n7m84J88M46l28l29M27J75m77j9M69j00m35K48L19l36k04M02N6m14
5272b14P0L90j96l06K89J86l33p7L62m7l48J52K88k51k04L53Q4l95O2L63j75l18
5294b65K98K33l89r2M12l6m11J72L51k73l05M01J72m61j0M58j28m20K47L26l40
5315f0k04M04P3m40P1L92j89l38L23K28l83j02M33m7m19J81L21k48k65L86R2l92
5337a83J7M24j74l79L11K73l90j61M60J6m70J24M49k78l55L63K60m80r2N01n3
5358A83m94K07M48l50l38M34J99n01m2N21j21m79K78L63l52k54M28J27m90N7M46
5379B70j61m08L00K95l78j65M27J7m31J31L68k39l05L56J77m19m4M36j03m04K53
5400b7L30l70k08M31N9m32P1M29k17l72L34K63m07j29M40pm51J51M01k60l02L38
$$ plain form
5422 65 270 -146 -207 222 127 -271 -59 281 -39 -240 108 220 -187 -144 240 52 -262 23 250 -96 -196
5443 -196 155 137 -221 -66 252 -8 -254 102 203 -178 -163 231 77 -265 5 261 -88 -240 169 196 -227
5464 -227 -136 272 27 -303 58 279 -146 -231 220 144 -263 -59 292 -28 -304 97 246 -182 -189 246 90 -271
5486 -271 -23 259 -73 -257 153 179 -223 -136 239 37 -283 37 267 -149 -220 205 144 -248 -61 289 -48
5507 -48 -282 117 233 -201 -188 258 88 -284 8 303 -102 -259 181 213 -250 -127 281 29 -294 64 265
5528 265 -139 -223 225 166 -247 -72 291 -7 -290 101 242 -188 -193 223 116 -261 -10 266 -68 -275 146
5549 146 202 -211 -139 246 44 -261 85 272 -146 -230 204 139 -264 -51 273 -33 -262 123 220 -193 -168 241
5571 241 74 -279 -4 262 -91 -236 172 187 -226 -123 256 13 -272 74 248 -137 -196 202 139 -244 -52
$$ packed form
5422F5K05m16o1M29r5l98K12L40l20k01L48J12m07M3L84j88l14K85K27l46j00
5443a96L51j8l58J55L18k60k46L56J01l81J5L94j54l42K70K56l49j52M09K7m23
5464b27R1M08k45l30L61K21m25q5M51p6m07K04L51l20k76M01J49m28pM35j56l61
5486b71K48K82l32j84M10K6m02Q7L75k02l20L20K30m16p1M25o1l92J87L50l37
5507d8k34L99J16m34J3M46j70l72K92K95m05j57M40L2m63J23M08k52l23L58K01
5528B65m04q4M48n9m13J75L63k98k83L91J41m30nM16j07l77K51K76l34k07M21
5549A46N6m13P2L85k02l05L46J87m18q4M34o5m03K13L24l06k29L85R7m13K5M09
5571B41j67l53K75K66l53j45M08J5m13J03L79k43k85L46J74l85n9L98o3l83J92
$$ plain form
5592 -52 249 -31 -255 123 217 -190 -165 223 95 -254 10 267 -108 -222 167 175 -222 -94 268 7 -272 64
5614 64 249 -159 -181 227 124 -262 -40 257 -70 -269 128 191 -209 -166 244 66 -261 20 275 -104 -252
5635 -252 183 167 -224 -118 278 17 -250 74 251 -155 -190 209 138 -257 -51 250 -42 -265 132 225 -190
5656 -190 -149 221 69 -269 13 248 -105 -244 169 186 -244 -109 244 -17 -273 58 216 -154 -189 212 123
5677 123 -252 -47 248 -57 -231 130 196 -201 -146 252 47 -250 40 261 -88 -211 168 153 -220 -85 250
5698 250 12 -252 83 224 -165 -184 223 106 -268 -24 257 -66 -247 139 206 -218 -133 248 58 -264 31
5719 31 244 -116 -194 203 155 -236 -86 254 -7 -236 93 229 -148 -151 223 102 -238 -8 245 -62 -228 135
5741 135 183 -199 -126 218 14 -258 41 240 -125 -208 182 144 -232 -69 253 -32 -261 85 221 -164 -183 225
$$ packed form
5592e2L01k80k24L78R4m07K5L88j28l49K64K57l75j14L89Ql97J28L62k61k79L36
5614F4J85m08k2M08j03l86K22K97l27j99L97O3m00M3M10j78l27K81K55l79j48
5635b52M35j6l91J06L96k61k67L24J77m06l5L99p1l95K06L01k92k23L97R3m15
5656a90M1L70j52l38K82K35l53j39M13J7m30J35L53k61k56L31J58l70l5M01q9
5677A23l75K05K95l05j74L61O6l97N5L98k05k97K90K21l49j23L79j5l73J35L35
5698B50k38k64L35J41l89j9M07j17l74K44K81l23j81L86O7m24Q5L81j90l22K95
5719C1K13l60p8L97m8l91J50L40k61k29L29J36l77lL74j21l40K30K53l07j66L63
5741A35M8l82P3L44k04k72K99J99l65q3L90l8l76J63L22k85k29L46J36l85j9M08
$$ plain form
5763 225 103 -258 4 277 -72 -235 151 201 -210 -112 274 50 -259 40 251 -120 -205 183 145 -245 -74
5784 -74 236 -3 -261 69 213 -151 -165 192 96 -242 -25 254 -68 -228 128 165 -196 -118 251 26 -247 46
5806 46 234 -108 -191 171 121 -228 -55 261 -5 -245 109 214 -159 -159 223 87 -241 -23 240 -81 -224 127
5828 127 160 -185 -119 217 27 -249 33 209 -108 -193 164 129 -198 -61 235 -15 -237 77 179 -160 -147 203
5850 203 75 -224 18 235 -67 -183 150 154 -203 -87 235 16 -235 65 219 -138 -172 190 112 -238 -25
5871 -25 257 -63 -247 125 192 -183 -151 215 39 -245 5 234 -97 -212 142 160 -211 -67 250 6 -250
5892 -250 63 209 -131 -171 179 114 -218 -22 235 -41 -225 105 195 -171 -130 217 58 -245 -4 224 -100
5913 -100 -221 143 155 -231 -91 235 18 -258 86 227 -156 -193 167 118 -221 -47 250 -48 -239 109 200
$$ packed form
5763B25j22l61K62K73l49j63L86N0m11R8L86k24l09K99K11l71q5L88l8l90J71
5784g4L10k39k58L30J44l64j4L57r6l38K17K79l22j60L56L7l61P8L69k25k73K93
5806D6J88l42q3L62n0l49J73L16k66k40L54J05l73%L82j36l28K18K63l21j43L51
5828A27L3l45O6L36j90k76K82J76l17q5L57l5l27J37K96k50k22L14J02l39J3L50
5850B03j28k99K42K17l02j16L33Ml57J16L22k19k51L00J54l57l4L62p8l50K13
5871b5K82l20j84L72O7l75L2L66j76k84K50K29l31j15L54J8l71J44L17k44k56
5892b50L13J46l40m0L50o5l32J96K57k76j84L30R0l66M1L47j59l03K41K28l24
5913a00j21L64J2l86J40L26k17k76L44J41l83l7L60m9l39J74K97k98j91L48R1
$$ plain form
5934 200 -168 -131 210 75 -239 -2 230 -77 -198 154 172 -198 -89 219 24 -223 44 200 -115 -192 176
5955 176 109 -208 -44 215 -38 -223 94 173 -171 -112 190 50 -218 1 221 -128 -206 148 135 -203 -77 230
5977 230 0 -221 73 198 -147 -176 178 88 -214 -24 227 -45 -201 91 160 -157 -106 207 60 -222 17
5998 17 199 -105 -191 135 126 -192 -73 206 -12 -222 63 166 -142 -154 176 87 -219 -24 233 -65 -215 122
6020 122 175 -167 -99 209 48 -225 32 203 -94 -182 172 133 -194 -57 210 -3 -232 71 204 -152 -153 173
6042 173 73 -217 -13 205 -44 -197 101 155 -160 -117 171 60 -243 10 193 -103 -185 149 137 -194 -69
6063 -69 221 -8 -214 65 203 -151 -145 174 82 -211 -15 219 -48 -201 148 167 -180 -95 202 38 -211 44
6085 44 200 -105 -177 157 122 -187 -50 200 14 -229 58 191 -143 -142 177 80 -201 -17 212 -52 -189 102
$$ packed form
5934B00l68L7L41j35l14K37K32l07j21L52J8l70J09L08j95k47K67J56l15p7L68
5955A76o7l17J64K59k53j85L17P9l44N9L02j40k68K19K20l49p8L54j3l38J26L07
5977B30k30k21K94J25l45k9L54r0l02J90K51k72j56K92O9l17N1L13j47k82K39
5998A7J82l04q6L26rl18J19K79k18k10K85J03l08j2L30q9l06J95K57k98j50L37
6020A22N3l42O8L08j61k73K57J71k97q8L54l9l27J37K67k13k29L03J33l56jL26
6042A73j00k90K04K18k49j53K98N4l15M3K88j11l03K53J83k96q2L34j2l31J25
6063f9K90k29k06K79J38l54OL19r2k93J96K34k67j53L49J9l47Q5K97j64k49K55
6085D4J56l05p2L34l5l09J37K50j86k43K87J33l34JL19r7k81J84K29k64j37K91
$$ plain form
6107 102 156 -175 -127 211 40 -217 32 194 -90 -162 151 117 -196 -50 200 -5 -210 76 180 -132 -148 159
6129 159 47 -223 -12 208 -60 -198 109 128 -201 -106 194 25 -203 24 174 -93 -168 140 99 -183 -53
6150 -53 196 -22 -195 73 176 -116 -134 172 91 -197 -9 195 -46 -187 127 153 -174 -105 186 7 -214 22
6172 22 180 -119 -169 144 111 -191 -46 186 -23 -183 80 168 -142 -122 169 62 -192 -9 183 -56 -163 115
6194 115 141 -160 -71 184 31 -186 38 176 -103 -139 129 86 -170 -19 182 -21 -179 55 141 -154 -99 168
6216 168 49 -204 1 181 -86 -175 124 111 -176 -62 177 8 -199 58 172 -111 -156 139 91 -183 -41
6237 -41 196 -29 -185 91 161 -129 -103 181 59 -193 14 203 -67 -155 111 118 -159 -71 182 8 -197 56
6259 56 171 -110 -159 150 86 -199 -30 187 -47 -202 87 147 -150 -107 171 29 -202 8 188 -75 -161 128
$$ packed form
6107A02N4l31M8L38j71k57K49J62k84p2L13l4l13J46K50k05k05K86J04l12j6L07
6129A59j12k70K11K20k68j38L07J9l29R5L00j69k28K27J50k67p5L08m1k82J30
6150e3K49k18j73K68J03k92j8L06q1k88J88K04k41j41L14K6l27O9K91j79k21K36
6172B2J58k99n0L13l3l02J45K32k09j60K63Q8l10K0K91j07k54J83J92k39j07K78
6194A15K6l01Q9K55j53k17K24J38k79l6K68m3k56J51K01k03j58K34Q6k95N5K67
6216A68j19k53K05J80k67q9K99j3k87J14K39j69k07K57J14k83m5K95m8k74J42
6237d1K37k25j56K76P0k90K6K84j22k52K07J89k70q8K66Pk77Q8K53j74k05K53
6259E6J15k81m9L09o4k85J69K17k34j55K89O0k97M3K78j42k31K10J80k63q6K89
$$ plain form
6281 128 131 -163 -61 207 6 -194 53 174 -91 -132 144 88 -173 -25 172 -38 -182 67 147 -131 -115 152
6303 152 36 -195 -20 164 -79 -138 110 119 -146 -72 173 -1 -185 44 147 -103 -137 156 75 -164 -23 168
6325 168 -50 -168 88 135 -144 -95 155 39 -179 17 167 -88 -140 122 106 -151 -69 173 -6 -187 48 149
6347 149 -114 -134 136 46 -163 -16 166 -32 -152 87 124 -135 -80 150 27 -183 10 169 -75 -136 105 94
6369 94 -159 -48 174 -4 -168 69 139 -112 -96 137 57 -157 4 173 -60 -159 92 97 -173 -76 159 7 -182
6392 -182 23 155 -114 -138 116 77 -168 -61 165 -7 -144 67 149 -109 -104 151 73 -149 -8 159 -46 -134
6414 -134 91 124 -152 -69 169 23 -166 38 157 -81 -124 122 90 -168 -28 146 -23 -169 66 127 -130 -106
6436 -106 147 53 -153 -21 152 -54 -151 93 101 -132 -68 157 28 -171 33 152 -77 -114 121 89 -114 -32 167
$$ packed form
6281A28Lk94J02K68k01k00K47J21k65m1K76n6k61J48J97k10j44K49Q0k78J6K67
6303A52j16k31J75J84k43n9K48Rk65P4K45j74j84K29J03k50l4K93q1k39J41J91
6325A68k18j18K56M7k79M9K50j16k18J96J50k55n2K62j6k57Q2K42j79j81K35J01
6347A49k63k0K70r0k09J47J82j98j20K39L7k59N5K30j23k10J93J59k44o1K41j1
6369I4k53J11K22j78j64K37P0k51J6K33q0k14J61J69k33r9K51Nk70R7K35j52j89
6392a82K05J32k69k4K54l9k45J07K26j72j37K11Q2k58NK55p8k22J41J67k05q8
6414a34K25L3k76Q3K38j46j89K04J19k38m3K46l2k58J40J74j69j46K35O1k57K4
6436a06K53r4k06J32J73k06r7K44Qk33O4K25j29j99K04J19k29l7K35l2k03Q2J99
$$ plain form
6459 167 -21 -140 66 132 -95 -85 139 59 -139 -9 143 -56 -143 79 98 -142 -62 136 6 -172 36 145
6481 145 -97 -115 122 76 -142 -30 152 -28 -142 54 119 -113 -74 141 56 -138 15 145 -58 -132 98 95 -106
6504 -106 -62 152 31 -150 21 129 -78 -93 109 74 -137 -21 132 -32 -152 55 99 -118 -66 119 40 -151
6526 -151 -8 146 -69 -134 95 88 -127 -57 141 10 -146 29 130 -85 -128 109 63 -127 -6 148 -32 -139
6548 -139 68 112 -103 -85 127 28 -145 18 115 -60 -110 80 89 -124 -59 136 6 -136 29 109 -88 -91 119 43
6572 43 -152 -22 144 -39 -128 66 88 -135 -59 160 39 -150 22 146 -77 -117 110 79 -134 -34 147 -3
6594 -3 -147 46 121 -81 -100 117 60 -140 -10 132 -47 -126 77 100 -90 -85 114 17 -138 18 118 -46 -111 93
6618 93 79 -130 -59 137 -4 -131 44 118 -88 -87 126 41 -132 2 144 -52 -125 81 109 -114 -78 124 5
$$ packed form
6459A67j88j19K06O6k27J0K24q0j98J30J52j99q7K22J9k40Q0J98j30j78K08J09
6481A45k42j8K37m6k18J12J82j80j14J96O5k32L9K15q5j94J53J30k03p4K30lk01
6504a06M4K14j21j81J71J08k07j5K02l5k11J16J53j64j20K07M4k17N2J85p9j91
6526a51J43J54k15o5K29pk15P0J98j31j56J75J01k15m3K37m6j90J21J54j80j07
6548a39K07M4k15J8K12r9j73J63R7j75n0J90Rk13O5J95j30j42J65Q0j97lK10p6
6572D3j95J30J66j83q9J94K2k23P6K19j21j89J72J24k23m0K27l1k13J00J81j50
6594cj44J93P5k02j9K17n7k00J30J42j79p9K03K3j90NJ99r7j55J56J00j64o5K04
6618I3j4k09P1J96j41j27J75P4k06JK13q5j73J34J42j96p3K06K8k23L6K02j19
$$ plain form
6641 5 -141 31 128 -82 -111 100 66 -114 -49 118 -7 -153 40 113 -83 -93 102 45 -123 -17 136 -32 -118
6664 -118 60 87 -103 -57 114 17 -107 35 113 -56 -106 101 77 -110 -24 141 -15 -126 48 107 -95 -79 104
6687 104 47 -110 -11 118 -45 -106 81 72 -127 -52 101 -2 -116 18 110 -81 -89 92 76 -114 -33 121 -7 -115
6711 -115 53 108 -70 -78 120 46 -127 -7 119 -35 -110 70 88 -110 -61 110 14 -130 32 100 -67 -93 93
6734 93 57 -128 -34 118 -26 -105 55 81 -91 -66 96 22 -120 24 127 -30 -114 83 77 -120 -36 113 19 -115
6758 -115 35 119 -62 -97 96 42 -121 -15 116 -30 -115 43 85 -75 -61 99 15 -125 2 119 -50 -122 72
6781 72 92 -120 -38 112 -7 -117 24 94 -79 -88 95 51 -97 -18 110 -17 -121 73 81 -97 -62 111 23 -114
6805 -114 18 111 -56 -111 71 63 -104 -35 103 -11 -125 31 102 -65 -88 81 41 -124 -27 114 -15 -116 41
$$ packed form
6641Ej46J72R7k10k9K11l4j80O5J67j25j46J93P3j96j0J95n7j68J06J53j68q6
6664a18J78K7j90M6J71r7j24J42P8j69n0K07k4j87Q6J65j56j11J74N9k02J6J83
6687A04n7j57R9J29j63o1J87rj99P5J53j03j14J34R2j91qJ81j6j90Q1J54j28j08
6711a15J68N5j78qJ98p4j73J20J26j54p5J80J8j98M9J71r6j44J62O8j67k6J86
6734I3l6j85R4J52j44p9J60K6j72K5J62p4j42J44J03j57q4J97oj97Q4J49r4j34
6758a15J50Q4j81l5J93n4j63J06J31j46q5J58M2j60J4J60q4j40J27J17j69p2J94
6781G2K0k12Q2J50j19j10J41P0j73rJ83m4j48P9J28j27j04J94Qj78L5J73q8j37
6805a14J32R3j67n5J82qj67O9J38j14j14J56P1j67k3J69m0j65R7J41j29j01J57
$$ plain form
6828 41 83 -88 -64 103 15 -134 17 107 -47 -109 95 52 -108 -20 112 0 -110 40 91 -64 -78 98 49 -126
6852 -126 -19 112 -51 -104 54 77 -73 -58 86 15 -113 -5 117 -53 -97 71 43 -112 -35 97 -7 -104 26
6875 26 89 -68 -81 93 53 -104 -10 105 -19 -105 55 95 -84 -28 102 11 -113 19 107 -65 -83 55 54 -108
6899 -108 -37 104 -15 -98 23 80 -78 -79 82 31 -104 -6 82 -43 -91 52 63 -102 -54 101 -14 -109 19 61
6923 61 -67 -67 85 58 -116 -23 111 -25 -89 55 102 -69 -77 115 27 -121 10 111 -53 -90 82 73 -106 -43 101
6948 101 -7 -128 41 74 -80 -80 88 26 -113 -24 108 -30 -102 45 66 -84 -55 107 17 -115 -16 105 -22
6971 -22 -91 62 72 -96 -47 107 12 -99 30 61 -67 -86 77 65 -121 -28 106 -34 -112 48 62 -87 -57 88
6995 88 13 -125 -3 92 -39 -101 74 74 -99 -34 92 -8 -108 33 94 -51 -66 58 36 -69 -26 95 -12 -88
$$ packed form
6828D1M2j71K4J67q8j49J51R0j54o2K04m3j60Q8J32j12j10J50N1j55j4J76m9j75
6852a26J07J31j63n3J58K3j50J5J44p1j28J08J22j70m4J68k8j55P7J32j04r7J30
6875B6O3j57j3J74m0j57R4J15j24q6J60M0j79N6J30r1j24J32Q8j72j8J38jj62
6899a08P1J41j19q3J21N7j58jJ61n1j35R8Q8j25m8J43J1j65M8J55j15r5J28M2
6923F1j28%J52k7j74R3J34j36o4J44M7j71qJ92q8j48J31J01j64l7J72rj79O3J44
6948A01j08j21J69L3j54%J68o2j39Q9J32j38p2J47K1j50K9J62r0j32R9J21j27
6971b2o9J53J0j68M9J54r5j11J29L1j28j9J63j2j86R3J34j40p8J60J4j49L0J45
6995H8p5j38J22R5j31o2J75%j73O5J26j00j00J41O1j45j5J24k2j05M3J21j07p6
$$ plain form
7019 -88 48 73 -79 -62 72 15 -87 0 75 -31 -82 39 62 -78 -16 71 -20 -92 14 59 -72 -72 82 32 -87
7044 -87 14 83 -42 -74 63 58 -86 -24 88 -1 -82 15 96 -57 -75 88 46 -87 -21 100 1 -96 39 66 -77
7069 -77 -73 84 21 -103 -12 90 -24 -86 29 65 -98 -48 88 7 -98 29 72 -66 -68 81 39 -77 -10 88 -7
7094 -7 -69 52 73 -79 -60 84 25 -98 10 91 -52 -103 67 74 -86 -46 94 -5 -107 30 93 -61 -61 54 44
7119 44 -103 -26 84 -6 -100 44 76 -59 -64 64 51 -83 -5 92 -20 -90 49 61 -66 -47 70 8 -96 -4 68
7144 68 -47 -75 59 39 -67 -8 69 -34 -59 31 55 -55 -42 62 16 -85 2 63 -39 -67 56 50 -106 -50 76
7169 76 3 -90 17 78 -49 -63 76 40 -73 -1 82 -9 -93 35 61 -59 -52 64 25 -87 4 70 -43 -42 62 22
7195 22 -71 -16 70 -28 -76 18 62 -54 -48 87 11 -67 16 71 -25 -86 47 34 -85 -49 94 7 -97 36 81 -22 -58
$$ packed form
7019h8J36K5j52J7J34n7j02Q7P5j06n1J21K3j40O2Q7r1p2J06M5j31%J54n0j19
7044h7J01O9j25l2J37nj44O2J12q9q1R7Q1j53j8J63m2j33O6J21r9r7J35K7j43
7069g7MJ57o3j24R1J02j14o2J15L6j63N0J36q1j05J27M3j38kJ49m2j16O7R8r5
7094go2J21K1j52J9J44n9j23J08Q1j43n1J70Pj60M0J40r9j02J37O3j54%J15j0
7119D4j47P7J10r0r4J44L2j35nJ28j3j34P8R7j12p0J39J2j27J9J17o2j04R2P2
7144F8j15k8J34k0j06N9P7j03k5R0K4j10J3J04m6j01Q7O1j02k8J23oj56N6J26
7169G6p3r3J07O1j27j4J39l6j13P2Q3r1q4J28K6j20PJ16l9j12R1O6j13JJ04m0
7195B2r3N5Q6r8m8R4M4j16OJ35p6p8Q3N5r6o1J33j3j19L6J43q7j04J33M5j03l6
$$ plain form
7222 -58 74 32 -87 -23 96 0 -92 34 82 -49 -68 93 50 -87 -24 85 -26 -77 31 69 -79 -41 73 20
7246 20 -97 7 65 -35 -71 48 53 -88 -25 74 -13 -76 43 56 -54 -58 68 33 -68 -2 92 -23 -80 52 72 -68
7272 -68 -44 76 35 -71 13 83 -41 -65 60 36 -75 -34 63 -25 -91 18 53 -32 -70 60 18 -75 2 58 -23 -72 44
7299 44 38 -60 -40 54 9 -57 18 56 -48 -47 62 31 -53 -3 76 -19 -66 41 72 -69 -46 77 20 -84 -2 65 -51 -87
7327 -87 50 17 -74 -45 75 -16 -80 21 70 -62 -69 48 38 -86 -19 72 -16 -91 31 72 -51 -51 80 3 -78 17 80
7354 80 -49 -74 52 54 -70 -19 78 0 -66 33 65 -46 -44 51 36 -69 -16 68 -16 -88 40 61 -68 -31 69 24 -74
7381 -74 -1 84 -31 -94 47 41 -83 -32 78 -8 -87 21 83 -39 -67 58 39 -79 -17 85 -11 -85 35 72 -61
7406 -61 -60 40 21 -64 -8 75 -36 -77 32 39 -61 -40 57 6 -93 20 44 -54 -53 64 29 -63 -4 59 -17 -61 20 64 -67
$$ packed form
7222e8J32m2j19O4J19r6r2J26M8j31j9J61m3j37O3J09j11n1J08L8j48L8J14n3
7246B0j17J04N8j00l6J19Nj41O3R9q7o3J19J3j10mJ26l5j01O6R4j15n7J32K0j40
7272f8K4J20m1j06Q4P0j24k4J25k4j11M1R7q8o6J09L5q5l8J30m2r3P7N6q1m9J16
7299D4or8K0R4m5o6P5L8j04JJ09l1q4N0P9r5m7J07L1j41K3J23n7j04Q2O7j16l6
7327h7J37l3r1K9J20r1o4J01M9j32pJ17j0j24O7R1q8p5J22M1j23%J31p7q1R5O3
7354H0j29k5J26Kj24N1R7p8o6R9L2j11KR5j5j05N3Q4q4p2J28K1j29L7J00m5r8
7381g4P3Q5j15o3J41oj24N1J10q6p9J08O2j22k8J25j9j18O2J02r6p4J20L7j33
7406f1JJ00j9q5N6Q3j11m1J09Pj00K1R7n1r9J13K4r8JJ17l5r2N9O3p6m4Q1M4j31
$$ plain form
7435 -67 -39 69 17 -67 3 57 -42 -54 47 55 -74 -16 62 -13 -76 22 44 -53 -31 42 21 -75 -19 54 -20 -61 43 50 -62
7464 -62 -40 55 -4 -81 -6 44 -24 -66 61 12 -71 -16 64 -20 -67 4 58 -51 -13 76 5 -85 12 68 -23 -64 38 41 -56
7493 -56 -13 67 3 -92 27 69 -59 -84 59 35 -82 -18 77 1 -70 21 60 -70 -52 51 20 -84 -3 96 -23 -58
7519 -58 35 63 -39 -29 74 23 -54 2 77 -18 -69 50 17 -44 -20 58 -11 -75 30 55 -51 -33 57 37 -89 -6 70
7546 70 -36 -76 38 36 -58 -52 61 1 -65 9 59 -35 -59 52 38 -67 -12 75 -13 -77 14 61 -38 -36 65 44 -59 2
7574 2 61 -13 -56 37 41 -57 -13 85 9 -69 1 45 -47 -38 19 10 -72 -29 66 -21 -49 11 32 -62 -27 64 2 -76 -2 65 -41 -45
7606 -45 39 40 -48 -18 58 -14 -55 28 41 -41 -41 55 28 -70 -8 57 -36 -67 29 49 -54 -32 39 6 -64 10 53 -33 -63 38
7636 38 44 -55 -22 45 0 -72 13 42 -58 -60 37 31 -71 -1 75 -12 -52 46 50 -46 -36 60 -3 -72 -4 61 -43 -72 59 28
$$ packed form
7435f7K8J08n2q4P0N4r9j2J01Qj29N8P8p5o3R8K2r7K2P3k1r6N6P3p4m1J04Pj12
7464f2K2R5n9p7P5N0o8m2J27m9q3N5Q0q4m7P1N4j09L8Q9p1r0R7N6r1m1J02Lr7
7493e6M3Q0o4r5J19M2j28k5J43k4j17O4R5p6p1R1L9j30J8J03l1j04Q1R9j19l5
7519e8R3K8j02J0J03n1p7N6P5r5n1J19l3o1K4P8o9o4J05K5j06J8R0k0j26Q3P6
7546G0j06m0J14kr4OJ13o0o6P4N0r4k4J11j4j05N5Q7q8o4R1M7r9KJ01k1j03O1
7574BN9p4m3R3Mr8M4R8p6p8P0M4r2RN7rq2M3R5q7k8O0K1r4L5R1o2p8P4O7j06m
7606d5Q4Jq8L0P6p2m1Q3J3q2%R6k7r8O2O5r3l1R6K0j03K2P1l3p0P4M3q6l0J01
7636C8Or9L3O7m5p2Q5K9j00kR7oj02P0P6q7m0R8Mr6J0R6o3o9O8O5j04k9J31l1
$$ plain form
7666 28 -83 -30 78 3 -74 25 43 -62 -72 23 19 -71 -24 48 -16 -83 16 50 -36 -39 51 12 -64 -6 45 -2 -52 30 37 -46
7696 -46 -37 45 -9 -62 11 37 -32 -53 48 15 -60 -12 52 -30 -49 34 42 -60 -46 49 2 -71 1 28 -35 -54 42 30 -60 -12
7726 -12 40 0 -51 30 41 -29 -36 31 5 -66 -13 50 -25 -51 22 46 -26 -31 33 8 -65 -7 43 -41 -43 45 37 -53 -5 54 -13 -69
7758 -69 28 34 -68 -44 44 9 -61 6 53 -41 -66 37 26 -44 -18 53 -8 -67 16 46 -34 -23 49 26 -77 -18 73 -12 -66
7787 -66 26 57 -49 -56 35 23 -71 -20 53 -23 -46 7 35 -48 -44 47 -13 -72 -3 47 -37 -53 26 10 -54 -15 59 -4 -49 25 20
7818 20 -51 -47 48 3 -62 -11 46 -16 -54 17 25 -33 -18 44 3 -59 0 71 -33 -46 33 31 -64 -12 42 -5 -60 -4 50 -16 -53
7849 -53 34 6 -50 -17 46 -18 -37 21 35 -38 -38 27 0 -45 9 41 -23 -34 40 27 -42 -11 35 -12 -51 32 29 -34 -8 30 1
7880 1 -57 2 33 -40 -64 27 0 -69 -20 45 -4 -63 1 30 -39 -45 38 12 -56 -19 46 7 -56 27 49 -27 -18 41 8 -48 -1 41
$$ packed form
7666B8j11N3J08p5p7R9J8j05j0R5mr0M7P2o4o7R9L4q6lR0l9p6N8N1m7n0Q2Pq3
7696d6RQ2n4n3P3K6o9k1J01l3p5M8O4q2j9Q3Qj02J4R5m7p3P2K7o3j9R6j2r0M8
7726a2N2m0n1Q1J1p0pO7k6p1N3O3p5k6P3K4p2nO4k5p3N8N0q4kQ8qr0M8N9o7n6
7758f9R7Oj02K4Q8l5p0O7M7r4k5J03j1p0K6P1o1n9Q3L0q0J1P2k3j03N9R1q5n4
7787f6R2L1j06pR1j2r4N1P3p6k3N3K8q3MR1o0n9O9N0q4j6P9j6o4L9P4o3m5P4n
7818B0p1MR5m5o5N1N7o2l8P1Qn8J5O2m1o2N9P1j04j3P9kr5N2N4m7n5N6N4o6l7
7849e3Q7k8n6L3O3o4j9N8J4p3%O5k7m5N4L2o4j1P4j3o9L1M6m7l9Q3lo3K6L8k9
7880An8N9L1p3k4R1k7o9M9O5m9n9O4K9o9oQ3k6o8L7O5l9o3Q3K2p6RN9l3n6M7M2
$$ plain form
7912 41 -21 -41 25 29 -33 -12 65 11 -38 18 42 -21 -25 22 12 -48 -26 40 -15 -67 15 16 -36 -38 12 4 -75 -5 50 -24 -65 27 41
7945 41 -50 -16 42 -4 -58 3 44 -28 -42 44 36 -53 -19 54 5 -42 7 52 -32 -48 29 16 -43 -5 33 -14 -43 16 16 -39 -26
7976 -26 18 5 -54 -6 18 -33 -42 8 8 -32 4 38 -3 -49 11 41 -40 -8 31 0 -37 1 51 -17 -22 26 7 -46 -9 40 -7 -44
8008 -44 0 45 -37 -45 28 12 -51 -10 9 -20 -51 21 24 -40 -34 25 -3 -41 13 32 -11 -33 35 28 -31 -3 45 4 -37 16 37 -22
8040 -22 -27 47 3 -41 9 37 -16 -33 12 15 -42 -32 31 -8 -42 11 46 -31 -37 20 13 -53 -28 52 -11 -45 13 30 -19 -38 50 9
8072 9 -49 -3 28 -12 -54 22 45 -32 -21 44 6 -50 -6 51 -21 -27 19 31 -31 -22 38 -4 -27 5 35 -31 -48 35 3 -35 -21 41
8104 41 -2 -44 22 37 -29 -28 26 -5 -33 11 31 -14 -36 30 11 -22 -8 41 -1 -29 23 30 -20 -21 27 8 -44 1 56 -13 -33 1
8136 1 12 -39 -35 2 -19 -46 -4 30 -18 -55 17 18 -53 -16 24 -2 -49 6 27 -25 -21 27 19 -42 7 40 -8 -40 -1 26 -15 5 33
$$ packed form
7912D1o2k0O6Mo2K1P7n4m9N6K4o3mM7j0o0K2O6n5n2Q2Jn2kN0qp9P0N5p4m1R2J4
7945D1r1L4N8m6n4O1M1p2j4Q6qq9L4P3m9m7M9M5q4j6P7j3n9L8L8m7k9N9%n5J3
7976b6M4j3n9M8K4n1rN0%m0L6L4m1m6O0L0q1L2L9l1l7L8N0o8nM8j9n3L7M9m7l7
8008d4M4M5q2qP3j6o3M1J9k9l1P2Lo4ON9k8l8N4J9m3k2O8pn9K8M8m1m1N3K1n9
8040b2nP4m4m4N0K8n3j7M5Ln7J0O3l9l4N3L5p7oN7po6K5Q0o3l4N8J7m9j9Q8m1
8072In8M6L1m0m2P6K3p7J1O5l8n6M4N7p2oM6J2o2RO0m2k3L2L0o6j7Q3l2l8J4O2
8104D1m3m2O6J5o6JN4l1k8M4K0m5k2O6j9l3J4M9m2k8N2Pn0jM8j9n2M5N5o9k0L4
8136AJ1n1ML7k1k7M2L4m8l7P2Jp1L7M0k6m7N5K1n2MM8qo1M9L3m8l2L9K7m1K0K8
$$ plain form
8169 33 10 -34 -2 41 -9 -22 24 18 -34 -7 26 2 -37 3 20 -31 -31 40 4 -52 -5 44
$$ packed form
8169C3k3m4L2M3n0j3M6on2K7L3k4l9M0J7n1%P1l6n6M7M9
8191D4
$$ Imaginary data points
##PAGE= N=2
##DATA TABLE= (X++(I..I)), XYDATA
$$ plain form
0 0 0 0 0 0 0 0 0 8 -8 8 -8 11 -16 16 -24 32 -40 48 -56 72 -82 98 -118 136 -162 192 -222 256 -296 340
30 340 -388 442 -503 569 -645 727 -816 914 -1023 1140 -1271 1412 -1565 1736 -1921 2120
46 2120 -2340 2582 -2846 3134 -3453 3804 -4191 4624 -5107 5654 -6273 6981 -7803 8770
60 8770 -9926 11339 -13107 15396 -18491 22926 -29830 42143 -70635 273118 -213480 -709538
72 -709538 325782 400677 -348199 -178154 538301 -22256 -655952 45696 690877 -47609
82 -47609 -533598 67271 317483 -206165 -118959 366989 55576 -473796 -71485 421841
92 421841 95893 -258339 -25339 68986 -116321 25596 254017 -15479 -276905 -41474
102 -41474 168687 40975 8509 48327 -138796 -179416 163515 247760 -107149 -192339 61751
$$ packed form
0@%%%%%%%Qj6J6j6J9k7L2m0N6p2Q8j04J28j54J80k16K54k98L54m14M78n52O36
30C40p28Q30r45J072j214J372j543J730j937K163k411K683k977L301l657M041
46B120m460M922n428N980o587P257p995Q815r731J0761j1927J3254j4784J6573
60H770j8696K1265k4446K8503l3887M1417n2756P1973j12778L43753m86598m96058
72g09538J035320P4895p48876J70045P16455n60557o33696P01648O45181p38486
82d7609m85989O00869K50212n23648Q7206M85948l11413n29372M02311M93326
92D21841l25948l54232K33000R4325j85307J41917K28421k69496k61426K35431
102d1474K10161j27712l2466L9818j87123m0620L42931Q4245l54909q5190K54090
$$ plain form
113 61751 36073 -95747 123494 201836 -198248 -296999 172044 296137 -110890 -180684 100223
124 100223 16780 -172602 98414 278442 -112314 -329330 55197 271868 -9802 -133638
134 -133638 38885 1645 -132116 46512 215742 -2760 -215508 -69628 119667 92479
144 92479 9426 -39207 -85021 -44272 64463 79256 19664 -21925 -90774 -98340 93572 201505
156 201505 -39870 -220339 -3116 152168 -28374 -57064 139424 5434 -269697 -18821
166 -18821 340763 53946 -317300 -41581 232333 -52657 -156424 197088 137505 -316705
176 -316705 -162291 352034 170100 -304204 -106745 230008 -27116 -192380 173198 208102
186 208102 -260293 -235898 259327 214100 -203136 -115126 156008 -28226 -158931 146533
$$ packed form
113F1751k5678j31820K19241P8342m00084r8751M69043J24093m07027o9794K80907
124A00223q3443j89382K71016J80028l90756k17016L84527K16671k81670j23836
134a33638J72523l7240j33761J78628J69230k18502k12748J45880J89295k7188
144I2479q3053m8633m5814M0749J08735J4793n9592m1589o8849p566J91912J07933
156B01505k41375j80469K17223J55284j80542k8690J96488j33990k75131K50876
166a8821L59584k86817l71246K75719K73914k84990j03767L53512n9583m54210
176c16705J54414N14325j81934m74304J97459L36753k57124j65264L65578L4904
186B08102m68395K4395M95225m5227m17236Q8010K71134j84234j30705L05464
$$ plain form
196 146533 196590 -187588 -212574 155358 159319 -102808 -40714 85388 -87868 -114883 162049
207 162049 151052 -157603 -137585 106440 52066 -66832 72666 73683 -172358 -110085 200822
218 200822 123352 -164085 -71590 111681 -38586 -93431 154484 117658 -217739 -145846 208614
229 208614 126867 -158991 -42479 123056 -74848 -131210 165920 165685 -190367 -177139 156914
240 156914 128348 -113249 -27548 104619 -75804 -136259 129157 170489 -117605 -160127 73411
251 73411 89923 -46826 8361 63939 -80016 -105597 90302 125161 -50462 -89271 6114
262 6114 7870 1863 71956 29041 -103071 -62220 74540 54503 -18740 5543 -17026 -86379
274 -86379 9979 137450 20458 -128945 -30931 74498 -7439 -18341 82982 -1808 -151151
$$ packed form
196A46533N0057l84178k4986L67932L961k62127O2094J26102j73256k7015K76932
207A62049j0997l08655K0018K44025n4374j18898J39498J017k46041O2273L10907
218B00822p7470k87437R2495J83271j50267n4845K47915l6826l35397P1893L54460
229B08614q1747k85858J16512J65535j97904n6362K97130k35l56052J3228L34053
240A56914k8566k41597Q5701J32167j80423o0455K65416M1332k88094m2522K33538
251G3411J6512j36749N5187N5578j43955k5581J95899L4859j75623l8809R5385
262F114J756o007P0093m2915j32112M0851J36760k0037p3243K4283k2569o9353
274h6379R6358J27471j16992j49403R8014J05429q1937j0902J01323q4790j49343
$$ plain form
285 -151151 -14896 169452 33757 -130851 -15802 68184 -47531 -26016 125318 24355
295 24355 -170830 -43709 158472 43702 -103593 919 48523 -77309 -27647 142926
305 142926 40166 -159364 -52801 122280 30091 -63722 33860 25198 -108346 -23968 149614
316 149614 40514 -135502 -37417 82178 -7148 -30117 78921 10728 -137429 -21743 147760
327 147760 31599 -108074 -8166 50078 -51909 -12684 118664 10797 -151622 -24892
337 -24892 132296 20023 -78115 22812 27746 -88745 -9489 139564 19463 -144219 -27240
348 -27240 103248 3497 -47713 53343 13644 -114142 -12932 141678 25830 -120383 -19553
359 -19553 68329 -22107 -21949 83452 6389 -128373 -16357 128959 22762 -87736 719
$$ packed form
285a51151J36255J84348j35695j64608J15049Q3986j15715K1515J51334j00963
295B4355j95185J27121K02181j14770j47295J04512M7604j25832M9662J70573
305A42926j02760j99530J06563J75081r2189r3813R7582q662j33544Q4378J73582
316A49614j09100j76016R8085J19595q9326k2969J09038o8193j48157J15686J69503
327A47760j16161j39673R9908N8244j01987L9225J31348j07867j62419J26730
337b4892J57188j12273r8138J00927M934j16491P9256J49053j20101j63682J16979
348b7240J30488r9751n1210J01056l9699j27786J01210J54610j15848j46213J00830
359a9553Q7882r0436J58J05401p7063j34762J12016J45316j06197j10498Q8455
$$ plain form
370 719 34958 -53648 -3777 107675 3989 -128473 -16110 103546 9922 -51612 28217
381 28217 7379 -82313 6495 118636 3658 -112773 -10278 69175 -10556 -17396 57165
392 57165 -11903 -102507 10874 115506 1198 -86281 3965 33995 -38148 8796 85483
403 85483 -21973 -114408 12727 103314 -7389 -57883 27534 6478 -70410 22576 109981
414 109981 -23142 -117707 13984 85645 -21260 -32972 54747 -9511 -98431 23624 122674
425 122674 -17003 -108331 14444 62403 -35404 -12520 76168 -15080 -111840 15614 116310
436 116310 -7555 -83874 15310 33944 -47146 4361 87179 -15015 -107827 6579 92444
447 92444 -3045 -49140 22176 4410 -59295 17884 90524 -14702 -92031 4620 59917 -10401
$$ packed form
370G19L4239q8606M9871J11452j03686j32462J12363J19656r3624o1534P9829
381B8217k0838q9692Q8808J12141j14978j16431J02495P9453p9731o840P4561
392E7165o9068r0604J13381J04632j14308q7479R0246L0030p2143M6944P6687
403H5483j07456r2435J27135R0587j10703n0494Q5417k1056p6888R2986Q7405
414A09981j33123r4565J31691P1661j06905j1712Q7719o4258q8920J22055R9050
425A22674j39677r1328J22775M7959r7807K2884Q8688r1248r6760J27454J00696
436A16310j23865p6319R9184J8634q1090N1507Q2818j02194r2812J14406Q5865
447I2444r5489m6095P1316j7766o3705P7179P2640j05226p7329R6651N5297p0318
$$ plain form
459 -10401 -13391 38682 -20306 -73517 27357 88977 -17068 -70526 12184 27137 -28508 15546
471 15546 60514 -35631 -85170 31377 81049 -20813 -45871 25059 -893 -49437 33526 78194
483 78194 -39838 -87330 29435 64547 -24167 -19948 38294 -21774 -65941 40479 85443 -35684
495 -35684 -77330 25248 40915 -28942 4598 51091 -35064 -76254 39974 82099 -29548
506 -29548 -57998 24597 14453 -38083 24890 63457 -41671 -79887 36325 69572 -26315 -33017
518 -33017 29926 -10824 -50303 39134 72184 -42741 -74657 32102 48821 -26957 -5838 38847
530 38847 -31437 -60886 46058 73179 -39497 -59959 28801 22981 -31200 18908 48968 -44430
542 -44430 -67191 45929 66531 -34393 -39698 28789 -1715 -39533 35990 59276 -47990 -69123
$$ packed form
459a0401k990N2073n8988n3211J00874O1620j06045n3458Q2710J4953n5645M4054
471A5546M4968r6145m9539J16547M9672j01862k5058P0930k5952m8544Q2963M4668
483G8194j18032m7492J16765L5112q8714M219N8242o0068m4167J06420M4964j21127
495c5684m1646J02578J5667o9857L3540M6493q6155m1190J16228M2125j11647
506b9548k8450Q2595j0144n2536O2973L8567j05128l8216J16212L3247r5887o702
518c3017O2943m0750l9479Q9437L3050j14925l1916J06759J6719p5778K1119M4685
530C8847p0284k9449J06944K7121j12676k0462Q8760n820n4181N0108L0060r3398
542d4430k2761J13120K0602j00924n305O8487l0504l7818P5523K3286j07266k1133
$$ plain form
554 -69123 40349 54758 -29928 -18893 32626 -20174 -49603 42726 66153 -42601 -64236 31030
566 31030 37933 -25913 913 36342 -31616 -54534 40539 62609 -31127 -47839 19688 13923
578 13923 -20873 21063 35224 -38852 -48628 34541 44580 -19556 -18668 11086 -16914 -17348 42610
591 42610 30673 -46332 -34288 32381 17144 -16806 16149 13534 -48350 -22425 62558 29870
603 29870 -55184 -20804 37795 -8018 -26850 44461 29357 -69920 -37418 73605 35350 -60446
615 -60446 -13355 45898 -23305 -42432 57612 49187 -73773 -52972 69155 40048 -55181 -8385
627 -8385 47041 -29432 -50782 55687 58498 -60850 -55302 50306 32995 -38797 2411 37805
639 37805 -34411 -45885 48619 50366 -43398 -38698 30224 9911 -23429 23700 28123 -45696 -36083
$$ packed form
554f9123J09472J4409q4686J1035N1519n2800k9429R2329K3427j08754k1635R5266
566C1030O903o3846K6826L5429o7958k2918R5073K2070r3736j6712O7527n765
578A3923l4796M1936J4161p4076r776Q3169J0039o4136Q88K9754k8000m34N9958
591D2610j1937p7005J2044O6669j5237l3950L2955k615o1884K5925Q4983l2688
603B9870q5054L4380N8599m5813j8832P1311j5104r9277L2502J11023l8255r5796
615f0446M7091N9253o9203j9127J00044q425j22960K0801J22127k9107r5229M6796
627h385N5426p6473k1350J06469K811j19348N548J05608j7311p1792M1208L5394
639C7805p2216j1474R4504J747r3764M700O8922k0313l3340M7129M423p3819R613
$$ plain form
652 -36083 47803 33397 -35915 -12757 24328 -19566 -23283 47929 30564 -59238 -33858 52777
664 52777 21478 -39733 6916 33396 -39261 -37767 60063 44575 -62140 -40597 51752 19540
676 19540 -42359 12026 43253 -39169 -51828 49996 56099 -44528 -45560 33896 20413 -30667
688 -30667 7555 38275 -24127 -48470 23422 48856 -12179 -33833 3578 9936 -6177 8772
700 8772 17070 -11967 -24723 622 19350 13954 -1587 -19922 -17451 14518 24680 -5771 -15343
713 -15343 5423 -3262 -18287 18418 37662 -22260 -50279 17855 46786 -16042 -28999 25557
725 25557 8151 -45129 4355 63643 -6190 -68910 4962 57225 -11327 -36161 28979 18282
737 18282 -50987 -10996 64715 11180 -61829 -8665 44901 -4247 -25116 25612 13282 -44645
$$ packed form
652c6083Q3886j4406o9312K3158L7085m3894l717P1212j7365q9802K5380Q6635
664E2777l1299o1211M6649K6480p2657J494R7830j5488j06715K1543R2349l2212
676A9540o1899N4385L1227q2422j2659J01824O103j00627j032P9456j3483n1080
688c0667L8222L0720o2402k4343P1892K5434o1035k1654L7411O358j6113J4949
700H772Q298k9037j2756K5345J8728n396j5541j8335K471L1969J0162l0451r572
713a5343K0766q685j5025L6705J9244n9922k8019O8134K8931o2828j2957N4556
725B5557j7406n3280M9484N9288o9833o2720P3872N2263o8552k4834O5140j0697
737A8282o9269L9991P5711n3535p3009N3164N3566m9148k0869N0728j2330n7927
$$ plain form
749 -44645 -11402 50128 11907 -39238 -4981 19742 -12364 -3598 33093 -2623 -45094 2313
761 2313 40890 -5088 -23388 17887 3431 -38202 9122 55389 -12824 -58825 15031 46246
773 46246 -24750 -25280 44112 7212 -65710 2006 77912 -5866 -73904 13412 56923 -30612
785 -30612 -37371 54510 24548 -74554 -19382 81024 14735 -72181 -2265 55716 -19608 -42294
797 -42294 43541 37084 -58686 -36195 58988 30811 -47978 -15450 35618 -6804 -30190 25961
809 25961 31873 -33078 -33360 27014 26644 -15288 -10461 7656 -7990 -8438 18544 13271 -16063 -13646
823 -13646 4223 4515 7356 10727 -11263 -22831 7726 23640 -3984 -12819 7553 -2029 -19294
836 -19294 11681 32326 -12375 -37300 8549 30057 -8338 -14940 16292 1280 -29184 4048
$$ packed form
749d4645L3243O1530l8221n1145L4257K4723l2106Q766L6691l5716m2471M7407
761B313L8577m5978j8300M1275j4456m1633M7324M6267o8213m6001P3856L1215
773D6246p0996n30O9392l6900p2922O7716P5906q3778o8038Q7316M3511q7535
785c0612o759R1881k9962r9102N5172J00406o6289q6916O9916N7981p5324k2686
797d2294Q5835o457r5770K2491R5183k8177p8789L2528N1068m2422k3386N6151
809B5961N912o4951k82O0374l70m1932M827J8117j5646m48K6982n273k9334K417
823a3646J7869K92K841L371k1990j1568L0557J5914k7624q835K0372r582j7265
836a9294L0975K0645m4701k4925M5849K1508l8395o602L1232j5012l0464L3232
$$ plain form
848 4048 38302 -1728 -36526 -1118 24283 -2502 -9194 13199 19 -24434 148 27725
860 27725 4172 -19661 -5168 4859 -1180 7723 11468 -11870 -17599 8458 13123 -4286 877
873 877 5774 -16985 -13147 26788 19973 -27508 -18477 23538 5990 -22014 12542 26504 -28334
886 -28334 -33451 35408 35257 -34838 -26394 33030 8382 -35852 11117 43186 -24245 -48908 28485
899 28485 45860 -28264 -32094 30283 12680 -37613 3989 46663 -12561 -50115 14404 43020
911 43020 -15657 -27122 21658 9751 -31825 1763 40028 -5532 -39545 5895 28740 -9087
923 -9087 -12651 17496 -855 -27358 6908 31563 -7093 -25682 7304 11750 -12249 3080 21044
936 21044 -12082 -27754 13698 26210 -12294 -15287 13766 89 -20210 11868 27858 -16360
$$ packed form
848D048L4254m0030l4798L5408K5401k6785o692K2393j3180k4453K4582K7577
860B7725k3553k3833J4493J0027o039Q903L745k3338n729K6057M665j7409N163
873H77M897k2759L838L9935o815m7481R031M2015j7548k8004L4556J3962n4838
886b8334n117O8859j51p0095Q444N9424k4648m4234M6969L2069o7431k4663P7393
899B8485J7375p4124l830O2377j7603n0293M1602M2674n9224l7554O4519K8616
911D3020n8677j1465M8780j1907m1576L3588L8265m5560l4013M5440K2845l7827
923i087l564L0147j8351k6503L4266K4655l8656j8589L2986M446k3999J5329J7964
936B1044l3126j5672M1452J2512l8504k993K9053j3677k0299L2078J5990m4218
$$ plain form
948 -16360 -30151 15261 23257 -14394 -9400 18134 -4449 -25574 12273 30997 -13024 -28717
960 -28717 11169 18022 -12283 -3897 18269 -6680 -25323 10033 27217 -8272 -20571 7003
972 7003 7814 -10237 4518 16865 -10726 -21329 10135 18538 -7101 -8064 6971 -4970 -11332
985 -11332 14009 16447 -15699 -16620 12375 8981 -9447 3772 10730 -15223 -15060 20128 17237 -18240
999 -18240 -12692 14021 1481 -12572 11408 15309 -19797 -18616 20878 17171 -17157 -8527 13923
1012 13923 -4430 -14751 15667 18210 -20392 -19353 18683 13937 -14855 -2333 13710 -10492
1024 -10492 -16256 18737 18923 -19856 -16733 16486 7722 -13620 5126 14401 -15913 -17360 20178
1037 20178 17811 -18209 -12071 14292 743 -12956 11161 15053 -18233 -17211 18414 14824 -14403
$$ packed form
948a6360j3791M5412P996l7651M994K7534k2583k1125L7847J8724m4021j5693
960b8717L9886O853l0305Q386K2166k4949j8643L5356J7184l5489j2299K7574
972G003Q11j8051J4755J2347k7591j0603L1464Q403k5639r63J5035j1941o362
985a1332K5341K438l2146r21K8995l394j8428J3219O958k5953J63L5188k891l5477
999a8240N548K6713j2540j4053K3980L901l5106J181L9494l707l4328Q630K2450
1012A3923j8353j0321L0418K543l8602J039L8036m746k8792J2522J6043k4202
1024a0492n764L4993J86l8779L123L3219q764k1342J8746R275l0314j447L7538
1037B0178k367l6020O138K6363j3549j3699K4117L892l3286J022L5625l590k9227
$$ plain form
1050 -14403 -6273 11162 -5330 -11555 14470 14139 -17203 -14454 14109 9100 -9530 1043 7748
1063 7748 -11347 -9371 16754 11027 -15583 -8451 10609 305 -6593 10364 6133 -18251 -7584
1076 -7584 19727 6767 -15609 -676 10105 -9611 -7153 19461 7242 -24066 -7187 22056
1088 22056 3125 -16393 5926 11535 -16779 -9905 24330 9984 -25374 -7849 20978 906
1100 906 -15303 9621 12169 -19166 -11895 23453 11406 -21426 -7065 16051 -1831 -11729 12140
1113 12140 10528 -19113 -10842 19901 8833 -15690 -2215 10472 -7657 -7774 16417 7641 -20032
1126 -20032 -7017 17618 2599 -12169 6043 7742 -15768 -6177 21937 5831 -22029 -3191
1138 -3191 17338 -3790 -11828 13520 8677 -21784 -7928 24818 6652 -22154 -1835 16747
$$ packed form
1050a4403Q130J7435j6492o225K6025l31l1342K749K8563n009j8630J0573O705
1063G748j9095J976K6125n727k6610P132J9060j0304o898J6957m231k4384J0667
1076g584K7311j2960k2376J4933J0781j9716K458K6614j2219l1308J6879K9243
1088B2056j8931j9518K2319N609k8314O874L4235j4346l5358J7525K8827k0072
1100I06j6209K4924K548l1335P271L5348j2047l2832J4361K3116j7882r898K3869
1113A2140j612k9641Q271L0743j1068k4523J3475J2687j8129j17K4191q776k7673
1126b0032J3015K4635j5019j4768J8212J699k3510R591K8114j6106k7860J8838
1138c191K0529k1128q038K5348m843l0461J3856L2746j8166k8806K0319J8582
$$ plain form
1150 16747 -6804 -12534 16132 11215 -21941 -11048 21989 8624 -17841 -2186 13213 -6791
1162 -6791 -11220 14298 11557 -16999 -11374 14507 7732 -9911 -488 6825 -7366 -6658 11822 7639
1176 7639 -10977 -6502 6419 1616 -1888 5376 26 -10731 -626 11335 879 -7114 1842
1189 1842 1188 -7530 2949 13305 -4003 -15425 3655 12360 -4962 -5929 9366 -148 -15248
1202 -15248 3254 19046 -3767 -18064 4404 12545 -7572 -5645 13199 707 -18497 1104
1214 1104 20049 -1584 -16568 3609 10004 -8432 -3897 14455 604 -18180 295 17101
1226 17101 -1343 -11682 4865 4941 -10538 -139 15510 -1780 -16621 2466 12727 -4606
1238 -4606 -5922 9180 -350 -14510 3808 17280 -4921 -15286 6103 9144 -9458 -1993 14505
$$ packed form
1150A6747k3551n730K8666m917l3156J0893L3037j3365k6465J5655J5399k0004
1162f791m429K5518k741k8556N625K5881o775j7643R423P313j4191P08J8480m183
1176G639j8616M475J2921m803l504P264n350j0757J0105J1961j0456p993Q956
1189A842o54q718J0479J0356j7308j1422J9080Q705j7322r67J5295r514j5100
1202a5248J8502J5792k2813j4297K2468Q141k0117J927J8844j2492j9204J9601
1214A104J8945k1633j4984K0177O395j8436M535J8352j3851j8784J8475J6806
1226A7101j8444j0339J6547P6j5479J0399J5649j7290j4841J9087J0261j7333
1238d606j316J5102r530j4160J8318J3472k2201j0365K1389L041j8602P465J6498
$$ plain form
1251 14505 -3156 -18644 5345 18819 -6320 -14327 8605 7249 -13092 -943 18143 -2638
1263 -2638 -20633 3967 18575 -5533 -12707 9184 5982 -14484 -1259 18809 -750 -19338
1275 -19338 1819 15440 -4316 -9179 8970 3686 -14090 -889 16648 47 -14867 1124
1287 1124 9609 -4279 -3754 8945 62 -12524 959 12523 -1020 -8498 2367 2630 -5716 2057
1301 2057 9343 -3865 -10558 3575 7862 -3467 -2289 5219 -3352 -8301 6540 10308 -6922 -8963
1315 -8963 6293 4078 -6825 2216 9120 -7070 -11569 8982 11594 -8821 -7868 8779 1476 -10365
1329 -10365 4750 12918 -8554 -14160 9555 11958 -9489 -6341 10382 -531 -12710 5859 14806
1342 14806 -8289 -14336 8581 10201 -8845 -3647 10536 -2561 -12940 6217 13896 -7127 -11608
$$ packed form
1251A4505j7661j5488K3989J3474k5139q007K2932j356k0341J2149J9086k0781
1263b638j7995K4600J4608k4108p174K1891l202k0466J3225K0068j9559j8588
1275a9338K1157J3621j9756m863J8149n284j7776J3201J7537j6601j4914J5991
1287A124Q485j3888N25J2699q883j2586J3483J1564j3543p478J0865K63q346P773
1301B057P286j3208o693J4133M287j1329J178P508q571m949J4841L768j7230k041
1315h963J5256k215j0903R041O904j6190m499K0551K612k0415R53J6647p303j1841
1329a0365J5115Q168k1472n606K3715K403k1447L148J6723j0913j2179J8569Q947
1342A4806k3095o047K2917J620j9046N198J4183j3097j0379J9157P679k1023m481
$$ plain form
1355 -11608 6978 6182 -7759 235 9865 -4918 -11721 6751 11138 -6632 -7145 6612 1078 -8016
1369 -8016 4518 10111 -7600 -10806 8139 8354 -7815 -2983 8437 -3213 -10292 7718 11783
1382 11783 -9458 -10819 9390 6589 -9512 -440 10860 -5125 -12790 8217 13214 -8818 -10638
1395 -10638 8658 5394 -9385 436 11278 -4423 -12862 5707 12140 -5376 -8532 5295 3356
1408 3356 -6605 962 8572 -2806 -9341 2353 7444 -1359 -3343 1496 -1036 -2929 3453 4134 -3242
1423 -3242 -3415 1565 167 -268 4251 354 -7539 -1117 8211 737 -6546 2029 4277 -6614 -2940
1438 -2940 11075 2710 -13261 -2186 12585 -190 -10205 4790 8005 -10130 -6963 13967 6343
1451 6343 -14932 -4576 13383 616 -11074 4827 9567 -9849 -9031 12428 8076 -12174 -5339
$$ packed form
1355a1608J8586p96j3941P994R630j4783o803J8472M387j7770n13J3757n534r094
1369h016J2534N593j7711l206J8945K15j6169M832J1420j1650p079J8010M065
1382A1783k1241j361K0209k801j6101R072J1300j5985p665K1007M997k2032j820
1395a0638J9296l264j4779R821J0842j5701q439J8569O433j7516l156J3827j939
1408C356r961P567P610j1378o535J1694N091q803j984M839k532j893O382O81p376
1423c242j73M980j398m35M519l897p893O422R328p474p283Q575K248j0891L674
1438b940J4015q365j5971J1075J4771j2775j0015J4995L215j8135L167K0930p624
1451F343k1275J0356J7959j2767j1690J5901M740j9416Q18K1459m352k0250O835
$$ plain form
1464 -5339 10232 549 -8505 4819 7839 -8656 -7489 9699 5922 -8414 -2226 6463 -2926 -5301
1478 -5301 7590 4923 -9896 -4028 9448 1253 -7461 3483 5618 -8696 -4639 12315 3844
1491 3844 -13140 -1707 11648 -2519 -9477 8001 7959 -12847 -7083 15267 5567 -14991 -2264
1504 -2264 13255 -2913 -11695 8396 10973 -12300 -10360 13562 8414 -12770 -4419 11546 -788
1517 -788 -11080 5416 11280 -7871 -10868 8004 8593 -7062 -4553 6527 108 -6953 2876 7501
1531 7501 -3528 -6828 2519 4238 -1359 -600 1162 -2445 -1726 3375 1846 -2182 -381 101 -2540
1546 -2540 1301 5418 -1606 -6788 1520 5806 -2374 -3318 4701 865 -7683 481 9741 -820 -9631
1561 -9631 1445 7472 -3265 -4615 6193 2528 -8948 -1668 9989 1209 -8777 84 6128 -2619
$$ packed form
1464e339J5571r683r054J3324L020j6495J167J7188l777j4336O188Q689r389k375
1478e301J2891k667j4819N868J3476q195q714J0944K135j4314M057J6954q471
1491C844j6984J1433J3355j4167o958J7478m2k0806N764K2350r700k0558J2727
1504b264J5519j6168q782K0091K577k3273J940K3922n148k1184Q351J5965j2334
1517g88j0292J6496N864j9151k997J8872N89j5655K509J1080o419p061R829M625
1531G501j1029l300R347J719n597P59J762l607P19N101j529m028J801M82k641
1546b540L841M117p024n182Q308M286q180r44Q019l836q548Q164R260j0561q811
1561i631J1076O027j0737j350J0808l665j1476P280J1657q780r986Q861O044q747
$$ plain form
1575 -2619 -3620 5677 2222 -7655 -1691 7456 919 -5286 985 2476 -3832 -359 6265 -633 -6903
1590 -6903 1254 5189 -2604 -2134 4992 -840 -7590 2711 8854 -3733 -7871 4870 4899 -6928 -1312
1605 -1312 9667 -1523 -11716 3239 11810 -4523 -9588 6435 6079 -9242 -2741 12076 424
1618 424 -13528 1088 12713 -2853 -10016 5527 6729 -8783 -4131 11416 2500 -12110 -1067
1631 -1067 10618 -1139 -7853 4254 5203 -7409 -3475 9211 2328 -8836 -885 6691 -1550 -4034
1645 -4034 4512 2079 -6817 -1029 7242 170 -5676 1369 3059 -3772 -702 6121 -587 -7174 1262
1660 1262 6262 -2152 -3831 3910 1190 -6177 618 7780 -1448 -7685 2019 5767 -3299 -3070 5347
1675 5347 776 -7348 438 8084 -1039 -6972 1903 4489 -3592 -1898 5665 195 -7030 562 6701
$$ packed form
1575b619j001R297l455r877N964R147o537o205O271J491o308L473O624o898o270
1590f903Q157L935p793M70P126n832o750J0301O143j2587m138J2741K9j1827N616
1605a312J0979j1190j0193J4955Q571j6333n065J6023l56j5321O501J4817j1652
1618D24j3952J4616J1625j5566p163J5543J202j5512M652J5547q916j4610J1043
1631a067J1685j1757o714J2107R49j2612L934J2686o883j1164P951P576q241k484
1645d034Q546k433q896N788Q271p072n846P045J690o831L070O823o708o587Q436
1660A262N000q414j679P741k720p367O795P162r228o237R704L748r066K29Q417
1675E347m571q124P786P646r123n933Q875K586q081J694P563n470p225P592O139
$$ plain form
1690 6701 -1118 -4701 2297 2003 -4072 205 5662 -1298 -5963 1718 4507 -2308 -1879 3605 -735
1705 -735 -5076 2341 5824 -2883 -4959 3124 2609 -3868 223 5161 -2368 -6209 3341 6009 -3607
1720 -3607 -4226 4028 1413 -5051 1213 6283 -2803 -6754 3372 5656 -3670 -3165 4449 282 -5673
1735 -5673 1898 6588 -2962 -6217 3330 4262 -3836 -1391 4851 -1269 -5934 2845 6137 -3413 -4840
1750 -4840 3688 2252 -4343 607 5323 -2693 -5932 3551 5297 -3739 -3258 4020 439 -4778 1939
1765 1939 5581 -3231 -5588 3515 4206 -3557 -1736 4012 -839 -4779 2581 5235 -3191 -4524 3142
1780 3142 2532 -3286 112 3853 -2298 -4413 3370 4180 -3489 -2649 3369 74 -3571 2498 3991 -4173
1796 -4173 -3974 4662 2818 -4472 -469 4334 -2369 -4500 4634 4602 -5708 -3832 5742 1845 -5495
$$ packed form
1690F701p819l583O998k94o075M277N457o960m665P681K789o815M29N484m340
1705g35m341P417L483q707k076Q083n15o477M091M938p529l841R550K668r616
1720c607o19Q254k615o464O264N070r086l951J0126K284r326N05P614m167n955
1735e673P571M690r550l255R547R32q098K445O242o120m665Q779L292r550j427
1750d840Q528j436o595M950M716q016l239R483J746r036M81P278l581n217O717
1765A939L642q812k357R103O91p763J821N748m851l940P360K654q426j333P666
1780C142o10n818L398L741o151k115P783Q10p669Q40O018l295l645O069J493q164
1796d173J99Q636j844p290M003M803o703k131R134l2j0310J876R574l897p340
$$ plain form
1811 -5495 957 5477 -3672 -5671 5379 5389 -5930 -4014 5815 1562 -5760 1275 6050 -3544 -6221
1826 -6221 4682 5573 -4879 -3728 4880 1088 -5142 1459 5576 -3103 -5500 3636 4333 -3666 -2132
1841 -2132 3760 -441 -4113 2418 4341 -3318 -3735 3338 2033 -3198 372 3256 -2593 -3476 3854
1856 3854 3255 -4047 -2040 3730 -92 -3536 2403 3617 -4047 -3616 4630 2943 -4398 -1274 4070
1871 4070 -948 -4076 2927 4280 -3947 -4099 4036 2997 -3730 -1116 3621 -977 -3855 2374 3987
1886 3987 -2756 -3492 2490 2084 -2131 -149 2137 -1404 -2334 2029 2196 -1716 -1209 1002 -427 -513 2010
1903 2010 368 -2810 -236 2542 -446 -1560 1840 534 -3487 97 4538 -486 -4581 1096 3687
1918 3687 -2356 -2422 4045 1366 -5557 -699 6220 64 -5806 1072 4679 -2832 -3489 4729 2637 -6077
$$ packed form
1811e495O452M520r149j999J1050J0j1319J916R829m253p322P035M775r594k677
1826f221J0903Q91j0452J151Q608l792o230O601M117q679k397R136O97p999J534
1841b132N892m201l672O531J923p659m17P073j305n231L570K884n849q83P330
1856C854n99p302K007N770l822l444N939J214p664M31Q246j687p341L124N344
1871D070n018l128P003J353q227j52Q135j039o727K614M737m598k878O229J613
1886C987o743p36N982m06m215J982K286l541r30M363J67l912N07K211j429q6K523
1903B010j642l178K574K778k988j114L400j306m021L584M441n024m095N677K591
1918C687o043o6O467k679o923M858O919o156n870O878L607p511o57Q218k092q714
$$ plain form
1934 -6077 -1968 6366 1004 -5700 627 4614 -2694 -3678 4496 3020 -5422 -2220 5280 943 -4399
1949 -4399 938 3414 -2943 -2665 4289 2073 -4554 -1133 3928 -399 -2893 2287 2014 -3858 -1365
1964 -1365 4536 694 -4162 463 3215 -2153 -2189 3860 1458 -4964 -880 5088 -19 -4378 1464
1979 1464 3366 -3264 -2563 4786 1989 -5474 -1316 5230 127 -4428 1584 3595 -3325 -3032 4528
1994 4528 2553 -4730 -1770 4211 429 -3475 1247 2894 -2642 -2597 3192 2204 -2916 -1406 2161 142
2010 142 -1517 1115 1224 -1816 -1112 1647 777 -856 -21 -21 -993 541 1662 -667 -1615 775 789 -1221
2028 -1221 326 1991 -1215 -2727 1683 2855 -1891 -2166 2274 940 -2982 336 3788 -1252 -4231
2043 -4231 1761 3873 -2253 -2757 2977 1313 -3912 -19 4646 -809 -4679 1386 3884 -2081 -2529
$$ packed form
1934f077M109Q334n362o704O327L987p308r84Q174j476q442L202P500m337n342
1949d399N337K476o357K78O954k216o627L421N061m327k494N180k73n872K493
1964a365N901l842m856M625K752n368l6O049k402o422M084N968n107m359N842
1979A464J902o630P01P349k797p463M158O546n103m555O012K011o920K93P560
1994D528j975p283K960N981l782l904M722J647n536M5N789r88n120J510L567k019
2010A42j659K632J09l040P04K759q70j633Q35%r72J534J121k329r48K390J4k010
2028a221J547J665l206j512M410J172m746k75M440j334l922L318L452n040k979
2043d231N992K112o126n04N734j664n225L893M665n455l870O065K498n965m48
$$ plain form
2058 -2529 2995 1097 -3900 -45 4342 -610 -3947 1179 2857 -1962 -1433 2873 251 -3582 477
2073 477 3575 -1001 -2786 1591 1488 -2436 -207 3249 -735 -3618 1313 3183 -1867 -2037 2630 666
2089 666 -3542 509 4152 -1312 -4123 1934 3281 -2687 -1957 3619 559 -4480 464 4832 -1181
2104 -1181 -4431 1866 3340 -2748 -2041 3730 907 -4429 -172 4525 -401 -3856 1088 2815 -1978
2119 -1978 -1782 2864 1125 -3321 -768 3108 397 -2356 237 1488 -1029 -876 1654 627 -1704
2134 -1704 -513 1189 240 -338 245 -360 -767 703 912 -713 -467 705 -444 -923 1406 1229 -2005
2151 -2005 -1337 2165 914 -2106 52 2142 -1215 -2266 2184 2374 -2628 -2038 2702 1164 -2660 58
2167 58 2732 -1224 -2877 1986 2750 -2254 -2131 2248 1069 -2305 176 2442 -1123 -2490 1609 2195
$$ packed form
2058b529N524j898m997L855M387m952l337N126J678m819N29M306k622l833M059
2073D77L098m576j785M377j03l924K229L456l984k883M931J870n050j70M667j964
2089F66m208M051L643n464k811O057J347n968P30N576l060n039M944M368o013
2104a181l250O297J474o088P07N771k823n336M257M697m926l455M944J727m793
2119a978J96M646j739m446K553L876k711k753K593J251k517J53K530j027k331
2134a704J191J702r49n78N83o05m07J470K09j625K46J172j149m79K329j77l234
2151b005O68L502j251l020K158K090l357j051M450J90n002N90M740j538l824K718
2167E8K674l956j653M863P64n004J23M379j179l374K481K266l565j367M099N86
$$ plain form
2183 2195 -1710 -1348 1704 157 -1811 961 1926 -1659 -1775 1894 1124 -1901 9 1909 -1281 -1946
2199 -1946 2271 1862 -2761 -1345 2887 294 -2829 1091 2839 -2344 -2746 3176 2398 -3516 -1519 3600
2215 3600 213 -3643 1228 3666 -2323 -3550 2959 3020 -3232 -1996 3417 679 -3633 565 3801
2230 3801 -1412 -3668 1862 3100 -2129 -2045 2396 866 -2751 41 2940 -575 -2763 808 2024
2245 2024 -1015 -1065 1297 171 -1566 400 1595 -549 -1151 569 337 -640 540 793 -1093 -816 1276
2262 1276 544 -1122 154 1004 -982 -963 1649 978 -1928 -779 1818 261 -1569 528 1446 -1303
2278 -1303 -1435 1755 1351 -1783 -1002 1584 333 -1399 465 1336 -1017 -1326 1225 1142 -1068 -638 830
2295 830 -82 -642 749 562 -1046 -428 989 46 -572 615 199 -1294 102 1722 -323 -1693 678
$$ packed form
2183B195l905L62L052j547j968K772R65l585j16L669p70l025J910J900l190o65
2199a946M217m09m623J416M232k593l123L920J748n183m02N922p78n914J997N119
2215C600l387l856M871K438n989j227O509O1o252J236N413k738m312M198L236
2230C801n213k256N530J238n229Q4M441j530l617K792K899l515k188L571J216
2245B024l039n0K362j126j737J966J195k144o02J720k32r77J180K53j886K77K092
2262A276p32j666J276Q50j986J9K612o71k906J149K597j557j830K097R18k749
2278a303j32L190m04l134P81K586j251j732J864Q71k353l09K551q3k210M30J468
2295H30r12n60J391j87j608O18J417r43o18J187m16j493J396J620k045j370K371
$$ plain form
2312 678 1257 -1301 -715 2030 216 -2608 166 2768 -575 -2486 1215 1938 -1987 -1331 2770 842
2328 842 -3208 -402 3235 -169 -2820 979 2316 -1859 -1825 2615 1442 -2928 -952 2834 249 -2477
2344 -2477 648 2050 -1542 -1705 2116 1315 -2262 -779 2045 -5 -1640 878 1280 -1589 -960 1929
2360 1929 537 -1794 94 1411 -883 -982 1630 613 -2061 -306 2069 -200 -1732 892 1303 -1622
2376 -1622 -900 2227 595 -2423 -194 2257 -361 -1882 1104 1507 -1805 -1199 2237 911 -2281 -457
2392 -457 2031 -189 -1694 924 1440 -1482 -1195 1714 932 -1585 -421 1273 -206 -973 793 777 -1105
2409 -1105 -571 1027 274 -697 192 335 -698 -57 1010 -86 -972 304 690 -589 -187 1018 -147
2426 -147 -1339 409 1406 -540 -1134 775 681 -1133 -235 1503 -103 -1709 287 1569 -494 -1195 799
$$ packed form
2312F78N79k558N86K745j814k824K774K602l343j911L701P23l925O56M101j928
2328H42m050K806L637l404k651L799J337m175L4M440j173m370J976L786k585k726
2344b477L125J402l592j63L821q01l577J483K824k050j635K518M02k869O29K889
2360A929j392k331J888J317k294r9K612j017k674J755K375k269j532K624M11k925
2376a622P22L127j632l018K229K451k618j521K986M03l312O06L436j326l192J824
2392d57K488k220j505K618N16k922K87K909p82k517J164J694j479p67J766j6j882
2409a105N34J598p53r71Q89J43j033O41J067j096q86J276L86j279M02J205j165
2426a47j192J748R97j946n94J909r4j814Q98J738j606j606J996J282k063p01J994
$$ plain form
2443 799 710 -1205 -271 1495 37 -1528 176 1219 -404 -713 778 228 -1073 125 1176 -331
2459 -331 -946 508 441 -757 131 1015 -610 -1119 892 955 -1046 -455 1210 -215 -1398 800 1559 -1202
2477 -1202 -1449 1457 1048 -1642 -400 1841 -298 -2058 830 2093 -1233 -1873 1474 1338 -1750 -651
2493 -651 2021 -8 -2243 513 2218 -864 -1860 1189 1276 -1510 -591 1808 -1 -1941 399 1778
2509 1778 -690 -1289 1003 629 -1270 -41 1472 -421 -1432 693 1058 -929 -482 1165 -144 -1353
2525 -1353 640 1396 -945 -1170 1155 680 -1383 -81 1598 -488 -1743 893 1668 -1137 -1305 1374
2541 1374 768 -1622 -170 1865 -268 -1944 610 1801 -843 -1372 1133 848 -1388 -363 1599 37
2557 37 -1596 183 1341 -364 -893 588 459 -796 -168 860 30 -712 23 362 -97 23 216 -298
$$ packed form
2443G99q9j915R34J766j458j565J704J043j623l09J491n50j301J198J051j507
2459c31o15J454o7j198Q88Q84j625n09K011O3k001N91J665j425j183K198P59k761
2477a202k47K906m09k690J242K241k139j760K888J263l326o40L347j36l088J099
2493f51K672k029k235K756J705l082r96L049Q7k786R19K399j809j940K340J379
2509A778k468n99K292l74j899J229J513j893j011K125L65j987M47J647j309j209
2525a353J993P56k341k25K325m75k063J302J679k086j255K636P75k805j68K679
2541A374o06k390J452K035k133j676K554J191k644n29K505k85k236J025J962j562
2557C7j633J779J158j705n29J481j29j255O28J028q30p42P35L39m59J20J93n14
$$ plain form
2575 -298 -244 408 141 -350 152 308 -533 -265 873 256 -1031 -158 1020 -121 -901 531 819 -952
2593 -952 -758 1255 673 -1343 -434 1307 -5 -1210 496 1128 -927 -1029 1162 835 -1193 -467 1113
2610 1113 -42 -997 549 913 -860 -760 961 447 -876 14 717 -534 -565 902 389 -1069 -123
2627 -123 1004 -283 -802 789 587 -1245 -373 1517 101 -1541 291 1390 -786 -1140 1383 957
2643 957 -1799 -680 2005 321 -1998 209 1866 -819 -1700 1424 1480 -1847 -1185 2024 721 -2034
2659 -2034 -145 1952 -524 -1809 1054 1642 -1394 -1338 1504 853 -1490 -277 1452 -246 -1374 638
2675 638 1212 -778 -931 815 517 -765 -62 738 -279 -676 458 516 -459 -231 389 -139 -328 461 276
2694 276 -662 -181 661 -44 -583 365 447 -716 -354 945 217 -1008 -50 914 -267 -783 609 621 -893
$$ packed form
2575b98N4O52k67m91N02J56q41K68J138o17j287Q73J178j141p80J432K88j771
2593i52J94K013n82k016R09J741j312j205J706O32k055j02K191l27k028P26J580
2610A113j155r55J546L64j773J00J721n14j323Q90P03j251l1J467n13j458R46
2627a23J127j287n19J591k02j832Q72J890j416j642J832J099k176l54K523m26
2643I57k756J119K685j684k319K207J657k685q81L124N6l327O62L209j303k755
2659b034J889K097k476j285K863N88l036N6K842o51k343J213J729j698j128K012
2675F38N74j990j53J746k98j282P03Q00j017l97J134N8r75K28O20n28j89P89j85
2694B76r38M81Q42p05n39R48Q2j163L62J299p28j225R58R64j181n16J392J2j514
$$ plain form
2713 -893 -491 1044 332 -984 -78 806 -227 -605 529 494 -682 -367 670 208 -491 35 264 -246
2731 -246 -98 401 -7 -377 114 202 -267 69 449 -321 -598 504 588 -637 -425 779 67 -994 247
2750 247 1156 -553 -1239 812 1098 -1029 -814 1315 416 -1576 15 1778 -383 -1753 739 1552 -1079
2767 -1079 -1183 1441 731 -1728 -312 1883 -75 -1833 410 1559 -807 -1197 1141 810 -1428 -474
2783 -474 1531 157 -1409 169 1151 -525 -832 823 535 -1047 -308 1045 37 -896 271 609 -558
2800 -558 -362 829 125 -900 115 804 -359 -584 650 288 -909 -10 1047 -198 -1002 443 798
2817 798 -699 -521 972 225 -1154 -3 1192 -213 -1045 440 800 -684 -539 917 334 -1017 -180
2834 -180 993 15 -811 172 601 -360 -438 510 318 -540 -238 443 140 -269 7 118 -122 10 145 -43
$$ packed form
2713h93M02J535p12j316R06Q84j033l78J134l5j176L15J037m62o99N26K29n10
2731b46J48M99m08l70M91Q8m69L36L80p70k77J102Q4j225K12J204p12j061J241
2750B47R09j709o86K051K86k127K15K129q99j992J591J763k161j370K492Q13k631
2767a079j04K624p10k459J416K195j958j758K243J149k366l90K338l31k238R54
2783d74K005j374j566J578R82j676l07J655k88j582P39J353j008r33J167L38j167
2800e58J96J191p04j025J015O89j163k25J234l62j197Q99J057j245q04J445L55
2817G98j497J78J493p47j379J151J195j405q32J485L60j484J45J456n83j351Q37
2834a80J173r78q26R83M29r61p8R48j92q58L02O81l03m09K76J11k40J32J35j88
$$ plain form
2854 -43 -42 85 -152 -125 377 172 -532 -142 610 17 -631 230 638 -541 -658 810 588 -1003 -445 1082
2874 1082 145 -1102 225 1107 -613 -1048 886 932 -1075 -678 1140 317 -1190 88 1194 -427 -1145
2891 -1145 685 998 -849 -703 931 347 -988 41 1020 -330 -937 536 754 -676 -431 743 63
2908 63 -812 276 811 -528 -669 683 382 -779 -17 810 -374 -837 662 711 -866 -495 949 129
2926 129 -1016 270 1037 -632 -963 863 781 -989 -500 1101 130 -1128 228 1170 -535 -1093 750
2943 750 875 -855 -581 951 243 -1034 66 1054 -282 -961 409 747 -528 -490 630 203 -683 -4
2961 -4 675 -150 -539 182 309 -261 -67 265 -129 -264 208 160 -238 36 211 -239 -187 464 113 -554 -29
2982 -29 533 -174 -478 414 363 -647 -287 766 141 -793 -4 729 -271 -636 482 543 -708 -444 797
$$ packed form
2854d3JJ27k37K7N02k05p04L90P52n93o48Q61M08j179j17J468k22j591N58J527
2874A082r37j247J327Q82j720m35J934M6k007L97J818q23j507J278J106j621p18
2891a145J830L13j847J46J634n84j335J029R79j350o07J473K18j430K45J174o80
2908F3q75J088N35j339j41J352l01j161P62Q27j184m63J499M9j577L71J444q20
2926A29j145J286P67j669l31J826q2j770M89J601r71j258J356R42j705n58J843
2943G50J25j730K74J532p08j277J100R88j336o79J370L38j275L8J120m27q86O79
2961dO79q25l89P21J27n70J94L32l94j35M72m8l98K74J75m50N2O51l51o67N25
2982b9N62p07l04Q92n1j010L60J053o25r34P89P33j000l65J118O1j251K64J241
$$ plain form
3001 797 251 -815 -47 732 -258 -631 479 520 -659 -387 700 173 -668 83 560 -351 -459 573 320
3020 320 -663 -129 634 -121 -529 423 401 -633 -233 768 52 -768 168 669 -473 -526 703 332 -887
3039 -887 -176 957 -76 -902 323 754 -616 -600 853 447 -1002 -249 1025 -6 -969 312 822
3056 822 -611 -682 841 518 -942 -296 936 2 -846 283 705 -529 -581 701 405 -734 -170 665
3074 665 -101 -570 356 437 -536 -305 576 101 -544 90 402 -315 -304 480 153 -574 -25 521 -161 -416 329
3095 329 285 -511 -156 629 58 -631 136 548 -314 -414 505 267 -668 -116 705 -29 -647 217 514 -411
3115 -411 -366 605 219 -684 -51 663 -126 -556 322 381 -498 -209 600 33 -585 133 495 -292 -353 451 157
3136 157 -567 15 566 -155 -513 317 369 -449 -145 612 -4 -640 186 618 -318 -488 477 283 -610 -96
$$ packed form
3001G97n46j066P68P79r90l73J110M1j179K72J087n27q41P51M77r11j08J032k53
3020C20r83N34P63p55m08R52k2j034M00J001p16q20R36N01j142n3J229l71j219
3039h87P11J133j033q26J225M31j370J6J453m06j449P53J274j031r63J281N10
3056H22j433p1J523l23j460O46J232r34q48J129M22j234n2J282k96j139N64Q35
3074F65p66m69R26Q1r73K31Q81m75o45O34L12p17J1P84l27p27N49N46o82k55P45
3095C29m4p96L55P85n71o89P67M12q62j00R19k38r35N52Q21p34o18Q64K97r25
3115d11M5R71l86r03O33P14p89m30Q78N9q79K89Q09n67o18P18L62p87o1Q04k94
3136A57p24N82N51p21l58Q30N2q18L04P57o16o36Q26M32r36j70R65j94q93N14
$$ plain form
3156 -96 731 -100 -741 265 633 -433 -470 576 245 -730 -38 794 -144 -739 310 585 -500 -362 646
3175 646 150 -731 45 718 -225 -617 372 398 -535 -214 629 11 -648 157 597 -302 -422 424 233 -537
3195 -537 -26 591 -146 -592 263 454 -375 -281 504 72 -576 83 574 -238 -503 364 343 -495 -151 570 -62
3216 -62 -603 211 560 -332 -392 448 200 -541 -4 598 -188 -571 336 438 -428 -242 516 33 -555 174 553
3237 553 -325 -451 413 304 -477 -88 539 -133 -544 282 488 -375 -366 462 169 -522 39 545 -225 -526 338
3258 338 435 -457 -268 491 54 -555 143 567 -302 -498 415 349 -476 -127 539 -60 -540 269 508 -390 -392
3279 -392 466 168 -500 49 509 -220 -484 379 386 -442 -223 483 9 -490 180 480 -338 -393 415 282 -480
3300 -480 -110 492 -107 -468 262 453 -392 -339 448 184 -482 3 493 -192 -472 366 405 -447 -256 496 83
$$ packed form
3156i6Q27q31o41J006L68j066l7J046l31r75O92Q32r38n95J049K75j085J38J008
3175F46m96q81P76O73r43l92R89K6r33L21Q43o18o59Q05M40q99j20Q46j91p70
3195e37N11O17p37m46Q55J91q29R4P85m32o48O59M91q12k65Q67k1q38L44P21o32
3216f2n41Q14L49q92o0Q40k48p41N37O02p86l83R07J02q66J86P58m83n88P29L79
3237E53q78j26Q64j09p81L89O27o72m11Q26K06q63RQ28k93o91N61N06p70l01Q64
3258C38R7q92J89P59m37o09O98M24q69j96R13o6q25L49O66n99m80Q09K39q98k
3279c92Q58k98o68N49M60p29k64Q63Pq28K19P06m74m99O70L00q18n5Q08j33p62
3300d80L70O02n99l61P30J91q45N3P87k64o66M85M90o85k80Q38L9q52J91P52m13
$$ plain form
3321 83 -504 130 465 -299 -416 423 290 -457 -120 482 -87 -471 256 401 -396 -297 452 132 -454 39 437
3342 437 -239 -383 367 289 -450 -172 465 11 -440 184 380 -329 -323 441 210 -490 -92 479 -105 -438 294
3363 294 384 -413 -282 509 159 -504 24 485 -236 -426 395 339 -501 -213 524 53 -502 136 424 -318 -352
3384 -352 431 237 -502 -112 472 -85 -417 261 355 -378 -243 445 127 -451 23 411 -188 -325 317 259 -415
3405 -415 -153 445 13 -423 138 347 -298 -275 435 166 -461 -37 457 -118 -405 272 291 -419 -203 493 68
3426 68 -524 60 443 -257 -353 380 241 -492 -115 518 -13 -460 181 375 -326 -267 434 141 -494 -19 460
3447 460 -110 -380 265 261 -372 -158 454 18 -458 88 384 -201 -299 347 187 -450 -46 478 -63 -440 208
3468 208 339 -353 -224 448 76 -527 35 514 -195 -441 331 304 -476 -151 552 -8 -562 128 490 -276
$$ packed form
3321H3n87O34L35p64j17Q39j33p47L37O02n69l84P27J45p97R9P49l20n86M93L98
3342D37o76j44P50p8p39K78O37m54m51O24J96p09OP64k31p00L98N71n84l33P32
3363B94R0p97J31P91l50o63N28M61p21j90Q21n6q40K88P37m71n55O38K88p42l4
3384c52P83j94p39L90N84n57l32O78R4p33J35O88l18n78M74L88n99j37O42n8o74
3405d15K62N98m32m36N61K09o45K3P10k69o27M24M94n75k87O77J9p10K16O96m25
3426F8n92N84L83p00r6P33j39p33L77O33n31m47O41J94p01N9P01k93o35M75M79
3447D60n70k70O45mo33K14O12m36m76N46K96n85r8O46j60o37M04N24n41l77O48
3468B08J31o92J29O72l72o03N62M79p09k46P72k7p80L25P03n60n54O90L62p66
$$ plain form
3488 -276 -374 405 242 -496 -95 541 -39 -527 176 437 -302 -294 406 177 -483 -45 493 -70 -430 208 331
3509 331 -317 -206 381 92 -430 16 413 -147 -330 253 213 -369 -96 416 -51 -409 147 327 -268 -209 352
3530 352 83 -418 54 423 -153 -345 286 248 -361 -126 417 -16 -437 129 396 -240 -297 322 165 -396 -41
3551 -41 428 -71 -403 171 325 -253 -225 343 104 -378 39 361 -113 -350 215 241 -283 -122 341 -6 -372
3572 -372 126 333 -218 -239 307 113 -349 51 389 -159 -354 291 266 -348 -121 410 -35 -431 174 394 -303
3593 -303 -319 378 210 -448 -70 464 -115 -481 246 424 -347 -301 436 181 -468 -4 511 -129 -463 261 417
3614 417 -341 -280 415 128 -456 33 489 -179 -407 284 336 -360 -172 425 32 -422 145 392 -260 -294 347
3635 347 180 -399 -18 404 -155 -389 267 304 -361 -193 395 61 -405 109 401 -232 -347 360 273 -395 -109
$$ packed form
3488b76r8P79j63p38M01O36n80m88P03K61p39QP00k29o60M38N38n63l60O38J23
3509C31o48J11N87k89n22M46L97n60j83N83m0n82K73N12m67l58N56J80n95N9N61
3530C52k69n01M72L69n76j92O31l8o09K35N43m33m21N66K67o36n7O19j57n61L55
3551d1M69m99l32N74J54n78K8N68k39m82M17L22m74k37N65K6n24J61M63l47l66
3572c72M98K07n51k1N46j94m62M00L38n48j95O45k5o14K27N31m45l96O05K20o97
3593c03j6O97j68o58L78N34n79l66P27J78p71M6P37k55o49M64N15o40l34P24J56
3614D17p58O1O95k87n84M89M56o68k28O91N2o96J88N97l93m54N67K47o52l4O41
3635C47j67n79L81M22n59k34O56L7o65J68N88l34m66N14K92o33j15P07q7o68K86
$$ plain form
3656 -109 422 -11 -416 183 411 -286 -324 350 222 -408 -74 450 -60 -413 208 365 -289 -253 378 143 -377
3677 -377 16 382 -169 -333 278 253 -324 -147 333 -20 -352 142 287 -280 -217 332 108 -340 21 358 -157
3698 -157 -282 266 226 -353 -124 401 2 -368 167 346 -269 -283 373 193 -402 -61 412 -73 -397 227 348
3719 348 -325 -263 415 160 -423 7 426 -147 -385 281 315 -390 -189 448 68 -435 76 400 -248 -310 348
3740 348 211 -427 -86 428 -50 -355 200 319 -318 -213 394 125 -402 47 393 -156 -326 302 264 -376
3760 -376 -158 418 25 -413 98 363 -250 -313 363 202 -409 -104 434 -45 -404 189 354 -338 -254 417 155
3781 155 -448 2 439 -152 -373 264 296 -398 -162 442 42 -422 100 393 -211 -269 349 198 -392 -59 412
3802 412 -40 -361 201 288 -291 -209 369 75 -412 25 384 -155 -334 273 223 -381 -114 429 16 -411 127
$$ packed form
3656a09N31m33m05N99K28o97l8O74j28o30L34N24n10l53O21J57o54L6O31k35n20
3677c77L93L66n51j64O11k5n77J77M80l53l32M94J45n67O3N49k24m48L61L37n15
3698a57j25N48m0n79K29N25l99l70N35J79o15j4O56j80n95L41M73m85l24O24J21
3719C48o73O2O78k55n83M30M19n73k38O66L4p05K01O37l80n03N11L24o48o2O58
3740C48j37o38L41N14m78l05N55J19o37J05O07k69n27M49L46n49j70O28l8o40
3760c76K18N76l93m38N11K65o13o3O76j61o11L05N38m79l59N93J65o92Q4O71k62
3781A55o03M50M37n91k21O37L2o94K36O04m00m64N22K93o04n8O18j51n90L33M71
3802D12m52l21N62Q7n79Q2N78k94m87M37L59n39j79O07n0o04K67N43m13m27N38
$$ plain form
3823 127 376 -260 -298 363 162 -437 -63 463 -88 -416 216 332 -361 -213 443 95 -463 36 468 -187
3843 -187 -375 297 283 -405 -150 456 17 -467 117 406 -254 -296 332 199 -431 -76 437 -54 -414 156 326
3864 326 -287 -224 378 116 -426 21 423 -117 -362 252 265 -331 -127 414 21 -415 109 376 -221 -277 341
3885 341 162 -401 -26 426 -91 -380 212 304 -322 -195 393 67 -429 63 399 -176 -330 269 228 -360 -85
3906 -85 413 -19 -401 141 361 -230 -264 314 158 -376 -13 413 -91 -342 208 300 -281 -185 353 50 -388
3927 -388 76 393 -186 -309 279 192 -367 -77 378 -71 -378 182 319 -303 -239 370 97 -404 56 424 -175
3948 -175 -370 285 270 -359 -166 425 6 -437 142 419 -249 -319 339 225 -392 -81 436 -60 -428 196 374
3969 374 -290 -278 371 142 -420 -21 435 -136 -413 257 317 -352 -205 409 44 -424 75 426 -228 -365 321
$$ packed form
3823A27K49o36l8O61k01n99L74N26n51l28O32J16o93J48O56l48n58M99M32o55
3843a87j88O72j4o88K55O06m39m84N84K89o60m2O28j33o30L55N13m91l60N70J70
3864C26o13O3O02k62n42M47M02n40k45O14J3n96K04N41l93m36N24K67n97n6O18
3885C41j79n63L75M52n17k89N92R2o26J27N88l26m96M92L36n75j54N99m1n88K75
3906h5M98m32l82N42K20n91l4N78j56n34L63M26n04k51N50R2n81R6N38l03m38
3927c88M64L17n79j23N88q7n59K90M55m49l07N60J37o22O4O09k73n01M60L68n99
3948a75j95O55j5o29J93N91m19m43N79K77o68p0O58j14o17L11N17m96l68O24J78
3969C74o64J2O49k29n62L99M56n71k77O70O0o69J47O14l65m68M99L51o54j37O86
$$ plain form
3990 321 243 -396 -96 428 -53 -418 200 365 -299 -277 361 140 -409 9 411 -130 -376 267 314 -320 -193
4011 -193 399 64 -405 86 399 -191 -311 298 241 -339 -130 396 -17 -398 139 355 -249 -268 317 156 -359
4032 -359 -37 381 -114 -353 208 302 -290 -173 358 55 -359 68 338 -187 -296 275 197 -340 -62 352 -49
4053 -49 -329 190 289 -262 -213 338 109 -345 7 354 -149 -304 239 252 -326 -162 361 34 -361 103 354
4074 354 -233 -293 312 190 -358 -75 388 -60 -352 190 329 -289 -215 357 114 -391 27 392 -163 -314 293
4095 293 262 -365 -140 394 5 -375 137 342 -246 -271 356 196 -371 -71 401 -61 -378 199 320 -301 -224
4116 -224 369 101 -393 14 375 -132 -355 270 263 -356 -177 386 46 -384 91 376 -217 -294 326 183 -375
4137 -375 -92 401 -40 -377 194 313 -313 -231 377 120 -399 21 391 -151 -350 268 270 -354 -146 403 32
$$ packed form
3990C21p8o39L00N24m81l65O18J65o64K2O38k21n49M18M02n41k46O43M7o34J27
4011a93N92l35m69M91L13n90j20O09n7n80K09N26m13l81N37K16o04j9N85j61n15
4032c59L22M18m95k39N61R4n92J17N31l03m14M27K70n25j09N71p8n37K78M14m01
4053d9k80N19R9n51M9N51k29m54L52L47n03j55N43J3n78J64N23l27l95M64K51
4074C54n87o0O05j22n48K83M63m48k92N42J39o18P4N72k43n05M18L65n55j51O07
4095B93l1o27K25N34l89l80N12K05n88k5O27j60n67L00M72m62l17N77J21o21P7
4116b24N93k68m94M07L61n07k23O25po19J79N63l40m30M75K85n93p7O20j43n58
4137c75K83M93m41l37N71J19o26Q2O08k57n19M20L70n42j99O18Ko24K08N49l71
$$ plain form
4158 32 -388 94 367 -217 -289 322 195 -369 -96 389 -52 -368 166 314 -260 -230 352 124 -378 6 379
4179 379 -115 -321 243 262 -318 -137 381 49 -362 84 345 -216 -283 325 177 -383 -49 375 -86 -360 202
4200 202 286 -317 -191 371 69 -397 33 392 -150 -331 253 233 -344 -118 421 21 -406 100 353 -212 -257
4221 -257 305 182 -374 -62 398 -25 -362 159 309 -273 -228 349 113 -391 5 370 -141 -321 237 224 -326
4242 -326 -135 376 4 -366 101 315 -214 -242 299 138 -364 -15 388 -89 -348 207 272 -270 -156 371 79
4263 79 -376 60 380 -143 -321 256 222 -332 -112 377 14 -369 100 349 -198 -268 306 168 -370 -64 383
4284 383 -72 -357 187 293 -272 -178 340 76 -380 48 363 -166 -300 256 191 -329 -76 371 -31 -352 158
4305 158 325 -248 -223 338 127 -367 8 376 -109 -346 217 279 -297 -146 371 43 -402 71 387 -198 -316
$$ packed form
4158C2m20M82K73n84p2O11j27n64K73M85m41l16N34J48n74L0N82k28n02L84L73
4179C79m94k06N64J9n80J81N18l32m11M46K61n61o7O08j48n60L34M24m61k74N62
4200B02Q4o03J26N62l02m66M30L59n42j81N84k0n77K26N39m00m27N06K53n65m5
4221b57N62j23n56L12M60m23l37N21J50n82M5N77k36n04L96L65n11j80N58j3n50
4242c26J91N11l72l70M67K14n29k8N41j61n02L49M03m77k59N55O5n42J14N27k92
4263G9m55M36L20n23j78N77l4n54K20M89l63l83M69K49n47p0N74j38n38L06M47
4284C83m55k85N44J06n65R4N18k64m56M28L15n29j34N56o5n20K53M47m02l21N10
4305A58J67n73K5N61k11m94L75L68m85k37N63O2n76J51N17l28m45M73L16n85j18
$$ plain form
4326 -316 284 224 -358 -103 405 -22 -414 129 370 -230 -259 338 152 -373 -17 405 -115 -360 220 311 -290
4347 -290 -187 364 59 -392 81 383 -179 -322 268 202 -352 -79 390 -46 -387 152 334 -257 -268 336 136
4368 136 -372 -14 390 -100 -362 226 292 -312 -187 381 71 -390 56 396 -174 -322 263 247 -321 -110 391
4389 391 -2 -362 140 341 -241 -257 311 156 -348 -28 370 -101 -342 213 286 -287 -163 354 48 -360 58
4410 58 343 -176 -282 251 200 -328 -94 343 -19 -348 154 321 -233 -233 300 132 -323 3 365 -93 -317
4431 -317 222 281 -282 -165 335 46 -346 61 327 -177 -270 272 190 -312 -70 344 -53 -330 150 294 -269
4452 -269 -196 323 94 -342 33 334 -156 -299 254 241 -323 -139 345 8 -323 125 299 -200 -249 303 161
4473 161 -354 -41 368 -65 -346 182 280 -269 -206 346 104 -377 34 351 -142 -299 246 232 -333 -137 367
$$ packed form
4326c16O00o0n82K55N08m27l92N43K41o00k9N97j86n25L56M22n20k45N80R1o01
4347b90J03N51l05m51M73L02n62j43N90o6n54K73M69m36l41N39J82n91j1O04k00
4368A36n08L58M04m90k62N88O6o04J25N68l10m61M46L40n70j48N85j6n68K11N01
4389C91l93l60N02K01n82j6N68j55n04L20L98m71k41N55P3n73J24N17l06m08M18
4410E8K85n19j06N33n1n28K34M37l62l29N02J67n54%N33j68m55L26L62m58k24
4431c17N39N9n63J17N00k89l92M07K66n04r3N42q2n02K42M14l97k77M80J44n63
4452b69P3N19k29m36L75L01m90j43N53j3n64J84M84l37l31M48J74m99m9N52j42
4473A61n15L13M09m33k81N28R8n49O3N52k42m81M11L17m93j57N45j4n65J96N04
$$ plain form
4494 367 11 -371 106 330 -238 -245 310 164 -384 -42 371 -101 -359 221 290 -310 -195 379 79 -398 61
4515 61 378 -170 -305 284 251 -364 -133 411 19 -393 126 364 -230 -312 324 211 -386 -103 413 -35 -385
4536 -385 150 345 -275 -266 345 144 -394 -44 370 -97 -342 233 263 -309 -153 356 44 -362 65 341 -184
4557 -184 -263 287 166 -332 -61 362 -53 -326 155 281 -256 -197 342 99 -351 -6 340 -119 -318 224 254
4578 254 -313 -160 346 36 -369 46 328 -172 -265 254 182 -335 -84 354 -22 -318 140 258 -209 -176 296
4599 296 91 -305 8 301 -108 -226 209 152 -264 -54 305 -18 -282 122 240 -208 -173 297 94 -332 21
4620 21 323 -129 -302 223 203 -312 -116 339 5 -386 87 361 -197 -291 293 205 -336 -72 397 -23 -378
$$ packed form
4494C67l56l82M77K24n68pN55j46n48L42M13m72k58N80O9o00J15N74l00m77M59
4515F1L17n48j35N89l3o15K31N44l92m12N19K38n94q2O36j13n97K83N16m48l50
4536c85N35J95o20RO11k01n38L50M14m67k45N75L0n72J56N09l12m06M27K76n25
4557a84p9N50j21m98K71M23m15k73M81J26n37N9N39k43m50L45L46m59j99N42L0
4578B54n67J53N06l10m05M15K82n00r3N19p2n17K51M38l76k96M58J18m67L3M72
4599B96k05l96L13K93m09j18M35n7m16K10L59l23k64M04J18m48L5M70k03m26L53
4620B1L02m52j73N25k0n15J96M55l34l91M73K74n58r4N84q8n41K64M69m20l55
$$ [...]
8191a4
##END NTUPLES=NMR FID
##END=
