##TITLE=1H_ES-ZN-IPA
 
 8 sc, 
 24.11.2022
##JCAMPDX= 6.0         $$ Bruker NMR JCAMP-DX V2.0
##DATA TYPE= NMR FID
##DATA CLASS= NTUPLES
##ORIGIN= UXNMR, Bruker Analytische Messtechnik GmbH
##OWNER= root
$$ XWIN-NMR		Version 3.5
$$ Thu Nov 24 16:31:46 2022 Russian Standard Time (UT+4h)  she@DPX200
##.OBSERVE FREQUENCY= 200.1313499994
##.OBSERVE NUCLEUS= ^1H
##.DELAY= (6, 6)
##.ACQUISITION MODE= SIMULTANEOUS
##.ACQUISITION SCHEME= undefined
##.AVERAGES= 8
##.DIGITISER RES= 18
##SPECTROMETER/DATA SYSTEM= spect
##.PULSE SEQUENCE= zg30
##.SOLVENT NAME= CDCl3
##.SHIFT REFERENCE= (INTERNAL, CDCl3, 0, 15.7039)
##AUDIT TRAIL= $$ (NUMBER, WHEN, WHO, WHERE, WHAT)
$$ ##TITLE= Audit trail, XWIN-NMR		Version 3.5
$$ ##JCAMPDX= 5.01
$$ ##ORIGIN= Bruker BioSpin GmbH
$$ ##OWNER= she
$$ F:/spectra/data/she/nmr/H-F/1/audita.txt
$$ ##AUDIT TRAIL=  $$ (NUMBER, WHEN, WHO, WHERE, WHAT)
(   1,<2022-11-24 16:30:33.84 +0400>,<she>,<DPX200>,
      <created by zg, POWCHK disabled, PULCHK disabled
       configuration hash MD5:
       00 E9 B6 7A A2 85 ED C7 34 08 36 98 17 FE 4E 26
       data hash MD5: 16K
       FB DE 00 D2 92 2D 3D 16 76 87 D6 87 B3 14 73 A6>)
$$ ##END=
$$ 
$$ hash MD5
$$ 07 F6 94 20 D5 89 9A 8B 18 CA 84 78 3C 37 51 85
##$RELAX= 
##$RELAX= 
##$RELAX= 
##$RELAX= 
##$RELAX= 
##$RELAX= 
$$ Bruker specific parameters
$$ --------------------------
##$DU= <F:/spectra>
##$EXPNO= 1
##$NAME= <H-F>
##$PROCNO= 1
##$TYPE= <nmr>
##$USER= <she>
##$AMP= (0..31)
100 100 100 100 100 100 100 100 100 100 100 100 100 100 100 100 100 100 
100 100 100 100 100 100 100 100 100 100 100 100 100 100 
##$AQSEQ= 0
##$AQ_mod= 1
##$AUNM= <au_zg>
##$AUTOPOS= <>
##$BF1= 200.13
##$BF2= 200.13
##$BF3= 200.13
##$BF4= 200.13
##$BF5= 200.13
##$BF6= 200.13
##$BF7= 200.13
##$BF8= 200.13
##$BYTORDA= 1
##$CFDGTYP= 0
##$CFRGTYP= 5
##$CHEMSTR= <none>
##$CNST= (0..31)
1 1 145 1 1 1 1 1 1 1 1 1 1 1 1 1 1 1 1 1 1 1 1 1 1 1 1 1 1 1 1 1 
##$CPDPRG= <>
##$CPDPRG1= <>
##$CPDPRG2= <>
##$CPDPRG3= <>
##$CPDPRG4= <mlev>
##$CPDPRG5= <mlev>
##$CPDPRG6= <mlev>
##$CPDPRG7= <mlev>
##$CPDPRG8= <mlev>
##$CPDPRGB= <>
##$CPDPRGT= <>
##$D= (0..31)
0 1.2 0 0 0 0 0 0 0 0.06 0 0.03 0 0 0 0 0.0002 0 0 0 0 0 0 0 0 0 0 0 0 
0 0 0 
##$DATE= 1669293033
##$DBL= (0..7)
120 120 120 120 120 120 120 120 
##$DBP= (0..7)
150 150 150 150 150 150 150 150 
##$DBP07= 0
##$DBPNAM0= <>
##$DBPNAM1= <>
##$DBPNAM2= <>
##$DBPNAM3= <>
##$DBPNAM4= <>
##$DBPNAM5= <>
##$DBPNAM6= <>
##$DBPNAM7= <>
##$DBPOAL= (0..7)
0.5 0.5 0.5 0.5 0.5 0.5 0.5 0.5 
##$DBPOFFS= (0..7)
0 0 0 0 0 0 0 0 
##$DE= 6
##$DECBNUC= <off>
##$DECIM= 32
##$DECNUC= <off>
##$DECSTAT= 4
##$DIGMOD= 1
##$DIGTYP= 9
##$DL= (0..7)
0 120 120 120 120 120 120 120 
##$DP= (0..7)
150 150 150 150 150 150 150 150 
##$DP07= 0
##$DPNAME0= <>
##$DPNAME1= <>
##$DPNAME2= <>
##$DPNAME3= <>
##$DPNAME4= <>
##$DPNAME5= <>
##$DPNAME6= <>
##$DPNAME7= <>
##$DPOAL= (0..7)
0.5 0.5 0.5 0.5 0.5 0.5 0.5 0.5 
##$DPOFFS= (0..7)
0 0 0 0 0 0 0 0 
##$DQDMODE= 0
##$DR= 18
##$DS= 0
##$DSLIST= <SSSSSSSSSSSSSSS>
$$ [...]
##$SUBNAM2= <"">
##$SUBNAM3= <"">
##$SUBNAM4= <"">
##$SUBNAM5= <"">
##$SUBNAM6= <"">
##$SUBNAM7= <"">
##$SUBNAM8= <"">
##$SUBNAM9= <"">
##$SW= 18.0517283424941
##$SWIBOX= (0..15)
0 0 2 0 0 0 0 0 0 0 0 0 0 0 0 0 
##$SW_h= 3612.71676300578
##$TD= 16384
##$TD0= 1
##$TE= 0
##$TE2= 300
##$TE3= 300
##$TEG= 300
##$TL= (0..7)
0 120 120 120 120 120 120 120 
##$TP= (0..7)
150 150 150 150 150 150 150 150 
##$TP07= 0
##$TPNAME0= <>
##$TPNAME1= <>
##$TPNAME2= <>
##$TPNAME3= <>
##$TPNAME4= <>
##$TPNAME5= <>
##$TPNAME6= <>
##$TPNAME7= <>
##$TPOAL= (0..7)
0.5 0.5 0.5 0.5 0.5 0.5 0.5 0.5 
##$TPOFFS= (0..7)
0 0 0 0 0 0 0 0 
##$TUNHIN= 0
##$TUNHOUT= 0
##$TUNXOUT= 0
##$USERA1= <user>
##$USERA2= <user>
##$USERA3= <user>
##$USERA4= <user>
##$USERA5= <user>
##$V9= 5
##$VALIST= <valist>
##$VCLIST= <CCCCCCCCCCCCCCC>
##$VD= 0
##$VDLIST= <DDDDDDDDDDDDDDD>
##$VPLIST= <PPPPPPPPPPPPPPP>
##$VTLIST= <TTTTTTTTTTTTTTT>
##$WBST= 1024
##$WBSW= 4
##$XGAIN= (0..3)
0 0 0 0 
##$XL= 0
##$YL= 0
##$YMAX_a= 488895
##$YMIN_a= -450000
##$ZGOPTNS= <>
##$ZL1= 120
##$ZL2= 120
##$ZL3= 120
##$ZL4= 120
##$ABSF1= 10
##$ABSF2= 0
##$ABSG= 5
##$ABSL= 3
##$ALPHA= 0
##$AQORDER= 0
##$ASSFAC= 0
##$ASSFACI= 0
##$ASSFACX= 0
##$ASSWID= 0
##$AUNMP= <proc_1d>
##$AZFE= 0.1
##$AZFW= 0.1
##$BCFW= 1
##$BC_mod= 2
##$BYTORDP= 1
##$COROFFS= 0
##$CY= 11.3945322036743
##$DATMOD= 1
##$DC= 2
##$DFILT= <>
##$DTYPP= 0
##$F1P= 2.36226072786647
##$F2P= -0.459571619588291
##$FCOR= 0.5
##$FTSIZE= 0
##$FT_mod= 4
##$GAMMA= 1
##$GB= 0.15
##$INTBC= 1
##$INTSCL= 1
##$ISEN= 128
##$LB= 0.24
##$LEV0= 0
##$LPBIN= 0
##$MAXI= 10000
##$MC2= 0
##$MEAN= 0
##$ME_mod= 0
##$MI= 1.114404
##$NCOEF= 0
##$NC_proc= 0
##$NLEV= 6
##$NOISF1= 3.799351
##$NOISF2= 2.8
##$NSP= 1
##$NTH_PI= 0
##$NZP= 0
##$OFFSET= 15.70392
##$PC= 1
##$PHC0= -18300.07
##$PHC1= 7.20072
##$PH_mod= 1
##$PKNL= yes
##$PPARMOD= 0
##$PSCAL= 0
##$PSIGN= 0
##$REVERSE= no
##$SF= 200.130013532006
##$SI= 16384
##$SIGF1= 3
##$SIGF2= 2
##$SINO= 400
##$SIOLD= 16384
##$SREGLST= <1H.CDCl3>
##$SSB= 0
##$STSI= 0
##$STSR= 0
##$SW_p= 3612.71676300578
##$SYMM= 0
##$S_DEV= 0
##$TDeff= 0
##$TDoff= 0
##$TI= <>
##$TILT= no
##$TM1= 0
##$TM2= 0
##$TOPLEV= 0
##$USERP1= <user>
##$USERP2= <user>
##$USERP3= <user>
##$USERP4= <user>
##$USERP5= <user>
##$WDW= 1
##$XDIM= 8192
##$YMAX_p= 0
##$YMIN_p= 0
$$ End of Bruker specific parameters
$$ ---------------------------------
##NTUPLES= NMR FID
##VAR_NAME=  TIME,          FID/REAL,        FID/IMAG
##SYMBOL=    X,             R,               I
##VAR_TYPE=  INDEPENDENT,   DEPENDENT,       DEPENDENT
##VAR_FORM=  AFFN,          ASDF,            ASDF
##VAR_DIM=   8192,          8192,            8192
##UNITS=     SECONDS,       ARBITRARY UNITS, ARBITRARY UNITS
##FACTOR=    0.0002768,     1,               1
##FIRST=     0,             0,               0
##LAST=      2.2672688,     0,               0
##MIN=       0,             -450000,         0
##MAX=       2.2672688,     488895,          0
$$ Real data points
##PAGE= N=1
##DATA TABLE= (X++(R..R)), XYDATA
0@%%%%%%%%qJ6j6J6k4L2l6M4n6P2q8J04j20J44j72J97k29K64l04L52m00M56n23
31b79N95o71P55q48R47j056J178j312J458j616J790j980K185k408K649k914L205
48A678l525L879m269M702n182N718o325P017p808Q726r809J1100j2671J4625j7116
63i260K0403k4923L1487m1791O0023j00431L11045J1514n15068N42031p35030
74d50000O84141k20067j65696N75615q19370N53819l59750K08876M29594q28036
84c90874O08600m84411L09163J96631n24300O88904p24776K96926R1105k00590
94a33622O00763q48245M39477q4252j01559M90256o67669N69004m20857m3914
104b00618M71717m59118N57082o36278J42853L14951m10824N81422n84290K85311
$$ plain form
0 0 0 0 0 0 0 0 0 0 -8 8 -8 8 -16 16 -20 24 -32 40 -48 56 -64 80 -92 105 -124 140 -164 188 -212 244 -279
31 -279 316 -355 400 -448 499 -557 621 -691 767 -849 941 -1039 1146 -1262 1387 -1527 1678
48 1678 -1847 2032 -2237 2465 -2717 3001 -3324 3693 -4115 4611 -5198 5902 -6769 7856 -9260
63 -9260 11143 -13780 17707 -24084 35939 -64492 246553 258067 -257001 285030 -450000
74 -450000 234141 14074 -151622 423993 -395377 158442 -201308 7568 437162 -390874
84 -390874 217726 -266685 42478 239109 -285191 403713 -321063 -24137 66968 -133622
94 -133622 467141 -381104 58373 -25879 -127438 362818 -304851 264153 -156704 -200618
104 -200618 271099 -188019 369063 -267215 -124362 190589 -220235 361187 -223103 62208
114F2208l3539l40829O76487n11932L27444k81526j66586N90980n34959M59676
124B47424l25677n9027L07372m90180O52781l68164l760Q9836l72541O60165m51474
135a13245J82412k183l33866M88887m45963M31094j13786l07526L47728m02930
145b69378N24265k29727j28907K58731m46866M77266k55509J21586J30685m81608
155b99462M34624k76888K66387J8891l62940L86620l92589L21107j1544j64765
165h0559K84739m94718L67620o4147j6962K09768m62372L69964k15006R4631K02443
176A95401l51707L13092l61874J96065J57356k41232K87711m11056K34813J7312
186C5881j20030L16857l93695K18617j37913l212L07481l41960K35180k41987
$$ plain form
114 62208 28669 -312160 364327 -147605 179839 -101687 -268273 322707 -212252 247424
124 247424 -78253 -137280 170092 -320088 332693 -35471 -39231 50605 -321936 338229 -113245
135 -113245 69167 66984 -266882 222005 -223958 207136 93350 -214176 133552 -269378
145 -269378 254887 25160 -103747 154984 -291882 185384 -70125 51461 182146 -299462
155 -299462 135162 -141726 124661 143552 -219388 167232 -225357 95750 84206 -80559
165 -80559 204180 -290538 77082 12935 -4027 205741 -256631 113333 -101673 -7042 195401
176 195401 -156306 156786 -205088 -9023 148333 -92899 194812 -216244 18569 35881
186 35881 -84149 232708 -160987 57630 -80283 -83495 223986 -117974 117206 -124781
196a24781M9941K14439k47115K99118l01182N7062Q6832j47191L37151l11263
206h6989R5576l5037j01480L10628k61791J79671j39706r3087K37972j97728K58311
217A66340j97406n8229J35208j74503K97467j91903K0781K1861j81732K89478
227A27362j64296J16193n7749j71499K29159j63645K00172q0623j21493J35800
237D9381j89419K46487p6723l7346N7689k10561K33579q7175O1766K3774k01227
248a29775J74169j22943J40915J8994j48947J11773j69018J68009J0565o1791
258h049P9688j99321J44411k2261K6590P7500j88701J03434p8891P8693Q1451
269I4544j32374P9472j37175Q3552O4611n5456Q4324j65206O1240J5289M602J04128
$$ plain form
196 -124781 -74840 139599 -107516 191602 -109580 -52518 34314 -112877 224274 -86989
206 -86989 8587 -26450 -127930 182698 -79093 100578 -39128 -132215 105757 -91971 166340
217 166340 -31066 -89295 45913 -128590 168877 -23026 -2245 19616 -162116 127362
227 127362 -36934 79259 21510 -149989 79170 -84475 115697 35074 -86419 49381
237 49381 -140038 106449 29726 -7620 50069 -160492 73087 -14088 47678 71452 -129775
248 -129775 44394 -78549 62366 81360 -67587 44186 -124832 43177 53742 -8049
258 -8049 71639 -127682 16729 -5532 21058 98558 -90143 13291 -65600 13093 94544
269 94544 -37830 41642 -95533 -11981 52630 -2826 81498 -83708 -22468 -7179 -2577 101551
281A01551j45997M3554n2145K6111J10583r2297N1396j05000J5103Q2449l6347
292a039Q1303j17235k328K3975p213J08308q8004K30l7240j1918J05900m1355
304A3384K9611p0078l2575O7179q820O7997o1632m1179J0678p904Q7583k5421
316B8823k1953l2404l0626P1815R019J7075m0004n1374K7948J7327N0266j3833
328C2079m7875j7445k587N4345K2326j7953l6844l1093K5121M1109J8879k1030
340A9032m2904j8626L1046L6086J5218k6662m8223L447J9704M5252O578m5421
352e473j7524k1082N0130L1263j4503j3504o0391L1591K6326K2296J3694p3985
364c1162R340r175M1627M3178n5663N423n5613L5952N0325k0532K7143q6494J8157
$$ plain form
281 101551 -44446 -892 -53037 -26926 83657 -8640 42756 -62244 -47141 35308 -1039
292 -1039 80264 -36971 -39299 -15324 -22537 85771 -2233 -2003 -39243 -51161 54739 13384
304 13384 42995 -27083 -59658 7521 -1299 66698 5066 -36113 -25435 -33339 54244 28823
316 28823 6870 -25534 -56160 15655 24674 41749 1745 -49629 -21681 -4354 45912 32079
328 32079 -15796 -33241 -35828 18517 40843 22890 -13954 -45047 -19926 21183 40062 19032
340 19032 -23872 -42498 -11452 24634 39852 13190 -35033 -31586 -11882 33370 39948 -5473
352 -5473 -22997 -44079 6051 37314 22811 9307 -51084 -19493 6833 29129 42823 -31162
364 -31162 -21822 -30997 10630 53808 -1855 3568 -52045 -16093 34232 13700 40843 -45651 -27494
377b7494K4459P400O0921q6912J0774k3301J3095Q1957o2925K8418o8156J441
389d0323P1748l5550O6270q9316p448L1680k4467J02514q3336N922j8869l2737
401e3912J13897o5446M5208n6131m5154R1772n6241R4426o8711l9985M7700o5755
413e8332J28844o4011o045M498q5257J31805o1003M8444k0429r3871J05573p4462
425d4246J00950k6666p4478O8679j02976J29787k9442k6239M1398j29461J28337
436C5643m6030L3827L0834j33031J08382q2137Q2231K7382j03927Q9499j26591
447h3918J05369J3145n1145Q3604j57520J07329k3927L817Q7108j57403J03648
458C0107p9737M2934Q4125j26302J08440j34137O3077N7395q0798J24623j64420
$$ plain form
377 -27494 -3035 4365 65286 -21626 -10852 -34153 -21058 60899 -2026 26392 -41764 -40323
389 -40323 31425 -4125 62145 -27171 -34619 -2939 -27406 75108 -8228 -2306 -21175 -53912
401 -53912 59985 -5461 39747 -16384 -61538 30234 -26007 68419 -292 -40277 7423 -58332
413 -58332 70512 6501 456 4954 -80303 51502 -9501 38943 18514 -75357 30216 -44246
425 -44246 56704 30038 -44440 24239 -78737 51050 21608 -4631 36767 -92694 35643
436 35643 -10387 23440 54274 -78757 29625 -52512 29719 57101 -46826 42673 -83918
447 -83918 21451 34596 -16549 67055 -90465 16864 -7063 -3246 83862 -73541 30107
458 30107 -49630 -6696 77429 -48873 59567 -74570 -11493 45902 -34896 89727 -74693
469g4693P3395L144l9331J40381j63102Q8119o2226j1121J34665j39546J16942
480F6627j14892N416R6427j08690J53331j42732K3357L6838q4100J74411j46812
491d0819N9272k3817p2131J63794j35141J11732p2278o1009J26533j23795J58171
502I0512j01402k8323P5723j26777J80076j10014K9109K1189j33292J77404j15270
513d1065Q9932k1670j15909J51853j38119J38824m1815o9607J06629j67313J72587
524F4327n8400j2525O5469j72938J78523r6996M8674M7623j51985J52285j44360
535h0303J09643L0329j16799J25547j72411J42853j3705o0590J22241j84079J37658
546D0384o7786J2145J15083j83927J32537j10109O0498P8296j48273J51654j53403
$$ plain form
469 -74693 -1298 1846 -37485 102896 -60206 27913 -34313 -45434 89231 -50315 66627
480 66627 -48265 -42849 53578 -55112 98219 -44513 -21156 15682 -68418 105993 -40819
491 -40819 18453 -5364 -77495 86299 -48842 62890 -9388 -70397 56136 -67659 90512
502 90512 -10890 -39213 36510 -90267 89809 -20205 8904 30093 -103199 74205 -41065
513 -41065 48867 27197 -88712 63141 -74978 63846 22031 -47576 59053 -108260 64327
524 64327 5927 -6598 58871 -114067 64456 -32540 16134 63757 -88228 64057 -80303
535 -80303 29340 59669 -57130 68417 -103994 38859 25154 -35436 86805 -97274 40384
546 40384 -27402 -15257 99826 -84101 48436 -61673 -1175 77121 -71152 80502 -72901
557g2901P0617L3294q1276J62067j92947Q7022q815l5146J43906j86804J28620
568D7637p3575k2143J24621j40037J55984j45354P402R9982j13022J61153j66149
579f3501O1320L0672j10297J77754j45394R5486n5590p9703J82665j46504J19400
590F6308r0740k9159J25290j61075J71150r2714k948M5201j39113K08200j21491
601b1091K8834J1752j06042J73853j53336J06053l599j01867J17116j44355J69397
612G6715n2725p5865J01345j37993J61183r5136J1307Q4902j66410J38565r6314
623e0426Q6223K8199j58450J51263j17842R7552j0963p9995J43518j79752J09342
634A8669j2871j3874R3877j95054J49849n3489M077P2559j40683J53560j37366
$$ plain form
557 -72901 -2284 31010 -50266 111801 -81146 5876 -2939 -38085 105821 -80983 47637
568 47637 -25938 -48081 76540 -63497 92487 -52867 -45465 54517 -58505 102648 -63501
579 -63501 -2181 28491 -81806 95948 -49446 46040 -9550 -89253 93412 -53092 66308
590 66308 -24432 -53591 71699 -89376 81774 -10940 -13888 31313 -107800 100400 -21091
601 -21091 7743 19495 -86547 87306 -66030 40023 36424 -65443 51673 -92682 76715
612 76715 23990 -51875 49470 -88523 72660 -22476 -11169 73733 -92677 45888 -50426
623 -50426 35797 63996 -94454 56809 -61033 36519 25556 -54439 89079 -90673 18669
634 18669 5798 -8076 85801 -109253 40596 -12893 -8816 63743 -76940 76620 -60746
645f0746L9930Q0661r9838J19966j72171R8111L5648q8433J24372j47918J09589
656C9171n3299m2947J50601j40856R2943r7018J9444J14944j45941J24002r9925
667c8881L0540L8103j03849J71070j27616K6283l00n1342J54347j52758P7894
678B3491k1033n0762J04895j23281J40289p4650n1339Q5272r1655J45267j14463
689b7969O819O0038j08372J30701r9935P1621l158j14933J36836r1280R2451m6454
701F365o6097J19238j25138J08782m1747j3212O1645j42765J39748n0011J1926
712H734K5969j13454J35911r5196M8394K8894q3571R3935j23127R7385J2693o5796
724b9229P4154j17340J07782l4586k2491Q2288j16142Q5970o7194L2972O8199
$$ plain form
645 -60746 -20816 59845 -39993 79973 -92198 5913 41561 -46872 77500 -70418 39171
656 39171 -14128 -57075 93526 -47330 45613 -51405 -31961 82983 -62958 61044 -38881
667 -38881 -8341 29762 -74087 96983 -30633 -4350 -4650 -55992 98355 -54403 23491
678 23491 2458 -48304 56591 -66690 73599 -1051 -52390 32882 -58773 86494 -27969
689 -27969 -21150 38888 -69484 61217 -38718 32903 29745 -85188 51648 -39632 52819 6365
701 6365 -59732 59506 -65632 43150 1403 -11809 49836 -92929 46819 -3192 8734
712 8734 34703 -78751 57160 -38036 10358 39252 -44319 49616 -73511 23874 36567 -29229
724 -29229 44925 -72415 35367 781 -21710 60578 -55564 30406 -36788 -3816 64383
735F4383j14191Q5254q2439N2723L0332p7876J02376j07784M8973J877k9037R8692
747G3283j24404O3141k4716q137P8952j03989Q7463o6514k028O3403p0483R5841
759F1812r7600J8293L7763n5833R6414r4407M3741p651m8448R8280p8666N9914
771C3612m5123l0501Q2927p3680P7087n5460j0554M4953p0789R6012n5540O971
783h5R897o1491R5947o0116L3487p625n2532P3341o3960O4438j8015m0587M7967
796B0666o5914P9583k8390j4344L0628p0354P4756l6963J9982J7577o9298O2381
808B0310m7450M4756P106n1791N0366o2731N4028j230k2763M0066p3237N3292
820A0722j4126L978L3812o8440M7727l4292K1018K9949n0132M2141n3182K8087
$$ plain form
735 64383 -49808 35446 -46993 5730 36062 -41814 60562 -47222 1751 3628 -25409 73283
747 73283 -51121 12020 -12696 -20833 58119 -45870 41593 -24921 -26949 36454 -34029 61812
759 61812 -35788 -17495 20268 -35565 60849 -33558 10183 2532 -45916 52364 -26302 33612
771 33612 -11511 -42012 40915 -32765 44322 -11138 -21692 23261 -47528 48484 -7056 -85
783 -85 9812 -51679 44268 -15848 17639 10014 -42518 30823 -33137 31301 13286 -27301 20666
796 20666 -45248 34335 5945 -8399 22229 -48125 26631 -10332 9650 27227 -42071 20310
808 20310 -27140 17616 24722 -27069 23297 -39434 14594 13364 -9399 30667 -42570 10722
820 10722 -3404 574 34386 -34054 13673 -20619 399 30348 -19784 22357 -30825 -2738
832b738K0429k7723M1506o0716K7747J597q986M4084n5051K6410k0597J548M1751
845B9261m0882L0473l7095L958K9493k5325L9133m2755M570R716j5236M5113l7630
858g206J0225j0335j2696M2124k7379K1844k3072j3067K9046j9541L4019k5032
870a070r629J0867j8176L9530j9324N90m237k0886L4471j3254J4706j0363k1697
883a8472K1137j2363K5804p855j5849O784j6777K7838k466l652j247k1757K0268
896A393p59R550q32k1423Q403n205J6665M387j3475l20j2708J4317Q040j258j540
911E235j7177N319N680Q379L473j4125l804j758R943R281m567p200q717L358J0319
926C639N706l598r505o377N288J0168L136k745j2695j865O087P165P548j2198
$$ plain form
832 -2738 17691 -10032 31474 -29242 -1495 102 -8884 35200 -19851 6559 -14038 -12490 29261
845 29261 -11621 18852 -18243 -14285 15208 -10117 29016 -13739 -9169 547 -14689 30424 -7206
858 -7206 3019 -7316 -20012 22112 -5267 16577 -6495 -19562 9484 -10057 23962 -1070
870 -1070 -10699 168 -18008 21522 2198 2788 -1449 -22335 12136 -1118 13588 3225 -18472
883 -18472 2665 -9698 16106 8251 -7598 -814 -17591 10247 7781 4129 2882 -18875 1393
896 1393 634 10184 9352 -12071 -3668 -8873 7792 12179 -1296 -1616 -14324 -7 8033 6775 5235
911 5235 -11942 -6623 -943 7436 10909 -3216 -7020 -8778 1165 10446 5879 -1321 -10038 -6680 3639
926 3639 9345 5747 -3758 -10135 -4847 5321 8457 5712 -6983 -8848 -2761 4404 11952 -246
940b46m915l653N147J4716o619n22j2843q10J4017j350R536j6254n231N848r71
955d150J9368j3617l005m715n759K3120r114O396j1782j1207J8683p953J8639
968A4904j2899j1575R191j2267K7388j0618l976L59j9251K8579j0100R373l814
981E294k3148K2989j4809K2463l842j9368J5292k3828K9835m091p692J0279l2148
994b2774K9897q888P136R346l4075K5765j9332J9136R521k7327K2370l1805K4798
1007C768O048j4440K2520m0411K5355l987r55K4837m1011K5130j8869Q432K4722
1020B1139l3738K7967l3420J3029J7822k2766L4057m2209J6021L686j2998L9258
1032B7848m3076K1791j3837o954L8473l7946L1750k9121k710K9284l1478M2833
$$ plain form
940 -246 -5161 -8814 -3667 11049 4430 3908 -8935 -9745 4272 2922 12458 -3796 -9027 -3179 -4150
955 -4150 15218 1601 -1404 -6119 -11878 11242 2128 8524 -3258 -14465 4218 -3735 14904
968 14904 2005 -9570 -379 -12646 14742 4124 148 507 -18744 9835 -265 9108 5294
981 5294 -17854 5135 -9674 12789 8947 -10421 4871 -18957 10878 6787 -905 9374 -22774
994 -22774 7123 -1765 5371 14717 -19358 6407 -12925 6211 15732 -11595 10775 -21030 3768
1007 3768 9816 -4624 17896 -22515 2840 -1147 -2102 22735 -18276 6854 -12015 -3583 21139
1020 21139 -12599 15368 -18052 -5023 12799 -9967 24090 -18119 -2098 1588 -11410 27848
1032 27848 -15228 6563 -7274 -14228 24245 -13701 18049 -11072 -13782 15502 -15976 26857
1044B6857l7907M091J3426k7352M9832l9798J5850m230k4925M8947l8637L0778
1056A6932j7927k0243L9312l8863M4795k5277j0323K4139m0675N3359k9329M724
1068F24R851m0856N2864l4704K2939L68l6558M4244m1725L9699o958k6028L4097
1081A7857m8214M8664j6218q019K6722n2534M8770k7117J3124J9535n0788M6361
1093A8143l9160K8543R989l8110M4835n2616L6253q33j8364M1230o1484M2086
1105A0512j4770j949L5331n7524M7517l4615R243K9660m4337M8840n2464K0974
1117c582J8833l2786M9147n7381L1594k834k2783N2352n3635L6755k5434q790
1129a8544M8838n1345M3895l6714L332L0342m6485N7650m2786R370Q902l4324
$$ plain form
1044 26857 -11050 -6959 6467 -20885 28947 -10851 4999 769 -24156 24791 -13846 16932
1056 16932 -995 -21238 18074 -20789 24006 -1271 -11594 12545 -28130 25229 -4100 624
1068 624 10475 -30381 22483 -12221 10718 11086 -25472 18772 -22953 16746 9788 -16240 17857
1081 17857 -30357 18307 2089 -5930 20792 -31742 17028 -10089 3035 22570 -28218 18143
1093 18143 -21017 7526 17515 -20595 24240 -28376 7877 7044 -11320 29910 -31574 10512
1105 10512 -4258 -6207 29124 -28400 19117 -15498 -6255 23405 -20932 27908 -24556 -3582
1117 -3582 15251 -17535 31612 -25769 5825 2991 -19792 32560 -21075 15680 -9754 -18544
1129 -18544 30294 -21051 22844 -13870 -10538 19804 -26681 30969 -11817 -2447 6455 -27869
1141b7869O3770n1537K1624m010k5479N2766n3798M4473j7224k3042L8717m6580
1153b8189N9398l5000r915L0107m5200N7681m3014J7122J4724n0518N5045m0894
1165a8653L6342p120m1105N5129m8384M1926j6460j6120M2054o2926N1341j7069
1177a045R72K1524n9900O1570l2227R892J6009m2312N3320n4552K9231J5857l3329
1190a4990L8605n8179M7825l707k5518M1042n1563M5060k9722r56M4594n4835
1202b2344L8860l7976K1419K5695n2425N1017m2427K1906K168k8598O0421n8610
1214b0894K3298o052q457M6703o3651M3845j8072r036L1559m4869N8164m3945
1226a1407l573K8809l2049N1185n4807K1135J4195l7493M8020m2749L6851j5895
$$ plain form
1141 -27869 35901 -15636 5988 1978 -23501 29265 -24533 19940 2716 -20326 18391 -28189
1153 -28189 31209 -3791 -13706 16401 -28799 28882 -14132 2990 17714 -32804 22241 -18653
1165 -18653 17689 10569 -30536 24593 -23791 18135 1675 -14445 27609 -35317 16024 -1045
1177 -1045 -73 21451 -38449 23121 -9106 786 16795 -25517 27803 -26749 2482 18339 -14990
1190 -14990 23615 -34564 13261 9554 -15964 25078 -26485 18575 -11147 -12103 32491 -22344
1202 -22344 16516 -21460 -41 25654 -26771 24246 -18181 3725 5893 -22705 37716 -20894
1214 -20894 2404 -3648 -12105 34598 -29053 14792 -3280 -12316 19243 -25626 32538 -11407
1226 -11407 -14980 13829 -18220 32965 -21842 -707 13488 -24005 24015 -18734 18117 2222
1238B222l1609N4133l9961L6104k9096q058M1536n1745M5233k3489M904J3356
1250A3530m8592O0866l0426Q140J899l1190N4075m8090K6703L404k5059L3116
1262A8376m9365M9863j0031k2033K7506m1069M9869l0557N89K8689m4734L8700
1274A5803l4912K6469J3474m5807M1257l5440L0862m980k4977M4730m8825K8882
1286F536r168k153L2057n5600L8851j5741L241J9808m0888M5201l5772P664J8734
1299A2770k5390L7732m7703K2208J0034k1999L3910m1418L0766j2070j5054L8068
1311B1854l5381K9109k7035K29L1503l6306L3537k8568Q893J2035l0592M3797
1323B3075l1641J1144k212j8394M2327l7580K1373q348j2778K9471l5112L5953
$$ plain form
1238 2222 -29387 24746 -15215 20889 -8207 -16265 25271 -26474 18759 -4730 174 13530
1250 13530 -35062 25804 -4622 3518 5417 -25773 28302 -19788 6915 10319 -14740 18376
1262 18376 -30989 18874 8843 -13190 14316 -26753 23116 -7441 -6852 21837 -22897 15803
1274 15803 -19109 7360 20834 -24973 16284 -19156 11706 6726 -18251 26479 -22346 6536
1286 6536 -2632 -4785 27272 -28328 10523 -5218 -1977 17831 -23057 22144 -13628 -5964 12770
1299 12770 -12620 25112 -22591 -383 9651 -12348 21562 -19856 10910 -1160 -16214 21854
1311 21854 -13527 15582 -11453 -11224 20279 -16027 17510 -11058 -2165 9870 -20722 23075
1323 23075 -8566 2578 366 -18028 24299 -13281 8092 -256 -13034 16437 -18675 17278
1335A7278j7439j0018J9629k8316L9974k6607J845J2695k7631L5336k7419J7404
1347F731J670k7176L1714k6108K5374q055j7691K6908l0287K8081j0904m461J7454
1360A3250l3641L0705j3667N044R514k9192K9785k1482J2739O470k0877K4102
1372A2750k8592K0125K152j2837J9699l0034K3087o854l611J8516k7989K1656
1384H068j5964N728J5371k3705K1144k2017J0922Q137j6088K2623k5557J2468
1396A130k94p670K2338k5607J4549q308k399J8884k1294J8046j5263K63J3184
1409G559j5469K0723j8854L192N774j1550K1489j8193P439k180r401J9696j5546
1422e321J2182p947p126J4778j3642J6448j0180l567P957j2964J8527j0246J623
$$ plain form
1335 17278 -161 -10179 9450 -18866 21108 -5499 -3654 9041 -18590 16746 -10673 6731
1347 6731 8401 -18775 12939 -13169 12205 4150 -13541 13367 -16920 11161 257 -4204 13250
1360 13250 -20391 10314 -3353 1691 11205 -17987 11798 -9684 3055 9525 -11352 12750
1372 12750 -15842 4283 6435 -6402 13297 -16737 6350 -504 -4115 14401 -13588 8068
1384 8068 -7896 -2168 13203 -10502 10642 -11375 -453 7684 -8404 14219 -11338 1130
1396 1130 836 -6834 15504 -10103 4446 -3862 -6261 12623 -8671 9375 -5888 -5625 7559
1409 7559 -7910 12813 -6041 -2849 2925 -8625 12864 -5329 2110 -70 -9471 10225 -5321
1422 -5321 6861 -1086 -8212 6566 -7076 9372 -808 -4375 3582 -9382 9145 -1101 522
1435E22J851j2473J7067j0138P617j770j0858J2742j0895J2399l289p025P791
1448C541j2288J4000l986j333M168j3004J2374n302M300K513j1505R051p662P777
1462B644J956p508O107j0141Q257J041k447M795j0959O525j286J685M915r250
1476c666M344m475L513M908n551L426p017K969L450j629M069p343J306M97Q42
1491c57N056n314M28k652R91M863k050J138m372m62K943N95K645l677j766J2J263
1508g16L486r97j717k271nK675J826m48k398j758L37L177Q38l00k623k088K490
1525d92P83K783k091k959O91r90N017r28j555p36l541N323n94J555r82n222M152
1542B14k022M650l00m720K682m836O371J13k080K059p484O363j100J425K501q368
$$ plain form
1435 522 2373 -10100 6967 -3171 4446 2676 -8182 4560 -6335 6064 2775 -4250 3541
1448 3541 -8747 5253 1267 -66 4102 -8902 3472 -1830 2470 4983 -6522 2529 -5133 2644
1462 2644 4600 -2908 3199 -6942 1315 2356 -91 4704 -6255 270 -1016 669 5584 -3666
1476 -3666 678 -3797 -284 4624 -927 2499 -4518 -1549 1901 272 4341 -3002 -1696 -1199 -357
1491 -357 4699 -615 -187 -2839 -1848 3015 965 2103 -2269 -2731 212 807 3452 -225 -1991 -1979 -716
1508 -716 2770 1773 56 -2215 -2220 455 2281 1833 -565 -2323 -1986 1191 2029 1729 -894 -2982 -492
1525 -492 291 3074 983 -1976 -1285 -2275 2742 1814 259 -477 -4018 1305 711 2266 1284 -3938 214
1542 214 -1808 2842 2542 -2178 504 -4332 2039 2152 72 2131 -5353 1010 -90 1335 3836 -4532
1558d532N566m125M325L012o937N244p815N747K242l875N887j0444O073n67n85
1573g84O991j0864O359m810J760P186r215P617q911K935N369o601R706j1440L910
1588g92J474m254J1375j1851N759l318k856J1365j0798Q817p507j698Q919r491
1602d856J2304j0080L12M595q699J4623j1077L936k06q170J4587j1468Q795m207
1616C89o895J2077j2065J3401o921l790Q143j2962J6120q901J250M137j3380J6268
1630F871j0902P090Q24j2119J4536j3406J1931j853q394J1976j6090J4749m530
1643F83k845R304j7467J5823q171K782P047j6170J5539j2919P560M824j2585J4613
1657H018j7086J1198J064p853J3975j8884J3382m820k572J3433j8429J4554j0984
$$ plain form
1558 -4532 1034 -3091 1234 4246 -2691 2553 -5262 485 2727 -1148 4739 -5705 368 -199 -784
1573 -784 6207 -4657 1702 -3108 -1348 5838 -3377 4240 -4671 -1736 3633 -2968 6738 -4702 -792
1588 -792 682 -3572 7803 -4048 1711 -1607 -4463 6902 -3896 4921 -2586 -4284 4635 -4856
1602 -4856 7448 -2632 -2320 2275 -6424 8199 -2878 1058 852 -7318 7269 -4199 4596 389
1616 389 -6506 5571 -6494 6907 -14 -3804 4339 -8623 7497 -1404 -154 3983 -9397 6871
1630 6871 -4031 3059 3883 -8236 6300 -7106 4825 2972 -5422 6554 -9536 5213 683
1643 683 -2162 7142 -10325 5498 -2673 109 7156 -9014 6525 -6394 1166 5990 -6595 8018
1657 8018 -9068 2130 3194 -4659 9316 -9568 3814 -1006 -3578 9855 -8574 5980 -5004
1670e004K629J0944j6325J6240j5444O308N565j2282J8418j8511Q870o98p265
1683f555J8293j9880J2699o378l768J5035j8175J7489j2149j193J0802j4855J9990
1696A1355j6644L603N916j3229J9761j7399R992j006j2105J9110j6532J4390p496
1709b84p637J6703j7873J7262j0005j238J0304j9259K0921j1491L541L618j6395
1722a1833K2048j6113Q647R26j1823J7579k0214J6169j931q797J2815j9682K0610
1735H401q906l238J1875j8501J8666j4731O485R182j9068J7151j6044J2681J615
1748E568j4901J9317j8785J2665l891n234J7934k3564J4598n898O38J1600k1906
1761a1859J9996j1858J388Q287j4240K0492k0361O011P158j0689J6584k1418J3927
$$ plain form
1670 -5004 -2375 8569 -7756 8484 -6960 -652 4913 -7369 11049 -7462 1408 710 -6555
1683 -6555 11738 -8142 4557 -1821 -5589 9446 -8729 8760 -3389 -4582 6220 -8635 11355
1696 11355 -5289 -1686 4230 -8999 10762 -6637 3355 2349 -9756 9354 -7178 7212 -284
1709 -284 -7921 8782 -9091 8171 -1834 -3072 7232 -12027 8894 -2597 944 4562 -11833
1722 -11833 10215 -5898 2749 3675 -8148 9431 -10783 5386 3455 -5342 7473 -12209 8401
1735 8401 -505 -3743 8132 -10369 8297 -6434 51 9233 -9835 7316 -8728 3953 5568
1748 5568 -9333 9984 -8801 3864 -27 -5261 12673 -10891 3707 -2191 -1553 10047 -11859
1761 -11859 8137 -3721 -2333 5954 -8286 12206 -8155 -2144 5014 -5675 10909 -10509 3418
1774C418o47j0551J6982j6966J5930j1433m496J8135j7298J4958j4301M184J0417
1787H332j9072J9804j3236O229j67j3210K3967j7825P586k979o056J7961k1776
1800a0442J6163m338n730J0074j7350K2835j2084l586R141j3322J9381j7504O883
1813A21O901j5960J5541j4805J4743k186j4556J7642j4509J3685p764m286J5895
1826A0462k0498J4178o350K986P271k0799J9663r436L358L139j2626J9232j8343
1839g763P520M358p906J2659k0545J5616q88p553J1456j5785J6525j1068j389
1852d763J3631j4988J2864j4459P421Q245j5871J4977j3204Q905j016r816J8786
1865A0712j6230P705m317k147J4920j9014J2576n582j188Q299j4487J7898j1514
$$ plain form
1774 3418 2771 -7780 9202 -7764 8166 -3267 -7763 10372 -6926 8032 -6269 -2085 8332
1787 8332 -10740 9064 -4172 2057 1890 -11320 12647 -5178 2408 -571 -6627 11334 -10442
1800 -10442 5721 1383 -4347 5727 -11623 11212 -872 -4458 4683 -8639 10742 -6762 121
1813 121 7022 -8938 6603 -8202 6541 4355 -10201 7441 -7068 6617 -1147 -5433 10462
1826 10462 -10036 4142 -2208 778 8049 -12750 6913 -2523 835 3974 -8652 10580 -7763
1839 -7763 -243 4115 -3791 8868 -11677 3939 3051 -4502 6954 -8831 7694 -3374 -4763
1852 -4763 8868 -6120 6744 -7715 -294 7951 -7920 7057 -6147 2758 1742 -8074 10712
1865 10712 -5518 2187 -2130 -4277 10643 -8371 4205 -1377 -2565 5734 -8753 9145 -2369
1878b369r37O416r273J6225j5909N453L936r743J3256j3534J1515l454r142J3732
1892F172j1523J2071q618k813J1456j3882J2839q220K708M433j3970J5861r046
1905b532M617j68r353J4991j3090Q100p94n701R913j4438J3045l263l751O889
1919D465j2331J3862q017P73O367j1259J1274j0303O394L689j0449J0395j0643
1932e783Q437n88o405J0692j2139Q176l151j287Q798j2968R282n252J302N871
1946D985j0452J0615q695K648L868o809J0148j1159N083J149m654R168j0628P220
1960B487l104k763Q495r046Q129o556j02O383p923R017p756K141K603o471R837
1975E371p970L776q25m549R112q016N785k916k944O707p482P847m314j408M081
$$ plain form
1878 -2369 -3306 3110 -6163 10062 -5847 -394 3542 -6201 7055 -6479 5036 1582 -7560 6172
1892 6172 -5351 6720 -1898 -4711 6745 -7137 5702 -2518 190 4623 -9347 6514 -2532
1905 -2532 2085 1917 -7436 7555 -5535 2565 1771 -3930 5983 -8455 4590 1327 -2424 4465
1919 4465 -7866 5996 -2021 -1248 5119 -6140 5134 -5169 1225 4914 -5535 4860 -5783
1932 -5783 2654 2066 -4339 6353 -5786 2390 -761 -2048 6750 -6218 3064 -2188 -886 4985
1946 4985 -5467 5148 -3547 -899 2969 -3840 6308 -4851 232 1381 -3273 5895 -4733 2487
1960 2487 -617 -3380 5115 -3931 4198 -2358 -2460 3923 -4000 5017 -2739 -598 2005 -4466 5371
1975 5371 -2599 1177 352 -4197 4915 -3101 2684 -232 -3176 3531 -3951 3896 -418 -1826 2255
1990B255o663Q583n258R46J900o113P877n600L561P7n239O451n868N431j268l380
2006b308M832o406O252k163q70L185o527O144l188J495J998n689N360m466L207
2021H56J101l937M323n492M048qj844L646n763M026j487J36L160n116L653k963
2037a661J344K471l647L451m044J746J387k043L520m342J753o0q18L437l734J915
2053F75j541k54K943k599K290k485p8J875j626K762k582J17M62j100K924k009
2069b26N75p28r86K419j276J303j242r62J327q15J919j086o45J77p91J931n21
2086C73j8n05r80J275m1O97m98r99K91L4J028l0n92n14j86O80N53L8o93m30j36
2107f53Q52M66k98k89j004P02L81L75K04j453M63l37Q75P23j288M93j311R86Q00
$$ plain form
1990 2255 -4408 4175 -1083 -137 1763 -4350 3527 -2073 1488 1565 -3674 2777 -3091 2340 1072 -2308
2006 -2308 2524 -3882 2370 207 -663 2522 -4005 2139 -1049 446 2444 -3245 2115 -2351 856
2021 856 1957 -1980 2343 -3149 899 891 -953 2693 -3070 956 -531 -395 2765 -2351 1302 -1661
2037 -1661 -317 2154 -1493 1958 -2086 -340 1047 -996 2524 -1818 -65 -125 -943 2494 -1240 675
2053 675 -866 -1120 1823 -776 1514 -971 -1049 826 -800 1962 -620 -503 -41 -1141 1783 -226
2069 -226 349 -379 -1365 1054 -222 1081 -161 -1123 204 -611 1308 222 -423 -246 -1037 894 373
2086 373 355 -150 -1130 145 104 801 303 -696 -405 -371 657 627 35 -479 -665 15 568 606 -87 -517 -653
2107 -653 199 665 367 78 -926 -224 157 532 736 -717 -254 -591 284 1007 -281 212 -1099 -113 687
2126F87o62R05k088R07K25l5J499k300R71q29L27J835j983J421j942M60J491j431
2144e42K173k661O22N60j034K880k834J135o94q35K997k619K069j817o61K465
2160A204k414L166k487k35J396k403L949k794P92J52k466M077k957K162q63k230
2176a951L513l313L540j581j440K521l760M467k151o0J524m064M647k863J650
2191F79O51l797M317l858L211r8k807L673m791M262j076j195L084n337M673k357
2207g66N83K546n139M712l818K115J750m197M714n125L144N30k725M778n991L830
2223I41j054j173M528o036M524k864P6L788n293N338m656J184K536m209N840n792
2239b322K470O82l233N954o009L900j637k189N596n782N117l574o70M267n600
$$ plain form
2126 687 25 930 -1158 -251 -26 -61 1438 -862 109 -720 -393 1442 -541 880 -1062 -602 889 -542
2144 -542 1631 -1030 -408 152 -882 1998 -836 299 -395 -1230 1767 -852 1217 -600 -1261 1204
2160 1204 -1210 1956 -531 -766 630 -1773 2176 -618 174 326 -2140 1937 -1020 1142 279 -1951
2176 -1951 1562 -1751 1789 208 -1232 1289 -2471 1996 -155 -215 1309 -2755 1892 -971 679
2191 679 1330 -2467 1850 -2008 1203 1105 -1702 1971 -2820 1442 366 -829 2255 -3082 1591 -766
2207 -766 -183 2363 -2776 1936 -1882 233 1983 -2214 2500 -2625 519 1049 -1676 3102 -2889 941
2223 941 -113 -1286 3242 -2794 1730 -1134 -1058 2730 -2563 2775 -1881 -697 1839 -2370 3470 -2322
2239 -2322 148 830 -2403 3551 -2458 1442 -195 -2384 3212 -2570 2547 -1027 -1697 2570 -3030
2254c030O264m614R03K057n054P105n371K468j0l928O768o163M387j391k777N269
2270B883o423O372k821j542L795o040P154m488O49K738n893O672n424L367J084
2285B083n562O323n869M946r95l636O121o989N482k211p85M654p838O488l273
2300a061R84K767o677P399n664K219J912m492O571p749M455P02l302N480p564
2315d020O286k368k041N626o554O137n266Q62M963o674O100n785L077J825n931
2330c763P695o172L246j023l077P952p843M238j771j157N406p928P195l294j229
2345a525L423n623Q378o371M98L065m731O813p186M369Q32n473O341n763O126
2360C173l054l586O947o367N671m217M31M658q127O943l581K070Q17o625Q735
$$ plain form
2254 -3030 3234 -1380 -477 1580 -3474 3631 -1740 728 718 -3210 3558 -2605 1782 391 -2386 2883
2270 2883 -3540 2832 11 -1531 2264 -3776 3378 -1110 -461 2277 -3616 3056 -2368 999 2083
2285 2083 -3479 2844 -3025 1921 926 -2710 3411 -3578 1904 -307 -1092 3562 -4276 2212 -1061
2300 -1061 -77 2690 -3987 3412 -2252 -33 1879 -2613 3958 -3791 664 1366 -1936 3544 -4020
2315 -4020 2266 -102 -2143 3483 -3071 3066 -2200 -1338 3625 -3049 3051 -2734 343 2168 -3763
2330 -3763 3932 -2240 1006 -17 -3094 4858 -2985 1253 -518 -1675 3731 -4197 2998 -296 -1525
2345 -1525 1898 -3725 4653 -1718 -1220 1845 -2886 3927 -3259 1110 1942 -3531 2810 -2953 3173
2360 3173 119 -3467 3480 -2887 2784 -1433 -1002 3656 -4471 2472 -1109 961 1778 -4847 3888
2375C888n592K372J5l368O998q441N183K37k576M042p666P994k714k179M202n690
2391c295O917o107J518M536o357N265n932M797J228o288O787n542M221j972k514
2406b738P522p833M027k074M99M534q340O812l085J25K236n209Q095o664J003
2421a090K385l170N958p901M656N82l861N116n779O246l642k488O015n205N225
2436C047n275J233M185o602N961m192K694J58n361P840n086K449j247k325O534
2451D013p201M534r36j559L491o459P167k917j389K757m589O635n415J412K708
2466B252m836M957n270M430K49m745N215m746M626k200j973N263o076M347k493
2481a000Q24L053o503N601l075J460J135m397O068n249K180Q47k434M594o310
$$ plain form
2375 3888 -1704 668 683 -2685 4313 -4128 1055 1292 -1284 2758 -4908 3086 372 -1807 2395 -3295
2391 -3295 3622 -2485 -967 3569 -2788 2477 -3455 1342 2570 -3718 3069 -2473 1748 -224 -2738
2406 -2738 4784 -3049 978 -1096 -597 3937 -4403 2409 -676 -551 1685 -3524 4571 -2093 -1090
2421 -1090 1295 -1875 4083 -3818 838 1420 -2441 2675 -3104 3142 -500 -2988 3027 -2178 3047
2436 3047 -2228 -995 3190 -3412 2549 -1643 1051 1209 -4152 3688 -1398 1051 -196 -2521 4013
2451 4013 -3188 1346 410 -1149 2342 -4117 3050 133 -1256 1501 -3088 3547 -1868 -456 2252
2466 2252 -2584 2373 -2897 1533 1782 -2963 2252 -2494 2132 -68 -2041 3222 -2854 1493 -1000
2481 -1000 -176 2877 -3626 1975 -1100 360 1495 -2902 3166 -2083 97 944 -1490 3104 -3206
2496c206M113k58j902L652n223M939k784p40L774m400M368m229J353K683m351
2511b211M520m194K375L88l252N238m521K512j110j463M597m997L479j801o02
2526a042K976m381M762k947p4J828l272M821l959J312Q42k824M151l949K923o98
2542D69k316L618l630L594j913r99K800l735L830k333M42J484l632M026k663J440
2558D82L88k810L681l257K309k04j818K840l607L032q31q59K118l452L209j691
2574d70K40J649l080K952k392J219J038k469K725k848J796K26j536K540l085K033
2590E38o31n24K179k932K208j452J95J633k358K350k122O88R49j668K377k414
2606i84J061J17j037K227k276J419p24n65J900j953J707j289j57J272j565J948
$$ plain form
2496 -3206 907 649 -1253 2399 -2824 2115 -669 -1409 2365 -2035 2333 -1896 -543 2140 -2211
2511 -2211 2309 -1885 490 878 -2374 2864 -1657 855 -255 -1718 2879 -2118 1361 -440 -1042
2526 -1042 1934 -2447 2315 -632 -706 1122 -2150 2671 -1288 24 866 -1958 2193 -1756 1167 469
2542 469 -1847 1771 -1859 1735 -178 -1177 1623 -2112 1718 -615 -173 1311 -2321 1705 -958 482
2558 482 870 -1940 1741 -1516 793 589 -1229 1611 -1996 1036 205 -654 1464 -1988 1221 -470
2574 -470 -230 1419 -1661 1291 -1101 118 1156 -1313 1412 -1436 360 586 -950 1590 -1495 538
2590 538 -93 -617 1562 -1370 838 -614 -419 1214 -1144 1206 -916 -228 721 -947 1430 -984
2606 -984 77 194 -843 1384 -892 527 -197 -762 1138 -815 892 -397 -554 718 -847 1101
2622A101j494J84N20j221J982j504O50j10j004J720j357J076n03p34J226j235
2638g03J388o62l76O91j158J437o99J27K33j068J227p24N94k0q61Q71p70Q27j11
2657B43m57M72q60Q43j35m4K33q14O44k85L17J98o37L31l81M21J70k77J17m40
2677c41K90J37L2P8m09P1lK59R5j66j56j16J71J56J51k78r3n0R4L68k54P0k86
2700a80m0M00j91L42m80l7J99j97O55n66R9r7k65P93n55L94l61l29P09n99P95
2721D89n39k44M74p15J112o73Q5J63q21J207p81N25j01q21J084r62J010l33o00
2740d41R07j250J346n21j85O64j443J493q36L78M68j415J451j218Q58K35j143
2757f52J380j648J254r8o52J283j916J527o15r9J177j960J692j234M47R30j685
$$ plain form
2622 1101 -393 -209 311 -910 1072 -432 218 108 -896 824 -533 543 40 -694 532 -703
2638 -703 685 23 -353 338 -820 617 -82 45 278 -790 437 -287 307 287 -574 297 -473 354 243
2657 243 -214 258 -602 241 106 62 295 -519 125 -160 157 355 -282 49 -332 89 259 -18 99 -341
2677 -341 -51 86 118 196 -213 -142 -145 114 209 43 -113 -229 -58 98 249 -29 -122 -172 -78 290 36 106 -180
2700 -180 -220 180 -11 331 -149 -186 13 -184 471 -95 4 -93 -358 435 -120 274 -87 -416 293 -306 489
2721 489 -50 -294 180 -535 577 -96 -11 152 -669 538 -243 282 181 -640 444 -518 492 159 -441
2740 -441 466 -784 562 41 -144 520 -923 570 -266 112 580 -835 616 -602 256 491 -652
2757 -652 728 -920 334 236 -416 867 -1049 478 -137 -236 941 -1019 673 -561 -114 816 -869
2774h69J790j777Q84M74j249J927k180J290k04p59J940k280J677r74k41J692k152
2791a011K009j584K25J200j880K356k074P40M59j556K569k348J298k92j151K383
2807A343k461J985r96o73J912k422K581j639q3J292k280K864k147Q20N66k110
2823a448K816k422J700k59j643K577k650K334r71q38K072k876K771j494J22J326
2839A117k867L079k089R44O54k328L004k812J743J24j627K585l256K527n87r90
2855g79K197l157K933j644r3J987k995K895k446J035J321k736K985k813J717J82
2871E89j977L259l272K051p47q45K896l645K677j373j32J952l239L513k418L15
2887c96J243k331L533l390J382O26j953L032l391K612p11j672K938k973K951k052
$$ plain form
2774 -869 921 -856 28 502 -747 1180 -1000 290 86 -673 1267 -1013 664 -310 -551 1141 -1011
2791 -1011 998 -586 -361 839 -1041 1315 -759 -19 440 -1116 1453 -895 403 111 -1040 1343
2807 1343 -1118 867 -129 -802 1110 -1312 1269 -370 -453 839 -1441 1423 -724 96 662 -1448
2823 -1448 1368 -1054 646 387 -1256 1321 -1329 1005 34 -804 1268 -1608 1163 -331 -209 1117
2839 1117 -1750 1329 -760 184 838 -1490 1514 -1298 445 569 -1058 1527 -1729 798 211 -779
2855 -779 1418 -1739 1194 -450 -543 1444 -1551 1344 -1102 -67 1254 -1482 1503 -1310 407 589
2871 589 -1388 1871 -1401 650 -97 -942 1954 -1691 986 -387 -519 1433 -1806 1707 -711 -396
2887 -396 847 -1484 2049 -1341 41 667 -1286 1746 -1645 967 256 -1416 1522 -1451 1500 -552
2903e52m81K636l199L052k375Q86J255l301L722k472J335o9k274L913l353J832
2919E55l68j192K821l920L247q67r55J837l225L940k358j46J816k721L272l258
2935a522J729J154k960K916k956K748n72k215L395l137K444j575k18K876m073
2950a966K853j517P63J241l602L952k440O97N65j926L685l975J693N83j367K492
2966A731l878L272q07j458K455k812L281k664j31K692k974K714k852J583J198
2981A350l279L440k484J723o59j922M018l338J698q93m27K734m026L141j079l80
2997c83J279k944M143k600k4J221j965L261l569J843P37k280K495k852L037j082
3013C17j840K888k615K637k100L5K423l448K673j743J139P21l191L591k192J089
$$ plain form
2903 -552 -1033 1603 -1596 1456 -919 -33 1222 -2079 1643 -829 506 437 -1837 2076 -1277 555
2919 555 187 -1005 1816 -2104 1143 276 -679 1158 -2067 1873 -485 -631 1185 -1536 1736 -1522
2935 -1522 207 1361 -1599 1317 -1639 1109 537 -1678 1717 -1420 1024 -551 -769 2107 -1966
2950 -1966 887 -630 133 1374 -2228 1724 -716 -19 546 -1380 2305 -1670 23 606 -761 1731
2966 1731 -2147 1125 318 -1140 1315 -1497 1784 -880 -1011 1681 -1293 1421 -1431 152 1350
2981 1350 -1929 1511 -973 750 91 -1831 2187 -1151 547 -346 -773 1961 -2065 1076 -3 -383
2997 -383 896 -2048 2095 -505 -529 692 -1273 1988 -1581 262 999 -1281 1214 -1638 1399 317
3013 317 -1523 1365 -1250 1387 -713 -678 1745 -1703 970 -773 366 1087 -2104 1487 -705 384
3029C84r5j670L361l497J811N4r23K074l569L128q49q79J703k600L198k416K31
3046e54J851k389K425k763J717P86k459K644k438J991p19j340K985k869J824j205
3062e13J5K116l209K556j403K89R53k364L189k347N44N92j420K661k960J594J04
3079C97j298K112k541K384j077r25K035k181K348j867J36J586k363K375j849R57
3095B29M43k111K703k004J226l16j240K430k470J701n73n72J586k462K384j086
3111a32j84J029j997K430j760N47P39j688K033j992J365J36j407J836j999J693
3127F49n91o57J621k065J717r90J05J159k002J839j302N50N80j525J887j711Q69
3144A33K02r89J664j930J252k56n87J398j771J476q29j59J149j532J535j249L18
$$ plain form
3029 384 289 -1381 1980 -1517 294 348 -575 1499 -2070 1058 209 -670 1033 -1567 1631 -785 -554
3046 -554 1297 -1092 1333 -1430 287 1073 -1386 1258 -1180 811 92 -1248 1737 -1132 692 -513
3062 -513 -498 1618 -1591 965 -438 -149 804 -1560 1629 -718 -174 418 -1002 1659 -1301 293 397
3079 397 -901 1211 -1330 1054 -23 -948 1087 -1094 1254 -613 -477 1109 -1254 1121 -728 229
3095 229 672 -1439 1264 -740 486 170 -1070 1360 -1110 591 18 -554 1032 -1430 954 -132
3111 -132 -316 713 -1284 1146 -614 -67 672 -1016 1017 -975 390 526 -881 955 -1044 649
3127 649 58 -599 1022 -1043 674 -316 -211 948 -1054 785 -517 33 613 -912 975 -736 133
3144 133 335 -654 1010 -920 332 76 -511 887 -884 592 -237 -396 753 -779 756 -493 -175
3161a75P21j281J575j402O36J86r51J546j441R05l35n10J291j382J133o54k19
3178c57R11j222J357r33J06M95j000J339j059M74J06q25J193j061P90k13n81R54
3196D74j021R68m29k59O48r64J014n69Q1L58q64R72o75L58J81p09Q19p59N61j4
3216A71m33O35q10O54j57j78M69p67O42l39J18L07o20N35m59K38J87m02M68n51
3236b92L10L5j80M01n24K94r8l5L28m22K80k23M0K55k57K50k94P5J16j24K64k67
3258f8N8j8l1K02j55O1j01j9J40k4M2j07m3K5N5M0rp6o4Q0oJ02p2j01O2o7J80
3285H6n8l9J0j77K48j11R4J5k61K77k14K35k1k02K53l53L55q7q8K10m40M12k01
3308e7O4J96m55M43l84K47J19l93M60n36L70L1k62M63o59M93j67r0M67p22O03
$$ plain form
3161 -175 546 -735 840 -562 74 260 -691 855 -586 319 -16 -526 765 -617 516 -138 -357
3178 -357 554 -668 689 -244 -138 357 -643 696 -363 111 217 -608 585 -476 314 101 -480 474
3196 474 -547 421 -8 -267 381 -583 431 -138 -57 301 -563 409 -266 92 273 -436 383 -376 185 171
3216 171 -262 373 -437 217 60 -118 351 -416 226 -113 5 312 -308 227 -232 6 193 -209 259 -292
3236 -292 18 53 -127 274 -250 44 -54 -89 239 -183 97 -126 -86 169 -88 162 -132 -57 59 -65 199 -68
3258 -68 -10 -28 -59 143 -12 49 -52 -71 69 45 87 -20 -63 -38 17 57 48 -28 -92 -12 -18 84 12 -89 -27 -94 86
3285 86 28 -11 -1 -178 70 -41 53 68 -193 84 -130 105 84 -118 135 -218 137 50 -38 172 -268 144 -57
3308 -57 7 203 -252 191 -193 54 173 -220 240 -296 74 105 -157 306 -353 140 -27 -117 350 -372 231
3329B31m15J02L95o53O62o18K67K39n39P95q14M36k4l51P98q86O11l12j69P21
3349D76q72Q04n99K3N45q20R70q03K48K50o86J036r49N27o6n54J029j021Q14l82
3369c0l54Q64j062J069o30m3N91j053J216q41K92K76r38J269j059O36J8p45J153
3388F29j233R82k78m57R54j315J237o08j02P27j258J327r47L34M96j160J326j220
3406e66P78J19r26J296j387J033k85m97J178j497J216o48l7Q96j454J411j006
3423c76L07N56j194J518j378O26K28q68J444j615J061j72o11J274j570J359p33
3440a44k79J152j462J448j160K78P68j393J564j328O88J95j156J732j507R12k81
3457B7o71J569j730J290n82k47J049j658J739r97rP06j343J814j481N38M32j158
$$ plain form
3329 231 -184 -82 313 -340 322 -296 -29 210 -329 466 -348 88 64 -287 511 -375 236 -76 -245 476
3349 476 -396 408 -191 -168 377 -443 527 -276 -28 222 -464 572 -377 150 84 -470 559 -462 352 -30
3369 -30 -384 480 -582 487 -143 -186 405 -648 568 -273 19 295 -643 626 -433 203 221 -524 629
3388 629 -604 378 100 -357 597 -718 519 -89 -191 536 -722 605 -342 -8 488 -672 654 -566
3406 -566 212 331 -595 701 -686 347 62 -435 743 -754 462 -186 -223 673 -781 630 -376
3423 -376 -69 487 -707 811 -567 59 287 -581 863 -752 309 137 -474 800 -770 589 -144
3440 -144 -423 729 -733 715 -445 -167 601 -792 772 -556 132 327 -829 903 -604 308 27
3457 27 -644 925 -805 485 -97 -344 705 -953 786 -211 -220 486 -857 957 -524 14 446 -712
3475g12J543j619J209j05j042J472j535J471p52m67J395j691J454r94K77Q84j832
3492a044J738j130O07K33j388J969j619P80K7p21J565k044J393k17n25J101j778
3509a053J861r83k36J071j419J659j599N81Q66j494J511j551J177k4j270J828
3525I25j535J104o75l92J686j953J283p22J50R03j902J944j056J46L88j151K024
3542A167j820N67L93q67J472j926J455j32r80J331j482J734j115m14J442j499
3558f74J433j347N56Q35j788J662j134Q53j19j290K033j542Q09l44m22J522k054
3575a011J417l41k51P81j722J992j025j35P30j158J697j736P18O50j211J250j535
3592h90J420k15j086J474j345J263q72k08J431j727J212q56M59O75j756J729j012
$$ plain form
3475 -712 831 -788 421 316 -726 746 -789 682 -70 -537 858 -833 621 -373 -96 788 -1044
3492 -1044 694 -436 171 404 -984 985 -634 146 173 -548 1017 -1027 366 149 -376 725 -1053
3509 -1053 808 -175 -411 660 -759 900 -699 -118 748 -746 765 -786 391 367 -903 925
3525 925 -610 494 -181 -573 1113 -840 443 -279 -129 774 -1128 816 -240 -94 294 -857 1167
3542 1167 -653 -86 307 -560 912 -1014 441 309 -671 660 -822 912 -203 -617 825 -674
3558 -674 759 -588 -32 803 -985 677 -457 396 277 -1013 1020 -522 287 -57 -479 1043 -1011
3575 -1011 406 65 -186 595 -1127 865 -160 -295 435 -723 974 -762 -44 606 -605 645 -890
3592 -890 530 315 -771 703 -642 621 -251 -459 972 -755 457 -399 60 735 -1021 708 -304
3609c04M21J06r71J810j673O48J15n20J257j839J362k76n52R77j366J625j101
3626b81j73J050j160J296j377O25N93j307J356j185R42k41r12J607j332Q63n34
3643a70k27J226j610J232n73K1N80j325J622r91J29L64q79J431j396O70K18p97
3661d75J062j312J178l25o47J055j139J156p57q5Q79j241J130q33M22L92j177
3678g17J273r14N34J6p31J247j242P48j40l35Q81j307J061l89j81O52j059J169
3696E66q28J34N43q74J012j025N45K17p34R56r98P36j96m49R34j017P77m46q2
3715b29P35j031R05o03J49L95q16R95p80K98J52n74R53r25N26n5m09P61q56P28
3735C19l33k33O23p78P96n32K1M11o96P85o10K76J47n99P89o48M17o6m00O58p08
$$ plain form
3609 -304 117 223 -748 1062 -611 37 152 -368 889 -950 412 136 -416 561 -805 820 -281
3626 -281 -454 596 -564 732 -645 -20 573 -734 622 -563 379 138 -774 833 -499 364 -170
3643 -170 -397 829 -781 451 -122 -101 479 -846 776 -215 -86 278 -601 830 -566 104 322 -475
3661 -475 587 -725 453 128 -519 536 -603 553 -204 -289 590 -651 479 -354 68 460 -717
3678 -717 556 -358 176 192 -539 708 -534 214 74 -261 620 -687 374 -15 -196 456 -603 566
3696 566 -262 -128 415 -459 553 -472 73 290 -444 512 -486 250 54 -395 539 -478 299 -147 -229
3715 -229 506 -525 380 -223 -74 321 -495 500 -280 18 170 -404 549 -376 150 95 -314 447 -409 319
3735 319 -14 -247 376 -402 394 -138 -117 294 -402 383 -227 49 196 -403 386 -262 155 89 -311 347 -361
3756c61N69k15j77M72o78O64l45oL24n98O52m71K03J45m60N75n36L69j2l24M97
3777B87n61M25j35j36M02n70M53k31J1K83m92M61l43J27J68l62M39m27K32M7k30
3798a52L64m21K78p9j07L18l62K81j81j1K33l11L02k62Q5J39k40L21k79R9K1j29
3820i3K55k57J61o1p1J81k01J79j23k5J19j50J96j40%M7j10J49q2N9k1j07J25
3843C0o6P1l0p1O8l9O2j8k3Pk7M7J1Ll0pJ3%K6jJm5K9lK0Rp5N9m4M8J4q6Q5j03
3877f5Q3J0o2J10j70J09k5k1J17j84J53j08J6J06j67K15j97O8Q1j45K26k50J13
3900A3K0j16K35k70J94p7p7K36k76K47j62l1J90k55L02k59Q1R5k50L66l24J60
3922D2k2j91L75l56K67j04j43K88l81M01k37l1K51l81M22l02J15J18l61M66l71
$$ plain form
3756 -361 208 -7 -184 288 -390 274 -71 -77 247 -351 301 -170 33 178 -282 293 -243 126 114 -210 287
3777 287 -274 151 16 -120 282 -288 165 -66 -55 228 -264 197 -146 -19 149 -213 226 -201 31 78 -152
3798 -152 212 -209 69 -10 -117 201 -161 120 -61 -72 161 -150 152 -110 -25 114 -126 195 -84 15 36 -93
3820 -93 162 -95 66 5 -66 115 -86 93 -30 -55 64 -86 110 -30 -30 17 -93 56 -26 33 12 -95 30
3843 30 -36 35 5 -66 2 -37 25 7 -16 -9 -36 11 22 25 -5 -12 1 1 27 26 27 -18 11 8 28 37 -38 21 -23 25 39 -47 38 -65
3877 -65 18 28 -34 76 -94 15 -10 -31 86 -98 55 -53 -37 69 -98 117 -80 -12 69 -76 150 -100 13
3900 13 33 -83 152 -118 76 -1 -78 158 -118 129 -33 -64 126 -129 173 -86 -5 90 -160 206 -118 42
3922 42 20 -171 204 -152 115 11 -132 156 -225 176 -61 -92 159 -222 200 -102 13 131 -230 236 -135
3943a35K16J5k88M35m54L61j26j60L69m76M38k24k7K69m88N09l45J12J99m89N50
3964B61m61K43O7l42N18n73M09r2k04M63o09N05k41p7M00n77N70m24J23K55n03
3985b89N89n28K76Q6l81N85o10M27j10k61N87o83N28k89m7M21o46O15m01O8K84
4006B21n76P27n69J98J32m47O90o80M19m1l34N82o86O29k91j89N16o42O81n02
4026a62Q4L73o69O97n16K75J31n84P58o37M06q4l49P06p88N68k18j50N15q10P62
4047C08l74j9L11o21P95o47K23K34n22O78p57N32J2m64O50p35O73l03k30O53p33
4068c36O13m86J46M49q13P36m92K62J28o33Q95p13L19kl13P38r32N86r0k27M97
4089C32p98Q27m43j22M48n82P78p26J92L90o12O43o84N20ln73P91o44N19l14k24
$$ plain form
3943 -135 81 96 -192 243 -211 150 24 -136 233 -243 195 -29 -56 213 -275 234 -111 1 200 -289 261
3964 261 -200 43 110 -232 286 -287 122 30 -174 289 -320 185 -56 -133 267 -310 260 -164 -41 214 -289
3985 -289 300 -228 48 134 -247 338 -272 155 45 -216 371 -312 216 -73 -120 301 -345 270 -131 -63 221
4006 221 -355 372 -197 1 133 -314 376 -304 115 74 -260 322 -364 265 -26 -215 301 -341 340 -162
4026 -162 -78 295 -374 323 -193 82 213 -371 387 -250 156 72 -277 429 -359 209 -9 -159 356 -454 308
4047 308 -66 -85 226 -395 400 -247 -24 210 -312 366 -391 141 153 -311 339 -396 277 -26 -256 397 -336
4068 -336 277 -209 -63 386 -427 309 -183 79 207 -426 469 -244 75 73 -240 498 -434 152 62 -165 332
4089 332 -466 361 -82 -204 244 -338 440 -286 -94 296 -316 327 -357 163 160 -413 378 -266 253 -61 -285
4110b85P51q03N55l48R1M09q64Q13l79N7J49n52R15p49K50J23l49O36q58O28l7
4131A53m05N07o51P91m41k32O17o32O03o02K57M02p69O46n06M32l0o00Q67o37
4151b30L61j75j61O81q97N56j44m2L17p47Q73m32p1K74m47P59p81K66K85m51N15
4172C09p04N98n5m80O28n65N66m28j21O58o94M92m13J99L24p53P05m06K10Mm48
4193c74Q37p04K63oj52N32q07N80j01k32L78n76P37m53r7M14m72N79o35L12K52
4214B75n63N24m96M57j09m38O64n33L82k60q9N48p10N04k32O3K30o07O87m02P7
4235b8J25l66O20o14K94R2k94M26n86N29j40k44M11m90N29l76k3M05n07M59l91
4256a69K08J59m82N22m05K55m3k93N47n15L02j02j10L74n60M64k16l4K69m45N27
$$ plain form
4110 -285 466 -337 218 -130 -39 370 -494 319 -60 -3 146 -406 509 -240 10 133 -216 420 -438 190 153
4131 153 -252 255 -396 395 -46 -278 339 -293 310 -292 -35 367 -402 244 -262 170 140 -460 407 -230
4151 -230 131 -44 -205 476 -421 135 -9 -51 266 -481 392 -40 -111 163 -284 475 -306 -40 245 -206 309
4172 309 -395 203 148 -332 296 -269 297 -131 -252 406 -288 204 -209 -10 314 -439 266 -140 70 74 -374
4193 -374 463 -241 22 16 -136 396 -411 169 68 -164 214 -362 375 -78 -175 239 -233 346 -289 23 275
4214 275 -288 236 -260 197 88 -350 314 -219 163 -97 -186 362 -348 156 -76 -13 217 -390 297 -105 -28
4235 -28 97 -269 351 -263 31 123 -171 255 -331 198 58 -186 225 -265 264 -112 -135 270 -237 222 -169
4256 -169 39 198 -284 238 -167 88 45 -248 299 -216 86 -16 -126 248 -312 152 -64 -98 171 -274 253
4277B53l85N8K13l35M53m58K63N0l08M07m08L37j19j95L86m07L51k41JL04m57
4298b37M10k66Q9J09l38M52l44J63L7k52L96l99K60m7j71L17m05L77j84o4K31
4319A34l41L68k55O0J53l01L44k84J58N8k41L20l07K34o2j59K92l04K37r4n0J84
4341A44l19L05j87N1J20k65L02k51J12N3k02K73k69J76j2j29K39k73K01r3o1J99
4363A14k52K31j50L8J14k04K33k04R3L7j46K31k45J45qq7J59j62J19q1j1J22j51
4386f5J37r4k4R7j35J66j20L7K5j05J39j23P6%p9J37j33R5k9n1Q8j20J21o5JO2
4412C8r8J11o3J8K2p7R0p3N4ml5O1n3L9j1k8L8o4M6Kk2K9n7M2k0J9%j9K5l2J1
4443a1J1j9K2k8J3RJ%qnJ8l%J4j7K2j9j1M1m6N0l0j3M3m3M4m8J7J5l8O5o7M2l2
$$ plain form
4277 253 -132 -74 139 -196 257 -201 62 112 -196 211 -197 140 21 -174 212 -195 156 -85 -84 220 -237
4298 -237 173 -93 -4 105 -233 219 -125 38 75 -177 219 -180 80 33 -138 179 -226 151 -33 -97 134
4319 134 -207 161 -94 -34 119 -182 162 -122 36 94 -147 173 -134 100 38 -121 171 -133 104 10 -40 144
4341 144 -175 130 -57 -6 114 -151 151 -100 12 65 -137 136 -133 43 31 -98 141 -132 69 -24 -85 114
4363 114 -138 93 -57 -19 95 -109 124 -80 13 50 -96 135 -110 35 27 -60 99 -63 56 -25 -36 86 -65
4386 -65 72 -22 -46 51 -84 82 -38 -1 24 -81 58 -65 11 11 -68 69 -64 31 2 -49 39 -81 40 -25 -24 38
4412 38 -60 51 -12 6 28 -49 41 -32 22 18 -17 44 -9 30 19 -9 29 -35 11 13 -9 20 -37 5 -15 4 4 -15 10 -22 -11
4443 -11 0 -19 3 -25 -12 -3 -2 -2 -10 -15 3 0 0 14 -3 19 0 -11 30 -16 34 4 -9 34 -9 35 -13 4 19 -19 46 -21 21 -11
4477a1k0P5q2O7l5m0R1q8O6o2J8N4p0P9o4KM4p5J15j07P7j2q3J35j30J11n0m9
4505d4J25j49J43r2nP2j38J78j27K3P5j51J77j48Q7lr1J62j86J29j9p4J28j95
4529a23J77o5l3J20j98J96j39N8P6j72J95j72R7K7j22J86k11J88n0p7J73k46J98
4552H3q5l5J28k02K30j80M4R8j83K33k40J16K9j62K55k55J77m5q8K01k55K27j43
4575e2j7J93k62K43j89M8J04k20K86k14J18K1j87K89k65J76n6j05K46k88K49j23
4597en1J68k67L14k09L3J26k55K86k66J40N1j78K63l05K18n5j48K83l22L01j63
4619d1l4K21l15K88j84N8J13k91L37k54J39K7j89L13l44J88J4j16K39l67L07j02
4641Go5J91l25L63k57K7J80k70L20l19J75P3k61K99l01K51p9j71L26l05K24j46
$$ plain form
4477 -11 -31 44 -38 29 -6 -46 45 -43 23 -39 -21 33 -37 42 -22 -20 24 -51 64 -43 34 22 -61 74 -56 55 5 -44
4505 -44 81 -68 75 -17 -22 50 -88 90 -37 -14 61 -90 87 -61 26 23 -68 94 -92 37 18 -56 72 -123
4529 -123 54 -11 -44 76 -122 74 -65 -7 69 -103 92 -80 17 44 -78 108 -103 85 35 -42 131 -115 83
4552 83 -2 -37 91 -111 119 -61 -17 81 -102 131 -109 7 36 -126 129 -126 51 6 -82 119 -136 91 -52
4575 -52 -69 124 -138 105 -84 -36 68 -152 134 -80 38 59 -128 161 -104 72 16 -89 157 -131 118 -5
4597 -5 -56 112 -155 159 -50 -17 109 -146 140 -126 14 65 -113 150 -155 63 8 -140 143 -179 122 -41
4619 -41 -75 146 -169 119 -65 -7 106 -185 152 -102 37 64 -125 188 -156 32 46 -70 169 -198 109 7
4641 7 -58 133 -192 171 -86 -59 121 -149 171 -148 27 100 -161 138 -163 88 9 -162 164 -141 83 -63
4663f3j4K48l87L34j71O9Q8l11L96k64R2K9j84L60m02K28K8j82K76l66L55j43
4685A6j44K55k72L27k78K3K27l07K95k80J81M4l07L83k78J96j03j53L84l83K24
4706E0r1j4K33m29L77j25l0J37l08M47l57O1J43j89K93l96K66L2k09K35l03L38
4728A61j68j26K97l00K69k61R2K15l77L03k12J62K8k98M03k91J36m4j20L62m33
4749b02K34j3p4J93l80M12j86n5J62k37L63l57R6J73k34K51l15K59Lk70L32k54
4771i9K40j80q4L45l68K38j68N6J90m20L75j90P1J9k34M06l17J23J2j24K95l86
4793b00K76m8j30J99k72L51k00o0K37k77K82k61J07J35k99K98k46J86qk21L24
4814A73k79J93j17n4K73l61K59j30K9J20k89L32k06K2J00k08L18l24J50N1j60
$$ plain form
4663 -63 -77 171 -216 118 -53 16 104 -207 189 -75 17 46 -138 222 -180 48 76 -106 170 -196 159 16
4685 16 -128 127 -145 182 -96 -73 154 -153 142 -138 43 87 -220 163 -115 81 -22 -175 209 -174 50
4706 50 -41 -55 178 -251 126 1 -29 108 -200 247 -110 -49 94 -95 198 -198 68 100 -109 126 -177 161
4728 161 -7 -133 164 -136 133 -128 -36 179 -198 105 -107 55 83 -215 188 -103 33 -11 -131 231 -202
4749 -202 32 19 -55 138 -242 170 -16 -71 91 -146 217 -140 -44 129 -105 146 -169 90 93 -177 155 -99
4771 -99 141 -39 -123 222 -146 92 -76 -20 170 -250 125 -65 6 25 -209 197 -120 3 15 -109 186 -200
4793 -200 76 28 -102 97 -175 176 -24 -84 153 -124 158 -103 4 139 -160 138 -108 78 70 -151 173
4814 173 -106 87 -30 -84 189 -172 87 -43 -14 106 -183 149 -57 -35 65 -143 175 -149 1 52 -108
4835a08K22k82K50o3j30K23k45K62j85k0K04k62K53k00Q1R4k35K99k42J36j2j55
4857a15K84k77J60n6o0J95k69K17j16j3J36k31K85k10M1Q1j58K32k37J25M1j71
4879a16K39k41J84m1j22K27k27J84j22j9J70k35K17j29L5Q3j90K06j68Q7Jr9J93
4902A17k00J29k9q4J53j89J71p6l6J14j64J88j48L0O3j51J86j38P5J6j17J65j56
4925h1J35n4n8J56j76J45n8k3Q7j41J42r5K1O9j34J54j25L4M9r9J12j15R2k1o3
4950d7J10j16Q7m8l9J06j07Q8n9j0Q7j23J29r3M6J1o3R0j00O6J5o6R4j00R3m0
4976A1k1O6q2P0m8j0M2p5Q0m4J8K8q1Q6n6K3j7j1N8p0K5J1j5J5l3M3jl3K8n0N4
5007A1l1J6Npj3ONK2l4L7j3JOkOmoPKJ0k1%K1l7K8jj8Qj7J0Nj7Rl1M4k0OPl5L7
$$ plain form
4835 -108 114 -168 82 19 -111 112 -133 129 -56 -76 128 -134 119 -81 0 94 -141 158 -84 52 40 -115
4857 -115 169 -108 52 -4 -64 131 -138 79 -37 -50 86 -145 140 -70 -29 52 -106 126 -111 14 55 -116
4879 -116 123 -118 66 25 -97 130 -97 87 -35 -54 116 -119 98 -31 4 87 -103 103 -65 22 23 -76 117
4902 117 -83 46 17 -67 86 -103 68 -8 -44 70 -94 94 -54 -24 39 -112 74 -64 11 27 -90 75 -81
4925 -81 54 0 -58 98 -78 67 9 -14 73 -68 74 -21 0 69 -65 89 -36 -2 47 -52 60 -55 37 16 -47
4950 -47 63 -53 34 -14 -53 53 -54 34 -25 -35 52 -71 58 -35 11 22 -41 49 -51 15 30 -36 58 -42 51 11
4976 11 -10 56 -26 44 -4 -14 28 -47 33 -11 7 35 -46 40 -16 7 -10 -21 37 -33 -8 3 -12 3 -30 13 12 -21 7 -43 11
5007 11 -20 -4 1 -6 -19 -13 -8 14 -20 17 4 5 11 9 15 11 5 12 14 24 3 3 24 -13 15 14 -4 4 -13 -3 2 -15 -6 -37 7 -13 -7 0 -35 2
5047Bk2J9J4l5L7m4L7Mn4O0m3K3L1o3Q6p3L5mk1O9r3O0j1k9O5p0M5l2j1M7r6J12
5079D5p6K5L8q3R4r6M8J0o9R6p7N7j3m8R7r9J09o6j1P0j21J22o9K1K5r3J41j07
5107c0N8J8j07J42j54J07qp9J26j46J35p0k8R1j51J48q1J4P2j55J84j54P2M5j39
5132i0J64j55J07rr3J63j95J60n8m1J34j99J94j18L1Q6j89K11j45N8M4j46K03
5155A17k05J33k1j01J73j87J62p7o2J73k33K01j34K2J10j89K14j65P7M2j73K39
5177A16j95J18oj28K10k46J91o8m0J64k59K42j29PJ26k02K35j98O8P7j89K35k25
5200i6J43Nj49K23k38J72n2r6K17k54K15j40QJ40k35K55k15Q7J04k36K76k37J30
5223B7lj47K81k85J86n6p4K12l02K78j35k5J71k66K85k19N8J26k31K70k66J52
$$ plain form
5047 2 -20 -1 13 -22 15 -29 8 12 -42 18 -25 -2 29 -34 52 -21 14 10 -11 58 -35 25 14 -15 50 -20 25 -7 -18 29 -67 45
5079 45 -31 -6 32 -51 43 -53 -5 5 -64 32 -45 12 -1 -49 48 -51 58 -8 -19 51 -70 52 -17 4 29 -64 77 -30
5107 -30 28 46 -61 81 -73 34 26 -53 73 -73 62 -8 -36 55 -96 52 -29 -15 57 -98 86 -68 4 49 -90
5132 -90 74 -81 26 17 -76 87 -108 52 -6 -47 87 -112 82 -36 -5 81 -108 103 -42 16 60 -86 117
5155 117 -88 45 24 -77 96 -91 71 -6 -68 105 -128 73 -61 -39 71 -118 96 -69 8 50 -123 116
5177 116 -79 39 33 -95 115 -131 60 -8 -48 116 -143 99 -30 -23 103 -99 136 -62 6 83 -106 129 -96
5200 -96 47 52 -97 126 -112 60 8 -88 129 -125 90 -50 -42 98 -137 118 -97 -10 94 -142 134 -103 27
5223 27 24 -123 158 -127 59 3 -71 141 -161 117 -18 -43 128 -138 147 -72 -14 112 -119 151 -115 37
5245C7M3k06K69k61J94p7j16K62k65K02j55K1J90l29L10j77N7Q2k43L30k58R6
5267FL7j63L05l26K07k8j19K26l05K94j43p0J94k46K85k25M6J67k80K83k76J82
5289E1L4k49L12k47J58o1j21K89l28K20p8m1J89l43L38j74L0J01k28L32l00J06
5311a0P3j74K72l25K16J6j78K33k58K61j39p3K35k78K59k04N1J56k90K80k03J11
5333C1N0k28K92k42J27l0r5K74l45K16o1o9J97l05L24j73j5J43k24K90k69R3J00
5356H1k01K46k47J91j3j83K89k65K22j47m9K41l02K51j67K0J47k96L13j86N1P3
5378F9k19L09k60J10N1j48K13k89K16l2j18J98k37K65j58l8J71k21K48k03Q3R4
5400A04k44K41j79J29Jj70K71k40J51m9o7K08k88K11q3j3J12k40K72j76K4Q7j70
$$ plain form
5245 37 80 -126 143 -118 76 -1 -117 145 -120 82 -73 -52 138 -191 119 -58 -1 81 -162 168 -90 6
5267 6 43 -120 185 -141 66 38 -81 145 -160 134 -9 -79 115 -131 154 -71 -25 142 -138 145 -131 51
5289 51 85 -164 148 -99 59 -2 -123 166 -162 58 -20 -61 128 -215 123 -51 -21 80 -148 184 -116 -10
5311 -10 63 -111 161 -164 52 68 -110 123 -135 126 -13 -86 149 -129 130 -74 -23 133 -157 123 -80 31
5333 31 81 -147 145 -97 30 0 -95 179 -166 50 -11 -80 117 -188 136 -37 -52 91 -133 157 -112 -19 81
5356 81 -120 126 -121 70 57 -126 163 -102 120 -27 -76 165 -137 114 -53 -33 114 -182 131 -55 -4 69
5378 69 -150 159 -101 9 60 -88 125 -164 52 20 -98 100 -137 128 -30 -68 103 -118 130 -73 10 104
5400 104 -140 101 -78 51 52 -118 153 -87 64 15 -52 156 -132 79 -4 -17 95 -145 127 -49 -25 62 -108
5423a08K50k41J04N5j55K12k42J72k8j17J86j98J77r3k7J52j91J67j15N0P0j89
5445a09K29j79Q0Nj13K09k13J49l1p1J62k16J75p0m3J19j84J86j35K9Q9j65J78
5468H1j38N2M2j32J73j53J13k3r4J61j73J34n5m4J52j79J53r6OR2j53J70j47N8
5492@M5j23J52j50J11qp5J32j46J14m7l8J01j56J24p1OQ6j35J29r9L9L2q1J12
5517E4j09M5K4o1Q6r4Q5l2l6J13j46J29p8J6N3q4O4m9K5L6p2P4p0O0j8l9O8o1
5545a7L0j8k2O8q4O1j4j6M7r0Q2m3oM0o2O5n0J2K4n4P8o6L2Ol2O0n3K6nlL8n4
5577b0N2l4OL7l8J7k0NJ2k4L1l8K6j2k2M8l9J0J1j3J6k2mJ2j0J3j1MQj5Nn%Nl
5612a2K3j9J2J4k4J1Kj3J7j5L6k7kK2k0J3j2rJ9k9K5j9jRj6K7k3K0rk1L0n4O0
$$ plain form
5423 -108 142 -99 5 60 -95 117 -125 47 19 -98 88 -110 67 -26 -53 99 -92 75 -40 10 80 -109
5445 -109 120 -59 21 26 -87 122 -91 58 27 -44 118 -98 77 7 -36 83 -101 85 -50 -21 68 -97 81
5468 81 -57 -5 37 -95 78 -75 38 15 -79 82 -91 43 -12 -56 96 -83 70 -26 -20 72 -81 89 -58 0
5492 0 45 -78 74 -76 35 27 -48 84 -62 52 5 -33 68 -88 36 -35 -29 57 -78 51 -48 -9 23 -58 54
5517 54 -55 -10 14 -47 39 -55 30 -2 -38 75 -71 58 -20 -4 49 -35 29 -20 5 41 -31 43 -27 33 15 -24 44 -17
5545 -17 13 -5 -27 41 -43 18 4 -12 35 -55 27 -16 -22 18 -44 21 -29 -17 7 -47 31 -35 -3 3 -29 31 -22 4 -1 -4 34 -20
5577 -20 32 -2 4 41 3 20 0 5 17 -7 24 -14 12 0 -22 26 -13 -3 8 -5 11 -11 -15 -3 -13 0 -11 -7 1 -14 -9 -14 -14 -9 -12
5612 -12 11 -8 4 18 -6 5 7 -6 11 -4 32 5 3 25 5 18 6 -3 16 -13 12 -7 -8 1 -15 12 -11 9 0 -21 9 -45 15
5645A5j0m0M5m4M4j5pL3m0M5m8L7Ro2P4o5M2J5p5R1o8L8J0m4N8o3O5m5j0N9r4
5676e0R9o9J0L7p4R4p4K5K5p0J07j05N9j9l8R9j42J30n5l0Q1j13J25q6K5M8q4
5703d5J26j24O3L0r8J28j04N3Oo6J07j28R4k8m7J13j41J15o9RM4j10J33j10M2
5728gK7r9J53j28N4Op9J43j60J38m5n0J17j50J47p8j2R0j43J64j30K8O2j31J75
5753I2j77J29k3q1J63j70J16n8l7J31j77J68r3j6R6j77J92j25N0M7j55J94j69
5776h0R1J7r5J60j96J51l3p7J46j83J75r5k7J26j70K01j47K5Q4j46J82j69J07
5799D7j3j24J87j82J34m9p3J94k08J38o9k3J03j93K14j35K7O9j51K24k20R9L5
5822C1j09J77k03J47k1j19K04k07J89r7l8J44k02J85j31L9R2j86K09j56P0K9j33
$$ plain form
5645 15 5 -35 10 -34 10 -5 -12 21 -19 26 -22 15 24 -38 36 -29 13 28 -47 44 -24 14 24 -20 38 -25 40 -5 -15 44 -50
5676 -50 49 -20 -10 27 -47 47 -27 -2 23 -47 60 -45 14 -5 -43 56 -86 44 -11 -41 40 -73 52 -34 -9 39 -45
5703 -45 81 -43 20 50 -48 80 -24 29 35 -31 76 -52 42 14 -33 80 -61 54 -15 -6 38 -72 61 -49 -7
5728 -7 20 -79 74 -54 0 6 -73 70 -90 48 3 -47 70 -80 67 -11 -23 67 -76 88 -42 -14 48 -83 92
5753 92 -85 44 21 -60 103 -67 49 -9 -46 85 -92 76 -17 -33 63 -114 78 -47 3 50 -105 89 -80
5776 -80 11 28 -67 93 -103 48 15 -62 84 -99 76 -19 -46 80 -90 111 -36 -11 73 -73 109 -60 47
5799 47 34 -90 97 -85 49 0 -73 121 -87 51 -18 -41 62 -131 83 -52 -25 44 -107 117 -103 -4 31
5822 31 -78 99 -104 43 22 -97 107 -100 89 -8 -46 98 -104 81 -50 -11 81 -105 104 -52 18 47 -86
5845h6K19k13J23l2p6J68k19J56m0m7J22k09K26j43J8R5j72K23j97Q0O0j74K09
5868I1j93J55j2j30K10k16J67r2k6J68k33J98j19J3J11k16K38j71P1M0j53K37
5890A38k36R9J7r1J86k42J79l4r9J71k04J99j29j8J49k02K00j73O9Q7j82K20j91
5913h7J23k4j21K27j91J42p5m5J73k31J76q7OJ05k02K27j59K8N9j44K10j98J07
5936A9J0j21J84k11J91o3j14J90j72J79j29oJ47k20J85j21L4P7j80K00j28N8L4
5959D3j43K26k08J17l1m7J47k09J95r6k3J14j86K11j46J1R4j40J61j76J04K1j41
5982a02J94j75J06j1r4J68j84J51r2j4J21j66J72j13QQ2j64K11j43M8L7j24J94
6005A10j80J12j6p2J28j59J39o5l2J11j48J49j03JO1j21J59j33N7N4j42J63j45
$$ plain form
5845 -86 133 -80 43 11 -65 103 -116 40 0 -47 75 -134 92 -51 -33 62 -110 113 -84 -4 56 -118 91
5868 91 -102 53 41 -89 121 -95 72 -20 -46 122 -111 87 -32 -19 92 -124 114 -57 14 54 -99 138
5890 138 -98 1 18 -73 113 -129 50 16 -83 88 -116 83 -46 -64 85 -117 83 -90 -21 66 -116 104 -87
5913 -87 36 12 -109 118 -73 69 -6 -51 122 -109 67 -20 -14 91 -111 116 -43 -15 44 -100 110 -88 19
5936 19 29 -92 92 -119 72 9 -105 85 -87 92 -37 -43 104 -116 69 -52 -18 59 -121 79 -49 9 43
5959 43 -100 126 -82 35 4 -43 104 -105 90 -6 -29 85 -101 110 -36 -25 69 -71 90 -86 18 39 -102
5982 -102 92 -83 23 12 -82 86 -98 53 -39 -53 68 -98 74 -39 -31 51 -113 98 -45 3 40 -84 110
6005 110 -70 42 26 -46 82 -77 62 -3 -35 76 -72 77 -26 -25 36 -85 74 -59 -2 52 -90 73 -72
6028g2R1jj04J64j65J06j8o3J34j51J32q1kP5j35J59j02K0N8j13J39j34O9L0r4
6053e8J31j32J04n2m1J18j33J13o2lP6j32J13q8M3L9r8J15j11O7J3q0R8r0O0j4
6079dm9R4r6Q6l3l5Q0r7R8o3K5M4q3R6q6M4Mp4J11q6M3j0l9R2r9O9l2k9O1r3J09
6110D8p7K0M1p8P7n9K6J6o2P1o0L0Ql8N6l5N1n0j5N1m2M5m5J8M0m6N3o7K9J8m5
6141b1M6m9L7j3j4N3n7K1oqK2l3L8l2OK7n4M2k6J8j4j4K6pPNj5K0j6K2kj6K1l1
6175a7L2jj6JKJ0k2L0jjk1J8rnpJ%Rj1NoJ8j8NppJ0j5rK7Rk3mK6l2J0J4NmjMK0
6217A9k7L2m3K7Rj9J2jQj8qK8l9L8j8j1J2j5L1l9J3L1m3L8l8J5Rn2O6n8L6%j9
6250b4M9o7N0j8KL9n9N6o0L1M3q8Q0m8J7nl8J00q7M4K8p5M7m9O3m0JM3p0N6k4
$$ plain form
6028 -72 19 18 -86 78 -87 19 1 -62 72 -79 53 -28 -30 45 -90 69 -33 -13 45 -68 71 -63 6 36 -58
6053 -58 73 -59 45 -7 -48 70 -63 50 -12 -15 61 -71 42 -46 -3 36 -62 53 -58 9 22 -58 40 -50 10 -4
6079 -4 -53 41 -55 31 -2 -37 43 -54 44 -19 6 50 -33 63 -23 21 25 -49 62 -24 19 9 -30 62 -37 32 0 -29 32 -61 48
6110 48 -29 -9 32 -46 31 -28 -2 14 -48 23 -37 -7 1 -37 19 -16 35 -15 -30 21 -21 24 -21 -3 37 -9 44 -23 6 24 -21
6141 -21 25 -24 13 0 -14 39 -18 3 -3 -11 11 -22 16 -16 -10 17 -37 5 -21 -3 -17 -31 -5 -12 -5 0 -15 5 -11 11 9 -7 14 -17
6175 -17 15 14 -2 -1 1 11 -11 19 18 17 -4 14 5 0 -7 -6 -6 3 -8 -3 -9 9 -9 -4 -11 -18 -8 -23 -32 -5 4 -19 -23 3 -29 -19 -5 0 -4 -5 -1 19
6217 19 -8 24 -19 8 17 -2 10 9 17 -1 -9 19 -20 18 0 -11 1 -14 17 -22 -9 22 -21 17 -21 -6 3 -49 17 -41 -5 -5 -24
6250 -24 25 -42 8 -10 -8 31 -28 28 -32 -1 42 -46 34 -14 3 -2 -40 60 -27 17 45 -30 17 -32 31 -9 -8 35 -35 21 -3
6281cqK3p9J07o2J6Ol7P5q5M4Mm9R7r3O9m2l5R0q3R0n6J3L9q6R3p8L6L0p4J01
6312F3r4M7j3k3O9r7P2j3n1R6j19R9o2j4P0p6P7o7K9L6r7J33j28O2K3p9J02j01
6340e6P9l0l8R3j08R7o5J6P5j44J29p2J4N7j13J37j04N4J2r6J39j43Q9oo4J29
6366H1j54J23n8l2R2j10J12r4J1O3j08J37j16O1J7r2J07r0P3k3m7J39j61J06l9
6391bl8J19j56J36q8K3O7j07J38j31M1N1j11J31j45R8%r8J41j65J40o6m0J16j42
6416h8J39r7J9J02j66J70j15K3M8j20J71j41P7lp5J44j75J09Lo0J13j60J49q2
6440a5pR9j40J47j29K8O1j16J50j58J00Oj01J52j44J05o4l2J34j60J22p3J5R9
6464G9j91J60p6J6N5j31J64j37O2L8p7J29j67J27k6o3J09j42J53r8j5J11j39J30
$$ plain form
6281 -3 -11 12 -67 40 -22 -6 0 -37 38 -47 -3 1 -48 49 -44 25 -17 -52 38 -45 45 -11 2 41 -45 48 -30 6 36 -38 63
6312 63 -31 16 3 -20 49 -48 24 11 -40 56 -63 36 -26 -40 30 -46 31 -36 -7 29 -68 65 -63 -1 22 -57 45 -56
6340 -56 23 -7 -45 48 -60 37 -28 -12 63 -81 48 -24 -10 47 -66 71 -33 21 33 -63 76 -67 22 16 -48 81
6366 81 -73 50 -8 -40 52 -58 54 -40 -29 34 -74 63 -53 8 25 -67 40 -50 23 0 -47 92 -69 37 -2
6391 -2 -40 79 -77 59 -29 -6 61 -46 92 -39 2 53 -58 73 -72 26 26 -72 69 -96 44 -22 -62 54 -88
6416 -88 51 -46 -27 75 -91 79 -36 -13 35 -85 86 -55 22 19 -56 88 -87 22 25 -35 78 -82 67 -15
6440 -15 -22 77 -63 84 -45 -17 44 -72 78 -80 20 26 -75 77 -67 38 -26 -58 76 -84 38 -35 -20 79
6464 79 -112 48 -28 -12 43 -88 76 -61 1 39 -38 91 -76 51 25 -38 71 -71 82 -16 -31 80 -59 71
6488G1j04K8N9j39J55j18O8J2j13J68j67J15n2m4J33j56J11m6j1R1j61J64r5j2
6512d3R8j35J52j20L9N7r7J19j32J05j2r3J57j60J02l6m6J24j48J15n8RP2j56
6536h7J48r8L6L2j11J42j04O5rp7J30j61J25l2n3J04j29J30o9j5R1j26J41j19
6560d6N5M8j06J11r1O4Qr8J23j09P4l9l1J10j37J15m9j5P3j25J23q6LM5q7J26
6586E9j05O2Qr3J11j12R1lp4J05j07R3m8l0Q6j03J01o1K4K8q3J14q6J9M5q4J20
6613G7j08N2Oo2R4j18J01n3j7Q7j26J08q0QO0r4R4o9L5K5o5Q2p7M6K1n9P9q1N3
6642A9l6qP6q7P9m7PM3q3Q4q5M7J4m6O8q2N4qk8O4q2N4%l1N0q5P9m0jL5p9O6l8
6675b7J8J6l6M4l9K1Ol3P1o7L8j5j2M0n4N1j6j2M6o4N5l2QK1o0O7m6K3J6n0N2
$$ plain form
6488 71 -33 -5 54 -85 70 -48 20 32 -81 87 -80 35 -17 -61 72 -84 27 -19 -30 61 -100 64 -31 -43
6512 -43 55 -80 72 -48 -9 48 -49 70 -62 43 31 -62 95 -65 37 1 -45 79 -69 46 -12 -3 69 -87
6536 -87 61 -37 -1 31 -80 62 -42 23 14 -63 67 -94 31 -1 -54 50 -79 51 -18 -33 58 -68 73 -46
6560 -46 9 57 -49 62 -29 35 43 -55 68 -41 33 -6 -37 73 -64 51 2 -13 60 -65 58 -28 -25 20 -67 59
6586 59 -46 16 24 -69 42 -70 21 18 -56 49 -58 35 -13 -43 43 -60 41 -20 4 32 -51 63 -23 -4 41 -43 77
6613 77 -31 21 27 -35 59 -59 42 -11 -28 59 -67 41 -39 -31 29 -65 29 -40 -5 20 -45 37 -40 6 27 -32 47 -34 19
6642 19 -17 -25 51 -36 43 -4 3 46 -37 47 -38 9 23 -23 45 -37 17 9 -19 45 -37 17 17 -14 36 -49 30 -10 -11 24 -55 11 -27
6675 -27 -9 7 -29 15 -24 -3 3 -30 41 -26 12 -3 -15 25 -29 22 6 -6 40 -24 31 -1 7 28 -32 35 -11 12 28 -22 30
6706C0n5L0jm6O4n1J6J6j8L0n3L9j9lK0j6M4m4J3J3l1L3l0L4j3oL1m9L7k2QK7
6738B8n0L5k6%J3pL4l2OPk1K1j0NPk4K7j7J5j4lOk1K6Nk8PpJ0PJRk0NJ3oRj0K0
6777B0k2NNnJ0pQJ3kl0MLJ0k9K4Qj5Oj1j7K5j6qjRKrK3j5J3j9NK1j1Rj3k2M1l4
6816b2L3rj0J8j9M0k6LJ3k4L9m2K0J1k1J9l8L3nl2N8m1J0J2k5K5m6L0k0j2M4m0
6848b4M1l2J2J8m9M3m1M6j2l7N5n3L5rj0N3n4M9l9KK1l4N5n2RK9n1N1m1J8J0k1
6880a2M1n3J9Lk7O9q4N6j1l1M4o5P6l7mJ3m8R9o9J7Kj7N4o9M6mm9Q2o8N0k3pL3
6913B6m9P6n9J4L8r2P2m7K4Qn6Q0o1L0Jm2O7p5P4m6%N2j00J02n5oO1p9P1m6K0
6944CJ6n0Q2q7O5pm3O9p6O7l1k4O9p8N8m2j8O2p7O7l4kL2o0R7r3M4J1o7Q7j07
$$ plain form
6706 30 -25 5 4 -42 22 -29 -13 3 -15 15 -38 1 -18 -21 -1 -17 27 -17 -4 9 -22 11 -19 15 2 -4 27 -22 15 -7 1 28
6738 28 -22 13 -13 -13 0 -7 27 -5 1 8 -13 8 -2 3 10 -14 13 -4 11 -3 -6 0 -21 5 10 -18 -11 -18 -8 -1 0 9 -11 -6 7 1 10 0 20
6777 20 -2 3 8 3 13 6 14 27 25 -5 -1 2 12 -17 7 15 0 6 -5 -22 3 -13 -21 -22 -13 -11 -20 3 -12 1 -18 -13 8 -3 6 -7 -29 12 -22
6816 -22 11 2 -8 10 -9 31 5 8 21 -3 36 -6 14 25 4 23 -15 18 13 -19 39 -2 8 20 -5 20 -26 4 -16 -28 16 -24
6848 -24 17 -15 -3 15 -34 9 -32 14 2 -35 20 -33 2 -7 -17 36 -18 31 -8 -6 15 -19 36 -16 -7 22 -29 22 -19 -1 9 -12
6880 -12 29 -24 -5 -2 -29 40 -44 12 1 -30 14 -51 25 -12 -16 -3 -51 48 -21 -4 -2 -19 35 -34 12 8 -41 41 -27 23 0 -7 26
6913 26 -23 53 -6 8 46 -46 26 -21 3 11 -45 35 -26 4 5 -37 30 -45 29 -17 -17 35 -65 37 -18 -24 37 -42 29 -17 3
6944 3 19 -31 51 -36 29 22 -21 48 -28 39 8 -16 53 -25 33 -9 -27 35 -42 25 -9 -11 21 -39 58 -35 9 20 -47 40 -67
6975f7P5Nn4R6j04Q6m0k5N4p5J01o4J9L9r6J01o5M1J8p5R0q4M3Lo2J18j16O0j0
7004A2k2N6j05J00n8k0P1r8J23r4K6L8p5R6j05N3Rl8O1p7Q0m9k2J00j14R1m4R
7032DL0p5R1o4K2K4p3J07q2L1Om5J00j18O9j1k9O0r3R6o4jO1j03J06q0K0M3p4
7061d2P5q1O0J6q6R3q4O2pn8J22j25Q0m9J2O9j30J41o9PM8r3J08j06N7K7p3R8
7089G2j17O5k2l6Q3j02J01o4j6Q9j02R3p3nO0q8J06q5L4L4q7J05q0M7Jn0R9j22
7117f0R5k6l2P1j13J29n8qN8j00J14r2K2K7n8Q9r2M7lp2J18q4M6j8j3O3j10Q6
7145B6m2OM4r4R9o9J6L2q1J16q3L2J6n1Q6r2O1Ln4O9p6O0k1k9O9o1P5o1NM7p7
7176b9O5n4M5k0m5Q1q0N3j3k8O4o9M7l2j7M9o6Q6m7ML7p6R1o1J7J7n3P2o1M3%
$$ plain form
6975 -67 8 13 -41 55 -49 37 -3 -28 26 -49 52 -12 7 46 -50 51 -14 27 45 -30 60 -24 19 22 -40 78 -38 22 12
7004 12 -10 46 -59 41 -17 -37 34 -64 59 -35 -9 29 -46 50 -55 -2 7 -31 30 -47 33 -16 -38 62 -52 39 -5 4
7032 4 34 -41 50 -14 8 32 -41 66 -16 15 21 -24 76 -42 27 16 -13 47 -46 50 -14 -15 46 -57 49 -31 -11 32 -42
7061 -42 33 -48 12 28 -58 35 -49 13 6 -52 70 -55 25 -24 -12 57 -73 68 -1 6 54 -39 69 -37 20 47 -26 72
7089 72 -45 20 -2 -38 45 -57 44 -20 -36 53 -49 44 -29 -34 26 -62 44 -41 -7 27 -60 45 -35 12 13 -37 62 -60
7117 -60 35 9 -23 48 -65 64 6 -2 56 -44 70 -22 0 27 -31 58 -34 13 10 -62 56 -28 18 0 -13 50 -60 26
7145 26 -16 -10 34 -60 39 -30 -14 18 -63 53 -30 2 18 -33 53 -39 22 25 -29 40 -36 24 3 -26 43 -18 57 -4 1 48 -29
7176 -29 36 -18 27 7 -38 43 -37 16 3 -25 39 -30 17 -15 -32 17 -49 37 -10 -6 31 -45 46 -15 2 19 -34 38 -23 20 20
7207B0l6N7o7O6l2j9L7p2Q7k6j5N2r1R2n8MJ7l7N4n6K0J4l2N5q1O3j3l4O0o2M0
7238Gj2j9L6m2N9l3RK4n2O8o7M0J5m0L1k5K4j1k9O3p1O5k4j9K3n8N7k5j2M4m8
7269b2N3m2MJ8l5N3m7K9j3j7L2l4K3j2K3J1l7K5k9OL8n0N4m5J4J7j3Rl1J5Q%J4
7302A9j8QqmQj0K0k7JK1m5K9j0K7k0L%qOJ0j6K8l4K2mj9L2l4L2%rJ3mmlJJ3nr
7341Bj6K3Mpk3J5RmJmlpLkJ0k0j0K2%OrNrrJ9Kj3K6k0jK2j9J6pj1KJ1nJ5oPnJ8
7384B8k8OJ1j3J8m1L6j2nJ2k7L4k6NKj4J4j3L1j4j9K4k8K0j1nR%L1k8jNj1K0j3
7419cJ1J8k4QpPJ9l1L9n0L0Ok4K6k6K5j3pJ9m7K6j0J5J1l8M0m6J3K4l8L8k6QK5
7453A8l7L4l7K3nj0N3o7N5k8PL3n3N2m2K0J4o4P1l7K0ql6N1m3L6lk0L2o6N1j5
$$ plain form
7207 20 -16 41 -26 40 8 -11 26 -46 41 15 0 52 -39 53 -5 -1 16 -21 33 -23 -3 11 -21 34 -47 16 3 -31 29 -33 7
7238 7 -5 -24 12 -30 29 -4 5 29 -23 45 -22 18 33 -7 24 -1 23 12 -17 46 -25 40 16 -3 20 -38 19 -6 -18 26 -22
7269 -22 31 -11 -7 11 -24 29 -18 11 -2 -19 13 -21 2 -10 13 24 -13 12 -17 -11 27 -23 31 -14 0 17 4 13 -18 -3 5 5 19
7302 19 1 9 1 -3 5 -5 15 -12 -11 10 -35 -6 -16 11 -9 -6 -6 -14 -8 2 -14 14 -20 2 -2 -21 11 -23 9 9 0 13 9 5 2 3 16 11 2
7341 2 -14 9 13 6 -17 -2 7 3 4 0 -3 -10 -7 -9 1 -19 -29 -7 -7 -1 -10 -5 -14 -23 -4 -2 -15 11 -9 -10 12 -7 9 2 -9 -7 4 -1 14 8 15 10 28
7384 28 0 6 17 4 22 -19 17 5 0 12 -15 19 -7 -2 0 -14 0 -13 18 4 -15 9 -19 1 -10 -15 -6 -6 25 -3 -4 1 -10 10 -3
7419 -3 8 26 2 10 3 10 29 -2 37 -13 17 23 -1 25 -1 24 11 4 23 -24 2 -8 7 18 -20 20 -26 -13 11 -27 11 -15 -7 18
7453 18 -19 15 -22 1 -4 -14 39 -28 27 -1 6 39 -14 38 -4 16 30 -34 37 0 20 12 -24 27 -16 20 17 -3 29 -37 14 -1
7485aqK4l9M3k8JK3m4M0l0J6J4l9N9m4L3j1k6M8n4N3l3J5Kl8O2l5K1mk5M9n8K4
7518A0J7n6P3o6L2kj2N2q5O0k6k0N7p1N6m1PK5n0P8p5K8L8o4Q2n9J8L5o3O2p4
7549c4O5j2k7N2o8N8m3PL8p0Q5p2L5K5n4O9p9M6on5Q7p9N1m2j0P1r8P9m0K1L7
7580C7q6Q1m2%K4n8R8p8L8Mn3R1q3O0j8l3Q0q9O5j7k8M8p7P8o6M6J4p5Q4p1L4
7611HKm3P9q4L6Nm0P4r5O9k6lN0q5R0o3qO9p9R6q2M6Oo0Q3p2P2l9k3Q7j16Q0k7
7644GJN3r9P5m3J5J5o5J00o5J4K1o3P6j07P5j1l0P1j01Q7k5m0Q3q7Q3o0LM9o4
7674c2P4n8L5J5o3O2n1N2pm3P7q2N1j7k7N0p9R6n2J1J3n0Q0q4K4L9p9Q6p0M6q
7705In5Q0p9P4l2k5Q2r5P3l1j5N9r1Q1l3j4N8o2O2p2L6J6n5P5o9M7j1m4P6q1N6
$$ plain form
7485 -1 -9 15 -24 19 -9 -8 15 -29 11 -19 -3 11 -28 31 -13 20 9 -17 31 -23 30 -3 12 14 -24 38 3 24 20 -5 44 -14 10
7518 10 27 -29 44 -22 10 8 -4 48 -37 23 -3 -23 34 -37 19 -22 -15 10 -40 38 -37 -9 29 -35 47 -12 6 41 -22 40 -34
7549 -34 31 19 -8 44 -24 34 -9 -2 36 -34 51 -21 14 39 -15 54 -25 21 15 -40 47 -32 19 -23 -33 38 -60 19 -21 0 37
7580 37 -49 32 -10 -10 14 -44 54 -24 14 18 -35 56 -27 33 15 -18 62 -27 38 21 -7 41 -36 42 -24 22 36 -39 45 -26 8
7611 8 10 -33 46 -38 -2 3 -37 37 -58 11 -15 -18 32 -53 37 -26 -34 35 -44 52 -30 16 22 -38 45 -27 45 6 -17 70 -46 34 7
7644 7 8 61 -38 37 -6 9 24 -41 59 -6 8 29 -34 42 -65 10 -1 -31 40 -61 26 1 -39 44 -43 40 -20 -17 32 -32
7674 -32 42 -16 19 34 -29 33 -18 34 27 -16 61 -21 30 13 -14 36 -43 53 1 12 25 -25 55 -29 -5 34 -45 41 -29 17 9
7705 9 -46 34 -45 29 -3 -28 54 -41 32 1 -14 45 -46 35 2 -12 46 -16 46 -26 10 26 -29 46 -23 24 13 -31 45 -36 20
7736B0j8k2O8p7O8l9k2N2p9O7m0M1j4m9R2p4L7Nn0P2p2N8l2jL7p6Q4m0JK0l3O9
7768E3o6K4Ol6N9o9N9rl8M2n6N5l8k1O5o5N2k1j8L7p1N6j6OK0m5P5n2J3j5j4N6
7800B8p3O5k3j4N2o7P0m4%N1o3N0l9RK8n5P7o7K6Mj7M7n3L0k7j0N5p6N7m2JL0
7832A0l7M5l1MJ1k3L9l5K1Qn8Q2n6L7qk2M3l9L8k3J0Kk0J3j6J5Nk5L9l4J6Pl0
7865a2M7m9K6j0nKk4K1lj2L9m7M3k9PJ8k5L3n2L6Oj5K2k9KRrK8j8J9%nJ8m2L0
7900B0j8OJ6l9L3k2J5kKq%j0J0qK2l2Qj1RJ4j9J0qKKRkj6mJ7MQj1Rj1RJ3J4k2
7939IJ3j2Jj2J9rNrK3qj5K3k6MrLj3JNj4K6j8mJ0j2K3J0k0rOK3l7K4J7j1J4l3
7976a2J5Mk4K2oknK3J5l1K0mlj1%J6pNKk5K6j8J6j3k0K4l1L6k8NK4m3L9j5%J4
$$ plain form
7736 20 2 -20 48 -29 39 0 -22 30 -49 18 -22 19 5 -44 48 -26 11 16 -34 38 -34 24 -8 -9 28 -48 36 -4 -3 17 -16 53
7768 53 -13 11 17 -19 40 -29 30 21 -17 25 -31 24 -14 -35 30 -35 17 -4 -22 15 -56 0 -16 -10 10 -35 40 -12 1 -14 -28 28
7800 28 -45 20 -3 -17 35 -32 38 -6 -6 45 -18 32 -7 2 30 -25 52 -15 11 15 -2 45 -8 22 -5 -15 40 -36 21 -21 -20 10
7832 10 -27 18 -13 -9 2 -21 18 -17 4 12 -46 36 -20 17 9 -13 30 -9 29 6 16 18 -2 11 -5 10 15 -10 29 -5 11 18 -12
7865 -12 35 -14 12 2 -3 -1 -25 -4 -7 -19 20 -27 16 -13 -6 12 -13 20 -32 4 10 -5 17 -12 -10 -1 -10 18 0 19 19 14 32 -10 20
7900 20 2 8 24 -15 18 -4 11 9 11 3 3 -7 3 -5 17 -15 -7 -18 -9 5 -14 -4 -12 -10 -8 1 -1 -17 -21 -4 0 8 -3 6 -5 4 17 31 9
7939 9 22 10 11 -1 18 9 14 5 28 20 5 28 2 6 -3 0 -13 -12 -7 -21 5 -13 -17 -7 -19 4 14 -6 -15 -9 14 -23 1 18 7 21 -12
7976 -12 3 7 -17 5 -1 -3 -8 15 30 -1 19 15 12 1 1 17 10 15 17 -8 18 0 16 3 -17 7 -24 12 -16 -11 13 -30 9 -6 -6 8
8012Hl9N2m9L0J0mJ5l8K9j5lL6n3M6k4J1Rl4L2k4J2K1m7N4l4Qmk6M4m4J4%QJ5
8046A6m3L0j0%K1n3M0j9RL7m4J8j0J9Pl4M3m6L3%k4N4o8M6nqL2n9L5j6MK9o1N0
8080B3m7L2nk5M3n0K5J0l0L8n1M1k3kM7p4N5nqL4n8N2n0M2Po3P3o1L9J1m6P7q4
8113c3O7j2l8N0p2O5l4JL5n2O2o8L0Pm5O1n8L1j2j1O4q1N1j4j9N0p0N0k3pM5o1
8145d1N4l4K0K9m8P1o8K7J5m6Q8p7K6nl2P0q5P2l2qM0p7Q9n5J2mm6O9o9N8jm6
8177c4Q2r2O4j9k3N6o4O0l8mL4n9O4k5
$$ plain form
8012 8 -31 21 -28 2 12 8 23 -15 14 -1 -4 32 -21 25 1 12 21 -13 19 -5 7 28 -19 35 1 9 5 -21 23 -21 -7 -7 1 16
8046 16 -27 3 -7 -7 14 -39 1 -18 -9 28 -16 2 -8 11 18 -16 27 -19 14 14 -10 44 -24 22 17 9 41 -18 17 1 5 34 -27 23
8080 23 -24 8 3 -22 21 -29 -4 6 -24 14 -37 4 -19 -21 26 -48 7 2 -6 28 -30 22 -28 14 21 -42 31 -30 9 20 -26 51 -33
8113 -33 34 22 -16 34 -38 27 -7 -6 29 -23 39 -29 1 8 -37 24 -34 -3 -15 -26 38 -43 8 -6 -25 25 -45 5 -18 -25 20 -41
8145 -41 13 -21 -1 28 -20 51 -17 10 25 -21 67 -10 16 11 -21 49 -36 36 4 -4 36 -41 48 -7 5 1 -45 24 -45 13 12 -34
8177 -34 48 -44 20 1 -22 34 -30 30 -8 -12 22 -37 27 2
8191B
$$ Imaginary data points
##PAGE= N=2
##DATA TABLE= (X++(I..I)), XYDATA
0@%%%%%%%%%Qj6K4l2M0m8N6p2R6j20J44j78K18k64L12l68M34n06N88o82P87r05
31d84J038j186J351j531J728j947K187k452K744l064L413l794M212m667N160n700
47b992O293o937P641q414R264j0201J1237j2388J3672j5115J6744j8602K0749
60A0951k3255K6228k9822L4271l9946M7472n8030P4198j03684K43178m97712L83481
72F7330j66457k8125N45359q02757P62093o06891Q1172L47051m19452P09572q01317
83c12422K12859K27565l59194O72259p47742M61890j69413l08015O76351n51736
93a97598N08262m64092j30080N93043n55293N86364m93872P4806K42139n44695
103c81016P50030m50704J50667n3301l99837P63461n41240L15199j32597k78403
$$ plain form
0 0 0 0 0 0 0 0 0 0 0 8 -8 16 -16 24 -24 32 -40 56 -64 80 -98 120 -144 168 -200 234 -272 316 -366 421 -484
31 -484 554 -632 719 -812 916 -1031 1156 -1296 1448 -1616 1797 -1997 2215 -2452 2708 -2992
47 -2992 3301 -3636 4005 -4409 4855 -5346 5891 -6497 7175 -7940 8804 -9798 10951
60 10951 -12304 13924 -15898 18373 -21573 25899 -32131 42067 -61617 181561 -316151 67330
72 67330 -99127 -127252 418107 -384650 377443 -229448 -148276 198775 -220677 488895 -312422
83 -312422 -99563 128002 -231192 441067 -306675 155215 -14198 -322213 354138 -197598
93 -197598 310664 -153428 -283508 309535 -245758 340606 -153266 -78460 163679 -381016
103 -381016 369014 -81690 68977 15676 -384161 379300 -161940 153259 20662 -257741
113b57741N15808n80089N91039j95223k33136K93624n05438P02499l45473m3603
123e7733K14120m91706N83070m16149K71803J04324n15254M71558m12960M46150
133A97223n7095l62397M27779m99714M45149j29657p9316L23154o03856M45339
143A06609j72767J08892J95234n32028M55857l27801J88852J53295l35757L90952
153B31338n00279K74045J05147j84752L25102n23550L33735o8966p5965L39322
163B55177m40700L15586k71969M9213L25102l61517L14386l70256J30679J83668
173A29369k68348L87007l92756J42377j076j47932M25479l90734J83724j34217
183f7107p5691L51716l36928K93364k28042n9507K23423k49244L80227k86425
$$ plain form
113 -257741 258067 -322022 269017 73794 -159342 134282 -371156 331343 -14130 -57733
123 -57733 156387 -335319 247751 -168398 103405 207729 -307525 164033 -248927 197223
133 197223 140128 -222269 205510 -294204 150945 21288 -58028 265126 -338730 106609
143 106609 -66158 42734 237968 -294060 161797 -166004 22848 176143 -159614 231338
153 231338 -268941 5104 110251 -74501 250601 -272949 60786 -8180 -84145 255177
163 255177 -185523 130063 -141906 -92693 232409 -129108 185278 -184978 -54299 129369
173 129369 -138979 248028 -144728 -2351 -3427 -151359 274120 -116614 67110 -67107
183 -67107 -142798 208918 -128010 165354 -62688 -122195 101228 -148016 232211 -54214
193e4214p908R7121k06139L84209k76614J08027k5538k07146L32032k31386K23319
204A35763j16971j75483K45784k23742K92946j40917q4077J33437k53529L16458
214A29669j31229K9979L9026k61111K87120j51066J36038J698k18193K10833k04903
225a32139K14432n294j35137J36267k52441K37191l2905k7670J03401k64540K03341
236D4506r2761P4587R7764k29117J56239j64191J31103Q1687j47447J35195k20110
247a32545J32029L5619m9426J39942k33302J08957l7656K0586J45754j91810R8817
258C6965j17064M3128J27436j17455J14330j68549L5562P2662n1528J42784j68828
269e0557L0177p053k1143J57263j26698M9033p8520k2887J34140p5266R1010j10604
$$ plain form
193 -54214 -62122 34999 -171140 213069 -63545 44482 18944 -188202 143830 -87556 135763
204 135763 18792 -156691 89093 -134649 158297 17380 -66697 66740 -186789 129669
214 129669 -1560 28419 67445 -193666 93454 -57612 78426 80124 -138069 72764 -132139
225 -132139 82293 76999 -58138 78129 -174312 62879 29974 2304 105705 -158835 44506
236 44506 -48255 26332 124096 -105021 51218 -112973 18130 99817 -47630 87565 -132545
247 -132545 -516 35103 -14323 125619 -107683 1274 -36382 -15796 129958 -61852 36965
258 36965 -80099 -36971 90465 -26990 87340 -81209 -45647 27015 -24513 118271 -50557
269 -50557 -20380 -27433 -48576 108687 -18011 31022 -47498 -70385 63755 -11511 79499 -31105
281c1105l1857P3293m5609J31865r7859k0896J441m7209J41715o1911J9402m7377
293a6107o4165J08854l4202P2073n5441o8429M9596l4359J06291l1672m2308l697
305a3566n6822J00914l948P319k4678p6767O0046J710N3752j0358p0526R943j9754
318d2735P0046J8391l4244j8966m9947M8175L3402J3064j3321o2670N011K0527
330a3267M2709J5295m4150k9722j0694L6929M0457l795l4681l5403J461M1517
342F656L2231j1082l2741l8646J8292L9575K0050j724n7417r450J3046L4672L7245
355E0707m5905j7225l0182K3652N7056j7027N013o3091q43M3017N507M5315o8476
368a2482j4863K782N379P7715m9819r00l9732j4066Q0647k7302L8670o2002l2547
$$ plain form
281 -31105 -62962 10331 -35278 96587 -1272 -22168 -20727 -67936 73779 11868 31270 -16107
293 -16107 -80272 28582 -5620 66453 11012 -57417 -7821 -42180 64111 32439 -9869 -13566
305 -13566 -70388 30526 26578 33897 9219 -67548 -7502 -5792 47960 37602 -32924 -22981 -42735
318 -42735 27311 45702 11458 -7508 -57455 -9280 24122 37186 23865 -38805 -33794 -13267
330 -13267 29442 44737 587 -29135 -39829 -2900 37557 33762 -919 -36322 -34861 6656
342 6656 38887 27805 -4936 -43582 -25290 14285 34335 32611 -24806 -34256 -21210 13462 50707
355 50707 4802 -12423 -42605 -18953 38103 21076 26089 -37002 -37845 5172 10679 55994 -12482
368 -12482 -27345 -24563 -19184 58531 8712 7812 -31920 -45986 34661 7359 46029 -15973 -48520
381d8520N1876k1600Q2557n8358k7862Q622l7904J05819m2805O951k5025o1581
393f7830R6612l7128N8239l5714o9374O3803n3463J00932k9722m6135K9033q4448
405g5195J15885k6728L544J0530j08233J02350m3694N8256J0017j04225P6703
416A9210q0989R4702J2351o7736N9236j21300J03271j726j3358N8351j41402R3275
428A3885m0072L5281O4926j28260Q3999r2429O2067O0014q7902Q8833j36343O8617
440g384K9343m0628J05284j52326P0557k5355n724J16850j37323Q3997q5613J1586
452c6736J04423j05340J12923j28479K1417O1004p5358J45077j42676L9904j334
463e175n7389J58896j34597P7039n9406m8217J39276j19264J26776r7014l3871
$$ plain form
381 -48520 3356 -18244 64313 5955 -21907 -13285 -51189 54630 11825 18776 -6249 -67830
393 -67830 28782 -8346 49893 14179 -55195 8608 -44855 56077 26355 -19780 9253 -75195
405 -75195 40690 13962 17506 28036 -80197 22153 -21541 36715 46732 -57493 19210
416 19210 -61779 32923 45274 -22462 36774 -84526 18745 17019 3661 62012 -79390 13885
428 13885 -26187 9094 74020 -54240 29759 -62670 -603 59411 -28491 60342 -76001 -7384
440 -7384 21959 -18669 86615 -65711 4846 -20509 -26233 90617 -46706 37291 -48322 -36736
452 -36736 67687 -37653 75270 -53209 -31792 29212 -46146 98931 -43745 -3841 -5175
463 -5175 -62564 96332 -38265 38774 -20632 -68849 70427 -48837 77939 -19075 -52946
474e2946R1446j09690J67106j12627J481L4781j10176J77662j14716N8714j3764
485A7271j09823J57251j17817J17802m5554q7990J18148j33633J57007o1151l7232
496b5721P3746j54597J70212p5300K6536L7961j56257J60281j06568Q4249J9022
507E3564j26589J33139j50095J27964K382p6806J06745j78881J49209l6764j7810
518a3942R7619j80133J44190r4308M3751R0122j60328J35168j43413Q7033N5667
529F1426j17617J44924j75795R9099j44n4985J54943j93023J07219n4794n007
540c3754J36451j77844J37372j09619J3224R8795j29013J67055j61534L2261N6385
551B9779q8837J70979j76732P7483o328p8102J64791j50962J21384q1649n8346
$$ plain form
474 -52946 38500 -71190 95916 -16711 -15230 19551 -90625 87037 -27679 31035 17271
485 17271 -92552 64699 -53118 64684 19130 -68860 49288 -84345 72662 11511 -25721
496 -25721 48025 -106572 63640 -11660 14876 52837 -103420 56861 -49707 34542 53564
507 53564 -73025 60114 -89981 37983 40365 -36441 70304 -108577 40632 3868 -13942
518 -13942 83677 -96456 47734 -46574 -2823 87299 -73029 62139 -81274 5759 61426
529 61426 -56191 88733 -87062 12037 11893 -43092 111851 -81172 26047 -28747 -33754
540 -33754 102697 -75147 62225 -47394 -34170 64625 -64388 102667 -58867 -26606 29779
551 29779 -59058 111921 -64811 12672 6344 -71758 93033 -57929 63455 -18194 -76540
562g6540J51146j34040J46787j20155r563R7631j42752J77610j17267L4755J7152
573B4764j32556K01893j28371P1174k8273r4610J70493j59960J33064l9120o7359
584d8861J03543j63603J91724p2450l5498O9330j46878J86115j20056M2479N7091
595F2936j49915J45112j34276J21955J3072j36567J35271j41672J37258l8012
605A5162o0293J32595j80542J26219n4026K1832R0233j94756J47255q1018M6275
616H936N0227j35970J60595j52844O0761M5476p1152J29825j94883J09643J0072
627B0686n3269J14087j62972J36489q1105k4504J32248j30684J20729j40170L8814
638b9651J02628j31489J34434j34904O8443J2722j01601J79037j38773O3277m6714
$$ plain form
562 -76540 74606 -59434 87353 -32802 -42365 55266 -87486 90124 -27143 7612 24764
573 24764 -107792 94101 -34270 36904 8631 -85979 84514 -75446 57618 18498 -48861
584 -48861 54682 -108921 82803 10353 -25145 44185 -102693 83422 -36634 5845 62936
595 62936 -86979 58133 -76143 45812 58884 -77683 57588 -84084 53174 15162
605 15162 -45131 87464 -93078 33141 -20885 947 91180 -103576 43679 -37339 8936
616 8936 59163 -76807 83788 -69056 -8295 37181 -33971 95854 -99029 10614 20686
627 20686 -32583 81504 -81468 55021 -26084 -50588 81660 -49024 71705 -68465 -29651
638 -29651 72977 -58512 75922 -58982 9461 22183 -79418 99619 -39154 24123 -22591
649b2591m0097J65945j62242J01163n9512j9855R5322j40630J67794r3369k3836
660c1908N1983r3325J75120j36789K7243L3984r2793J34893j26781J05683j8598
671B8712j05181J20606j00738J29749p2787n4720J09989j25595J23601p1433J9634
682A837N3746j52604J42997o6515N0488K809j16671J47299j12975P1972L165o2862
694c7314J01375j54082J18338m476l8067O5618j40363J37656o0564k977P3073
705E8217j16348J08336j08652N7400O4142j08155R2794j15568Q5909J1760p3668
716d3833J12172j22539P2335l2782j3088J10537j36151P6496n3194J5921P3464
727E9338j13067J07744q5588J3258M3242o5064J17919j19331L0981J9571m4255
$$ plain form
649 -22591 -62688 103257 -58985 42178 -17334 -37189 58133 -82497 85297 -8072 -31908
660 -31908 20075 -73250 101870 -34919 -7676 26308 -66485 68408 -58373 47310 28712
671 28712 -76469 44137 -56601 73148 361 -54359 55630 -69965 53636 -17797 1837
682 1837 55583 -97021 45976 -20539 29949 32758 -83913 63386 -49589 22383 25548 -37314
694 -37314 64061 -90021 28317 23841 -14226 51392 -88971 48685 -11879 -14856 58217
705 58217 -58131 50205 -58447 -1047 63095 -45060 47734 -67834 18075 29835 -43833
716 -43833 68339 -54200 18135 -14647 -27735 82802 -53349 23147 -30047 -14126 59338
727 59338 -53729 54015 -31573 -18315 24927 -40137 77782 -41549 -10568 9003 -35252
738c5252J04006j13455O8496k6119m3663R5600q5765Q9349p1552k3130P9762p8297
750d0020R8259q1019J1129L5368q1310J12520p2982L5409j0486o7354J11370p8346
762b7462N9434k8159m4935P9058q7473R0716l3415k6091M2234q4424J04977m7069
774b609K515K4090p8330Q9943o0924M2096J2944p1504O8053o8790O8046k675m8336
787b5481N5496p9183P0447j7231j0571M5623q7343O4747l2027K0132L4472p7112
799c8031O0811n4133L4899K4708n0023N6666p5267M1394J0309k2528N3617p9969
811c7547M4566j5062l103N2471o7541M5929m2765R095M4845m8549N0236n9021
823b6446J5291K4390l0846N7799o0368J9155k595j8367N9874n1672K7481k4823
$$ plain form
738 -35252 68754 -44701 23795 -2324 -45987 49613 -36152 53197 -18355 -41485 38277 -40020
750 -40020 58239 -22780 -11651 23717 -57593 54927 -18055 17354 6868 -60486 50884 -27462
762 -27462 31972 3813 -41122 37936 -49537 41179 7764 -18327 23907 -60517 44460 -2609
774 -2609 -94 23996 -54334 35609 -25315 16781 29725 -41779 26274 -42516 25530 22855 -25481
787 -25481 30015 -49168 21279 4048 -6523 39100 -48243 16504 -15523 4609 39081 -38031
799 -38031 22780 -31353 3546 28254 -21769 34897 -40370 1024 11333 -11195 42422 -37547
811 -37547 7019 -8043 -11146 41325 -26216 19713 -23052 -13957 30888 -17661 32575 -26446
823 -26446 -11155 13235 -17611 40188 -20180 -1025 -3620 -21987 37887 -13785 13696 -11127
835a1127j2776M9365l9293M1107l6272r818K9030k9978N2407l6899j698O891k7460
848b6521N3692l0899J3678r585k8102M3543k5830L0842j6317k4217K6365k6743
860b0094M1926j5126j2025R912l1683M1977j2762N807P89l4054L1934j5029K1917
873A3489j51k8341J8408k2419K9334J964j4392R133k9910K5897R10K206P478l1257
887a7651J6128o038J3591J0587k3457P505j6117J5254J2357r628N351k2985Q942
900f161Q231K901R249k1585J081j486P943J4061j2142k197j1284M519J3944l40
914F734J170j4744l092P074O856P646r549q428k752N884J1166R22p515q949j257
929h834P950R918j700p066q753l84J2061L553K038j1317p865O695L240J2767q077
$$ plain form
835 -11127 -23903 25462 -13831 27276 -8996 -18814 10216 -19762 32645 -4254 -5952 939 -26521
848 -26521 27171 -3728 9950 365 -27737 15806 -10024 20818 4501 -19716 6649 -20094
860 -20094 21832 6706 -5319 4593 -27090 14887 2125 7932 8721 -25333 6601 -8428 13489
873 13489 13338 -15003 3405 -19014 10320 12284 -2108 7025 -22885 3012 3922 6128 13606 -17651
887 -17651 -1523 -7561 6030 16617 -6840 665 -15452 -198 12159 2531 7882 -15103 -6161
900 -6161 2070 4971 14220 -7365 -6284 -7770 173 14234 2092 -105 -11389 -6870 7074 6734
914 6734 7904 -6840 -9932 -2858 3998 11644 2095 -6333 -9085 -3201 7965 8887 1372 -7577 -8834
929 -8834 -884 9034 7334 268 -8485 -8869 3192 6745 8783 -2534 -10399 -3704 -464 12303 4226
944D226q761j685l300J8683k978j594p192j1646J6863j618J0067o957j5594R816
958a670o775J9755l255j1336L162j6077K2807j347l41J104k3516J9426n567J1983
972H353L496k3869J4010j5727J9973N725j5895J1589k7012K1532K763l458J3688
985A5168l3199J9324p224P513J7286l0893J8265k1243J3306J7031k1713K1356
997A4977l3086J4574R358j0833K7362l7770J5458m777l170L1461l4566K0034k0327
1010a1305J70K8783k7168K8846l1451K251J7892k0650L8215l5361P541K150j7646
1023a7733M2568l3810J8396j2906j6426L8455l1169L2485k2935j2434K6832l1119
1035a9796M4339k7368k121J2076l3236M9124k9536J3815o22l3257M5188l3631
$$ plain form
944 4226 -4535 -6220 -9520 9163 6185 4591 -2601 -14247 2616 998 11065 4108 -11486 -1670
958 -1670 -8445 11310 8055 -3281 -119 -16196 6611 5264 4923 6027 -17489 1937 -3630 8353
972 8353 11849 -12020 1990 -13737 6236 11961 -3934 7655 -19357 2175 4938 1480 15168
985 15168 -18031 1293 -5931 1582 18868 -12025 6240 -15003 -1697 15334 -6379 14977
997 14977 -18109 -3535 5823 -5010 22352 -15418 40 -4737 -7907 23554 -11012 9022 -11305
1010 -11305 -11135 17648 -9520 19326 -12125 -9874 8018 -12632 25583 -9778 -2237 -87 -17733
1023 -17733 24835 -8975 9421 -3485 -19911 18544 -12625 19860 -3075 -15509 11323 -19796
1035 -19796 24543 -2825 -4946 7130 -26106 23018 -6518 7297 6675 -26582 18606 -15025
1047a5025L1043q612k7130L4992m0239M4090j4058j3786K3999m6042M8932k1154
1059b990M424J6262m7031M5885l1418K2590J0521m0573M0074m2768L4837K834
1071A2647k6269L6317n2134L9213q501p537L3595n5715M0555k3052Q310K8456
1083B5885m9366M3189l9851J7991K0037l5112M5724n3823K5739O622k1076M6253
1095C2212n7461L4544j3670j0697M4983n1361M2152l4891P9L7769m3969M9049
1107B8739m6745J1903J9392l7559N7199m9368K1474l427k7854N9510n1028L2654
1119A4890j8751j7393M7587n1288M9665k7981j0324K9066m5600O2074l8573J682
1131d946J5941m0548N9082m5817K4707L925m0501M9839m5323M4715j2881l1879
$$ plain form
1047 -15025 16018 7406 -19724 15268 -24971 19119 5061 -8725 15274 -30768 18164 -2990
1059 -2990 1434 17696 -29335 16550 -14868 7722 18243 -22330 17744 -25024 9813 12647
1071 12647 -13622 22695 -29439 9774 1273 -6264 27331 -28384 12171 -10881 -2571 25885
1083 25885 -23481 19708 -20143 -2152 17885 -17227 28497 -25326 413 7035 -14041 32212
1095 32212 -25249 9295 -4375 -15072 29911 -21450 20702 -14189 -14110 23659 -20310 28739
1107 28739 -18006 -6103 13289 -24270 32929 -16439 5035 1608 -26246 33264 -17764 14890
1119 14890 -3861 -21254 26333 -24955 24710 -3271 -13595 15471 -30129 31945 -6628 -4946
1131 -4946 10995 -29553 29529 -16288 8419 12344 -28157 21682 -23641 21074 8193 -23686
1143b3686M4349m8457N0483k4488p974L4142n8457N2840k7789J4201J6023n6960
1155c5773N8064l8741K5038N069l7917N3158n8652L7438K086k0508L8327o5197
1167c7608N2744j3261j0405L3274n4683N3359l9444Q051L4952m7633M4269n1662
1179b8047K9769J9450m3254M8523n0600L3697p582k3512N7546n6800L0694k0989
1191a1105o06M5827o1123M5023k7986L046K4101m4713O1821m6853M404J4840k6441
1204a9765N6778n9964K6034L995k7304M5310m9607M7985k3095k5407M5098l9844
1216a9786M9425m1694j698L5733m8435M9906l6576J9958O699m9435O1104l5938
1228a0737K4342j1768k8813N6645n2564L5253q994j3386L1351n7618N6719j5768
$$ plain form
1143 -23686 20663 -27794 22689 -1799 -9773 24369 -34088 18752 -9037 5164 21187 -35773
1155 -35773 22291 -16450 8588 13657 -24260 28898 -29754 7684 9770 -10738 27589 -37608
1167 -37608 15136 1875 -8530 24744 -29939 23420 -16024 -7973 26979 -20654 23615 -28047
1179 -28047 1722 21172 -22082 26441 -24159 9538 1956 -21556 35990 -20810 9884 -11105
1191 -11105 -11711 34116 -27007 18016 -9970 -6924 17177 -27536 34285 -12568 -8164 6676 -19765
1204 -19765 37013 -22951 3083 7078 -20226 25084 -24523 23462 367 -25040 20058 -19786
1216 -19786 29639 -12055 -13753 21980 -26455 23451 -13125 6833 13532 -35903 25201 -10737
1228 -10737 13605 1837 -26976 29669 -22895 12358 3364 -10022 21329 -36289 20430 4662
1240D662j0160J8344m4028N8316l7904P325K1676l8952M0943m6421L5140J1016
1252A9957m0409L6810m1695M2086j2297k1819M3460m8615L4055k1822O682L3364
1264B9757n7314L9734k4555J5691J3951m2676N0951m1831J4982P680j9344M4507
1276C1533n7564K8260J638j2895L3019m9463M2510k1449j0000L3638l5233M0270
1288B4264m1034O568K8542l4298L8055l9479K0587N435l1372M6639l5314K1581
1300A0174j3977j6056M5742m0818K7428j7438n262K7651m0484M2880k1754l334
1312e248J2447l0048M7865l2659P149P121k5074L8027l5911K6588k117k5221L0043
1325A2962l1774L6531j5525j4655K6447l3776L5217k0830M219J6643l8117L5220
$$ plain form
1240 4662 -5498 12846 -31182 27134 -10770 -3445 18231 -20721 20222 -26199 8941 19957
1252 19957 -20452 16358 -25337 16749 4452 -17367 26093 -22522 11533 -10289 -3607 29757
1264 29757 -27557 12177 -12378 3313 17264 -25412 25539 -16292 -1310 6370 -12974 31533
1276 31533 -26031 2229 3867 -9028 23991 -25472 17038 -4411 -14411 19227 -16006 24264
1288 24264 -16770 -10202 18340 -15958 22097 -17382 3205 8640 -22732 23907 -11407 10174
1300 10174 -3803 -19859 25883 -14935 12493 -4945 -10207 17444 -23040 19840 -1914 -5248
1312 -5248 7199 -22849 25016 -7643 -494 6627 -18447 19580 -16331 10257 8140 -17081 12962
1325 12962 -18812 17719 2194 -12461 13986 -19790 15427 -5403 -1184 15459 -22658 12562
1337A2562k1803J5968M450l1234L5262k9467K1012l79j7148K8088l7930K7249
1349F630l761o931J9918l6722L0987j4129J125J7540k9685K7919k5297J0844J4449
1362A2887k3430K4843k9780J7235M644j5778K6141l0178J8070o894n708K5684
1374A7736k9353J9646j5110J300J9197k4626K4485k1400M259J0229j6976K7616
1386A7003k5494Q335J347j1531K6135k4645J5000p639q749K1682k0629K0828j4568
1399b925m815J4921j7834K3961j6801J347O284j6665K4328j6062Q066j262j4668
1412a2125K1206j5797J4148n120j0809J5046j6685J8469o568n122Q729j7397J9275
1425G250q028J905M621j6698J6551j0534Q547K449j3614J2602j3593J2351O01
$$ plain form
1337 12562 -9241 6727 11177 -20057 15205 -14262 6750 6371 -10777 17311 -20619 6630
1349 6630 2869 -4062 15856 -20866 10121 -4008 -2883 14657 -15028 12891 -12406 -1562 12887
1362 12887 -10543 14300 -15480 1755 6399 -9379 16762 -13416 4654 -2240 -7948 17736
1374 17736 -11617 8029 -7081 -5781 13416 -11210 13275 -8125 -3866 6363 -10613 17003
1386 17003 -8491 -156 1191 -10340 15795 -8850 6150 -1489 -10238 11444 -9185 11643 -2925
1399 -2925 -7740 7181 -10653 13308 -3493 -2146 4138 -12527 11801 -4261 3805 2543 -12125
1412 -12125 9081 -6716 7432 2312 -8497 6549 -10136 8333 1765 -3357 5372 -12025 7250
1425 7250 -778 1127 5748 -10950 5601 -4933 3614 6063 -7551 5051 -8542 3809 4410
1438D410p818R504j5995J2765k186j012P809j5979J1137o230M169O770j2742R332
1452C934j0472O471N066p493Q587j3035O417J625k426Q811j2509N468k926O29
1466a853Q674r385N330o860J278O869n312O444q524O98L204k288P794p460O22
1481g69j015j314P817m683K004l962j953N740k006M179m484k473K178r32N630
1496C957k759j638j148j627N159l35M18k567k759K627J080K488j548k918n75P32
1512a413L058Q26j596k580o02J471K806L97k256j531j506L315J481n2j050m075
1528c307K372O07K490N75m722J270k127L897J977l133J219n286L881J662n10K541
1544C406p155L202p83J718M218o864L177m418K651M682m890M542p639K721K895
$$ plain form
1438 4410 -3408 6096 -9899 2866 680 -332 7477 -8502 2635 -3595 574 7344 -5398 3934
1452 3934 -6538 -67 4999 -2494 6093 -6942 -525 1100 -1326 7485 -5024 444 -2482 -1853
1466 -1853 6821 -2564 2766 -4094 -2816 4053 -1259 5185 -3339 -2641 563 -1725 6069 -1391 -769
1481 -769 -1784 -3098 4719 36 2040 -1922 -3875 1865 -141 4038 -446 -2919 -741 -1673 3957
1496 3957 1198 -440 -1588 -3215 1944 1609 2027 -540 -3299 -672 408 2896 1348 -1570 -2145 -1413
1512 -1413 1645 2471 875 -1705 -2307 -836 1970 2367 111 -1420 -2926 389 1870 1818 768 -3307
1528 -3307 -935 -328 2162 2737 -1985 -715 -2842 1055 3032 -101 1118 -4168 -287 1375 865 3406
1544 3406 -3749 -547 -1330 388 4606 -2258 919 -3499 -848 3834 -1056 3486 -4153 -1432 1463
1559A463k574O721r028L026p83j060Q308q525M621m893n29P854p014P501p963
1574b875k8N096n758J0443r183J567R43n345J1864r057M820l024n233J0928q751
1589c593Q915n689m184P958r151J2374p020j297M148j0039J3888p995L343Q82
1603B540j0306J3046r545Q381j411q684J0697j1911J2286l350m703Q062j4132
1616i030J4093n870P62N863j4760J4040r414O110L915j2747J3066j3520R971J463
1630C942q425J2045j6750J2200k311l278J1199j7526J3273p505J401J0068j5734
1643g401J3949j2764N108P367j2386J4953j6344P847K333q361J6073j7731J0105
1656B748l820m342J5588j7376J3083r326j021J2206j5399J6870j3670J887O901
$$ plain form
1559 1463 -1111 5610 -3418 -392 -1175 -2235 6073 -2452 2169 -2724 -3253 4601 -2413 5088 -2875
1574 -2875 -2903 2193 -3565 6878 -2305 -738 205 -5140 6724 -2333 2487 -537 -5770 5158 -3593
1589 -3593 5322 -367 -4551 3407 -5744 6630 -390 -1687 2461 -7578 6310 -1685 1658 2540
1603 2540 -7766 5280 -4265 4116 2705 -5979 4718 -7193 5093 1743 -2960 5102 -9030
1616 -9030 5063 -807 -45 5818 -8942 5098 -4316 1794 5709 -7038 6028 -7492 2479 3942
1630 3942 -4483 7562 -9188 3012 701 -2577 8622 -8904 4369 -3136 -1735 8333 -7401
1643 -7401 6548 -6216 -1108 6259 -6127 8826 -7518 329 2662 -5699 10374 -7357 2748
1656 2748 -1072 -5414 10174 -7202 5881 -3445 -4466 7740 -7659 9211 -4459 -2572 4329
1669D329j2481J9317j6676O169J176j0081J8663j7345J2067m818q109J6057j6423
1682h155J6922j0273l981J2163j6301J9319j3076K497O283j6593K0424j4113Q304
1695C420R2j4073J9768j6685J2830l322q858J5579j9822J7608n561m004J0364
1708G336j9716K0626j0440J204P914j7189J9008j6111Q704N788j5164J6186j8483
1721a0337J4804l17j1070J6342j9459J5597p166k549J5634k1659J5837j0853M650
1734e46J0012k0154J9438j5089O620M163j2668K0947k1602R359J147o713J7168
1747A2082k3142J5945m978n456J4373j8019J9303j4513j466J3788j5131J7856
1759A0642j8410O676P618j6064J9233j6098J0756l042j2246K2281j7198J1341
$$ plain form
1669 4329 -8152 11165 -5511 658 1834 -8247 10416 -6929 5138 320 -7789 8268 -8155
1682 -8155 8767 -1506 -5487 6676 -9625 9694 -3382 -885 5398 -11195 9229 -4884 3420
1695 3420 3512 -10561 9207 -7478 5352 2030 -6828 8751 -11071 6537 976 -3028 7336
1708 7336 -12380 8246 -2194 -990 6924 -10265 8743 -7368 1336 7124 -8040 8146 -10337
1721 -10337 4467 4150 -6920 9422 -10037 5560 -1606 -4155 11479 -10180 5657 -5196 -546
1734 -546 9466 -10688 8750 -6339 281 4444 -8224 12723 -8879 480 1627 -5086 12082
1747 12082 -11060 4885 -93 -5549 8824 -9195 10108 -4405 -5871 7917 -7214 10642
1759 10642 -7768 -1092 6526 -9538 9695 -6403 4353 1311 -10935 11346 -5852 5489
1771E489p808m283J7545k1081J6936p854j105P956j8500K3820j2876L90M339j2583
1785i615K1510j9488R184L285j2241J4950j8422J8677m368j1378J4411j5713J8565
1798I357j2148j500J3886j9404J5968j1939Q346N669k0458J9337j2455R362j258
1811B763j1698K0262j9890J0344q01l671J3238k3320J7154l487k974Q850j7175
1824a0405J9763j3566M03J0755j2702J4993j8895R480P226j3612J4179j5921J3109
1837D807l650r383J8423j5930J0668r422P2J5503j9346J3684r249L307O079j5719
1851a0156K0329j3368K419J752q019J9092j9030Q033N30o621J2916j6911J6037
1864G003o053p236J1353j2146J6718j2916q57J0279j3344J4370j2306P023L128
$$ plain form
1771 5489 -2319 -6602 10943 -10138 6798 -1056 -2161 5795 -12705 11115 -1761 -1371 2968 -9615
1785 -9615 11895 -7593 1591 4876 -7365 7585 -10837 7840 3472 -7906 6505 -9208 9357
1798 9357 -2791 -4291 9595 -9809 6159 -5780 2566 8235 -12223 7114 -5341 4021 2763
1811 2763 -8935 11327 -8563 1781 980 -2691 10547 -12773 4381 894 -2080 6770 -10405
1824 -10405 9358 -4208 -3805 6950 -5752 9241 -9654 -174 7052 -6560 7619 -8302 4807
1837 4807 1157 -8226 10197 -5733 4935 -4487 -4415 11088 -8258 5426 -3823 -516 5563 -10156
1851 -10156 10173 -3195 -776 976 -7043 12049 -6981 1052 1582 -5039 7877 -9034 7003
1864 7003 950 -6286 5067 -7079 9639 -3277 -4134 6145 -7199 7171 -5135 1888 5016
1877E016j4697J6081j0610Q925l571r192J6244j4440J0079l869k916J0130j7099
1890i919J4875m692r05N023j3683J6673j0386K571M758j0239J2760j4203R288
1903A921K629r261J0183j3356J2404l428n282J0910j3255J0931p514J533R048
1916G463j4098J0956q765N096M163j1184J2944j1353N414Q64n704J2307j4094
1929e991P266j263k788R519j2938J0256n455j688P932r706J1037r557J117N947
1943C688q115J0688j0275M450J493p135J1129r455O285l001m541J0291r527Q012
1957C987n086j709O811r302J0291o198M08L020p838J1003p554L109N48o270R311
$$ plain form
1877 5016 -9681 6400 -4210 4715 1144 -8048 8196 -6244 3835 -34 -2950 7180 -9919
1890 -9919 4956 264 -641 4382 -9301 7372 -3014 -443 4315 -5924 6836 -7367 1921
1903 1921 4550 -4711 5472 -7884 4520 1092 -4190 6720 -6535 4396 -3118 -1585 7463
1916 7463 -6635 4321 -4444 652 4815 -6369 6575 -4778 636 1500 -4204 8103 -5991
1929 -5991 1275 12 -2776 6743 -6195 4061 -1394 -3082 4850 -4856 6181 -3376 -2259 3688
1943 3688 -4427 6261 -4014 436 1929 -5206 5923 -3532 2753 -248 -4789 5502 -4025 3987
1957 3987 -1099 -2808 4003 -5299 4992 -1206 -798 2222 -5616 5387 -2167 942 1490 -4780 4531
$$ [...]
8191d5
##END NTUPLES=NMR FID
##END=
