##TITLE=1H_ES-ZN-EG
 
 8 sc, 
 22.11.2022
##JCAMPDX= 6.0         $$ Bruker NMR JCAMP-DX V2.0
##DATA TYPE= NMR FID
##DATA CLASS= NTUPLES
##ORIGIN= UXNMR, Bruker Analytische Messtechnik GmbH
##OWNER= root
$$ XWIN-NMR		Version 3.5
$$ Tue Nov 22 16:46:13 2022 Russian Standard Time (UT+4h)  she@DPX200
##.OBSERVE FREQUENCY= 200.1313499994
##.OBSERVE NUCLEUS= ^1H
##.DELAY= (6, 6)
##.ACQUISITION MODE= SIMULTANEOUS
##.ACQUISITION SCHEME= undefined
##.AVERAGES= 8
##.DIGITISER RES= 18
##SPECTROMETER/DATA SYSTEM= spect
##.PULSE SEQUENCE= zg30
##.SOLVENT NAME= CDCl3
##.SHIFT REFERENCE= (INTERNAL, CDCl3, 0, 15.7039)
##AUDIT TRAIL= $$ (NUMBER, WHEN, WHO, WHERE, WHAT)
$$ ##TITLE= Audit trail, XWIN-NMR		Version 3.5
$$ ##JCAMPDX= 5.01
$$ ##ORIGIN= Bruker BioSpin GmbH
$$ ##OWNER= she
$$ F:/spectra/data/she/nmr/H-F/1/audita.txt
$$ ##AUDIT TRAIL=  $$ (NUMBER, WHEN, WHO, WHERE, WHAT)
(   1,<2022-11-22 16:45:21.26 +0400>,<she>,<DPX200>,
      <created by zg, POWCHK disabled, PULCHK disabled
       configuration hash MD5:
       00 E9 B6 7A A2 85 ED C7 34 08 36 98 17 FE 4E 26
       data hash MD5: 16K
       4B 4B AC B6 1B AF 23 9E 03 55 70 06 AF 1D 9D 78>)
$$ ##END=
$$ 
$$ hash MD5
$$ 23 54 D1 02 2B 58 76 5C 38 68 5A FE 24 D2 5B A4
##$RELAX= 
##$RELAX= 
##$RELAX= 
##$RELAX= 
##$RELAX= 
##$RELAX= 
$$ Bruker specific parameters
$$ --------------------------
##$DU= <F:/spectra>
##$EXPNO= 1
##$NAME= <H-F>
##$PROCNO= 1
##$TYPE= <nmr>
##$USER= <she>
##$AMP= (0..31)
100 100 100 100 100 100 100 100 100 100 100 100 100 100 100 100 100 100 
100 100 100 100 100 100 100 100 100 100 100 100 100 100 
##$AQSEQ= 0
##$AQ_mod= 1
##$AUNM= <au_zg>
##$AUTOPOS= <>
##$BF1= 200.13
##$BF2= 200.13
##$BF3= 200.13
##$BF4= 200.13
##$BF5= 200.13
##$BF6= 200.13
##$BF7= 200.13
##$BF8= 200.13
##$BYTORDA= 1
##$CFDGTYP= 0
##$CFRGTYP= 5
##$CHEMSTR= <none>
##$CNST= (0..31)
1 1 145 1 1 1 1 1 1 1 1 1 1 1 1 1 1 1 1 1 1 1 1 1 1 1 1 1 1 1 1 1 
##$CPDPRG= <>
##$CPDPRG1= <>
##$CPDPRG2= <>
##$CPDPRG3= <>
##$CPDPRG4= <mlev>
##$CPDPRG5= <mlev>
##$CPDPRG6= <mlev>
##$CPDPRG7= <mlev>
##$CPDPRG8= <mlev>
##$CPDPRGB= <>
##$CPDPRGT= <>
##$D= (0..31)
0 1.2 0 0 0 0 0 0 0 0.06 0 0.03 0 0 0 0 0.0002 0 0 0 0 0 0 0 0 0 0 0 0 
0 0 0 
##$DATE= 1669121120
##$DBL= (0..7)
120 120 120 120 120 120 120 120 
##$DBP= (0..7)
150 150 150 150 150 150 150 150 
##$DBP07= 0
##$DBPNAM0= <>
##$DBPNAM1= <>
##$DBPNAM2= <>
##$DBPNAM3= <>
##$DBPNAM4= <>
##$DBPNAM5= <>
##$DBPNAM6= <>
##$DBPNAM7= <>
##$DBPOAL= (0..7)
0.5 0.5 0.5 0.5 0.5 0.5 0.5 0.5 
##$DBPOFFS= (0..7)
0 0 0 0 0 0 0 0 
##$DE= 6
##$DECBNUC= <off>
##$DECIM= 32
##$DECNUC= <off>
##$DECSTAT= 4
##$DIGMOD= 1
##$DIGTYP= 9
##$DL= (0..7)
0 120 120 120 120 120 120 120 
##$DP= (0..7)
150 150 150 150 150 150 150 150 
##$DP07= 0
##$DPNAME0= <>
##$DPNAME1= <>
##$DPNAME2= <>
##$DPNAME3= <>
##$DPNAME4= <>
##$DPNAME5= <>
##$DPNAME6= <>
##$DPNAME7= <>
##$DPOAL= (0..7)
0.5 0.5 0.5 0.5 0.5 0.5 0.5 0.5 
##$DPOFFS= (0..7)
0 0 0 0 0 0 0 0 
##$DQDMODE= 0
##$DR= 18
##$DS= 0
##$DSLIST= <SSSSSSSSSSSSSSS>
$$ [...]
##$SUBNAM2= <"">
##$SUBNAM3= <"">
##$SUBNAM4= <"">
##$SUBNAM5= <"">
##$SUBNAM6= <"">
##$SUBNAM7= <"">
##$SUBNAM8= <"">
##$SUBNAM9= <"">
##$SW= 18.0517283424941
##$SWIBOX= (0..15)
0 0 2 0 0 0 0 0 0 0 0 0 0 0 0 0 
##$SW_h= 3612.71676300578
##$TD= 16384
##$TD0= 1
##$TE= 0
##$TE2= 300
##$TE3= 300
##$TEG= 300
##$TL= (0..7)
0 120 120 120 120 120 120 120 
##$TP= (0..7)
150 150 150 150 150 150 150 150 
##$TP07= 0
##$TPNAME0= <>
##$TPNAME1= <>
##$TPNAME2= <>
##$TPNAME3= <>
##$TPNAME4= <>
##$TPNAME5= <>
##$TPNAME6= <>
##$TPNAME7= <>
##$TPOAL= (0..7)
0.5 0.5 0.5 0.5 0.5 0.5 0.5 0.5 
##$TPOFFS= (0..7)
0 0 0 0 0 0 0 0 
##$TUNHIN= 0
##$TUNHOUT= 0
##$TUNXOUT= 0
##$USERA1= <user>
##$USERA2= <user>
##$USERA3= <user>
##$USERA4= <user>
##$USERA5= <user>
##$V9= 5
##$VALIST= <valist>
##$VCLIST= <CCCCCCCCCCCCCCC>
##$VD= 0
##$VDLIST= <DDDDDDDDDDDDDDD>
##$VPLIST= <PPPPPPPPPPPPPPP>
##$VTLIST= <TTTTTTTTTTTTTTT>
##$WBST= 1024
##$WBSW= 4
##$XGAIN= (0..3)
0 0 0 0 
##$XL= 0
##$YL= 0
##$YMAX_a= 312703
##$YMIN_a= -318751
##$ZGOPTNS= <>
##$ZL1= 120
##$ZL2= 120
##$ZL3= 120
##$ZL4= 120
##$ABSF1= 10
##$ABSF2= 0
##$ABSG= 5
##$ABSL= 3
##$ALPHA= 0
##$AQORDER= 0
##$ASSFAC= 0
##$ASSFACI= 0
##$ASSFACX= 0
##$ASSWID= 0
##$AUNMP= <proc_1d>
##$AZFE= 0.1
##$AZFW= 0.1
##$BCFW= 1
##$BC_mod= 2
##$BYTORDP= 1
##$COROFFS= 0
##$CY= 11.3945322036743
##$DATMOD= 1
##$DC= 2
##$DFILT= <>
##$DTYPP= 0
##$F1P= 2.36226072786647
##$F2P= -0.459571619588291
##$FCOR= 0.5
##$FTSIZE= 0
##$FT_mod= 4
##$GAMMA= 1
##$GB= 0.15
##$INTBC= 1
##$INTSCL= 1
##$ISEN= 128
##$LB= 0.24
##$LEV0= 0
##$LPBIN= 0
##$MAXI= 10000
##$MC2= 0
##$MEAN= 0
##$ME_mod= 0
##$MI= 1.114404
##$NCOEF= 0
##$NC_proc= 0
##$NLEV= 6
##$NOISF1= 3.799351
##$NOISF2= 2.8
##$NSP= 1
##$NTH_PI= 0
##$NZP= 0
##$OFFSET= 15.70392
##$PC= 1
##$PHC0= -18110.99
##$PHC1= 8.80072
##$PH_mod= 1
##$PKNL= yes
##$PPARMOD= 0
##$PSCAL= 0
##$PSIGN= 0
##$REVERSE= no
##$SF= 200.130013532006
##$SI= 16384
##$SIGF1= 3
##$SIGF2= 2
##$SINO= 400
##$SIOLD= 16384
##$SREGLST= <1H.CDCl3>
##$SSB= 0
##$STSI= 0
##$STSR= 0
##$SW_p= 3612.71676300578
##$SYMM= 0
##$S_DEV= 0
##$TDeff= 0
##$TDoff= 0
##$TI= <>
##$TILT= no
##$TM1= 0
##$TM2= 0
##$TOPLEV= 0
##$USERP1= <user>
##$USERP2= <user>
##$USERP3= <user>
##$USERP4= <user>
##$USERP5= <user>
##$WDW= 1
##$XDIM= 8192
##$YMAX_p= 0
##$YMIN_p= 0
$$ End of Bruker specific parameters
$$ ---------------------------------
##NTUPLES= NMR FID
##VAR_NAME=  TIME,          FID/REAL,        FID/IMAG
##SYMBOL=    X,             R,               I
##VAR_TYPE=  INDEPENDENT,   DEPENDENT,       DEPENDENT
##VAR_FORM=  AFFN,          ASDF,            ASDF
##VAR_DIM=   8192,          8192,            8192
##UNITS=     SECONDS,       ARBITRARY UNITS, ARBITRARY UNITS
##FACTOR=    0.0002768,     1,               1
##FIRST=     0,             0,               0
##LAST=      2.2672688,     0,               0
##MIN=       0,             -318751,         0
##MAX=       2.2672688,     312703,          0
$$ Real data points
##PAGE= N=1
##DATA TABLE= (X++(R..R)), XYDATA
$$ [...]
202d6987n28J27712k3694j40569L1549J19558m3906p4640P3302L0343j10876m350
214f3086J33877o308j26235J9453R2749m8566n4242Q8591K8928j19483j7495J23817
226E2000N208j01945K1978P0741o2265m8213R8663L7864j13235k7822J02548M093
238C9615p9606L4523O1366p4059n3482R6820M6759r6364k7626Q1914p643o8835
250d6618M8088O4305p6844o1573Q5159M7735p8757j7129P1063k2193p0217N4686
262b295P1693o9933o3634P0591L8845o8053k575P0886l1261p6598N1386P4525
274F3577n7782n6406N9806K4873o6057Q106P5810l0986p9727M1658O8796m7406
286D262m3259N6550J2995o9847J0702P9329k4101p5643L2529N6937m3857l0857
$$ plain form
202 -46987 -47515 80197 56503 -84066 -52517 67041 23135 -51505 21797 52140 -58736 -63086
214 -63086 70791 64483 -61752 -42299 50450 1884 -52358 36233 65161 -54322 -71817 52000
226 52000 57208 -44737 -22759 47982 -14283 -62496 36167 74031 -39204 -67026 35522 39615
238 39615 -39991 -5468 55898 -18161 -71643 25177 71936 -24428 -52054 29860 22217 -46618
250 -46618 1470 65775 -11069 -72642 12517 60252 -18505 -35634 35429 13236 -56981 -2295
262 -2295 69398 -535 -64169 6422 45267 -22786 -25361 45525 14264 -62334 -10948 63577
274 63577 5795 -50611 9195 34068 -31989 -23883 51927 20941 -58786 -17128 51668 4262
286 4262 -38997 17553 30548 -39299 -28597 50732 26631 -49012 -16483 40454 -3403 -34260
298c4260N9970P993p4243O644P7381j6676o5792K9301M4843m7230k4196O5293
310B9028R643p4465Q82O9769j3773n4514L2455L7165n3074k3894O7200J3985o8877
323b8470j844N9511j6437m6195L8317L5180n6159k6839O3383J6387n9762M36N0890
336B8398k2281m2861M2508L6829n4253k8825N5856J4389n1491O235M6793k7475
348C822m3531M2520L8529m8591k7221M8473Q817m7146J2184M6869k9267m5106
360c9648L8830L7384m2388k2049M4240K423m6831J5414M8346k7373m4461L3854
372b259L2796l8415j5567M3631j876m8248J5107M8200k3637m0573L0298K6472
384B5929l7647j0495M4982k926m8589J2589M5142k0646l4721K9569K1034l9081
$$ plain form
298 -34260 25710 33703 -40540 -33896 43485 26809 -38983 -9682 35161 -12069 -36265 29028
310 29028 38671 -35794 -34912 34857 21084 -33430 -975 36190 -16884 -40778 26422 40407 -28470
323 -28470 -30314 29197 12760 -33435 4882 40062 -16097 -42936 20447 36834 -22928 -22492 28398
336 28398 6117 -36744 5764 42593 -11660 -40485 15371 29760 -21731 -15496 31297 3822
348 3822 -39709 2811 41340 -7251 -34472 14001 22818 -24328 -12144 34725 5458 -39648
360 -39648 -818 36566 -5822 -27871 16369 18792 -28039 -12625 35721 8348 -36113 -2259
372 -2259 30537 -7878 -23445 20186 18310 -29938 -14831 33369 9732 -30841 -543 25929
384 25929 -11718 -22213 22769 19843 -28746 -16157 28985 8339 -26382 3187 24221 -14860
396a4860q388M5927j530m6481J0229L9991k0055k9185L1126J8087m0615q706M4790
409B0330J04m2185R880L4642k1742k5699L3137J7586m0428r773M1484K95l7325
422a9694J1631L0936k4174k4608L3877J8146l8153r825L7288j467l3653J4387
434e309K9423k5686k4786L2633J8116l4751q112L3844m396l1930J6552K9361k5425
447d66k4736L0070J6549l1666n168L2055p025l1687J7093K9322k3676k3369K7449
460D745J3683k9939k229L1717q278l1699J6133K8232k1586k0714K5853J0608k9583
473a3057l99L1872q092l0925J4654K5883k0311j7614K5660Q340k9982J07L1494
486A7630p195k9020J3708K2964k0254j5129K6254P326k9990k90L0059o556k6386
$$ plain form
396 -14860 -23248 22679 21149 -25332 -15103 24888 4833 -24352 6774 24861 -15754 -24460 20330
409 20330 20434 -21751 -11871 22771 1029 -24670 8467 26053 -14375 -24148 17336 17631 -19694
422 -19694 -8063 22873 -1301 -25909 7968 26114 -12039 -21864 15424 13957 -19696 -5309
434 -5309 24114 -1572 -26358 6275 24391 -10360 -18472 15372 10976 -20954 -4402 24959 -466
447 -466 -25202 4868 21417 -10249 -15417 16638 9613 -22074 -4981 24341 665 -22704 4745
460 4745 18428 -11511 -13740 17977 9699 -22000 -5867 22365 779 -19935 5918 16526 -13057
473 -13057 -13456 18416 10324 -20601 -5947 19936 -375 -17989 7671 16011 -13971 -13864 17630
486 17630 10435 -18585 -4877 18087 -2167 -17296 8958 16284 -13706 -13996 16063 9507 -16879
499a6879J3808K0364k1009j3753K6633P273k9027o28K7771o797k3835J4698J8739
512A7358k1706j3327K6142P361k7200k53K5422p860k2053J5757J8002k1761j3148
525a7266K4830O866k5117R22K3627r167k1179J6272J7675k0952j2579K3114N609
538A2655k3451K449K2667j0081k0767J5956J7125j9681j1332K1651L960k2516
550a1365L716K2219j0286k0217J5152J5943j8530r616K0832K432k2156M366K1806
563A4296r925j9185J4316J4292j7883p952K0595J455k1889M399K0982r424j7673
576a3596J3885J2554j7766o714K0493J050k1263M204J9616r171j5961J3879J1148
589A2358j7806o029K0064R61k0101M147J8008r333j4453J4122J0233j7664n703
$$ plain form
499 -16879 -3071 17293 -3716 -17469 9164 16437 -12590 -13218 14553 7756 -16079 -1381 17358
512 17358 -4348 -17675 8467 15828 -11372 -11625 13797 5937 -16116 -359 17643 -4118 -17266
525 -17266 7564 14430 -10687 -9765 13862 4695 -16484 -212 17463 -3489 -16068 7046 12655
538 12655 -10796 -8347 14320 4239 -16528 -572 16553 -3128 -14460 7191 11151 -11365
550 -11365 -7649 14570 4284 -15933 -781 15162 -3368 -12984 7848 10280 -11876 -7510 14296
563 14296 4371 -14814 -498 13794 -4089 -12041 8554 10009 -11880 -7481 13501 4077 -13596
576 -13596 289 12843 -4923 -11637 8856 9906 -11357 -7153 12463 3292 -12669 1210 12358
589 12358 -5448 -11477 8587 9548 -10553 -6406 11602 2269 -12184 1938 12171 -5493 -11196
602a1196J9242P92j8691M501J6554r807j3447J4329R734j7231n355J8158L00j7458
616i575N192J5577j0336j2855J4270R291j6514m741J7116n55j6503N943J4910
629A1220j0557j2344J3817Q617j5617l849J6209j427j5794O361J4355j0337j1645
642a0991J3096P673j4762k877J5525k069j5242O425J3697r884j0729J2473O627
655H962j4255k016J5115k429j4747O341J2899r599r708J2225N681j4112j397J4838
669G798k626j4152O295J1989r565q737J2244M941j3988j042J4378k737j3310O339
683b173J0999r593p906J2139M465j3576q40J3584k820j2298O400J0081r550p288
697h376J1826M126j2871o42J2659l023j1418O560R422r495o863J1438L779j2232
$$ plain form
602 -11196 8046 8838 -9853 -5352 11202 1395 -12052 2277 12011 -5220 -10575 7583 7883 -9575
616 -9575 -4383 11194 858 -11997 2273 11564 -4950 -9691 7425 6870 -9633 -3690 11220
629 11220 663 -11681 2136 10753 -4864 -8713 7496 6069 -9725 -3364 10991 654 -10991
642 -10991 2105 9778 -4984 -7861 7664 5595 -9647 -3222 10475 591 -10138 2335 8962
655 8962 -5293 -7309 7806 5377 -9370 -3029 9870 271 -9437 2788 8469 -5643 -7040 7798
669 7798 5172 -8980 -2685 9304 -261 -8998 3246 8187 -5801 -6843 7535 4798 -8512 -2173
683 -2173 8826 -767 -8673 3466 7931 -5645 -6485 7099 4279 -8019 -1619 8462 -1088 -8376
697 -8376 3450 7576 -5295 -5937 6722 3699 -7719 -1159 8263 -1232 -8095 3343 7122 -5110
711e110k45J1941l433j0820O817Q986r458o464J1088L282j1706K98J1459l863
725B772j0438O989Q576r275n944J0676K695j1236Q05J1019m115r960O860Q029
739G453q879n319J0181K128j0752J138J0517m106r380O566P370q453m694R752
753C522J662j0320J308J0034m036q797O381O719q278m102R563J292j0059J515
767c596R570m115q197O427O129q299l635R478R72r757J712R083m258p627O539
782D26N591q240l241R192P09r245J877Q467m361p030O474N128p965k921Q697M89
798D047q636K034P852m403o520O326M760p635k617Q213K21q121K246P410m494
813F83o163O278M396p425k218P923j82p805K571P095m643n815O252L984p268j772
$$ plain form
711 -5110 -5355 6586 3153 -7667 -850 8136 -1322 -7786 3302 6584 -5122 -4824 6635 2772
725 2772 -7666 -677 7899 -1376 -7320 3356 6051 -5185 -4380 6639 2524 -7436 -576 7453
739 7453 -1426 -6745 3436 5564 -5188 -4050 6467 2361 -7019 -453 6917 -1536 -6230 3522
753 3522 5184 -5136 -3828 6206 2170 -6627 -246 6473 -1805 -5907 3656 4948 -5111 -3596
767 -3596 5974 1859 -6338 89 6218 -2081 -5716 3762 4734 -5023 -3311 5772 1514 -6113 426
782 426 6017 -2223 -5464 3728 4437 -4808 -2931 5536 1175 -5855 619 5747 -2218 -5139 3558 4047
798 4047 -4589 -2555 5297 894 -5626 700 5460 -2175 -4792 3421 3642 -4479 -2233 5177 683
813 683 -5480 798 5194 -2231 -4449 3474 3292 -4513 -1942 5153 510 -5305 947 4931 -2337 -4109
829d109P690n75p518K778O781m688n392O104L534p027j381P390q13p186K858O335
845D781m562m935N880L102o748j071P073r66o792K841N906m461m494N736K728
860D018o539q22O811j111o442K914N512m492m104N728K401o456n65O600j291o151
876c989L072N148m594l759N723K111o325l39O342j478n801L175M803m600l464
891c975N590J877o060j50O003j605n455L224M481m505l215N400J662n796M2N694
907C212j716n160L245M236m444k967N237J419n576K56N464j871m931L298L994
922C696m415k692N120J158n431M80N284k021m711L346L714m356k411N002Q99n248
938b586O36N073k078m454L300L462m267k154M858P29n060P26M847k094m197L267
$$ plain form
829 -4109 3581 3006 -4512 -1734 5047 359 -5033 1071 4605 -2422 -3803 3587 2774 -4412 -1554 4781
845 4781 219 -4716 1164 4266 -2482 -3553 3520 2554 -4238 -1397 4509 48 -4446 1290 4018
860 4018 -2521 -3343 3468 2357 -4085 -1171 4341 -151 -4255 1473 3874 -2582 -3147 3453 2162 -3989
876 -3989 -917 4231 -363 -4122 1601 3712 -2613 -2952 3390 1912 -3889 -714 4089 -511 -3975
891 -3975 1615 3492 -2568 -2718 3285 1680 -3775 -551 3930 -575 -3790 1610 3272 -2524 -2482 3212
907 3212 1496 -3664 -419 3817 -627 -3594 1643 3062 -2514 -2258 3206 1335 -3596 -298 3696
922 3696 -719 -3411 1709 2867 -2564 -2084 3200 1179 -3532 -186 3528 -828 -3239 1763 2662 -2586
938 -2586 -1950 3123 1045 -3409 -109 3353 -914 -3068 1790 2519 -2541 -1815 3032 938 -3259 8
954HL188m166j929M723N65m882Q29M606k134l927L249K954m123j732M614M11m708
971b454R29M393k197l705L278K715m065j559M503K67m536J049M157k252l478L283
987C28K518l995j369M348J15m321J157L951k324l256L260K325l896j202M199l6
1003A802m137J258L745k339l075L216K138l804j021M056j72l988J355L573k394
1018B13k865L182J937l711q38L921l39l795J424L389k380k685L132J752l620o69
1034a952L791m38l642J476L200k372k482L077J559l522n18L670n43l501J538L023
1050B364k405k286L058J385l452l89L558o42l348J600K846k424k110L017J232
1065B004l380k58L428p27l175J647K666k415j951K975J083l272j22L266q08l001
$$ plain form
954 8 3196 -970 -2899 1824 2389 -2493 -1664 2942 808 -3119 130 3084 -1039 -2771 1843 2254 -2454
971 -2454 -1525 2868 671 -3034 244 2959 -1106 -2665 1838 2105 -2431 -1382 2775 523 -2955 328
987 328 2846 -1149 -2518 1830 1945 -2376 -1219 2732 408 -2848 412 2737 -1159 -2361 1838 1802
1003 1802 -2335 -1077 2668 329 -2746 470 2608 -1196 -2217 1839 1667 -2321 -966 2607 213
1018 213 -2652 530 2467 -1244 -2082 1839 1500 -2295 -871 2518 138 -2547 585 2337 -1283 -1952
1034 -1952 1839 1401 -2241 -765 2435 63 -2419 658 2217 -1305 -1823 1847 1304 -2197 -659 2364
1050 2364 -41 -2327 731 2116 -1336 -1725 1833 1191 -2157 -557 2289 -135 -2245 772 2004
1065 2004 -1376 -1634 1794 1067 -2108 -461 2205 -210 -2161 814 1897 -1375 -1497 1769 961 -2040
1081b040J679K497k395j794K909R48l162k6L118q64k849J707K346k394j649K849
1097H80Q15l051P0L013r67k734J773K213k411j499K802O70k977K08K915j058k601
1114a939J810K062k370j361K744N53k889K86K801j093k466J795J933k328j253
1129a715K673M65k793L57K670j106k340J779J789k272j122K579L68k679M08K556
1145A617j146k219J787J677k267j021K556K69k629M88K474j202k091J808J555
1160A656k260r02K510J89k547N55K365j235j985J804J454k219p92K435Q5k422
1176a309N94K251j238j878J759J348k143p30K347M3k337O28K142j253j763J750
1192B11J248k102o41K271k3k244O81K027j255j677J757J151k067n37K206j10k168
$$ plain form
1081 -2040 -361 2136 -259 -2053 856 1804 -1358 -1384 1734 870 -1979 -272 2074 -320 -1969 880
1097 880 1695 -1356 -1286 1727 760 -1974 -201 2012 -399 -1898 904 1574 -1403 -1195 1720 662 -1939
1114 -1939 -129 1933 -437 -1798 946 1499 -1390 -1104 1697 604 -1862 -67 1866 -462 -1715
1129 -1715 958 1423 -1370 -1013 1657 551 -1789 -10 1779 -493 -1615 964 1332 -1347 -939 1617
1145 1617 471 -1748 39 1716 -551 -1572 984 1253 -1376 -888 1586 384 -1707 101 1656
1160 1656 -604 -1506 1004 1193 -1354 -799 1566 331 -1654 150 1604 -615 -1407 1028 1113 -1309
1176 -1309 -715 1536 298 -1580 179 1527 -616 -1346 1001 1044 -1293 -665 1477 224 -1539 211
1192 211 1459 -643 -1284 987 964 -1280 -599 1428 173 -1504 253 1404 -663 -1200 1006 896 -1272
1209a272P49J949j315j559J762J040k048m34K149j74k099P79J877j329j463J727
1225C39R39j987l68K086k39j992P90J754j299j370J682Q69j915l16K013k64j933
1242a211Q23J661j292j267J657P87j884k35J955l40j832Q69J575j329j178J666
1258D25O94j857j48J890m03j760R14J480j337j093J650O06j815q9J830m35j690
1275a138R21J416j347j009J616N34j753l9J755m69j610R44J322j303r46J572M91
1292I57j701J7J684n10j527R45J259j310q71J573L94j655P6J635n67j462R81J169
1310A087j312p97J556L28j644J45J589o07j400J005J099j314p23J519K67j581
1326g83J90J528o33j327J002J029j290o49J466K26j533K37J446o43j242R97R61
$$ plain form
1209 -1272 -523 1426 111 -1448 314 1354 -694 -1128 1021 847 -1252 -473 1404 75 -1388 339
1225 339 1278 -709 -1077 1009 770 -1222 -432 1322 23 -1347 335 1204 -711 -1027 986 722 -1211
1242 -1211 -388 1273 -19 -1286 371 1158 -726 -961 994 654 -1178 -309 1266 -63 -1241 425
1258 425 1119 -738 -886 1004 601 -1159 -245 1235 -102 -1195 455 1061 -754 -843 987 552 -1138
1275 -1138 -217 1199 -148 -1157 459 993 -760 -799 956 487 -1123 -179 1143 -160 -1106 466 957
1292 957 -744 -727 957 447 -1080 -135 1124 -186 -1057 516 910 -745 -669 966 399 -1063 -82 1087
1310 1087 -225 -1022 534 862 -782 -637 952 345 -1055 -50 1049 -265 -988 531 798 -783
1326 -783 -593 935 302 -1025 -23 1006 -284 -933 533 759 -774 -537 909 266 -976 21 982
1343I82j273n93J453J59j478K63J386o49j194R93Q93j253n35J409R9j414K88J338
1361H74o86j132J004Q32j242m60J369N8j384L37J276p10j058J022P63j229m03
1378g69J341J3j330L80J207p02j010J000P01j186l49J274nj284L93J148p35r18
1396h31R78O56j181k97J238m9j223M02J090p14q97R78O01j146k63J208r7j177
1414g24M45J031p19q23R62N42j119k07J171j22j134M66R87p36p68R46M96j098
1432d04j53J132j62j082M72R37p49p22R42M39j051j41J082j74j032M77Q93p36
1450c2o75R22M00j031j06J059k02r94M95Q43p27o40R16L70j003p3J022k26r51
1469f33N07P98p35n72Q94L20r92k3R84k52r13N20P49p40n46Q96K78r56mR53k79
$$ plain form
1343 982 -291 -884 569 728 -750 -487 899 250 -944 49 942 -311 -846 563 662 -752 -464 874
1361 874 188 -944 60 892 -350 -810 559 617 -767 -430 846 136 -922 100 863 -366 -769
1378 -769 572 585 -745 -365 842 140 -870 130 831 -355 -704 570 565 -719 -326 822 87 -831
1396 -831 147 803 -378 -675 563 514 -709 -307 783 69 -828 150 751 -395 -658 550 453 -724
1414 -724 -279 752 33 -790 172 714 -405 -612 559 437 -697 -231 756 20 -748 198 694 -404
1432 -404 -557 575 413 -669 -197 740 -9 -731 211 650 -401 -542 540 366 -666 -189 704 -32
1450 -32 -707 215 615 -416 -522 537 335 -659 -164 679 -48 -688 228 598 -405 -478 544 318 -633
1469 -633 -126 672 -63 -635 259 579 -413 -436 548 296 -617 -97 652 -88 -634 262 540 -416 -420 533 254
1490B54q75N38O99p29m93Q61K51r35K1R25k93q36N29O82p27m57Q56K18r06N3Q87
1511E23l01p96N23O44p16m18Q28J75q67P2Q58l26p61N39N91p11l93Q28J41q53
1531d20J02Q22l42p31N55N59p07l60Q16J14q36J14Q04l44o89N41N25o89l16P86
1551C04J04q21J34P75l61o59N48M97o77k91P51Q3p91J50P35l62o22N36M62o82
1571a87k51P43L6p59J88O91l82n84N40M20o59k21P26Qp14J74O72l73n57N45L85
1592D41o36k04O96Qp01K07O32l69n40N43L58o25j93O92k5o65K11N94l81m81N13
1613G5L32o06j61O55l5o45K10N81l84m61N23L03o13j23O31n3o18K37N44l86m22
1634d16N16K68n87j01O17o3n91K45N11l85m02M98K64n79r4N99q5n70K49M85l81
$$ plain form
1490 254 -621 -83 616 -113 -606 255 506 -429 -408 517 224 -612 -83 599 -128 -585 271 489 -417 -364 523
1511 523 222 -574 -51 593 -123 -541 287 462 -405 -333 525 199 -562 -23 568 -143 -536 292 433 -420
1531 -420 -318 504 162 -569 -14 545 -162 -522 294 408 -428 -314 490 146 -543 -2 523 -166 -482 304
1551 304 408 -413 -279 496 135 -524 24 521 -156 -447 304 387 -404 -254 481 119 -503 33 495 -187
1571 -187 -438 305 341 -418 -230 461 79 -505 35 455 -204 -425 301 309 -405 -231 441 68 -489 56 441
1592 441 -195 -399 297 305 -396 -189 443 74 -466 77 435 -190 -383 309 284 -381 -170 424 43 -438 75
1613 75 407 -199 -360 295 260 -385 -175 406 22 -439 84 387 -226 -349 282 229 -389 -152 392 6 -416
1634 -416 100 368 -219 -320 297 234 -357 -112 399 14 -388 110 374 -205 -299 300 215 -355 -106 379 -2
1655bl76M86K31n59p2N81j02n42K48M75l93l52M82K12n48m3N53j09n23K67M33
1676C47l80l22M82J89n33k9N38j27m88K62M31m00l04M69J70n20pN11j42m67K67
1697e3M03l92k78M55J43m97LM85j30m64K68L74l80k59M56J24m87K2M77j57m23
1718c10K84L41l88k34M58J22m85K0M70j60m12K78L30l69k28M38R5m59L8M42j68
1739A03l99K89L14l75k05M18Q6m59N4M37j80l91K87K98l66j80M15P0m35N2M24
1760B57j85l62K92K73l54j79M09O0m12N4M06j87l40K78K68l53j56L99L4m10P7
1781a31L88j84l32K71K56l57j52L92K8m01R0L59j88l11K89K15l44j17L76J2l64
1802b05Q2L46j83l00K88K13l43j11L69Ml58J04L32j98k80K80J88l24r8L63nl59
$$ plain form
1655 -2 -378 108 339 -220 -292 289 187 -355 -107 368 -25 -377 105 317 -231 -274 279 170 -353 -86 347
1676 347 -33 -355 127 316 -217 -246 292 165 -323 -61 370 -30 -334 135 305 -215 -222 289 147 -320 -53
1697 -53 350 -42 -320 135 278 -219 -216 269 139 -325 -57 317 -63 -322 134 258 -229 -207 270 113 -310
1718 -310 -26 315 -73 -307 151 273 -212 -192 278 118 -294 -16 314 -55 -283 155 250 -209 -171 271 103
1739 103 -296 -7 307 -68 -273 145 231 -228 -174 263 83 -308 -21 277 -89 -269 146 216 -219 -167 257
1760 257 72 -290 2 275 -79 -258 151 211 -201 -147 259 72 -268 10 278 -75 -231 168 202 -208 -131
1781 -131 257 73 -259 12 268 -89 -241 151 179 -222 -132 227 39 -272 17 232 -112 -229 147 159 -205
1802 -205 -123 223 40 -260 28 241 -102 -213 156 160 -198 -94 238 40 -240 40 228 -96 -194 169 164 -195
1824a95J15L16k16k55K84J66l27q5L56l2l35R8L27k01k44K62J66l20o3L42l8l23
1846b02J20K98j98k38K72J46l12n3L17j7l31J43K67j99k25K78J34l08m5L09l8
1867A18l08J49K47k17j92K76J05k98m0L27p3k86J33K40k05j85K62J19l02k1L02
1888A51p4k82J64K26k07j70K62R6k77k5L00p6k64J51K16k08j55K58P8k71j2K87
1910A68q2k62J55K06k19j43K47O7k66J1K75r8k47J58K07k20j42K60O3k72J6K61
1932A43r0k28J67J86k14j27K50N3k56K7K39q5k30J80J58k01j20K37M0k54L1K49
1954A55j05k17J61J68k16r9K40L2k46L3K20r2k01J55J73k20r7K35L1k43M9K17
1976A33r7j83J58J47k06p9K30J1k20L5K30j17j94J70J31j93q3K33Lk26N4K12j21
$$ plain form
1824 -195 -80 236 20 -235 49 215 -112 -197 159 127 -208 -110 217 16 -228 34 200 -120 -183 159 121 -202
1846 -202 -82 216 18 -220 52 198 -114 -167 150 133 -198 -55 212 13 -212 66 200 -108 -153 156 118
1867 118 -190 -41 206 -11 -203 73 178 -120 -160 167 94 -192 -59 181 -24 -209 53 172 -130 -151 151
1888 151 77 -205 -41 185 -22 -192 70 166 -111 -136 164 88 -176 -25 191 -17 -172 86 164 -107 -119 168
1910 168 86 -176 -21 185 -34 -177 70 137 -129 -118 157 59 -188 -30 177 -43 -185 75 138 -134 -118 143
1932 143 53 -175 -8 178 -36 -163 87 140 -116 -89 150 65 -165 15 173 -28 -148 89 129 -125 -94 155
1954 155 50 -167 -6 162 -54 -153 87 119 -127 -94 126 34 -167 -12 161 -59 -156 79 110 -133 -84 133
1976 133 36 -147 11 158 -48 -127 103 114 -106 -71 159 42 -152 18 149 -44 -127 106 109 -117 -63 149 28
1999B8j80J66J22k00p0K20Pk17N1K05j20j67J72J13j97o0K11Lk20P5J95j32j49
2022a44J68J09j95l8K04k2j93P0J72j16j50J75R3j98l3K00mk16P9J79j35j39J70
2045C6Q7k04k2J92k9j87Q9J56j26j30J70Q0j86l1K05l9j91Q5J71j31j19J72O9
2068A17j86k7K02k0j90Q0J60j29j09J47P4j86j2J84n0j75J00J41j32j10J57N5
2090I1j67j2J79n1j67R7J38j30j05J77L8j77JJ85m7j64J00J22j26q9J65L3j66
2113g5QJ73n2j51R1J30j31r4J56L6j78K1J61n9j46J09J15j45o7J42L1j65K4J64
2137I8o6j51J03J13j32o5J50L2j63K7J37n9j34J10J04j40n2J46K9j72L5J56o6
2160D0j25J02R4j38n5J49Pj51L0J51q2j20R9R7j37m7J35J2j45L6J30q1j10J05
$$ plain form
1999 28 -152 14 136 -64 -134 86 93 -124 -73 132 12 -155 17 130 -67 -127 84 87 -133 -58 137 5 -144
2022 -144 24 133 -62 -100 104 82 -111 -41 131 15 -135 40 133 -65 -98 102 98 -118 -39 140 5 -134 36
2045 36 123 -81 -103 89 60 -127 -38 118 -8 -138 32 112 -74 -105 100 61 -130 -45 126 -5 -124 48 117
2068 117 -69 -96 106 86 -104 -24 136 7 -102 45 119 -67 -79 105 55 -120 -20 121 -11 -121 36 91
2090 91 -76 -88 91 40 -127 -30 108 -22 -127 50 88 -89 -88 97 50 -114 -14 108 -18 -107 58 91 -75
2113 -75 -67 106 54 -97 -6 124 -7 -101 55 91 -87 -66 95 36 -110 -1 114 -31 -98 44 75 -90 -66 98
2137 98 32 -119 -16 97 -35 -100 50 82 -81 -54 83 24 -110 0 104 -36 -88 58 87 -85 -50 106 40
2160 40 -85 17 111 -27 -82 67 74 -77 -47 104 22 -98 1 98 -39 -86 49 61 -84 -48 82 1 -109 -4
2184dQ6j12n9J51oj30K9J36p5r7R1Q8j27l9J35%j28L4J18p4r8J05P2j17l9J17
2210E7Lj25K5J22o5j08R9O9j26k6J30j2j20K8J26p8r4R5P1j06l3J15lj21M6J06
2236G5o6q0R2N4r4k7J08lj17M1J04p7p2R0M7j14j5J22j6j20M6J04q6o4R2L9j04
2263d1k2J19j8j12M5R3p3o9R3N3j14oR3j1r9M8P7n6p3J02L9j08J5Q7k9q3N4P6
2291H0q6m5Q5L4j04j2J16l2j00N0P1p2n5Q7L5j06jR9k2r5O1P5o5n0P0L4q8KP7
2320D3rr4M5P6o1n5Q8K8r7lJ00j9q7N5N9p2m2P9K7q9lQ7k4q1N9M1p2m1Q3J8q9
2351e0NQ6k9p9N8N7p4k9Q6Rp9LR0j9q6M2N7n2l2O9J7p5OP9k6p1M4M9o5l2Q6Jr3
2384d7K3Q2m2o4N7K1n3k1O6Pp3J4O3k4o7N4M5o3k5P4K5r1J4P5l9n2M9M3o6k1P3
$$ plain form
2184 -4 82 -30 -89 62 56 -74 -45 91 16 -81 10 98 -29 -68 67 67 -61 -27 91 17 -81 24 96 -21 -60 57
2210 57 60 -65 -40 82 17 -91 8 77 -49 -75 55 43 -77 -49 77 -1 -95 0 71 -35 -68 47 44 -77 -31 75
2236 75 9 -71 21 75 -19 -46 62 59 -58 -17 87 10 -62 28 75 -39 -54 68 52 -68 -22 82 -4 -68 24 63 -41
2263 -41 -63 56 38 -74 -29 64 -9 -78 15 68 -46 -52 41 30 -69 -21 56 0 -73 29 68 -40 -25 62 33 -50 4 80
2291 80 -6 -51 34 68 -36 -48 68 36 -64 -14 57 -15 -70 17 52 -54 -55 44 22 -73 -12 63 -2 -52 18 52 -36 -34 43
2320 43 34 -60 -15 61 0 -55 33 61 -36 -39 61 42 -45 10 69 -3 -45 34 61 -28 -31 56 32 -49 10 51 -21 -62 21 39 -50
2351 -50 -45 41 12 -67 -9 48 -26 -55 31 40 -39 -36 54 35 -51 -9 48 -4 -36 33 50 -25 -19 60 34 -37 7 56 -9 -41 45 46 -47
2384 -47 -24 58 16 -48 9 30 -23 -44 22 29 -44 -30 33 9 -58 -4 41 -22 -47 27 52 -39 -25 50 11 -41 8 51 -15 -36 37
2415C7Np8K0P0l1o0O0K1n2l3P2kp2K0N1k6n9N6K7n5j8O2Kp6L4N9l6m9N1L8o2k7
2447e1P2pm3J5O0l1n2N0M3p1qO2Ko9J6O0l7m2N4J5n6mN1mn9J5N2l5m9N0L3n7j4
2480c9N2Kn9J4O7l8m1M2L4m7k0O5j6m6K9M7m7k8N2J7m5j5M4J3o3K6M4m9k4N0J6
2511C7n6%M7j7n6L1L9l7l1L8J9m7RN6k4n9L0L8k9l3N5K1n6LN3j2n2K8M2l7k7N4
2543B7J1l9k1N9j3m1K6L6l5l7M3J6n6NM6j9m1K3L8l7l2M1K2n8NN1j9m0L2L2l6
2574a1j8M1K3n3J0M1k4m3L7L2k9k8N4%m6MM5j7m2L6J3k4k5M0jl7OM1k7l5L0L3
2606B6l9k8M7ll8J3L4j1m0L7K6l0k7M7Jl6lN1j2l4L4J0l1j3L4J2m2RM0k0k2J3
2638EK0k4k2L3Pl7NL5k0l8K5L8m5j0L9j2l5J7L0j9j5K6K9m1lK9kk1lK8j4j7J5
$$ plain form
2415 37 42 -36 -16 54 23 -37 23 44 -8 -41 31 29 -43 -23 28 2 -57 -1 26 -29 -47 15 17 -59 -25 34 -2 -51 0 38 -24 -51
2447 -51 21 14 -29 -14 46 15 -37 13 56 -15 -23 39 41 -28 -12 48 11 -31 23 38 -18 -22 29 25 -34 -19 33 -2 -51 -1 32 -25 -39
2480 -39 13 15 -44 -30 37 -1 -42 0 34 -13 -33 32 16 -30 -1 46 -1 -29 23 40 -5 -20 24 37 -26 0 44 -5 -29 21 37
2511 37 -19 -19 28 11 -45 -14 25 -12 -43 -5 14 -33 -24 32 8 -51 -21 17 -12 -45 10 31 -25 -22 31 19 -33 -5 37 0 -27 27
2543 27 38 -1 -22 37 24 -17 9 45 10 -27 16 32 -24 -19 27 8 -33 -10 28 -9 -41 0 22 -36 -31 20 1 -39 -7 25 -11
2574 -11 -29 12 35 -18 -8 33 9 -34 3 35 6 -22 32 32 -14 -10 35 18 -24 12 25 1 -24 16 15 -22 -16 25 -2 -37 -7 26
2606 26 -13 -41 6 3 -35 -22 12 1 -39 -2 24 -6 -33 14 15 -21 -24 27 15 -19 15 25 -6 -19 15 27 -15 -6 34 14 -8 5
2638 5 25 1 -21 12 19 -18 -13 22 2 -36 -11 27 -18 -28 11 -1 -36 -19 11 -8 -23 3 32 -9 -12 17 15 -6 -9 19 5 -12 3
2671CK5k7j1L0lk7NL0j8j8K0J0l2mK1Lm2J1L6k4j8J4K6m3MJ9J0l3J1L6j9j7J5
2704gJ8k4JK8%k4QL3l4j3J7K5l1mK7jk9RK5k1j5J7J2l6MJ9%l0J9K0k7l0M4Nk4
2739a9JK1qk0J1K0j6mL1Lk7JK9Nk7QJ8k1j2L0nj8%J6kk3NK9k1k1K5Kl0J4J8k1
2775hj8K2J0j8j9L7ok0KPJ7j9J1Pk1KK3Oj1j3J4kj4J2Qmk3L8ok4J6J2mk4K1Mk8
2812a3jJ8Jj6pK1nj7J3Mk4MR%j6J1J9pj1PJ3j3oK0Rk8PK3j0j6J7Lj1KJ9pj7%J2
2851GKj5J5pj6qK2pplK3j0rKJ3j7jK0j1j4PJ4qoRJ4j4kJ9Lj7kK6k2JJOj6%J9j0
2892AJMOpk1J9nqNjKj2QRoj4K0j1oOOooKJ0%mJ2%rPJ0Mj9J4mj4J8%oOj0J7rk0
2937a1J6Nrj3RJ5j7mJ0qj1MNMmKMmnJJ2j1KMMmJ1J4k1jRJqJ0J0j1j0J8nmqRpn
$$ plain form
2671 3 28 1 -10 20 17 -10 -5 25 7 -11 9 19 -13 -17 4 7 -35 -24 12 -12 -30 -16 10 -33 -29 -10 0 -33 -22 14 -5 -22 -7
2704 -7 11 -13 -12 16 16 -8 0 33 -1 -14 3 28 -3 -7 20 19 -10 -1 24 3 -12 5 17 -19 -15 4 4 -26 -7 13 -14 -44 0 5 -19
2739 -19 -18 3 -5 -25 -14 6 -10 -14 17 20 -7 -6 23 28 1 9 27 6 -6 24 19 1 1 17 15 -8 -3 26 5 -16 9 11 -19 -5 13 -8
2775 -8 -26 -4 6 -12 -31 6 0 -20 -18 -11 6 -13 -2 5 -16 -14 9 15 4 -9 5 3 -11 1 9 5 -18 20 14 -10 6 18 14 -10 11 15 -13
2812 -13 -14 4 5 -11 -18 3 -2 -19 -6 -2 -26 -22 -13 -13 -29 -18 1 -6 -17 -10 3 -10 -16 4 13 -15 -8 15 5 -11 6 9 -2 0 19 12 -5 -5 7
2851 7 9 -6 9 2 -14 -22 0 -7 -14 -17 6 -4 -13 -11 2 -15 -16 4 -7 -21 -14 0 -8 -14 -5 9 -5 -7 12 15 -2 -4 22 0 1 2 8 -8 -8 11 1
2892 1 2 6 12 5 -16 3 -2 -10 -5 -6 -4 -16 -8 1 -5 -19 1 -10 -16 -10 -4 -10 -16 -14 -4 -4 -8 4 4 -5 2 12 16 -3 11 7 -7 11 11 5 11 1 18 9 -11
2937 -11 5 10 1 -12 -3 12 -5 -9 1 -7 -18 -14 -9 -5 -9 -7 -3 -7 -12 -11 1 -10 -8 -4 0 -4 7 21 0 -1 8 9 1 11 21 10 0 18 13 9 1 10 3 -2
2981bJJ1rpMkj6RJ4j4OqRj0kNMlmNNqKK1j1mJ9kj0%OljKMPj7J4oqNJ6j4nj%nr
3029a2J8pj1NPj1%L%jJjNlpJ8%j0J0Rj7NOlkJ0Pnj1OJlqJ4Lj0%j2MKklNj7J2k
3075gmJNMj5J4pqNMRrJ0KrKKkNMKQj3J0%MnNlrjN%kJJqlNmlJJmrKJ3j6RKJmJN
3129bqLkJ1jLjmJ6qJKKOj6%J%LkoJ4rj0NJ0mnkj4KJ1Mj0jNkj1J0PkqPJ1j2QqJ3
3177Gj4J4j1QLnLRoMKonkOjKrK0j8Kp%nRqrPJ0orJ1onRJOj1QpMLM%J0j0LqJ3N
3227A5qMrJ2mnj0RMLojkkJQpj1K%j5J3%j4J7lPJrOkomJ5mNQrOMkJ9j3jJj8K2j0
3275GQnpOj2Mj2KOrQp%jJ3k1JJ2Rpj2J3moMJ3j2JJ5j0LJ7j8NL%J1nKlPj2%kMl
3321FNj4PpN%okJ1mj7QOj5RLrQmKNj0%J8j4MNmpJ6J2nqJJ2pKKQnpOnmOJqJrpM
$$ plain form
2981 -2 -1 10 1 -6 -2 -4 -20 -11 3 -11 -5 -13 -4 -14 -16 -11 -7 -10 -14 -9 -4 -12 -10 11 0 -4 15 13 3 3 9 6 5 7 11 18 1 15 9 1 6 22 8 3 2 2 -3 -12
3029 -12 6 -1 -12 -7 0 -11 -11 -8 -8 -9 -8 -9 -4 -7 -14 4 4 -6 4 13 -4 1 7 4 2 12 19 14 3 9 10 7 -1 13 16 6 6 -6 -2 0 -2 -5 0 -17 -5 -7
3075 -7 -11 -10 -5 -1 -16 -2 -9 -17 -12 -8 1 -8 2 4 -5 -3 -1 -3 2 6 8 16 3 13 13 17 12 17 14 5 4 9 9 7 8 9 1 -2 3 -1 -4 -3 -2 -6 -15 -13 0 -16 -7 -5 -4 -8 -7 -2
3129 -2 -10 -7 -9 2 1 4 3 -1 15 7 8 10 12 18 2 2 3 3 6 4 -2 12 3 -7 -2 8 4 -1 -3 -17 -15 -4 0 -10 -11 -6 -8 -19 -9 -2 -4 -12 -5 6 -6 2 -6 7
3177 7 -7 7 -4 4 7 2 5 14 8 12 14 8 3 1 7 6 8 -1 19 1 3 -4 -4 -9 0 -8 -17 -10 0 -6 -15 -4 -10 -15 -6 -5 1 -10 -2 -9 -5 -2 2 2 12 2 5 -3 10 15
3227 15 7 11 2 14 10 5 -5 4 8 11 5 4 2 0 1 9 2 -9 -7 -7 -22 -9 -9 -23 -6 -9 -2 -1 -10 -4 -6 -12 -16 -1 -5 0 8 -1 5 9 7 26 13 12 13 -5 17 7
3275 7 15 10 3 9 -3 1 -11 -9 -3 -12 -4 -11 -11 -12 1 -20 -19 -7 2 -5 -17 -4 -8 -14 -10 3 -9 -8 7 -3 0 17 -1 4 7 7 18 13 15 12 19 7 7 5 9 6
3321 6 11 -3 4 -3 2 2 -4 -6 5 1 -16 -8 -2 -17 -8 -5 -14 -6 -10 -8 -3 -13 -13 5 -9 -5 0 -4 -11 5 17 12 4 5 17 10 12 14 22 17 10 16 11 7 13 14 6 7 -2 -9 -5
3372eOlmpOK%kK%jRoJmKnPRJPj0QKj3MQNj4jN%kLNljKKk1J1%qNj6J3LrJ0rmNm
3425ioQPmMNk%o%J0KPlkq%J4jrP%j2kJ0j2Qj2OJJjjkkopLK%NPnnLNolLpJ6Nol
3479cMKLoQnOJNj0KN%n%jj0lLPln%%m%Lj0J1lNj2J6j1jRLRj2QKQj2kNkj0K3j5
3528CJRoM%Pm%qOqJRj3kpMJmkjJ1ppJ3Lj3J5Loj1%NNJ4j3MPj3J3jk%jQ%qMmkj
3579FnLNkj4LLmrMqJ0lNpKJ%j3J4mRj0J4JlLPLnkJ3j0j2J8mJqJ2orQKmjkOj7J4
3628EqQj0%OKj0KnMKjJ0mMpokJ2K%%mMPOKKj2%%%NokLrJ1klrKjLqmQlJ5j7LJl
3681gMnQJj6QRKqPLpnJ2MnML%lJOpjRjlmlj0LkKLj4J0%RpkKj4J7lj2PJ1lj0Rn
3732cJ3Pj1KRrJMlNrJ9qnOLrlOoj0NJkPj8Qj2J3ljkJ%pM%J4roMJ0jJ3j5RlJ3j0
$$ plain form
3372 -5 1 -2 -6 -13 -7 -5 -5 -7 -5 -5 -6 3 -3 -2 -6 -4 -9 -2 7 8 15 5 13 15 2 6 14 19 5 4 9 9 7 10 15 12 11 13 15 -6 5 5 -3 2 -14 -1 2 -7 3 -6 -10 -5 -9
3425 -9 -15 -7 0 -4 0 5 3 3 -3 -3 7 9 16 13 11 3 3 17 16 7 14 14 2 0 10 -2 6 -6 0 1 2 1 0 -2 -4 -10 -17 -14 -12 -12 -7 0 -5 -10 -7 -2 -8 -11 -8 -15 1 6 0 -3
3479 -3 1 3 6 0 8 3 9 10 15 5 7 12 12 7 7 6 -4 -7 -4 3 0 -5 -5 -5 -9 -9 -6 -16 -5 -8 -3 -15 1 -10 -11 -2 1 10 -2 6 8 16 4 2 7 5 -5 18 3
3528 3 4 13 7 11 11 18 14 14 6 12 4 5 14 1 -1 -8 -4 -3 -7 -9 -10 1 -6 -13 0 3 -10 5 8 2 -9 -9 -4 1 15 2 6 13 0 13 12 10 10 9 17 17 9 13 9 7 6
3579 6 1 4 9 7 -7 -4 -1 -5 -14 -10 -18 -8 -11 -6 -13 -11 -10 -10 -23 -9 -13 -4 -14 0 1 -2 1 8 11 6 4 17 7 -5 13 9 10 2 14 8 -1 7 9 5 4 2 8 -9 5
3628 5 -3 5 -5 -5 1 3 -7 -5 -10 -6 -4 -5 5 1 5 -2 -8 -10 2 4 4 4 0 4 11 17 19 21 9 9 9 9 14 8 6 9 0 11 9 6 -3 -1 -2 1 -7 -11 -3 -6 9 -8 -5 -4 -7
3681 -7 -3 -8 0 1 -15 -7 2 4 -4 3 6 -1 -6 6 10 5 9 12 12 9 10 16 9 8 17 16 13 9 6 -4 -1 -3 -1 2 -12 -2 -2 7 0 -2 0 -14 3 0 -12 -5 6 3 -7 2 -3
3732 -3 10 17 6 8 17 8 9 13 10 15 6 25 17 12 18 21 12 9 15 9 -1 4 5 3 10 -8 0 -12 1 -2 -3 -5 -4 -4 -11 -7 -7 7 -2 -8 -4 6 5 18 3 12 9 22 12
3781A2rJ3j3PlRLqmJ3j2RnjjnrJ4pnOj0j%JJjqlO%J%Pj1J7pNQoOno%J0Rj0%Mj
3831A0NqJ2orlrJ0Oqj5J8KnlpLMLj0MJ0j2PK%J1jLj1qJ2PmrPQj0MlJ6qkOpjlK
3879A0j0Q%q%jRk0KNOj0pJ0ljJ1lqKQJkKKKKqNqJ1OmkKJlJOj0j0PJ3rMj4PoL%
3929a%Nj3J4j7J1mjNj0Rmj0J4mKJ2j0kJ3j3QRkM%ppJ8momPJO%j0kp%%%koKJMm
3977eKmj6J4mORMj8QQjMj2kMRKOqlPJ2j3PnPnJjj3NmNj7J4nQj2KmPj1RjoM%J0
4026Doj0Q%jN%OLqJPjmOKnQjjL%r%nnNJnJLkmmlJ2j5LJ4klKKpOpOoOMj0J3%J6
4080B3qkMj0Jj0J6rQlPKj2NqMj8KJ5j6MnLKpPjkRrnR%J0KpLJ%mPJjRlJjNj2R%
4131A6ljKNnj3Qn%jjkjKoPoO%k4J6j0PPrJ9mj2J0MpJlJ2KpOPqLkMKqJ0j5JJ1k
$$ plain form
3781 12 3 16 3 10 7 16 19 11 7 20 8 17 12 11 10 5 -4 10 3 -2 4 -6 -7 -7 -6 -5 -6 -14 -17 -11 -11 -10 -10 -3 -14 3 -4 1 9 3 9 4 -2 -2 8 17 7 7 11 10
3831 10 15 7 19 13 4 1 -8 2 8 0 -15 3 5 0 -3 -10 -7 -3 0 -10 -6 4 -8 -1 1 1 12 11 14 3 -5 7 14 10 1 8 16 6 10 7 23 15 13 19 12 11 8 10
3879 10 0 8 8 0 0 -1 8 -12 -10 -5 1 -9 -16 -6 -9 -10 1 -2 -10 -8 0 1 -1 1 3 5 7 -1 4 -4 7 13 9 7 9 10 7 8 14 4 -6 1 14 5 9 -5 2 -4 -1 -1
3929 -1 -1 4 -9 5 -12 -1 -5 -6 -1 -11 -2 -6 -16 -2 -6 -4 8 -2 -4 9 -4 4 13 11 15 15 8 1 19 15 9 5 12 13 19 19 9 7 0 0 0 0 -2 -8 -6 -5 -1 -5
3977 -5 -3 -7 -23 -9 -13 -7 2 6 -12 -4 4 3 7 -5 -7 -3 6 8 14 6 3 10 22 9 16 11 18 13 14 13 0 5 1 6 -11 3 -2 6 -6 -4 -8 -1 -12 -3 -4 -10 -6 -6 4
4026 4 -2 -12 -4 -4 -5 0 0 6 9 1 2 9 8 4 10 12 7 15 14 13 16 16 7 7 2 -3 2 3 -2 -1 2 0 -4 -8 -11 1 -14 -11 3 1 -2 0 2 -5 1 -6 0 -6 0 4 -6 7 7 23
4080 23 15 13 17 7 8 -2 14 5 13 10 17 19 7 12 4 8 -10 -8 7 -9 -5 -10 -7 -5 -12 -5 -6 -8 1 -8 -13 -4 -4 6 8 1 4 5 5 1 8 9 8 17 14 15 14 19 7 16 16
4131 16 13 12 14 19 14 1 9 4 4 3 2 0 -1 1 -5 2 -4 2 2 -22 -6 -16 -9 -2 -11 8 4 -8 2 6 -1 0 -3 9 11 4 10 17 9 12 10 14 16 8 18 3 4 15 13
4180A3j2J1j4JLpQj2OooJ1qJ0j3J2jJOmrQPmmJ2Qj3J0mLjMlrJjoJ9Jj1NqJ3j5
4225BNkk1J1%kLLj3MNkQj3J3mPJj5RLoJ2KlnnJ7rMkKkJ3%j4MMmj%kllKmqJ1j2
4274a0%JkQj5J2Rmj4J2jMqnJ0qJ2Oj2JJ1Lj1J4nKmnRlkLKoJj1QJmrJ2j3NnPro
4321a9K1olmKNmRolOJ0jlLLj0PnOoJJ4j3MoJ2n%JrLLrjPrjkjjMj1ORj8J0MlJ1
4371BpJ0Mpj3QJ6npJ3LpOj0J0jj2KOj1%Pjj0MpKKqJ3j3J4j2kJKrPJPnNj2LRoO
4418bmJ9j0nRnmOJMNpj6J4Qj2Qmj4J6lqlLKk%Mj3Rj3NnRqJ2kLJlmNRj2J6qNJ1
4466A7npRpJ1j4ORj1RoonQklKpjoJMlkMrlJ9j1MjoQjJ4j4J2mJLkmRmMjPknOkR
4518B2j3mOnL%lloOj0QjoNkrjRj1LJJ3LnoJ2qMKjoQJ2kokJ5j6%%OooJ3pKmnOj5
$$ plain form
4180 13 1 12 -2 -1 2 -5 3 -9 -3 -9 -15 -4 -12 -2 -15 -3 -4 -3 3 -1 -10 -2 5 1 -3 9 17 4 14 10 13 12 16 13 4 5 4 -2 17 18 7 12 4 17 2
4225 2 7 5 -16 -5 -5 -7 -4 -1 -14 -10 -5 -7 1 -12 1 -3 4 5 -10 -1 2 -4 8 10 7 2 -3 14 5 9 7 9 7 20 20 6 10 14 10 9 9 7 4 1 3 -1 -9 2 -10
4274 -10 -10 -9 -11 -3 -18 -6 3 -1 -15 -3 -4 0 -8 -13 -3 -11 1 7 -5 -4 7 10 -1 13 8 10 6 1 10 7 5 8 10 4 5 -6 2 3 -1 -10 2 -11 -6 -11 -4 -13 -19
4321 -19 2 -4 -7 -11 -9 -4 -8 1 -5 -8 -2 8 7 4 7 10 0 7 2 8 2 3 17 4 8 2 14 9 9 10 1 4 7 -2 -3 4 -5 -6 -8 -9 -10 -6 -17 -11 -2 -20 -10 -6 -9 2
4371 2 -5 5 9 2 -11 -3 13 8 1 14 17 10 16 6 16 15 3 5 11 0 0 7 6 -4 0 -7 -5 -3 -11 2 -11 3 -9 -11 -10 -8 -17 -10 -9 -2 -7 -2 -14 -11 -2 -8 -2
4418 -2 -6 13 3 -2 7 2 -2 4 5 9 14 7 -9 5 13 1 9 5 -9 7 4 -4 -7 -4 -2 -4 -4 0 -13 -4 -17 -12 -17 -8 -16 -4 -6 -3 -2 -5 -9 -4 5 -7 9 1 6 17
4466 17 12 5 14 7 18 4 10 19 8 17 11 5 0 8 6 3 5 -2 -3 -9 -8 -4 -7 -9 -5 -14 -17 2 -9 -5 -6 -12 -4 -5 9 -5 7 3 4 7 5 1 10 6 10 9 16 14 9 15 13 22
4518 22 9 5 11 6 9 9 6 3 -3 3 -7 1 0 -6 -1 -3 -12 -13 -4 -15 -12 -11 2 5 0 -6 6 -2 2 4 3 -3 5 17 15 9 7 22 6 6 6 12 6 0 13 6 8 4 -1 5 -10
4569a0MjLQmkkj7J8Nj0knRLLjJKKK%nlJ5KLqnK1j1jj1J7j0JJj9J8llmjk%J3j8
4616gMPnj0kJ2j1J2j2RlJNmJJ1mJ1j1J3kKnPnmQnJjJ0j5KmNrnR%prMNlllJ3rJ1
4665Er%KNj5MJ3mOkJ0mNj4J2NqQOoqqPLnNOkokmjlpQkQprMpjMPqLlLJ2j3ONNo
4719CNKj2MOjRoPpmMOkoMoOnnRJj2Lj2MnJ4j0jkJ6j8PNlNkLMkj2J0%Qj0%QMpp
4770@J4%jmKjknLKj5lJ6j0jjJJ3j0Rj4jjjNlj1OLK2rMJmkOpLJ6j1JRKqoLnL%l
4820EKlLLoKj0LlKLj4Rj2J8j2Ro%j1J5LnJ2j4QKnKPJ8pj2J0poNLLoN%k%oJ1%r
4868Gm%oNj5J5j2pJ3Mj5J4jj%lOpJ5oJ2rMMmO%j0QKlJkJ0j0lKmrJ3RroqNmj0O
4916gMkLj0LJ3jnJ0Kj6MJjLnPMJ1j4OnNmOkLrRqJ4oj0J1j6KPrJNk4J8j0Qj2J5
$$ plain form
4569 -10 -6 -7 -4 4 0 -2 -4 -21 -3 2 -8 -10 -15 -6 -3 0 -1 0 2 4 6 6 1 -2 13 15 18 10 5 26 15 14 3 20 10 11 12 -7 11 8 5 1 0 -2 -2 11 -7
4616 -7 -3 4 -1 -11 -13 -1 -12 0 -12 -3 -6 -5 0 -4 -3 8 4 15 4 17 15 17 12 19 14 10 18 13 14 13 23 8 10 6 11 2 -3 6 6 -1 -10 -6 -1 -4 -7 -10 3 -6 5
4665 5 -4 -4 -2 3 -12 -8 5 1 7 5 15 11 16 2 14 19 11 19 25 19 11 3 10 13 8 13 19 17 11 9 5 4 1 -6 2 0 8 1 -8 -4 -11 -12 -8 -1 -9 -6 -9 -6 6 -7 -1 4 9 3
4719 3 8 10 -2 2 8 7 16 10 17 10 6 10 16 14 8 12 6 12 7 2 11 12 0 3 -9 -5 -10 4 -6 -7 -9 7 -11 -4 1 -2 3 1 4 8 6 -6 4 4 12 2 2 10 14 7 0
4770 0 14 14 13 9 11 10 8 3 6 8 -7 -10 6 -4 -5 -6 -5 8 -2 7 -7 -8 -9 -10 -5 -8 -19 -13 -10 12 3 7 8 4 2 8 1 4 20 9 10 19 21 13 7 10 5 8 8 5
4820 5 7 4 7 10 4 6 -4 -1 -4 -2 1 -13 -4 -16 2 -10 -1 -7 -7 -18 -3 0 -5 7 -7 1 3 -2 0 7 25 18 6 16 9 3 8 11 14 8 13 13 11 11 5 16 16 7
4868 7 3 3 -3 2 -13 2 -10 -17 -4 0 -15 -1 -2 -3 -3 -6 0 -7 8 2 14 5 9 13 9 15 15 5 13 15 12 13 11 21 11 8 10 6 -3 10 19 10 4 -4 1 -3 -13 -7
4916 -7 -3 -5 -2 -12 -9 4 3 -2 8 10 -6 -2 -1 -2 1 -4 3 7 18 4 10 5 10 6 12 10 13 4 13 5 19 13 3 14 -2 0 7 -2 -1 4 -20 -2 -12 -4 -16 -1
4962aj0MknJ4j8K8j5rMPOj0J3Rj2jJ0koOjrNPknNnkJ1j0RpoqJ3kqOokqKJ3mlm
5010a1RpOjJ1lnMJ2nnQolQkrMKpK%jL%kPKj4Pj1KNMnkkkKmPLmJ0nmOMj0j1J1N
5062CQoomLJ6kmnJ9j1Lmn%JqLO%j6OkMnpJ6pJrJ1nMnN%jlJ3qQpJ4j0lNJjLLLL
5114A8j4KNkmonK1j4QqoJ2j3KLj2Pkm%nJ2jJ%kMKL%JKqJ3mKjj2J0MKnLmOlj4P
5163A%kLklnkMj4NJ5j1KjQMj6RjjJPpJ0KmJ0onLKPj2J5kMmJj1NoJ0ok%MnrQlq
5214hnPlKJkJPLkn%nOJkRj1J7Oj1mLQnnJ3KqjrJ4pMqK%Oj4mnJNnMpPnRJj1qQO
5268g%JOqJ0Ooj%kJ4lLkmj1J0KJJmknjPoMqLmkMMrjNj1NMMjjM%JKLqMqKj0K1R
5322A5j2J3lKpLj0KJ3lmnnJ7j3Jj7J1K%nojqJ5o%MRrRj7J5j1NMmPQNj4KLjkJ2
$$ plain form
4962 -1 -11 -7 -9 -14 0 -18 10 -5 -14 -10 -3 3 -7 6 15 3 2 12 10 4 10 9 0 5 12 10 5 10 5 3 14 4 13 6 0 -8 5 3 -5 1 -5 -7 -15 -13 0 -4 -7 -11
5010 -11 -2 -9 -3 -4 7 4 -1 3 15 10 5 13 7 4 12 10 1 5 7 0 2 2 1 4 4 2 9 11 -3 4 -7 -5 0 4 -1 -3 -5 -7 -5 -9 -2 1 -3 7 2 -2 4 8 -2 -13 -2 3
5062 3 11 5 -1 -5 -2 14 12 8 3 22 11 14 10 5 5 6 -2 1 7 7 -9 -3 -5 -1 -6 -13 3 -4 -3 -12 -1 -6 -2 -7 -2 -2 -3 -6 7 -1 7 0 14 4 1 6 7 6 9 12 15 18
5114 18 4 6 11 9 5 -1 -6 15 1 9 1 -5 7 -6 -4 -1 -13 -6 -8 -12 -12 -17 -5 -6 -5 -5 -7 -3 -1 2 2 3 5 -3 10 6 8 7 -5 5 9 11 6 9 5 11 8 -6 1
5163 1 1 -1 2 0 -3 -8 -10 -6 -20 -15 0 -11 -9 -10 -2 2 -14 -5 -6 -7 -6 1 -6 4 6 2 12 6 1 4 6 13 1 16 14 18 14 15 4 9 3 13 7 5 5 9 4 -5 3 0 -8
5214 -8 -13 -6 -9 -7 -6 -8 -7 0 3 1 -4 -4 -9 -3 -2 -4 5 -6 11 17 6 2 5 13 8 3 16 18 10 9 0 14 7 11 3 5 5 11 -3 -7 -12 -11 -6 -11 -7 -14 -7 -12 -3 -2 -13 -21 -13 -7
5268 -7 -7 -6 0 -8 2 8 2 1 1 -1 13 10 13 11 7 -4 6 8 9 10 6 4 -1 -2 5 -1 3 -5 -2 -6 -8 -4 0 -9 -10 -5 -16 -11 -7 -3 -4 -5 -1 -1 0 2 5 -3 1 -7 -5 -15 6 15
5322 15 3 16 13 15 8 11 1 3 16 13 9 4 -1 16 3 4 -13 -2 0 0 -5 -11 -12 -20 -5 -11 -11 -7 2 -7 2 -15 0 -11 -6 -2 -6 1 9 14 0 2 5 4 2 14
5368A4j0J%KJ1oooOmqONk0RJN%k%nKj0mRkKpJ5oJ2lnL%mQK%kj%MNnpQJ2noolP
5421FLpmoN%Lj0jMKlK%%lLlQj1RQnj2J7nLQj6J1OoQjmmkLKrJ6jj0mkMpnPmNJq
5474ilMrJ2NmpOKJoRmOLmJ0oLNKjlMnkJ%Jj4J3j4OPrRj3KJkMj2QpjMnM%oNLLK
5528ajnjPOPpJ0nlQoj0J3%o%KlJ0j7lJ2nj5QONmNj2PqNJpj0J1k%KmQjOkNnOno
5579dJ3kLlKNj0%OKqPj8J4j2Pkj1KOnnML%nLoMJ0PplrJ0Pj1J2lMmn%RmJ0lRj5
5628DNkJNkll%mOqjRj4LmJj3J5jNj4mJ4Kjo%OPnPpNKJm%O%%%Pmj3LRr%J2j1kj1
5681a1J0%j3J6j7MOLj5J2mkkJ0j3J0%ONj3J5j0POknllJ1Jj1J7j0oMJKNk0K0j4
5722cNoOj2PMnk%JJ%nRqLJ1p%lOlJPm%Pj1J3j4OPj1RNqjj2J1%Kml%LoJJj4%Ol
$$ plain form
5368 14 4 5 5 7 18 12 6 0 6 2 -6 0 5 -15 -6 -5 0 0 -2 -2 -7 -5 -15 -19 -10 -12 -10 -17 -2 -8 4 1 -4 -1 -1 -5 3 5 5 3 2 2 6 11 6 -1 7 19 14 8 2 -1 6
5421 6 9 2 -2 -8 -3 -3 0 -10 -11 -7 -5 -8 -6 -6 -6 -9 -6 -9 -1 -12 -3 5 0 -12 5 0 3 11 -5 6 12 6 14 13 9 5 3 6 8 -1 15 14 4 0 -2 2 -5 -10 -3 -7 -2 -1 -9
5474 -9 -12 -8 -17 -5 0 -4 -11 -5 -3 -2 -8 1 -3 3 6 2 12 6 9 14 16 15 12 16 11 9 10 10 11 -3 10 -4 2 9 0 9 -4 -2 -1 -3 1 -11 -3 -10 -11 -7 -12 -8 -8 -14 -9 -6 -3 -1
5528 -1 -2 -7 -8 -1 5 12 5 15 10 7 15 9 -1 12 12 6 6 8 5 15 -2 -5 7 2 -13 -5 1 6 2 7 -5 2 -6 -1 0 -7 -17 -6 -8 -8 -6 -10 -2 -3 3 1 6 1 7 2 -4
5579 -4 9 7 10 7 9 14 4 4 10 12 4 11 -7 7 -5 2 0 -11 -9 -3 -8 -13 -9 -6 -6 -11 -8 -14 -10 0 7 0 -3 -12 -2 5 -6 6 3 7 3 -2 -2 7 3 13 10 19 4
5628 4 9 7 8 13 11 8 5 5 1 7 -1 -2 7 -7 -4 -8 -7 -20 -5 -6 -1 -15 -19 -5 -3 -4 -10 -10 -4 3 -2 5 -2 3 5 6 2 2 8 8 8 8 15 11 -2 1 10 1 1 13 2 0 -11
5681 -11 -1 -1 -14 2 -15 -11 -5 -2 -17 -5 -9 -11 -13 -3 -16 -6 -6 0 5 -8 7 -3 4 10 8 3 0 -3 8 9 -2 15 5 -1 3 4 6 11 -9 11 -3
5722 -3 2 -4 2 -10 -3 1 -4 -6 -6 -5 -4 -4 -9 0 -8 -5 6 -1 -1 -4 2 -1 0 7 3 3 10 -1 12 -2 4 11 0 9 14 6 5 -7 4 4 6 2 -1 -1 2 -4 -3 -2 -16 -16 -10 -13
5774a3J4nPrjoLJRJkKNpJ1ooOqPLOlLKpJLJrjKnLJkKpQq%J0j8jJ4j8NK%O%MJ1
5827A1j5J0poQLLmNj7J4kJ2kj0J5lj0joRmJKnjn%mKJ1oj7QKJ0Lj7MO%Pj4JKKM
5874aQMj5rJ1NJ0pNnmLjmKmMnlKlLM%nkoOqNjKmK%Ko%RoPLnJ4okLMl%nRmMLpO
5931I%qjlKoJkJ0rNrJ7j5jRj0J2j1RmOJkKpkJ2MmjRj3l%J5PpJmpJJj%OPk4J7n
5981DoJ0%rj0J1lmKLjKqOMnmJ1pkNJqJ6Qj7LJLnPKMpMKjnlnLJoJpkOJ0j6jJ0p
6033ijqJ5nMLpJ0JpJ1j8K0qMnoOKL%Qj4NpPqJlRJKLpj3kjJnRJ1j2LKn%nJ4%mR
6084Dj0RlMmNLjqNj0J3KnoNQ%qNMj0jqmMMKrMnLMmMj1J3Nj6J0LMJj2QQj1lNlJ0
6135GkJjLlOj1%OMj2KnRjj3NLmmNjmJ%qQjMlnjJ5lkPoLjKKLRnrLmQNjnkpJ3rj
$$ plain form
5774 -13 1 -4 3 -6 -7 -13 -10 -9 0 1 -1 1 6 -1 10 4 -2 4 -4 3 6 12 9 12 14 7 8 11 12 3 2 4 -1 2 3 1 3 -4 4 -4 -4 6 -12 -13 1 -17 -12 -10 -10 -4 -4 0 11
5827 11 -4 6 -1 -7 1 4 7 3 8 -9 5 3 15 13 3 18 15 5 4 -2 7 3 4 6 1 0 -5 -5 -9 -7 4 -2 -19 -11 -9 1 4 -13 -9 -3 -3 4 -10 -9 -7 -5 -1
5874 -1 7 11 -4 -13 -2 3 13 6 11 6 2 5 4 0 2 -2 2 -3 -6 -4 -7 -4 0 0 -5 -7 -13 -7 -15 -10 -11 -9 -13 -11 -11 -9 -15 -15 -6 -12 -5 -2 -7 7 1 -1 2 6 3 3 -2 7 3 7 10 3 9
5931 9 9 1 0 -3 -1 -7 -6 -8 2 -7 -2 -11 6 -9 -10 -1 -11 1 -10 -1 -5 1 2 0 2 -5 -7 5 9 5 4 13 0 -3 -3 12 19 12 13 9 2 3 4 3 3 9 16 -8 9 4
5981 4 -2 8 8 -1 -11 0 -3 -7 -5 -2 -3 -1 -9 -3 1 -4 -8 3 -4 -6 -1 0 -8 8 16 -1 2 3 6 1 8 10 14 7 11 13 12 7 4 -1 2 3 -3 -2 -9 -11 -5 5 -11 -12 -2 -9
6033 -9 -10 -18 -3 -8 -4 -1 -8 2 3 -4 7 -11 9 1 5 0 -6 0 2 5 5 13 -1 4 -3 4 -4 -3 -6 3 4 6 9 2 -11 -13 -14 -13 -18 -9 2 -10 -7 -5 -10 -10 -15 -1 -1 -5 4
6084 4 -6 3 0 4 0 5 8 7 -1 4 -6 7 9 4 -2 3 11 11 3 8 12 2 1 -7 -11 -7 -3 -1 -10 -6 -11 -8 -4 -8 -4 -15 -2 3 -13 -3 0 4 5 -7 1 9 -2 -5 0 -3 7
6135 7 5 6 5 8 5 11 0 0 6 10 -2 0 -5 4 3 -10 -5 -2 -6 -10 -5 -6 -10 -9 -9 -17 -9 -10 -6 -9 -14 -15 0 -3 -5 2 -4 -1 -2 0 2 5 14 9 0 3 -1 7 12 11 6 4 -3 10 1 0
6191@p%Qjj0J3npLJ0j8LnJ5rLkjlNJ2j6OKKNNLj4OKJPnlkNj4J6j2Pm%jmmNjnj
6241a0Q%oKLj2PKL%j1nRQojjJ6Oj2RnPKjjJjJj6KJ3%Oj4KJ4j6JqNm%nNlj0KJ5
6290AJlnJOnoMOpOQjMoPjJOj2J2j4MRj7RKj0LoJ2j0NnkQlomPJjnK%MKoJ3mknl
6343eJ0KJ0j8PpQkJKl%KnLJ0JpOj1LJ1r%nj0lPkl%OonJ2rLN%JjKJ2j6J8pjlOj
6393INLj3LJkMMnKqJ1pj1PjnNmjjJLnJj1K1j0njQ%qRMmKjJRjmKRknjpKJNPj1J
6447F%mOlj2J3j5L%oJ0nKkQmj2J2Mj1LJ4mj3OJ0%NllPj0J5jLj2LlPj0lOJj1NK
6493DjoKKnMlj4RnJ3Kj2Oj1J3%JMnJ0j5%QLj0NJ1LnJ0j9PKLj2JkMknJ0j1N%kM
6540AqjllKK%MNqJMJ%kJMnQpJ6ljklJ9j1pL%J2qnKpKOj0KLLJj6OnOLj0j0J7qj
$$ plain form
6191 0 -7 -7 1 0 -10 3 -2 -9 -6 4 -14 -11 -16 -1 -10 -7 -9 -10 -13 -8 4 -12 -6 -4 -2 3 8 11 -3 3 5 6 13 8 5 3 8 -6 10 -2 5 1 1 0 -4 -8 -3 -4 -9 -10
6241 -10 -2 -2 -8 -6 -3 -15 -8 -6 -3 -3 -14 -19 -10 -2 -8 -9 -10 6 12 0 9 4 11 13 12 11 12 11 12 -4 -2 11 11 17 3 5 19 3 4 -4 1 -3 -3 -8 -3 -6 -16 -14 1
6290 1 2 -1 -6 -5 1 -4 -10 -6 0 -7 -1 7 6 10 4 11 10 11 17 5 17 3 7 16 -1 8 10 0 3 -3 9 -1 4 -1 -3 5 2 -4 -8 -1 0 -1 -6 -4 -4 0 2 -4 9 5 3 -2 -5
6343 -5 5 7 17 -1 6 -1 7 5 6 8 5 5 7 2 5 15 16 9 15 4 7 18 9 9 4 -6 -9 -2 -4 -7 -7 -1 -7 -12 0 -9 -6 -1 -1 0 -1 1 13 -3 15 8 7 4 10 9
6393 9 14 17 4 7 8 6 10 14 9 11 3 14 7 -4 3 2 -3 2 -2 -3 -4 -3 0 -5 -4 -15 6 -4 -9 -10 -2 -2 -10 -1 3 -1 1 0 1 10 9 5 7 16 14 9 8 1 3 4 9 16 5 6
6447 6 6 2 8 5 -7 6 -9 -6 -6 -12 -2 -7 -5 -7 1 -3 -15 -3 1 -10 -7 7 3 -10 -4 6 6 11 8 5 12 2 17 16 19 7 10 7 14 4 1 7 8 -3 2 4
6493 4 3 -3 -1 1 -4 0 -3 -17 -8 -13 0 2 -10 -4 -15 -2 -2 -1 3 -2 8 -7 -7 1 4 -6 -1 10 13 8 18 -1 6 8 11 -1 0 -2 2 0 -5 5 -6 -1 -1 -3 1
6540 1 -7 -8 -11 -14 -12 -10 -10 -6 -1 -9 -8 -4 -3 -3 -5 -4 0 -5 3 -4 12 9 8 6 3 22 11 4 7 7 19 11 6 8 1 3 9 -1 1 4 7 8 -8 -2 -7 -1 2 -8 -18 -1 -9 -10
6592a0OllOnJ9rJNmjP%pJ3k5J9kMnKoJ1klj6J2JkJ0k0nRPrJj0NMKJKqlPmRj2R
6641bKKJ2j3pLJ2jqJ3Onj0kJ0nLj2QloNj1lQj%nJ3rnNMrJ2lmjjOKlRJkoqJ1Lo
6691aPOLj5J3JJoJ%lj2QJn%MKpnJ1noQOmmMj1J2qJ4j4jlJ3j3RQmJ3j3RnmJ3j3
6738E%%KRJpLnnKkNlpQpLkLj5MjpNJNoJ6j4J0j0L%J1qN%jMNmOkoMnMKkKMk0Pq
6792hQp%J1j0mNmkOj%nLMKlmkOjOKrMLKkOMoJpLOJPj1oJJ%L%%nlJ3oj1JMpRpO
6848cMrLPkJJjJjmNJ2lnkOpNoRJoMj0J6j4NkkkoKOr%jqQKNj4J4jLjKQj3lNOko
6902bPNMj6NKNkkpmJ2OPj1kmkj2J0pMLJ5k1ROk7RQj3MJNQlMj3J3klMOrJ1pmQl
6951EKJ2q%j0JNOj0JonJMNnNlpKKJmmkJ0pMkPj0Q%KLj2J4mMLMmOojMqQmjNqnK
$$ plain form
6592 -10 -4 -7 -10 -4 -9 10 1 2 7 3 2 9 9 2 15 -10 9 7 11 6 8 2 13 11 8 -8 4 5 3 13 -7 -12 -3 4 -5 -4 -14 -9 -5 -3 -2 0 -8 -11 -4 -8 1 -11 -2
6641 -2 0 2 14 1 -6 -3 9 8 0 13 19 14 4 2 12 7 10 -2 6 3 -3 2 -9 -12 -4 -5 -5 -10 3 -6 -11 -6 -2 -11 1 -2 -6 -7 -8 -2 0 -3 6 7 5 -1 -9 2 5 -1
6691 -1 6 12 15 0 13 14 15 9 10 10 7 -5 3 4 -1 -1 3 5 -2 -7 4 -1 -7 1 7 3 -1 3 -8 4 -4 10 -4 -5 -8 5 -8 1 9 5 18 5 14 9 5 18 5
6738 5 5 5 7 16 17 10 13 8 3 5 3 8 5 -2 6 -1 2 0 3 -12 -8 -9 -16 -11 -10 -5 -11 5 -9 1 -9 -6 -6 5 -3 2 2 1 5 10 6 12 10 4 8 3 7 9 7 9 13 -7 0 -8
6792 -8 0 -7 -7 4 -6 -10 -5 -9 -11 -5 -6 -6 -11 -8 -4 -2 -5 -9 -11 -5 -6 0 2 -7 -3 0 2 0 6 10 4 5 -2 1 7 8 15 4 -2 -1 0 0 3 3 3 -2 -5 8 2 -9 -8 -4 -11 -2 -9 -3
6848 -3 1 -8 -5 2 0 1 2 1 2 1 -3 2 14 11 6 4 10 3 8 2 11 12 6 10 0 16 2 7 5 3 1 -5 -3 3 -6 -6 -7 -15 -7 -5 0 -14 0 -1 2 1 3 11 -2 -5 0 6 4 -2
6902 -2 5 10 14 -2 3 5 10 8 6 -1 -5 7 13 20 9 7 3 1 -11 -1 -8 -4 -1 14 -7 2 8 -19 -10 -2 -15 -11 -10 -5 3 0 4 -9 4 2 -1 3 9 0 11 4 0 8 5
6951 5 7 19 11 11 1 2 7 13 3 4 -2 -7 -6 -2 3 -2 3 0 -7 -5 -3 -2 -6 -10 -12 -2 -9 -5 -7 0 -10 -2 -2 0 3 -9 5 1 5 8 12 8 14 8 7 11 3 11 7 6 11 3 -2 0
7005@LrJOOlLkj2JqPmJ6mJkj5J2lJ1j3LKOJMoN%JlOomPLj0MnQjLpqLrOJpKMLM
7059BqKJ%mPlKMp%KJRKjLklJkOPj3LkJ4j4pOJoKNKj2mkLjJ1j6O%kL%jrJ4kM%M
7113Fkj2J6nPKj5OJPrJ2j9K2mknpKPPj8J0j3OMj2RqMOKpPj5PjJjKmJ5K%NmnJK
7162A0JkrJJ3j6J2rqJ5Jj2KMqOPj0j2QRj4J1oj0J7j1MPrkJQjNl%J4j0PpK%jNr
7208AQmMkMmOjj1JMoQjlj1jQpoJ1nLkKllPMrJRqNNJkMPp%njQm%jNKj6%J1nmjQ
7264Dj3mJ3oKlNj1J1o%MJj3PJPj0K%nJ4RJj0NOnjOKj0lK%OJoOmk%qJlJJ1j0Jp
7314a1J0krJ4lkJm%jQnOKoPj4J9Klj1PPknMmMrQJjJLrj6MLLmnPJlrRJRj0%jKN
7367amKkJ1NpmjLJKJPLqljMmJ0j1QolnkkMpjP%Nj2MNl%pOPn%%JKJkMKJ1j0Nj0
$$ plain form
7005 0 3 -6 -5 1 7 4 7 5 -7 -6 -14 -7 -11 5 1 2 0 -15 -3 -6 5 -8 -5 -3 3 4 8 2 7 7 8 5 11 5 1 8 11 1 5 0 8 7 10 3 -5 -2 -11 -5 -4 -11 -9 -5 -2 2
7059 2 -6 -4 -3 -3 -7 0 -3 -1 3 -4 -4 -2 -1 8 10 9 12 10 7 8 6 12 19 6 9 7 21 7 0 6 7 1 3 8 10 -2 -6 -8 -5 -6 5 -11 -5 -5 -7 -4 -4 -5 -14 0 -2 2 2 6
7113 6 4 -8 8 3 10 12 -3 3 4 11 2 14 -5 17 13 11 6 -1 1 8 15 -3 7 -6 0 4 -8 1 -7 -3 3 5 -2 5 -10 -3 -4 -3 -4 -2 -6 9 11 11 16 12 7 8 10
7162 10 11 9 0 1 14 -2 10 1 -7 8 9 -3 -1 3 -5 1 8 -2 -14 -6 3 -11 0 -6 -16 1 -10 -6 1 -8 -10 -9 -1 -2 3 0 0 14 4 11 4 6 6 5 10 1
7208 1 9 5 9 7 11 7 13 12 1 2 6 0 8 7 4 -7 -8 0 -7 -13 -2 -7 -4 -6 -4 -7 -10 -3 1 -8 -7 2 -6 -1 4 5 3 7 14 7 7 2 1 9 5 5 4 9 11 -5 -5 6 1 -3 -4 4
7264 4 -9 -13 0 -6 -4 -7 -2 -13 -2 -8 -8 -4 -3 -16 -9 -8 -1 -11 -9 -9 -14 0 9 10 0 5 11 6 5 11 13 3 0 2 2 8 9 3 9 5 3 3 -5 -4 -7 -6 5 -5 -4 -11
7314 -11 -1 -3 -12 2 -1 -3 -2 -6 -6 -7 1 -4 2 4 -2 5 -9 10 12 9 -2 5 12 10 5 9 5 9 0 8 9 8 9 12 3 -13 -9 -6 -3 -7 -12 -5 -4 -7 -16 -7 -6 3 -7 -7 -8 -6 -1
7367 -1 -5 -3 -5 6 11 4 0 -1 2 3 5 6 13 16 8 5 4 8 4 14 3 11 5 2 -3 -5 -7 -3 -10 -11 -4 -4 1 -11 -7 -2 -5 -5 -12 -6 1 -4 -4 -4 -3 -1 0 -2 2 4 15 5 10 0
7421@lMRoMKj7RkLJoPj0J2nJmnLKrkKoJ1pkOJ1j3J3jJJKmOQpp%J0j1J7rloJ6j
7471A5nj4J2JlmLoJl%NqmRrR%pJ4nqNJpJ3M%rNlkPKL%lmJ4oJpJjpROrQk0lPKJ
7525AOrLjLkLlj3RJl%MLpLOj1J4OoMLj4RLj0RqJ0j4J0qjMMroKJo%J0nlLJj0J0
7575dlJJlQKpkJ2Lj0JLjJ4qLmjLmpRpN%jJj1%J0Qj3LnLKonKj1J4plOkOPj5NPk
7627cjJ2j0J0j5J1NoPj3K%PjJjpJ0qj2NnJ4Lj7MLLMmjnNJmNj1PP%pJJ2ppJ6qL
7675EJjKNnrJ6qkk%knPJllj2J2kJ2j6J2mj3J8j2J0j0mPlJJ1jpRjJJOj2J2pMjj
7722GJ1j0PqMOnjoLNj4RojJr%jjNlNKKmj0QOj0NLQlmKKjjJ1j5NNKjlJJqOlj3O
7775cOqJ0jpJ1roPklKLpJmO%NmnLj1K9kknkNpJ7j6J4Mj5jMPnqJ4rjpLLj0KjPo
$$ plain form
7421 0 -3 1 10 4 8 10 -7 2 0 3 4 -2 5 -5 7 2 3 -1 -6 -3 -1 -10 -12 -10 -16 -5 -12 -14 -8 3 -10 3 2 3 4 6 2 8 16 9 2 2 12 1 18 9 6 0 16 15
7471 15 10 -4 8 9 6 2 5 -1 0 -3 -3 2 -6 -10 -1 -10 -1 -1 -8 6 1 -7 -2 -1 -8 5 9 9 0 5 2 0 7 9 12 12 9 5 19 13 14 7 8 7 0 9 15 6 14 -6 -9 -2 0 1
7525 1 7 -2 1 0 3 1 4 1 -12 -3 -2 -5 -5 -1 2 -5 -2 4 -7 7 13 7 11 14 0 9 12 2 11 3 13 -1 9 1 0 4 8 -1 -7 -5 -4 -10 -10 0 -5 -8 -5 -4 -14 -4
7575 -4 -7 -6 -5 -8 0 2 -5 -7 5 8 -2 -1 2 1 15 7 10 6 5 8 4 -3 6 -1 4 4 3 4 -7 -7 3 11 -2 1 -4 -1 1 -5 -10 -8 -19 -5 -12 -15 -9 -11 -5 2 -13 -8 -1 -3
7627 -3 -4 8 -2 8 -7 4 9 3 10 -3 -1 -1 6 5 6 5 -2 8 0 -12 -7 -12 2 5 -12 -8 -5 -2 2 -2 -3 -8 -3 -2 -6 -1 -12 -5 2 2 -5 -4 8 1 -6 10 2 5
7675 5 6 5 7 12 7 -2 14 6 4 2 2 0 -5 2 3 0 -3 -15 -3 -5 7 -9 3 -1 -14 4 -8 2 -8 -12 -5 -8 -7 4 3 -4 5 4 5 6 12 0 12 5 9 8 7
7722 7 18 8 15 7 11 17 12 11 5 8 13 -1 8 2 1 2 -7 -7 -8 -9 -4 -7 -2 0 2 -2 -12 -4 2 -8 -3 0 8 5 1 3 5 4 3 14 -1 4 9 11 10 7 8 9 1 7 4 -9 -3
7775 -3 3 -5 5 4 -3 8 -1 -7 0 -2 -5 -3 0 -7 -6 -10 -4 -4 1 -3 -8 -5 -16 13 11 9 4 2 7 0 17 1 15 19 4 3 7 14 9 1 15 6 5 -2 1 4 -6 -4 -5 2 -4
7826djL%oQqPRlj3jJ4KoMkoQLjnjROoj0J5jj5J5k1J0jknL%lRj2rJ3Qj4pK0j3J
7874iNMnKOJl%nPLlKmJ4j1mjJ3pNkKj4LOOroKQj3J3rNj2jQMj3NJ3j5ONpjQqOO
7925F%%PkrJ0j3J0j5J2Lj1J0jJKmqLnJ1j1JoPj3K2j1Plj2OqJ0%pLjJ0Kj4J7Lj5
7969fOJ3nNpnQoPRqKj4NOJrLQmj6JMmokJ6rlRpNjlLO%nJ0pnOJ2j4J2j5J4lrOo
8020bLQj0RjqJ3j7RkMlp%NklKPrJMj3J3kNj6J6jkRkj0jRj2J1MnLKKlJ0j0Nj5Q
8068F%oJ4Pj3j1J5j6KOnj0J5j0%OkmKnRmKoJ3knPknNmKmPpOJ5rnJ0%pmoRMnoJ3
8118A2llojj1PKJlOj1LMK%j0PPpQJqNJQJjMj6J9qpLOloJjRj4Pmj1J3%%j1KJ3j0
8168cjKlK%mlnQJ1nnOoJ2nOpJ1JqJM
$$ plain form
7826 -4 -5 -2 -2 -8 0 -8 -1 8 5 -8 -9 5 7 1 5 3 -3 5 8 7 2 1 10 16 10 0 15 14 -1 14 -7 3 2 0 -5 -2 -2 -5 4 -8 -17 -4 4 -10 -17 3 -10 -9
7874 -9 -4 0 -5 -3 3 4 1 1 -4 3 6 3 5 1 15 4 0 -1 12 5 10 8 10 -4 -1 5 11 2 -4 -2 6 -7 6 -3 2 -10 -11 -3 1 -12 -7 6 -9 -3 2 -5 -6 2 -6 0 6
7925 6 6 6 13 11 2 12 -1 9 -6 6 9 -2 8 7 8 10 6 -2 1 -4 7 -4 -3 -9 -2 -15 7 -4 3 0 -12 -6 -14 -4 -4 -11 -8 -9 1 3 -11 6 9 -6
7969 -6 0 13 8 13 6 1 9 3 10 19 11 13 -1 4 10 11 2 5 13 9 -7 -6 -2 -6 -12 -14 2 -7 -10 -1 -8 -3 -4 -7 -4 2 2 -3 7 0 -5 1 13 -1 11 -4 10 7 -2 4 -2
8020 -2 1 9 -1 8 7 -1 12 -5 4 2 6 3 -4 -4 1 -1 -4 -2 5 -4 -3 1 -12 1 -1 4 -12 4 3 1 10 8 -2 -3 6 -6 5 9 4 7 9 11 8 18 8 13 -2 6
8068 6 6 0 14 21 8 -3 12 -4 -2 4 -1 -11 4 -6 -6 0 -2 -6 -4 -9 0 -4 -2 -8 5 3 -2 5 3 -2 3 -1 1 -3 4 -3 3 18 9 4 14 14 7 3 -3 6 10 5 -1 12
8118 12 9 6 0 -1 -12 -5 -3 -2 -5 1 -10 -7 -3 -1 -1 -11 -4 3 -4 4 5 -3 2 3 11 12 11 15 -1 18 10 3 6 12 9 3 4 3 12 -2 5 1 -10 3 3 3 -8 -6 7 -3
8168 -3 -4 -2 -5 -3 -3 -7 -10 -15 -7 4 -1 -6 0 -6 6 1 7 0 11 12 4 5 9
8191I
$$ Imaginary data points
##PAGE= N=2
##DATA TABLE= (X++(I..I)), XYDATA
0@%%%%%%%%%%%qJ6j6J6k4L2m0M8n6P2q0Q8j08J32j56J80k08K40k77L17l60M10
33B18m66N28n96O70p52Q44r42J048j166J296j438J592j758J940k140K357k597
50a362K861l151L474l833M231m678N187n767O436p220Q152r285J0690j2488J4891
65H138j8276K3432l2336N1851j67814J25441L02730l03692r8132J71344o8887
76f201k10723K65213K55252k93424k97349K51505J93724j75709k2178J94042j58403
87d251k57460K24380L11165k03863k51411J52345J04712j68161O2685K39631j49074
98F0698l08271J50192K85754j17779j70043J34275K0068k09178P5892K90595r4357
109A17846k99825P6653K16724r3866q7779J68300r335k58649L9572K94025l1914
$$ plain form
0 0 0 0 0 0 0 0 0 0 0 0 0 -8 8 -8 8 -16 16 -24 24 -32 40 -40 48 -60 72 -84 96 -112 128 -149 168 -192 218
33 218 -248 280 -316 354 -398 446 -496 552 -614 682 -756 836 -922 1018 -1122 1235 -1362
50 -1362 1499 -1652 1822 -2011 2220 -2458 2729 -3038 3398 -3822 4330 -4955 5735 -6753 8138
65 8138 -10138 13294 -19042 32809 -135005 -9564 293166 -10526 -108658 62686 -6201
76 -6201 -216924 48289 303541 10117 -287232 -35727 157997 -17712 -39890 154152 -4251
87 -4251 -261711 -37331 273834 69971 -181440 -29095 75617 -92544 -29859 209772 60698
98 60698 -247573 -97381 188373 70594 -99449 34826 54894 -154284 -78392 212203 117846
109 117846 -181979 -105326 111398 17532 -70247 98053 88718 -169931 -130359 163666 131752
120A31752k42759M8168J37549j18534m6295K13396J0211k69324j2224K47627j047
131I8520j67639O4367Q7430j59364n0728K30383N0782k34854m2219J80152j1939
142D4891j14165J03141Q0648j83946q1241K10244P8500j79220l5035J28769m9036
153C550j00851J34570J03634j77719j07326J67550P5440j32457j266J11285q4159
164g749j17246J38946J27610j45921j07944J24920M6069j10850L4767J20477r5884
175G195j37608J15962J30417j07087q2689R9898J0216j13287N2479J36881q1654
186C0723j41868Q2680J09165q1592m7754R8324j2630j27483M7152J43724n5735
197D4706j25982N9651P7187p8877k2065J12221j4640j38016K8427J34236l5939
$$ plain form
120 131752 -111007 -62839 74710 -43824 -90119 123277 133488 -135836 -148060 99567 98520
131 98520 -69119 -4752 82678 -76686 -127414 102969 153751 -81103 -123322 56830 44891
142 44891 -69274 33867 114515 -69431 -150672 59572 138072 -41148 -76183 52586 3550
153 3550 -97301 37269 140903 -36816 -144142 23408 98848 -33609 -34875 76410 -7749
164 -7749 -124995 13951 141561 -4360 -112304 12616 58685 -52165 -17398 103079 7195
175 7195 -130413 -14451 115966 8879 -73810 26088 36304 -76983 -24504 112377 30723
186 30723 -111145 -28465 80700 -892 -48646 49678 37048 -90435 -43283 100441 44706
197 44706 -81276 -21625 55562 -23315 -45380 66841 52201 -85815 -57388 76848 40909
208D0909r8669N6516N0901r2366j4739J25587j930j34117J1390J11624l1843p2667
220d9404O8283L9406j06578k2178J25439J2583j15347O170Q6186m1309n7745Q2276
232B7782M2005j09348l3819J10516J8159r1443J3941O9173n5393n6432Q8336N0901
244G4378r9216l9352Q9885J1634p4429K8305O5626o4799o3528Q3513N6713q2991
256a4261l4348P4316k394o9760M0186P1374o4613o9550P1455N3307o8971k1364
268c4623O8668j5547p3960M3320P7241n5824o7615N8661M1703o2186p704P0960
280D3094k1209p9201L7549P6369m4544n7381N1270K7917o3032J39P5755j8537
292B8189p9476K8387O7854l7492m4114N1569J8493o7956L08P7635j1770p3272
$$ plain form
208 40909 -57760 -1244 49657 -42709 -57448 68139 66209 -67908 -56518 55106 23263 -49404
220 -49404 18879 58285 -48293 -70471 54968 67551 -47796 -41626 44560 3251 -54494 27782
232 27782 69787 -39561 -73380 37136 55295 -36148 -22207 46966 -8427 -64859 23477 74378
244 74378 -24838 -64190 25695 37329 -37100 -8795 56831 -7968 -71496 12017 68730 -14261
256 -14261 -48609 25707 23313 -46447 -6261 65113 500 -69050 2405 55712 -13259 -34623
268 -34623 34045 18498 -55462 -12142 65099 9275 -58340 321 42024 -20162 -27866 43094
280 43094 21885 -57316 -19767 56602 12058 -45323 5947 33864 -29168 -29029 46726 28189
292 28189 -51287 -22900 44954 7462 -36652 14917 33410 -34546 -34238 43397 31627 -41645
304d1645K2307N5877l7758l3931N6818J6101p1473m271P3838o667o2972K2467
316a1309M5567m3018k9878O1449J8833o9698q555O5186o511n2856K7345M0224
328C6779m8274l0914O1307K2218o2664q845N5544j1077m6558L3114L9756m9695
340i309l3423N6166K2546n4023m611M8941j7244m5088L6086M1581m6626l3831
352c8835M8968J8742m7708J771M6957k1575m6464L5012M2205m1102l0571M3279
364A0679J2407m5460P073M7985k2212m7329L1095L9594l6151k4582M0929O510
376B0538m6237R149M9069j9820m5375K6997L4092l3847j8397M1526L285m7524
388b6544Q158M7837j6633m0620K4944K7978l4410j4389M3111L108m7135N888M4010
$$ plain form
304 -41645 -19338 36539 -1219 -35150 21668 37769 -33704 -37975 35863 29196 -33776 -11309
316 -11309 34258 -8760 -38638 22811 41644 -28054 -36609 28577 22066 -30790 -3445 36779
328 36779 -11495 -42409 18898 41116 -21548 -30393 25151 14074 -32484 630 40386 -9309
340 -9309 -42732 13434 35980 -18043 -22654 26287 9043 -36045 41 41622 -5004 -38835
352 -38835 10133 28875 -18833 -17062 29895 8320 -38144 -3132 39073 -2029 -32600 10679
364 10679 23086 -22374 -15301 32684 10472 -36857 -5762 33832 -2319 -26901 14028 20538
376 20538 -25699 -16550 32519 12699 -32676 -5679 28413 -5434 -23831 17695 20980 -26544
388 -26544 -18386 29451 12818 -27802 -2858 25120 -9290 -23679 19432 22540 -24595 -18707 25303
401B5303j4921l4874K5554K3476l6317j3179M3535M460m4301M615L8816j5665
413F502l0147K7728K1510l7495j3764M1731N370l9894N407L4216j8027k7710K9587
426E014K1494l6742j4333L8244M524l5633P897L1541k0447k7249K9800K1841l4217
439h266j3537L4529K019l2938J0713L0790k1510k7421K8237K1124l1132j1148
451a8540L1951j028l2008J2462L0858k0823k6851K5820J8903k8767q019L0943
463A4901l291l2038J2567L0478j9083k4937K3806J5837k7815n372L1030m109l1909
476a9935J1561K8911j7524k2045K3046J2968k8062l935L1185l771l0789J0475
488g915K6341j6986j9129K3412J1135k8510l725L0529l115k8624J0131K3547j7488
$$ plain form
401 25303 10382 -24492 1062 24538 -11779 -24958 18577 23037 -21264 -16649 22167 6502
413 6502 -23645 4083 25593 -11902 -25666 16065 21435 -18459 -13052 21164 3137 -24573 5014
426 5014 26508 -10234 -24567 13677 18201 -17432 -9535 22006 1559 -25690 4110 25951 -8266
439 -8266 -21803 12726 14745 -18193 -7480 23310 1800 -25621 2616 23740 -7392 -18540
451 -18540 13411 12383 -19625 -7163 23695 2872 -23979 1841 20744 -8023 -16042 14901
463 14901 11610 -20428 -7861 22617 3534 -21403 2403 18240 -9575 -14947 16083 11974 -19935
476 -19935 -8374 20537 3013 -19032 4014 16982 -11080 -15015 16170 12399 -18390 -7915
488 -7915 18426 1440 -17689 5723 16858 -11652 -15377 15152 12037 -16587 -6456 17091 -397
501c97j7062K4139J0502k8308m021K8829k983k6041J0755K1352j8442j6048K4346
514F621J0434k7077l964K6568l721k3839J1922K0104j9061j5736K3676J0206k5257
527i124l110K4529n097k2507J2962J9598j8949j5373K2312R301k3446j640K3189
540A2645o432k1883J3295J9194j8073j4485K0840P771k2204o3K2550p204k1494
553a5543J2950J8357j6984j2974J9785O058k1642J072K2238p298k0815J2254J6985
566A4443j6193j1221J9373M652k1462J579K1735o997j9610J1717J5258j5906r662
579a2294J9322L841k1172J622K0728o706j7994J1586J3621j5983q604J9201L495
592A0663k0373J572J9284o750j6359J1833J2400j6109q003J8726L306j9209J814
$$ plain form
501 -397 -17459 6680 17182 -11126 -15147 13682 10699 -15342 -4587 16765 -1677 -17725 6621
514 6621 17055 -10022 -13986 12582 8861 -14978 -3056 17048 -2013 -17749 5927 16133 -9124
527 -9124 -12234 12295 7198 -15309 -2347 17251 -1698 -17071 5241 14542 -8904 -10544 12645
540 12645 6213 -15670 -2375 16819 -1254 -15739 5101 12872 -9332 -9395 13155 5951 -15543
553 -15543 -2593 15764 -1220 -14194 5591 11649 -9993 -8921 13317 6019 -14796 -2542 14443
566 14443 -1750 -12971 6402 11054 -10408 -8829 12906 5909 -13701 -1984 13274 -2632 -12294
579 -12294 7028 10869 -10303 -8681 12047 5341 -12653 -1067 12554 -3429 -12033 7168 10663
592 10663 -9710 -8138 11146 4396 -11963 -130 12270 -3839 -11842 6884 10190 -9019 -7205
605g205J7783p200j5091J2224J1661j5999p651J7939K919j7992K435J6635p881
618B577j4315J2498J1197j5602p138J6981K165j6937L278J5820q385j3761J2370
631G48J0624j4881o343J6050J221j6118L984J5213q500j3167J1876R802j4053
644c544n345J5254L85j5530M355J4636q263j2387J1283Q794j3471m343J4817k55
658F386j5117M480J3993q033j1444J0990P756j3296l529J4627o49j4685M512J3242
672I233p984j0475J1006O848j3249k975J4357q57j4032M572J2290q029r520J0987
686B172O206j3016k667J3745r78j3084M646J1279q061q743J0831N739j2509k417
700f857J2916j180j2144M833J0490q135q209J0624N372j1972k055J2208j600j1485
$$ plain form
605 -7205 10578 3378 -11713 511 12172 -3827 -11478 6461 9380 -8612 -6177 10458 2577
618 2577 -11738 760 11957 -3645 -10783 6198 8363 -8574 -5296 10524 2139 -11622 748
631 748 11372 -3509 -9852 6198 7419 -8699 -4715 10498 1998 -11169 707 10509 -3544
644 -3544 -8889 6365 6750 -8780 -4425 10211 1948 -10439 844 9638 -3833 -8176 6641 6386
658 6386 -8731 -4251 9742 1709 -9735 1255 9011 -4285 -7814 6813 6164 -8521 -4009 9233
672 9233 1249 -9226 1780 8628 -4621 -7596 6761 5904 -8128 -3556 8734 705 -8815 2172
686 2172 8378 -4638 -7305 6440 5462 -7622 -2976 8303 242 -8501 2330 8069 -4440 -6857
700 -6857 6059 4879 -7265 -2432 8058 -77 -8286 2338 7710 -4262 -6317 5891 4291 -7194
714g194N195R990q257p807J0399M953j1529j521J1695k125j1039N527R592q236
728c57p361J0098M381j1057r44J1234k530j0594N573R106p965o757R626L747j0554
743d354m71J0731k675j0067N406Q478p581o093R169L187j0128j50J0288k709r520
758f489N248P844p391n458R003K702r916J34R934k845q987N315P239p444m903
773f014Q984K290r713L84R525l010q431N443O660p469m445Q808K000r331O00Q940
789E221l143p813N467O136p323m064Q427J729q739P55Q314l238p251N427N695
804E600p068l730Q031J423q262J052P835l421o853N448N347o930l356P772J024
819C912p948J399P528l652o526N517M952o829k918P557O02p696J726P223l790
$$ plain form
714 -7194 -1999 7991 -266 -8073 2326 7279 -4250 -5771 5924 3799 -7240 -1713 7879 -357
728 -357 -7718 2380 6761 -4296 -5240 5994 3464 -7130 -1557 7549 -416 -7173 2453 6200 -4354
743 -4354 -4825 5906 3231 -6836 -1430 7048 -533 -6626 2543 5730 -4398 -4548 5740 3031 -6489
758 -6489 -1241 6603 -788 -6246 2757 5459 -4457 -4323 5611 2766 -6221 -906 6333 -1111 -6014
773 -6014 2970 5260 -4453 -4069 5456 2446 -5985 -542 6118 -1351 -5796 3012 5012 -4319 -3719 5221
789 5221 2078 -5735 -268 5868 -1455 -5519 2908 4637 -4102 -3347 4967 1729 -5522 -95 5600
804 5600 -1468 -5198 2833 4256 -4006 -2954 4881 1460 -5393 55 5402 -1528 -4884 2888 3912
819 3912 -4036 -2637 4891 1239 -5287 230 5182 -1647 -4565 2992 3594 -4102 -2376 4847 1057
834A057o157N441M527o623k491P279K77p369J858O840l740n701N276M064o378
849a840k110O974M3p007J940O415l684n247N140L647o206j777O752j57o701K020
865a798O060l741m854N155L286o168j499O626l73o449K193N712l870m499N205
880I86K964o083j242O411n79o132K356N342l933m167N145K700n885j017O082p42
896B206n771K433N018l898l888M997K458n639q21N797q85n480K511M748l894l634
912c742M890K220n466n97N574j066n258K618M514l901l384M824J942n336l37N414
928B909j262n063K714M274l907l091M723J688n194j31N238j383m827K714M009
943C411l808k831M596J442n003J5N009j435m559K696L737l761k579M489J260m866
$$ plain form
834 1057 -5100 341 4868 -1755 -4246 3033 3310 -4059 -2201 4639 899 -4802 474 4538 -1840
849 -1840 -3950 3024 3067 -3940 -2000 4415 731 -4516 624 4271 -1935 -3712 3040 2883 -3818 -1798
865 -1798 4262 521 -4333 822 4108 -2060 -3559 3067 2694 -3755 -1562 4150 280 -4219 986
880 986 3950 -2133 -3375 3036 2457 -3675 -1319 4023 90 -4077 1068 3768 -2117 -3134 2948 2206
896 2206 -3565 -1132 3886 -12 -3900 1097 3555 -2084 -2905 2892 2007 -3473 -962 3786 -108 -3742
912 -3742 1148 3368 -2098 -2695 2879 1813 -3445 -827 3687 -214 -3598 1226 3168 -2168 -2505 2909
928 2909 1647 -3416 -702 3572 -335 -3426 1297 2985 -2209 -2340 2898 1515 -3312 -598 3411
943 3411 -397 -3228 1368 2810 -2193 -2178 2831 1396 -3163 -467 3270 -491 -3070 1419 2679 -2187
959b187J35M803j494m315K721L464l728k355M414J066m708K74M595j582m088K772
975b13L238l721k142M330R16m565M00M390j680l845K799L015l677j962M224P50
991B257m387N21M198j763l654K831K828l617j780M092N83m227O72L987j826l457
1007b742K818K629l553j594L969M29m060P73L815j889l256K800K443l473j400
1022b291L858K52l921Q97L640j921l068K782K234l396j222L731J25l766R81L472
1038B387j952k887K756K044l336j042L631j5l626J050L304j999k685K756J863
1053B249l300q96L552j31l487J141L124k048k503K762J700l255p43L437k40l335
1069a973J202K956k041k340K719J529l146o20L297l29l177J252K784k064k170
$$ plain form
959 -2187 -2052 2751 1257 -3058 -337 3127 -601 -2956 1458 2524 -2184 -1910 2685 1103 -2985 -213
975 -213 3025 -696 -2838 1492 2408 -2157 -1757 2633 953 -2892 -93 2922 -755 -2717 1507 2257
991 2257 -2130 -1609 2589 826 -2828 3 2831 -786 -2566 1526 2109 -2118 -1446 2541 715 -2742
1007 -2742 76 2705 -848 -2442 1527 1956 -2104 -1331 2484 595 -2661 139 2582 -891 -2291
1022 -2291 1567 1819 -2102 -1205 2435 514 -2554 228 2462 -934 -2156 1575 1700 -2066 -1085 2387
1038 2387 435 -2452 304 2348 -988 -2030 1601 1586 -2040 -990 2314 315 -2370 386 2249
1053 2249 -1051 -1947 1605 1474 -2013 -872 2252 204 -2299 463 2163 -1092 -1835 1602 1362 -1973
1069 -1973 -771 2185 144 -2196 523 2052 -1094 -1714 1583 1254 -1923 -671 2113 49 -2121
1084b121K688J378l050n14L190m22l033J316K622k068k037K654J249k996l66L078
1100A568n45k899J384K503k104j898K642J105k929k33K973o29k792J447K367k116
1116a56j744K591R85k848j30K874p16k661J463K232k086j601K528Q47k758n2K762
1133A530p46k528J463K091k049j479K459P55k677L0K643p87k402J474J968k043
1149b98j359K431O42k613J16K581q63k296J511J851k058j242K421N43k555J97
1165i91K480r20k210J557J738k028j150K351M63k470K51K365r27k081J524J621
1181A573j986j037K256L91k349K88K251r48j954J507J508j938r51K207L10k278
1197a150L55K167r87j873J529J434j934q60K178K10k224M32K089j047j770J552
$$ plain form
1084 -2121 567 1945 -1105 -1619 1571 1149 -1884 -568 2054 -14 -2051 603 1852 -1144 -1510 1568
1100 1568 1023 -1876 -492 2011 -93 -1991 651 1756 -1173 -1406 1567 938 -1854 -407 1960 -156
1116 -156 -1900 691 1676 -1172 -1302 1572 856 -1805 -342 1890 -196 -1797 731 1578 -1180 -1232 1530
1133 1530 784 -1744 -281 1810 -239 -1718 741 1496 -1181 -1151 1492 705 -1697 -223 1745 -298
1149 -298 -1657 774 1416 -1197 -1081 1500 637 -1659 -148 1703 -355 -1597 824 1367 -1188 -991
1165 -991 1489 569 -1641 -84 1654 -374 -1524 827 1290 -1180 -929 1436 509 -1572 -48 1573
1181 1573 -413 -1450 806 1197 -1152 -864 1387 439 -1515 -8 1500 -438 -1389 818 1128 -1150
1197 -1150 -795 1372 385 -1488 41 1475 -459 -1319 859 1069 -1155 -723 1366 319 -1451 101
1213A01J326j931p55K140J29k165M94K006j072j675J532J217j876o69K062P7k077
1230a136N09J917j063j578J509J122j813n93J985J5j980N54J806j078j475J498
1246A99J043j793n17J946o0j915O01J745j111j400J510R45j767m33J897j25j858
1263a093O63J637j131j309J507Q63j758l53J853j78j796P17J554j146j217J488
1279C01P91j706k94J776k24j691P06J487j136j141J465P09j654k31J706k63j632
1296a031P29J413j134j080J457O38j635j58J659l17j577P90J328j161r85J433
1312C69N62j596r5J631l83j507Q15J256j170r15J434M88j569k8J572m21j445Q37
1330a65J195j163q40J395M33j514J3J496m31j379Q38J112j143p86J367L81j470
$$ plain form
1213 101 1427 -504 -1259 881 1010 -1155 -661 1345 273 -1402 130 1347 -529 -1198 864 941 -1136
1230 -1136 -627 1290 227 -1351 158 1280 -533 -1126 859 874 -1106 -552 1254 176 -1299 199
1246 199 1242 -551 -1068 878 818 -1097 -496 1249 138 -1262 248 1193 -574 -1007 890 765 -1093
1263 -1093 -430 1207 76 -1233 274 1137 -621 -974 879 701 -1095 -378 1176 30 -1187 301
1279 301 1092 -614 -908 868 644 -1047 -341 1146 10 -1131 334 1043 -611 -842 864 601 -1031
1296 -1031 -302 1111 -23 -1103 354 992 -643 -801 858 541 -1036 -246 1082 -79 -1064 369
1312 369 931 -665 -760 871 488 -1019 -204 1052 -118 -1033 401 889 -680 -708 864 443 -1002 -165
1330 -165 1030 -133 -973 422 855 -659 -646 850 419 -960 -122 990 -153 -939 428 809 -661
1347f61L5J452m51j317Q44J050j149p13J349L25j436J00J396n07j246Q69R76j142
1365b26o41J321K60j388J40J352n37j172Q62R26j137n81J298K16j358J94J280
1382H09n52j124Q61Q77j109n53J265J67j297J98J229n46j074Q75P94j092m73J212
1400D67J29j255K49J156n74r86Q55P48j075m26J196Q4j217K69J128n95r34Q49
1418F8P00j059l80J168L0j166L02J061n88q92Q52O35j027l38J117J1j122L11J027
1437G10o18q38Q52N81j009k93J092j4j096L32R79o14p83Q31N46r94k42J049o1
1456D10j011L44R32o12p56Q37N00r67k14J032r6r86L64Q85o19p02Q24M48r46j74
1476e07R93j15r57L79Q47o32o64Q27M15r52j27R67j41r20M13P92o41o02Q06L80
$$ plain form
1347 -661 -626 826 375 -942 -98 952 -197 -910 439 764 -672 -572 824 317 -929 -60 916 -226
1365 -226 -867 454 714 -674 -534 818 281 -891 -29 897 -240 -821 477 693 -665 -471 809
1382 809 257 -867 -6 871 -238 -791 474 641 -656 -458 771 225 -849 26 820 -272 -745 467
1400 467 596 -659 -410 746 172 -814 41 789 -286 -712 484 568 -649 -380 748 153 -781 68
1418 68 768 -291 -671 497 527 -639 -337 724 136 -756 96 731 -296 -634 483 494 -628 -317 710
1437 710 92 -746 106 687 -322 -615 477 463 -633 -301 678 64 -719 112 658 -336 -578 471 410
1456 410 -601 -257 675 63 -693 144 644 -323 -537 495 399 -587 -223 662 43 -659 165 613 -333 -507
1476 -507 486 371 -586 -207 640 8 -656 171 586 -366 -493 474 333 -587 -174 618 -23 -625 181 561
1496E61r09j09R31j75q74M17P61o27n69P91L40q84q4R12j86q64M42P10o29n39
1516e84P92K97q61n6Q79k06q14M42O84o38n05P73K78q54k1Q54k14p89M43O60o40
1537h0m63P61K44q39K0P98k16p52M46O18o28m25P45K12p98K5P82k48p10M50N74
1558E16o15m05P41J78p78M4P71k66o97M60N50o06l73P06J61p59O9P26k78o34M62
1579b7N10o11l35P22J07p33Q6P14l04o12M77M71o01l07O98J02p13J16O78l09n86
1600d57M59M52n95k72O67Q1o90J16O48l08n54M61M18n80k40O36N4o37J14O19l12
1621H0n16M59L86n72k16O37L6o33J41N89l23m77M60L49n52j92O06K4o18J59N63
1642C90l22m60M41L34n50j70N96j2n79J63N37l28m29M43L06n33j60N77k5n52J79
$$ plain form
1496 561 -348 -457 474 299 -575 -158 603 -24 -593 198 538 -346 -430 482 296 -568 -126 584 -45 -584
1516 -584 208 505 -356 -412 467 261 -553 -111 573 -65 -570 203 481 -373 -394 460 246 -543 -100 560 -80
1537 -80 -543 218 462 -377 -357 441 225 -527 -81 537 -91 -516 229 441 -357 -332 450 202 -508 -58 516
1558 516 -99 -504 237 415 -363 -319 452 186 -511 -51 499 -107 -480 226 387 -372 -303 423 145 -489 -27
1579 -27 483 -128 -463 259 366 -367 -281 433 129 -483 -6 465 -136 -443 255 357 -356 -240 438 129 -457
1600 -457 2 454 -141 -413 254 335 -355 -239 409 101 -453 8 426 -154 -394 242 296 -341 -227 392 80
1621 80 -436 23 409 -163 -379 258 294 -339 -198 391 68 -409 51 400 -152 -344 262 286 -332 -173 390
1642 390 68 -392 49 383 -167 -337 259 247 -332 -169 368 40 -389 54 360 -173 -333 244 219 -333 -154
1663a54N08l18m17M42K84n18j30N53k9n39J95M74l29l82M37K63n20j03N55n8n24
1684c10J86M68l29l58M27K30n04p6N15o6n02K18M36l44l38M32K16m85p5N01p1
1705A71m82K09M21l25l20M22J89m66n5M81p8m58K25L83l22l02M10J87m68m7M73
1726B48r5m39K24L73l31k76M07J62m53l9M65j05m25K18L64l35k65M15J27m35k0
1747b15M51j07m18K33L49l32k42L91J35m31oM33j23l82K39L10l22k29L79J26m27
1768a88RM12j28l71K49K94l29k00L73R0m10L5L95j41l54K46K73l21j96L79Q4m01
1790b00L5L92j46l40K32K79l18j79L75O8l87L5L69j35l24K53K44l17j58L63N1
1811A92l85O5L51j59k96K45K27l11j44L46M6l63N5L37j59k90K40K33l15j34L55
$$ plain form
1663 -154 354 36 -381 61 345 -173 -303 250 221 -318 -123 351 22 -360 77 340 -180 -283 272 214 -310
1684 -310 -124 344 15 -343 84 314 -190 -266 249 183 -319 -101 335 -9 -347 85 301 -184 -259 242 171
1705 171 -311 -102 319 -6 -326 96 285 -181 -236 245 167 -291 -66 317 -5 -307 103 290 -178 -225 248
1726 248 153 -286 -62 311 -20 -296 111 273 -180 -219 246 141 -284 -66 298 -37 -302 113 240 -195 -215
1747 -215 236 129 -289 -56 293 -39 -281 110 245 -186 -192 241 118 -264 -25 285 -37 -266 113 239 -188
1768 -188 -179 233 105 -266 -17 277 -52 -252 121 211 -199 -164 231 90 -264 -18 255 -66 -262 117 201 -200
1790 -200 -165 227 81 -259 -27 252 -66 -245 130 198 -189 -154 215 80 -244 9 253 -64 -222 141 192
1811 192 -193 -128 223 64 -232 13 240 -71 -215 131 177 -186 -131 206 47 -243 -3 230 -85 -219 136
1832A36K1l44O5L28j57k71K31K03k97j22L45K5l47P9L07j63k65K44K02k98j06
1853a84L15K4l24Q0L08j91k40K35J84k93r4L19pl18J03K90j83k36K50J49k89p1
1875a73L08j9k99J10K76j80k27K30J65k91o8L15k2k98J10K59j78k11K43J36k77
1896i1o0K95l3k83J17K45j91j95K46J17k66n4K84l4k68J20K23j75j86K34J14k68
1918a09j7K57m2k61J13K18j79j65K43R1k47k1K62n2k45J23K09j87j52K32R9k73
1940a03j2K57o1k22J10J97j86j41K16Q8k52mK43o5k32J39J89j90j46K39P1k53
1962a18OK41o1k22J30J80j82j32K28P0k50J7K31p5k05J38J67j92j14K25M9k34
1984a03J3K26q2k12J47J76j95j08K14M3k41K7K29r6j88J36J66j92j02K08M0k15
$$ plain form
1832 136 157 -187 -122 206 49 -222 9 212 -85 -207 138 163 -184 -105 202 39 -226 18 220 -78 -184
1853 -184 131 155 -169 -89 219 28 -212 23 207 -86 -180 139 132 -186 -83 207 24 -212 38 187 -102 -173
1875 -173 135 116 -183 -73 203 23 -204 26 191 -100 -168 147 125 -173 -63 196 18 -193 50 186 -91
1896 -91 -151 144 111 -172 -55 190 -1 -196 50 167 -99 -153 131 97 -171 -51 172 -3 -189 45 159 -109
1918 -109 -126 131 89 -172 -59 159 -20 -185 58 149 -98 -119 143 91 -154 -31 178 -9 -161 71 170 -103
1940 -103 -115 142 81 -141 -31 166 -20 -161 55 143 -109 -113 130 65 -167 -28 161 -29 -175 64 135 -118
1962 -118 -112 129 68 -154 -24 156 -26 -158 70 140 -110 -93 138 63 -142 -4 163 -29 -143 82 131 -103
1984 -103 -90 136 54 -158 -11 165 -30 -138 76 119 -122 -95 134 38 -150 -14 152 -40 -142 66 106 -109
2006a09K0K18q7j94J41J60j95q6K14K5k16M4K07j06j72J45J34j86p6K13J3k14
2028a07M8J90j03j62J40J22j77p8K04J0k01N5J82j11j57J49J24j85o7J96J4j90
2050a04M4J86j18j38J47J07j74n7K02j5j89O1J76j12j39J50R7j77m3J77Mj80N2
2073d3J72j17j32J42R2j77m7J89qj87O4J61j10j35J51R0j75l5J81j7j77P9J48
2096A09j09j24J38R8j66m2J82j4j73P0J49j26r9J34Q2j76k3J73k3j56O1J47j15
2119cj16J49N9j54j5J64m0j49O7J42j26r8J50O2j72pJ69m7j47Q3J20r6j01J51
2143D5M7j57LJ48k9j44P4J25j13r9J50L8j49oJ47m0j48R8J02j13q1J42L4j47J4
2168e9J37m5j42R1J00j05o9J25L9j43j0J42k8j30Q4J06j18n5J23M3j44J0J35n5
$$ plain form
2006 -109 -89 129 42 -152 -11 149 -46 -132 82 107 -109 -65 142 36 -136 9 143 -43 -119 94 107 -107
2028 -107 -59 131 28 -134 6 128 -49 -127 77 87 -114 -59 123 12 -145 4 128 -57 -124 72 86 -104
2050 -104 -60 126 8 -130 17 124 -50 -107 95 80 -109 -48 128 16 -123 27 124 -53 -96 81 85 -95 -43
2073 -43 129 12 -120 22 114 -63 -110 79 71 -116 -52 109 -1 -136 15 105 -70 -105 76 59 -118 -39 109
2096 109 0 -124 14 112 -54 -96 86 72 -101 -31 118 -8 -107 27 109 -67 -90 83 60 -96 -35 112 -3
2119 -3 -119 30 89 -65 -80 84 44 -105 -38 104 -22 -120 30 92 -80 -87 82 35 -112 -29 91 -5 -106 45
2143 45 92 -65 -62 86 57 -87 -13 112 -1 -100 50 88 -61 -67 80 40 -108 -10 92 -21 -102 40 74 -73 -59
2168 -59 78 33 -109 -18 82 -23 -92 33 72 -71 -81 61 33 -97 -13 93 -25 -80 43 86 -58 -48 87 32
2192C2j19R7P9j02o5J27K0j31J3J33o2j14Q5J00j21n8J35J2j32QJ29o0r6Q9P9
2217G8j09o7J39%j05J1J17o6r1Q5R4j08n4J19J9j09J1J20o2r5Q0P6j09l3J08k
2243D7j13K8J15o6r1R0N0r5l7J24j6j17L8J12o1r3Q7O0r2m2J12lj04K6J06o0q0
2270g5Q9O2j08k8J09Jr6K3J01n5q9P1O9r7l4J05j1j03M4Q8q0n1Q2M4r5j8J00r
2298C9j07L1R5n3q2P7N2q6j2Q7nj06N1P5m5p4P9N1j06jR0rr1L6P7o1n0O9K8q3
2328c4j3J01k0q4L1P7o3n5P3L7p7k2Q8k5q1M6P4o5n7P7K9q5kR2k2q0M8P2p1m8
2358e9P3L9r4lR4k3q3M0P6p7l6P7K4q3%P4k5p2M1O6o5m9Q1J7p9JP9l4n4K4O6n5
2390a9m3P9J0p4J1P3k4n9L5O7o6l8P1K1o7JO6j8p2L5P0p2m4P9J6o7RO6l3n9M5
$$ plain form
2192 32 -87 10 89 -13 -78 49 69 -62 -49 84 22 -92 -7 93 -28 -86 49 61 -71 -63 66 6 -90 -1 78
2217 78 -31 -98 41 41 -64 -53 64 -2 -93 -8 86 -22 -76 43 62 -47 -36 84 22 -73 7 83 -26 -59 49 47
2243 47 -66 -38 77 11 -80 10 60 -35 -72 52 36 -81 -43 69 8 -85 2 62 -30 -72 40 37 -67 -41 65 5 -75
2270 -75 14 76 -32 -60 49 50 -46 -23 78 23 -66 5 74 -23 -57 48 37 -66 -22 66 -14 -65 17 61 -34 -52 48 39
2298 39 -68 -37 58 5 -77 0 52 -34 -46 41 36 -70 -19 56 11 -63 16 67 -39 -40 50 41 -50 -14 63 2 -48 21 49 -34
2328 -34 -47 54 34 -50 -19 58 -5 -60 13 50 -27 -49 39 14 -67 -21 53 -12 -69 8 37 -48 -50 42 20 -60 -12 60 -11 -59
2358 -59 14 53 -41 -44 50 27 -56 -16 60 -17 -53 24 48 -35 -35 39 14 -58 -17 49 -16 -65 16 33 -46 -45 34 0 -54 -30 36 -19
2390 -19 -62 17 27 -47 -36 37 13 -46 -11 56 -10 -48 23 44 -23 -22 44 26 -46 -11 59 -13 -57 22 38 -29 -20 46 13 -46 -1
2421aN2o1l9O8J2p6K0N3k0n2K4N2n1l3O5J3p0QP4k7n7L5M9n0k8O6J1o4J0N9k4
2452A8o6N8K8m6m2R2j0o9J1O2l0m6L6L6o5lN2lo3J5O6l9m6N0M2n8k2O4Lo1MO0
2484B8k1n3M1M8m7j1L2J3n5J3N2l6l8L3L9n4j0M8Nn8MM3pn1L9K2l8k4N6%o0J6
2516c1M2j6l9L4K9n1%N0qm6J7M4j7l4L6K7o0%M2Km5J3M7l4l4N0J7n1jK8Rn3J8
2549a5L9l2l0L7J8m3j4M9j0m9K5M8l2k5L6Rm2nM6%m1J8M6l3k9K7K1l6mM0j4k0
2581a5J1L8l3l3L4K1l9pK8Rl7J7L1m3j7L2J9o0J5M9k3k7J0L4k1k7M4J0m4JL6j1
2613Bl2J4N3n0j5M9Rn5J5K8Ll2KL2k9k0L1K0l1j5L6ml8K6J9l0j5L1Mm0MK7j5k3
2647c9K0L1l1j7L6Rk4kL2j1j6J6K0j8j8L4ol2JM2j2m2K6K1k5j3K6Jk7PK5j8k5
$$ plain form
2421 -1 51 -10 -49 19 31 -45 -25 28 8 -44 -20 32 -19 -52 13 26 -44 -36 38 11 -46 -11 38 -12 -40 26 37 -27 -17 42 18
2452 18 -48 10 38 -8 -50 42 32 -37 -26 36 6 -40 -4 32 -33 -36 16 13 -50 -35 31 -8 -54 -4 38 -20 -42 22 25 -36 -32 28
2484 28 7 -46 -5 43 -4 -15 17 30 -25 -12 40 4 -34 -1 38 -16 -26 22 27 -31 -27 16 9 -42 -3 19 -19 -43 13 13 -47 -31
2516 -31 11 -5 -44 -10 19 -32 -32 18 10 -36 -19 25 8 -26 10 37 -23 -23 19 21 -24 -11 36 2 -32 18 35 -16 -17 11 20 -33 -15
2549 -15 24 -8 -38 -1 17 -26 -40 9 -1 -50 -25 23 -9 -34 2 11 -31 -36 10 10 -31 -13 33 0 -29 -2 19 -17 -21 19 5 -15
2581 -15 -4 34 1 -32 2 23 -16 -23 5 14 -23 -6 25 -18 -35 -3 16 -44 -29 20 -3 -30 -20 14 -7 -34 10 20 -24 -23 13 2
2613 2 -30 -16 37 -13 -28 21 30 -25 -10 18 21 -11 -9 23 -6 -26 5 25 -6 -21 15 11 -27 -1 18 -12 -27 4 8 -32 -28 -1 -16 -39
2647 -39 -19 12 -19 -36 0 9 -15 -17 15 4 -12 4 24 6 -12 22 16 -16 -15 27 15 -27 -1 20 -5 -18 8 9 -18 -11 14 -4 -29
2680b9K5J4k6jJ2Ok6J4J7pk7J9J7k3j4L2Rl4J3L4j9l8L3J5k9jL1J1l4mK9ol2L2
2714A3%j5j1L1lk8qK8j2j7J6Ql0KL0qj3JJ3oj3J0J8k8J0K4j7lnL4k0j4K3Ol2%
2750a6K8jk4J1K8k4nJ5J2l4lK5j5l0L6J3k7pK2rnk2L4Jk5MK1j4oK2Ql4%L0%k8
2786a9J7J2j5rK3Nj9LJ5Jk5J1J9k1j9J6J5k2lK4j6k0K1L%j0QPk8kK7j0rJ6llj8
2823b8K7J2k3JJ6Jj3mK7j4rJ5Nlj7K2rq%Jlj1J5Kj4pK5lk1J7J4k8kJ9lj9mJ4j
2862a1j2K2Lk3OK0Kk1OK4j2j3J1J2j2mK0Lk8J4J4kk4J4LqrJ0oj4nJ5j1lJ6pkj2
2900b4K5jk1J5kJJNqmNJ6nj1JJ1j0KOPmnRRk5JJ2j0KkLqKQnpnJ3lj3NJ0j7J2N
2945dnkj1J9j0qJ5MomJ2oQoQmKKMrKKlJQj0Kj0J9kpqJ0lj8J0J1k0nK0j3j1J2K
$$ plain form
2680 -29 -4 10 -16 -17 -5 1 -25 -11 6 -1 -28 -9 8 -15 -29 3 12 -22 -9 25 6 -32 1 16 -13 -14 17 28 -6 -10 19 13 -19 13
2714 13 13 -2 -13 18 15 -13 -21 7 -5 -22 -6 2 -28 -26 4 -4 -17 -16 -3 -9 -22 -12 6 -22 -12 12 -5 -8 -13 21 1 -13 10 16 -16 -16
2750 -16 12 11 -13 -2 26 2 -3 12 24 -10 -13 12 -3 -33 3 16 -11 -18 4 -5 -10 -32 2 3 -22 -18 3 -11 -17 5 13 -21 -21 9 9 -19
2786 -19 -2 10 -5 -14 9 14 -5 -2 13 14 -11 0 19 -2 -21 -5 10 -12 -15 9 -7 -27 -6 -3 -3 -13 -5 2 -26 -28 -1 -11 -20 -4 -7 -10 -28
2823 -28 -1 11 -12 -11 5 6 -7 -11 16 2 -7 8 13 10 -7 15 6 -2 -2 -1 -4 -15 0 2 -12 -19 6 3 -18 -1 13 -15 -17 2 -1 -20 -24 -10 -11
2862 -11 -23 -1 2 -21 -15 5 7 -14 -8 16 4 -9 2 14 2 -2 18 21 -7 7 21 19 -5 9 12 4 -5 5 -1 -15 -20 -5 -16 -19 -3 -10 -12 -24
2900 -24 1 0 -21 -6 -8 -7 -6 -1 -9 -13 -8 8 3 -8 -7 4 -6 -4 2 9 5 0 9 18 -7 -6 6 -4 -2 -4 -1 -9 -7 1 -4 -11 -16 -3 -6 -19 -14 -4 -21 -9 -4
2945 -4 -9 -11 -22 -3 -13 -21 -6 -2 -8 -12 0 -6 2 -4 4 0 2 4 8 -1 1 3 0 1 9 -1 1 -9 10 8 1 -7 3 0 -18 -8 3 -17 -22 -2 -15 -26 -14 -12
2989a2mLkJPrJ4J3j7mJ1jj1K1pKqKJ0j3LN%j6KJ8j3mNLj6JJ6mp%KmnNJ3qr%K%
3035a5QJ2pj5J0%LpNJ0j0LPlKmnmJ0nJ7j2pJ0p%K%j4jMPj4J7oqMKmPpJ3mj3J1
3080hM%jJMlnPqLOj2J0Kj1J8j2PjkpROk4KJ1jnlKj%mjQj2QjKnOOrNkKJJ1pQj2
3131hOljJ4ooPKkJmLkKmPrj1J3j3O%KrRJj0j2J9j6J0JQnRJpK0j9J1Pmj6MNojJ3
3179Gj2J5j7M%J0%Kpj0PklNj3j1J9oMMj1JJ0j5NJ3mKpNj2RlJ0NoJ3j7RRoj0JJ0
3223GLj0Q%ppJ1%Oj6Qj1nOkmJomNOQkj7Ppk%K0j3JOkQnOJ1okQj0KJ1rnk%J2j8
3272a1RnlKjnJ7j8Rkq%KKkOjqQmpR%KLrJ6KnlOOmj4J1Kj2RJ0j0m%NjpKlkPopL
3324a4jJjj0J1J1oMj0rJ2PKqnJ5j5J3NnoMLP%klj1QqJ2jJj0NjoQKk2J3lrNPJj1
$$ plain form
2989 -12 -16 -13 -15 -14 -7 -16 -2 11 -6 -10 1 0 -11 10 3 5 -3 -1 9 -4 -1 4 4 -12 -10 8 -5 -9 -4 -1 -17 -16 0 -4 -11 -11 -9 -13 -18 -13 0 -8 -17 -17 -15 -15
3035 -15 -7 5 -2 -17 -7 -7 -4 -11 -6 4 -6 -3 4 1 3 -1 -6 -10 0 -5 12 0 -7 3 -4 -4 -2 -2 -16 -17 -13 -6 -20 -3 -9 -17 -13 -11 -15 -8 -15 -2 -6 -19 -8
3080 -8 -4 -4 -5 -4 0 -3 -8 -1 -9 -6 0 -12 -2 0 -11 7 -5 2 1 -1 -8 1 7 -17 -15 -4 -5 -10 -13 -11 -12 -12 -16 -17 -9 -21 -13 -14 -12 -17 -11 -5 -14 -9 -11 -9 -8 3 -4 4 -8
3131 -8 -2 -5 -6 8 2 -4 3 5 3 4 0 3 1 3 -1 6 -3 -14 -1 -14 -8 -8 -6 -15 -6 -5 -15 -27 -8 -24 -14 -13 -5 -10 -1 0 -7 13 -6 5 12 8 -8 -4 1 -5 -6 7
3179 7 -5 10 -7 -3 -3 7 7 9 2 -8 -1 -3 -6 -1 -14 -25 -6 -12 -8 -4 -15 -14 -4 -19 -14 -1 -5 -3 -10 -5 -17 -8 -11 -1 4 -2 11 -6 3 12 6 -4 -3 7
3223 7 10 0 8 8 1 -6 5 5 11 -5 3 -8 -13 -7 -9 -13 -12 -18 -22 -17 -11 -3 -5 -22 -15 -22 -24 -24 -4 -17 -16 -10 -12 -4 -9 -3 8 2 0 8 -2 0 11 2 -3 -5 -5 7 -11
3272 -11 -2 -7 -10 -8 -9 -14 3 -15 -6 -8 -16 -16 -14 -12 -14 -8 -9 -17 -9 -13 -20 -11 -11 -9 -6 -15 1 3 -2 -5 1 7 3 -11 0 2 -10 -1 9 -1 -5 -5 0 -1 -8 -6 -9 -11 -4 -10 -17 -14
3324 -14 -15 -14 -15 -25 -14 -3 -9 -5 -15 -24 -12 -5 -3 -11 -16 -1 -16 -3 2 -3 -9 -5 -2 5 5 3 0 -11 -3 -11 1 0 1 -9 -4 -5 -11 -3 -1 -23 -10 -13 -22 -17 -10 -9 -20
3371b0LOl%jnOjJ0opJ0mOOKJqJ2krj3J6MrJ4%qqK%%KKNk2KJ2j1MjNrj%LKLnkM
3422a3KOLKj3J3qkJ3j2J1KpPpLLnnJ2PoNj2J0k3MQnlKnmJJ4pq%LKj0K3j8LKRL
3469@jMJJn%mM%jPmkmnKMJ5j3qKNjj0RnMj1KkjMjLjLpJ2Rj7QpMnKQ%pQOqPMK%
3524A0rMn%lk%NLrnJkj3J6pkJ3k0J6lnKPJnRmJmjQlKRmOn%lKPlj2kJ2lOrLmJ1
3576Gj3jj%Pj0njKplK2n%%KjmJ3pKnK2k0OLOQnnJrQlpMPpjoRmNj0lkOn%kmPnj3
3630b7J7KkkjJ1nRrJlQKjrJ9lnJ6om%LqoPJqPJlj4%PKoJ2j3Nj3RLJmnJ8j5J4n
3679bNqJj5J7KROj5LJ4j7J6ojKnMnNpkO%nrRknml%J0j0JJKlLjNkQj1PQk2J7NL
3729ImKmmJ0lj0J4J0jj0Kj0nL%pJ4j8LPpJ3j3Pj2JOnkloMJ1%jlLjPlNMLj1QkQ
$$ plain form
3371 -20 -17 -11 -14 -14 -15 -20 -14 -15 -5 -11 -18 -8 -12 -6 0 2 3 -5 7 5 -4 -17 -1 3 -6 8 8 0 -8 -6 -6 -6 -4 -2 3 -19 -17 -5 -16 -12 -13 -8 -17 -18 -18 -15 -13 -10 -15 -17 -13
3422 -13 -11 -5 -2 0 -13 0 -8 -10 3 -9 2 4 -3 4 -3 0 3 -2 -7 5 12 6 11 -1 9 -14 -10 -2 -7 -10 -8 -13 -17 -16 -2 -9 -17 -17 -14 -12 -22 1 -17 -14 -12 -3 0
3469 0 -1 3 4 5 0 0 -4 0 0 -1 6 2 0 -4 -9 -7 -3 12 -1 -9 -7 -2 -3 -13 -4 -9 -5 -16 -14 -16 -17 -13 -14 -11 -12 -9 -16 -4 5 -12 -4 -11 -7 -12 -10 -2 -2 -9 -1 5 -3 4 8 10 10
3524 10 1 5 0 0 -3 -5 -5 0 3 -6 -11 -10 -12 -25 -9 -16 -18 -5 -25 -9 -12 -17 -15 -8 -7 -12 -3 -7 -6 -10 -11 -3 -6 -4 5 1 7 2 2 -1 1 8 5 -7 -9 3 0 6 -3 0 -4 7
3576 7 -6 -7 -8 -8 -1 -11 -16 -17 -15 -22 -25 -3 -8 -8 -8 -6 -7 -11 2 -5 -3 -8 14 -6 0 3 9 17 12 7 8 -1 7 4 -3 1 8 1 0 -6 3 -1 4 -6 -9 -11 -5 -10 -10 -12 -16 -9 -14 -27
3630 -27 -10 -8 -10 -12 -13 -2 -7 2 -7 -6 -9 -1 1 0 -9 10 7 2 18 12 8 8 11 3 -3 4 5 -3 4 5 2 -12 -12 -5 -3 -9 3 -10 -5 -18 -9 -6 -5 -9 -14 4 -11 3 -2
3679 -2 3 -5 -4 -19 -2 0 9 15 0 3 17 0 16 10 9 11 6 10 5 10 3 1 7 7 2 -7 2 0 -5 -9 -12 -12 -2 -12 -11 -10 -8 -11 -8 -9 -4 -6 2 -9 -2 6 -16 1 6 9
3729 9 5 7 3 -1 9 6 -4 10 20 19 9 11 1 -4 -1 -1 -8 6 -12 -9 -2 -9 4 -9 -2 -14 -13 -7 -12 -14 -17 -23 -19 -8 -8 -9 -12 -9 -10 -3 -6 -1 3 6 -5 3 1 9
3777IoKqOqJ2r%PpljNmoMNkkMPj6nJ2j1LMpMJ0j4J1NlJ4j9J0ol%J2qJ2nlQj4N
3825APooJj1P%oRlOjrMqOlnP%j9K2JjjMOnJkkPKMklKPj4J1lJ2j1%J1lj6NJnJN
3877EqolR%mmJrPLpJ4j2PkjLRmkJ1lj%kJMKoLMNj6JNJ0j1mlJklQpJ3j0jpoJ3l
3929hlNoJ5j7jK1qrOM%JkPJrJ5rQj0J0j4PmQKnpJ4j1kJ0j3mnK6k1NkmpQkmQjj
3977hjnJ1J2j2KkJ0oQpLRKnkpJ1pmqMOMj0Nj1KjnKpJ1qJ2j4NlQlPqL%NJJoJ1n
4027@LOj8QJ4jrNnPoJ2j2Qoj1OK%Mnj7J1j5J7mj%JLnljQj1NJ1Mj0Pj3J0%kQkN
4074HJ0op%mlJ3rmn%J2Oj8KROrqKJj2OmQj1RpjK%OlJ0Nj8MJ0nMKJOlNKk2K8j0
4123HMj7J3qOnmnKJ2j6NlkNj0J4KqrQLqPqnJ4jJJ1j3JOOj0J1kNooK2j5RorJ0q
$$ plain form
3777 9 3 5 -3 3 -5 7 -2 -2 5 -2 -5 -6 -1 -5 -11 -7 -2 -4 -6 -2 5 -11 -16 -4 -15 -12 -8 -15 -11 -1 -15 -4 1 -2 12 -7 3 -3 -6 -6 6 -2 10 5 2 10 -4 1
3825 1 8 2 -4 -3 -14 -7 -7 -13 -4 -7 -1 -2 -11 -7 -15 -9 -12 -17 -10 -10 -29 -7 -6 -7 -8 -4 2 -3 -2 -4 -6 1 3 7 5 2 4 11 -3 8 5 17 6 6 17 14 -2 3 4 -1 0 5
3877 5 -3 -9 -12 -3 -3 -7 -11 -10 -19 -12 -9 -16 -2 -14 -7 -9 -10 -7 2 -2 -4 7 4 3 3 1 2 6 8 2 5 9 14 -2 -1 4 14 3 -1 -4 -3 -5 -8 0 -7 6 -4 -5 -12 -18 -5 -8
3929 -8 -11 -6 -12 3 -14 -15 6 -2 -11 -5 -1 -1 0 -2 5 6 -3 12 3 11 1 11 -3 4 0 8 10 5 -2 12 1 -1 9 -4 -8 -13 13 -8 -3 -5 -9 -16 -8 -10 -14 -6 -7 -8
3977 -8 -9 -14 -3 9 -3 -1 -3 7 1 9 2 5 14 16 11 9 2 13 6 2 -6 -2 4 8 -2 3 -8 -6 -7 -12 -10 -17 -6 -14 -2 -16 -11 -14 -6 -9 -2 -10 -7 -7 -2 -1 0 -6 5 0
4027 0 3 9 -9 -1 13 12 3 8 3 10 4 16 4 12 6 -5 1 3 3 7 2 -15 -4 -19 -2 -6 -7 -7 -6 -3 -8 -11 -12 -4 -15 -10 1 5 -5 2 -11 -1 -1 -3 5 3 8
4074 8 18 12 5 5 1 -2 11 2 -2 -7 -7 5 11 -7 -5 4 10 1 -7 -5 -4 -16 -10 -14 -6 -17 -8 -15 -16 -14 -14 -8 -11 -1 4 -14 -10 0 -5 -1 1 2 8 5 10 12 -10 18 8
4123 8 12 -5 8 0 6 1 -3 -8 -6 6 -10 -5 -8 -10 -5 -15 -1 1 -7 -16 -8 -5 -13 -6 -14 -19 -5 -6 -5 6 -7 -6 0 6 -4 7 5 10 4 -2 20 5 14 8 -1 9 1
4170AJ1romRj1MJ6k0qMQj2J2Kj1Lj1J3M%mONqRj3PNKpOmk%oJ3Rj3kJ5j5MoMKr
4217gmJOKkJj0J0lj4J1KoJ0qPJpQ%%jO%JnPKrMJ7j2LoLmJJqKnPokJ0kj1lJ0rj
4268a2PJkLmMmNlnNKlOOnJ0j3K2j5kKJ1pLj1KmJ5Knnkj1%NpNpJ3lrMpJ0qMnPr
4318a4LMKmLMKMkPKjJoM%J0j2NJpKrR%kqlpJ2nlkj0J7pQk2J9k%rM%%PJ%lJ2j2
4369gRpPkPQkJrLnMJKj3MQj1KnJlJlKJjpNmORj8J0m%%rJ5QqKkkJ1j1J1R%j0j0
4420fK3j2kNj1J2j5nJ6Jj4J6nrkMj0kjMlmJ2qPjJ1qJ1j4J3j6J5mkQmmK0j5LJM
4463I%jqLRkplKmJ2j0mjPKjjjoklJ3nj1J5j0NJMKqOpQoJ5Klj2J0kpJ8joolnJ2
4513IqoJmL%J0rpRj4NNqRopK1jorJ1kLoRqJ5nkNnNPRj8klOjMoKlknJRj2MonmN
$$ plain form
4170 1 12 3 -3 -7 2 -9 -5 11 -9 -17 -13 -5 -17 -5 -3 -14 -11 -22 -9 -5 -5 -9 -3 2 -6 3 -10 -3 2 4 -3 3 -1 -3 -3 -9 4 13 0 -2 13 -2 2 -4 0 2 -7
4217 -7 -11 -10 -4 -2 -4 -3 -13 -3 -6 -20 -9 -7 -13 -3 -11 -4 -3 -10 -2 -2 -2 -3 3 3 4 -1 6 8 -1 3 20 8 11 5 8 4 5 6 -2 0 -5 2 -4 -6 4 2 -9 -12 -2 -11 -12
4268 -12 -5 -4 -6 -3 -7 -3 -7 -2 -5 -10 -5 -3 -6 0 6 1 11 -2 20 5 3 5 16 9 12 1 3 -1 14 16 11 6 4 -7 -7 -2 -9 -4 -11 2 -1 -10 -6 -13 -3 -11 -7 -12 -5 -14
4318 -14 -11 -7 -5 -9 -6 -2 0 4 2 9 11 10 11 5 9 9 19 7 12 13 6 8 -1 8 8 6 -2 -5 -12 0 -5 -8 -10 -20 -3 -10 -2 -24 -5 -7 -7 -16 -12 -12 -12 -5 -4 -4 -7 5 -7
4369 -7 2 -5 2 0 7 15 13 14 5 8 3 7 8 10 -3 1 9 -2 0 -5 -4 -7 -6 -9 -7 -6 -7 -14 -9 -13 -7 2 -16 -6 -10 -10 -10 -19 -4 4 -4 -2 -4 -6 5 -6 5 14 14 4 -6
4420 -6 17 5 3 8 -3 9 -6 -11 5 6 -8 8 3 -6 -8 -4 -14 -16 -17 -13 -16 -20 -8 -16 -9 -10 1 -7 4 -10 3 -13 2 -2 -4 4 0 -4 16 1 4 5 9
4463 9 9 8 0 3 12 10 3 0 2 -2 10 0 -4 -5 2 4 3 2 1 -5 -7 -10 3 -2 -13 2 -8 -3 -2 2 4 -4 2 -5 3 -3 12 14 11 -1 9 7 0 18 17 11 5 2 -3 9
4513 9 1 -5 -4 -8 -5 -5 5 -4 -11 -2 -16 -11 -6 -14 -5 -11 -18 3 2 -4 -13 -2 -4 -1 -7 2 -6 9 4 2 7 2 7 14 23 5 3 0 6 5 9 3 5 2 0 -5 -4 5 -7 -3 -9 -14 -18 -13
4567a3MoJ7k8J3nQpR%jMpR%rJ2mNJ2j6NoQ%J4k2J0%OpLnkn%Oj1NoRj3J6j9JJ7
4613Aj8LKLMKkmPqJ6kml%LQ%kllMRj1J0oo%PqLqQ%j4QqRjpJJ5j5Qm%mMlkJ6j1
4665fJjMMLoNLlj2QMpJ4J0k1MLKKlj1J1j3PkrRj5nmJ6Jj3OjOJ4pmOrJ1pjPlOm
4714@j0K6kKqnNmJnLQj1j3PjjjP%j2QjNj0mLnqOJ2nnJ4j0KMNnLRJj4J4olRrQk
4764BQj6NnOjpJ2j1RlrQkqloJ6j3%NqJ0Kj4LJ2j1J0oJKLNMLLj1PKJJKpPj3%kO
4813aqLNJj0nJ2oOn%kJ0k8J0J1rQmQmjMlONqkJ4Kj0PkmJ1pO%Rj8OJj1kpK1j8J1
4861BpjllKnNnlRnlJJ0rJ%%jJ3kQj3QKlRjj1RKj0L%%qRQpoLnJj3J3rLLlJ1j3j
4913a5LlJ%j5K0kMlpLOJ7onJ2omJ1MnqloOjkklNj0J0NlrnlJ8j6Q%j2J7j6PpKN
$$ plain form
4567 -13 -9 -15 2 -26 -13 -18 -10 -17 -8 -8 -9 -5 -12 -3 -3 -12 0 -4 1 13 -3 2 -4 4 4 18 -4 6 6 12 5 8 3 1 -4 -4 2 -9 -4 -10 -1 -14 2 -17 -16 1
4613 1 -17 -14 -12 -9 -5 -3 -5 -9 -2 -10 6 4 0 -3 -3 0 8 8 6 3 0 4 13 2 12 6 0 0 7 -1 2 -6 2 2 -12 -4 -12 -3 -4 -11 -10 5 -10 -2 -6 -6 -10 -6 -9 -11 5 -6
4665 -6 -5 -6 -2 2 5 -1 4 7 4 -8 0 4 -3 11 21 0 4 7 9 11 8 -3 8 -5 2 0 -9 0 -15 -20 -24 -8 -7 -20 -14 -15 -9 5 -2 -6 0 -9 2 -5 -6 1 -2 4 0
4714 0 -10 16 14 16 8 3 8 4 5 0 3 11 0 -13 -6 -7 -8 -9 -2 -2 -14 -6 -7 -2 -12 -16 -13 -18 -26 -20 -8 -13 -18 -4 -14 -12 -8 -3 -8 -5 4 5 -9 5 -1 -4 5 -4 4 2
4764 2 10 -6 -1 -6 0 -1 -8 4 -7 2 -1 -10 -2 -4 -12 -15 -21 -5 -18 -18 -13 -21 -11 -9 -23 -20 -8 -19 -9 -15 -14 -12 -9 -4 0 3 6 -5 2 4 5 6 8 1 8 -5 -5 -7 -1
4813 -1 -9 -6 -1 0 -10 -15 -3 -9 -3 -8 -8 -10 0 -28 -18 -7 -16 -8 -12 -4 -8 -9 -5 -8 -2 3 -5 -7 7 9 -1 6 4 0 11 4 10 10 19 1 7 8 -3 -5 -12 9 -9 2
4861 2 -5 -6 -9 -12 -10 -15 -10 -15 -18 -9 -14 -17 -16 -6 -15 -14 -14 -14 -15 -2 -4 4 -9 -1 1 -2 7 6 -5 4 6 -4 -1 -1 -1 -9 0 8 1 -5 -2 -7 -6 -19 -6 -15 -12 -9 -12 -1 -14 -15
4913 -15 -12 -15 -14 -14 -29 -9 -11 -7 -10 -17 -14 -8 9 3 -2 10 4 0 11 15 10 2 -1 -7 -1 -2 -4 -6 -9 -4 -14 -4 1 -2 -11 -16 -19 -1 -17 -9 -9 -21 -4 -20 -13 -20 -18 -13
4961a3j%J5oL%j2KJJ0lnJ3kQOj3jJ2lrqPjJnMj2LNm%j2J0Llj1QjL%Lj0QKnRQr
5010emJJ3j2NkQj2QMlJjJ%j0J0LqqJ5j8OPljlJn%N%%Nj0MMkK%RoJlJ3oJoJ7k7
5060a1J7mJ5qrQokJ3j3mKJLkkrJPJpjrMJ1jpPj1RmRj0J6krNQj2J9j2QMrNOnLL
5109A6ojkJj1J3qmJj5OJQKk3RjOJnNk%kJP%oQQj3J1oQrLJ3okPj1JPj0%Rj2lJ2
5158FmnqPJpJOjoMjmNoKkMpJ2Lq%ORrOJOJj1J1Nj1LpLn%NKj6PlmMJj0J6qJn%j
5212a1%Pj2KJ8ljKLqQpjJ1j2PRj5LJ1kK%lNJnLlmJmoqNJ1j0mLj2J4nJ0mj3J6k
5259cqMLkjJ9j8OJKMnNjPnNMmmnklKL%NrjMLj6OoJ2j4lOKmk%PKlPnmNJ0%loJ4
5313A1PnJm%MrPj1J7rjmPj4KklJ0qknMlkj1J2kJ3pqLlJ2j0J3Mj1QoJ6klJ1j0p
$$ plain form
4961 -13 -14 -14 1 -5 -2 -2 -14 -12 -11 -1 -4 -9 4 2 10 16 3 2 14 11 2 -6 1 0 1 -4 0 -12 -9 -4 -8 -8 -20 -10 -7 -10 -21 -13 -14 -11 -11 -8 -18 -10 -8 -13 -4 4 -5
5010 -5 -9 -8 5 -7 -2 -4 4 -8 0 4 1 2 1 2 2 -8 2 5 -3 -11 4 -14 -8 -1 -4 -5 -8 -7 -12 -12 -7 -7 -7 -2 -12 -8 -4 -6 -4 -4 5 -1 0 -3 10 4 5 -1 16 -11
5060 -11 6 2 17 9 0 8 2 0 13 0 -4 -2 -1 2 0 -2 -11 -10 -3 -2 -9 -10 -19 -15 -4 -5 -12 -5 -16 -7 -11 -2 -12 4 2 -7 -2 6 -6 13 1 9 13 4 9 15 10 13 16
5109 16 10 9 7 8 -3 10 2 -2 -1 -16 -10 -9 -1 1 -22 -13 -14 -8 -7 -12 -7 -9 -9 -11 -10 -3 -3 -9 -1 7 -6 5 -1 7 -2 1 14 8 6 13 2 3 10 0 0 9 -3 -6 6
5158 6 2 -3 -11 -4 -3 -10 -9 -3 -4 -10 -6 -7 -11 -6 -12 -10 -12 -8 -15 -3 0 -8 -8 -2 7 -2 4 5 11 12 1 12 17 6 9 2 5 0 0 5 7 -9 -2 -5 -9 -5 -4 -14 2 -6 -5 -10 -10 -11
5212 -11 -11 -4 -16 -14 4 1 0 2 5 -3 5 -2 -3 8 -4 3 12 -3 0 11 9 11 11 8 13 14 9 12 9 5 6 2 -4 -12 -7 4 -6 -10 -7 -19 -5 -10 0 -4 -17 -1 -3
5259 -3 -11 -7 -4 -6 -7 12 -6 0 1 3 7 2 7 6 13 8 13 17 13 9 4 2 -1 1 4 4 9 0 -1 3 6 -10 -4 -10 2 -12 -15 -9 -7 -11 -13 -13 -6 -4 -7 0 -5 -9 -4 6 6 3 -3 11
5313 11 18 13 14 10 10 14 5 12 1 18 9 8 4 11 -3 -1 -3 -6 4 -4 -6 -11 -7 -10 -12 -23 -11 -13 0 -7 -15 -12 -15 -3 -13 0 4 -7 1 -5 11 9 6 17 7 0
5359@J8j5qOkK0j0rOLj6J0Jq%pJ3j0ojJNlRkpMOj0J0opOJ0JJj3N%%OLmJ3rQLj0
5407ELJ0jj6LKjNnol%oOoJ%jJ2j4qKKPJj8K1KJ1j4KRj2QKPpjPnJ0Lj2j0QQlJn
5456DKrJ2nnpljQmkj4J0KlnJ1q%NLkLJ0nRnqJ5pNllLoJ6j1qNQmljmmOj0%KOkj5
5508b2J2OrkJLMQrmOMrjJRQoOmmrK4poPjLk%%MnnPlnjQj7QqJJ1j2mQjjJrJ4ml
5562iLOJPqlNjNLJQqqOrJ0Nj0kMp%m%kRj0PpJPrqJ3kJRj6LLomNJ1j1OJNLnQoj
5616@OKLj4J3okJ0j3NoJ0j7RNmpNknnJ6j2LnLjnNJ5j1nJ6oNqJ4j3NKOjlJLlKK
5664A2kj3KJ3mmoLk%qJ4j1KMKnolNj2J2Pj3J0j4J6qNjnPMLkQjoNKmnP%JpJ0nM
5713A1mj1J3qNmj7J6j1QqjMjpKKkO%Oj3kJ2JLNj%MmlJ4kLmj0LmJJ1p%p%KkkpR
$$ plain form
5359 0 18 3 -5 1 -1 19 9 0 6 9 -7 3 4 -4 -4 -11 2 -8 -14 -15 -14 -9 -12 -3 -5 -12 -8 -2 -12 -2 -8 -15 -9 1 2 3 -10 -5 -5 -5 1 4 0 13 4 12 15 5
5407 5 8 18 17 1 4 6 5 10 5 -1 -4 -4 -10 -4 -10 -9 -9 -10 2 -12 -20 -18 -16 -9 -8 -26 -5 -3 8 -6 -4 5 -7 1 3 10 3 2 9 4 14 17 5 -5 3 11 8 9 4
5456 4 6 -3 9 4 -1 -8 -11 -12 -4 -8 -10 -24 -14 -12 -15 -20 -9 -17 -17 -12 -9 -11 -8 2 -3 6 1 -7 8 1 6 3 0 3 -3 13 2 -6 -1 7 3 0 -1 -5 -9 -3 -13 -13 -11 -5 -7 -22
5508 -22 -10 -4 -13 -15 -14 -11 -7 1 -8 -12 -6 -2 -11 -12 -11 -2 6 0 6 2 -2 -11 13 6 0 7 6 9 7 7 7 11 6 1 8 5 0 -1 7 -10 -2 -10 -9 2 -10 -14 -6 -7 -8 -7 -16 -2 -6 -9
5562 -9 -6 0 1 8 0 -3 2 1 6 9 10 18 10 2 8 -1 9 14 4 2 6 -1 -1 -5 -5 -7 2 -8 -1 -8 -7 0 -9 -17 -4 -6 -5 4 -12 -9 -6 -12 -16 -11 0 -11 -5 -4 1 4 -1 7 1 0
5616 0 6 8 11 -3 10 4 2 12 -1 4 -2 8 -9 0 5 1 -6 -1 -3 -8 -13 3 -9 -6 -11 -8 -9 -14 -9 6 -5 -10 6 0 5 -3 11 -2 3 5 11 10 7 8 11 8 10 12
5664 12 10 -3 -1 12 8 4 -2 1 -1 -1 -9 5 -6 -4 0 2 -3 -9 -12 -7 -19 -7 0 -13 -3 -17 -1 -9 -4 -5 -10 -3 1 4 2 10 9 3 8 10 6 1 8 8 9 2 12 7 11
5713 11 7 -4 9 1 6 2 -15 1 -10 -2 -10 -11 -7 -8 -15 -13 -11 -13 -7 -7 -1 -14 -16 -4 -3 0 5 4 4 8 4 1 15 13 16 12 2 5 1 2 13 6 6 -1 -1 1 -1 -3 -10 -1
5763anmQmqLlMJ5lpO%nQokQmLkKOnOq%J2mJlM%lJ2k6J0lNj4%JJNRj9RnlNmQnl
5817hLjPmQJjJ0nPrMK%pRj8J4Qj5nR%lJ0rmKLJj1Nnr%MjmQpQO%j2QoKlqJ6%Km
5870bJ7k3K8rnKKmJJ0j9MOpJ1rRjj3Nj0J3j4KMj2LKKnJ0PqqPPnJ2j2kPOjqNlO
5917HMLkKlnj1J0Nmj2QNj1RprRlLknJjj0NL%J5k0J9njRj1MmJ7j0J1mnJJ5j2KL
5964A4kLMj2%NmJpkkllJ1nJrLPj1NPnkj4J6OJKlj2J5J0j0QnjoJ1lLlKjpQqkRM
6014A4j0lNoL%qmMmMklmQj0J5oRrmJ2MPJj4MMPoQMoj3R%JRj0pQqLjlJNj1mQJj4
6066a2mQLoj1J9lmMPj2NmJ3pJ6j5OKjPnNJMj1J3orKJ%mKj0KJLj1lRj1J3JlklL
6114gkLJj0Q%jJ2NMj8LMJMkQrOjjkKKrMpRnKkqJKNj6KQJlNjqJnJ3%JPj2MMMqJ1
$$ plain form
5763 -1 -6 -10 -2 -6 -14 -11 -14 -10 5 2 -5 1 1 -4 4 -2 -4 4 0 3 1 3 9 4 10 2 2 14 10 11 8 12 12 9 21 -5 5 2 7 -7 -7 -6 -5 0 9 -10 -1 -6 -9 -4 -8 0 -5 -8
5817 -8 -5 -6 1 -3 5 6 5 15 10 17 8 12 14 14 7 16 -2 12 20 5 0 9 9 6 16 7 3 5 8 9 -2 3 -2 -11 -11 -7 -8 -12 -4 -11 -3 3 3 -9 -1 -7 -5 -8 -16 0 0 2 -2
5870 -2 15 -8 20 11 6 8 10 6 7 17 -2 2 8 1 12 3 12 11 -2 3 -7 6 -8 -6 -2 -14 -11 -9 -7 -12 -2 5 -3 -11 -4 3 -2 10 -2 -4 3 9 8 0 5 2 8
5917 8 12 15 13 15 12 7 -4 6 11 7 -5 3 8 -3 6 -1 -10 -1 -4 -1 -3 -8 -7 -8 -18 -13 -10 -10 5 -15 4 -1 -2 7 -4 0 -4 13 3 14 10 5 6 21 9 11 14
5964 14 12 15 19 7 7 12 8 9 2 0 -2 -5 -8 3 -2 -1 -10 -7 0 -11 -6 1 -4 -6 -20 -4 2 3 5 2 -10 5 15 5 13 8 7 1 12 9 12 9 11 10 3 11 3 1 10 14
6014 14 4 1 6 0 3 3 -5 -9 -5 -9 -5 -7 -10 -14 -6 -16 -1 -7 2 -7 -11 1 5 12 13 -1 3 7 14 8 16 20 14 1 10 10 11 20 10 3 11 3 6 5 2 3 8 -3 -7 1 2 -12
6066 -12 -16 -8 -5 -11 -22 -3 -6 -10 -6 1 -11 -6 -10 3 -4 12 -3 3 5 4 11 6 11 12 16 5 18 12 3 5 6 6 2 4 -6 -4 -3 0 -11 -14 -5 -16 -3 -2 -5 -7 -10 -7
6114 -7 -9 -6 -5 -15 -7 -7 -8 4 9 13 -5 -2 2 3 7 5 13 4 10 9 8 6 8 10 1 5 -2 7 2 4 2 -6 -5 -3 2 -14 -12 -4 -3 -6 -1 -2 -10 -9 -14 -1 -1 0 7 -5 -1 3 7 -1 10
6169A0Lj3MmMJ4noLll%J3mj4QnL%qL%mnlJ3j2oLJ3rjNjjKjJPlJ9lpmnOJ9pj1J
6219FlkJ8rJMmKMoj1k%lrJ4qlMkjJ1pLqNomK1p%JQLJnjQnOQjk0Q%lqMPqJ1rpn
6273iJNjMj2LmQnkRnjJ2k1LJ5j4MNPkLj0QRmjJ4nQj4Nj1J9j8J4j6NmLNj2jpJ3
6319CrMrNOr%JnmNJJ0oK%j1K1lj5K2rJ%KJ1mQnj4J5jj3PNpkRj6LRj6%Mj1J6pK
6367dj1OKoMQpjKkMQNmkJLo%J8j2Oj0RjMnNj3lJ2pkOjj4lnJ6oqlJ0j5ONJ1j2M
6416hjjJKJ0ljKkJ0mPrmJ1lLnPr%J8lojkplPpknKjqQNjLpj2J5joJ2kKLj2K1lp
6468CLNOqKmMqPmqJ3Kokk%LLrq%Rj3PoMJ0j3%oRnqJ5j2J7%llLJ1pQmrJ0kLmNO
6520A4oolPkkJj3POmm%j1LKPjmKOj0Qpj1J2oJ0NnKJK%MmMlQLj8K1pLmOj1mQKj0
$$ plain form
6169 10 13 0 4 0 4 18 13 7 10 7 4 4 17 13 -1 7 2 5 5 -3 0 0 -4 -9 -12 1 -11 -17 -14 -1 -10 -11 -6 -7 -8 -6 -7 -6 1 -2 17 14 7 3 -2 4 23 16 5 6
6219 6 3 1 19 10 11 15 11 13 17 11 0 -2 -2 -5 -14 0 -8 -11 -7 -9 -10 1 -6 -3 -11 -6 -12 -16 5 -2 -2 -1 7 10 11 6 5 13 8 14 22 21 1 9 9 6 -2 2 9 1 12 3 -4 -9
6273 -9 -8 -3 -4 0 -12 -9 -13 -5 -10 -12 -3 -8 -9 3 -18 -15 0 -14 -10 -5 2 0 3 -7 1 10 6 5 19 14 22 8 13 2 21 3 17 1 6 2 5 10 -2 -3 -10 3
6319 3 -6 -2 -11 -6 0 -9 -9 -8 -13 -17 -12 -11 -1 -7 -5 -5 -16 5 2 -13 9 0 1 1 3 14 10 18 13 -1 14 13 0 7 12 5 3 12 -4 -1 8 -8 -8 -4 -15 1 -6 -4
6367 -4 -15 -9 -7 -13 -9 -1 -8 -9 -7 -9 -5 3 8 4 2 3 6 0 0 18 6 12 2 11 10 14 9 14 1 -2 10 3 1 7 6 -8 -11 -16 0 -6 -14 -17 -7 -22 -16 -11 0 -12 -8
6416 -8 -9 -10 -9 -7 3 0 -1 1 -1 9 5 12 3 -1 10 7 10 5 12 3 3 21 18 12 11 9 2 -1 6 -1 -3 -8 -6 -7 -15 -7 -2 -3 0 -7 -19 -4 -5 -11 1 -1 1 4 -8 13 10 3
6468 3 6 11 17 9 11 7 11 3 10 6 -2 11 13 7 5 3 3 6 9 0 -8 -8 1 -12 -5 -11 -7 3 -10 -10 -16 -7 -12 -20 -5 -17 0 0 -3 -6 -3 8 1 9 5 -4 6 4 7 3 8 14
6520 14 8 2 -1 6 4 2 3 -10 -3 3 -1 -5 -5 -16 -13 -11 -4 -5 -9 -7 -1 -11 -3 -10 -21 -9 -15 -5 0 -5 -3 -2 0 0 4 0 4 1 9 12 -6 15 8 11 7 13 2 -2 6 8 -2
6571boLnNmMOj3QMj3NPj7JQMQRj9L%J1j1QOmnQLLpLOj2jJ0j0j2J5LmqJ%kJrjM
6621hllj%jJ2j%KkjLqO%Rnj0J1PpJ1Mj1JQljJ1k4J0mmjPPoj0MRj1%qkQrKOj1J3
6671dLj1%nLQQJLj2J8qkQj1K1pj0J3qmJJQnJrJ2k1PMqklN%qNnKJOnLQrKnRoMJ1
6723Hj6MKJ2j0J5JmrJ2mNnk%k%j1OLJpJ1omk%lmKk%kPj4ONJ4j1Lj3J2KPoOjlK
6772EPMjLo%klmPjnPnlo%J3k6J8k1RQj3J5kMlqJ0pJ0j4NLR%oJ4j1M%nOoJ8orj
6821EKrLPPqKopQlMq%KlLrjJM%J1j0NLK%kKkRqLmOjjKnMmKLMj3NoOOllj0OoPn
6878cQpj1OJkknJ3Qj5LJ7j7MJmK%J4knqK6j3k%RlloJ%KJ%knLj4M%oPqmkNKNJ%
6930fjjJ3orMKNKmORj0Q%klllRpJmLNj2OlKonRnlLL%Kj2P%%pLOqPNKpJ5j2PKN
$$ plain form
6571 -2 -8 -5 -10 -5 -9 -5 1 -12 -4 0 -13 -8 -1 -18 -17 -9 -5 3 12 -7 -4 -4 7 -4 4 10 6 1 9 12 15 8 11 17 5 4 14 4 -8 7 10 6 -2 -1 -1 -3 -2 -11 -12 -8
6621 -8 -11 -14 -15 -15 -16 -4 -5 -5 -3 -5 -6 -3 -11 -5 -5 4 -1 -11 0 7 0 11 15 4 5 13 10 9 20 -4 6 2 -2 -3 4 11 5 -5 -1 8 -3 -3 -11 -13 -5 -14 -12 -6 -17 -4
6671 -4 -1 -12 -12 -17 -14 -6 2 3 6 -6 12 4 2 10 -1 20 13 3 16 8 4 5 6 14 9 10 1 13 -8 -1 3 -5 -7 -10 -5 -5 -13 -8 -13 -11 -10 -4 -9 -6 2 -7 -5 -10 -1 -7 -3 8
6723 8 -8 -4 -2 10 0 15 16 12 3 15 11 16 11 9 9 7 7 -4 2 5 6 -1 10 4 0 -2 -2 -5 -9 -7 -9 -9 -11 -4 -18 -12 -7 7 -4 -1 -14 -2 0 7 1 7 6 3 5
6772 5 12 16 15 18 12 12 10 7 3 10 9 4 11 6 3 -3 -3 10 -16 2 -19 -10 -2 -15 0 -2 2 -1 -9 1 -6 4 -10 -5 -2 7 7 1 15 4 8 8 3 9 3 21 15 6 5
6821 5 7 -2 1 8 15 7 9 3 -4 4 1 5 -3 -3 -1 -4 -1 -10 -11 -10 -6 -6 5 -5 0 3 5 5 3 5 3 12 4 7 3 9 8 7 9 4 8 4 6 9 13 0 5 -1 5 11 8 5 -5 1 -5 2 -3
6878 -3 5 -2 -13 -7 -6 -8 -10 -15 -2 6 -9 -6 11 -6 -2 -1 -5 -3 -3 11 9 4 -4 22 9 7 7 16 13 10 4 5 5 7 8 8 6 1 4 -10 -6 -6 -12 -5 -13 -17 -19 -14 -12 -7 -6 -6
6930 -6 -7 -8 5 -1 -10 -6 -4 1 3 -1 5 14 4 12 12 10 7 4 1 10 3 4 0 3 8 -4 2 -1 1 -5 -10 -1 -6 -9 -6 -3 -3 -1 -13 -6 -6 -6 -13 -10 -4 -12 -5 0 2 -5 10 -2 5 7 12
6985A2j3PKLkPmjkj1J1jlJrJ0mnJ2njomJ3poJ0lKmjMmJMlKJRnLl%MnOJ3j5mJQ
7036A5oNpoJLPqqlJ0Kj1MoL%jpJ0jkJmRjonJ2Oj%jLQkpj0J6%qJ5j2oMMMrQj1m
7087cQlmjJ0oj3RqJ0%kqJ4rPPj5J3j4LJ1j2RQqQLrO%lMLkNj1lJJqNKqRj0Mj5J4
7136anljjLmQRj2kJ7j7RNj4N%J1mMknRKjmJ0%j8RMj2LJQj2lPjj3J0%kj0jOmKj
7185a1J2JlpkN%QklJ7j2NpOrJ0LjlMnKlmNpQKrkpkJ5j5NJKpqOJ0knQjPmojR%m
7238aOjRj0J0LklPlmkJ0onkJkMkj1JnJoORqkRj2kQ%nOlMnMKQj0MJ4mMlMkjNpJ1
7292B1j2RrnkjJ0Lj4jJ2j3JoM%rjJ0lkKKMNj5MQNj3J1mKMlJ1%j2J3j2OJ0nqkq
7338cJ0pOqOpOj0PpKpJMnJLNKMlKqpRJ0j0PmJ1nRj1j0J5RKjmJqlKj1QO%j0Jmj
$$ plain form
6985 12 -1 6 8 11 9 16 12 11 9 -2 9 8 5 6 -3 7 3 -2 10 5 4 -2 -6 7 0 -6 4 1 3 -1 -2 2 -2 -1 3 0 2 3 12 7 10 7 7 11 6 12 25 10 6 7 15
7036 15 9 14 7 1 2 5 12 4 -4 -7 3 5 -6 -2 -8 -5 -5 -6 -13 -3 -4 -6 -5 -9 0 -1 -7 -12 0 6 5 5 4 7 15 13 6 -4 12 12 4 19 7 1 5 9 13 4 12 1 -3
7087 -3 5 2 -2 -3 7 1 -12 -3 -11 -1 -1 -3 -11 3 -6 1 8 -7 6 -8 -5 6 -6 3 11 3 11 14 5 11 11 8 12 15 13 18 7 4 5 6 -2 3 5 -3 6 -4 0 -15 -1
7136 -1 -6 -9 -10 -11 -8 -12 -4 5 -7 -9 8 -9 0 5 -9 -4 -4 7 3 7 5 0 9 11 10 6 16 16 -2 7 11 -1 2 3 11 -1 -4 3 2 -11 -1 -1 -3 -13 -14 -8 -12 -10 -11
7185 -11 1 2 -1 -8 -10 -5 -5 3 1 -2 15 3 8 1 7 -2 8 11 10 7 11 6 8 5 1 6 -1 7 9 0 -2 -9 -11 4 -11 -6 -5 -3 -10 -18 -12 -2 -4 -9 -1 -2 5 1 -5 -6 3 3 -1
7238 -1 5 4 13 3 13 16 14 11 18 15 11 9 19 13 8 6 7 5 9 7 -4 -3 -8 -7 -13 -7 2 -6 -8 1 -11 -13 -5 -5 -10 -4 -7 -3 -8 -4 -2 6 -4 0 14 10 14 11 15 13 12 17 10 21
7292 21 9 18 9 4 2 1 11 14 0 -1 11 -2 -1 -7 -3 -3 -12 -13 -3 -6 -8 -6 -4 0 5 -10 -6 2 7 -6 5 1 3 7 4 15 15 3 16 4 10 20 15 7 5 -3
7338 -3 7 0 6 -2 4 -3 3 -7 0 -7 -5 -12 -11 -7 -12 -11 -8 -3 -1 3 0 2 -6 -13 -4 6 -4 3 -1 10 5 14 3 -7 8 17 19 18 14 15 7 4 6 -5 3 9 9 -1 0 -4 -5
7389ejr%ONj0J6pjlRkj8J1J2nO%n%nJ4pQMjLJonlQMqKRj7nJ3poJ0j8J5rLjjj7
7438b3J2j0J2mRmPj1J0Qj6J2MnLKj0J5olMkJmjPloNmJqOlJkMoOlojpkJ1KLmNk
7488fjLlJ0oLJ1j5R%JMMnmmKqLNOJnnOj6J2pNpklLOj5J6mkj0J6%qljPNQlJnOM
7540IOlJ0pj7PljNpPpmJ0njl%NolknLPoLJrJ0j0oQnPKQmNOoQ%%%nJ0jkqJJ6j0
7593HqJ9j1orMj2J6Jj2j%RpMlK%j0OjLjJ0nkLJNOkJkrJ0K%j1J5Mk2J6qNJ1nkk3
7641a1J2Onq%Rj9J3knMKJNkJmmoJ3KlMoJ1k%lJ4nPj5NNj0J1kmRnmj2KPmkLjnl
7691fnPjj%klJ1%j4LpJ1J1j1N%J8j6OnKQoONjj7NkKnO%Mp%kKoOqmJ4j9O%kQmo
7742a4J6knNMrk%J0jN%jjjLmRlJljnOjL%nLqkoL%kJJ1rkqQ%NkkjNoJML%J%%PL
$$ plain form
7389 -5 -6 -15 -15 -9 -4 -14 2 -5 -6 -9 0 -2 -20 -9 3 -2 4 4 -1 -1 -6 8 1 9 13 12 15 16 10 5 2 10 14 6 8 17 0 -5 8 1 -5 5 -13 2 -7 -4 -5 -6 -23
7438 -23 -11 -21 -9 -13 -4 -8 -1 -12 -2 6 -10 2 6 1 4 6 -4 11 5 2 6 4 5 1 0 7 4 -2 3 -1 0 -8 -2 -5 -4 -6 -2 -8 -2 -5 -11 -12 -19 -21 -10 -8 -5 -9 -4 -6
7488 -6 -7 -4 -7 3 -3 0 11 -4 5 5 6 10 14 9 5 1 3 -5 -2 3 9 10 5 0 6 -10 2 -5 0 -7 -9 -12 -9 -3 -18 -2 -6 -8 -18 -2 -2 -10 -13 -14 -7 -2 6 3 4 -1 5 9
7540 9 15 12 22 15 -2 5 2 1 6 -1 6 -1 -5 5 0 -1 -4 -4 1 -5 -8 -10 -15 -12 -5 -11 -8 -7 -16 -6 -16 -22 -14 -19 -12 -10 -2 -6 -1 5 -1 7 7 7 7 2 12 11 9 1 2 18 8
7593 8 0 19 8 2 -7 -3 -15 1 2 -10 -11 -11 -2 -9 -5 -8 -6 -6 -16 -10 -11 -8 -9 1 -4 -6 -3 -2 3 9 7 8 6 -3 7 9 9 -2 13 17 -5 11 3 8 19 14 12 -11
7641 -11 1 7 2 -6 -6 3 -16 -3 -5 -10 -6 -4 -3 2 0 1 -3 -7 -13 0 2 -1 3 -3 8 6 6 3 17 12 19 4 9 14 4 15 13 9 18 13 9 -3 -1 6 2 0 3 2 -3 -6
7691 -6 -11 -4 -5 -6 -6 -8 -11 0 0 -14 -11 -18 -7 4 -7 -2 -2 16 0 6 1 3 11 5 11 16 15 -2 3 1 3 -2 4 4 8 1 1 -1 1 -5 1 -7 -11 3 -16 -10 -10 -12 -4 -8 -14
7742 -14 2 0 -5 0 4 -5 -7 -7 3 2 7 7 6 5 4 7 3 12 9 10 7 6 1 7 6 9 9 4 7 -1 -3 -9 -6 -6 -8 -7 4 -5 -7 -15 -7 -7 -2 -4 -6 -7 -2 -8 -7 -3 0 0 1 1 1 8 11
7799A1pKnPj%JPj7MkRJj6lJ2j1J1rNJj1KjkKOj7MJ2qQJ1r%kLJ%jRmMQ%oN%j3P
7849Hlj1J0nQokPj3%kLKKnLjj1LmJ1rJ0%pLlRKQknkmJ2%jllP%OoJ3j3Qj4Lk%j
7900@jqoPjRj1oJ3jLnpkmJ2nRJ%MqPLJQj0MoJ3lKj0KLJqLnQKmknPj1%mNLNj9%
7953a7J2j1MNLomJ5qJ3pkkLP%P%lNpj2J2%pRlOmLj0Pmj2NNj9mNLJ0oLj4J0%Pl
8001flKj3J8pnJ5JNj2J6pPpRoMj3J2p%LNpNkj9J3pkmMJ%jlPj0QnnMlJ1JkRnJO
8051FLj3MKJ3rj0J4oKOj5J2%%plNjnJMPj4Lpj4RJRoooJ3jJ0qJJ7k0MQJOj2NKJ0
8099A5kj1J2%rLJ0j4jJjRjrMj1MnKrRnj3J0rQoQJ5mmj0J3rQJ0Kj7J5rLMkJjkK
8146DRrQj5J5pRj1joKj5QNoJ3j0RpmJQmkNrRJkMJmJ0nJ2lj0J1k%j2J1koO
$$ plain form
7799 11 4 6 1 8 7 7 8 15 -2 2 0 9 10 -6 -9 3 -8 3 -6 -1 0 -11 -9 -10 -12 -10 -4 -21 -17 -5 -13 -5 6 -3 -3 -5 -2 -1 -1 -2 7 3 7 15 15 9 14 14 1 8
7849 8 5 -6 4 -1 7 1 -1 6 -7 -7 -9 -6 -4 -2 -7 -4 -5 -16 -13 -17 -6 -15 -5 -5 -12 -9 -12 -3 -1 7 5 0 -2 -6 6 6 5 2 -1 6 6 12 6 19 6 14 0 3 1 1 0
7900 0 -1 -9 -15 -8 -9 0 -11 -17 -4 -5 -2 -7 -14 -16 -20 -8 -13 -4 -3 -3 1 -7 0 3 4 12 2 6 0 13 10 12 2 4 7 8 0 3 -2 6 8 4 2 -3 4 -7 -7 -11 -6 -3 2 -17 -17
7953 -17 -5 -16 -12 -7 -4 -10 -14 1 -7 6 -1 -3 -5 -2 5 5 12 12 9 14 7 -5 7 7 0 9 6 12 8 11 1 8 4 -8 -3 2 -17 -21 -16 -13 -3 -9 -6 -20 -10 -10 -3 -6
8001 -6 -9 -7 -20 -2 -9 -14 1 2 7 -5 11 4 11 4 13 7 11 -2 10 3 3 6 11 4 9 7 -12 1 -6 -8 -12 -8 -7 -7 -8 -11 -4 -14 -6 -11 -16 -12 -15 -4 -3 -5 4 -1 0 6
8051 6 9 -4 0 2 15 6 -4 10 4 6 12 -3 9 9 9 2 -1 4 3 -2 -1 3 10 -4 -1 -8 -22 -13 -12 -3 -9 -15 -21 -8 -9 1 -7 -6 11 -9 -5 3 4 10 -2 3 5 15
8099 15 13 2 14 14 5 8 18 4 3 4 3 12 11 2 6 -5 -1 -6 -4 -13 -4 -9 -22 -12 -21 -13 -19 -11 4 0 -4 -14 -1 -10 -2 8 10 -7 8 -1 2 6 4 5 4 2 4
8146 4 13 4 12 -3 12 5 14 3 2 -4 -2 -17 -9 -4 -10 3 -7 2 -5 -9 -8 0 -4 -6 -1 -10 -1 0 -2 2 3 -1 9 4 16 13 3 14 12 12 0 11 9 3 9
8191I
##END NTUPLES=NMR FID
##END=
