##TITLE=1H_ES-ZC-tBuOH
 
 8 sc, 
 19.1.2023
##JCAMPDX= 6.0         $$ Bruker NMR JCAMP-DX V2.0
##DATA TYPE= NMR FID
##DATA CLASS= NTUPLES
##ORIGIN= UXNMR, Bruker Analytische Messtechnik GmbH
##OWNER= root
$$ XWIN-NMR		Version 3.5
$$ Thu Jan 19 14:11:34 2023 Russian Standard Time (UT+4h)  she@DPX200
##.OBSERVE FREQUENCY= 200.13135
##.OBSERVE NUCLEUS= ^1H
##.DELAY= (6, 6)
##.ACQUISITION MODE= SIMULTANEOUS
##.ACQUISITION SCHEME= undefined
##.AVERAGES= 8
##.DIGITISER RES= 18
##SPECTROMETER/DATA SYSTEM= spect
##.PULSE SEQUENCE= zg30
##.SOLVENT NAME= CDCl3
##.SHIFT REFERENCE= (INTERNAL, CDCl3, 0, 15.7039)
##AUDIT TRAIL= $$ (NUMBER, WHEN, WHO, WHERE, WHAT)
$$ ##TITLE= Audit trail, XWIN-NMR		Version 3.5
$$ ##JCAMPDX= 5.01
$$ ##ORIGIN= Bruker BioSpin GmbH
$$ ##OWNER= she
$$ F:/spectra/data/she/nmr/H-F/1/audita.txt
$$ ##AUDIT TRAIL=  $$ (NUMBER, WHEN, WHO, WHERE, WHAT)
(   1,<2023-01-19 14:10:23.28 +0400>,<she>,<DPX200>,
      <created by zg, POWCHK disabled, PULCHK disabled
       configuration hash MD5:
       00 E9 B6 7A A2 85 ED C7 34 08 36 98 17 FE 4E 26
       data hash MD5: 16K
       E5 21 00 E6 C8 14 37 C5 CA DE 76 51 C2 53 B5 F6>)
$$ ##END=
$$ 
$$ hash MD5
$$ B4 0D E7 0C 08 6B 77 DF AD 28 A5 5F 70 9F 38 57
##$RELAX= 
##$RELAX= 
##$RELAX= 
##$RELAX= 
##$RELAX= 
##$RELAX= 
$$ Bruker specific parameters
$$ --------------------------
##$DU= <F:/spectra>
##$EXPNO= 1
##$NAME= <H-F>
##$PROCNO= 1
##$TYPE= <nmr>
##$USER= <she>
##$AMP= (0..31)
100 100 100 100 100 100 100 100 100 100 100 100 100 100 100 100 100 100 
100 100 100 100 100 100 100 100 100 100 100 100 100 100 
##$AQSEQ= 0
##$AQ_mod= 1
##$AUNM= <au_zg>
##$AUTOPOS= <>
##$BF1= 200.13
##$BF2= 200.13
##$BF3= 200.13
##$BF4= 200.13
##$BF5= 200.13
##$BF6= 200.13
##$BF7= 200.13
##$BF8= 200.13
##$BYTORDA= 1
##$CFDGTYP= 0
##$CFRGTYP= 5
##$CHEMSTR= <none>
##$CNST= (0..31)
1 1 145 1 1 1 1 1 1 1 1 1 1 1 1 1 1 1 1 1 1 1 1 1 1 1 1 1 1 1 1 1 
##$CPDPRG= <>
##$CPDPRG1= <>
##$CPDPRG2= <>
##$CPDPRG3= <>
##$CPDPRG4= <mlev>
##$CPDPRG5= <mlev>
##$CPDPRG6= <mlev>
##$CPDPRG7= <mlev>
##$CPDPRG8= <mlev>
##$CPDPRGB= <>
##$CPDPRGT= <>
##$D= (0..31)
0 1.2 0 0 0 0 0 0 0 0.06 0 0.03 0 0 0 0 0.0002 0 0 0 0 0 0 0 0 0 0 0 0 
0 0 0 
##$DATE= 1674123022
##$DBL= (0..7)
120 120 120 120 120 120 120 120 
##$DBP= (0..7)
150 150 150 150 150 150 150 150 
##$DBP07= 0
##$DBPNAM0= <>
##$DBPNAM1= <>
##$DBPNAM2= <>
##$DBPNAM3= <>
##$DBPNAM4= <>
##$DBPNAM5= <>
##$DBPNAM6= <>
##$DBPNAM7= <>
##$DBPOAL= (0..7)
0.5 0.5 0.5 0.5 0.5 0.5 0.5 0.5 
##$DBPOFFS= (0..7)
0 0 0 0 0 0 0 0 
##$DE= 6
##$DECBNUC= <off>
##$DECIM= 32
##$DECNUC= <off>
##$DECSTAT= 4
##$DIGMOD= 1
##$DIGTYP= 9
##$DL= (0..7)
0 120 120 120 120 120 120 120 
##$DP= (0..7)
150 150 150 150 150 150 150 150 
##$DP07= 0
##$DPNAME0= <>
##$DPNAME1= <>
##$DPNAME2= <>
##$DPNAME3= <>
##$DPNAME4= <>
##$DPNAME5= <>
##$DPNAME6= <>
##$DPNAME7= <>
##$DPOAL= (0..7)
0.5 0.5 0.5 0.5 0.5 0.5 0.5 0.5 
##$DPOFFS= (0..7)
0 0 0 0 0 0 0 0 
##$DQDMODE= 0
##$DR= 18
##$DS= 0
##$DSLIST= <SSSSSSSSSSSSSSS>
$$ [...]
##$SUBNAM2= <"">
##$SUBNAM3= <"">
##$SUBNAM4= <"">
##$SUBNAM5= <"">
##$SUBNAM6= <"">
##$SUBNAM7= <"">
##$SUBNAM8= <"">
##$SUBNAM9= <"">
##$SW= 18.05172834244
##$SWIBOX= (0..15)
0 0 2 0 0 0 0 0 0 0 0 0 0 0 0 0 
##$SW_h= 3612.71676300578
##$TD= 16384
##$TD0= 1
##$TE= 0
##$TE2= 300
##$TE3= 300
##$TEG= 300
##$TL= (0..7)
0 120 120 120 120 120 120 120 
##$TP= (0..7)
150 150 150 150 150 150 150 150 
##$TP07= 0
##$TPNAME0= <>
##$TPNAME1= <>
##$TPNAME2= <>
##$TPNAME3= <>
##$TPNAME4= <>
##$TPNAME5= <>
##$TPNAME6= <>
##$TPNAME7= <>
##$TPOAL= (0..7)
0.5 0.5 0.5 0.5 0.5 0.5 0.5 0.5 
##$TPOFFS= (0..7)
0 0 0 0 0 0 0 0 
##$TUNHIN= 0
##$TUNHOUT= 0
##$TUNXOUT= 0
##$USERA1= <user>
##$USERA2= <user>
##$USERA3= <user>
##$USERA4= <user>
##$USERA5= <user>
##$V9= 5
##$VALIST= <valist>
##$VCLIST= <CCCCCCCCCCCCCCC>
##$VD= 0
##$VDLIST= <DDDDDDDDDDDDDDD>
##$VPLIST= <PPPPPPPPPPPPPPP>
##$VTLIST= <TTTTTTTTTTTTTTT>
##$WBST= 1024
##$WBSW= 4
##$XGAIN= (0..3)
0 0 0 0 
##$XL= 0
##$YL= 0
##$YMAX_a= 884341
##$YMIN_a= -739506
##$ZGOPTNS= <>
##$ZL1= 120
##$ZL2= 120
##$ZL3= 120
##$ZL4= 120
##$ABSF1= 10
##$ABSF2= 0
##$ABSG= 5
##$ABSL= 3
##$ALPHA= 0
##$AQORDER= 0
##$ASSFAC= 0
##$ASSFACI= 0
##$ASSFACX= 0
##$ASSWID= 0
##$AUNMP= <proc_1d>
##$AZFE= 0.1
##$AZFW= 0.1
##$BCFW= 1
##$BC_mod= 2
##$BYTORDP= 1
##$COROFFS= 0
##$CY= 11.3945322036743
##$DATMOD= 1
##$DC= 2
##$DFILT= <>
##$DTYPP= 0
##$F1P= 2.36226072786647
##$F2P= -0.459571619588291
##$FCOR= 0.5
##$FTSIZE= 0
##$FT_mod= 4
##$GAMMA= 1
##$GB= 0.15
##$INTBC= 1
##$INTSCL= 1
##$ISEN= 128
##$LB= 0.24
##$LEV0= 0
##$LPBIN= 0
##$MAXI= 10000
##$MC2= 0
##$MEAN= 0
##$ME_mod= 0
##$MI= 1.114404
##$NCOEF= 0
##$NC_proc= 0
##$NLEV= 6
##$NOISF1= 3.799351
##$NOISF2= 2.8
##$NSP= 1
##$NTH_PI= 0
##$NZP= 0
##$OFFSET= 15.70392
##$PC= 1
##$PHC0= -19066.46
##$PHC1= 57.60079
##$PH_mod= 1
##$PKNL= yes
##$PPARMOD= 0
##$PSCAL= 0
##$PSIGN= 0
##$REVERSE= no
##$SF= 200.130013532006
##$SI= 16384
##$SIGF1= 3
##$SIGF2= 2
##$SINO= 400
##$SIOLD= 16384
##$SREGLST= <1H.CDCl3>
##$SSB= 0
##$STSI= 0
##$STSR= 0
##$SW_p= 3612.71676300578
##$SYMM= 0
##$S_DEV= 0
##$TDeff= 0
##$TDoff= 0
##$TI= <>
##$TILT= no
##$TM1= 0
##$TM2= 0
##$TOPLEV= 0
##$USERP1= <user>
##$USERP2= <user>
##$USERP3= <user>
##$USERP4= <user>
##$USERP5= <user>
##$WDW= 1
##$XDIM= 8192
##$YMAX_p= 0
##$YMIN_p= 0
$$ End of Bruker specific parameters
$$ ---------------------------------
##NTUPLES= NMR FID
##VAR_NAME=  TIME,          FID/REAL,        FID/IMAG
##SYMBOL=    X,             R,               I
##VAR_TYPE=  INDEPENDENT,   DEPENDENT,       DEPENDENT
##VAR_FORM=  AFFN,          ASDF,            ASDF
##VAR_DIM=   8192,          8192,            8192
##UNITS=     SECONDS,       ARBITRARY UNITS, ARBITRARY UNITS
##FACTOR=    0.0002768,     1,               1
##FIRST=     0,             0,               0
##LAST=      2.2672688,     0,               0
##MIN=       0,             -739506,         0
##MAX=       2.2672688,     884341,          0
$$ Real data points
##PAGE= N=1
##DATA TABLE= (X++(R..R)), XYDATA
$$ [...]
209A14223q8984j77161L66114m01936K72655l3915k14887L71815l74073K23078
219E6929J7125k46961L72466l43640J74296O4341k73582L68099l10499J26283
229D857J07514k94456L58384k74571P9169J46278l08933L42884k35829L3519J79801
240A38617l16482L21531j94781r880K07375l16864K94870j52503m9945K28504
250A50442l10431K63945j10287q5772K43144k98180K30257o9427j16822K51870
260A48739k81442J95385l0955j43229K55774k61739J60514M714j65320K55721
270A38162k40073J26386L7440j83662K52662k17270R3311O7393j98581K46880
280A22648j93430O1219R4696k10173K38283j68397L0164J19093k18039K26546
$$ plain form
209 114223 25239 -151922 214192 -187744 84911 50996 -163891 207924 -166149 56929
219 56929 74054 -172907 199559 -144081 30215 94556 -179026 189073 -121426 4857
229 4857 112371 -182085 176299 -98272 -19103 127175 -181758 161126 -74703 -41184 138617
240 138617 -177865 143666 -51115 -60995 146380 -170484 124386 -28117 -78062 150442
250 150442 -159989 103956 -6331 -92103 151041 -147139 83118 13691 -103131 148739
260 148739 -132703 62682 31727 -111502 144272 -117467 43047 47761 -117559 138162
270 138162 -101911 24475 61915 -121747 130915 -86355 6956 74349 -124232 122648
280 122648 -70782 -9563 85133 -125040 113243 -55154 -24990 94103 -123936 102610
290A02610j42048J45J40313k21729K11352j14420k8311J57708k20811J92617q5884
301h458n4553J70637k15135J70863n7302p7886J78954k05092J46871k9585r7733
312g8419J82812j91537J21753l467j14064J82763j75443R6496K0488j26998J79688
323I4072j57947P1950M2045j37010J74384j39789M8478O1380j44584J67432j21403
334d0992K6179P8668j50034J59078j02790M914R3992j53335J49192q3854j5286
345c4268J07217j54279J37557o4502l4267J17969j52388J23890m4863n1669J25831
356G6228j47450J08301k5264o6977J30424j39455R1183o300p9765J31706j28816
367e6185P3181J1431q9808J30005j16199N5064K7425r7163J25807j02402L7498
$$ plain form
290 102610 -39438 -39293 101020 -120709 90643 -23777 -52088 105620 -115191 77426 -8458
301 -8458 -63011 107626 -107509 63354 6052 -71834 107120 -97972 48899 19314 -78419
312 -78419 104393 -87144 34609 31142 -82922 99841 -75602 20894 41382 -85616 94072
323 94072 -63875 8075 50120 -86890 87494 -52295 -3817 57563 -87021 80411 -40992
334 -40992 -14813 63855 -86179 72899 -29891 -24977 69015 -84320 64872 -18982 -34268
345 -34268 72949 -81330 56227 -8275 -42542 75427 -76961 46929 2066 -49603 76228
356 76228 -71222 37079 11815 -55162 75262 -64193 26990 20690 -59075 72631 -56185
367 -56185 16996 28427 -61381 68624 -47575 7489 34914 -62249 63558 -38844 -1346
378a346M1534j02161J19907q8234K1002N3731j05274J12906p4189N646O4278j06927
390e9127J05227o0418q622P3385j07379R6966m6917k1888Q1110j06549Q8032l3526
402B94l4241Q7392j04259P8199k0262m5478R1917j00197O7283p087n5383R4430
414E2608r4306N5478N627o3584R4670q6502M2991J7466o9800R2667p7177L0318
426D56K8142p4043Q8795o6901J8020L7343p6421Q3454n6176O421M5104p7259P7220
439C4155m5556m242N1536p7009P0548l5255j4012N6918p5989O3651k5362k2929
451b3546O1375p4292N6644j5887l1088O4926p1913M9325o635l8454O7458o8603
463c0690M1560K369m5006O8821o4207L3296J1005n0364O8669n8632K4656J9058
$$ plain form
378 -1346 40188 -61973 57934 -30300 -9298 44433 -60841 52065 -22124 -16478 47800 -59127
390 -59127 46100 -14318 -22940 50445 -56934 40032 -6885 -28773 52337 -54212 33820 294
402 294 -33947 53445 -50814 27385 7123 -38355 53562 -46635 20648 13561 -41822 52608
414 52608 -41698 13780 19407 -44177 50493 -36009 6982 24448 -45352 47315 -29862 456
426 456 28598 -45445 43350 -23551 -5531 31812 -44609 38845 -17331 -10910 34194 -43065 34155
439 34155 -11401 -15643 35893 -41116 29432 -5823 -19835 37083 -38906 24745 -617 -23546
451 -23546 37829 -36463 20181 4294 -26794 38132 -33781 15544 8909 -29545 37913 -30690
463 -30690 10870 13239 -31767 37054 -27153 6143 17148 -33216 35453 -23179 1477 20535
475B0535n4408O6977n1923J5806K6260n6920O3788m4400P152L2378n7945N9342
487B6642l6418j019L7354n7735N4123k8398q491M1264n6598M8475k0641j5187
499a6629M4279n4815M2723j3291k1226M6633n2660L7002o320k6655M8418n0137
511b2678L1276L02l1543M9635m7228K5439O669l5854N0180m3813J9465J2702l9453
524b4901M9842l9681J3295J8347m2140M8399l4761O988K3342m3718M5915k9269
536h342Q38K7516m4126M2399k3316n002L0758m3458L8122j7276j0279L3126m1971
549b1011L3445j1382j4925L4660l9856K8630n861j8952L5636l7468K3888o99k2482
562a6377L6176l4874J9279M081k5554L6369l2182J4805Q523k8217L6238k9315
$$ plain form
475 20535 -33873 33104 -18819 -3013 23247 -33673 30115 -14285 -7133 25245 -32700 26642
487 26642 -9776 -10795 26559 -31176 22947 -5451 -13942 27322 -29276 19199 -1442 -16629
499 -16629 27650 -27165 15558 2267 -18959 27674 -24986 12016 5696 -20959 27459 -22678
511 -22678 8598 8900 -22643 26992 -20236 5203 11872 -23982 26198 -17615 1850 14552 -24901
524 -24901 24941 -14740 -1445 16902 -25238 23161 -11600 -4612 18730 -24988 20927 -8342
536 -8342 -7504 20012 -24114 18285 -5031 -10033 20725 -22733 15389 -1887 -12166 20960 -21011
549 -21011 12434 1052 -13873 20787 -19069 9561 3700 -15252 20384 -17084 6804 6105 -16377
562 -16377 19799 -15075 4204 8285 -17269 19100 -13082 1723 10246 -17971 18267 -11048
574a1048J0381J2703l0450L5606k6097N958J6494l2047L4319k2469J505J9890
586A4745l2941L2344j8473k826K2694l3020K9659j4142o951K4843l2269K6347
598A0010r716j0610K6211l0771K2647n375j3788K6918k8760J8773j277j6421K7069
611A4910k6435J4968K476j8592K6840k3995J1321N818k0370K6402k1521P869Q890
624H581k1861K5772j9074M591J1689k3086K4954j6575J419J4228k3958K3823j3919
637c416j652J6454k4412K2293j1047m638J8296k4335K0315p966p496J9685k3658
650a1577J7880m835r998K0507k2420J5113j751j2107K0747k0704J2175J201j3805
663i574K0507j8700R258L805j5086J9965j6572O443O184j6054J9174j4431L840
$$ plain form
574 -11048 -667 12036 -18414 17192 -8905 -2947 13547 -18500 15819 -6650 -5145 14745
586 14745 -18196 14148 -4325 -7151 15543 -17477 12182 -1960 -8911 15932 -16337 10010
598 10010 294 -10316 15895 -14876 7771 2396 -11392 15526 -13234 5539 4262 -12159 14910
611 14910 -11525 3443 5919 -12673 14167 -9828 1493 7311 -13059 13343 -8178 -309 8581
624 8581 -13280 12492 -6582 -1991 9698 -13388 11566 -5009 -3590 10638 -13320 10503 -3416
637 -3416 -5068 11386 -13026 9267 -1780 -6418 11878 -12457 7858 -108 -7604 12081 -11577
650 -11577 6303 1468 -8530 11977 -10443 4670 2919 -9188 11559 -9145 3030 4231 -9574
663 -9574 10933 -7767 1491 5296 -9790 10175 -6397 46 6230 -9824 9350 -5081 -1241
676a241Q193j6741J8349j2413J458J0029j7325J7442j0421q14J1656j7682J6429
689F919q437k970J3118j7869J5248o403n018J4341j7729J3830m294o912J5214
702I038j7188J2088k096q678J5757j6279J0139P9j0103J5832j4972P984K132j1200
716g467J5502j3365N786M040j2013J4894j1637L670N671j2500J4073r862J671
729a537P071j2789J3177q129j57Q280j2909J2186o494j812R317j2968J1285m963
743d42l348J0228j2876J0256l444m763J1000j2697R186j930o095J1578j2297P956
757B312l76p308J1906j1597O544J142q260J1923j0645N008K601r040J1649r453
771c594L429L919r504J1106q110J839N038r726J0344o670L33N987r734R424n276
$$ plain form
676 -1241 6952 -9789 8560 -3853 -2395 7634 -9691 7751 -2670 -3484 8172 -9510 6919
689 6919 -1518 -4488 8630 -9239 6009 -394 -5412 8929 -8800 5030 736 -6176 9038
702 9038 -8150 3938 1842 -6836 8921 -7358 2781 2860 -7243 8589 -6383 1601 3733 -7467
716 -7467 8035 -5330 456 4496 -7517 7377 -4260 -590 5081 -7419 6654 -3208 -1537
729 -1537 5534 -7255 5922 -2207 -2364 5916 -6993 5193 -1301 -3113 6204 -6764 4521 -442
743 -442 -3790 6438 -6438 3818 374 -4389 6611 -6086 3100 1170 -4925 6653 -5644 2312
757 2312 1936 -5372 6534 -5063 1481 2623 -5637 6286 -4359 649 3250 -5790 5859 -3594
771 -3594 -165 3754 -5750 5356 -2754 -915 4123 -5603 4741 -1929 -1596 4391 -5343 4081 -1195
786a195r72O722r631Q554l955k183P334r432P647k738l263P887r245O783j566
801G47m241Q296q930N891m57n148Q635q560M969O34n967Q808q017L958J724o657
817d315Q810p331K863K736p156Q561o424J692L665p419Q063n401N59M457p540
832d180P458m312n46N080p437O686l206j535N552p189N854k132k394N850o874
847c325N061j196l106O079o536M290l03l762O258o183L575M79m337O400n834K895
863D55J229m829O435n406K162J986n281O394m884J387K673n609O206m271N95L280
879B522n748N838l510k20L810n813N362k719r86M209n630M719j887j673M466n374
895b634M054j091k267M616n024L386l76k746M691m676K725L22l179M696m302K142
$$ plain form
786 -1195 -2167 4555 -5076 3478 -477 -2660 4674 -4758 2889 151 -3112 4775 -4470 2313 747
801 747 -3494 4802 -4128 1763 1306 -3842 4793 -3767 1202 1836 -4131 4677 -3340 618 2342 -4315
817 -4315 4495 -2836 27 2763 -4393 4168 -2256 -564 3101 -4318 3745 -1656 -1097 3360 -4180
832 -4180 3278 -1034 -1580 3500 -3937 2749 -457 -1992 3560 -3629 2225 93 -2301 3549 -3325
847 -3325 1736 540 -2566 3513 -3023 1267 964 -2798 3460 -2723 852 1331 -3006 3394 -2440 455
863 455 1684 -3145 3290 -2116 46 2032 -3249 3145 -1739 -352 2321 -3288 2918 -1353 -758 2522
879 2522 -3226 2612 -898 -1118 2692 -3121 2241 -478 -1464 2745 -2885 1834 -53 -1726 2740 -2634
895 -2634 1420 329 -1938 2678 -2346 1040 664 -2082 2609 -2067 658 980 -2199 2497 -1805 337
911C37Q89l525M717l962J597J415l842M698l629J068J926m112M634l260N41K386
927A878m341M513k835JK836m488M267k314n64L184m484L927j755j109L466m368
943b186L454j139j603L652m173K954n42k023L720l855K421j4k365L714l515J865
959C65N25k659L678l162J368R44k856L594k816Q86J369l050L503k521M85J751
975A404l261L416k184P1K066l366L296j873l36K389l450L107j493p32K663l496
991a779K871j079j147K888l417K542o45j486K995l236K139j95j779L009k976J723
1007D28K40k090L021k696J265O54k245K901k362Q42R91k380K777k027M45J283
1023A047k479K654j736Q9J562k558K511j420k31J793k624K357j150n37K010k661
$$ plain form
911 337 1226 -2299 2418 -1544 53 1468 -2374 2324 -1305 -237 1689 -2423 2211 -1049 -508 1878
927 1878 -2463 2050 -785 -784 2052 -2436 1831 -483 -1047 2137 -2347 1580 -175 -1284 2182 -2186
943 -2186 1268 129 -1474 2178 -1995 959 417 -1606 2114 -1741 680 666 -1699 2015 -1500 365
959 365 890 -1769 1909 -1253 115 1059 -1797 1797 -1019 -133 1236 -1814 1689 -832 -347 1404
975 1404 -1857 1559 -625 -554 1512 -1854 1442 -431 -767 1622 -1828 1279 -214 -946 1717 -1779
991 -1779 1092 13 -1134 1754 -1663 879 234 -1252 1743 -1493 646 451 -1328 1681 -1295 428
1007 428 668 -1422 1599 -1097 168 822 -1423 1478 -884 -42 949 -1431 1346 -681 -236 1047
1023 1047 -1432 1222 -514 -425 1137 -1421 1090 -330 -561 1232 -1392 965 -185 -722 1288 -1373
1039a373K243q94p94K173k652K015n55j129K369k629J803k56j390K448k465J492
1055D06O6j584K434k257J119M40j796K386j991P83P40j917K292j732M40J014k012
1072a169K163j403J03J203k030K014j159j54J381k042J848q98m22J587k081J710
1088F51o44o65J707k050J562m21q80J824k017J361j85j082J928j948J183M5j285
1105i16J976j851R79K85j433J996j710P27N37j565J927j484M55P50j652J838j265
1122d06J75R66j688J679r90q4J111j662J530p67k95J224j639J386n51m74J318
1139H33j605J202l41o56J379j525J042j29q38J479j524R16N4r81J538j478P86
1156A52K28j121J559j370O11L78j214J568j254M17N64j313J527j101K35P16j358
$$ plain form
1039 -1373 870 -24 -818 1355 -1297 718 163 -966 1403 -1226 577 321 -1069 1379 -1086 406
1055 406 472 -1112 1322 -935 184 624 -1172 1214 -777 6 746 -1171 1121 -611 -171 843 -1169
1072 -1169 994 -409 -306 897 -1133 881 -278 -432 949 -1093 755 -143 -565 1022 -1059 651
1088 651 7 -658 1049 -1001 561 140 -740 1084 -933 428 243 -839 1089 -859 324 369 -916
1105 -916 1060 -791 188 473 -960 1036 -674 53 590 -975 952 -532 -77 673 -979 859 -406
1122 -406 -231 735 -953 726 -264 -348 763 -899 631 -136 -431 793 -846 540 -11 -485 833
1139 833 -772 430 89 -567 812 -713 329 200 -638 841 -683 233 287 -694 844 -634 152
1156 152 380 -741 818 -552 59 437 -777 791 -463 -46 518 -795 732 -369 -134 582 -776
1173g76J452r49N8Q34j374J330p19j72R91j399J207n06l56J052j321J050l61m81
1191d40J102j261R02j62o48J147j188P49Np53J181j135O31J54q47J200j067M83
1209E3K83r32J204r78L54M04r89J180q90K41N17j072J169p83R3O42j119J116o33
1228a40q5P44j099J018n02k17Q19j076Q85l29l48Q86j050P62j97m54R10r85O30
1247A72l1n40Q92q89M90R2o35R27q29L89J97o77R07p51K91K90p56R03o78J74M02
1268C40q06Q83o12R8M79q62Q82n27j8N42q53Q15m43j24O30q56P22l27k26O76q28
1289d15O50j94l29P13q13N57q9m02P39p48M40M5m92P34o60L23J52n49P12o22K56
1310HK30n80O98n22J13L15o06O49m34O1L38o03O42m00j5M12o59O24l23r9M69o65
$$ plain form
1173 -776 676 -273 -215 619 -755 575 -144 -316 675 -724 483 -23 -379 673 -648 402 41 -440
1191 -440 662 -599 303 141 -507 640 -548 201 206 -547 634 -501 130 284 -563 637 -430 53
1209 53 336 -596 608 -370 -16 388 -601 579 -311 -70 447 -625 544 -239 -146 496 -623 493 -140
1228 -140 -225 519 -580 438 -64 -281 538 -538 347 18 -330 556 -494 268 71 -383 527 -458 172
1247 172 141 -399 493 -396 94 186 -449 478 -351 38 235 -442 465 -286 5 295 -461 442 -236 -62 340
1268 340 -466 417 -195 -97 382 -480 402 -125 -143 399 -454 361 -82 -206 424 -432 290 -37 -263 413 -415
1289 -415 235 41 -288 425 -388 169 80 -322 417 -331 109 154 -338 396 -264 59 211 -338 374 -248 8
1310 8 238 -342 356 -166 -53 262 -344 305 -129 -68 270 -333 309 -91 -106 306 -353 271 -52 -151 318 -347
1332c47N79k44j89N45o82N35j84k40N60o46M77j03l07N78o06M13l1l74N83n34
1352b17K87P7m02N63n11K14J62m51N75m53J45K12m72N10l66P7K72n03N00l15P
1373h9L17m95M80k82n4L68m94M32k10j22M13n35M30j58j65M21n21L90r7k04M59
1394B84n02L46o6k68M59m57K84K7l32M91m45K29Q3l38M36l71J39J47l69M27l22
1415a18R4J87l93M25k77J6K34m00L97k06n4K80m08L64j67q0L05m08L38r9j52L26
1437B04l84L01j00j60L62l92K62l5j96L50l74K25K9k45L70l65K08K9k65L59l16
1458a33J52R1l00L72k78R5J07l00L48k32L1J82l20L19j91kK01l05L03j62n6K11
1480A33l03K92j13j19K72l12K24m7j29K66k90J99k6j73L11k98J80mj98K93k78
$$ plain form
1332 -347 232 -12 -201 344 -338 197 13 -227 333 -313 164 61 -246 332 -274 139 108 -266 317 -217
1352 -217 70 147 -255 308 -203 11 173 -278 297 -156 -11 201 -271 239 -127 -50 222 -281 219 -96 -89
1373 -89 228 -267 213 -69 -123 245 -249 183 -27 -149 264 -271 159 1 -164 257 -264 126 29 -175 284
1394 284 -218 128 62 -206 253 -204 80 107 -225 266 -179 50 133 -205 231 -140 -1 146 -223 204 -118
1415 -118 -24 163 -230 195 -82 -66 168 -232 165 -41 -95 185 -223 141 -26 -106 199 -209 129 30 -122 204
1437 204 -180 121 21 -139 223 -169 93 58 -138 212 -162 63 92 -153 217 -148 60 89 -176 183 -133
1458 -133 19 110 -190 182 -96 -1 106 -194 154 -78 -47 135 -185 134 -57 -59 142 -163 140 -22 -78 133
1480 133 -170 122 9 -110 162 -150 74 27 -102 164 -126 73 47 -126 185 -113 67 63 -135 158 -120
1501a20J50K8j94K99k80J30N4k31L13k39P6R4k43L05j88L5J24k59K74j82J6J51
1523A13k28K30j37m6J98k53J94o9p5J92k26J72n1r3K02k50J75j5j32K21k27J58
1545E3j8j32K18k17J13L8j61K05j57M7Q7k07K45j77N9R2k26K39j58L0J13k14K47
1568A19j57J3J35k06J97j30k9J76k29K08j03o0J87k34J77o7p1J84j90J16k2q5
1590g1J57j78J25Oj00J65j71Q2M3j44J99j64N0N3j37J94j59K6R1j62J86j13nJ07
1614H0j64J82j23J2J13j79J64r5lJ02j59J55q7l7J21j61J27l4m5J16j76J47o4
1637hm1J27j37Q0j0q1J48j35Q9nr7J36j00N5K4j04J28j19M7M8j16J34q8K1O1j26
1663f9J30p3JQ7j29J28r4j6R2j23J12n8j6R3j23J02o6j8J01j23R4k1n8J10j21
$$ plain form
1501 -120 30 58 -136 163 -117 13 67 -164 149 -90 -14 80 -163 142 -46 -11 113 -146 128 -54 -38 113
1523 113 -115 115 -22 -68 130 -123 71 2 -73 119 -107 65 14 -79 123 -127 48 33 -99 122 -105 53
1545 53 35 -97 121 -96 17 55 -106 99 -58 -11 76 -131 114 -63 -4 88 -138 101 -57 -27 86 -128 119
1568 119 -38 -25 110 -96 101 -29 -58 118 -111 97 -6 -66 121 -113 64 -3 -74 110 -80 36 14 -71
1590 -71 86 -92 33 39 -61 104 -67 15 58 -86 113 -51 -1 52 -85 109 -50 -24 67 -95 91 -22 -27 80
1614 80 -84 98 -25 -13 100 -79 85 -10 -13 89 -70 85 -2 -39 82 -79 48 14 -31 85 -91 56 -8
1637 -8 -49 78 -59 21 11 -70 78 -57 32 27 -70 66 -34 21 45 -59 69 -50 -3 45 -71 63 -25 -4 57 -69
1663 -69 61 -12 -11 76 -53 75 -19 -35 57 -66 46 -12 -28 65 -58 44 -22 -40 61 -62 32 11 -47 63 -58
1688e8J06l0o6J22j32Q0j0o0J15j01M8J5p3J09j04M3L3o3Q4j12L7P1r4J09q6J0
1714gN5j09J12o5kP8j18J02n7j0R1j29R5m5j7Q3j05O9j7n2R0q1O6j7m0R3r1P8
1742E0k0q0R6p0M8Jn1Q4p9L3L0q2R3p2M1J0r1J15q1K4M6q7P1m3oP4j04J03p3n
1772b5N4r9J03k3l4N0m9M5k4j7P3q7N0j0l3N4p1P2k0k9P2q4M5Mo3Q3o5M8j6k8
1802b4P0o1J2K5n8O7o6M1J1n6Q0m3rN2p4M1rjL3n4M7l7K0K5n3N6m2j3N1n1L2J1
1834B3j8M1p0M6mm0M4k6M8l1l1M3o2M2Mk9L4m4K5K2k6M0m4K7J3o3O1l4PL2o9N6
1866A7k2jJ8k7M8m5pN0o0L2%kM2n1L3k0J7J2m8K2J4k8K8l9J6K1l0O6o0mKk7N2
1899A9l6J6Rl0M9n3L7Jm3N6l6J8L3o1M2k1j3L6l0L0m0K3J0k4K0Jk8M5k8J4j0r
$$ plain form
1688 -58 48 18 -48 74 -58 22 12 -48 67 -34 14 29 -44 65 -39 4 37 -26 58 -54 -17 54 -40 69 -17 -7
1714 -7 48 -61 51 -14 -16 62 -56 46 -11 -21 70 -59 36 -9 -26 57 -48 21 4 -48 42 -39 27 10 -30 63 -28 50
1742 50 30 -50 46 -24 24 25 -26 58 -21 12 42 -40 53 -19 22 32 -59 56 -25 -1 45 -42 29 -14 -20 54 -50 53 -20 -25
1772 -25 29 -70 33 10 -24 26 -23 22 -2 -19 54 -33 17 7 -26 28 -43 29 9 -20 52 -32 13 17 -46 37 -28 20 4 -24
1802 -24 46 -15 -3 22 -36 31 -35 6 17 -39 41 -2 -11 41 -33 8 -1 -2 31 -23 24 -13 7 32 -21 35 -7 -20 31 -20 12 23
1834 23 5 46 -24 22 18 -22 22 -4 44 13 -18 25 -37 5 9 -20 14 -30 -5 17 -9 31 -13 14 27 -36 25 -9 -2 30 -39 17
1866 17 -5 -6 12 -15 33 -12 -19 31 -29 3 3 1 43 -8 25 5 22 34 -14 8 22 -6 22 -17 -1 20 -10 56 -4 -8 -6 -33 19
1899 19 -17 -1 8 -22 27 -26 11 12 -31 25 -11 7 40 -21 21 0 -13 23 -7 23 -17 6 16 -8 12 13 -15 30 2 16 6 -3
1931cL5m6L2l0j6M4l1J3jnL0l9L7k6kJ4k0OJ2k3L3l1K2lj4L9l7J0K4l1L6k3j7
1964a1K2k4K4oNKj9L0l6J9K0l4L5ol6L0l7L3Pl0K6j8Plj0J2j6J9j7PJ8pJrMK9
2000C1l2RNl0L1njJ5m7M7k6J4J4j2ok0KK4k5J0pqL9m1L1rrK3l2J5Qj9J6j2J1N
2036Ij2%J1lMOj1k0L4lk2L5l1J3J0k7K9k3J1Lk4J5J3k8J1MQoj9J6k0K2j0kJj2
2072a8K3j6%J0k0K9ooK2l0K3j5J3ll7N3k4J2Mj6j0J6%LmK8k7NjJjknJ8k4J2%k6
2110a9K7j5oJ5kkpkK1k4J6J1Lj9j5K8j4nK7k4K0j5k0N0l5K5j5%J8j6MnJ1%j7K9
2146B8k3MJk3K2J0k5J4k6LL3k4J1j0nJ1k4K6mj2J3j0LKnJ4OJ2qmJ2k0Qj2JJ0n
2183DQj4jJ8j5kJ5j3J3j9J6kk1K7j5j1K5j1KKjkk0K3r%r%K3k6L1rJ2j4rj7J6k
$$ plain form
1931 -3 32 -14 18 -12 -28 16 -15 -2 -3 -8 22 -17 20 -6 -8 6 -14 -8 4 -19 14 -17 5 2 -12 27 -10 0 24 -7 29 6 -11
1964 -11 11 -13 11 5 10 12 -7 23 -13 6 26 -8 27 21 -15 15 -22 11 18 -12 14 -4 3 0 -10 2 -14 5 -12 -5 13 6 7 -2 2 31
2000 31 -1 8 13 -17 14 9 8 23 -24 23 -3 11 25 13 7 -13 -11 13 -12 -2 -9 -17 22 -19 12 3 -6 17 -15 0 8 -11 5 -7 4 9
2036 9 -3 -3 8 5 9 15 4 -16 18 15 -7 28 -3 10 20 -7 22 -1 10 13 -11 4 17 -11 0 4 12 6 -13 3 -17 5 -5 -7 -6 -18
2072 -18 5 -11 -11 -1 -21 8 2 -4 18 -12 11 -4 9 6 -31 22 -2 10 14 -2 -12 4 4 7 3 31 4 9 8 9 8 6 1 19 -5 7 7 -19
2110 -19 8 -7 -13 2 0 -2 -9 -11 10 -14 2 13 16 -3 -18 10 -4 -9 18 -6 14 -1 -21 29 -6 19 4 4 22 6 10 5 16 16 -1 28
2146 28 5 9 10 -13 9 19 -6 8 -18 -15 18 -6 5 -5 -10 1 -23 3 -1 -13 0 -10 -7 -5 -10 4 10 22 14 10 22 2 10 -2 -1 9 4
2183 4 12 -2 -3 15 0 -2 13 0 13 -6 10 8 -13 14 -1 -12 13 2 4 6 5 3 -17 6 -3 -3 -12 -12 11 -15 16 7 19 5 -4 -21 -5 -7
2221gK1rmK7k7J6j2J0OponLQj9%Q%lj0K0mloj1K2Lk8J0J1j2nj4J2OK6j6nJ2ml
2262AJ5ppnJ3qj3K3kj8K1rPMj4J3k8J9opqJOJ7rJ9Om2K2j1LMMj8KkPJ0koLOJ8
2305B2qk0J4pJ2rj6K6qj1PL%pjJ6mj1J3j3J6lQj9lJ3j8K2qk0J4Nqj4oK7k1K2J
2344FPok1L3k0PMj5K7k6jJ5NJ%NJ6k8NKj7J4%pK%Lj1RLmpj1J2pj5JK3k8K1KJ1
2386A0mj5jK4Qk5J1Nj5QMrJ6j4J2Jj6KQqJ8j6K0j4j8J8Omj2KLRk8LJ6j3Nj0J0
2425cqpK2J3pko%nJ1mJ6qRj8j1L2oqj4rJ5J6j7llLPj1k2K8Qj2K1k8J6Nj9J6Kl
2466FnOj1J3j2oJ2j9K0j2NJ9j8J6k1QnQJ1j4LJ5kmNk4K9mj4J0k0J4j1JJ2j9Nk5
2504b8M5qolJ1j7rK6j0j0lmJ3rJ4J1j9RjpkMj7K8j8Qj0LJ1J1kMj1jj5%J2Nj2J1
$$ plain form
2221 -7 14 5 1 28 1 17 5 15 21 14 8 3 6 14 -5 -5 3 3 0 -10 10 6 3 -3 -14 8 11 -17 -7 4 -8 -13 -27 -15 -9 17 1 -4 8 4 1
2262 1 16 9 2 -3 10 2 -11 12 10 -8 13 4 11 15 1 14 -14 5 -1 -8 -16 -15 -9 8 -1 18 24 -18 4 -7 -4 0 4 -14 -12 -14 -7 3 1 -5 -2 4 22
2305 22 14 -6 8 1 13 4 -12 14 6 -5 2 5 5 -2 -3 13 9 -2 11 -2 14 11 19 0 -3 10 -8 14 6 -14 0 5 -3 -17 -23 4 -17 5 6
2344 6 13 7 -14 19 -1 6 10 -5 22 -4 -5 10 15 16 16 21 37 9 14 16 -1 13 13 6 8 8 11 0 9 12 8 1 -10 2 -5 -20 -19 4 -24 -3 -1 10
2386 10 6 -9 -10 14 22 -3 8 13 -2 6 10 1 17 3 15 16 0 2 10 2 20 4 24 10 -8 10 16 12 0 2 5 14 -14 -11 5 -8 -3 -13 -3
2425 -3 -11 -18 4 17 10 8 2 2 -3 8 4 20 12 21 3 -8 24 18 10 -4 -13 2 18 1 -2 -5 -2 5 -6 -28 0 8 -4 17 -11 5 10 -9 7 9 6
2466 6 1 7 -4 9 -3 -9 3 -16 4 -8 -3 16 -2 14 -7 1 -4 4 15 1 4 19 17 13 18 -6 23 19 5 15 -5 9 -2 -1 11 -8 -3 -28
2504 -28 17 9 3 0 11 -6 -15 11 1 -9 -12 -16 -3 -12 2 13 -6 3 2 -5 -7 -3 -20 8 -10 -2 -12 -9 2 13 11 15 4 3 -12 -12 0 5 -7 4
2544DnrP%J1j2Qj8K6k0Pj1J6J0k9K2Kj2lKMK3j4rJKj4PQRoJ0j0jRj0KjMjj0Rj1
2587cJ3j5j3J1J4j9K5k1MKKJ1qknJ1J4j5j7J4N%j1K5mk0Pj4QmJ3nMRj7Jj2J6N
2626Ij7mJ4j6L2kj8Lj8NOlPrmJ9jpJLnNmJmLj6K7lkJ2%jj2lmJ2Kj7J8j0KKQk1
2671a0kJJ5rLMLj4MLJ0kj9RJ2Nl3J7J9j9OJQrrPJ5j1lkJ1kOnkMJ2pj4Lk6J9mP
2715BJ1k3J1kKNj0KJlK2l5QPJ4j3k6L1Qj4J2j9QpQMlOL%Olj9NkQnMmQOl1K7%m
2760FOk4RK7j4j2j6L6k0%J5k5POjqJ5j2jmK5k7OJ3qk%K2k6J0oJ0Pl2J8K6j7j3
2798dOK3k7J7j7oJ0KoPk0K6op%Qk3nJ9nJ2oQ%oJ9j3m%NRj8QPkOMrj5QPqOOrj0
2844cJ1J0q%Olj0Kj5J6j0j6NLj6M5j9j7J5nM%L2k8J2Oj2k1K2Kq%j2K4pkOOj3J1
$$ plain form
2544 4 -1 -10 -3 -3 8 -4 4 -14 12 -8 -1 -12 4 14 -15 7 9 -3 -6 -4 0 23 9 0 1 3 -11 -4 4 13 7 17 7 6 15 5 7 6 10 9 -1 8 -3
2587 -3 10 -5 -18 -7 7 -12 13 -8 -4 -2 0 11 3 1 -4 7 21 6 -11 3 8 8 -3 22 18 -2 5 -9 -1 -5 8 3 7 16 -1 0 -12 4 9
2626 9 -8 -12 2 -14 18 16 -2 1 -17 -12 -6 -9 -2 -11 -15 4 3 -4 -3 0 -5 0 -4 -3 -7 -4 -20 7 4 2 14 14 13 1 -2 -6 6 8 -9 9 -1 1 3 11 -10
2671 -10 -12 -11 4 -5 -2 2 5 -9 -5 -2 8 6 -13 -4 8 13 -20 -3 16 -3 3 4 12 3 -6 1 16 5 2 0 11 9 15 10 8 12 24 17 3 6 -20 -1 -5 2
2715 2 13 -10 1 -1 1 6 -4 -2 -1 -4 18 -17 -9 -2 12 -1 -27 4 12 -2 10 -9 -1 -8 0 4 1 7 10 10 16 13 -6 -1 -3 5 0 4 0 8 14 -17 10 10 6
2760 6 12 -12 -3 24 10 -2 -18 18 -2 -2 13 -12 -5 1 0 -8 7 -5 -6 -10 15 -12 -6 7 -1 -3 -3 19 -7 3 -3 7 14 -18 0 26 9 -4
2798 -4 2 25 -2 15 -2 -8 2 4 -2 5 -15 11 5 -2 -2 6 -17 -22 -3 -8 4 -2 6 6 0 19 6 2 2 7 16 -2 6 13 11 17 21 12 -3 5 12 4 10 16 7 -3
2844 -3 8 18 10 10 16 13 3 5 -10 6 -4 -20 -15 -12 -28 17 -2 -19 -4 -9 -5 -5 27 -1 11 17 5 -16 6 8 0 0 -12 12 5 3 9 15 2 13
2884A3j0j6J8j1jmJ1LJ4k3J9%j4JqJ8j1ljJ3l3J4%J1j3KMMj6JJ5j1K4j4PjPj5
2922fLRJrQj1Mj1J3J1k7J8k1J0J5nJ0qj9PLOmr%Qj0J6j2J4j6nOQLj5J8nj0J8%
2963FmrK1omN%Qk0pPj0J3NrNnK2k3lJ0nLk7J3MOnn%J9r%J3j2rK5k7K2k0K2Oj6
3006@QKk1OJ7mqOj0PJJ7k2J4Lj7Lr%J5j5LkrJ2Nj2Kj5J0MOJ6l2M0l7K3j8J4nN
3047CJ7rj2j2J2JPkj7K0Oj9%J4k0J2Pj7JJ4rK4l0J6ql2K2RJ2k3J5j1mj6J6J3k
3084bOKOj0NlJ9k1oL2j7Rpj4J0J1j5Jj2mLQjpK5nk6K6j1j1mJ8k4J0Q%JlMj5K1
3125Gj7jPPj3kkkNK2j0K0k9OmJ7j1j3K2LkLj3kRlpmRj7J0j5K1qlrJQMpJ8mqPj3
3170a3LNoj2K6lj3K4j2QpJ4nMpjJJ3j6Oj3lMJ8%k4MnpJ9rlQJ2k7J2ooJ9ppJ1J
$$ plain form
2884 13 3 -13 5 -6 -7 -11 0 3 17 -6 13 13 -1 0 -8 10 -1 -4 -5 8 -25 -11 -11 0 -13 -11 -7 -3 -19 -18 -3 -14 10 -4 3 2 9 -6
2922 -6 -3 6 7 -2 6 -5 -1 -12 1 12 -15 3 -18 -8 7 2 12 4 -15 -8 -5 1 -3 -12 -12 -4 -14 2 -10 4 -12 -17 -11 -3 0 -15 3 -2 -12 6 6
2963 6 2 -7 14 8 4 9 9 17 -3 -10 -3 -13 0 5 -4 1 -4 18 -5 -8 2 -3 0 -27 -14 -10 -4 -9 -14 -14 5 -4 -4 9 -3 -12 13 -14 8 -12 10 16 0
3006 0 8 10 -11 -5 12 8 0 6 -4 3 4 21 -1 13 16 -1 2 -7 -7 8 -7 -4 -6 -15 -3 2 -10 -8 -23 -13 -9 -3 13 -19 21 -16 7 -11 3 -2 3
3047 3 20 11 -1 -13 -1 0 7 5 -12 8 14 -5 -5 9 -11 1 8 -9 -8 6 -3 21 -9 7 -1 -33 -11 -2 10 -13 2 -9 -13 -29 -13 0 -2
3084 -2 4 6 12 2 7 4 23 2 -4 28 11 20 13 -1 9 20 5 6 -6 -10 -7 1 0 -7 18 13 -13 13 2 -9 -13 5 -19 -9 -1 -1 0 -3 1 -14 7
3125 7 -10 -11 -4 3 -10 -12 -14 -16 -11 11 1 21 -8 -2 -6 11 0 -13 9 12 10 13 0 -2 7 4 -3 -7 2 -15 -5 -20 1 -7 -10 -19 -18 -10 -6 -13 5 1 -7 0 -13
3170 -13 -10 -5 -11 -23 3 0 -13 11 -1 7 0 14 9 13 6 5 6 19 3 9 -4 -7 -3 15 15 -9 -5 -10 -17 2 -7 -10 -2 10 -17 -5 -11 -17 2 -5 -12 -1 0
3213@oOmjnJ4JKk2K4j2MJ9j9KPPmlmJ0rjlONjj4J8k9J0mnJ0Rj9j9K7%%Jj6J6J
3257aKoJ0rJ0J5qk9K7j6JJQj1J3qoLoPJOj3onK3j8M%%J3j0kKQj7J8j8J9nLOmL
3301Ek5K1lqJ9opMLMmJ0qJ0j2rmJ5J7k1RokmJ2jj5j1K1j4K8k5mL%J0j6K9k3J2
3341DOj3KMMj0kQmK7k8ORjj6J1Kj7J4j8K0oJ0j3J1k2L1l0J1Pj8J2JlLQj4QrOn
3382dJnlK9k5j6K3rOJ8j1nKJ5j6NOl1L0nPmJj0LPJNk5QRJ1k9K1j5joMNjJ3j8Q
3425aNqMnKnKJ5k6J6Kj5RNQLj8J6Rpj3J2Q%k2J3%JOj6j5J6MJ3nk4K4k3LLoPOP
3469A0j8J4j7K2j3J5j2Nj3KK3ml%j7K1rPj5j0K9j1KNPrk1J3J6k0J2j5NmnnQoJ4
3508Cj5POJ2j5jJ9j4nJ8qj8OJ9j0j0J4J6k3NK%J5j1mrK1Ml0LJJ7k4J8j5j5L0o
$$ plain form
3213 0 -6 0 -4 -5 -10 4 5 7 -15 9 -3 1 20 1 3 10 17 13 10 6 16 7 6 3 9 14 13 -1 17 -12 -2 -6 -11 -1 8 -11 -30 -3 -3 -3 -2 -18 -2 -1
3257 -1 1 -5 5 -4 6 21 13 -16 11 -5 -4 -3 5 -6 7 -1 -7 -4 -10 -3 -2 4 -9 -15 -20 3 -15 -11 -11 -11 2 -8 -10 -8 0 -17 1 -17 2 -3 0 6 2 5
3301 5 -20 1 -2 -10 9 3 -4 0 3 7 3 13 5 15 3 -6 -10 5 22 1 10 4 2 -2 10 9 -6 -17 4 -10 18 -7 -11 -8 -8 2 -14 15 -8 4
3341 4 10 -3 -1 3 7 -3 -5 3 -1 26 -2 4 13 12 -4 7 9 -8 6 -12 8 2 12 -1 10 -12 19 -11 0 7 -11 1 2 -1 2 10 -4 4 -5 1 -4
3382 -4 -3 -8 -11 18 -7 -23 0 -9 -3 15 4 -1 1 16 0 5 11 -20 10 5 12 8 9 -1 2 9 10 15 -10 -2 7 18 -11 10 -5 -6 -12 -8 -3 -4 9 -9 -1
3425 -1 4 -4 0 -5 -3 -8 -6 9 -17 -1 1 -14 -5 0 8 11 -7 9 18 11 -2 10 18 18 -4 9 9 10 16 0 -15 1 5 18 13 -11 13 -10 -7 -4 -10 -3 3 10
3469 10 -8 6 -11 11 -2 13 1 6 -7 -5 18 14 11 11 -6 15 6 13 -2 -12 17 6 8 13 20 11 -10 3 19 -1 11 -4 1 -3 -8 -13 -5 -11 3
3508 3 -12 -5 1 13 -2 -3 16 2 -3 15 7 -11 -5 14 4 -6 8 24 1 6 8 8 23 12 8 -1 20 24 -6 -3 -2 15 -9 9 -6 -21 9 3
3546CkPkJ0k3Lnj0K6j0Pnj3K6j3jmONKPj8J8j1QPnjj3L2l5kJ3j0OnK0j4rJ1J6
3587B2l0L1rLj1k%Mp%j4J7J2j3nmnNK0j0kj6J8%rK3j0j4J1J4lqJ2prLKJ3k3j1
3627a2J7%j1L1k5J8pk4J2JoJK5j9LJ4k1QoNQLKk0J6MNj3j7K1Rj8%OLPj5pJ2ln
3668BK0j5QNj3qK4k1pj3L6j2j7QOmMj0JK7qj0rJ5Oj8RoJ5k4J4OJ1k0rR%%Kj3J
3709hL5k0Kmj1nJ1j3J4JkNJ2k2RKoKNjnJ2qn%MmJ4j8K2qjNj5nK0j0KKqJ5k1QO
3753HJ7k8j6K3j0K1j5kJ1lJ9j4Nj5Rrj2J9j9J7j8J4%OkKqOjj5K2qMNql%nK3%j9
3794Aj4J1J1j0MJ3nRk0jRpJ6k5JJJ2%j2J0k6J1J6j4J3Q%k2J5nJkJ6k1J1KlPk1
3833a0K3j4%OJ3k0K0k3MJ7j8%J2rJ3jj7J8jk4OOMj1PR%lj5J5KoJ2j8J0%J3k1%
$$ plain form
3546 3 1 8 6 16 -7 -4 -9 -19 7 -3 4 -1 -14 12 -1 -2 -6 0 5 7 14 -4 14 3 11 18 13 12 -1 31 -4 -6 7 -3 3 -2 18 4 -5 6 22
3587 22 -8 23 14 17 6 4 4 8 1 1 -13 4 16 3 -2 -6 -11 -6 14 4 2 -14 4 4 -5 18 8 -6 5 19 16 8 20 13 4 7 9 22 -1 -12
3627 -12 5 5 -6 25 0 18 11 -13 -1 0 -6 -5 20 1 4 18 -3 5 -1 4 12 15 17 -3 13 17 22 9 -8 13 22 4 4 10 13 20 5 -2 10 7 2
3668 2 22 7 15 20 7 -1 23 2 -5 -18 18 6 -11 -3 3 -1 3 -7 -6 21 13 3 -6 9 15 -3 6 0 15 -9 5 11 22 2 -7 2 2 2 4 -9 -8
3709 -8 27 7 9 5 -6 -11 0 -13 1 2 0 5 17 -5 4 6 0 2 7 6 1 13 5 0 0 4 0 14 -4 18 10 9 14 -1 -6 14 4 6 8 0 15 -6 2 8
3753 8 25 -3 -19 4 -6 15 0 -2 9 6 25 11 16 1 10 1 -11 8 -11 6 -12 2 2 8 6 8 0 6 5 -10 12 4 8 13 5 2 2 -3 20 20 1
3794 1 -13 -2 9 -1 3 16 11 20 0 -1 8 1 17 -8 -7 -6 6 6 -6 4 -22 -11 5 -9 4 12 12 -10 5 0 1 -1 15 -6 5 7 4 11 -10
3833 -10 13 -1 -1 5 18 -2 18 -5 -1 16 -2 -2 10 1 14 13 -4 14 13 -11 -5 1 5 -6 1 10 10 7 -8 7 9 3 15 -3 7 7 20 -1 -1
3872aPoJ2NmlNPj3l%K0l0%J5j2k3K7LoJ0lOj6K0j3J2j5LqLLNk4J8jk0K7rj4J7
3913AJ0qJ8pj5PMoNJ0k1mJ8pK1k6kJ7OmoOj7JrJ0j0OJqLJ1K0k5J1lQNj1j1J7J
3955A7k3K0j5jK4k4J5Lj3K6j3mj7joLJ6J4k4lJ7j2Qnj7K3NomMlN%k0J4qpPJ3k9
3995b1L2j2KJ0pQjj4K0qpRjnJ6j6Kj1NljJ1j6J1J7k0%J4omjnj3K1onQ%j2J5k%
4037Dj7J1rqJ7qK2k6QRMlkNnjj6J8qK4k3J2oJj8J3RJ4j6j7J5Jmj4NJ8j0mqJ6r
4078fJ2LqlK3j2plOOjjkqJ7Jk8K4j0kK0k4J9k2J3qPJ0j6KJ9jl1J6Mj0j3Qk%J3
4119EllQk1J1pJ1llllJ0J1ljmjJ4k3J2nOOrQmK1k3moJ4OopJ3rKj3J5nrONOj8N
4165aJ6k6J8jj9K2jj4J1Lk0J%K4j7LMK6k4K0j3Knj3RoOkj0K1j9PJ2lk4J0NJ9j4
$$ plain form
3872 -1 6 0 12 17 13 10 15 22 9 6 6 26 -4 -4 11 -1 -24 3 6 0 10 7 13 -3 17 4 16 1 4 -4 -1 2 7 -17 1 0 -20 7 -2 -16 1
3913 1 11 3 21 14 -1 6 10 4 9 19 -2 -6 12 5 26 0 -2 15 21 17 11 17 0 1 -8 2 -8 -2 -1 -9 -6 5 25 0 11 8 16 21 10 -1 16 17
3955 17 -6 14 -1 -2 22 -2 13 16 3 29 16 12 -5 -6 -12 -9 7 21 -3 -6 11 -1 7 2 -15 8 13 7 3 7 4 9 9 -11 3 -5 -12 -5 8 -21
3995 -21 11 -1 1 11 4 12 11 -3 17 9 2 11 10 5 21 5 7 -4 1 -2 -3 8 -8 3 20 0 0 14 8 4 3 -2 -15 6 0 -5 3 3 -9 6 4 4
4037 4 -13 -2 -11 -19 -2 -10 12 -14 -6 3 7 4 2 7 2 1 -15 3 -5 19 -4 8 2 3 -15 -2 7 21 5 -12 3 4 0 -14 -9 9 -1 -5 -13 3 -6
4078 -6 6 9 1 -2 21 9 2 -1 5 11 10 9 7 -1 16 17 -11 13 3 1 21 -3 16 -6 7 -1 6 16 0 2 21 20 -11 5 9 -1 -14 -6 -8 -8 5
4119 5 2 -1 7 -14 -3 -10 1 -2 -5 -8 -11 -1 10 7 6 2 1 15 -8 4 -1 5 11 2 10 6 27 4 0 -6 8 14 8 1 14 5 7 -6 9 4 -5 1 6 12 -6 -1
4165 -1 15 -11 7 6 -13 9 8 -6 5 8 -12 -11 -11 13 -4 -1 3 29 5 25 12 14 9 -4 5 -1 5 3 -7 14 -5 2 14 11 -13 -3 2 21 7
4204Gk1J1oJ4j3J1j3%K1j7rNQoMJ8JqPj7NoK0Pk1mJ3Ok5JL4k9nJ2m%J7k7J9ok
4245BJ1k8PJ0j9K3jj2lNj4J1KJ2lJ1j1J2j1J4j7MJ3k4K4lMj8jJ1j2j2R%Ok5L1
4282HrrK5mk0K1j5jJ5j5pNk0J4J8Kk7J4JqKJ6rMLJ0j2jOJ2Lk1J2Jj3OKj1MLjj
4324CkJ9j4J0k2Pj7J7mJ5j4j0J3J0pMj0QJ4j9J0rmJ2nlpJ4Kk2QJ3pkJ6j7qMkM
4364bJLJ1j8RRk5J8qkJ1qQj4PmJmNJ1j2Nj2j0K1Pj3JJ8JNk1lJ3J5k3k1K4o%J0
4405HLmk%joJ5j8OPJ1j6PJ1k2Mj1K6j6Jj5oL7j1rj0J5j3J8rJ9j4LJ0j7nJ8nRj3
4445EmrlJ8nJ3j1kJ4k9J4pJ0J0okjpJ2j1jj%J9j0j2jJ3KqjPOk9K1Nj7KJ3qK2M
4487B5k7J4j2jj4L1rMmqj4K2J3j8pKj1J3J7qJ1k1J0rj1K6j9K4k6KmLjJPj3P%J1
$$ plain form
4204 7 -14 -3 -9 5 -8 3 -10 -10 11 -6 -15 -10 -2 -8 -4 14 15 7 14 -3 2 -4 16 23 2 -2 11 17 -8 -7 27 -2 -7 5 1 1 18 -9 10 4 2
4245 2 13 -15 -8 2 -17 6 5 -7 -10 -5 -19 -8 -6 6 3 14 3 15 4 18 1 5 18 -6 18 15 19 1 0 11 -1 -13 -4 -4 2 -23 8
4282 8 -1 -10 15 11 -9 12 -3 -4 11 -4 -11 -6 -26 -12 6 8 -19 -5 -4 -12 -10 6 -3 1 4 14 2 1 7 19 22 1 13 14 1 7 9 -2 2 5 4 3
4324 3 1 20 6 16 -6 1 -16 1 -3 12 -2 -12 1 11 4 8 -2 6 20 1 11 2 -2 10 5 2 -5 9 11 -11 -3 10 3 1 17 0 -8 -4 -6 -2
4364 -2 -1 2 13 -5 4 13 -12 6 -2 -4 7 -1 7 -7 0 -4 -3 -7 -2 9 -3 2 -10 -20 1 8 -5 -4 14 15 20 -1 -4 9 24 1 -20 4 -2 -2 8
4405 8 11 7 5 5 4 -2 13 -5 1 8 19 3 10 21 -1 3 -8 18 2 3 -12 -18 19 8 -1 -11 4 -9 9 0 19 5 8 18 1 -4 14 9 18 5
4445 5 1 -8 -11 7 2 15 4 2 16 -13 1 -6 4 14 8 6 5 -2 10 -1 -2 -3 -3 16 6 -6 -7 6 8 0 -1 6 12 -17 4 9 -8 -6 7 -1 21 25
4487 25 -2 12 0 -1 -15 16 7 11 7 -1 -15 7 20 2 -5 -3 -14 -1 16 8 19 -2 8 -1 -12 14 -5 19 -7 -5 -9 -6 -7 -6 1 -12 -5 -5 6
4526Fj3L4k0K1j6%KpjJ6l8J2J1pPJj3K0k4jPPl0PK1j1nJ7j5QOj2K7j5Rj4Rj2J0
4565DpJ1oj9J8RpnNJ6j3LjqLrK7j6mNOkj8OmoJ5qK0k8JL3j5qrJ2JNkJ2k0J1rL
4609Bj1oJ3lJ8qk%k%j9K1J0j0RNl5K8jrJ5j4mJ1JqooRNlOk0J9%j3Rk0L5pj4MK3
4652B2k3RoJ4k4RJ7J4k2k5K9rJ1lk0K3k9J3%K0k4lNLnm%ojQj2J4j3J2nJ5j1Q%
4691Aj6K1qMj3jK0Pj3J5Kk3K0j1pMKN%Mj1Rj3MNJ6k6KPj1PjK1k1j0K0j2MMO%j0
4733CJ7qoj3J0pJ1jjj0LNQp%mj5J1J6J%qQj2K4rjk3KoNMmJ4jPl0RlJ3mj2RPMj0
4779dMPQj6qK5k3kQJ9nPj8J3qJ7l3K0%nkjrQ%q%L%rJ7k2J1pMj7J1J2lK0jrJ2p
4823Ik0RJOj3J6J0j3jMj1%J7j2MK0j3pj3kK6j5RnmJOPjj7RmqJ5j3lJ6%j4mOo%
$$ plain form
4526 6 -7 27 7 28 12 12 14 7 6 22 -16 -4 7 0 7 8 -5 15 -9 -10 -3 4 -26 -19 2 -9 -14 3 -12 -4 2 -10 17 2 11 -3 6 -6 4
4565 4 -3 8 2 -17 1 10 3 -2 3 19 6 9 8 0 3 -6 21 5 1 6 12 10 -8 -2 -6 -12 3 -5 15 -13 -12 21 6 -2 -11 1 2 7 5 17 -3 8 -1 2
4609 2 -9 -15 -2 -5 13 5 3 3 1 1 -18 3 13 3 12 17 -18 10 9 0 15 1 -3 8 9 1 -5 -11 -2 3 0 6 -14 5 5 -8 1 -19 16 9 -5 -1 22
4652 22 -1 8 2 16 -8 1 18 32 10 -15 14 5 16 13 -7 16 -13 0 0 20 -4 -7 -2 1 -4 -8 -8 -14 -15 -7 -19 -5 -18 -6 -11 4 -7 1 1
4691 1 -15 6 -2 2 -11 -12 8 15 2 17 19 -4 16 5 -2 2 4 9 9 13 2 11 -2 2 7 23 -3 -1 6 -5 2 1 22 1 -9 11 -1 3 7 13 13 3
4733 3 20 12 6 -7 3 -4 7 6 5 -5 -2 3 11 4 4 0 -15 -4 12 13 13 5 13 1 25 16 15 -8 -6 -12 -7 -3 -7 7 6 13 -17 -8 -11 2 -2 -14 -5 2 6 -4
4779 -4 0 7 15 -1 -9 16 -7 -9 -1 18 13 20 2 15 7 24 -9 11 11 6 4 3 -6 2 2 -6 -6 -3 -3 -12 5 -17 -6 -13 -9 -26 -15 -3 -6 14 13 4 16 9
4823 9 -11 -2 -1 5 -8 8 18 5 4 8 -3 -3 14 2 6 26 13 6 -7 -9 17 2 11 6 2 3 9 16 15 -2 7 3 -5 10 -3 -6 10 10 -4 -8 -2 -8 -8
4866hK6k0%mJ0JJ1k0NMQj7K6lk0J6j0qJkM%J3j7NrQkPjj0J8j4jopJ5j5MJ4j6L5
4908B1k3POm0L7J1k5LJ2j0%K3omnlQnNj2pMoMJ7k3J0MolKkNP%rqNQPNj5pj4jK9
4954Fj5j1K1L%rK1j7K1j8mK1J0l1j5K9oQk%Mk4j6K2j1J2Oj6nK2qJOj4NjQj2J1
4993B%lPk0LK3k0QJ7rnoj0QQJ0k3L4qlk1K0jjMkj9JKJ2qKj0J6qrOj4J5k0J2LM
5036cp%J2Oj2jjQOrJ5qMMqOLpoPj6%J4J9l0Pj1J6k2RkpJ5j4jJ5%pj7J7j0J3PQ
5080A2l3J5KJ1j9J5j0JJMJ1Nlnj6J6j9K8j1j2J9k3L5j4kj2J8k9J8jj5J6j6JQL
5116aJj0J8j5J1LLmk1jPK3pMMj3J6j6jJqJJ5OpQk6J0mpPJ0lklPj7J8j0k0J4PJ
5159amn%L2j5k4MjKK9jmk2K0J0j5J0j8K3k6J2j3J8oJ5k3%JMJ1Pj8NJ5k2Kk9L1
$$ plain form
4866 -8 18 -2 -2 -6 4 5 16 -4 1 5 13 -4 22 19 -1 15 5 -3 -2 -4 0 0 13 -4 1 -8 0 -2 5 4 -6 12 -2 -3 -9 -16 -1 -16 -12 2 -14 21
4908 21 -2 5 11 -29 8 19 -6 -3 9 -1 -1 22 16 12 7 4 12 7 12 0 -7 -3 -9 -5 12 -11 -1 3 -3 -6 -4 -6 -1 6 6 -3 -11 -6 2 9 14 -1 -8 -22 -23 6
4954 6 -9 -20 1 4 4 -5 16 -1 20 2 -2 19 29 -2 -17 12 6 14 12 12 16 -8 -24 -2 -13 -1 5 -11 -16 6 -2 -1 5 -9 -4 -5 3 -9 2
4993 2 2 -1 6 -14 -11 12 -8 0 17 8 3 -3 -13 -5 3 13 -10 24 16 13 -8 12 11 10 14 12 -7 -6 -4 8 0 2 -8 8 0 -9 -3 -17 -2 -22 -10 -7 -3
5036 -3 -10 -10 2 8 -4 -5 -6 2 8 -1 14 6 10 14 6 12 15 8 2 9 -7 -7 7 26 -4 3 -8 8 -14 -5 -7 -14 1 -13 -14 1 1 -6 -23 -6 -16 -3 4 12
5080 12 -21 -6 -4 7 -12 3 -7 -6 -5 -1 10 15 12 7 -9 7 -12 16 5 -7 12 -11 24 10 8 -4 14 -15 3 2 -13 3 -13 -12 -4 -1
5116 -1 0 -10 8 -7 4 7 10 6 -15 -16 -9 14 7 11 15 2 18 2 1 2 -6 -5 10 16 9 17 -9 1 -3 -10 -3 7 4 2 -1 6 -11 7 -3 -23 -9 -2 -1
5159 -1 -5 -10 -10 22 7 -17 -13 -14 -12 17 16 12 -10 10 20 5 15 -3 20 -6 6 -7 11 5 20 -3 -3 -2 2 13 20 2 7 22 0 2 -27 4
5197Dl2K4KJ6k3J4nk%L%PlJ3j8Jj0Oj1nM2nj0j1J3p%k0M2k0Nj3J5Jj2LMNnpoK4
5239A9k2jQonJ3j4kRnj0J2K1j0J2%j1mOorRj3J5Oj8oL1j6j0J0lPj5OKNOk1kJ0
5280bNj0j3L6j3ppOrQ%lOj5J3J4j6oKrK1Lj6J9jJ5j7j5J0pJ9rnJ7Kpj5%PJ7j1
5321GLpJ6rrnQk3K3j0J1j0kLlJ9k4K1k4J8j0J8l0K4oQJ2j4%kJ1j7OqON%J1j5P
5361Ij5LJ0j0QLroOjJ2k2J3j1K3k6J2MNqOoopmK8%j4QoJ2olj1L8j6j1KoJ0j2J2
5403Hj2J2PkrOrPj0qlJ2q%Rj2J2j7J0J1NQj3MMnj8J2J9k4JPj8J8kQJ0j8j1JJ0
5444Bj3J0NjJ9l0K7l0J6j0MJj6K2j8ONoK1nk1JjQMj3J0J8j0rj0PKmQPKkPj9PJ
5486BnOjJ5j8nK4okLrLj0PMk2J6j1J2orLJJ0JjJj1PJj1j0J5QOj0K1k0J4j5mMn
$$ plain form
5197 4 -28 -4 -2 14 -9 5 0 -2 -2 1 1 8 5 18 0 1 -9 -3 -14 -19 23 18 8 -3 10 3 3 -17 25 5 10 -3 12 13 1 4 8 13 8 1 -5 19
5239 19 -3 -4 4 -2 -7 6 -8 -10 -1 -6 -16 -4 17 7 19 19 8 4 10 4 -5 4 -9 6 12 -6 -12 19 3 -7 3 0 7 -8 -2 0 5 11 -10 -12 -2
5280 -2 3 -7 -20 16 3 -4 -11 -5 -14 -6 -6 -9 -3 -18 -5 9 -7 -13 -11 -20 1 4 -12 7 6 21 4 -11 -1 -8 11 2 -3 14 16 9 -6 -6 1 18 7
5321 7 10 3 19 10 1 -4 4 -19 4 -6 5 -5 -7 -4 -7 12 -12 9 -15 3 -7 11 -19 5 -1 7 19 5 5 3 14 -3 3 -5 1 6 6 17 2 9
5361 9 -6 -3 7 -3 5 8 -1 -7 -1 -2 10 -12 1 -10 13 -13 -1 3 8 0 6 0 -6 -13 -17 11 11 -3 5 -1 11 5 2 -9 29 13 2 4 -2 8 -4 8
5403 8 -4 8 15 13 4 10 1 8 -2 -10 -13 -1 -9 -9 0 -12 0 -17 -7 4 9 17 4 8 12 7 -11 1 20 -4 -3 4 -14 4 2 10 20 2 -9 -8 2
5444 2 -11 -1 4 3 22 -8 19 -11 5 -5 -1 0 -16 6 -12 -6 -1 -7 14 9 -12 -11 -12 -4 0 -13 -3 15 5 -4 -14 -7 -5 -9 -1 6 8 6 13 -6 1 2
5486 2 -3 3 2 17 -1 -6 18 12 10 13 4 7 -3 4 8 -14 2 -9 3 -3 -12 -9 -8 2 3 2 3 -8 -1 0 -11 -21 -6 2 8 -2 19 -1 13 -2 -6 -2 -7
5529gKNnpJ1QrQlnl%J8oLj5oMJ0J4oMk2JlJ2MlJjkmJPLj8J3qJ4j1QpMPj3MmJ1
5577IKNj6J4j0nojK6j0k1%K2mJ1k4J3j2KoJ8%l2L3j3J4j5Qj1Pj3J7J0j0kkJ0r
5615aOQmj5J2j7K1j0j1J8j8K3Kj6lrJ5j4rJ5J0nJmQjpJ3Jk7J6NpLj0L8m3K2Kj
5655GNj1K1l3L6k3lrQJ1J9k6RLrJ5j2Qk1n%J1Kj1J7pj2J2jLJ0rj4K7j6J1rLjM
5695A0qMjoJ7k1j1L5j5KpJ5k9LNNJ6k1J7Nqj2K7k6mj0L2rJ8k5j2J8qJ1JqLj6J8
5734EqKNrK3qjLJJ0j5j1OK2j5j3J1%J3k8K1j0j1NJ4k2NK0j5J4j8J3KqOj4%pQK
5774bRPk7JK6qpPj1OJK1l5L2j3mKN%k0Rj4K1olJ4j9OK5l3J5jj3J1j3J8j8L0k3
5813dJJkK1j5Mnj2J8k0J9j5JNMkJ2j0oJMj0KK5j8J1kkQrrNj1qJ4pJ0JQjk0J2%
$$ plain form
5529 -7 -5 0 -5 -12 -1 7 -2 6 3 -2 -5 -5 13 7 10 -5 -11 -7 3 17 11 15 -7 -6 -9 3 7 4 5 4 2 -2 -1 6 9 -9 4 -4 10 -1 7 0 4 11 -2 2 -2 9
5577 9 11 16 0 14 4 -1 -7 -8 18 8 -13 -13 9 5 16 -8 5 -7 -5 -11 7 7 -25 8 -5 9 -6 2 -9 -2 -15 2 12 2 0 -2 8 -1
5615 -1 5 13 9 -6 6 -11 10 0 -11 7 -11 12 14 -2 -5 -14 1 -13 -22 -7 3 -2 -1 -5 3 2 -5 8 9 -18 -2 3 -4 -1 -11 27 -16 6 8 7
5655 7 12 1 22 -11 25 2 -1 -10 -2 9 28 2 11 14 5 20 8 16 -5 -10 -10 1 3 -8 9 2 -10 2 1 4 14 5 -9 18 2 13 4 7 6 10
5695 10 2 6 5 -1 16 -5 -16 19 4 6 -1 14 -15 -12 -7 -2 14 -7 10 15 7 -5 22 -4 -8 -18 14 5 23 -2 -14 4 -4 7 8 0 3 -13 5
5734 5 -3 -1 4 -5 18 10 9 12 13 23 8 -3 3 25 10 -3 8 8 21 -7 14 4 -7 -2 12 -10 -5 15 0 14 -4 9 11 3 9 -5 -5 -12 -4 -2
5774 -2 7 14 -13 -12 14 6 -1 6 -5 1 2 23 -12 20 7 3 5 10 10 -10 -1 -15 6 0 -3 11 -8 -2 23 -10 5 4 -9 2 -11 7 -11 19 -4
5813 -4 -3 -2 -4 17 2 6 1 -11 7 -13 6 -9 -8 -3 1 -1 11 1 -5 -4 0 -10 -8 17 -1 10 8 6 14 5 -4 1 -10 -18 -4 -11 -1 0 8 7 -13 -1 -1
5856aMPklJjKjj3J6j5J6%k0J0PLQj3j8K0JJ0k1J7LLqoJ8j8LJ6j2k6MQJ0j2J1j5
5897gJJJ0j7%K9j2j1J3j8L1k2lQj1L5k4jK5j8j0J0nJJ0jlj3MJ0l1J9Mqj2J3nj
5935iJ1OrloOmRj4RjlRlJ8j9R%pJ3k3NK9j5j3NJ3j4k2L1Qk8jOK1k6RJ4Ljpj1L
5978bj1J3jkj2J9j0J3Kj2J8j4oJj4jJ0nK7j8K1kj9KRjNLk5K4Kj0MjJ3j5Pj0Oj
6018GJ8l5J8j6K3j0koRMk1kQj0nJ4J0jk2K2o%J2k%j4K1j9QKrpK3%j8J5Rj6KJ5
6058A9Kl7K7j4RK2k0nj2J6kj0j5K4kJ2k2K1Jj3NjoK0l0kJ6Mj9J7j0J6RJj6kJJ3
6096A7k1J6KQj0pJ0k0J1J1qjJk1jNNJ3j3nJ1mLRpQm%rJrJ1oJ1MKppKj1J0JJ3k1
6140gJ9j3pNK4k1jJ9Lj5%ljj8K5pllJ3%k5K5k6J8J1j7lJ7r%PojJ0J7k0Mj6OQk
$$ plain form
5856 -1 3 10 8 5 6 5 7 6 -7 9 -6 10 10 -10 0 7 10 18 5 -13 7 8 18 -3 14 17 20 12 6 24 6 9 25 13 -13 -9 -1 9 -3 8 -7
5897 -7 -6 -5 5 -12 -12 17 5 -6 7 -11 20 -2 -5 3 -8 27 3 2 27 9 -1 9 4 5 15 14 11 -2 2 12 -19 0 4 -4 -16 -3 -8 -9
5935 -9 2 8 -1 -4 -10 -4 -8 1 -13 -4 -5 -8 1 -2 16 -3 6 6 -1 12 -11 -6 23 8 -5 0 13 -1 -23 8 16 -12 -13 -7 14 -12 -3 11 14 13 6 -5 -2
5978 -2 -13 0 -1 -3 -15 4 -6 7 9 -3 15 1 -5 -4 -18 -19 -9 -14 13 -5 16 14 -5 -3 6 5 10 13 -12 12 14 4 8 7 20 5 12 2 8 7
6018 7 25 -10 8 -8 15 5 3 -3 6 10 -11 -13 -5 -15 -20 -6 4 3 -19 3 -3 -3 9 7 7 -7 14 -5 3 5 -4 -11 12 12 -6 9 18 2 4 19
6058 19 21 -16 11 -3 6 28 8 3 -9 7 5 -5 -20 4 2 14 -8 13 14 1 6 5 -1 19 -11 -13 3 7 -12 5 -5 11 20 21 5 3 4 17
6096 17 -4 12 14 22 12 5 15 -5 6 17 9 8 9 -12 -13 -8 -3 10 -3 -8 3 -1 2 11 4 12 8 8 -1 0 -9 2 -4 7 11 13 6 -1 1 -10 0 1 14 -7
6140 -7 12 -1 -8 -3 21 0 -1 18 21 6 6 3 2 -16 9 2 -1 -4 9 9 -16 9 -17 1 12 -5 -8 9 0 0 7 1 0 10 27 7 11 -5 1 9 7
6181GQMk0j1J4kpJL0k1PNrJ2k0K1kj9mJ2J7k6oJ9ml2K1J3j3o%RMj3mJ0JPJ1Kj0
6222FRpqJJjPrLPk4L2Rk0KRl8J0K0lKj0MMj1j1J2jQj9J5lRk1NlJ0J2QJk8K3j0
6265BpK4rmlJ2k6J8mj7J3qJ3oLMrQjk1J1J6kljQrjkj1J0qK0k5J8JJ5j4Jj3lK1
6307A1Qk6J0oJ2oMjJ7k1J3j0QMl1L0k2knLQJ4j0Jk4RJ1MMj1lkRL%lKOJ1j0k2K
6349a1J3RpOqNnK%Pk1RJ1j1j1J8j5J4Mj6J3Kk3J9Lnkj2rJ8Rj6kJrJ3jPlJ7opl
6392coK7k6LJ0qK4j7j0J7k1K8qj2J7j0KMmOk4RJpQQj6J1j4j1L5j5kjJ8l3J8oP
6431aKoJ2kNkRk9K0mPk1J5kJ2j7lK5j7j1NN%lLj9%K4ojj2K5k5nJ2KRj5J7j8J7
6472Gk2J1RJ2j1JQl5M4m8K1nJ7%qK0j6P%nj2%jnJ9oj2j1J7j0RQj1j0K8k0J1J3
$$ plain form
6181 7 15 19 -1 -12 2 0 -7 -6 24 3 10 15 6 18 -2 19 17 -2 -6 6 23 -3 -9 10 6 -26 -5 8 -5 -11 -11 -2 2 -11 -15 -5 -4 3 14 16 6
6222 6 15 8 0 1 2 1 8 -1 2 9 -15 17 26 6 8 17 -21 -11 9 6 8 -2 2 6 -5 -16 -4 -5 3 -16 -1 -4 5 -16 -11 -14 -4 8 16 17 -11 12 2
6265 2 -5 19 10 6 3 15 -11 7 3 -14 -1 -9 4 -2 1 5 -4 4 3 -18 -7 9 7 4 3 11 2 1 -1 -12 -2 -10 10 -15 3 4 19 5 6 -7 -10 11
6307 11 19 -7 3 -3 9 3 7 6 23 2 15 5 13 17 -14 16 -6 -8 -13 -10 -2 12 2 3 -21 -12 -1 3 7 -4 -7 -9 0 3 3 0 2 8 19 9 -13 -11
6349 -11 2 11 4 10 2 7 2 4 4 11 -10 -1 10 -1 -12 6 -9 5 9 -7 6 8 -15 4 7 2 0 -12 -21 -3 6 -10 -12 -11 -20 -7 -8 -1 -4 13 7 0 -3
6392 -3 -9 18 -8 -5 5 -3 21 4 -6 11 -10 18 10 -2 15 5 7 11 7 13 -11 -2 -1 -8 0 8 -8 3 -11 -22 13 -2 -4 -5 13 -20 -2 -8 -1
6431 -1 1 -5 7 5 10 8 17 -12 8 4 11 -10 5 3 15 -2 -5 20 3 -8 -3 2 2 -1 2 -17 -17 7 1 0 -12 13 -12 -17 -5 -3 6 -9 8 -10 7
6472 7 -15 -4 5 17 6 7 15 -20 24 -24 -3 -8 9 9 1 21 5 12 12 7 -5 -5 -6 -11 8 2 -10 -21 -4 -14 -5 3 -8 -18 10 -10 1 14
6510A4j0Mk6J1rM%K5j6OrkJ2pOj7K1j4ROnLOqnJ0Loj1n%ONpljllJ9K%pJ2lnj7
6556a5K3%Rl3J5rLLPJ1k0kJ2j9J4mKQkJ0j4%jj2J9Rnj4oJ3Nl6K7PlNJk2OqMkn
6599a9J7kJ6k1J4rlJ4PLj3mJ0okJ4pj6Oj3K2Jj4KJ0k5L5j2Qj5Pkj6K3j8pNJ6n
6638AOj5klJ1j0j0J2Nj4K1jj6OK0pQmj9J3pPNRk1PKk2K4KJ4k2j6MPpRMonrJ4j5
6681b0L4k1K4j8rRj9J9pjkPJ0pOj5PO%mj3J7%NRnoqJoqPK6Ml3OnJ%Rj9J0KjlP
6727dQ%qrJ4k0J3lj1JL0Jk4J1pPj2J1JJj5QJ1pJOOJmj2Mj0mJ2KQj8QoJ0Jkj1J
6771a0LJ2j7nPJ3j1J1J%k2J8nK%J9Jk5j1J6%LNjJ0k1J2J5k7J6j6J2Jj1Jj0J1R
6809Fjj3j6J4K0j7j2K7j7K5k6K1j2j3J1J6j8J1prNJ0Rj1rNKnJ5Mk3OJ4Rk3J5j2
$$ plain form
6510 14 4 8 -18 -7 -16 -12 -12 13 -3 3 -6 -8 4 -3 3 -14 7 -7 2 8 3 6 12 4 -1 9 12 6 -5 -10 -10 -4 1 -6 -9 -10 -13 -16 3 5 5 -2 10 7 2 -15
6556 -15 8 8 17 -16 -1 -10 -7 -4 3 14 -6 -8 4 -15 -1 -5 -3 5 3 13 -1 -1 -2 -14 5 14 9 -5 -11 2 7 -29 -2 5 2 7 8 -14 -8 -16 -12 -14 -19
6599 -19 -2 -4 12 -9 5 -4 -7 7 14 17 4 0 10 4 2 16 9 -7 -1 -14 8 9 -5 -3 7 -18 17 5 13 -2 5 3 -13 10 -8 -15 -10 6 1
6638 1 7 -8 -10 -13 -2 -12 -22 -10 -5 -19 2 1 -15 -9 11 4 12 8 -11 2 -5 2 7 16 -5 2 4 -18 6 8 22 0 -16 -12 -5 -12 -3 1 -5 -10 -19 -5 -20
6681 -20 14 -7 17 -1 -10 -1 -20 -1 -8 -9 -11 -4 6 -1 5 -10 -3 3 3 -1 -14 3 3 8 17 12 6 -2 -1 -7 -15 -8 18 22 -11 -5 -10 -9 -9 0 -19 -9 -7 -8 -11 -4
6727 -4 4 4 -4 -13 1 -19 -6 -9 -20 -19 11 12 -12 -1 -8 -1 -13 -2 -1 0 -15 -7 4 -3 -2 4 10 11 7 -5 -1 -11 -15 -3 -1 7 -11 -3 -9 1 2 0 -11 -10
6771 -10 -7 5 -12 -17 -10 3 -8 3 4 4 -18 0 -5 -3 -3 16 17 -8 -19 -3 -3 0 5 4 14 -7 5 20 -7 9 -7 5 6 -5 -4 -14 -3 6
6809 6 5 -8 -24 -10 10 -7 -19 8 -9 16 -10 11 -1 -14 -3 13 -5 6 -1 -10 -5 5 14 3 -6 -1 1 -4 11 15 -8 -2 12 21 -2 13 1
6846AOOk4J2j0J1klj7K1km%Pj7J2m%OLj4K0k0L2j8PJ1j1Pj3JK1mk8J2j2J3lk6
6885b3K8Mpj2J1OkPKj8J3l0J2K0j4lJ1k8J1J2qqK7j5Rj4KnJ1J3j9J6J3k1QoqR
6923Dkk%N%pj5K3ppLJ2j8J5j0pQJ4PKj9J3k6oK2%j4lJ9Qk2J3KLnj8K9Rj4jnJ8
6965B1j9PKonNrJ1jpKJNl1K7jrJ6j0J6j4LNqj9J1QjjJ0j5KJJ0Lk7J7j4J6nRLM
7008A3rj0MJ4kpnJ1j5MJ5pk1J9Nk6QNj5L1k9kJ0JJ8j1%J3qrLQkJ4j8J3k6J1rJ5
7048DrKnmPRJ1pj7RNj5pJ6LJ9j5oPJmj1KmRPj3mK2j4qOJ6j8K0opPqjnOJ8Jj0L
7094A2k3RjJ0Mj0kJ1k1J9J1k6PKKlJ8k2JOj2jJ6j2Mjj0Mj1J1rNKJ6k1L4j1j5J8
7133A1jj5kJ7jjj6K2%j6J9j3%k1J8j0pJ6Mjk4L8l3J1N%Pj7J7kMj9%Mj0%K0LkL
$$ plain form
6846 1 7 13 -11 1 -9 2 0 -3 -20 1 -1 -5 -5 2 -15 -3 -7 -7 -1 2 -12 8 -12 20 2 9 20 9 16 3 4 25 21 -7 5 -7 6 3 -23
6885 -23 5 9 2 -10 1 7 5 12 14 -4 9 -21 -9 11 -3 -6 5 -23 -12 0 -8 -16 11 -4 5 -9 -7 -12 -1 12 -7 9 22 1 9 3 -5 4
6923 4 2 0 0 5 5 -2 -17 6 -1 -8 -5 7 -11 4 -6 -13 -5 9 16 18 -1 12 -14 -20 2 2 -12 -15 4 12 -10 3 5 8 3 -15 14 23 9 8 3 21
6965 21 2 9 11 5 0 5 -4 7 6 -1 1 2 7 -24 3 2 -7 9 -1 15 1 4 9 1 -18 -7 1 0 -1 9 -6 -4 -3 7 10 -17 0 -14 2 -3 6 9 13
7008 13 4 -6 -2 12 10 3 -2 9 -6 -2 13 6 -15 4 9 -17 -9 -4 -19 12 -17 -19 -9 -8 10 -1 -1 12 4 -5 -2 6 4 18 0 13 -13 -2 -11 4
7048 4 -5 -3 -8 -12 -5 4 15 8 -9 0 5 -10 -17 -1 2 21 6 0 7 8 4 -7 -5 -9 0 7 -6 -10 12 -2 -10 -4 12 -6 14 8 1 8 0 -1 -6 0 18 19 9 12
7094 12 -11 -2 -3 7 11 1 -1 10 -11 8 19 -7 0 2 4 1 19 -3 -2 4 -8 -9 7 -5 -1 -2 -12 -8 -19 -8 -17 -12 -10 6 -15 19 8 -7 11
7133 11 10 -5 -7 10 9 8 -8 14 14 -2 17 4 4 -17 1 -9 -16 0 4 3 -21 17 -16 -5 0 0 7 -10 7 5 9 -10 -10 -6 -16 -16 4 7 5 8
7173HoolLNnJ1J2nnq%j0K1%j9lJ1mJ0k4J3jJ2j5OJ7k2J0jm%mJ2jj5KQj0J8k1j3
7215b6nJ1J2j2J9LrK2rlOj5J5nlJ0Mk0Mj8K8k8J2%O%jMNk0L1j3Oj8KlqJ7PNMl3
7257a6L3j0j9RJ9rlk3K3Opjj0Pk1M6pj2Pj3%Qj0j2J7Nj1NpLqJQJ0oj3J4j7%pJ8
7298cLm%lJ0Rj4MJ3j5ooJ5kJ8j1%k4pK3Kj3J1j1K6k2OkJ4k7OKJ3j0Mj1lNJ7kj2
7339gJ2j7lJ3j5K5j6J5j1j2K1mknoPj8K0%K3qk3oJ6qrL7k5mJ4MpPJ5k3qJ4Oj8
7378fM%KoK5j9J0j6oJ3j7J9J2k3J5kLj2jOoK8j7jJLj3pK0j4j0J1J1%j4J5k4J6
7416@j9K4J5k7J0mRkpJ5j8J3k1J7%j3J7j3Oj2QOpkRKjj0kJ0j3K6lk8J4llJ8l0
7455a9J8Ok4K4j5J1Qj1MmpJJ7rmLLNnj4RkoPJNrRJOrqKPkJ5k2J1J4j4j4J9nl%
$$ plain form
7173 8 2 -4 -7 -4 1 -4 7 19 14 9 1 1 -9 12 12 -7 -10 1 -3 7 -17 -4 -5 7 -8 -2 15 -7 3 2 -2 -2 -6 6 5 -10 -8 0 -10 8 -13 -26
7215 -26 -31 -20 -8 -20 -1 2 -7 15 6 3 9 -6 9 4 1 11 15 -5 -1 -19 9 -19 -7 -7 -1 -1 -2 2 7 -13 18 5 11 -7 -5 -8 -16 1 8 13 17 -16
7257 -16 17 7 -12 -3 16 7 4 -19 4 10 3 2 -8 -1 -22 24 17 5 12 -1 -1 7 -3 -15 2 7 -4 1 -6 -3 -11 -10 -2 8 2 -11 3 -14 -14 -21 -3
7298 -3 0 -4 -4 -7 3 12 -2 2 15 0 -6 -12 3 1 19 8 8 -16 -23 0 2 -11 0 -11 15 -7 -1 -3 11 -16 -10 -8 5 -5 -1 -12 -15 -10 7 5 -7
7339 -7 5 -12 -15 -2 -17 8 -8 7 -4 -16 5 1 -1 -6 -12 -5 -23 -3 -3 20 12 -11 -17 -1 -9 -18 19 -6 -10 4 8 1 8 23 0 -8 6 12 -6
7378 -6 -2 -2 0 -6 19 0 10 -6 -12 1 -16 3 15 -8 7 5 8 -4 -5 1 -5 23 6 5 6 9 -4 -11 9 -5 -15 -4 7 7 -7 8 -16 0
7416 0 -19 5 20 -7 3 -1 8 6 -1 14 -4 9 -12 5 5 -8 9 -4 2 -10 -2 4 -3 -5 4 6 5 -5 -7 3 -10 16 13 -15 -1 -4 -7 11 -19
7455 -19 -1 5 -19 5 -10 1 9 -2 2 -2 -9 -8 9 0 -4 -1 2 7 2 -12 -3 -5 -11 -4 -3 2 -7 2 3 9 0 -8 -6 1 -1 14 -8 3 17 3 -11 8 3 0 0
7500@JoLj3KQjNJ1qj5NLRj3J2J2j2OokPj8POlknJ2J4Rk3Kj4%QK6m6QNJ4j0Oj1
7544gML%oJ0rpPKNlKlOKjj3J2kLj8J5oQoj4pK0j6J2J7j2rKOpJ6Jj3KNMj9L2j1
7589Gmj3OQJ9pj4mJj6J0QnJ6j9KJ0llJ5j9QJ0oj8K6mj4Qlj5K4j3nrQMNJ1rRnk4
7632a7M8l1Qj4J8j5OKj2K0j2%jNLjMj2J3rPpnLmJ9j4LqJ1rOpRpmO%mj5K8j5Oj6
7676a4J9lj2QMpJ6rmJ2lk4MK1rj1L3pj6jmK1j4j0JJ6MMpj9PrL1lj4mM%KJrOqJ0
7720CJ8l7K1j6JOJ0j7K5Rk8LROj5%j0J6jk7K2J1moKLKMjrRlJ3k5J9j0kJ6j0j1
7760dQj7NK2nj8MRj8J5nj9K6%%k2K6j1j4J8KJ3k2J0%J5j3mj9K2mJ4mJj2j1J3K
7798CJ8k5MnlPKj2J2qJ2lqKj9NJ1LMj6OjJJ0rJ4%k1RJ6j1J8j7PONnmj2j%j1ML6
$$ plain form
7500 0 1 -5 -2 -15 -13 -5 -6 -1 10 2 -13 -8 -5 4 -9 3 15 3 9 3 1 8 -10 -3 3 0 -2 -7 5 19 28 5 7 -7 -7 1 27 -19 -11 -6 8 -2 4 -7
7544 -7 -3 0 0 -6 4 -5 -12 -5 -3 2 -1 1 -2 4 6 5 -8 4 2 5 -13 2 -4 4 -2 -16 -23 -3 -19 -7 10 -2 -11 -9 -3 -10 6 7 -6 -4 1 5 -14 18 7
7589 7 3 -10 -4 4 23 16 2 -2 -1 -17 -7 1 -4 12 -7 -5 5 2 -1 14 -5 3 13 7 -11 15 11 -3 5 2 -13 11 -2 -7 -16 -8 -4 1 12 3 12 7 -17
7632 -17 31 0 8 -6 12 -3 3 5 -7 13 1 1 0 5 8 7 11 -1 12 3 10 3 -2 1 -3 16 2 5 -3 8 -1 5 -2 7 0 -4 2 2 -2 -17 11 -4 2 -14
7676 -14 5 2 -10 -2 2 -5 11 2 -2 10 7 -17 -13 8 -1 -12 21 14 -2 -3 -7 14 0 -10 -9 7 11 15 8 -11 -4 -13 18 15 1 -3 1 1 3 4 -5 1 -7 3
7720 3 21 -16 5 -11 -10 -4 6 -11 14 23 -5 -2 7 13 -2 -2 -12 4 3 -24 -2 9 5 -1 1 4 6 10 9 0 9 6 19 -6 13 3 1 17 7 -4
7760 -4 4 -13 -8 14 9 -9 -5 4 -14 1 -4 -23 3 3 3 -19 7 -4 -18 0 2 15 -7 3 3 18 5 1 -18 4 0 14 10 11 -1 -12 1 3
7798 3 21 -4 0 -5 -8 -1 1 -11 1 -7 5 2 -6 -4 -23 -18 -7 -4 0 -16 -10 -11 -10 0 -9 5 5 -16 -7 9 -2 16 -1 6 12 17 12 8 -4 -5 -5 -16 -12 24
7842B4k9Nj8K2kj2J5j7J4j7J2J1j5oJ2pjj7J4J5lJ0j1jJPk7K4KjjkJ7j1qJ4rj
7880CJ3j0lPj2JJ7k5JJ8j4j3NQj1J4Oj0J5j9j7K1J3j6OJj2J3j0J9jmKrJqL3jk3
7919aJ5l0K8jqPLNk9J5qJ3JJ1l3K0jQMj2qrK4k7JNQrK0j5QqJ0lPj4j9J9K6j9R
7960A3j1KnJ0p%LLjj1pJ0j0K4j4j0L3k7J1jk4K3%%j5J0j0jOJ6k3NqNK6j3j2JJ6
7999Gj6K6k0J5j9J0j6NJ6Oj4PJj6K0nk3K6pPPkk4J1%j0QoRn%%J3j7J4rnoJ8jj7
8040a2RrJ7qKJJ0pj0QJ3k6J5Qk3kJ4qrRPk0J5Qj3nK2nMMj2pPjJnNKj0RkOk3QK6
8085A3%j5pJ9j4J8nlRl4J4qJ1OkqJ9rqk1J9%J1rkkJ7omRj6OMJ3lj7Rj1pJ7pJJ1
8128Hr%J1rJ2Jl2j2L9j6J7j3lK1j9NJ2k4RJ3k5J3mJ6j6JJ0Pk2kLkpJ2J5k4%K5
$$ plain form
7842 24 -5 0 -18 4 2 -10 5 -12 2 -15 -3 8 -7 -13 -1 -8 -9 -26 -12 3 0 10 -1 -2 -1 6 -21 3 5 4 3 1 18 7 -1 13 4 3
7880 3 16 6 3 10 -2 -1 16 -9 -8 10 -4 -17 -12 -4 -15 -1 5 -5 10 -9 -26 -5 8 -8 -2 -1 -13 0 -10 9 8 4 6 -3 -2 -10 23 22 -1
7919 -1 14 -16 12 11 3 10 13 18 -11 4 -4 9 10 21 -12 8 7 15 19 7 -1 -10 14 -13 -12 -7 1 -8 12 -3 5 -3 7 4 11 -3 -22 -3 23 4 13
7960 13 2 4 -1 9 2 2 5 8 7 -4 -11 -1 -11 13 -1 -11 22 -5 6 5 -19 4 4 4 -11 -1 -11 -12 -6 10 -13 -8 -16 -11 15 2 -10 -9 7
7999 7 -9 17 -3 12 -7 3 -13 -8 8 14 0 7 8 -8 12 7 -16 10 3 10 17 15 -9 2 2 -8 0 -6 3 -2 -2 -2 11 -6 8 -1 -6 -12 6 5 -12
8040 -12 -3 -12 5 -3 -1 0 10 3 -7 1 14 -12 3 11 -12 -14 0 -8 -17 -8 -1 -21 -6 2 -11 -16 6 1 5 9 -3 -10 -3 -4 -3 -8 -3 -1 -11 -2 -4 2 -21 -13 13
8085 13 13 -2 -9 10 -4 14 9 6 15 -19 -5 -13 -2 4 2 -6 13 4 -4 -25 -6 -6 5 -4 -6 -8 9 3 -1 8 -8 -2 2 15 12 -5 4 -7 -14 3 -4 -3 8
8128 8 -1 -1 10 1 13 14 -18 -30 9 -7 10 -3 -6 15 -4 1 13 -11 -2 11 -14 -1 -5 11 -5 -4 6 13 -9 -11 -8 -10 -17 -5 10 -14 -14 11
8166A1jk0%MQk4K2K1oj2lJ0j3J2j1Lj2J3j7J5KrOj3J2
$$ plain form
8166 11 10 -10 -10 -6 2 -22 0 21 15 3 0 10 -3 9 -2 1 -11 2 -15 0 2 -7 -1 -14 -2
8191b
$$ Imaginary data points
##PAGE= N=2
##DATA TABLE= (X++(I..I)), XYDATA
0@%%%%%%%%qJ9k7M0n6P2q8J04j28J64k05K55l12L76m48N28o23P32q57R98j159
29f23J342j543J763k009K284k587K922l294L705m153M645n184N772o414P115p881
45d140Q717r631J0630j1723J2919j4226J5662j7246J8996k0944K3120k5564K8333
58A4903l1497L5151l9424M4500n0649N8276o8024Q0992r9214J27093j77491M08444
70C03060r31384Q93787k09849o01858J430585j623847J094757k69963o25030J301548
80G61806j371088Q37401l069q36684J355378j300527P19987J15865q84489J277089
90F71669j125149N10878K97915r76060J248357j005889L62011M11089r99526J166038
100E61333q49245J89991N35410j030814J097546p15471M9331O23828j029384J006154
$$ plain form
0 0 0 0 0 0 0 0 0 0 -8 11 -16 24 -32 40 -48 56 -72 92 -113 142 -170 206 -242 286 -337 395 -462 536 -623
29 -623 719 -824 939 -1070 1214 -1373 1549 -1745 1960 -2193 2452 -2732 3040 -3374 3741 -4140
45 -4140 4577 -5054 5576 -6147 6772 -7454 8208 -9038 9958 -10986 12134 -13430 14903
58 14903 -16594 18557 -20867 23633 -27016 31260 -36764 44228 -54986 72107 -105384 303060
70 303060 -628324 265463 55614 -546244 884341 -739506 355251 85288 -539742 761806
80 761806 -609282 228119 225050 -611634 743744 -556783 163204 279069 -605420 671669
90 671669 -453480 57398 355313 -620747 627610 -378279 -16268 394821 -604705 561333
100 561333 -287912 -97921 437489 -593325 504221 -211250 -161919 461909 -567475 438679
110D38679n71119r0447P04278j020264R13951m35947k11832P61584r90224Q09700
120C08359l00885l22173Q02427r45839O99846j72343m15630Q22459q85075N84456
130A75602n0866m92602Q23582q11180M67475O0058n51753Q07314p27397L52099
140E2332J58796n93636P76372o37846K41700K44505o20207P34362n46011J38484
150e1149L17205o33806O84754m54679M3247L77917o36552O29998l65778m3402
160a32245M27654o30267N71497k79750j21820M67099o15694N09816j96778j92086
170a92574M96420n92871M45012j17014k53961N15287n61592L77165m1118l06511
180b31757N23060n21875L06995K9971l48924N19505m74423K35989R4693l80462
$$ plain form
110 438679 -132440 -222887 481391 -538873 375078 -60869 -272701 488883 -501341 308359
120 308359 7474 -314699 487728 -458111 241735 69392 -346238 476221 -408854 175602
130 175602 124736 -367866 455716 -355464 112011 172069 -379684 427630 -299767 52332
140 52332 211128 -382508 393864 -243982 -2282 242223 -377984 356378 -189633 -51149
150 -51149 266056 -367750 317004 -137675 -94428 283489 -353063 276935 -88843 -132245
160 -132245 295409 -334858 236639 -43111 -164931 302168 -313526 196290 -488 -192574
170 -192574 303846 -289025 155987 38973 -214988 300299 -261293 115872 74754 -231757
180 -231757 291303 -230572 76423 106394 -242530 276975 -197448 38541 133234 -247228
190b47228N05183m20860J66007J51739m01171M81534l63354R8981K00485m11899
200b40583M50623l04274L6470K40872m14207M14732k45626k0689K73539m09833
210b18976L75946j88827p2288K99400m00243L35595j34490j18611L19361l86403
220a89536K94201q2688j59917L33809l68633K51890l3304j96290L42631l46722
230a54559K08557J3478k27303L45316l20269J64228N7147k52262L41384k89363
240a13646J19476R6966k70524L30685k54498P5285J31920k81743L13708k16721
250f9092L2735J61436k86109K91484j77504o997J85223k84430K65499j38332m3067
261f9154K03561k77906K37267j00286p5355K17192k67804K07985o4010j03959
$$ plain form
190 -247228 257955 -162905 3102 154841 -246330 235204 -128150 -29169 171316 -240583
200 -240583 210040 -94234 -57764 183108 -231099 183633 -61993 -82682 190857 -218976
210 -218976 156970 -31857 -104145 195255 -204988 130607 -3883 -122494 196867 -189536
220 -189536 104665 21977 -137940 195869 -172764 79126 45822 -150468 192163 -154559
230 -154559 53998 67476 -159827 185489 -134780 29448 86595 -165667 175717 -113646
240 -113646 5830 102796 -167728 162957 -91541 -16256 115664 -166079 147629 -69092
250 -69092 -36357 125079 -161030 130454 -47050 -54047 131176 -153254 112245 -26087 -69154
261 -69154 134407 -143499 93768 -6518 -81873 135319 -132485 75500 11490 -92469
271i2469K26888k55172J78529k9797j29187K33257k40458J49026K455j51262K36430
282A28240k23765J19453L2800j70063K36228k04866Q9780O0992j85220K32215
292A15794j83468N9993Q6696j96193K23980j59591L0640J09224k02471K11440
302I6044j33677K318J28000k03876J95080j06583k4049J42586k00721J75703p9252
313h427m7866J53082j93757J54425n2646o8779J59845j83903J32309k7493q6753
324f9963J63575j72170J10152m048j02097J64889j59210Q8393J7657j15133J64225
335H6270j45403O7190L7705j26035J61744j30737M6408N6156j34690J57201j14943
346c9134K5927P2876j40825J50265r7908N931Q7471j43958J40698p9769j3132
$$ plain form
271 -92469 134419 -120753 57776 27979 -101208 132049 -108409 40617 43072 -108190 128240
282 128240 -95525 23928 56728 -113335 122893 -81973 7807 68799 -116421 115794
292 115794 -67674 -7681 79015 -117178 106802 -52789 -22149 87075 -115396 96044
302 96044 -37633 -35315 92685 -111191 83889 -22694 -46743 95843 -104878 70825 -8427
313 -8427 -56293 96789 -96968 57457 4811 -63968 95877 -88026 44283 16790 -69963
324 -69963 93612 -78558 31594 27546 -74551 90338 -68872 19521 37178 -77955 86270
335 86270 -59133 8057 45762 -80273 81471 -49266 -2858 53298 -81392 75809 -39134
346 -39134 -13207 59669 -81156 69109 -28799 -22868 64603 -79355 61343 -18426 -31558
357c1558R9469j43842J28613o0865l0810J08443j40391J14285m1782m6615J14348
368F9295j34043R8493k3247o0114J17310j25407Q2011n852p1277J17791j15245
379e0285O5585J0044q0270J16421j04292M9674K4439q7450J13724r3036L4522
390i24L7405r3134J10047q1670K0097M9089r7440J05377p0034O251N9547j00347
402e5736R9645n8086o979O8641j01574R2521m5597j9601P6079j00772Q3864l2702
414b97l1274Q1632r7876P3772j9728m1639Q5021r2888O2554p070n0362Q6172q6068
427c8051N0698M797n7318Q5415p8021L8798J5593o2588Q3113o9237K7244K5185
439B5628o6435P9823o0278J6326L3668o9179P5859n1366O109M1156p1025P1458
$$ plain form
357 -31558 67911 -75931 52682 -8183 -38993 69450 -70941 43344 1562 -45053 69295
368 69295 -64748 33745 10498 -49616 67694 -57713 24298 18446 -52831 64960 -50285
379 -50285 15300 25344 -54926 61495 -42797 6877 31316 -56134 57590 -35446 -924
390 -924 36481 -56653 53394 -28276 -8179 40910 -56530 48847 -21187 -14936 44611 -55736
402 -55736 43909 -14177 -21156 47485 -54089 38432 -7165 -26766 49313 -51459 32405 -297
414 -297 -31571 50061 -47815 25957 6229 -35410 49611 -43277 19277 12207 -38155 48017 -38051
427 -38051 12647 17444 -39874 45541 -32480 6318 21911 -40677 42436 -26801 443 25628
439 25628 -40807 39016 -21262 -4936 28732 -40447 35412 -15954 -9845 31311 -39714 31744
451C1744m2612l460M7734p2030O6576l3881j2492N3438p2165O1124k5075k1006
463b2105N8190p1215N4889j6160k8875O1668o8892M7799p288l5775O3673o5141
475b9232L9866J435m1586O4131o0062L1436R632m6091O3039n3905K2854J6991
487A8508m9141O0626m7088J4484K3475n1103N7324l9987O553K9002n2108N3485
499B4030l2927p99L3744n2426M9399k6160p569L7830n2267M5153j9553j3864M1339
512B5930n1648M0683j3101j9704M4248n0465L5920o726k5080M6410m8523L0711
524H655m05k9867M7621m5678K5000N734l3806M7719m1899J8946J1491l6779M6631
537B3363l7232J2717J6615l8658M4472l1964O562K1065l9536M1482k6409P79K4713
$$ plain form
451 31744 -10868 -14328 33406 -38624 27952 -5929 -18421 35017 -37148 23976 -1099 -22105
463 -22105 36085 -35130 19759 3599 -25276 36392 -32500 15299 8011 -27764 35909 -29232
475 -29232 10634 12069 -29517 34614 -25448 5988 15620 -30471 32568 -21337 1517 18508
487 18508 -30633 29993 -17095 -2611 20864 -30239 27085 -12902 -6349 22653 -29455 24030
499 24030 -8897 -9696 24048 -28378 21021 -5139 -12708 25122 -27145 18008 -1545 -15409 25930
512 25930 -25718 14965 1864 -17840 26408 -24057 11863 5137 -19943 26467 -22056 8655
524 8655 8250 -21617 26004 -19674 5326 11060 -22746 24973 -16926 2020 13511 -23268 23363
537 23363 -13869 -1152 15463 -23195 21277 -10687 -4125 16940 -22596 18886 -7523 -6744 17969
550A7969l9597L7991k0839m546K7615l9020L4261j5509r329L0011l8115L0481
562A1373j0430j3648L1876l6886K6698n635j7571L3413l5423K2877j019k1141
574a5516L4514l3638J8927L462k4289L5024l1313J4760P724k6877L4868k8466
586a0820J0446J1684k8799L3892k5013N995J5222k9896L2087k1074J607J8203
598A3534l0229K9626j6879k560K0578k9815K6666j2624o314K2295k8850K3454
610H882q518r654K3549k7535K0178m661j2561K4394k6071J7040j140j5080K4957
623A3780k4488J3988K166j7343K5291k2804J0975N276j9290K5344k0959P995Q195
636H126k0934K5015j8808M914J0899k2112K4162j6283J779J3301k2753K2788j3468
$$ plain form
550 17969 -21628 16363 -4476 -9022 18593 -20427 13834 -1675 -11004 19007 -19108 11373
562 11373 943 -12705 19171 -17715 8983 3348 -14223 19190 -16233 6644 5625 -15516
574 -15516 18998 -14640 4287 7749 -16540 18484 -12829 1931 9655 -17222 17646 -10820
586 -10820 -374 11310 -17489 16403 -8610 -2615 12607 -17289 14798 -6276 -4669 13534
598 13534 -16695 12931 -3948 -6508 14070 -15745 10921 -1703 -8017 14278 -14572 8882
610 8882 364 -9290 14259 -13276 6902 2241 -10320 14074 -11997 5043 3903 -11177 13780
623 13780 -10708 3280 5446 -11897 13394 -9410 1565 6841 -12449 12895 -8064 -69 8126
636 8126 -12808 12207 -6601 -1687 9212 -12900 11262 -5021 -3242 10059 -12694 10094 -3374
649c374j260J5298k2853K0916j0460m128J6793k2329J8598p324o741J7798k1353
662a0419J6048m266r020J8371k0029J3437j460j0921J8600j8524J0864J114j2465
675h670J8586j6992Q451L452j3831J8455j5480O176N581j4979J8184j3888L960
688i95P559j5943J7778j2314J809R383j6679J7095j0527l26J0992j7095J6132
701F869q535k465J2347j7087J4748o389m475J3359j6632J3043m182o250J3971
714H322j5843J1140j972p825J4219j4646R066J30r075J4153j3321P034K009j0091
728f700J3901j1950N131L698j0873J3478j0547L342N190j1489J3023r206J662
741a340O499j1986J2514p905P4P744j2370J1907o537j467Q855j2588J1136n144
$$ plain form
649 -3374 -4634 10664 -12189 8727 -1733 -5861 10932 -11397 7201 -123 -6864 10934 -10419
662 -10419 5629 1363 -7657 10714 -9315 4122 2662 -8259 10341 -8183 2681 3795 -8670
675 -8670 9916 -7076 1375 4827 -9004 9451 -6029 147 5728 -9251 8933 -4955 -995
688 -995 6564 -9379 8399 -3915 -2106 7277 -9402 7693 -2834 -3160 7832 -9263 6869
701 6869 -1666 -4131 8216 -8871 5877 -512 -4987 8372 -8260 4783 601 -5649 8322
714 8322 -7521 3619 1647 -6178 8041 -6605 2461 2591 -6484 7669 -5652 1382 3391 -6700
728 -6700 7201 -4749 382 4080 -6793 6685 -3862 -520 4670 -6819 6204 -3002 -1340
741 -1340 5159 -6827 5687 -2218 -2144 5600 -6770 5137 -1400 -2867 5988 -6600 4536 -608
755f08k943R762j2538J0165l652m320J0457j2207Q957k077n583J0849j1582P558
769B238m95o650J0923j0653O013J004p472J0761r551M447K381q105J0387q364
783c136K957L561q508R876p150J545M592q773R294o018L15N480q967Q742m944
798a134q54O252r054Q122l862j949O956r111P497k793l018P577r001O736j725
813F39l977P982q715N879o21m836Q242q222M830M90n556Q274p534L694J610o137
829c958Q082o676K550K546o511P727n731J386L406o701P200m731L51M074o723
844c709O579l751n78M611o690O005k844j454N086o609N418k017k180N485o512
859c160M872j256k869N799o362M307m80l516O085o133L640K97m095O201n749K935
$$ plain form
755 -608 -3551 6211 -6327 3838 186 -4134 6323 -5884 3073 996 -4587 6262 -5320 2238
769 2238 1743 -4907 6016 -4637 1376 2380 -5092 5669 -3882 565 2946 -5159 5228 -3136
783 -3136 -179 3382 -5126 4750 -2400 -855 3737 -5036 4258 -1760 -1445 4035 -4932 3810 -1134
798 -1134 -1988 4264 -4790 3332 -530 -2479 4477 -4634 2863 70 -2948 4629 -4372 2364 639
813 639 -3338 4644 -4071 1808 1187 -3649 4593 -3629 1201 1691 -3865 4409 -3125 569 2179 -3958
829 -3958 4124 -2552 -2 2544 -3967 3760 -1971 -585 2821 -3880 3320 -1411 -1060 3014 -3709
844 -3709 2870 -881 -1459 3152 -3538 2467 -377 -1831 3255 -3354 2064 47 -2133 3352 -3160
859 -3160 1712 456 -2413 3386 -2976 1331 851 -2665 3420 -2713 927 1224 -2871 3330 -2419 516
875E16J064m585O219n269K154J788m936O000m578J301K470n175N679l864N17L019
891B320n243N247l105k73L467n177M726k325r75L810n051M179j617j552M065m848
907b352L644r81k090M285m679L158l71k566M439m488K704J82k979M558m289K248
923D23P27l386M654m024J724J270l717M648l675J211J733l961M535l222O24K202
939A766m103M290k706M4K589m150L964k134n24K904m045L515j524j052L145l934
955a955L084r70j499L305l716K601m62j864L391l508K183K9k182L438l276J759
971C58M68k484L487l063J383Q50k754L526k856J020J245k986L503k567N80J627
987A337l174L417k262J90J963l309L257j862k54K267l312K988j454o70K482l243
$$ plain form
875 516 1580 -3005 3214 -2055 99 1887 -3049 2951 -1627 -326 2144 -3031 2648 -1216 -699 2320
891 2320 -2923 2324 -781 -1054 2413 -2764 1962 -363 -1338 2472 -2579 1600 -17 -1569 2496 -2352
907 -2352 1292 311 -1779 2506 -2173 985 614 -1952 2487 -2001 703 885 -2094 2464 -1825 423
923 423 1150 -2236 2418 -1606 118 1388 -2329 2319 -1356 -145 1588 -2373 2162 -1060 -436 1766
939 1766 -2337 1953 -753 -709 1880 -2270 1694 -440 -964 1940 -2105 1410 -114 -1166 1979 -1955
955 -1955 1129 159 -1340 1965 -1751 850 388 -1476 1915 -1593 590 619 -1563 1875 -1401 358
971 358 826 -1658 1829 -1234 149 999 -1755 1771 -1085 -65 1180 -1806 1697 -870 -290 1337
987 1337 -1837 1580 -682 -492 1471 -1838 1419 -443 -697 1570 -1742 1246 -208 -878 1604 -1639
1003a639K651r70j076K634l108K286n20j404K705k872J857r7j675K719k645J483
1019C29K68j901K728k412J129O18k085K700k213Q18R12k277K685j994N00J183
1035I88k395K635j757J58J504k537K532j495j36J726k608K408j236m41J917k605
1051a342K221r01p81K105k556J975n86j051K202k432J656k16j286K238k245J324
1067C25J21j510K245k023R82M47j646K159j768O58P06j776K110j573M04R34j876
1084a081K018j340J03J173j950J924j118j38J353k036J876r51l56J522k047J739
1100F91p24n87J647k053J614n02q10J767j998J394k21j015J841j873J151J9j190
1117h49J851j731R03K60j304J820j549O16N32j428J736j320L50P41j498J639j087
$$ plain form
1003 -1639 1012 42 -1034 1600 -1508 778 258 -1146 1559 -1313 544 447 -1228 1491 -1154 329
1019 329 597 -1304 1424 -988 141 759 -1326 1374 -839 -21 891 -1386 1299 -695 -195 988
1035 988 -1407 1228 -529 -371 1133 -1404 1128 -367 -503 1223 -1385 1023 -213 -654 1263 -1342
1051 -1342 879 -22 -803 1302 -1254 721 135 -916 1286 -1146 510 294 -992 1246 -999 325
1067 325 446 -1064 1181 -842 140 587 -1059 1100 -668 -10 696 -1080 1030 -543 -139 795 -1081
1084 -1081 937 -403 -300 873 -1077 847 -271 -409 944 -1092 784 -167 -523 999 -1048 691
1100 691 -33 -620 1027 -1026 588 86 -724 1043 -955 439 218 -797 1044 -829 322 341 -849
1117 -849 1002 -729 174 434 -870 950 -599 17 549 -879 857 -463 -113 628 -870 769 -318
1134c18J00R08j551J528q79j06J065j588J444p25k66J173j583J324n44m54J268
1151G96j569J225l93o08J359j548J110k24p79J458j534R67or27J495j454Q13J61
1169C42j047J498j322N91L64j132J458j196M02N37j225J405j001K01O59j226J287
1186E95q06k6Q04j256J197o55j55R09j253J064m59l25R88j229R53k96m61J050
1204F39j220Q68j79n77J089j168P64k8p11J161j124O45R5p99J174j073N17K40
1222C13q96J187r78L69L66r34J137q65K43M58r91J100p42P3O09j006R69n48o9
1241b05O73j007Q90m00k14P55r90P79k66l25P94r44O89j35m16Q06r18O20l9n43
1261c96Q76q46M83P3o13Q91q06L96J64o54R01p70L17K61p32Q99o99K00L63p83
$$ plain form
1134 -318 -218 690 -861 667 -212 -318 747 -841 603 -122 -388 785 -798 526 -18 -472 796
1151 796 -773 452 59 -549 810 -738 372 148 -631 827 -707 260 254 -673 822 -632 181 342
1169 342 -705 793 -529 62 426 -706 752 -444 -42 495 -730 675 -326 -125 534 -692 595
1186 595 -211 -237 567 -689 508 -147 -302 607 -646 418 -41 -366 622 -607 346 50 -411 639
1204 639 -581 287 108 -469 620 -548 216 188 -523 638 -486 159 254 -545 629 -444 73 313
1222 313 -583 604 -374 -5 361 -573 564 -301 -58 400 -591 509 -233 -160 449 -557 412 -136 -205
1241 -205 468 -539 351 -49 -263 492 -498 281 15 -310 484 -460 229 94 -322 484 -434 186 147 -396
1261 -396 480 -366 117 190 -423 468 -338 58 222 -432 469 -301 16 277 -455 444 -255 -55 308 -475
1281d75Q89o05J12M30q16Q39n19nN30q20P55l83j38N86p98O78k81k23O08p34N87
1302B17j73k94O48p23M80n0l99O55o63L94M6m47O72o27L14J24m98O76n87K45J93
1323B03n56O85n25J51K72n79O66m68Q9L38o25O54m23K1L88o26O25l70n8M47o46
1344c37N62k64j14M68o34N00j74k10M89n62M19p8k86N18n45L50pl44N50n06K50
1365D5O5l65N24m53J87J62m38N10l78J24K06m50M92l33N5K43m73N06l36L6L06
1386B35m89M82k90l7L33m91M64k30j01L65m88M05j68j41M00m93L78r9j97M19m68
1407b11L02k9k44M17m31K61Pk69M23m00K06P3l05M09l37J35J13l40M19k91N2J93
1429A53l49L85k66PK28l67L57k26MK62l90L50j79p3K90l78L30j36j10K97l64K79
$$ plain form
1281 -475 414 -191 -79 351 -465 374 -145 -150 380 -440 315 -68 -206 380 -418 260 -21 -244 364 -370 217
1302 217 44 -250 398 -325 155 105 -294 361 -302 92 138 -309 363 -264 50 174 -324 352 -235 10 203
1323 203 -353 332 -193 -42 230 -349 317 -151 -62 276 -349 305 -118 -97 291 -335 290 -80 -138 309 -337
1344 -337 225 -39 -153 315 -319 181 7 -203 286 -276 143 65 -221 297 -248 102 95 -249 301 -205 45
1365 45 110 -255 269 -184 3 165 -273 237 -141 -17 189 -261 231 -102 -47 196 -277 229 -107 -71 235
1386 235 -254 228 -62 -99 234 -257 207 -23 -124 241 -247 158 -10 -151 249 -244 134 35 -162 257 -211
1407 -211 91 62 -182 235 -196 65 72 -197 226 -174 32 105 -200 209 -128 7 120 -220 199 -92 -40 153
1429 153 -196 189 -77 -70 158 -209 148 -78 -74 188 -202 148 -31 -104 186 -192 138 2 -108 189 -175 104
1451A04q6j58L42l90K65m6j71L26l31K07Mk12L42l49J89O0k67L61l07J32R4k61
1473a52L15k45P9J30k97L12k12L5J53k85K91j54l0J91k96K73j30n0K29l12K43
1494H8j09q8K54l01K34o8j12K52k87K22o5j41K68k83J94mj66K63k73J44N3k22
1516a47L02k65J42N6k24K77k15O6R4k08K46j74J8J33k30K51j62%J50k32K19j14
1538a7n9J85k23J84p6p3J73j98J66n2r3J92k12J65l3j16K11k24J50mj43K28k03
1561g2R9M0j66K30k17R5N3j69K28j91P7O9j90K13j53J9J24j93J99j36PJ09j85
1584a10J77r7j9J29j82J63o5n3J58j96J43l0p8J51j69J22j6r1J63j79J08Rj06
1607f8J72j49N2L1j06J52j35L8O9j40J69j30M2P1j62J87j55O5M7j44J67j15J6
$$ plain form
1451 104 18 -140 202 -188 77 31 -140 186 -145 62 66 -146 196 -153 36 96 -171 190 -117 15 109 -152
1473 -152 163 -82 -3 127 -170 142 -70 -35 118 -167 124 -30 -60 131 -165 108 -22 -72 157 -155 88
1494 88 -21 -109 145 -156 78 10 -102 150 -137 85 20 -121 147 -136 58 54 -112 151 -122 22 75 -147
1516 -147 155 -110 32 88 -136 141 -74 -8 86 -122 124 -50 -32 101 -129 122 -40 -40 110 -122 97 -17
1538 -17 -76 109 -114 70 -6 -79 94 -104 62 10 -83 109 -103 62 29 -87 124 -100 50 46 -97 131 -72
1561 -72 27 67 -99 131 -86 9 62 -107 121 -70 7 76 -114 99 -54 -35 89 -104 95 -41 -34 75 -110
1584 -110 67 -30 -49 80 -102 61 -4 -57 101 -95 48 18 -60 91 -78 44 28 -63 100 -79 29 38 -68
1607 -68 104 -45 7 38 -68 84 -51 -13 56 -84 85 -45 -3 68 -94 93 -62 3 50 -94 73 -42 -26
1630b6J20j89J84r4k0Q7j32J33o4n0J42j59J10m8l7J27j58J18l1p2J42j49J08
1653D2pr0J46j46P4%r2J44j27O6M2j29J48j24N8M0j06J11q2K0N5j01J29r4LP2
1679E2j20J28p8RO5j21J09l7l6J04j30J14n3j8P5j26J05k9n3R6j16Q9j4m8R8j14
1705d9P9j7n5R7j00O2K8j00J02q8K2M5p3R3p5K8L7r4J16q4RO4r0O4m1OO5j17R8
1734C2n0RM5o8N9k3k2P2j10Q6l7k4Q5j08O1k3j7R4j14O9J2p0Q7r7N5Mo8J14q1
1763b8L9J3n6R1p2RK2n3O7m5OK8n6O8n3%M8m9O0n7J2N0p5P3m9j2N9o3M8m0qN7
1795C4o2L4j3j9N3n5L5j2k8P5n9RK2m1O4p4M2K2p3P4n9K3K0n0P8o1J1M3p1P2l8
1826dpN5p5N8l7k0M8l8O0m2nK9n8M6k2rM6n8L1j0NK9n3K6K1l3N2o4K8Ol1O4n8
$$ plain form
1630 -26 94 -95 89 -5 -25 62 -70 63 -1 -51 91 -68 42 -6 -43 84 -74 44 13 -59 83 -66 42
1653 42 35 -55 91 -55 19 19 -73 71 -56 10 52 -77 71 -53 5 45 -61 50 -32 -12 43 -58 71 -23 -20 52
1679 52 -68 60 -18 -9 56 -65 44 7 -29 75 -55 59 6 -12 63 -63 42 13 -40 56 -60 29 15 -33 65 -49
1705 -49 30 13 -42 55 -45 17 45 -55 47 -41 -19 26 -47 46 -29 -1 36 -58 58 -26 -17 47 -43 21 -20 -14 51 -66 32
1734 32 -18 -9 36 -32 27 4 -18 54 -56 30 -7 -31 54 -54 7 -16 -33 61 -53 16 28 -42 45 -52 3 7 -61 53 -28
1763 -28 11 24 -32 59 -13 -4 18 -35 32 -13 -7 21 -35 33 -20 -20 28 -21 39 -18 -6 44 -31 42 -7 -19 40 -23 25 -15 -23 34
1795 34 -28 6 -7 -26 27 -28 7 -5 -33 42 -17 -8 14 -27 37 -37 5 27 -46 28 -31 -8 12 -38 40 -21 -10 33 -38 34 -4
1826 -4 -11 44 -31 27 -10 -30 18 -20 40 -2 -7 22 -36 10 -12 -21 25 -33 -2 -12 -7 22 -31 -5 16 -17 35 -29 -1 5 -26 38 -20
1859b0J4Mj7N3n3L0L4p1N1m9L2Jm5N1n1L7J1k9L3k0LL5q3P6k8lK6m6K0Ok3M3m9
1892b7M5j1k7L0l3K8jj7K0m1K7Mk0L5l0K7j3qJ7j9QK4l4K3l0L2ok6K3jlK7l0Q
1926A%Ojk8L3j7kL1m4L3JjJ1l9L8j6k0K0j9L3k1LK4m5M2ql7M1j4J2oj9L1n4K6
1961e%j0M1l3Mjj3L7k3J2kk6J2j2RJ1j0J5poJ5j6J0J0k7K8k4K8k0oL9k7lKOJ9
1997B7k7j1RqK1j7NJ7l8L2l0RL0k8J9ppLj3J3j3J7lk4M7m5K3Rj7pJ3kkl4L4Po
2034dJ7k2K0k3J4J5k6K3k2RMl4L3j8MK1mk2Oj1K9r%k0J0L5j7j1Qj2Oj3K2j0j2
2069a4L2m1lL7k9J9OoJ5l2J3LjplL3k2PmnKNj9K5k3K3Lk0K1l1J1jk1K8nJ8j4k0
2107b0L3j8QRl2K0%k9K9oLOk0Rj9K0J2l7M4j7Nk6J3%NOj1lJ7JNnjJ1j4mlpJ6j7
$$ plain form
1859 -20 -6 -2 -19 34 -19 11 45 -26 25 -24 8 9 -36 15 -36 1 12 -17 16 -4 -1 34 -49 27 -1 -4 22 -24 -4 2 -21 22 -27
1892 -27 18 7 -20 10 -23 5 4 -13 7 -34 -7 -3 -23 12 -18 9 -4 -12 5 -14 -6 18 -16 7 -23 9 3 -23 0 -1 -4 23 -7 1
1926 1 1 7 6 -22 11 -6 -8 23 -21 12 13 12 23 -16 22 6 -14 6 -13 20 -1 2 26 -19 23 15 -22 19 5 17 11 -8 23 -31 -5
1961 -5 -5 -15 26 -7 -3 -4 -17 20 -3 9 7 -19 -7 -19 -10 1 -9 6 -1 -7 8 -8 2 12 -15 13 -11 17 -3 -9 30 3 0 2 8 27
1997 27 0 -11 -2 -10 11 -6 -1 16 -22 10 -20 -11 19 -9 10 3 -4 -1 -14 -1 -14 3 0 -24 23 -22 1 10 -7 -14 -1 -3 -5 -39 -5 2 -4
2034 -4 13 -9 11 -12 2 17 -9 14 -8 1 5 -29 4 -14 -10 11 7 -15 -9 -20 9 0 0 -20 -10 25 8 -3 5 -7 -1 -14 8 -2 -14
2069 -14 18 -23 -26 11 -18 1 7 1 16 -16 -3 0 -1 -8 -11 22 0 7 3 -2 0 5 -14 11 -12 11 14 -6 15 -16 -5 -6 -27 1 -4 14 0 -20
2107 -20 13 -5 3 12 -20 0 0 -29 0 -6 -3 3 -17 -8 -27 -7 5 -32 12 -5 0 -26 -13 -13 -8 -2 -13 -16 1 2 7 2 1 12 -2 -6 -9 -16 0 -17
2147a7K1nkJ3j9J3pkLoMJ2rJ1j5j1RlK8l0K2j2jJ0kJ2j7nJ2j9pM3k2Kpj0J1j0
2185a2pKmL2l5J0J%KlJ9j6J0oklRj3J4oONnK0l1L1j5l%j1J0JJ1j0j4PK1j5J4k3
2225iJ2Kj3OnKJ0k2MQj3J2mPRj2RMj6opK5pKJ3k6J5j8K9j7j5K3Pj2Oj6J1j4K5
2264ILk4J8Lj1Mj5J6rrJ4j9J7nj7J4JLnJ8J0j4J3k3Jj0LK1j1J0Mkk3K9j1PQk2
2302dK6k7Pj7PJ4k1J0OlQj2j5M1j4j9J8j7LmLMJ4j2kjmK1mlLj3Qp%J2k7K7Nj3
2342bJ4j1%kj5K5Jj2MlmPJ0j1LnQNl5J9%rJ0K3k0Mj3J8mkj5%K4mj3Nj2KJ0j1J5
2383D%KQrQj0KpLnJ0lmNkK2m2J5j0K6j7Lj1J8j6mJ1Lj4L6j3k8J4Jj4M7k3Qj3j8
2423a7K8k3J6poJ5pmKLnnPj6K0K1k8KjJ8l4K9%J5l2Mm%j3K4j1RKj0Oj0NOmJlO
$$ plain form
2147 -17 4 -1 -3 10 -9 4 -3 -5 -2 -8 -4 8 -1 10 -5 -16 -7 -10 18 -12 10 -2 -3 7 5 17 0 -5 7 -12 -19 24 2 4 -3 -13 -2 -12
2185 -12 -19 -17 -21 11 -24 -14 -13 -13 -11 -14 5 -11 -1 -7 -9 -12 -3 -16 -2 -8 -2 3 -2 18 -13 18 3 0 0 -11 -1 0 11 1 -13 -6 15 0 14 -9
2225 -9 3 5 -8 -2 -7 -5 5 -17 -13 -5 -18 -6 -10 -3 6 -6 3 7 -9 -15 -22 3 -4 -2 11 -15 0 -18 11 -6 -21 2 9 -3 3 -13 -2 -16 9
2264 9 12 -12 6 9 -2 2 -13 3 -6 -15 -1 -20 -3 -8 -25 -11 -10 -7 -12 6 16 2 15 -8 -7 -17 -14 7 -4 6 10 8 -15 14 3 10 18 -4
2302 -4 22 -5 2 -15 -8 6 -15 -5 1 -2 6 -6 -21 20 6 -13 5 -12 -9 -13 -10 -6 8 -4 -6 -7 -11 10 6 3 6 -7 1 -6 -6 6 -21 6 11 -2
2342 -2 12 1 1 -1 -16 9 10 -2 2 -1 -5 2 12 1 4 -1 7 12 -23 -4 -4 -13 -3 20 0 4 -9 9 5 3 -12 -12 12 8 -5 0 -12 -10 0 -11 4
2383 4 4 6 14 5 13 3 5 -2 1 -4 6 3 -1 4 2 24 -18 -3 -13 13 -4 -1 -12 6 -10 -14 -3 0 -14 22 9 -19 -5 -4 -18 29 6 14 1 -17
2423 -17 11 -12 4 -3 -9 6 -1 -5 -3 0 -5 -10 -3 -19 1 22 -6 -4 -5 13 -21 8 8 23 -9 -5 -9 -9 -22 2 -9 0 2 -8 -2 -12 -7 -1 -5 -4 -7 -1
2465anLqJ8kQJ5l2%K4k0j6J2jJ6l0K3j6J7j2NrJ5J3mk1J8k8pM0j7LpQMK1j2Rk9
2504eJ3j6K9k4J7Jk6K6k0J0j5K7rKj3K9j9k3J9pj3J8Jnj5J4j3K0j8K1j8J0olJ
2539a0PmJ0nMJ5j6%kOJ3k4J6Kj5j0NJ2oMMj9J8kKmqJ0mJ9j7oKRj5R%Lj7oL7k0
2581cMJ2k7J5jK8k6rK6j4nNqj2J4JRjQmj8oQ%J1l1K0J2%Jk2J8l%kJ3q%Nj1j1R
2623cJ6j5j1J1nlkJ4pQj3PNJ0k8L2j3Qj1K5l4K0j6%J3mqMj0K0lrmJ4qoPJLMrj
2665aJ0Nj0j2K1j5J8p%j1lJnK3j1mkNrJ6ljKnj4L6j8npK8j7Jjmj6K3j1%j0K1o
2706B%lMQk9LJ4J2j9K1Lk4J1Qk4J3Nk4OOK4k0K0k%mk0J6MknnPjLj3lNNnK1%j1
2749GOk6J6j1lJJ2j1PNlj4J2pK0pkomKJJ6rLj%J7joj1%j9K0LkLJ2l1J2j7K2kk
$$ plain form
2465 -1 -6 -3 -11 7 5 13 28 -4 -4 20 0 -16 -4 -5 11 -19 4 -12 5 -7 -2 -11 4 17 13 -8 10 -18 -25 15 -2 1 -6 2 6 27 15 24 -5
2504 -5 8 -8 21 -3 14 15 -11 15 -5 5 -10 17 8 10 -3 26 7 -16 3 -4 -17 1 2 -3 -18 -4 -17 3 -15 6 -12 -2 -8 -11 -10
2539 -10 -3 -7 3 -2 2 17 1 1 -1 5 18 -6 10 12 -3 -13 -8 4 -2 2 6 -13 5 3 5 1 -7 3 -1 18 1 -5 -3 6 -9 0 0 3 -14 -20 17 -3
2581 -3 1 13 -14 1 0 28 2 -7 19 5 0 5 -3 -15 -1 0 9 8 16 12 -6 -12 -4 -4 7 -24 -4 8 8 9 -13 5 2 2 0 13 5 5 10 -1 -12 -3
2623 -3 13 -2 -13 -2 -7 -10 -12 2 -5 3 -10 -3 2 12 -16 16 3 11 0 25 -9 11 -5 -5 8 4 -4 0 -10 10 7 -2 -6 8 0 -6 1 2 5 9 0 -1
2665 -1 9 14 4 -8 13 -2 16 9 9 -2 -5 -4 -9 14 3 -1 -3 2 -7 9 6 5 7 2 -12 24 6 1 -6 22 5 6 5 1 -15 8 -3 -3 -13 8 2
2706 2 2 -1 3 11 -18 -15 -1 11 -8 13 16 -8 3 11 -13 0 5 -19 -13 -7 17 -3 17 15 15 11 -9 7 11 9 4 -1 6 5 8 -5 -8 -3 2 -3 18 18 7
2749 7 13 -13 3 -8 -11 -10 2 -9 -2 3 0 -14 -2 -9 11 4 2 -4 -8 -6 -5 11 2 5 4 4 21 20 14 3 3 -16 4 7 5 8 20 -11 1 -16 6 4 2
2792BlLQj1J5jj6nKj2K3j0J7j6NOk%l%KJ0l4J2J4oJ6j8lPJ1mj4J7j4Mjj2K1j8
2832hJ2%jJ5k2llNoJ4qjJJ0k1NL3k9LoJ8j6mjQMOk0K7k8J6J3k8jP%%lQjJ0lJ1
2875A3lj7oJ7Lj3LKj2LK7k0pJ3j6LK0k4J9JK%rK1k9jJ6oJ9l1lJ6qNJ7k7kL0j2
2914Dj5K6qqpJ5mj7OrJ5J2k6PPpjNjJ3rj2L4l0MJr%J2O%LKj4MJ5pj1J9j9Rj3R
2957AJ0j0qJ2kLKk0KMNJ0mj2jj3PORKj8rK3Oojj5J1rK7j7J0RqOpOj0jNpKkoRJ
3003BpPojJ6rpJ1Jk0Qjj5PQJ0KjqnK1l3J3J3pnL%J1Qk4jPRj0Kj1K8j1rMpjJ0j5
3048a3J4jNMKj1j6MJ2Mj2oJ0%oJ3Jj1pK8j9J2Nj3jK0j3%nK3j5Lj2J4oKrnOj4J8
3089EJ5k3OQnj0Qj6KK1j2J5j4lNoLonK6k7K0joPnLoj2KJ4ONor%PJqnPj0NQj2K1
$$ plain form
2792 2 -1 2 10 -1 14 13 -3 -8 -6 -18 5 -5 12 -4 1 7 5 5 2 2 4 14 -20 -8 6 0 16 -2 -5 2 13 9 -5 12 -2 2 1 -11 10 -8
2832 -8 4 4 3 18 -4 -7 -10 -5 -11 3 -5 -6 -5 5 -16 -11 22 -7 -4 -10 8 -8 -12 -13 -5 -1 5 -15 12 -16 0 13 -15 -16 -9 -9 -9 -12 -4 -5 5 2 13
2875 13 10 -7 -13 4 7 -6 -3 -1 -13 -10 17 -3 -10 3 -13 -10 10 -14 5 6 8 8 -1 20 -9 -10 6 0 19 -12 -15 1 -7 -2 15 -12 -14 16 4
2914 4 -11 15 7 -1 -8 7 3 -14 -8 -17 -2 10 -16 -9 -2 -9 -10 -5 -6 7 -2 -14 20 -10 -6 -5 -14 -14 -2 4 4 7 9 -5 -1 14 7 -4 15 -4 5 -8 1
2957 1 11 1 -7 5 3 6 8 -12 -10 -6 -1 9 5 -7 -8 -21 -14 -8 1 3 -15 -24 -1 5 -1 -2 -17 -6 -15 12 -5 5 14 6 12 5 11 1 0 5 -2 0 -2 -8 1 2
3003 2 -5 2 -4 -5 11 2 -5 6 7 -13 -5 -6 -21 -14 -6 4 6 5 -3 -8 13 -20 -7 6 -1 -6 -3 -3 8 16 -8 -9 -2 7 -3 -1 -12 16 5 -4 0 -7 -8 2 -13
3048 -13 1 0 5 9 11 0 -16 -12 0 4 -8 -14 -4 -4 -10 3 4 -7 -14 14 -5 7 12 -1 -2 18 5 5 0 23 8 11 -1 13 7 9 0 -5 1 -13 5
3089 5 20 -3 3 11 6 -4 4 -12 -10 11 -1 14 0 -3 2 -4 -1 -7 -12 14 -13 7 6 0 7 2 5 -1 -13 -11 3 9 14 8 -1 -1 6 7 -1 -6 1 -9 -4 4 -8 13
3135A3Kj4J1j6j8K3j6NJ0pjkJ1Nj0J7k4RNqJ7nmMlmpJ2j1J0%jrkJ5pj8K3kj7O
3176hK5k5%%J4mpqL%J3j1RNmMmnqK3j2lj1OJ0qj0J3mROj1j4J8NRj2oNKKqjpJ6
3221Fk2K8j4qLK0k2mMnNMj0J1J9j5nJ0lMpkJ2pJ8k6RJ0j6J4j6J1j7K0j9lK6j8
3259eJ2nKJ2k7K7j2j1lJNLOPpolnJ6okNOpj1%nKJ6k3L3oj6j1K3qj4J8NloKjj0
3303a2QJ2Qj7koJ2k3K0oqJ0oJ3j8K6k1RMk6J9J9j6j0RJ7l0J8rrJJ4oRJ3Jj5%j
3342AK8k4llnMkQKjjj1J6j4PlMnj4J2K3nj9JRpJ1Lk0oK2j0j4J7J5k3MKOJ0j6j
3384bJ7k3Rr%LJ5j1PRpj0k5K7nNKoLlnLJ1oJ1rjOqJ3k0J2oP%j4LJ8%mmj1QKj2
3429a0J8j3QmpJ0%OjoKJ3k0Pj8J8Jj1Nj0RlRJ0j3LoRj3JNJ2J4l3J1r%POOqoML
$$ plain form
3135 13 15 1 12 -4 -22 1 -15 -10 0 -7 -8 -10 1 6 -4 13 -11 -2 3 -5 12 7 3 7 4 0 -7 5 -6 4 4 3 -6 -8 7 0 -18 5 3 -14 -8
3176 -8 17 -8 -8 -8 6 2 -5 -13 -10 -10 3 -8 1 6 2 6 2 -3 -11 12 0 -3 -14 -8 2 -6 -16 -3 -7 2 8 -3 -17 1 6 15 3 -3 2 4 6 -2 -3 -10 6
3221 6 -16 12 -2 -10 -7 13 -9 -13 -9 -14 -9 -5 -15 -4 15 0 -5 5 2 6 -1 -3 9 2 20 -6 3 13 -3 11 -5 6 -11 9 -10 -13 13 -5
3259 -5 7 2 4 16 -11 16 4 -7 -10 -9 -4 -1 5 12 5 -1 -4 -9 7 1 -1 4 10 3 -8 -8 -13 -11 5 -18 15 9 -7 -18 5 -3 -17 1 6 3 -3 -1 -2 -12
3303 -12 -4 8 16 -1 -3 -9 3 -20 0 -6 -14 -4 -10 3 -15 11 -10 -1 3 -23 -4 15 -1 -11 -2 15 -15 3 -6 -15 -14 0 -6 3 16 17 2 2 1
3342 1 29 5 2 -1 -6 -2 -4 4 6 5 4 -7 9 -5 2 -1 3 -2 -16 -4 19 14 -5 -4 5 -2 9 12 -8 -14 8 -2 -16 1 16 -7 -3 -1 5 15 -1 -2
3384 -2 15 -8 1 -8 -8 -5 10 -1 6 15 8 -2 -27 0 -5 0 2 -4 -1 -4 -9 -6 5 -1 10 1 0 6 -2 11 -9 3 -3 4 4 -10 -7 11 11 7 3 -8 0 2 -10
3429 -10 8 -5 3 -1 -8 2 2 8 7 1 3 16 -4 3 -15 3 4 -7 -2 -12 -3 -6 3 13 0 3 -3 6 -7 -6 -1 11 25 -8 3 -6 -6 1 7 13 5 -1 3 6
3473Fk4K5j3nK8j9J8j8J6Mkj8Qk3PJ3R%k2PkJ8qKj8QOnJ2nnokL6k4jj4M0l2PO
3514A0J0j4%kk0K3j6lJ7oJ%Rmj3M%LJ%J5j1lLk6K3rK7j3j0L3l5RkrqJ9NoMMj6
3556fRRnKj3J4mj0J9j4J7oJ2k3KQj6olJ0K0j6knoJ5j7J3Nj9L0Kk4J6jk2J7j6J2
3595bJ0QkrlJ1j3Rj0jJj9L1k3nK3kJMj2Lk6K2NPj6lKJ5j1KLJ2j1mOKj9J0lnJ4
3637BOpJ4j3j3J8MPj3pnqJ0JMJkj0rK4JLpj2PL%k2MLkjJ2Rj5K3m%qrMLJ6Mj1j6
3683a1K1%k1K2j2rJ7j6K5j3rNj0OJ3l4K1J1k5J8K1k1nk2LPPqL4qj4J7qmLMk1J6
3721@j0J9j6K5mj3pJ2LrjOoJ2rPj0j0K7j8NlNJ0k1LQJj1lK4j4pNmJ6Kmj3pQOj5
3764a1JK6k6J4jPpLRjJj1ojJ2j3NpN%jk0L9j6qJ5j0jqQJNLrLnKK2l1L%JPjJ4k1
$$ plain form
3473 6 -18 7 -6 -11 17 -2 16 -2 14 18 16 -2 6 -17 -10 3 12 12 -10 -3 -5 13 5 7 -11 -3 3 -2 10 5 0 -6 -8 28 4 3 -11 29 -3 4 10
3514 10 20 6 6 4 -16 7 -9 -12 5 -1 0 0 9 5 -8 -4 -4 -1 0 0 15 4 1 4 -22 1 -8 19 6 -4 29 -6 3 1 -8 -16 3 8 2 6 10 -6
3556 -6 3 12 7 9 -4 10 6 -4 15 1 18 12 24 1 3 11 -5 -11 -14 -4 16 0 -2 -7 -13 2 -15 -2 3 -16 14 16 -8 8 7 -15 2 -14 -2
3595 -2 8 16 14 5 2 13 0 9 -1 -2 -1 -20 11 -12 -17 6 4 5 9 -3 0 -26 -4 1 8 -8 -11 -9 6 -5 -3 0 12 1 -3 3 5 -14 -4 -7 -12 2
3637 2 8 1 15 2 -11 7 11 18 5 -2 -7 -15 -5 -4 0 1 -1 -11 -20 4 5 8 1 -11 -4 -1 -1 -23 -19 -16 -18 -19 -7 2 -13 10 6 6 -2 -11 -7 -4 12 16 5 -11
3683 -11 10 10 -11 11 -1 -10 7 -9 16 3 -6 -1 -11 -5 8 -26 -5 6 -19 -1 20 -1 -6 -28 -25 -18 -11 -19 15 7 -7 10 2 -2 1 5 -16 0
3721 0 -10 9 -7 18 14 1 -6 6 9 0 -1 5 -1 11 2 9 -1 -11 16 -2 3 0 5 15 -6 -3 5 6 -5 -8 16 2 -5 0 -4 12 14 10 -3 -10 -2 4 -11
3764 -11 -10 16 -10 4 3 10 3 6 15 14 15 4 -2 -3 9 -4 1 -6 -1 -1 -2 -22 17 1 -7 8 -2 -3 -11 -3 -2 3 6 -3 0 -5 -3 19 -12 -9 -9 -8 -1 -2 12 -9
3810iOLmJ7k5K2%j2J3Jj3oOlKMj4kJ4LNmPk1POk4K6JrOj5J2j5Qj1K2rk%llQJ8
3854A3j1Nj0J2mpJ3%l0J9RpnjMj%j4J2LJ4j7J2rpPPj1j3J0qQJ1j5jJ5pK2pqk4
3895b1K4nJ5qjKqJ6j0lqoJ6rOmNj4J6%j0k4L8J6k8rMMlLLj2OOj2J9j8QN%j3J5
3937Aj4kJ3j2K4LnKJnk1K3j7KPQJk7K1Nj5J1Om3L4mMj9RJ8j3N%J3oj2JJ7j4j6
3977a6OJ2Kj1pRK7k3PMj2QQj3lJ0j9J0jJ5j7lP%j9K0MrLlJ2k9pJ9Qj1J9j5KJ1
4017EKj8J5rj1J9j1pJ3mljL%K4k4J0J0Oj5Nk2lK8j1jj0J7JNj8mQjKj5J8j5K0j5
4057gqOQkmJ8j8NJ0%qj2ROJ0Ol3NJ0J2nomJ0k2LJ5qJ0j6J1mkL1l2LlrOjJ2k0N
4100a3lk1L8j0KK2j1j1LmL%J1kj4PK0rj4k%oMjMmK7j3j6J8j2J0pjj7J1RnLKk0
$$ plain form
3810 -9 -3 0 -4 13 -12 10 10 -2 11 12 -1 -7 -1 -4 -2 2 -12 -14 0 3 8 4 11 -10 -3 3 -21 5 6 -3 3 -12 0 -15 -7 -18 4 -5 -7 -7 -10 -13 -5 13
3854 13 2 7 -3 9 5 -2 11 11 -19 0 9 2 -3 -4 0 -1 -1 -15 -3 0 14 -3 9 0 -7 0 7 -4 -17 -7 -15 -7 4 -11 -12 3 -4 18 11 3 -21
3895 -21 3 -2 13 5 4 6 -2 14 4 1 -7 -13 3 -6 0 -4 1 -13 3 3 -7 -31 7 23 -5 -14 -10 -6 -9 -6 -3 -15 -9 -3 -15 4 -14 -6 -1 -1 -14 1
3937 1 -13 -15 -2 -14 10 13 8 10 11 6 -15 8 -9 -7 0 8 9 -18 3 8 -7 4 10 -33 1 -3 1 -18 -9 9 -4 1 1 14 8 -4 -3 14 0 -16
3977 -16 -10 2 4 -7 -14 -5 22 -1 6 10 -2 6 14 1 -2 8 -11 -1 -2 13 -4 -7 0 0 -19 1 5 -4 -1 -4 8 -21 -28 -9 -1 -12 7 -8 -6 5
4017 5 7 -11 4 -5 -16 3 -8 -15 -2 -6 -9 -10 -7 -7 17 -7 3 13 19 4 9 -13 -16 12 1 0 -10 7 8 13 -5 -9 -1 -2 0 -15 3 -12 8 -7
4057 -7 -15 -9 -1 -3 -7 11 -7 -2 8 8 0 -12 -3 3 13 19 -14 -9 1 13 8 2 -2 8 -14 -11 4 -4 6 -10 1 -3 -5 26 -6 -3 -6 -15 -9 -10 2 -18 -13
4100 -13 -16 -37 1 -9 -7 15 4 -7 -4 -8 -5 -5 6 4 -10 -3 17 8 -6 -8 -8 -14 -10 -11 -7 -11 16 3 -13 5 -7 3 -4 -5 -22 -11 -2 -7 -4 -2 -22
4141b2J1QLKj7K3k1mQPj0KJ4j5RJJJ5plNj7rK6k6%J7JqrLJ9%rlj4K4j3qJ6k4J6
4183hJ1k5J4J2k0qNK1loJ6k7JJ6JPk8K9j5nJ1konJ5J6k2RjPmJk5J7lRnj5J0oJ3
4224BkJ2k3j3%J6pKPOlNj0%Mj7J6QpqJ0mJ2krJ6lk2K3jk0J7kJ0k1l%QJJ3j1lK0
4267A7k6j5PkJ6oJ1J0k5K6j7J4k0PpQlmRljJ8nJ1l4J3LOJ2j4k1J7j2RJ1j5NrO
4306clLJ1Jj1MlpmQjNJ0j1P%mqJ3nNnmJ5lMl4K8nJ0pj6J6j9QJ6k2NqJ9qJ1Pj3
4350Bnj4K3j5J0k7K1qkMj1J4mLnROlj0J5jMLj0mLPRj6lJ1klkRmkLLrJJ0j5J7r
4395Cj6lK9j6Nj2j4JJ8j3L1j3J4k4LKJK%j3K0nRplOlKnJ1Qj7nJ0PJrj0NK7k0J
4437HOoj7K5j9jRoRJ1j4nj0mNMJ6pNnrJ9j6MnpJ2Mj8K6k5RJ1j3lK1j8j1J7P%q
$$ plain form
4141 -22 -11 -3 0 2 -15 8 -13 -17 -9 -2 -12 -10 4 -11 -2 -1 0 15 8 5 10 -7 -16 10 -16 -16 1 2 -6 -15 -12 7 7 -2 -5 -19 5 -8 -16 0 -24 -8
4183 -8 3 -22 -8 4 -16 -24 -19 2 -1 -7 9 -18 -17 -1 0 7 -21 8 -7 -12 -1 -3 -9 -14 1 17 -5 4 3 10 6 7 -18 -1 -4 5 0 -15 -5 -11 2
4224 2 0 12 -11 -24 -24 -8 -15 -13 -6 0 -3 2 -8 -8 -4 -21 -5 3 -4 -12 -2 -6 6 4 -5 11 8 -14 9 8 -12 5 3 13 -8 -11 -11 -3 -2 11 0 -3 17
4267 17 -9 -24 -17 -19 -3 -9 2 12 -13 13 -4 10 -10 -3 -10 -2 -5 -9 0 -3 -4 14 9 20 -14 -1 2 8 20 6 -15 2 -10 -1 10 -5 0 -9 -3
4306 -3 -6 -3 8 9 -2 2 -1 -8 -12 -4 -5 0 10 -1 6 6 2 -6 7 2 7 2 -2 13 10 14 -20 8 3 13 6 -10 6 -13 -5 11 -11 -6 -14 5 -3 8 15 2
4350 2 -3 -17 6 -9 1 -26 -5 -13 -15 -11 -22 -8 -12 -9 -14 -5 1 -2 -12 3 2 6 9 -1 -5 -2 5 14 -2 -5 6 4 1 -1 8 4 2 5 8 -1 0 10 -5 12 3
4395 3 -13 -16 13 -3 2 -10 -24 -23 -5 -18 13 0 14 -10 -7 -5 -4 -2 -2 -15 5 0 9 2 -1 5 2 4 -1 10 18 1 -4 6 13 14 5 -5 0 27 7 8
4437 8 14 8 -9 16 -3 -4 5 -1 8 19 5 0 -10 -14 -9 -5 11 4 9 4 -5 14 -2 2 -3 -10 2 6 -12 14 -11 -2 9 -4 -7 14 -4 -15 2 9 9 1
4479AoJ1qkQJjnLrJ5j3LOj9L0j0mK4l4k1L2LJ4j0j1JJj4J9J8k8J6qNj2jmNORj0
4521AJPkNqmnOlj5J8J8k2LJ1rpK1k5LJ1J4j1j1J3j4RrOPPpjk3K4%nOrJ1ok5J3
4564fJ0Kj7QNJJj0J6j5Nnj1J5PkJ6j0MqKj2pOkQj1KJ7LknkJ2nk2PLJjOk1K7J2
4608B2k7J8j6J4J0j0k3J4j1J9j5QJ1nlQj9PK%k6J5rK6Jk4K0j6J4Kpj2K6j5J9j5
4644C%j3MJ0j8NJ4rJ7JqlJ2ml0L1j6lJj4L7j9J3pOj8J7j0J0k4J4mRj6%K8pj2J6
4683A3PMj9oJ3j1j4K2jMj7RRqkk2lJ7pK0pjj3QJ4J1j6KojJ2j3%OJ1k1J6J3prL
4724A0qJ1j3J1qJ6j3NqmoJ6j8K2rjJ1Kk3KpkJ7Nlk0J7J9lj9NJ5rj6Qj3J5mJ6n
4764A1nKJ2j1j0O%Mk3LJ1MnmOqOJ6oJPrj0oLJJoJ0j0pJ5J2j3qJ0MlJ7qOnk1NR
$$ plain form
4479 1 -5 6 -2 -4 4 5 4 -1 2 -7 8 -5 -2 4 -15 15 5 1 25 -9 -30 2 5 19 9 -2 -1 0 -14 5 23 -5 11 3 8 -4 -5 -9 -4 2 11 1
4521 1 2 9 7 12 4 0 -5 1 -2 -17 1 19 -3 0 11 2 -5 16 -9 -6 5 19 8 -3 10 -4 5 -4 2 9 16 9 8 -15 9 9 4 10 1 12 6 -19 -6
4564 -6 4 6 -11 -3 2 3 4 -6 10 -5 0 -5 -16 -1 6 4 20 10 14 6 8 -4 -11 -5 -7 1 -10 -8 9 12 10 5 3 15 10 -12 -5 -2 -1 -2 4 -17 10 22
4608 22 -5 13 -3 11 21 11 -12 2 -9 10 -5 3 14 9 6 14 -5 2 4 4 -22 -7 -16 10 11 -13 7 -9 5 7 0 -12 14 -1 18 3
4644 3 3 -10 -6 4 -14 -9 5 -4 13 14 6 3 15 11 -19 12 -4 -7 -6 -20 17 -2 11 4 10 -8 9 -1 9 -15 -1 -5 4 -12 -12 16 9 -3 13
4683 13 20 24 5 -1 12 1 -13 9 8 12 -5 4 13 5 3 -19 -22 -5 -12 8 1 0 -13 -5 9 20 4 6 0 -1 11 -2 -2 4 15 -6 10 23 16 7 10
4724 10 2 13 0 11 3 19 6 11 3 -1 -7 9 -9 13 4 3 14 16 -7 -5 -12 -14 3 8 5 -15 2 21 18 -1 4 19 10 -6 2 -11 4 0 16 11
4764 11 6 8 20 9 -1 5 5 9 -14 -11 0 4 -1 -5 1 -7 -1 15 9 10 17 8 -2 -8 -5 -4 -3 -9 1 -9 -16 -1 11 -2 -10 0 4 1 18 10 16 11 -10 -5 4
4809DKmj2J6Mj7QjKPoJ4k2PONolk%Pj4J8j5nnRNlLJ2k0J0%Kjj4J4mk6J3K0oJ6
4853A8k3J8k%qJ7j0j2MJ5pj4OoJ2oKQpPo%J3k3J1j8K1oNj2J4rlL0k2j7Rj6K2l1
4893b6K0J5j2mJ0J2j3M%pMollRNk5K0pJ2Noj2JRjmJ3k3qK7Mr%kPoQOQk6PMoQj9
4939a0K1Kl2K0K0j7PJJ7m2J4PqJ1j6Rj1jQrJ1nKL%jKk1PLPOoJ0j8J1pMP%Kj1P
4982DJkmJ2nLj5J4oOkQj4lJ8j7%Pj7J1K0j4%j4Lq%KKQojK0j0oJ3J6j1j8j3MQJ6
5025A0mjJ3Mkk9J2pJ4j2J4Rk0j8J8Rk4K0lQrqpNJ2j7PJ8k6NJ9JMlmjrJ3nj0PK
5067EpJK7l0OJ6Lk5K2j1JmJ5rkJ1j5J0l1K6Mnj1QqJmJ2k5J7J3rQk1kK0Ln%mj1
5108a0%J1l%KlJ5PRl1%J6j7PjJ4j0J4j8jklMj0J7qJj3J9k2K0LJ2k6rL2j2LpLm
$$ plain form
4809 4 6 2 -10 6 10 -7 1 0 2 9 3 17 -5 2 8 13 7 4 2 2 9 -5 13 -2 -7 -12 -3 2 -1 2 14 -6 4 4 6 5 -9 5 1 -25 -12 8 2 18
4853 18 -5 13 11 11 3 20 10 -2 2 17 10 -4 2 -4 8 2 4 12 5 12 6 6 19 -4 7 -11 10 4 9 -3 11 2 -1 29 7 -10 -1 -17 5 -26
4893 -26 -6 9 -3 -7 3 15 2 6 6 -1 3 -3 -6 -9 0 5 -20 0 -7 5 10 4 -8 -7 2 1 -3 10 -13 -21 6 10 1 1 -1 6 0 8 14 22 -4 3 7 1 9 -10
4939 -10 11 13 -19 1 21 4 11 12 29 -13 1 8 0 11 -5 4 -7 -8 0 -9 2 -3 -1 2 2 1 3 -18 -11 -8 -1 5 -1 9 -9 2 -5 -1 6 6 8 -3 4
4982 4 5 3 -1 11 6 9 -6 8 2 8 6 14 0 -3 15 -2 -2 5 -12 -1 19 5 5 -9 -6 -14 -14 -12 -10 -2 -8 -9 11 1 -5 8 24 13 -5 -18 -14 -6 10
5025 10 6 5 18 22 20 -9 3 -4 10 -2 12 21 1 -17 1 10 -14 6 3 11 2 -6 -13 -8 4 -13 -6 12 -14 -9 10 11 15 12 8 7 -2 11 6 -4 3 5
5067 5 -2 -1 26 -4 2 18 21 -4 18 7 8 4 19 10 8 19 4 14 -17 9 13 8 -3 5 -3 -2 -6 6 -19 -2 11 2 10 -11 -13 7 10 5 5 1 -10
5108 -10 -10 1 -2 -2 0 -3 12 19 28 -3 -3 13 -4 3 2 16 6 20 2 1 -1 -4 0 -10 7 -1 0 -13 6 -16 4 7 19 -7 -16 16 4 7 0 3 -1
5149aJ5orQLj9RkJ8rLJ0j1j4oJ2j1J3mJ5j9j0J2J3j1pK6j1rOj0Nj4K6k6L0j1%
5187Dk%P%lrK1k8nK1KppK3k1QK2k8lR%KJ6j1k7L8j8NQj6%JJPj1kQj5LnJ0lL%O
5232DoOjlj6L1j8jJ5%j4MOj2mK5Nl0LJ5j3J5lk0MJ6jjjqJ0j1J3Kjpqj0J5ROj8
5274cPQpkQj0prK1j3Mj0K1J4k0PNqPpmJ0Ml0j0L0J3j2pLj4K6Mj8KPj4MMpj2KK9
5317A6k1PKkj1MPRj3Oj3J2J5Pj6Oj9K0j1kJ5mk5lJ3j0K0Qnj0Mnj3%J4j8JjJ5p
5357hKQJ0k1RQqKqj6L6j4kQj2QRqoPOKj2J3j2j7JJ1Pj6J0OOqLj1lJ7oOlQj1kj1
5402a2NRj2qNK4j1LqljJ6%Jj4J6oNRj0j7JJ2j0J5l5K2pJ8rj1J3PoKn%j7PJ5Ql
5444HrpK8j7Kj0LQoJknqJ2K4k6Oj3J9kjJ1j3KJ5k0J3rMLnKj5K1j3%j6L0k4MnR
$$ plain form
5149 -1 14 8 -1 7 10 -9 0 -2 16 7 10 20 9 -5 -11 1 -10 3 -1 14 -5 -15 -3 10 -1 -8 18 7 -2 4 -6 -1 -15 11 -15 15 4 4
5187 4 2 2 9 9 6 -3 18 -10 -15 6 8 1 -6 17 -4 4 26 -2 -5 4 4 6 22 11 -16 22 4 9 17 1 1 2 3 10 -1 -3 5 -10 -7 -12 -2 -5 -2 -2 4
5232 4 -2 4 3 0 -16 15 -3 -4 11 11 -3 1 7 -5 -9 16 21 -9 -6 9 -4 11 8 -12 -8 8 7 6 5 -3 7 -4 9 11 10 3 -5 -15 0 9 15 -3
5274 -3 4 12 5 3 11 1 -6 -15 6 -7 -3 -13 8 22 2 9 14 6 13 6 2 12 16 -14 -24 6 19 7 0 3 -11 15 19 1 3 10 -4 0 4 -3 -15 -13 16
5317 16 -5 2 4 2 -9 -5 2 11 -2 4 -9 3 18 25 9 15 -4 16 5 3 18 14 -11 -14 -1 -11 9 17 12 2 6 1 -12 -12 2 -16 -15 -16 -1 -8
5357 -8 -6 2 12 -9 0 8 0 2 -6 -22 14 0 -2 6 -6 2 11 3 -3 4 10 12 0 13 1 -16 -15 -4 3 -13 -3 3 9 1 4 -7 -10 7 1 7 4 12 1 -1 -12
5402 -12 -7 2 -10 -18 -13 11 0 3 -5 -8 -9 7 7 8 -6 10 4 9 18 8 -9 -8 4 -6 9 -26 -4 -11 7 -2 -13 0 7 1 3 -2 -2 -19 -12 3 11 8
5444 8 -1 -8 20 3 5 -5 -2 6 0 1 -1 -6 -14 -2 22 -4 2 -11 8 6 5 16 3 5 20 0 13 4 8 11 6 8 -7 14 1 1 -15 15 -9 -5 -10 -1
5486aj1J6j3JMNj5LnK9jk4J5k1J6J5mKoPJ3rrPqJ4j1j6Pk2K2llJ6k1J6J2rmMk0
5527a2OJjJ5j0LJ2j7J2l4K0lK3l4QJ3KOj7K5kj1mrLJ1j1KnNJ5kk1NJ8nqr%J1r
5568hjLJ0oJ2k4rK9kLJ4k7K6j1k7J5oK5j7pJ6moK1l1kJ2JMnMmQkJJnkk4K0NpJ2
5611Eq%KlrK4j4rPK0nnj6RJJk0mK9j6J7lNmk6K3J5j5j2RMnj2K9k2J5kKmLkJ1k0
5654ej0LkQRj3lQjJ%PmJ4pLMj0j9MJ5kNpLLPk2MK1j9LOj8J1J6kk5K3n%lpK0Jp
5700Hj3kmJ2j2kK4Ok7Rj0K3j6%J6j4lJ4Qj3PjQl0MJ6J3j7Jj5J7KrjRJ3k4K9l5
5739iK0rQlj7K6kj2j1J2JJ1j6PJ0nqrkj7K5LolKJ6j0J0k4K5j8LMjmJ5j4J4l0K7
5779Imj7QpJ9pjJJ3l1K4j4K4j0nl%mK9k5Kj4PpK1j8KJ7Orj4J2%PQj2J1j8Pjjn
$$ plain form
5486 -1 -12 4 -9 -8 -4 1 -14 -11 -16 13 12 -12 3 -18 -2 13 9 11 5 12 25 16 7 14 6 20 9 -7 0 -22 0 -3 -6 10 -11 5 17 8 4 8 -12
5527 -12 -6 -5 -6 9 -1 2 14 -3 9 -25 -5 -8 15 -19 -11 2 4 10 -7 18 16 5 1 -8 -5 6 -5 -3 -8 -3 12 10 -11 -6 12 7 -1 -10 -10 1 -8
5568 -8 -9 -6 4 -2 10 -14 -23 6 4 7 21 -6 20 9 -18 -3 -9 16 -1 -8 8 4 -2 19 -12 -14 -2 -1 3 -2 2 -2 6 4 5 6 1 -1 -25 -5 0 -7 5
5611 5 -3 -3 -1 -4 -13 11 -3 -12 -5 15 10 5 -11 -2 -1 0 -20 -24 5 -11 6 3 8 4 -22 1 16 1 -11 -2 2 -3 -15 14 -8 7 5 7 3 6 4 15 -5
5654 -5 -15 -12 -14 -6 3 -10 -13 -5 -6 -5 -5 2 -2 12 5 8 12 2 -17 -13 2 0 5 -2 1 4 11 -11 -7 14 -5 -2 4 -14 -3 13 11 -14 9 4 4 1 -6 14 15 8
5700 8 -5 -7 -11 1 -11 -13 11 17 -10 -1 -11 12 -4 -4 12 -2 -5 9 17 4 11 10 18 -12 -8 8 21 4 5 -10 7 9 0 -1 8 21 -3 26 -9
5739 -9 11 2 10 7 -10 16 14 2 -9 3 4 15 -1 6 16 11 3 -6 -8 -25 0 3 -3 -6 -4 12 2 12 -12 13 -5 -2 2 1 -3 12 -2 12 -18 9
5779 9 5 -12 -4 -11 8 1 0 1 14 -17 7 -7 17 7 2 -1 -1 -5 24 -1 1 -13 -6 -13 8 -10 -8 9 15 6 -8 4 4 11 19 7 18 0 7 6 5 0
5821@j4J5j2J6J1j0rpJ0lnRq%kJ4Jk4PKKJ5l0RRnj2L1MkLKj1j7JJ2OnnJlNNnJ7
5866A8j6J5q%j6J0npoKJ5j2J6kkJ5k0mmJ7j2j0jNK3qoOJ6j3%mpJ2j2NJ3oj0jJ5
5907A1Lj4J6j4kqOJ1pPj3mkpK7j6j3J7J7j5nPpJ5rJ5j2MqJ2j8JK5j6PmkpJ5jj
5948A1l0J5pJ4qNj6NK0k8MJ7J4j4JJ7k7J3j1ORk2LJ2lmOJ4jj8jkJ4lJj2OJ8k0
5987bQqpJ8lrjK0j2pK3j8mRj4PoQj2lJ4RpjMj2J8knmKj8J7Nj1JplK7Kmj4LoJ7
6032A2k3MJ1JmLLKpoK3k5J3j2%LjJ2j0mJ7nj8LJ1k1K9k0JJ2j3J3Nj6lM0rj6J6
6071B1j0pO%PqqkQJ6oj4K1j6jJqJPJ1l1J0j9K6nj5J7k%RonNJK8l8J7j3J1plJ1
6113A0Oo%j3p%J9JompK9j1rkMmMOj4k0K5pqJ4nMj9J8J2k4J1J4q%kRj7kJ6LnlR
$$ plain form
5821 0 -14 1 -11 5 16 6 -3 -10 0 -3 -8 1 -7 -7 -9 5 6 -18 -11 -9 -7 8 -22 -13 -4 -9 -21 10 14 12 15 17 6 -11 -10 2 8 3 -2 -1 -4 1 6 1 18
5866 18 2 17 9 9 -7 3 -2 -9 -15 -13 2 -10 6 4 2 17 -3 -7 -11 6 -6 -16 -17 -12 11 3 -3 3 19 6 6 2 -5 7 -5 0 13 7 -3 -4 11
5907 11 14 0 16 2 0 -8 -2 9 2 9 -4 -8 -10 -17 10 -6 -19 -2 15 0 -5 2 -5 10 1 16 4 8 0 12 -6 -5 20 4 11 7 5 -2 13 12 11
5948 11 -19 -4 -11 3 -5 0 -16 -11 9 -19 -15 2 16 2 3 20 -7 6 -5 1 10 -12 -9 3 0 -4 2 16 15 -3 -4 -6 8 5 6 -6 0 18 -2
5987 -2 6 -2 -9 9 6 -3 -4 16 4 -3 20 2 -2 7 -7 0 -6 2 -10 -13 1 10 3 2 6 -6 12 10 5 1 3 -15 2 7 -4 -3 -10 -13 14 16 12 -2 1 -5 12
6032 12 -11 -7 4 5 1 4 7 9 2 -4 19 -6 7 -5 -5 -2 -3 9 -1 -5 12 7 -11 -8 3 -18 11 -9 -8 4 -9 4 9 -7 -10 30 21 5 21
6071 21 11 4 10 10 17 9 1 -1 7 23 17 3 24 8 7 8 0 1 8 19 -12 -2 -21 5 0 -15 2 0 0 9 3 -2 3 4 32 -6 11 -2 9 2 -1 10
6113 10 16 10 10 -3 -10 -10 9 10 4 0 -7 22 11 2 0 4 0 4 10 -4 -24 1 -6 -14 0 -5 -1 -20 -2 10 -14 -3 11 3 3 1 10 -7 -9 7 10 5 2 11
6157A1j1%L7l4j1PJ4j1j3J4kj1QKJ1j0mK2k7ONkmJ6mk2J9J9k6kRMk4J2Ml%j2J6
6196Cj8J8onQLoJ3j1LJ3j3qJ6kKrmNrkkQMjj2Oj2KK6k2L3k4moK9j1rPnl%NqJ2
6241DnLJ1j3J4Rk2J9j7mNnQkql%J3j6lkK2Mk9jJ0MjolJ4Pqmlj0J7%jmKj0K%J0
6286bKJ1j4qK2k5J1OLlkJK0l0OoJ3j5pKK4j2jQj3QpoJ4qj0J7Qj6kRNJ2k8PQjj1
6329a0NKj3J5rQjJ3j3J0pJPmmj3K8j0joj0M%jM%J2j4LjmRON%j3kJ1r%MpJ0J3k3
6374eK4k6J3Lk2QqJ4J6k5K4k1J3Nj5mkLj6K0Prj2K2jmj1J2j9K2l0J5Mj1mQkKl
6413a5J5J4k7J8MjRj6j4J9kj1J2kj8J3rJ2Qj9kQMk1K2mj2qMJ0J0J1kk7J8moj0
6451a9J7j2J8pj4J2rK0j3J9j8J4rpPKjOkk3J7rNkkJ2j4J2j4QL%j2J2kj6OK9l4
$$ plain form
6157 11 0 0 37 3 -8 -1 13 2 -11 3 1 -10 -2 0 11 1 -3 19 -8 -2 3 1 -3 13 9 -13 6 25 -1 -3 6 10 -14 -2 2 -1 -1 -13 3
6196 3 -15 3 -3 -8 0 3 -3 10 -1 2 15 2 -6 10 8 10 1 -3 2 -7 -9 -11 -3 1 0 -12 -6 -18 -16 10 -12 21 -3 -7 -13 16 5 -4 3 -2 -5 -5 0 -8 4
6241 4 -1 2 13 0 14 23 1 20 3 -1 4 -1 7 5 -3 -6 -6 7 -9 -12 -14 8 12 -17 -18 -8 -4 -5 -11 -14 0 7 -1 -5 -8 -18 -1 -1 -2 -6 -4 -14 -12 -12 -2
6286 -2 0 11 -3 -11 11 -14 -3 3 6 3 1 2 22 -8 -2 -8 5 -10 -17 -15 9 -3 -4 4 -9 -1 -8 -14 0 -8 -18 -1 7 -9 -11 -2 3 15 -13 -6 2 1 -10
6329 -10 -5 -3 -16 -1 -10 -2 -3 10 -3 7 0 1 8 4 0 -13 15 5 4 -2 -12 -8 -8 -9 -5 -5 7 -7 -4 -5 -9 0 6 11 11 -2 -4 7 -2 -2 2 -5 5 18 -5
6374 -5 19 -7 6 9 -13 -5 -13 1 17 -8 16 -5 8 13 -2 -6 -8 -5 -21 -1 6 -3 -15 7 6 2 -9 3 -16 6 -24 -9 -5 -16 -20 -12 -14 -12 -15
6413 -15 0 14 -13 5 9 8 17 1 -13 6 4 -7 5 3 -15 -2 -11 1 9 -10 -12 -4 0 -21 1 -3 -15 -23 -19 -9 1 12 10 -17 1 -3 -9 -19
6451 -19 -2 -14 4 -3 -17 -5 -14 6 -7 12 -6 8 -1 -8 -1 1 0 6 4 -19 -2 -11 -6 -8 -10 2 -12 0 -14 -6 -3 -3 -15 -3 -5 -21 -15 14 -20
6490b0K4Mj2j3RLmJ8j8J2klJ5j1j0J6j3J0k5J1Rj8JK4Jj9kJnJ3LJnj2k1L3LnR
6529Bk6L1j4MLJ1Kj5LnlPj2K0j8K5k1J5Lj6J7j0pkRj1J6j8J0moK0pk0KK1j2j3
6567a9K4l8J1K5k7L2k4RjlOJ6nj8K2k7J3LlkNmOnNJNloj3QPj0PoQrPMj8KK0k8
6610b3J0jJ1rJ0k0J6Mk1J0K3k2K3j3k6K9kj0Jj3L4Jl%Mk9L7j9J1Lmj6Ljj4J4N
6647CqMj2MLj3RJ0j0MjJ4Jj3%JmoJ4j2J6pj5J3Oj8K4k5K1jpOQmj6J1qrJ3j0J4
6688@rJ6j3NNoj0RJ7j2k8L4k0j5K4prK2j1nK1j8j6J7oJ3J3l3PJ8mJ5rlj8J9mP
6726FnnNnMJjOJ2j5loJ4j9J7j0MoqJ6j3K6j1lkPj8mJ3Mj0lPJ2lJ8k4J6ojJ0k0
6768clmjK6k8K6k9J5LOLKoj8J6j0NQj7pJ9j4kK0Rjk0J1J3l7L3j7k2K0J4Lk8J9
$$ plain form
6490 -20 4 8 -4 -17 -8 -5 -9 9 -9 3 1 -2 13 2 -8 8 -5 5 -20 -9 0 -18 -17 7 8 -11 -13 -12 -17 -4 -1 0 -5 -17 -38 -5 -2 -7 2
6529 2 -24 7 -7 -3 0 11 13 -2 1 -4 -7 0 -12 8 -10 15 -6 9 12 -4 13 3 -4 -6 3 -8 8 -10 0 -4 -10 10 3 -17 -15 6 -6 -19
6567 -19 5 -33 -22 3 -24 8 -16 -7 -8 -11 -5 11 6 -12 10 -17 -4 -1 -4 -6 -1 -5 1 -4 1 2 7 4 -2 -15 -7 0 -10 -3 -9 -1 -10 -3 1 -17 -15 5 -23
6610 -23 -13 -14 -3 -12 -2 -22 -6 -2 -23 -13 10 -12 11 -2 -28 1 -1 -11 -10 -23 11 12 9 9 13 -16 21 2 13 16 12 -4 -1 -2 -16 -2 3
6647 3 -5 -1 -13 -9 -6 -19 -10 0 -10 -6 -7 7 8 -5 -5 -4 -8 -14 0 -12 4 -3 -18 -5 1 -17 7 -18 3 2 -5 1 9 5 -11 0 -8 -17 -4 -14 0
6688 0 -9 7 -6 -1 4 -2 -12 -3 14 2 -26 8 -12 -27 -3 -10 -19 3 -8 -13 8 -10 -26 -9 -15 -2 11 -22 -15 3 -1 14 5 2 -16 3 -1 6
6726 6 1 -4 1 -4 0 1 0 6 18 3 0 -6 8 -11 6 -4 0 -6 -14 2 -11 15 4 1 -1 6 -12 -16 -3 1 -9 -12 -5 7 4 22 -2 14 8 7 17 -3
6768 -3 -6 -10 -11 15 -13 13 -16 -1 2 8 11 13 7 -11 5 -5 0 8 -9 -16 3 -11 -13 7 16 15 -5 6 19 -18 15 -2 -24 -4 10 13 -15 4
6806DmLOj0lK5k2plK0pnjj%mK4j9Rk8J6J3Pj4oJ4j0KKoopJ8JQj8Rj3J0nJ2%Lm
6850Cj3RKpoKNMlJ4mj1L%J0j4K1j9KqlK7k6KJ0j8pJ0KK3j8LKqNKpJ1jj%OJ4j5
6894CJ0j5KPj1J2npKJ2nrKMj2J6%pj4RMj3JkQmQqqJ7OoPkmK0j7KkQj1NMJlmNJ0
6942A6l1J4QRj5j1K6j8rK0qj9K8j5QlmjLj0lJ6ojlQl0M1j2j5J3J0rQ%k5L4Jk1
6981f%NJ3j4Pj2J8Jj4JPj8K2opOj%j7PKjPmoQJ0k4J2PpqKKJoR%nRMKj1J6j2J0
7027Ij0MJMj9J4Pk3KRmJ0j1KjnKQQj1jjK1k4oLLLQpqRj2J4KpJ3j4MPJ2k8qJ5J0
7072Doj3J0J4j0j2L2oj3qRPk5J9j3rRMjJJj5PL%%j0MjQOpQoNomK8j8J2j4J6j3
7115cmJpJ2k1J1J1k4L0j3rJ9lj3mj7K5Kj8L1l5K4Kmr%QMmnOnkJ0J3k4MJ9j0pJ2
$$ plain form
6806 4 0 3 9 -1 -4 21 -1 -8 -11 9 2 -3 -4 -5 -5 -9 15 -4 5 -23 -7 6 13 -1 -7 7 -3 -1 1 -5 -11 -18 0 1 9 -9 0 -13 -3 -8 4 4 7 3
6850 3 -10 -1 1 -6 -12 -10 -5 -1 -4 10 6 -5 -2 -2 8 -6 15 -4 -2 -10 -13 14 -12 -10 0 -18 -25 -15 -13 10 -8 -5 -3 -11 -6 -4 -11 0 -1 -2 -2 4 18 3
6894 3 13 -2 0 7 -4 8 3 -4 -2 10 5 -4 -2 2 -10 6 6 -1 -15 -6 -2 -15 -14 -16 -8 -12 -4 -12 -20 -3 3 -3 4 2 -2 18 1 3 1 9 -2 3 7 8 5 1 6 16
6942 16 -15 -1 7 16 1 -10 16 -2 -11 9 1 -18 10 -5 3 0 -4 -5 -2 -12 -15 1 -5 -6 -9 -1 -31 10 -2 -17 -4 6 -3 5 5 -20 14 15 -6
6981 -6 -6 -1 12 -2 5 -7 11 12 -2 -1 6 -12 10 4 -3 3 2 2 -15 -8 -6 -7 0 -4 -10 -2 8 -16 -4 3 -4 -12 -10 -8 -7 -13 -4 -4 -9 0 4 6 -5 11 -1 9
7027 9 -1 3 4 8 -11 3 10 -13 -11 -2 -6 4 -7 -5 -6 -11 -9 -1 7 -4 -5 -6 15 -9 -15 -12 -9 -6 2 -5 -13 -4 -16 -2 0 -7 6 -8 -4 3 15 -13 -21 -6 4
7072 4 -2 -15 -5 9 -1 -13 19 13 0 -8 1 8 -17 2 -11 -20 -11 -7 -8 -7 -6 -21 -14 -11 -11 -11 -21 -17 -18 -10 -4 -11 -3 -9 -4 -10 -14 14 -4 8 -6 10 -3
7115 -3 -7 -6 -13 -1 -22 -11 0 -24 6 -7 -16 3 0 -13 -17 -34 -9 -7 -25 6 -29 -5 -3 -7 -16 -16 -8 -4 -8 -13 -7 -12 -14 -4 9 -15 -11 8 -2 -9 3
7156Cj5J2mpJ6mqOkj0KpRnoLj2LONk3K8Pj1KJJ3j8K3j7J5j2j0mK0Kj3M%NLJ3j4
7199aMJ0qopMoOOj5kLOpJ6j4oQJ1lpQk7L2j4mQJoNpLpJ0J0k7J5J2Kj9J6kNkOo
7245DoNlorPrJ8m%oj1K2jjjj1QqJNJmJ1qrMJ6oj9K2QqpqPk5L6j1J5j2Jj3J0Kn
7291hLqJ7Nj9NJ9rLjl3J8JjPoNj0J7j0Rkk1LJ6j1mlJ6%mJ4llmpNJ3j5J9j7j3J4
7334clQk2LJ3qQMk2K4k0J5oj1J5onj2J4KJ3kj5MoK1j3jJ4Jj2mLj6L2mkrK2j2o
7375dmNqJ1jj0J4jMk5mK2nJoLKKj5Ojj3K2lK0j7mj0J8k2KJ4JMrPJ4k2NJj1K7k4
7418a4J2kJ3l0K5K1m2J1Jpj1QRLj3%nK6j3jNk2J7j3J1%K1qlKk2KJ5J1k6J5MKm
7457bJ1rRKl1OK7mlpKLj7JM%J8mj6RJ6j9mn%mJ3J1%lk4J8j%oJ6l4J5kJ4oPmJ4
$$ plain form
7156 3 -12 0 -4 -11 5 1 -7 -1 -3 -13 -11 -18 -9 -14 -20 -17 -29 -26 -20 -15 -38 -10 -3 -14 -12 -11 2 -16 7 -10 5 -7 -17 -21 -1 1 -12 -8 -8 -3 0 13 -1
7199 -1 3 13 5 -1 -8 -4 -10 -4 2 -13 -15 -12 -6 -13 3 -11 -17 -9 2 -1 -8 0 -27 5 -9 -13 -5 -4 -10 -5 -12 -9 -16 -6 4 -23 -8 4 6 -13 3 1 6 4 10 4
7245 4 -2 3 0 -6 -15 -8 -17 1 -3 -3 -9 -20 2 1 0 -1 -12 -4 -12 -11 -6 -5 -9 2 -6 -15 -11 5 -1 -20 2 10 2 -5 -13 -6 -31 5 -6 9 -3 -2 -15 -5 -3 -8
7291 -8 -5 -13 4 9 -10 -5 14 5 8 7 -26 -8 -7 -8 -1 -7 -2 -12 5 -5 4 2 -19 -16 0 -11 -15 -18 -2 -2 -6 8 5 2 -2 -9 -4 9 -6 13 -4 -17 -3
7334 -3 -6 2 -20 -17 -4 -12 -4 0 -22 2 -18 -3 -9 -20 -5 -11 -16 -28 -14 -12 1 -1 -16 -12 -18 3 -10 -11 3 4 -8 -12 -9 -25 7 3 1 -8 14 2 -4
7375 -4 -8 -3 -11 0 -1 -11 3 2 6 -19 -23 -1 -6 -5 -11 -8 -6 -4 -19 -13 -14 -27 -5 -8 12 -5 -9 -19 -1 -23 -21 -7 -6 -2 -11 -4 10 -12 -7 -6 -17 10 -14
7418 -14 -2 -4 9 -21 4 25 -17 -6 -5 -12 -23 -15 -6 -3 -16 -16 -21 5 -8 -9 -4 -26 -9 -22 -11 -11 10 2 -1 1 -21 -19 -4 7 -19 -4 0 2 -2
7457 -2 9 0 9 11 -20 -14 13 9 6 -1 1 4 -13 -12 -8 -8 10 6 -10 -1 15 -4 -8 -13 -13 -17 -4 7 7 4 -20 -2 -3 -3 -9 7 -27 -12 -14 0 -6 1 -3 11
7501A1j1L%kJ2kj0lLjJ3j3Nj5J6ooj%j%lL%mRJ2j3qlK2j1ljJ2oJJ2j6k5M2rrK
7545dkK6k7kJ9j0Mj4QRj9J2lqJ9mJk1QK6k7%jJ1jrJ5K1l8K4k5J3Kj3KJ4j4nJ6
7584Cj4PJ3oMMpMj7JJ0lkK2k4J0Pmk1K3p%j1pNQk2J2oLMOMQk2K0MJ1j8l0L2j0
7626fOPLj5J9poM%k0J3RmnPJj1J1l0J8ljNj0joNOj4O%J8jj3kRKj0NJ6j0j0J3J2
7670A0j1J4K2l6MojMoJ6qNnj0jnJ4j4J2J6k6K4j1jk0J3J4mlMqLnokJ8k3JQKOj
7712cjJJ6kl2L7qqLMrLmRj4K7l5J1PlJ5j7krJ5jj0LkJ3qJ5k1nPJ3lk2K7j5jJ9
7754A0j5J2j7J0OJ2rj3K7k9J0Rj5JjJ1mk2J4rMrJ5%p%Rpk1K9j8J2%kJ5oj2j4J9
7793ePp%J2Pj3Qj7J2NJ8l1Pj9K8j9J1%Qqj0J0nLJ3rnkNnlMpPnk1J9lj1J3pJ4L
$$ plain form
7501 11 0 3 3 1 13 11 1 -2 1 0 13 0 5 -10 6 0 -6 -7 -7 -8 -8 -11 -8 -8 -12 -3 9 -4 -12 -15 7 -4 -7 -8 4 -2 -1 11 -5 -30 12 3 -6 -4
7545 -4 -6 20 -7 -9 10 0 4 -10 -2 7 -12 0 -3 -11 8 4 5 -16 -8 18 -9 -9 -10 1 0 -9 6 27 -11 13 -12 1 3 -10 -8 6 -8 -13 3
7584 3 -11 -4 9 3 7 11 4 8 -9 -8 2 -1 -3 19 -5 5 12 8 -13 10 3 3 -8 -15 -10 -2 -24 -12 -18 -15 -11 -5 -1 7 -15 5 9 20 2 -28 4 -6
7626 -6 0 7 10 -5 14 7 1 5 5 -15 -2 7 3 -2 5 6 -5 6 -24 -6 -9 -10 -5 -15 -16 -22 -17 -11 -25 -19 -19 -1 -2 -15 -17 -8 -6 -16 -11 5 -5 -15 -2 10
7670 10 -1 13 35 -1 3 -3 -4 0 -6 10 2 7 2 -8 -9 -14 0 -14 -2 14 -12 12 1 0 -20 -7 7 3 0 4 -4 -1 -6 -12 -14 4 -19 -18 -10 -8 -2 -3
7712 -3 -4 -3 13 11 -21 16 8 0 3 7 -2 1 -3 6 -8 19 -16 -5 2 -1 14 -3 -5 -14 1 0 -10 -7 -9 4 -4 11 -10 -15 -8 5 2 -20 7 -8 -9 10
7754 10 -5 7 -10 0 6 18 9 -4 23 -6 4 13 -2 -1 -2 9 5 -17 -3 -12 -8 -17 -2 -2 -9 -9 0 -7 -28 1 -17 -5 -5 -7 8 2 -10 -24 -5
7793 -5 2 -5 -5 7 14 1 9 -8 4 9 27 -4 3 -16 12 -7 4 4 12 4 -6 4 -1 2 15 6 1 -1 4 -1 -4 0 -7 0 -5 -26 -7 -10 -21 -8 -15 -1 2
7836BOpj6RJ4j5J5j1nRpJNmNmNoKJmPKQj3K0k0Km%lOk0K2j6J3k0J5NjMj1jJ5j1
7881fkJJ2Jj2J8j2nK6j0J4j4pj0OnJ8jrLj3%K1j6j7J2mqJ5rrjQJ1mQqpRJOKJ0
7924A3njnkRj6KJ5lj3MOQokOj2k8K9%j1MRnRjPLj5OJ3j3k5LJ6j0j8L0k6K1Jj9
7966b2K2Pj7LK1j4Nj4RlmOJ7k4NmRkJ4k0J0%pOK3k3qMK2l3jJ2j1nnK1k0K8j0k
8006eJ2j1Qj8K1kpJ1j5jJqJ5MOrNQk7RJmnQ%KpJ0J2j9j4L6j6mpJ6k0oJ8j9J6l
8048hJ1j5LK0k2qK9k0oQj2RJ7j9J4mJ6k6J6kPj3J5jnJ1j6KJkNLk0mPROj0RJ1j0
8089FlkJ2k1MJ2k4J2jJ8j1jrJ9j4jJ6j0PqLjMj6J6j5QjLkRKk3PPKJ2j4j7NpJ0
8131gPnKKk2K1j4KlNLj8M3k3RKjJj7J8lj3J6qkLrKPJ0lmlJjj6%J3nJ1rqj4M0o
$$ plain form
7836 2 8 1 -15 -6 8 -7 8 -3 -8 1 -6 -5 0 -4 1 -3 2 -4 -2 -1 -5 2 4 12 -1 19 -1 1 -3 -3 -6 0 -20 2 -14 -1 -21 -6 -1 -2 2 -9 -10 5 -6
7881 -6 -8 -7 5 6 -6 12 0 -5 21 11 25 11 4 -6 0 -5 13 12 3 6 -7 -7 14 -2 -19 -7 -11 -19 -4 -13 -22 -23 -15 -4 -8 0 -8 -15 -6 -5 1 3 13
7924 13 8 7 2 0 9 -7 -5 10 7 -6 -2 4 12 6 4 10 -2 -30 -1 -1 -12 -8 1 -4 5 4 11 14 -1 5 18 5 -20 -17 -1 -11 -29 1 -25 -4 -3 -22
7966 -22 0 7 -10 -7 14 0 5 -9 0 -3 -7 -1 16 -8 -3 -7 2 0 14 -6 4 4 -3 3 26 3 -5 -1 21 -12 -13 -1 -12 -17 -22 -1 -21 7 -3 -5
8006 -5 7 -4 4 -14 7 5 -2 9 -6 -7 -6 -14 1 5 11 2 7 15 -12 -3 -2 -6 -11 -3 -3 -1 -8 2 14 -5 -19 17 1 -3 -10 6 -14 -20 -2 -21 -5 -8
8048 -8 3 -12 -9 11 -11 -19 10 -10 -16 -8 -20 -11 6 -13 1 -3 13 -13 3 1 8 -5 10 9 4 15 -1 1 2 0 5 8 -12 -16 -9 0 6 -4 5 16 6
8089 6 3 1 13 -8 -4 8 -16 -4 -5 13 2 1 -8 11 -3 -4 12 2 9 1 4 3 7 -9 7 -8 0 -1 2 0 9 11 -12 -5 2 4 16 2 -15 -10 -17 -7
8131 -7 0 -5 -3 -1 -23 -2 -16 -14 -17 -12 -9 -27 16 -7 2 4 3 4 -13 5 2 -11 5 -3 -5 -2 -11 -9 -2 8 5 1 -2 -1 -2 -18 -18 -5 -10 1 -8 -16 -30 10 4
$$ [...]
8191C
##END NTUPLES=NMR FID
##END=
