##TITLE=1H_ES-ZC-MeOH
 
 8 sc, 
 18.1.2023
##JCAMPDX= 6.0         $$ Bruker NMR JCAMP-DX V2.0
##DATA TYPE= NMR FID
##DATA CLASS= NTUPLES
##ORIGIN= UXNMR, Bruker Analytische Messtechnik GmbH
##OWNER= root
$$ XWIN-NMR		Version 3.5
$$ Wed Jan 18 16:26:02 2023 Russian Standard Time (UT+4h)  she@DPX200
##.OBSERVE FREQUENCY= 200.13135
##.OBSERVE NUCLEUS= ^1H
##.DELAY= (6, 6)
##.ACQUISITION MODE= SIMULTANEOUS
##.ACQUISITION SCHEME= undefined
##.AVERAGES= 8
##.DIGITISER RES= 18
##SPECTROMETER/DATA SYSTEM= spect
##.PULSE SEQUENCE= zg30
##.SOLVENT NAME= CDCl3
##.SHIFT REFERENCE= (INTERNAL, CDCl3, 0, 15.7039)
##AUDIT TRAIL= $$ (NUMBER, WHEN, WHO, WHERE, WHAT)
$$ ##TITLE= Audit trail, XWIN-NMR		Version 3.5
$$ ##JCAMPDX= 5.01
$$ ##ORIGIN= Bruker BioSpin GmbH
$$ ##OWNER= she
$$ F:/spectra/data/she/nmr/H-F/1/audita.txt
$$ ##AUDIT TRAIL=  $$ (NUMBER, WHEN, WHO, WHERE, WHAT)
(   1,<2023-01-18 16:25:12.95 +0400>,<she>,<DPX200>,
      <created by zg, POWCHK disabled, PULCHK disabled
       configuration hash MD5:
       00 E9 B6 7A A2 85 ED C7 34 08 36 98 17 FE 4E 26
       data hash MD5: 16K
       05 83 63 C7 81 43 6A 8D B2 92 61 93 94 3C 07 4B>)
$$ ##END=
$$ 
$$ hash MD5
$$ A6 03 B5 F2 37 46 2A CF 27 A9 82 CE EB 10 67 72
##$RELAX= 
##$RELAX= 
##$RELAX= 
##$RELAX= 
##$RELAX= 
##$RELAX= 
$$ Bruker specific parameters
$$ --------------------------
##$DU= <F:/spectra>
##$EXPNO= 1
##$NAME= <H-F>
##$PROCNO= 1
##$TYPE= <nmr>
##$USER= <she>
##$AMP= (0..31)
100 100 100 100 100 100 100 100 100 100 100 100 100 100 100 100 100 100 
100 100 100 100 100 100 100 100 100 100 100 100 100 100 
##$AQSEQ= 0
##$AQ_mod= 1
##$AUNM= <au_zg>
##$AUTOPOS= <>
##$BF1= 200.13
##$BF2= 200.13
##$BF3= 200.13
##$BF4= 200.13
##$BF5= 200.13
##$BF6= 200.13
##$BF7= 200.13
##$BF8= 200.13
##$BYTORDA= 1
##$CFDGTYP= 0
##$CFRGTYP= 5
##$CHEMSTR= <none>
##$CNST= (0..31)
1 1 145 1 1 1 1 1 1 1 1 1 1 1 1 1 1 1 1 1 1 1 1 1 1 1 1 1 1 1 1 1 
##$CPDPRG= <>
##$CPDPRG1= <>
##$CPDPRG2= <>
##$CPDPRG3= <>
##$CPDPRG4= <mlev>
##$CPDPRG5= <mlev>
##$CPDPRG6= <mlev>
##$CPDPRG7= <mlev>
##$CPDPRG8= <mlev>
##$CPDPRGB= <>
##$CPDPRGT= <>
##$D= (0..31)
0 1.2 0 0 0 0 0 0 0 0.06 0 0.03 0 0 0 0 0.0002 0 0 0 0 0 0 0 0 0 0 0 0 
0 0 0 
##$DATE= 1674044712
##$DBL= (0..7)
120 120 120 120 120 120 120 120 
##$DBP= (0..7)
150 150 150 150 150 150 150 150 
##$DBP07= 0
##$DBPNAM0= <>
##$DBPNAM1= <>
##$DBPNAM2= <>
##$DBPNAM3= <>
##$DBPNAM4= <>
##$DBPNAM5= <>
##$DBPNAM6= <>
##$DBPNAM7= <>
##$DBPOAL= (0..7)
0.5 0.5 0.5 0.5 0.5 0.5 0.5 0.5 
##$DBPOFFS= (0..7)
0 0 0 0 0 0 0 0 
##$DE= 6
##$DECBNUC= <off>
##$DECIM= 32
##$DECNUC= <off>
##$DECSTAT= 4
##$DIGMOD= 1
##$DIGTYP= 9
##$DL= (0..7)
0 120 120 120 120 120 120 120 
##$DP= (0..7)
150 150 150 150 150 150 150 150 
##$DP07= 0
##$DPNAME0= <>
##$DPNAME1= <>
##$DPNAME2= <>
##$DPNAME3= <>
##$DPNAME4= <>
##$DPNAME5= <>
##$DPNAME6= <>
##$DPNAME7= <>
##$DPOAL= (0..7)
0.5 0.5 0.5 0.5 0.5 0.5 0.5 0.5 
##$DPOFFS= (0..7)
0 0 0 0 0 0 0 0 
##$DQDMODE= 0
##$DR= 18
##$DS= 0
##$DSLIST= <SSSSSSSSSSSSSSS>
$$ [...]
##$SUBNAM2= <"">
##$SUBNAM3= <"">
##$SUBNAM4= <"">
##$SUBNAM5= <"">
##$SUBNAM6= <"">
##$SUBNAM7= <"">
##$SUBNAM8= <"">
##$SUBNAM9= <"">
##$SW= 18.05172834244
##$SWIBOX= (0..15)
0 0 2 0 0 0 0 0 0 0 0 0 0 0 0 0 
##$SW_h= 3612.71676300578
##$TD= 16384
##$TD0= 1
##$TE= 0
##$TE2= 300
##$TE3= 300
##$TEG= 300
##$TL= (0..7)
0 120 120 120 120 120 120 120 
##$TP= (0..7)
150 150 150 150 150 150 150 150 
##$TP07= 0
##$TPNAME0= <>
##$TPNAME1= <>
##$TPNAME2= <>
##$TPNAME3= <>
##$TPNAME4= <>
##$TPNAME5= <>
##$TPNAME6= <>
##$TPNAME7= <>
##$TPOAL= (0..7)
0.5 0.5 0.5 0.5 0.5 0.5 0.5 0.5 
##$TPOFFS= (0..7)
0 0 0 0 0 0 0 0 
##$TUNHIN= 0
##$TUNHOUT= 0
##$TUNXOUT= 0
##$USERA1= <user>
##$USERA2= <user>
##$USERA3= <user>
##$USERA4= <user>
##$USERA5= <user>
##$V9= 5
##$VALIST= <valist>
##$VCLIST= <CCCCCCCCCCCCCCC>
##$VD= 0
##$VDLIST= <DDDDDDDDDDDDDDD>
##$VPLIST= <PPPPPPPPPPPPPPP>
##$VTLIST= <TTTTTTTTTTTTTTT>
##$WBST= 1024
##$WBSW= 4
##$XGAIN= (0..3)
0 0 0 0 
##$XL= 0
##$YL= 0
##$YMAX_a= 833499
##$YMIN_a= -637102
##$ZGOPTNS= <>
##$ZL1= 120
##$ZL2= 120
##$ZL3= 120
##$ZL4= 120
##$ABSF1= 10
##$ABSF2= 0
##$ABSG= 5
##$ABSL= 3
##$ALPHA= 0
##$AQORDER= 0
##$ASSFAC= 0
##$ASSFACI= 0
##$ASSFACX= 0
##$ASSWID= 0
##$AUNMP= <proc_1d>
##$AZFE= 0.1
##$AZFW= 0.1
##$BCFW= 1
##$BC_mod= 2
##$BYTORDP= 1
##$COROFFS= 0
##$CY= 11.3945322036743
##$DATMOD= 1
##$DC= 2
##$DFILT= <>
##$DTYPP= 0
##$F1P= 2.36226072786647
##$F2P= -0.459571619588291
##$FCOR= 0.5
##$FTSIZE= 0
##$FT_mod= 4
##$GAMMA= 1
##$GB= 0.15
##$INTBC= 1
##$INTSCL= 1
##$ISEN= 128
##$LB= 0.24
##$LEV0= 0
##$LPBIN= 0
##$MAXI= 10000
##$MC2= 0
##$MEAN= 0
##$ME_mod= 0
##$MI= 1.114404
##$NCOEF= 0
##$NC_proc= 0
##$NLEV= 6
##$NOISF1= 3.799351
##$NOISF2= 2.8
##$NSP= 1
##$NTH_PI= 0
##$NZP= 0
##$OFFSET= 15.70392
##$PC= 1
##$PHC0= -19026.5
##$PHC1= 12.20073
##$PH_mod= 1
##$PKNL= yes
##$PPARMOD= 0
##$PSCAL= 0
##$PSIGN= 0
##$REVERSE= no
##$SF= 200.130013532006
##$SI= 16384
##$SIGF1= 3
##$SIGF2= 2
##$SINO= 400
##$SIOLD= 16384
##$SREGLST= <1H.CDCl3>
##$SSB= 0
##$STSI= 0
##$STSR= 0
##$SW_p= 3612.71676300578
##$SYMM= 0
##$S_DEV= 0
##$TDeff= 0
##$TDoff= 0
##$TI= <>
##$TILT= no
##$TM1= 0
##$TM2= 0
##$TOPLEV= 0
##$USERP1= <user>
##$USERP2= <user>
##$USERP3= <user>
##$USERP4= <user>
##$USERP5= <user>
##$WDW= 1
##$XDIM= 8192
##$YMAX_p= 0
##$YMIN_p= 0
$$ End of Bruker specific parameters
$$ ---------------------------------
##NTUPLES= NMR FID
##VAR_NAME=  TIME,          FID/REAL,        FID/IMAG
##SYMBOL=    X,             R,               I
##VAR_TYPE=  INDEPENDENT,   DEPENDENT,       DEPENDENT
##VAR_FORM=  AFFN,          ASDF,            ASDF
##VAR_DIM=   8192,          8192,            8192
##UNITS=     SECONDS,       ARBITRARY UNITS, ARBITRARY UNITS
##FACTOR=    0.0002768,     1,               1
##FIRST=     0,             0,               0
##LAST=      2.2672688,     0,               0
##MIN=       0,             -637102,         0
##MAX=       2.2672688,     833499,          0
$$ Real data points
##PAGE= N=1
##DATA TABLE= (X++(R..R)), XYDATA
0@%%%%%%%%%Qj1J1j6J6j6K4l2L6m4N6p2Q4j00J20j36J56j84K12k43K79l19L66
32A95m15M68n26N92o66P44q33R32j035J150j278J414j562J728j906K096k310K549
50A337k808L093l411L763m158M605n115N700o381P187q153R341j0846J2816j5522
65h552J9490k5875L7845o7908K84682N93817m47907o81663j48364N08892L22697
76C87154l32984n84968Q803O47467N37816k26111o49872k66001L97792M40756
86C59852j33799n37469j88747M47962N48470l8874n50887l60797K57478M76065
96B79254M1176m45776l15426K57498N18871J15435m26592m16722J13331M55901
106A76950J78131l30712l82332Q9051M56675K31024k91735m32651j9932L93941
$$ y = [0, 0, 0, 0, 0, 0, 0, 0, 0, 0, 8, -3, 8, -8, 8, -8, 16, -16, 20, -24, 32, -40, 44, -56, 64, -72, 84, -100, 112, -131, 148, -171, 195, -220, 248, -278, 314, -352, 392, -441, 491, -544, 606, -672, 742, -820, 908, -998, 1098, -1212, 1337, -1471, 1622, -1789, 1974, -2184, 2421, -2694, 3006, -3375, 3812, -4341, 5000, -5846, 6970, -8552, 10938, -14937, 22908, -45000, 239682, 833499, 385592, -296071, -444435, 64457, 387154, 54170, -530798, -521995, 125472, 663288, 437177, -212695, -478696, -80904, 359852, 226053, -311416, -500163, -52201, 496269, 457395, -93492, -454289, -196811, 279254, 320430, -125346, -440772, -183274, 335597, 451032, 24440, -392282, -278951, 176950, 355081, 24369, -357963, -268912, 187763, 418787, 127052, -305599, -325531, 68410]
116F8410K73310k03901l95818n2000L65817L03044j55016m06599j30617L00180
126c3190L22532p7842l61845j57618K55627L29207k9541l45317k08367J91847
136a14507L28230L2262k95605k24180J43426L17722P2242k65007k51985Q7028
146a70374L02939J17816k15836k56984M2281K82040J47365j79833k67667n023
156b03276K58516J78352j33190k62680m3465K30061J96778r5428k58846q0966
166b14144J99404K13212n2117k43093j10540J65097K18698j6172k26153j36190
176b01998J30014K20378K0700k01171j54068R4031K13472N0348j75621j67148
186a71063N9731K03453P8007j46374j73933K7127J88320R9240j18441j76847k454
$$ y = [68410, 341720, 137819, -257999, -309999, 55818, 358862, 203846, -202753, -333370, -33190, 289342, 211500, -150345, -307963, -52336, 276871, 247330, -97987, -306354, -114507, 213723, 245985, -49620, -273800, -130374, 187348, 259590, -5417, -257402, -170374, 132565, 250381, 34545, -222439, -180158, 101882, 249247, 69414, -198253, -203276, 55240, 233592, 100402, -162278, -205743, 24318, 221096, 125668, -133178, -214144, -14740, 198472, 146355, -96738, -207278, -42181, 176517, 160345, -65808, -201998, -71984, 148394, 169094, -32077, -186145, -92114, 121358, 171706, -3915, -171063, -111332, 92121, 170128, 23754, -150179, -123052, 65268, 164508, 46067, -130780, -133234]
197a33234J71875J17841q9568j75532k9489J52752J31225o2540j71353n3415J33045
208h393J41976l5716j63727p4516J11327J48017j0623j53094r2195Q9078J50526
219A02660J3309j39174j06260O5647J48380L4740j22544j16156M2559J42481N3670
230A19312j03730j21992K0010J32870O9268q3866j23968q41J20899Q1812o3640
241D6134j22792j9857J07090R1195m4001j19074l6584R2541R8052k5224j13461
252d5981n1298P7342J02428p496j06099o3834O1929J04603R086r7214p4265M6149
264d4650J04357K4411q6626q2250L0354J01516L8143p4495q7537J4710R6030M9901
276H3864o1051q9965k71Q8186N9352m6828q9592j4058P8459O6294l2514q6752
$$ y = [-133234, 38641, 156482, 66914, -108618, -138107, 14645, 145870, 83330, -88023, -141438, -8393, 133583, 97867, -65860, -140376, -29049, 118968, 108345, -44749, -136944, -47866, 102660, 115969, -23205, -129465, -63818, 84562, 119302, -3242, -119398, -76839, 65642, 119312, 15582, -106410, -86400, 46470, 115738, 31872, -92096, -92937, 27962, 109774, 46134, -76658, -96515, 10575, 101770, 57769, -61305, -97889, -5348, 92704, 67480, -45981, -97279, -19937, 82491, 74995, -31104, -94938, -33009, 71594, 80680, -16534, -90799, -44650, 59707, 84118, -2508, -84758, -54404, 47112, 85255, 10760, -76777, -62067, 33963, 83864, 22813, -67152, -67423, 20763, 80115, 33287, -56305, -70363, 8096, 74390, 41876, -44876]
288d4876k6235O7472P0942j8624q2082l6734N5900P3538n588p5983m5478M4216
300b3532P4407O435o9012n2663L2700P3874J7387o1263n8332K1360P1969K7224
312F0554n2850o2395J0348O8601L5887m3740o4803k71O3778M3065l4001o5263
324d1090j0283N7392M8572k3914o3801j9225M9772N2257j3864o0543k6963M1278
336a0412N4097m201n5842l3275L2383N4353M636n0148l8202K3594N3320J2623
348D2926m3931m1850J5071N1302J9629l7391m4410P013M8543K5681l0702m6013
360c4132n29M5117L0844k3879m6549p627M0868L5019j6927m5988j4111L5957L8056
373C6119r995m4191j9851L0278L9823l076m1283k4581K4084M0255L327l7275k8231
$$ y = [-44876, -71111, -3639, 67303, 48679, -33403, -70137, -14237, 59301, 53713, -22270, -67748, -23532, 50875, 57310, -11702, -64365, -31665, 42209, 59596, -1667, -59999, -38639, 33330, 60554, 7704, -54691, -44343, 24258, 60145, 16405, -48398, -48669, 15109, 58174, 24173, -41090, -51373, 6019, 54591, 30677, -33124, -52349, -2577, 49680, 35816, -24727, -51690, -10412, 43685, 39484, -16358, -49633, -17250, 37103, 41739, -8409, -46611, -23017, 30303, 42926, -1005, -42855, -27784, 23518, 43147, 5756, -38654, -31641, 16902, 42583, 11881, -34132, -34661, 10456, 41300, 17421, -29128, -36755, 4113, 39132, 22205, -23783, -37894, -1937, 36119, 26124, -18067, -37918, -7640, 32183, 29107, -12176, -36757, -12673, 27582, 30909, -6366, -34597]
386c4597J7613L9535R171l2566l0832J1279L7775J4256k7500l2360N239L5321
398A2334J8513k2293l3153l27L2411K2110j7145l3292n418K9215K4979j2109l2840
411a7015j0045K5744K7235p224l1809j4195K1930K8794k379l0100j7835J7803
423i096K9557K245k7691k0765J3377K9426O593k4608k2956Q808K8437J0418k0918
436B827k4253M291K6670J3686j7026k4787M2K4321J6305j2938k4670l888K1674
449B254J8316q989k4033p322J8778J9838n233k3051j0345J5817K0891j650k1776
462f505j2972J2824K1503J695k0142j5229R746K1651M863j8182j7014O560K1247
475A0045P732j5778j8239L364K0246J0248j3076j8847K58J8671J2306j0121j8829
$$ y = [-34597, -16984, 22551, 31722, -844, -31676, -20397, 17378, 31634, 4134, -28226, -22987, 12334, 30847, 8554, -24599, -24926, 7485, 29595, 12450, -20842, -26260, 2955, 27934, 15825, -17015, -27060, -1316, 25919, 18695, -13114, -27309, -5379, 23415, 21036, -9064, -26899, -9096, 20461, 22706, -4985, -25750, -12373, 17053, 23646, -962, -23918, -15110, 13327, 23745, 2827, -21426, -17135, 9535, 23221, 6195, -18592, -18550, 5771, 22076, 9138, -15532, -19420, 2254, 20570, 11581, -12452, -19774, -996, 18842, 13609, -9442, -19787, -3970, 16921, 15271, -6505, -19477, -6653, 14850, 16545, -3597, -18826, -9080, 12571, 17434, -748, -17762, -11202, 10045, 17777, 1999, -16240, -12876, 7370, 17618, 4542, -14305, -14047, 4624, 16930, 6809, -12020]
488a2020k734J6670J3837p073j8316n328J4382J4882m142j7380p602J1995J5507
501A2678j375j6169r530R562J5773J159j4802j1065P186J5787L516j3315j2392
514a2987M856J5554N625j1634j3425K565J4974P552r802j4023K51J4098R206p792
528E018j4269j923J2793J0485n581j4053l925J1165J1344l325j3402n727R338
541b062J1858j188j2408p174P320J1968Q35j1172q306N377J1780K622r819r187
555i556L488J1430M216q460r815J742J0874N594p039j0245P9J0236O780n603j0458
570f737j511R401P787m079j0459k973Q382Q525k557j0139m269P124R039j023r529
585c018n399N745R155N01q667o273M267R001J866p574o927K802Q643L092o439
$$ y = [-12020, -14754, 1916, 15753, 8680, -9636, -14964, -582, 14300, 10158, -7222, -14824, -2829, 12678, 11303, -4866, -14396, -4834, 10939, 12098, -2704, -13769, -6583, 9204, 12720, -595, -12987, -8131, 7423, 13048, 1414, -12011, -9446, 5528, 13080, 3278, -10745, -10494, 3604, 12810, 5018, -9251, -11174, 1619, 12104, 6523, -7530, -11455, -290, 11054, 7729, -5673, -11400, -2062, 9796, 8608, -3800, -10974, -3654, 8314, 9149, -2023, -10329, -4952, 6828, 9450, -369, -9556, -6068, 5362, 9578, 1118, -8697, -6955, 3919, 9513, 2474, -7771, -7692, 2544, 9324, 3721, -6737, -8248, 1153, 8940, 4861, -5598, -8571, -189, 8336, 5779, -4360, -8629, -1505, 7534, 6511, -3018, -8417, -2672, 6483, 6984, -1683, -7956, -3689, 5312, 7178, -396, -7323, -4521, 4122, 7214, 775]
600G75p328J410Q127M059n243p537Q9P528M944m097p627j080O824N645k966p602
616d079k140O095O207j875p428l121N267O654p66p126l988M351O902K92o596m725
632f076L340O912J316n907n282K305O682K263n069n594J170O315L039m119n747
647d452J77N766L700l176n760p57N142M215k229n645j595M516M567j341n467k298
663d637L841M873n56n198k934L173N047K49m856l507K499N132R89m442l970J753
679b544N094J691l927m259R91M849K315l285m443K47M525K824k568m511m91M092
695F00L209j830m371j181L539L492j101m159j714K951L639m29l891k196K381L747
711B686J65l577k574J803L769P39l257k909J268L766J252k906l193P75L637J711
$$ y = [775, -6553, -5143, 2984, 7043, 1800, -5737, -5648, 1880, 6824, 2727, -4900, -5980, 844, 6489, 3523, -4079, -6219, -124, 6083, 4208, -3220, -6341, -1074, 5580, 4814, -2312, -6300, -1949, 4953, 5245, -1351, -6076, -2736, 4176, 5492, -415, -5697, -3392, 3290, 5553, 484, -5110, -3940, 2375, 5414, 1295, -4452, -4275, 1491, 5191, 2015, -3745, -4502, 640, 4855, 2626, -3019, -4614, -98, 4469, 3128, -2339, -4637, -796, 4077, 3521, -1677, -4611, -1438, 3609, 3858, -998, -4505, -2006, 3126, 4115, -327, -4297, -2544, 2550, 4241, 314, -3945, -2954, 1895, 4210, 925, -3518, -3271, 1254, 4078, 1510, -3001, -3492, 600, 3809, 1979, -2392, -3573, -34, 3458, 2357, -1802, -3516, -565, 3074, 2645, -1246, -3442, -1061, 2686, 2851, -726, -3300, -1497, 2272, 3011, -246, -3155, -1887, 1879, 3131, 225, -2968, -2193, 1444, 3155]
727C155k481l345K12L453K111k008l438l09L172K449j498l383q34K777K687r37
743A783l268j239K353K796m15l026j620J862K869O1k714j931J390K822N21k444
759b00k120R47K740R15k113k317N23K651J263j786k431J30K504J558j454k513
775a703k72K365J798j113k524o11K104K021p33k489r13J807K145l68k342j224
791b052J494K202Rk143j456J142K157L56j865j622P69K062O71j605j721M10J965
808G73R28j327j799J08J831J115j041j826j91J676J332p99j818m41J500J477n28
825I70j803p08J343J581k82j745q94J132J667j7j647j091R01J645K58j467j224
842a381O27J622M62j287j311L80J510O64j025j367R9J412Q39q24j366j11J258
$$ y = [3155, 674, -2671, -2459, 994, 3105, 1097, -2341, -2650, 522, 2971, 1473, -1910, -2744, 33, 2720, 1783, -1485, -2724, -371, 2425, 2010, -1016, -2636, -774, 2095, 2156, -558, -2489, -1099, 1723, 2244, -200, -2320, -1373, 1367, 2282, 169, -2148, -1625, 1026, 2289, 503, -1928, -1798, 706, 2264, 810, -1703, -1975, 390, 2188, 1075, -1449, -2060, 44, 2065, 1332, -1157, -2070, -263, 1882, 1514, -828, -2052, -558, 1644, 1653, -490, -1946, -804, 1353, 1709, -156, -1778, -1009, 1053, 1724, 119, -1602, -1192, 773, 1701, 374, -1425, -1317, 514, 1629, 588, -1238, -1429, 247, 1579, 780, -1038, -1479, 21, 1498, 970, -833, -1541, -198, 1383, 1101, -644, -1538, -406, 1261, 1244, -403, -1494, -593, 1052, 1310, -157, -1381, -754, 868, 1330, 43, -1268, -888, 622, 1286, 261, -1106, -1007, 405, 1244, 420, -946, -1057, 201]
859B01R80o02j358l30J115J072l80j316m97R81J141j91j259o66Q11J207j3j178
877b82q23O61J223K05j131q97M69J236L60j000j001K94J212N03q36j083J44J090
895C44O31o78j059n8R97P45m82j056k28Q63Q14l06j008l75P45Q70j74r21m78N84
915b30Q90Qq62o02M64R08J17p81o73L39R06K66p37p51K31Q92L86o32q05O8Q63
936B65M86n43q15j9P86N64m05q15j72P10O39k74p91k74N88O66j47p34l53M78O76
957E16j9o59m36L56O74J07o00n10K68O60J97n41n40J75O27K67m32o07Q6O23L32
978E44l67o14k1N75M19k87o56r6N48M59k07o12k00M87M93j29n91k60M06N13j6
999C88n48l30L05N34N6m73l75K25M84J37l99l93J15M97J90l31m31N3M51K48k79
$$ y = [201, 1181, 579, -779, -1109, 6, 1078, 698, -618, -1115, -134, 1007, 816, -443, -1109, -298, 909, 896, -282, -1105, -444, 779, 984, -147, -1044, -575, 661, 1021, 21, -980, -686, 526, 1029, 193, -890, -746, 344, 975, 297, -762, -820, 177, 922, 440, -616, -844, 19, 833, 527, -481, -856, -111, 759, 585, -336, -814, -230, 660, 668, -194, -796, -332, 576, 693, -88, -761, -422, 484, 750, 13, -738, -507, 385, 771, 139, -666, -598, 265, 751, 208, -607, -626, 160, 724, 319, -496, -668, 42, 681, 407, -384, -658, -70, 596, 449, -285, -638, -160, 516, 497, -162, -598, -242, 432, 539, -61, -571, -303, 357, 554, 13, -527, -352, 275, 542, 110, -497, -411, 212, 544, 177, -437, -458, 117, 536, 249, -407, -503, 45, 504, 297, -315, -515, -28, 465, 336, -255, -515, -109, 404, 388, -160, -490, -185, 349, 405, -68, -443, -218, 266, 403, 4, -389, -274, 223, 413, 82, -349, -296, 155, 403, 124]
1020A24m45k4M54K91k24m57p7L87L45j69m43j57L81L63r5m31k11L07M12n3m18
1041a40k37K27M48K5m02k67J96L75R6l51k96J41L75J44k96l22M5L69J83k02l45
1062b34j6L33K20j83l20o8K85K65j19l36j11K43L10r3l32j29K16L15m1k92k11
1083b98K04K99M0l01k13J37L17R3k97k38J19K95J07k13k84N3K78J67k05k53pK55
1105E5J85j34k78m8K45J97q3k59r9K05K20n2k48j42J95K30k8k58j21J35K38K0
1127A75k18j74J13K19Q7k14j96R0K38J05k00k02M3K47J07j76j88mK14J36j41j99
1149a38l0J86J55q3k17n1J69J69n4j97p4J33J75j6j98j11J27J73Nj51j33Q2J78
1172I9J8j21j33L4K10M5j41j45M2J62J01j25j45pJ44J34j04j67m8J67J41q1j67
$$ y = [124, -321, -345, 109, 400, 176, -281, -358, 29, 374, 205, -238, -395, -14, 349, 254, -177, -388, -81, 331, 278, -140, -377, -150, 298, 323, -79, -346, -150, 225, 321, -30, -326, -185, 190, 334, 38, -284, -239, 130, 313, 111, -234, -250, 83, 303, 120, -200, -268, 17, 282, 163, -173, -284, -41, 269, 176, -156, -285, -69, 246, 205, -87, -298, -94, 205, 245, -56, -269, -132, 185, 278, -19, -257, -138, 157, 264, 51, -233, -180, 98, 265, 60, -193, -200, 55, 240, 106, -172, -220, 25, 222, 139, -120, -219, -14, 206, 154, -94, -236, -41, 189, 161, -97, -218, -83, 155, 175, -43, -217, -104, 115, 202, -12, -208, -118, 120, 225, 25, -177, -134, 113, 220, 44, -144, -148, 66, 202, 61, -138, -168, 18, 173, 90, -127, -178, -9, 160, 106, -91, -165, -32, 143, 127, -71, -182, -55, 118, 123, -28, -161, -79, 99, 117, -4, -137, -103, 107, 152, 11, -134, -92, 70, 171, 46, -99, -106, 38, 172, 68, -99, -147, 20, 161, 80, -87]
1195h7l9J29J26m9j63n7J25J35l2j43p9J05J21j2j11r1P2J41Rj20p9L0J22P1j16
1220Hj06L1J12Q2j10j12J5J12Q6p1j26mJ10R5p6j13k1R4Q9l1j27m5Q4J03j9j23
1246f3m6P2J10j2r0r3P2J04Nq9o3K6J18M3r0q6J5R9M5n4q0KP9N2l5r6MN4O7m4
1276B6q6KP9N4k9j01k9O6N9jo5m5L3Q1J9j07l7L7Q0J1o1n8K3Q5K0m2p9L1O1N9
1306H6o7o6rQ6L8m6p1JO8L3qq7ON2M0l0n5l8N8N5%p3k3M8O2k2l5p1M2O6J0p5m5
1339g0M6K6M1m3o6J4Q3K5o4k6LN0K3j4n5rM3N8m2m9j3M9K9j6n0j1L8K9j0n3qJ9
1371b3N0J1o0l4M4M4jj7n5J3N4J0n0k0LL9N5o1m7jM7L6j6n4%N4K3j9m1l3M7L7
1403C5j0m1k4M0M9j8m5j2L1Rol0j0J8L6Jm6qLL8K3l8k7jN0J0j2m1%K8K0ql3%L3
$$ y = [-87, -126, 3, 129, 80, -83, -140, -15, 120, 88, -55, -134, -29, 92, 80, -31, -122, -50, 91, 100, -20, -99, -69, 53, 124, 8, -98, -67, 45, 127, 17, -95, -80, 32, 118, 47, -79, -83, 27, 122, 46, -67, -88, 6, 95, 64, -63, -108, -24, 79, 60, -63, -109, -37, 73, 61, -29, -122, -50, 54, 59, -30, -93, -67, 51, 94, 4, -82, -67, 32, 77, 23, -57, -55, 24, 76, 41, -55, -51, 3, 70, 26, -60, -58, 21, 75, 46, -55, -84, -18, 41, 40, -25, -70, -37, 44, 63, -44, -81, -44, 36, 47, -14, -72, -49, 36, 56, 14, -65, -34, 27, 86, 19, -47, -56, 30, 68, 22, -49, -48, 20, 53, 45, -42, -36, 16, 56, 26, -29, -67, -9, 46, 46, -27, -50, -2, 60, 38, 3, -68, -26, 40, 50, -25, -70, -24, 2, 43, 0, -66, -52, 31, 56, -8, -34, -31, 19, 42, 28, -27, -36, 7, 65, 23, -26, -39, 10, 39, 23, -27, -38, 0, 29, 19, -34, -42, -23, 27, 38, -22, -56, -12, 32, 31, 14, -41, -28, 26, 36, -14, -34, -31, 8, 63, 2, -45, -46, 1, 37, 21, -33, -33, 21, 44, 25, -16, -49, -2, 35, 25, -16, -40, 0, 49, 31, -14, -26, 5, 14, 8, -22, -32, -14, 22, 23, -23, -31, -28, 10, 33, -5, -32, -33, 17, 27, 15, -26, -26, 2, 22, 14, -19, -19, 14]
1438A4K9k2l8PJ3K2mk8k6L1L4rk6qJ8K3j6j9k1K1K5Ol3j8J8L0k1k3j0J5L1Jj8
1471bj3oK8J5l3J2pRK0j0k9nL0PJ6n6nK5K8Oj5k2oL0Nk7j8J3K9Nl2pj1J8J5j6
1507ikrJ6jnqjRRNol1M1NpkmJ0jjqj5PLLRk2PK7Kk0j2j6L5lLk2nK5Jj7k0J7K4
1551A1rj1k7K9J1oj4j0PJ2J9j6j2KJ0K1n%l7J3K6j1jk1K8mKk0lOK6l1k0lK2J2
1587djMj0k0M2Nrl6oK5Nkj1QkkRj1pL3j1LlomL0rj6J1j1J9j5oQPOlj3J4j7nK1
1629A0j4mkOPj0%pJ1J5k7J2%j2K6j0onNJ2Lj1j2PJ9j5k1J7QKNlK%k0NJ0J0mP%
1670A6m1J8J0k2Pkj2QJK1krMjJkmnJ1J1j3kjpL1Rj8j6J8J8j3mj4kK5k0Qrj1J4
1710AJ0rj8J0PJ0k2L%J7j2pNj1LOnJ3j6J2JnK0%pjj3J3Kj1J2j2MJkoojrK6J2k
$$ y = [14, 43, 21, -17, -10, 3, 25, 21, -7, -33, -2, 32, 23, -3, -11, 7, 30, 14, -5, -26, -5, 20, 26, -7, -25, -7, 23, 2, -21, -31, -16, 15, 16, -2, -15, -21, 7, 22, -11, 1, -6, 3, 23, 13, -16, -21, 9, 16, 32, -24, -29, -4, 24, 30, 15, -7, -13, 17, 22, -5, -23, -10, 19, 24, -8, -15, -26, -8, 7, -9, -11, -20, -4, -5, -10, -18, -19, -10, -1, 4, -2, -33, 8, 13, 6, 4, 0, 10, 9, 8, 0, -15, -8, -5, -2, 7, -15, -8, 19, 21, 1, -11, -27, 8, 5, 8, -14, -19, 6, 7, -10, -30, -13, 11, 2, -9, -36, -7, 4, -2, -16, -26, -19, -7, 12, -4, -16, -14, -4, 17, 12, 12, -25, -12, 14, 3, 2, -19, 9, 5, 7, -13, -16, -10, 16, -15, -35, -38, -16, -4, -5, -1, -11, -31, 11, 16, 7, -29, -35, -10, -5, -7, -18, -10, -12, -14, -5, -16, -23, 10, -1, 2, -1, -7, -11, 19, 10, -6, 5, -6, 13, -2, -8, 0, 7, 13, 10, -3, 11, -6, -11, 10, -4, -8, -10, -4, 3, -7, -7, -14, -3, 12, -15, -3, -3, -15, 11, 1, -5, -10, -5, 7, 10, -1, -13, -6, 13, -2, -23, -6, 2, 4, 9, 6, 8, 8, -12, -7, 3, 13, 9, 16, 16, -25, -7, 3, -19, -12, -14, -26, -18, -17, 4, 2, -7, -3, -4, -3, -5, -9, -14, -3, 8, -5, -7, -8, -15, 16, 25, 7, -9, 9, 27, 14, 10, -4, -6, 19, -1, 7, -2, -13, 1, 11, 2, -16, -6, 1, 11, -11, -8, -8, 9, -3, -10, -5, -16, -13, -7, -12, 1, -15, -3, -2, -7, 13, 13, 6, 5, -8, 5, 7, -4, 8, -4, 0, 1, -1, -7, -13, -14, -23, 3, 15, 13]
1752A3nj6J5J4k4KKNj2kJ6j4oJ3Lj0lpmK3MrrLJ3oj6K8j3LJ6rj7J1J6j2pK6j0
1791A5qkJOnj9J5klQPorpkJ2LlJ2j2k2K7j2J3qLLpoPJ1Nk2J6Qk4K4j6NRmkk5K2
1835FlJlK5j6Lj5nPQj0j9J3J1kj2PJ1j8OKjK1k6J2KJj2PJ8k8%J7j0J5j1%KoJ6
1875A4j1jkj2OL1k3j6K8j0Pj2MpRkrJRj3rNLmj6L0lOj6J0K3j4oNPj0J0k3ORk4
1916b0K2mk%J2J3j5m%Jk7K3J7j9LoPpoJ6k2lK1J2lk3J4jqoRmKJ4JKj3ONQJ2j2
1958A5j0qJ3JPj9JJj4K1Mok0J7Mj1Rj0Oj0pJ2j9L0j8K0qJJ4k8mJ9poQPj2PJ5j4
1998AJ2lj4QllPj2J6lnlNjmNMOj5kNKj5J7j4LoLNJ5qJj0K%nJ2pRomNlMJJ0j1%
2046AjOQj1J1j8J1PrkplNpLPpj9J3nJ5jj0QkJ8j2mj6kJ6KJ8pj2J8j9J6rKOj0j
$$ y = [13, 8, -8, 7, 21, -3, -1, 1, 6, -6, -8, 8, -6, -12, 1, 4, -6, -9, -16, -20, 3, 7, -2, -11, -8, 5, -1, -17, 11, -2, 1, 17, 8, -9, 2, 18, 6, -1, 25, 15, 7, 5, 6, 12, 7, -12, 3, 1, -2, 6, 13, 7, -2, -9, -11, 1, 4, 1, 13, 1, -21, 6, -6, 7, -1, 2, 5, -2, -8, -1, 10, 15, -7, 9, 17, -7, 17, 1, 6, 15, 11, 9, -16, 6, 3, 4, 1, 26, 10, 13, -2, -7, 0, 8, -2, -21, -8, 3, 1, -11, -4, 7, -11, -5, -3, -4, 17, -9, 3, 5, 6, -6, 1, 19, -9, -9, 8, -2, 13, 2, 2, 4, -2, 14, 3, 2, 0, -12, -6, 25, 2, -14, 14, 4, 11, -1, 3, -4, 5, 3, -6, -5, 4, -9, -18, -13, -10, -14, -30, 0, -3, 3, -13, -3, 20, 6, 0, 5, 12, 2, 12, -11, -5, 4, -20, 2, -2, -4, -4, 8, 21, 6, 2, 2, 3, -24, -1, 16, -3, 0, -6, 1, -6, -12, 4, -18, -21, 0, 12, 9, -14, 0, -1, -9, -15, -6, -10, -8, 6, 7, 9, -4, 2, 7, 15, 27, 15, 5, -3, 10, 11, 18, -1, 0, 1, -13, 8, 12, 6, -14, 3, 7, -4, 5, -5, 1, -9, -16, -4, -23, 7, -11, 9, 1, 2, 16, -12, -16, 3, -4, -10, -2, 5, -7, 0, 15, 1, 13, 10, -4, 4, 1, -2, 5, -7, 9, 6, 1, -2, 3, 2, -2, 3, 7, 13, -2, -4, 1, 3, -12, 5, -9, -6, -12, -9, -4, 11, 3, 4, -6, -4, -4, -9, 3, -4, 5, -1, -5, 0, -3, 1, 2, 12, 1, 1, 0, 6, 14, 3, 14, -4, 7, 14, 5, 3, -4, -7, -2, -9, -6, 1, -6, -25, -12, -17, -2, -3, -13, -5, -7, 11, -1, -5, -21, -23, -7, -5, 13, 6, -6, 12, -7, 9, 0, 2, 8, -2, -3]
2089cJ0j1Qj3RO%rMNkpNj9J6qJ0j9pJ1QpJ0j7Rj0J6J9l4J7lJ4j9mJ4NJLj2K3j2
2130GKpOnk4K2OLqLJJ1l2J6JPj0Nj1npJ2j1J2j8J2lMJ9k8J4rJ0qNPnMNJl%pJ2
2174FJ3j6NlljllKj0PQlMpj4J0MNoj1OOJ4kqJ5j0oj3J9j4PmoOj1J8Jj3NK6j4L
2218IPj1jnJ0jk3J9QopPRj1kKk3%J5%mJ1j2rQJ8jk6J3OKj8RnlJjJ5JOmj3J8j4
2262fJ9ppjJ0MOj1j7PRjJpoJ9j7j4J2oQLoPk5LJ6j3K4j8Qj2K8opklK3l9L8k6%
2304a2%L7k1J1k2J6rRj%roJ0joNNj9J4Kk6KQj4K7qloQpJ5NqjjJ3NorK3j7JQj1
2348ARm%Mkj4OJ4mj9NQqMlOLj4K1j9jonKJ7k8K5k2J6J0mqJ0j0PJRmqJKjJ1Pk0
2393eRRrMj2Ojj3J6j4jQrRoKMj7K1k2J5Nj1JK3k2J5j5Qj6J2l%J9j3MPJ7k7OKJ7
$$ y = [-3, 7, -4, 4, -9, 0, 6, 6, -3, 1, 6, 4, -3, 2, -17, -1, -9, 1, -18, -25, -14, -6, -13, -3, -20, -11, -21, -5, 14, -20, -3, -6, 8, -11, -15, -1, 4, 5, 8, -4, 19, 7, 9, 2, 8, 3, -21, 1, 7, 10, 2, 5, 6, 17, -15, 1, 2, 9, -1, 4, -7, -12, -19, -7, -18, -6, -24, -12, -15, -11, 8, -20, -6, -15, -5, -13, -8, -1, -6, -2, 3, 4, 1, 1, -6, 6, 19, 3, 8, 5, 2, 1, -2, -5, -3, -13, -6, 2, -1, 3, -4, -18, -8, -4, 1, -5, -16, -10, -4, 10, 8, 0, 15, 5, -1, -14, 5, -9, -2, -6, -12, -6, -17, 1, 2, -11, -6, 20, 6, 9, 16, 5, 4, -1, 9, 8, -15, 4, 12, 6, -1, 6, 15, 4, 2, 4, -19, -19, -4, -4, -8, 3, -9, -18, -10, 8, 7, -19, -6, 0, 2, -16, -7, -12, -15, -14, -15, 0, 1, 7, 3, -10, 8, -6, 13, 6, -1, -2, 8, 12, 18, 7, -10, -3, 6, 5, 6, -1, -7, 12, -5, -19, -7, -13, -5, -2, -8, -1, -26, -23, -7, -20, 4, -14, -6, -18, 10, 4, -3, -5, -8, 15, -24, 14, -12, -12, -12, 25, 4, 15, -7, 9, 0, 9, 8, 8, -1, -7, 3, 2, -4, 1, 6, -13, 1, 3, -23, -21, -13, -27, 0, -8, -11, -17, -9, -16, -1, 4, -4, -5, -6, 7, 12, 6, -3, 20, 3, 4, 12, 1, 10, 6, 6, 10, 8, -6, 0, 14, 10, -9, -4, 4, -4, 0, -3, 3, 6, -8, 13, -6, -7, -13, -18, -16, 1, -27, -2, -24, -8, 2, -2, -10, 0, -10, -3, -2, 7, 3, -5, -4, -2, -3, 8, 15, -5, 4, 13, 4, 8, -4, 2, 1, -12, 4, -10, -11, -3, -12, -3, -9, -7, -3, -20, 1, -21, -6, -1, -12, -11, 12, -10, 5, -10, -2, -18, -6, -9, -9, 10, -3, 1, 8, 25, -2, 4, 6, 23]
2435B3j8Jk%jKlJ1j5rj2K2pnPo%NkKnMJ4j5P%Kmkj6L2omj9J1LJoJ0MqlPPJkjj0
2483eqK4j3K1k3Nj3K1j4Nj5RJ9k6J1J2j1Nj4Oj7KnK1MmNoKJ8j4%pJ1jJ4mj9Qj
2523Cj8J5qRrJ6pjKMj2N%k0K9k1J6k1LNljoJ2R%mj1LJ5rJ9j2KmRljlJJLj%j7J1
2569@rJ0poK2k3K0j0jJkJRk3J0RQk3jJ9Kk7K2k7J2J5Ok2J3J1j3NQmJ2Mk0J0k1
2608a0K1oj2%J3%oJ1pkj6KJ5j5J4j3jLMJJ1oJlJNLk0QO%jj4J5pJ2jj2J1j6OK2
2650A7j7Kj6J9jPj0pJ4jj4kJ2kJ3k0Oj4J4j7jPRJ1j6J5k4J6qqJJ1Oj8J6qj7J7
2688hqNJ5j7K3j0J1j7QJOJ2rk0Pj1K0qrJ1Jk3J8ok0QK8j0j0lJ1rJ5j0J7j1%KK
2727BmROj4OMk1K0J1j6qkK4j8pJ4J2k0LQk7J2J2oJ1k4Pj0%j2J1J8j1kOqJ4lkL
$$ y = [23, 5, 6, 4, 4, 3, 5, 2, 13, -2, -11, -23, -1, -8, -13, -6, -12, -12, -7, -9, -7, -12, -8, 6, -9, -2, -2, 0, -4, -6, -22, 10, 4, 0, -19, -8, -5, -4, -10, 0, 4, -4, -7, 0, 7, 8, 6, 5, -5, -13, 11, -2, 19, -4, 1, -12, 9, -5, 0, -15, -6, 13, -13, -2, 10, -1, 4, -10, -4, -21, -19, -24, -3, 1, -3, 2, -4, -2, 16, 2, 2, -5, 6, 5, 19, 15, -4, 4, 3, -15, 0, -8, 1, -8, 8, 1, 0, 2, 6, -6, -1, -1, -21, 8, -13, 3, -18, -15, -10, -13, -14, -20, -8, 1, 1, -3, -14, -11, 4, -5, 14, 2, 4, 0, 9, 6, 5, 2, 3, 4, 7, 6, 6, -11, 0, -9, 1, -6, -12, 10, -13, 7, -3, -4, -3, -5, -4, 5, -18, -8, 1, 9, -14, -15, 4, 6, -21, 1, -26, -14, 1, 7, -15, -2, 9, -4, 1, 9, 5, 17, 21, 1, 11, -10, 11, 5, -7, -7, 6, 6, 0, 11, 4, 2, -14, -12, 3, -12, 2, -11, -12, -9, -5, -4, 7, 1, 2, -1, 0, 5, 8, -12, -4, 2, 2, 1, -13, 2, -5, 7, 6, -6, 5, -11, -5, 17, 0, 2, -14, 5, 4, 11, 1, -6, 8, 7, -7, -9, 3, 1, 14, -6, 0, -14, 0, -17, -18, -11, -2, 9, -7, 8, -16, 0, -8, -16, -15, -4, 2, -16, 0, -8, -25, -8, -16, -11, 4, -13, 10, 0, 11, -6, 2, 3, 9, 21, 12, -8, -1, -12, 8, 0, -9, 2, 3, -20, -2, -8, -28, -20, 8, -2, -12, -15, -4, -13, 2, -8, 9, -2, -2, 0, 2, -2, 7, 13, -1, 5, 9, -12, 8, 19, 3, -5, -7, 17, -1, -8, 6, 18, -2, 1, 9, -18, -6, 6, 0, 11, -13, -6, -16, -16, -28, -17, 1, -10, -12, -6, -14, 0, -3, -5, -2]
2767blK3rj4J4oJ1k8J3KJJ2k1J1lj2K2rJOnJ1lnnJj%J0k8K6ojj3nOMj2jJ4jJJ1
2810Gj3MJ2j0pJ7mkjJ9k6NJ0mK3j7nRPj9J3k5pRKj2K1j4MmpMK1j3rLkNMJ0mj1
2852gRj6JL2j9pj9L7j0JLj0J9%pJ1j5LNj6PrlmK2j9JNMjrnm%J0j4L1%k3PJ6j0
2894cMlPMj1N%Nj6L4l2mPpRJ0jmpONpLJ0Kj4%J8j3jPjopqRnj7J2j0K1k0J6Pj1
2939gNrJ4j1OPj0rL0k4JLJJ1J1j0Lk0K3j9J3j9M0k8j5J1J4k2qJ6Nk1kK5pq%Ol
2978gQj9J9rlnJ3jJ7l5J9J7j3J4mj7J5nRj9LQj2J2k5K4Mjk5LL7j5k2J6mj7nK2
3016c%j7J8j2J4j5LR%NrJJ3j8J1qJRqL%J5jmRk0J3pOKj4O%qoPJ6j2Joo%qqRJ7
3062bmMKmrJ6pJjJ0jj4mK2Oj2j1K1MqlQj0RqkPk1J2J0Kk3pJL5nj9j1J2j1O%j0
$$ y = [-2, -5, 18, 9, -5, 9, 3, 14, -14, -1, 1, 2, 14, -7, 4, 1, -11, 11, 2, 3, 9, 4, 15, 12, 7, 2, 3, 2, 2, 12, -16, 10, 4, 3, -10, -15, -9, -5, -17, -18, -4, -5, -4, 7, -6, -2, 10, 0, -7, 10, 6, 4, 3, 22, -4, 1, 11, 7, 30, 13, 8, 17, 24, 5, 18, -7, -14, -5, -3, -15, 6, -8, -4, -8, -15, -11, 10, -3, -12, -9, -11, -6, -2, 8, 4, -7, 2, -14, -13, 19, 0, -7, -26, 11, 1, 2, 5, -5, 14, 14, 7, 18, 3, 6, 11, -5, 2, -7, -10, -14, 8, -11, -10, -5, -1, -2, -11, -16, -20, -20, -10, -24, 7, 7, -16, -9, 7, -3, 1, -2, 5, 9, -2, 3, 3, 8, -8, 26, -6, -10, -3, -10, -1, 9, 8, 4, -3, 3, 8, 1, 4, 14, 16, 2, 2, 20, 7, 6, 13, 12, 6, -1, -9, 0, -5, -22, -10, -20, 1, -19, -3, 4, -7, -2, -11, 3, -8, -2, 5, -5, -14, 16, -8, -7, -4, -3, 8, 19, 9, 12, -8, 15, -4, 9, -10, 30, 2, -13, -2, 12, -10, -18, -2, 3, -18, -20, 5, -2, -10, -10, -4, -7, 1, -18, 1, -8, -11, -16, -3, -4, 13, -22, -3, 14, 1, 15, 11, -6, 9, 4, 13, -6, -3, 5, -7, 5, -20, 4, 8, 7, -18, -15, 22, 7, -15, 1, -3, -20, -25, -3, -3, -20, -2, -14, 0, -15, -12, -3, -3, 2, -7, -6, 7, -11, 0, -8, -7, 2, -6, -3, -3, 12, 11, 7, 16, -4, 9, 2, 8, 10, -4, 2, 2, -6, -12, -5, 11, -1, 0, -6, -12, -12, -20, -28, -19, -2, -6, -2, 0, -4, -13, 3, -4, -3, -4, 6, 5, -9, -13, 9, 15, 3, -8, 13, 17, 9, 6, 14, 4, 13, 5, 3, 10, -11, 1, 11, 13, -10, -17, -16, 19, 14, -5, -16, -4, -15, -9, -9, -19]
3105a9J0PPk9L6k5J4oJ1PRk2pNJ6pojlK7j1Mj0k%j5J9Lqkj5KKmLJJ5j0qkJ5q%
3148gJ5k3J4mQ%k0LJ4PrmJ6rJ1j0J3l1J8KJ%Jk0J1J4k1nK3nj2K3pJk1J8mj3Pj
3188fPj1rJ9mj2K4k4lJ6nKPlJ1mJ9nj4J5kmJ0J3l4Mj9J4kJ4k0jJJ0Kj0J6l3MJ9
3228BojjJ2k9RqJ4lOQj2J6kkj8J2j1KkK3prlJ7Qorj1J2%mMmKKnmJ4rQ%j3mJ4j1
3274iJ7nj6OJrQnK1kOj6JQkLroqL5mkqKK4k9j6K3Jj8J5kmPj7QmJ5rpLnJ8k5JJ
3320a3K4j3k1K0J2lj8J1Pk0QMkOQkjqJ1kPkj2J7j9J5NrkRj3J3j0k1K6j5J1j3r
3359a4J8jqNKj5OJ2j9PJ0j3J6J8k5JJ3j0RqPpnRKj7J4MnjNrkOplOmmJ5ro%J4j9
3404a2kK6j8j0%JJ1J6k3L3k5pNK1j6oJ0K4k0jJ2rPmoj6K2l3K8npJ6l1J1orJ6N
$$ y = [-19, -9, -2, 5, -24, 12, -13, 1, -5, 6, 13, 22, 0, -7, -2, 14, 7, 1, 0, -3, 24, 13, 17, 7, 5, 5, -10, 9, 12, 4, 2, -13, -11, -9, -13, -10, -9, 6, -4, -12, -14, 1, -7, -7, 8, -15, -1, -5, 3, 3, -17, -14, 0, 7, -2, -6, 10, 1, 12, 2, 15, -16, 2, 4, 5, 5, 6, -14, -3, 11, -10, -15, 8, 3, -9, 14, 7, 8, -13, 5, 1, -12, -5, -6, 1, -10, -19, 0, -4, -16, 8, -16, -19, -3, -8, -6, 1, -2, 9, 5, 24, 19, 5, 20, 18, 14, 24, 37, 3, 7, -12, 2, 0, 14, -6, -7, -6, 4, 6, -4, 12, -21, -17, 2, -4, -5, -6, 6, -23, -14, -22, -8, -11, -5, 3, -9, 7, 5, 3, -15, -3, -14, -12, -14, 9, 2, -7, -10, 7, 15, 9, 0, -11, 1, 1, -3, 1, -3, -1, 1, -4, -8, 6, -3, 5, 5, -8, -12, 2, -9, 8, 3, -13, -7, -6, -15, -7, -12, 9, 7, 13, -3, -2, 6, 4, 7, -2, -8, -16, 19, 15, 13, 5, 7, 31, 2, -14, 9, 10, -8, 7, 5, 1, 8, -9, -1, -5, 10, 1, -6, -3, -8, 10, -15, -14, -13, 11, -2, -23, -3, 9, 6, -12, -1, 6, -14, -6, -2, -4, 2, 10, 8, 7, -1, 10, 8, 15, 13, 1, 18, -1, 14, 19, 10, 8, 17, 4, 17, 7, -14, 12, -3, 8, -5, -14, 4, 3, -5, 0, 2, -13, -7, 5, -14, -7, 3, -10, 6, 24, -1, 0, 13, 3, 12, 4, 11, 4, -1, 8, 10, -7, 7, 11, 6, 5, 10, 1, -1, 5, -2, -5, 1, -3, -7, 8, -1, -7, -7, 7, -12, -14, 12, -6, -16, -16, -15, -4, 12, -11, 22, -3, -10, -5, 16, 0, -6, 4, 28, 8, 7, 19, 10, 17, 13, 7, -9, 13, -20, 8, 3, -4, 12, -19, -8, -14, -23, -7, -2]
3442bj3J6mmJ7j6j1J1K%j3J5k2J8Pk2J1RlmJ0NKoJ4%j2MRn%%Qj1Jlj2J2j6Jj4
3483b1L0j8Qj0LpMRj0lJjpK8j2pL0j8m%Nj0K5rLlLj8PJ0J6j5Mj2J7rjnj4Rj0J4
3525Bk0K3J7l9K0k9J0J1rj3J0J6j1jK1j4J5Kj0J0kNj5j3ROQl4K5pNJ5jj9J4M%
3562A1J5l1nQLLMJk5L0j8J6j4k0J4K0j2qJ5k3J7pj8K8qJPlJ4j0OpJ3p%j4J4%Q
3601A8kkj0J0j3oMnRkj3J1mOJ1oj2PmmPk6J2J7j1%J4rPj2%J9j2JJ1j0J3K3l0p
3641@J1KKqOj0OJ9j6mrKLnm%RmRj0LJ5k1kJ7l0RJ6k7K9j1jJ5l6K9JRk6QJ1k2J1
3683dJ5j2K0j9L9l4%Qk7K4j6K2j2J2j9okJJLPk3J9lQqQKpkJKkjJ3pPPk9J4Poj
3726@J5k4K2j6%rJ0J7lKj7JNLj4NlRj2K1j9oJ8j2J5j0m%Rrk2L8k0K1mmj1OJ2j2
$$ y = [-2, -15, 1, -3, -7, 10, -6, -17, -6, -4, -4, -17, -2, -24, -6, 1, -21, -10, -1, -4, -8, 2, 7, 9, 3, 17, 17, 5, 9, 18, 13, 13, 13, 21, 10, 11, 8, -4, 8, -8, -7, -21, 9, -9, -1, -11, -8, -15, -11, -2, -12, -15, -14, -15, -22, 6, -6, -13, 17, -1, -5, -5, 0, -10, 15, 6, 9, 6, 9, -9, -2, 8, 24, 9, 13, 1, 18, 9, 8, 3, -11, -2, -12, 2, -18, 5, 22, -17, 3, -26, -16, -5, -14, -27, -17, -1, -12, -13, 8, -6, 9, 11, 1, 11, 9, 14, -1, -14, -5, 1, 9, -25, 0, -7, -2, 13, 12, -7, 7, 11, 11, 26, -5, -10, -2, 1, 4, 8, 9, -16, 14, -4, 12, -2, -22, -8, 12, 0, -8, 7, -16, 1, -6, -24, 4, -4, -3, 4, 1, 15, 5, 11, 4, 17, 10, 10, -4, 10, 10, 18, 16, 14, 4, 14, 1, -5, -1, -6, 3, 1, -12, -1, -5, 1, 12, 6, -6, 1, -3, -7, 0, -26, -14, 3, -8, -8, 6, -3, 4, -8, -8, 11, -1, 0, 11, 1, 14, 37, 7, 0, 11, 13, 15, 7, 13, 3, 9, 28, 12, 8, -1, 1, 4, -1, -5, -5, 4, 0, 9, -1, 2, 17, -4, -6, 11, -19, -10, 6, -21, 8, -3, -4, 11, -25, 4, 5, 14, -12, -4, 7, -15, -4, 11, -1, 19, 0, 39, 5, 5, 13, -14, 10, -6, 16, 4, 16, -3, -9, -11, -10, -9, -6, 1, -22, -3, -6, 2, -6, 2, 4, -3, -5, -4, -2, -4, -5, 8, 1, 8, 15, -14, 0, 7, 1, 0, 15, -9, 13, -3, -3, -12, -2, 15, 12, 14, -3, -2, 3, 6, -8, -3, -6, 3, -9, 12, -7, -13, 5, -7, 8, -2, -6, -6, 3, -6, -28, 10, -10, 11, 7, 3, -8, -2, 10, -2]
3766boMJ6j2KJ1JomOqPMjJ5k0qJ1k1QK7j2j9Qj2J0j1J8k6J9j5kMJ2rJ4JLj9L0
3806A8oqpj4K2Nj2J3j1rJ7Lj5LK1j9KJ%nj9MJ7kr%jONj5MlJ1j4KoK2j2OJ0lol
3849glmJ9mnnPJ5qjJ0lPj2LlOj2J4l9J5jJ0Pk9J9Pk5J4NJj3j5J2K5j7RpLlMK1
3891A7k0OoJ0%pn%J1Mj4PK1j6j%j4J8k4J5oPPj5j0KJRk9L6j8ROj4J1mJ3Lk1P%
3932djJ6j0mKOoLPmqJ4Jk7L5j0jmKK0j4LKj1j9J9j5mJ7mrLqNqJ3oJ0j3J0KPNk0
3976hK1Ok2J0jk1J4qJ1J2pk3J6J8j0Pj8jjJ0Ok0J4k3J6jlJ2Oj8JJ0j1j1J7j3J
4013a2rJ9KpJ5j2%J7nllJ7j3j9J9MnNloOJ2j0KorK3l4Q%Nj3Q%j2K4rLLj1J0j0
4055ij1J2kJ3o%j0J0L5l3Rj9K9j8oJ0K8k6loK1l%nkOpj0J4k8j3L0pNk4J1J9j5
$$ y = [-2, -8, -4, 12, 0, 2, 13, 14, 8, 4, 10, 2, 9, 13, 12, 27, 7, -1, 10, -11, -3, 24, 12, -7, 1, -11, -1, -12, 6, -20, -1, -16, -18, -14, -2, -11, 3, 4, 7, -12, 18, 12, 4, -3, -17, 5, 10, -2, 11, 0, -9, 8, 11, -4, -1, 20, 1, 3, 4, 4, -1, -20, -16, 1, -1, -10, -10, -11, -5, 0, -15, -11, -14, -3, -17, -15, -21, 1, -11, -5, 5, 2, -4, -7, -10, -14, 5, 1, -4, -9, -2, 13, 5, 4, 14, 11, 18, 6, 9, 6, 12, 0, 14, -25, -10, -11, -1, 6, -23, -4, 3, -22, -8, -3, -2, -15, -30, -18, 7, -10, -1, -8, -5, -8, -4, 17, -3, 3, -3, 7, 7, 0, -5, -5, 6, 10, -4, 3, 24, 8, 7, 7, -7, 11, -13, 2, -4, 3, 10, -5, -15, -13, -12, -3, -32, 4, -14, -5, 1, -13, -2, -6, 7, 10, -11, -4, -4, -5, 11, 1, -3, -1, 5, -1, 2, 9, 5, -3, 11, 12, -15, 20, 10, 9, 5, 7, 27, 13, 16, 18, 7, -12, 7, -8, -12, 5, 1, -8, -5, -13, -8, -16, -3, -9, 1, -12, -2, 0, 7, 12, -8, 13, 19, -3, 7, 6, -15, -1, -9, 2, 14, 7, -16, 0, 18, 8, 15, -3, -4, -5, 5, 11, -9, 5, -18, -2, -3, -6, 6, 12, -6, -5, 5, -6, -17, 0, -13, -12, -21, -2, 0, -7, 8, -4, -4, 13, 8, 5, 2, 19, 6, -13, 6, 10, 5, 10, 7, 1, 7, 19, 9, 11, 5, -4, 19, -15, -7, -7, -2, -15, -7, -7, -19, 5, -4, -1, 2, -9, 1, -9, -20, -8, -10, 3, -3, -3, -13, -3, 32, -1, 8, -11, 18, 0, -6, 4, 32, 6, 3, -3, 18, 15, 15, 10, 8, 14, 7, -3, 11, -17, -30, 0, -7, -2, -26, -15, 4, -11]
4093a1kK2o%j3N%mJ4lLj0J6Jj2j2J5%J4j4rJ5NkLPj4j2QpJ8j5J2kj5j0J2%q%J3
4134Bj4J6k0j5M3l1KJ5jj0%QMMJ9Jk8MJ0k2J5j1NKlLJ0JMj5pkJ6lJ1j5Pl%mk5
4175b7J9Lj6J3J2j8OQKk0LJ7j5MR%j2RPk4L3j1%J1j5lJ5k9J8J0KJ1k0K2l0J4K
4212A0mqNj4K5j5oJoJ0j7MR%Qmrj0J3NkKJMkJ1j6J6j9K3j5Nj2mMpL1k3Qj0J6n
4254CMnlQoJqnJ9j5J2Jkj5LQj5J5nOj7nJ4j4K5k0J0J6Lj4OjmPNOj0NqmkJ4j0j2
4298iK1j1jNqj2J4j7LJ3j4KRPNk6J7qNqKRnpROjj7K4Jj4OJlQlLK%j0oK1j3J7j0
4343Gj6oJ4ojJkJ1k7J3jJJ9l1K7k1K0j1QMj5K7j5KkPQmKj0Mk1j1K5%RjmjJ7qq
4385DlJ3j2k1J0NJ3k7LJ7j6RPj6J2k0pJ9j1L%OJ7j3K%NPj9OQj1J1J2j6Nk2M5k9
$$ y = [-11, -13, 9, 3, 3, -10, -5, -5, -9, 5, 2, 5, -5, 11, 12, 0, -12, 3, 3, 17, 3, -6, 9, 14, 12, 15, 22, 8, -4, 4, -3, 15, 0, 12, 10, -5, -15, -3, -3, -11, -11, 2, -12, 4, -16, -31, 12, -19, -17, -2, -3, -13, -13, -5, -1, 3, 22, 23, -5, -1, 9, -13, 2, -9, -4, -2, -5, -2, 8, 9, 13, -2, -9, -11, 5, 2, 13, -2, 5, 2, 2, -2, -27, -8, -5, -21, -8, 4, -14, -8, 0, 2, -18, -15, 2, -13, -9, 0, 0, -12, -3, 4, -20, 13, 2, 2, 13, -2, -5, 10, -19, -1, 9, 11, 22, 2, 24, -6, 8, 10, 6, -2, 3, -11, 14, -1, -7, -6, -12, -2, -19, -15, -6, -6, 2, -2, -11, -21, -8, -3, -5, -3, -2, 2, 0, 11, -5, 11, -8, 15, 0, 5, -7, -11, -7, -14, 17, -6, 2, -8, 8, 3, 7, 2, -1, 7, 1, 2, -6, -11, 8, -7, 5, 6, 4, -11, -8, 0, -15, 0, -5, 1, -16, -21, -7, -21, 4, -16, -6, 10, 13, -1, 5, 4, 0, 7, 12, 18, 8, 13, 5, 1, -1, 13, 3, -9, 12, 1, 0, 5, -3, -15, -1, -18, -15, -2, -16, -14, -5, 2, 7, -19, -2, -10, -5, -13, -11, -2, -7, -14, -5, 1, 0, -17, 7, 8, -6, 0, 1, -2, 6, 3, 6, 8, 8, -2, -8, 13, 0, 17, 7, -9, -15, -1, -7, -8, -7, -9, 2, -25, -12, -13, -12, 7, -24, 3, -18, 2, -9, -1, 3, -12, 15, 0, 2, 0, 7, 15, 11, 13, 3, 7, -14, -25, 0, 0, 9, 8, 4, 3, 20, 12, 4, 1, 14, 2, -19, -9, -4, 9, -18, -15, 2, -14, -5, 2, -14, -2, -22, -29, -10, -21, -18, -18, -12, 5, -8, -6, -6, -1, 6, -13, -7, 1, -10, 1, 13, -3, 2, -20, 25, -4]
4424dj2J1%kkJ9k0QmRj5J1mkJ5Pl5K8k7KoQKp%PnMOJ1j3QpJ2j0jJ6j4pNPPj1q
4468a3MPMonJ4k7K7nlj1Oj3K0k1M0k1PrjkJ3j8J5rj7J7lJ4jlrK4mLKmJjj1JJ7
4510A9J0k5lqLOj0JoKMrK9j7Pk7K0j4J1JJ5q%krkQrKJ3J4oQk2MnNJ3jj5J7Jj3
4553Bj0K3Qj0Jj5NoJ1Kj5jJ0qNj9J3oJnK1j4NqLJ7j5QPnLrQRLJ1k7RqllkPj0K5
4598A8rj4Rlj5J1Pj1Oqj5K8j5jrJ4j7K5J3k0J3Lk1KJ6plJ3knjjmQj8J2J1j5Om
4638cNkJ0qj7QqJ7Kj0QOj8Po%K0j8J6j5pK0j4Q%j5K0k1K5j2J3nj2KJ6r%Pj4J1
4678GplOqJ6pnJ2Pl0jJ3q%rJ9j9J0%J1rKJ5m0J4Rj0J2kj9J2JNJqMJ2MJ0pnjnK4
4722B3jl8L1lkMk7J7j3RrL5m8J2LJ0j2kJ5j3J1lmjNk0JK4Mj2j2K0j6J0KKQj8J6
$$ y = [-4, -16, -5, -5, -7, -9, 10, -10, -2, -6, 3, -12, -1, -5, -7, 8, 15, -20, 8, -19, -17, -23, -15, -13, -20, -20, -13, -18, -14, -8, 3, -10, -2, -9, 3, -7, -8, 8, -6, -13, -8, -1, 6, -5, -13, -9, -2, 2, -4, -9, 5, -22, 5, 0, -3, -14, -8, -21, -1, -22, 18, -3, 4, -5, -6, -8, 5, -13, 2, -7, -24, -7, -10, 4, 3, 0, -9, 15, 11, 14, 16, 12, 13, 12, 1, 2, 19, 29, 4, 1, -7, -4, 2, -8, -7, -13, -11, -7, -16, 13, -4, 3, -24, -4, -18, -7, -6, 9, 1, 1, -1, -10, -12, -4, -13, -11, 2, 16, 10, 18, -4, 0, -5, 0, 13, 12, -3, 14, 15, 2, -8, 15, 23, 13, 14, -1, 4, -2, 9, 11, -4, -5, 5, -3, 2, -17, -4, -10, -9, -14, 7, -7, -2, -10, -7, 10, -5, 3, 10, 5, 8, -1, 7, 16, 19, 30, 3, 12, 4, 1, -2, -4, 3, -7, 18, 9, -5, 4, 1, -14, -3, 4, -7, -1, -9, -24, 4, -11, -12, -21, -7, -24, 1, 14, -6, 7, 10, -11, -9, 7, 0, -3, 10, 8, 3, 2, 1, -3, 5, -13, -1, 10, -5, 1, -3, 2, 0, 10, 2, -15, -7, -15, 2, 4, -6, 2, 8, -10, -3, -9, -9, 11, -7, 9, -6, -13, 7, -7, 1, 1, -14, 6, -15, 10, -2, 11, 6, -6, -4, 12, 3, 3, 10, -4, 7, 0, -3, 3, -5, 11, 4, -1, 11, 18, -12, -13, 0, -8, -8, -17, 2, -17, -7, -7, 4, -5, -3, 12, -28, -14, -5, -15, -3, -5, -24, -12, -11, -6, -5, -13, -9, 3, 7, 17, 10, 5, 4, -1, 23, 22, -16, 15, 12, 10, 14, -13, 4, -9, 0, -9, 26, -22, -10, -7, 3, -9, -11, 4, -9, 2, -1, -5, -6, -1, -21, -20, 4, 8, -4, -16, 4, -12, -2, 0, 2, 10, -8, 8]
4761Hj8LmKJ0LjkJ7rJ0k7PKKmnJ5j4JnKJ0lpoJ7k8J4J9j0%MnRj4J2o%QKJ1j4k
4805DNolj8J1J2okj0K5nK5l3pK1j2lmmJ5j1pOKpNrkJ0j6J0KJ0J8k1oQQkRmj1K3
4848B0j7ROJj9J3j8kK3k1J3k6K0MjJmMrkkRj1LqK1j3K0j4oJQj1oOJ0KJk6K8J1
4889A8j0J6k2lRrJ5j9J0%Jl%jj6LLljQjlnJ0j8K5kQKoj1Rk6K9%oj9J8j3J7PJ8
4931B9l7J9qoJ4nJ1k1KJ1JJ4j9moPJ0j3nJmPkqJ8Qk1j9J6J8k%Jj8J8rJPKj2K1
4972A7j4KpJJ8j7J4k4J5rJPMpQmpkpJ6k8J6j1J6Jj4lQOkjnOK1k0Rj7kK3rLj4K5
5015A3j8K3mj4j9K0lKMnmKRnj4OK5j5QPk3lJOk1QkK0j7rPKJ2j3rK9k0J3J%%k1
5057b1K7KJ1MqQk2RnPj0jlj1J7Oqj7J9j7J3j1LK1l0nK3Rk0QlrRJ1nj5K4ok2J5
$$ y = [8, -10, -7, -11, -9, 1, 4, 3, 1, 18, 9, 19, -8, -1, 1, 3, -1, -6, 9, -5, -4, -9, -7, 3, 0, -7, -13, 4, -24, -10, 9, -1, -1, 3, -2, 7, -7, 5, -1, -1, 7, 9, 20, 6, 4, 9, 3, 0, -18, -7, 5, -1, -3, -13, 12, 7, 32, -1, -8, 13, 1, -2, -6, -10, 5, -6, -13, -7, -5, -12, -7, -16, -18, -8, -24, -14, -12, -2, 16, -5, -11, -3, 5, 3, 12, 8, -3, 20, 3, 12, 18, 19, 0, 13, -5, -7, 16, -5, 8, -18, 2, 6, 5, 6, 2, 6, -3, -5, -7, 2, -9, -6, -14, 7, -6, 14, 0, -6, -5, 3, -8, -14, -8, 2, 4, 5, -21, 7, 18, 8, 24, 2, -1, 8, -1, 14, -5, 5, 5, 6, 3, 3, 2, -14, -11, -8, -11, -12, -4, -5, -8, -13, -3, -21, 4, 2, 10, 12, 6, -5, 4, -22, 7, 7, 1, -18, 0, -13, 4, 11, 29, -8, 11, 3, -3, 11, 6, 17, -4, -2, 9, 10, 24, 5, 1, -5, 2, 12, -1, -6, -5, -9, -2, -4, -12, 6, 14, -7, -26, -10, 8, 6, 6, 7, -11, 7, -2, -1, 6, 8, -4, 17, 3, 5, -2, -1, 17, 0, 14, -10, 5, -4, -3, 4, 8, 1, 9, 5, -2, -4, -11, 5, -23, -7, -18, -2, -1, -15, -18, -10, -4, -6, -7, -12, -6, 15, -5, 4, -13, -15, 8, -1, 2, -12, 13, -5, 18, 14, 0, -19, 1, -2, 0, 4, -1, -5, -3, 6, 1, -13, -7, 18, 3, 11, 18, -5, -8, -7, -1, -22, -14, -16, 4, -13, -22, -15, -13, -1, -14, -23, 6, -14, -1, 0, 0, 0, -21, 6, 8, 19, 23, 15, 23, 1, 10, 5, 12, 2, 1, -2, -13, 4, 10, 2, -15, 4, -13, 0, -11, -8, 13, -17, -22, 1, 10, -10, -2, -5, -14, -5, 6, 1, -14, 10, 4, -18, -3]
5097c%JqJ0jJ1k3K7Jj1j3J7j7J6mj0Pk2K1j5KK4j1j2kQj3J9j2K3j5Kk3L6j8jK
5134gKlmj0J4kmpJ5MNjjljklJ2m%j2L3j7LMMj9J2rNj4J2lkj1Ml%Mj0OJ7%k4OK
5180a2J1kJ3j5Pj2QJ3k5OjQRJ5l3K1j0qNJj0J0J2j0mJqqKJ5j4KlOlMoJJ2jj2O
5222iONj6kRjK0k7K0J6jjk7K7j5mK0k4JQJkmLj8K6KpJJ3nm1K1Rj5Lj5J3j8K0j
5263iNkK3l9RKLLpJ1NkmKJ3j4J1jQnnk3K0Qk6K5j3%j1MRk2J1oK0Ll1J8qJ1nOq
5306a1LJ3lj1pJ2j7K1RomkK3kj0KJjoLJ3j2Jj8K4mj2J2pkmrMnJ1oj1J8j0mNJ2
5348Ckkj6NOMRrJj0poJ9K2j5jK0j2J6k4RmJJ6j8j2nJ7kkNjqpjLolPJ6j8J0j3%
5392a5J3OLKnmnJ1Lnj0J4%k5J3QJ1j4MPPrk9K6nj2RJ1LpJj6Mj5J1qJ2plJ6j4j
$$ y = [-3, -3, -2, -10, 0, -1, 10, -13, 14, 15, 4, -9, 8, -9, 7, 3, -7, 0, -22, -1, -16, -14, 10, -1, -13, -15, -7, -20, -1, -13, 10, -5, -3, -26, 10, -8, -9, -7, -5, -8, -12, -22, -8, -10, -14, -21, -6, -2, 3, 2, 1, -2, -3, -5, -8, 4, 0, 0, -12, 21, 4, 7, 11, 15, -4, 8, -1, 4, -10, 2, -1, -3, -14, -10, -13, -13, -9, -19, -13, 4, 4, -20, -14, -12, -1, -3, 10, -5, 2, -10, -2, 11, -14, -8, -9, -1, 8, 23, -10, 11, 1, -7, -2, -1, -11, -1, 11, 1, -3, -2, -10, -18, -16, -1, -15, -13, -16, -10, -13, -9, -15, -14, -2, -3, -15, -9, -3, 2, -14, -16, -7, -8, 12, -15, 5, 21, 20, 19, -8, 19, 4, 0, 20, -4, -3, 5, 6, 4, 0, 3, -15, 11, 13, 6, 7, 20, 15, -26, -5, 4, -11, -8, -23, -10, -28, -8, -9, -4, -6, 17, -22, -13, -11, -8, -5, -12, -1, 4, 2, -2, 0, 13, -1, 10, 9, 17, 12, 7, -16, 4, 12, -14, 11, -2, -2, -13, -9, 0, -22, -11, -17, 3, 6, -25, -7, -15, -4, -9, -3, -11, -8, 5, 2, -9, -16, -4, -21, 0, 9, 3, -1, -3, 20, 18, 8, 10, 11, 10, 4, 7, 20, 8, 9, -9, 15, 11, -1, 11, 4, 2, -2, -11, -7, -12, -1, -7, -18, 0, -10, -14, -9, 3, 1, -1, -17, -12, -6, -2, 7, -2, -1, -11, -18, -24, -5, 17, 2, 1, 21, 9, 25, 1, 10, 6, 7, 23, 5, -7, -12, 5, 3, 1, 6, 5, -3, -10, -11, -8, -14, -17, -10, 6, -12, -2, -15, -15, -2, 4, 7, 9, 4, 0, -5, 6, 9, 4, -6, 8, 8, -17, -4, 4, 15, 1, 5, 12, 19, 10, -19, 7, 2, -10, -1, 10, 13, 6, 7, -9, -5, -20, -9, -17, -5, -12, -15, 1, -13, -14]
5434a4OLnokJ2jJ0jpj3K7kpMNJKk6J2LnlOjJ1j5Qj8QKNpJ1rrJ6%rQQj4J1k1Qk
5480a0Rj6J7j0kqJ3MKRJj4%J0j0J2jJ0j9nJ6oRjNojlj1mRjmnKJjmRj2J4LJ2j9
5524fmQRmKmOj6PMj6K3j3J3OpNKj8kMJ6mk3PjjJ2mk3J1J6ljj3Ok1PJ6KKj4K1J1
5568A8k8J2KkLj3JJ0Ok6L5j2pJ5Kj3RRk1LPk1L3l5K2Mj7j0QkKnOpJ5k1J9pqL%
5609a1jkJJ3NmkLoOj1K2%nk4L6j8Ok2J0J4l1J6LK5k3qJ0oJ3j6J8k4K3j7j2J5j2
5647a6J2pJ3pj9JK4nqJ6j5J1j%kJ2j1J7j9MPkoMJ9l3J1j0RQj1Nj1PkKJ2Mk6J3
5687@qqOJ1Pj3j5K6okj1J6qJ7k6J9omK5rjKjjnJ7j5PJ5k4J5j6j0kJ3lj1j1Oj1
5727b5J9J4ojj4NlOMjJ1j2MnJ7oj1Mj2J2j2J5Okj1QJ8l1J5J9j6Jk6J3J8j6j8N
$$ y = [-14, -8, -5, -10, -16, -18, -6, -7, 3, 2, -5, -18, 9, 7, 0, 4, 9, 10, 12, -14, -2, 1, -4, -7, -1, -2, 9, -6, 2, -16, -8, -6, -1, -8, 3, -6, -15, 1, 1, -8, 0, 8, -6, 5, -16, -8, -10, -1, -17, 0, -10, -12, -20, -7, -3, -1, 8, 9, -5, -5, 5, -5, 7, 6, 16, -3, -8, 8, 2, 11, 10, 15, 9, 8, 5, -6, -10, -1, -2, -6, -11, -9, -8, -9, -13, -4, -16, -2, 1, 13, -6, -10, -2, 7, 3, 5, 1, 7, -9, -2, 2, -14, 9, -4, 9, 15, 8, 13, 15, -3, -5, -1, 15, 11, -12, -5, -6, -7, 5, 1, -22, -11, 5, 2, 1, -12, -6, -27, -20, -4, -2, 0, -14, 7, 18, -10, 2, 4, 2, 5, -8, -7, 3, 9, -17, 18, 6, -1, 14, 16, 3, 12, 21, 0, 3, 10, -11, 22, -13, 9, 13, -4, -14, -6, -8, -6, -11, -5, -12, 3, -18, 1, -6, -14, -11, -11, -12, -14, -13, 0, 5, 1, -1, 2, -4, 2, -9, 13, 13, 8, -16, 20, 2, 8, -14, -4, 10, -21, -5, -2, 23, 0, -8, 2, -4, 9, -7, 11, -13, 10, -7, -19, -4, -16, -4, -11, 2, -5, -24, -23, 1, -4, -12, 4, -11, 0, -1, -1, -3, 9, -2, 15, -4, 0, 7, 5, -1, 3, 22, -11, 0, -10, -1, 7, -4, 1, -10, -3, -5, -3, 9, 13, -13, 0, -8, -16, -10, 1, 8, -5, -20, 6, 0, -2, -13, 3, -5, 12, -14, 5, -1, -5, 20, 11, 10, 12, 11, 10, 5, 22, 7, 14, 29, 5, 20, 4, -6, -8, 5, 2, -9, -20, -14, -25, -6, 8, 2, 1, -13, -8, -11, -5, -1, -2, 9, -3, 1, -4, 13, 7, -4, 0, -12, 0, -12, 3, 9, 7, -4, 4, 22, -9, 6, 25, 9, 10, -16, -3, 15, -1, -19, -14]
5765a4J6j6oL1j2oJ8k6OorLK1rJ4j2jlj1K3Pk%%kj8MKOJ5rOj3J3j6Nj6%L6j4N
5806A0j5MNJ1j5lj6NnJ2J3k3JQj2K7j0kNPj5J3Lj0Rk1J2j1J0J0k0K0klJ3qrQJ0
5845A6rKj5JRnKj2L7k7J2j6oJ3%Qj6NjjpJLJ5j2LpJ%J3nkK5j1j0%pJ2J0j1j6K2
5887A4j2j5J2j2JKRmnRPj7J6Kjj1Ok6J9kkpNJ0%jj0PLJ3Kj5nMOkJ6nnKj7K4rm
5931BOmNj4Rj5K1%j2NnjKk1J5Qjj6J2Oj0J4Qj9%MpJ0j3J0joMPPj8J0N%jRLRk5
5975BJ2k%%pj1NJ5l7K2qJ4j3JojJ3j1j7L1LJ0j6%Lo%j6J1J2jpj1J5nJ7nj0L4l2
6015bJ2nRRj6Jj1kJ7mkkKmkj5K3qjk3L2k8J5J5j8%J2mj0K5oLj3NpJ1j3J4MNJ0
6056B8k6J1J0rl0J7QoQJj8nL5k1Pk2J7j1OmlOJk0kRMj1J2J0qJ0njMjJ0Pj4%J2
$$ y = [-14, 2, -14, -20, 11, -1, -7, 11, -15, -9, -15, -24, -21, 0, -9, 5, -7, -8, -11, -22, 1, 8, 6, 6, 6, 4, -14, -10, -8, -2, 13, 4, 10, -3, 10, -6, -1, -17, -17, 19, 5, 10, -5, -1, 4, 15, 0, -3, -19, -14, -19, -7, 6, -17, -16, -8, -20, 7, -3, -5, 0, 7, -8, 5, 8, -2, 7, -14, -2, -13, -3, 7, -13, 7, 5, 2, 15, 7, -2, 6, 16, 7, 9, -6, -5, 4, -1, 1, -11, 26, -1, 11, -5, -11, 2, 2, 10, -6, -1, -2, -3, -10, -9, -6, 9, -3, 0, -7, -6, -6, 7, 2, 0, 25, 14, 4, 4, -3, 9, 19, 8, -8, 14, 2, -13, -1, -13, -12, -10, -1, -5, -10, -1, 6, -11, 5, 7, 6, -5, 1, -25, -6, -8, -10, -17, -12, -2, -2, -3, -13, -6, -3, 10, 12, -3, -8, -4, 2, 0, 16, 11, 6, 8, -9, 15, 6, 2, 8, 4, 9, -5, 4, -11, 10, 10, -2, 3, -2, -3, -1, -22, -7, 1, 0, -16, -4, 2, -8, 6, 14, -5, -5, -1, -8, 2, -11, -1, -2, -8, -4, 3, 10, -8, 2, 7, 7, 6, 15, 18, 27, 2, 14, 12, 12, 12, 5, -6, -1, 14, -23, -1, -9, 5, -8, -7, -13, -14, -1, -12, -29, 2, 5, 15, -1, -1, 2, -4, -4, -20, -9, 3, 2, -5, -16, -1, -6, 11, 6, -4, 30, -2, 10, 5, 14, 23, 7, 8, -3, -5, 12, 8, 6, 4, 6, 2, 0, -15, 8, 0, -1, -24, 8, -20, -5, 10, -8, -8, 4, 0, -10, 15, 9, 12, -1, 4, -3, 8, -5, 9, 13, 18, 28, 2, 13, 23, 14, -16, 1, 9, 3, 11, 12, -6, -11, 24, 3, 10, -12, 5, -6, 0, -4, -7, -1, 0, -20, -22, -13, -9, -20, -8, 2, -6, 4, -1, -2, 2, 1, 11, 18, 4, 4, 16]
6097A6%qJ6j2PJkrqkJ5prKPj7JK6k5J0NqnjJ4k1K5j5oJ9j2rJ1J6m2L0OrKqK3r
6139HOjopN%lPqMqJ4k3MrJ6nLkJ1Mj0jrlJ1j8J3Ok5K0MonJ5ojnMJ1J1k8P%QPo
6186DJ7rmMoQj6JJ3mjKj2LpoLNJ9l0K1oj6kJ6j9MJ5J2j7RPj5K7poLlj9J9j9J8
6228FMqJ3J3k5O%Mk1LJML3j3j4MKj8LJ1j6lkJ8Mk3pNJ4ORj2J5k5OJ0MkJ2ok4K4
6270A5j3J6j6NlRj0PNj1j2%J3ppPj3J0nJ4j0J6k2Qj4J2%j2kJJ9nJlJ4Ok2K3oL
6310A1pJ3onlJ4pj2K1j6J6j3Pl6L5j9Qj9J2Oj9J6j3J6Nj3jnPRPk3J3%pR%j1J9
6349Iopj3LpRK5pj4K2joj0K1j2j9RPj0Olj6OJ2j6K0Qj8kPkJj7J6J2j8J0nMK4j6
6390Fj0J9k3Mj1K6l1K0j7K0j0K4j2O%%mlJ5qj0J7j6mnjJmNKMj3kj8K0JMqPkJ8
$$ y = [16, 16, 8, 24, 12, 19, 20, 18, 9, 1, -1, 14, 7, -2, 0, 7, -10, -9, 17, -8, 2, 7, -1, -6, -7, 7, -14, 11, -4, -10, 9, -3, -12, -1, 15, -27, 3, 9, 0, 2, -6, 17, 8, 14, 13, 7, 0, 5, 5, 2, 9, 1, 5, -3, 11, -12, -8, -17, -1, -6, -3, -5, 6, 10, 0, -1, -10, -13, -2, -20, -7, -1, -26, -6, -2, -8, -13, 2, -4, -5, -10, -6, 5, 16, -12, -5, -5, 3, 10, 4, 21, 12, 8, 12, 6, 14, -2, -1, 12, 8, 7, 9, -3, 0, -7, -13, -10, -5, 14, -16, 5, -1, -17, -19, -3, -22, -18, -3, 9, -8, 1, 8, -7, 20, 13, 7, 10, 7, -12, 7, -12, 6, 10, 2, 15, 28, 3, 9, 9, 13, -8, -5, -4, 0, 33, 20, 6, 10, 12, -6, -3, 8, -8, -11, -13, 5, 9, -14, -21, -16, -2, 4, 13, 1, 16, -9, -3, 7, 11, 9, 21, 15, -9, 15, 2, 18, 2, 7, 4, 13, 3, 10, 15, 4, -8, -8, 5, -2, -9, -2, -15, -5, -10, 4, -6, 10, -12, -4, -18, -6, -6, -18, -20, -19, 0, -5, -4, -7, 7, 13, -9, 14, 8, 11, 4, 17, 11, 6, 3, 17, 10, -2, 19, 3, 19, 6, 13, -23, 12, -7, 1, -18, -6, 0, -19, -3, -16, 0, 5, -8, -9, -14, -7, 2, 9, -14, -1, -1, -8, 1, 1, -10, 9, 3, -4, -17, -14, -21, -12, 13, 6, -8, 14, 13, 7, -3, 18, 6, -13, -4, 3, -7, -1, -4, -20, -14, -2, -18, 2, 10, -8, -10, -3, -5, -4, -21, -5, 7, -11, -1, -6, -2, 22, 6, -4, 15, -8, -4, -15, 11, -20, 0, -17, 3, -7, 17, 5, 11, 11, 11, 7, 4, 19, 11, 1, 18, 2, -2, -7, -8, -7, -11, -6, -4, 0, -13, -15, -33, -13, -12, -8, -16, -9, -11, 7]
6431Gj4J7lQj4oKlJ0mJnmK3Jl%%j5J8Rk0J9k0lJ3j4KkqPkRj4j3J4JJ0j9qJ7%j3
6474a9J7MMk0OK7ln%j6J3k0J0PJ1j4pK6j4Qj7J3j5J1k1NPJ1k4J3J4p%j2J3l3K1
6511fKj0J7ok4K7j2LKPnJ1jj3MJ3K%k3L0j4NQpoknkpkLRRj9QPOl0PL7l5NjK1k
6556A1j9MpJ3j0Nj0oL9j2k2K3njQpMQqj1QpK5j5Jk0K2pj5Lj3QmK5l5JK9j2j0K8
6596IOj9nkj7K6nLLkm%jK4qj3J4j7OjJ4orNoJ8j7lR%J8j2qj1J2nMk2K1lpJ0lo
6640a0j6RK1k1J7jnmNJ5j7K2k1lJ1oJK6m1OJ2J1j6MJNkRj7%Rj6mK5j7JRj0jqj
6681a8QQj7J9rkJ2j0qJ5j%k1L7rrQJ5lj3jJ1j5J4MMj1OrRrj4oQjMJ0j7kJ1k2J3
6723a1lj1nPK1j4J3ojm%J0JrlJ3Plj1L2j6oJ1j0QmOOk3J5Jj6j2L4k5OjlMj1kK4
$$ y = [7, -7, 10, 7, 15, 1, -5, -3, -6, 4, 0, 1, -4, -8, 15, 16, 13, 13, 13, -2, 16, 25, 5, 24, 4, 1, 14, 0, 2, 0, -8, -1, -3, 6, -8, -21, -7, -6, 4, -15, -23, -6, -6, -19, -2, 2, 6, -14, -8, 19, 16, 11, 11, -5, 8, -12, -2, 5, 16, 2, -5, 21, 7, 15, -2, 11, -4, 7, -14, -9, -2, 9, -15, -2, 12, 5, 5, -7, 6, -27, -6, -4, -14, 3, -3, -27, 0, -12, -9, -7, 0, -5, 6, 5, -8, -4, 9, 11, 11, -12, 18, 4, 9, 17, 10, 4, 2, -3, -5, -12, -14, -11, -2, 7, -12, -4, 3, 9, -21, -14, 23, -12, -7, -8, 13, 11, -8, -4, -11, 2, -8, -3, -13, -19, 20, 8, -14, 9, 4, 3, 11, 4, 8, 16, 8, -3, 5, -2, 23, 8, 9, -11, 11, 4, -11, -8, -21, -13, -17, 8, -27, -26, 3, -9, -19, 9, 15, -4, -9, -11, -28, -2, -7, -4, -1, -3, -7, -7, -8, 16, 8, -5, 9, -8, -2, -3, 11, 5, -4, 1, -5, 13, -4, -7, 2, 2, 20, 8, 0, -11, 1, -4, 0, -22, -1, -4, -11, -1, -4, -10, -26, -17, 4, -17, 0, -1, -6, -10, -5, 10, -7, 15, -6, -9, 2, -4, -3, 23, -18, -12, 0, 11, -5, -1, 0, 5, 3, 12, -5, -5, 4, -12, -16, 9, -8, -7, 2, -8, -9, -17, -18, -10, -2, -19, 0, -9, -11, 1, -9, -17, -2, -3, -3, -24, 13, 4, -5, 3, 18, 15, 2, 1, 12, -3, 11, 15, 19, 8, 14, 5, 14, 5, -9, -15, -7, -8, -4, 6, -11, -13, -2, -24, -11, -14, -25, -30, -23, -2, -16, -3, -9, -10, -14, -14, -4, -3, -12, -15, -2, 5, 2, -9, 23, 7, 1, 12, 2, 10, 6, 12, 18, -5, 10, 11, -5, -17, 17, -8, -2, -3, -6, -2, -13, -15, 9]
6765Ij5%jjJ1j6LKl%oNRnJ2Jjj1NJ7rLKl0K8Nj9LJ6k7K7jlj2%Kj4J3oj0K2mLj2
6809hoj1J6j3ORj1JJ9%Nk1JkRrJ2J1j3nJ6j9J3POj5PPj4K7m1J5Nj0J8j1j2Ljm
6849a3LKJ1j9J8jrnjj2J9J0j7oRKLJJ0j6J7qPj3LOJLnkJ0J6j3k1jK7j7J3k7J5
6889@j6QPrQj3K2j3KJ0k9J1JMmnJ1prJK3Qk2J2LPmkj2jK5j5J8pOk6J0MkpoJ3q
6932cqPjomRmMJ0oj6LJ5rnJ8Mj3j2PnPJ1koLJ0Mj8JPmLLK5k6KnpJ0j4J2j3RoP
6978blk4K6qlK2lj1jnj4RMnNL3k1%JPkj1J1pNqJ5j1oJ3J9l3jL5j3j3J7j7Nj0L
7019bj8nJ6moPJ1j1NpKLMjMroK6qM%J0%k3N%kK3k4J1Lj5J3%qQojJ6j6MrLKpoK7
7066A3rqqJ4pJponmK2j1RjlK9j2j5LMRpPoj4JNK0pjj6J5MpmqK0k2QnpK3j7OJ3
$$ y = [9, -6, -6, -7, -8, 3, -13, -10, -8, -11, -11, -17, -12, -3, -8, 4, 5, 4, -7, -2, 15, 6, 9, 11, -19, 9, 14, -5, -2, 14, -13, 14, 13, 10, -2, -2, 0, -14, -1, -7, -17, 5, 1, 4, -8, -14, -25, -9, -22, -16, -7, -18, -17, 2, 2, 7, -14, -13, -15, -6, -15, -3, 8, -5, -10, 6, -13, 0, 7, 13, -2, 5, 12, -2, 25, -16, -1, 4, -6, 12, 1, -11, -8, -9, -13, -10, -8, 3, -16, 2, 1, -8, -13, -14, -26, -7, 3, -14, -20, -11, -9, -6, -5, 5, -11, 6, -2, 5, -8, -5, 1, 2, 5, 0, -2, 8, 24, 11, -10, -11, 16, -1, 12, -15, 0, -16, -8, -1, -10, -2, -15, 7, -6, -4, 6, -23, -12, -11, -7, -11, -16, -5, -12, -21, -20, 3, 11, -11, 1, 4, 11, 7, 5, -7, -8, 17, 2, 20, 13, 19, -7, 3, 7, 5, -2, -8, 5, -3, -11, -4, -5, -11, -15, -6, -10, -6, 4, -2, -18, -15, 0, -9, -14, 4, 8, -5, -17, -10, -15, -8, 3, 1, -5, -2, 8, 12, -6, -5, 2, -2, 1, 4, 29, 3, 5, 0, -7, 3, -11, 1, -12, -3, -9, -2, -5, -29, -3, -11, -14, 8, 5, -6, -7, -12, -26, -17, -13, -18, -13, 20, -1, -1, 0, 7, 5, -6, 5, -2, 3, -5, 10, -1, -7, 6, 25, -8, -9, 26, 13, 0, 17, 0, 5, -5, -2, -20, -25, -9, -13, -19, -12, -1, -12, -7, -14, -12, -9, -5, -6, -2, -11, -17, 9, 1, 5, 5, 15, 15, -8, -3, -3, -5, 18, -6, 5, 8, -7, 6, 6, -2, 6, 0, -1, 15, -1, 3, -6, -3, -1, -8, -14, 13, 4, -4, -12, 2, -5, -4, -11, -17, -22, -26, -4, -15, -6, -7, -10, 19, 7, -8, -5, -1, 8, 1, 8, 2, -12, -11, -6, 14, 7, 6, -10, 5, 9, 2, -2, -10, 10, -12, -4, -9, -16, 7, -10, -4, 9]
7111Ik9kJ4kOj1J0j4%J5j6LJ3%J2kmjlJ2mlonJ7Jlj1Mkj7K1J4j6j7RMqnOJ2j9
7153a8J5j4J3MooJ0nj1KkJ4nj1lK8mPj8J9j5K0j0oJ4nJ0j1J1jl2K0j5K2j9Nj1
7190a4Kj5QL2k1LJ2k0JLJ9j0LLoQj6RLj1mNKLPNjKoj3PJPjJlKO%Jkk1J5Jk5J4
7236dj0J6k3RokK9l2Q%J5k1J4Lj8J1KK3%j2j8J3j2L5l0KJ2loJ6k8K7%j0njK3j4
7274CpPKj3QmnJlJ0k4L4oj6OJj3PpK7j0j%lK5kmjl6K8j5lJ6nK4k4J9jj0%MNj1
7317CJ9k1jj4mK4%Kjp%j5J3omOk0J0nPkJ0j4J7kJ5koK1k1j7K8knKOj6J1nj1J2
7358Ej1lPj1J2jpqlJ0J9l0K7qjj1J2qj2LJ1Oj2J%J1oJ8j8J1MQpPLk2K3j2kKll
7400AJ3p%rkQnqLnj3J9Kjo%qRRk0K0RLk5J6j3K0k1J1KQj1MLpJ0NPJj1Ok6L8k0
$$ y = [9, -20, -22, -8, -10, -4, -15, -5, -19, -19, -4, -20, -17, -4, -4, 8, 6, 2, 1, -2, 10, 6, 3, -3, -8, 9, 10, 7, -4, 0, -2, -19, 2, 16, 0, -17, -8, -4, -12, -17, -11, 1, -18, -3, -17, -4, 0, -6, -12, -2, -7, -18, -16, -18, -4, -9, -20, -23, 5, 1, 8, -10, 9, -6, 14, 4, -2, 12, 7, 17, 6, 17, 16, -16, 4, -11, 11, -8, -3, -14, -12, -27, -19, 13, -8, -5, 7, -13, -12, -9, 10, 0, 3, 6, 0, 8, -8, 1, 4, -7, -11, -6, -4, -1, 6, 11, 10, 12, 6, -7, 0, 1, 8, 7, 8, 5, 7, 13, 13, 14, 12, -9, 6, 7, -18, -4, -14, 2, -21, -12, -18, -20, 9, -23, -15, -15, 0, -21, -7, -4, -22, -11, -9, 14, 14, 2, -16, -3, -15, 20, -10, -8, 4, 1, -5, 11, -17, 10, 10, 0, -5, -6, 17, 3, -4, 3, 5, -8, 0, -4, -9, -8, -11, -1, -25, 9, 3, -13, -7, -6, -19, -12, -19, 8, -2, -3, -3, -6, 19, 17, 13, 12, -24, 4, -11, -14, 2, -3, 21, -3, 16, 15, 5, 5, 9, 14, 3, 22, 1, 0, -14, -18, 6, 6, 8, 7, 0, 0, -15, -2, -8, -12, -6, -26, -16, -21, -14, -16, -6, -20, -3, -5, 10, 8, 2, 23, 2, -15, 13, 11, 6, 8, 14, -2, 9, 4, -7, 5, -6, -9, -2, -13, -1, -2, -9, -17, -20, -10, 9, -21, 6, -2, -3, -14, -2, -10, -22, -19, -8, -2, -14, -13, -13, -2, -8, 10, -8, 3, 7, 15, 8, 15, 18, -4, 19, 7, 5, 7, 4, 1, 14, 7, 7, -2, -4, 4, -1, -9, -6, -11, -24, -5, -3, -4, -10, -10, -18, -9, 0, -20, 0, 9, 12, -13, 3, -10, 10, -11, 0, 2, 10, -1, 3, 6, -1, 9, 14, 21, 22, 11, 17, -9, 29, 9]
7444IK5k0mj1QqK%k2J3Nj0LK1k2NoPJ7k4J0jKpJJ2j4K3j6J8j9J1jPqppJQJ1Nj5
7486BM%nNj6%J0j3J0JjJ0prLkJ3j4KMJMprJ7n%KJ4klJ0j2lJ9lj5kLj0J0j0MJ1
7530A1j0Nk%j6KJMOqnJJ5pj1J2qJ3j9J1qLJ2ppmK3nj4J7OOj8Rm%Mj3K1pk5K2L
7573IJ7j4ooMJ3k7NJ8j4j0JJ4plJ3mj0LJ5j0jj6J5kj3J8LknPJ0lqj1K1lJkj0L0
7614C0k4J2j2%J4kj6j0L%pj2J8j%oK9j3Rj5j4J6mmJ1Pmrj4K3Qj3K2k0jJ9k6j0
7652a6kJ2MlJ4lqnJJ5kLj1J9k7L%%JNjj3NM%oLrQllK5j2JNLj7RPjoRJ4j8jj1K9
7699B1lmmNk3J0jNjmRlj5NOj1J8j7K3k2J2j8mMPJ0j6K2j5J5j5KMLj3QMJ6j2Jl
7740Fj0J2mj1J1mK3k9J0jK0k2nK2m3K1JJ2j3J4j6J3pjJj5J0rQoMJ0j0ONpJ4%J3
$$ y = [9, 34, 14, 10, -1, 7, -1, 1, 1, -21, -8, -3, -13, -10, 11, -11, -6, -12, -5, 12, -12, -2, -3, -1, -8, -7, 5, -9, 14, -2, 16, -3, 8, 7, 14, 6, -1, -8, -7, 1, 12, 17, 2, 6, 6, 1, 6, -10, -10, 0, -13, -3, -2, -3, 7, 0, -9, -6, -8, 5, -9, -7, -3, -2, 2, -5, -14, 3, -2, -2, 0, 14, 12, 9, 19, 7, 4, 23, 20, 5, 3, 6, -4, 6, -4, 0, 11, 1, 6, 4, 4, -12, -10, -9, -5, 1, -7, -12, -11, 4, -3, -14, -2, -10, 3, -16, -5, -13, -10, 2, -5, -12, -16, 7, 2, -12, 5, 11, 17, -1, 8, 4, 4, 8, -5, 16, 9, -16, 6, 9, 26, 12, 6, 0, 4, 17, -10, -5, 13, -1, -11, -10, 4, -3, -6, 7, 3, -7, -4, 11, 1, 0, -16, -1, -3, -16, 2, 5, 3, -2, 5, 15, 12, 4, -7, 14, 11, 12, 10, 0, 30, 6, 18, 6, 6, 20, 18, 2, -8, -5, -5, -12, -24, -6, -7, -7, -13, 16, 3, 12, -3, -17, -1, -5, -9, 2, 9, 5, -4, -18, 5, 13, 0, 22, 2, 1, 20, -6, -16, -18, -6, -2, -5, 9, 6, -2, -7, -6, 9, 7, 10, -1, 18, -9, -6, -6, -6, -5, 0, -1, -14, -9, -5, -5, -11, -8, -17, -9, -12, -15, 10, -2, -1, 4, 7, -10, -1, 6, 5, -1, 8, 22, 4, 3, -8, 21, 18, 14, 10, 15, -8, 2, 1, 6, 5, 1, 10, 7, -8, -3, 3, -8, 10, -7, 16, -6, 6, -12, -16, -12, -5, 5, -11, 11, -4, 11, -4, -2, 2, 5, -8, 0, 4, 20, 8, 9, 6, -4, 8, 4, -7, 4, 0, 23, -6, 4, 3, 23, 1, -4, 18, -25, -4, -3, 9, -4, 10, -6, 7, 0, -1, 0, -15, -5, -14, -6, -12, -8, 2, -8, -2, 3, -4, 10, 10, 23]
7779B3j4%JmQj1oNnQNOk2Qj2J2j3j7K2j%J0rj0J8Nj0pJjK7m1L4j3J1j3NJ2l2K4
7819DJ0j2LKK2k3Jj0RpO%j1J1qRlnlKlljRj0LJ4j8OlJ2J7l3J9k4PRkj2K2j0JJ
7862bqK1%j9PKJ2k5RLPj3LK3Oj5j4jRlj7Mj2J9nqJ2Lj9J9rJ2j5L0jj0mpknK4n
7904Fj0K2j0nMpK5k0Knj1K1j3PNJ1k1J0qOj3OQk3lOjnnJ3mNj%oJ3llnQj8PJ1j
7948eJ1kkQLl%j5NRj9PJ6k0K1k0J6l3K5kJ4j8%j1Rj5K0j6K3mkmj7K7%k2J9j0%
7987gJ4l1K2mjNJ7nj9L0j8J0k2J6mj%nJj9K2%Krj1kPORJpqLJ6pjkJ0j0pj5K4k6
8030b6K9j8KK3k1NOJ2j3jK0j0rKQQpJ4j1%j7J4nj6OKmLMkNk2L2k5JLmJ1Qk1J3
8071aJ0nJKjprNK3j1Rqj0Nj0KPJj2K5j1kJ4qJ9k8j5J9Jojj5J0Lk7RRMnQMj5J5
$$ y = [23, 9, 9, 10, 6, 14, 3, -3, 2, -3, 5, 10, 16, -6, 2, -10, 2, -11, -28, -6, -7, -7, 3, -6, -16, 2, 7, -3, -10, -9, -10, 17, -24, 10, -3, 8, -5, 0, 12, -20, 4, 14, 2, 5, 7, 29, 6, 7, -3, 6, -1, 5, 5, -6, 5, -3, 6, 3, -2, -5, -3, -6, -9, -10, -1, -11, -8, 6, -12, -6, -9, 3, 20, -13, 6, -18, -11, -2, -4, -16, 6, -4, -3, -2, -10, 11, 11, -8, -1, 1, 13, -12, -3, 0, 7, -6, -3, 20, 26, 11, -3, -4, 5, 2, -15, -11, -23, -4, -9, -17, -5, -2, -21, -2, -11, 1, -14, 16, 15, 5, 1, -6, -8, -13, 11, 6, -4, 18, 8, 3, 7, 0, 25, 5, 7, 2, -9, 12, -1, 6, 11, 22, 1, 11, 3, 9, -4, 2, 10, -13, -16, -10, -11, -16, -21, -8, -12, -7, -8, -8, -14, -1, -4, -7, -12, -4, -22, -15, -4, -5, 6, 4, 2, 10, 13, 10, 10, -5, 0, 9, -10, -3, 13, -7, 14, -6, 10, -23, 2, 0, 14, -4, -4, -15, -6, -21, -1, -17, 6, 2, 0, -4, -21, 6, 6, -16, 3, -7, -7, 7, -24, -2, -6, -7, -2, 15, 10, -9, 21, 3, 13, -9, 7, 3, 2, 2, -3, -2, -21, 1, 1, 3, -6, -17, -19, -12, -6, 3, 4, -3, -11, -8, 8, 1, 0, -2, 8, -2, -9, -24, 0, -26, 3, -15, -13, 10, -11, -6, 0, 12, -1, -2, 18, 8, -1, 1, 9, 17, 10, 24, 13, 13, -4, 10, 5, -11, -5, -3, -7, -4, 0, -2, 3, -19, 13, -12, -11, -8, -12, -1, 7, -14, -1, 9, 4, 5, 7, 6, -1, -10, -5, 18, 7, 16, 8, -2, 3, -7, -5, 2, 3, -9, 16, 5, 3, 17, 9, 28, 0, -15, 4, 5, -1, -2, -17, -7, -4, -31, -22, -13, -9, -14, -6, -2, -17, -2]
8114bjqoL5k7J5RoKlk3J3%NK4j5j5LRj1K0j7J5j3j4K8rj1KrJ4j6oJ7%qJLJ5j5
8154ePpJ2k3J3%%j9J1J6Nj1J9j6rJ5LNmpkpL2k5Nj3jjQk7L2Ooj2jRL
$$ y = [-2, -3, -11, -17, 18, -9, 6, 15, 9, 11, 8, -15, -2, -2, 3, 27, 12, -3, 0, 9, -2, 18, 1, 16, 3, -11, 17, 8, -3, -1, -10, 4, -12, -18, -1, -1, -9, -8, -5, 10, -5, 2, -5, 7, -16, -3, -3, -3, -22, -11, 5, 10, -1, 18, 2, -7, 8, 11, 16, 12, 5, 3, -4, 28, 3, 8, -5, -6, -7, 1, -26, 6, 12, 6, -6, -7, 2, 5]
8191E
$$ Imaginary data points
##PAGE= N=2
##DATA TABLE= (X++(I..I)), XYDATA
0@%%%%%%%QqQj6J6k1K9m0M8n6P2q8J12j36J60j92K30k70L12l66M27m91N64o48
31c46P38q38R52j075J209j363J531j712J915k136K373k633K920l233L575l948
47b071M354m800N291n827O417p072P801q615R527j0563J1746j3108J4707j6610
61h823J8916k1786K5469l0393L7360m8050O6705j08547L71899j39549q00303J69762
73d67340N59880K92483m44065m14986J97395O93185K63118m72762o79126m2781
83e14999N29815L90336k69049m85521j4680N40672L84386k67070o10110j87317
93e03537M15230M52039j03705m70059j79524L81518M39624q1597n16552k93712
103d60275K78848M67280M2775m06172k91183K26260M43632P1375m05195l59775
$$ y = [0, 0, 0, 0, 0, 0, 0, 0, 8, 0, 8, -8, 8, -13, 16, -24, 24, -32, 40, -48, 64, -72, 88, -104, 126, -144, 168, -198, 229, -262, 302, -346, 392, -446, 506, -569, 640, -723, 808, -904, 1011, -1125, 1248, -1385, 1535, -1698, 1877, -2071, 2283, -2517, 2774, -3053, 3364, -3708, 4093, -4522, 5005, -5558, 6188, -6920, 7787, -8823, 10093, -11693, 13776, -16617, 20743, -27307, 39398, -69149, 302750, 163201, -637102, -467340, 92540, 385023, -59042, -474028, -276633, 416552, 679670, 206908, -472218, -514999, 14816, 405152, 136103, -349418, -364098, 176574, 560960, 293890, -316220, -503537, -88307, 363732, 260027, -210032, -389556, -8038, 431586, 349989, -166563, -460275, -181427, 285853, 328628, -77544, -368727, -142467, 301165, 372540, -32655, -392430]
113c92430J39609M40876J61825l10204l51345Q1601M03061J86222k80477l81479
123c02741R632L76061K45011j95681l60888m2673L26502K57356j53077l60826
133b01324r7424K85160K87836q1089l29460j36799K31723K87008l8336l10698
143a03403j73808J86508K96331J8890k74092j99477J35840K85564N5653k45713
153a7707k21361R2307K80270R9101k06873k34481M6607K61040J27650j72821k42508
164a88776P056K43667J57461j32547k42474l2027K16128J75080r5847k36463o4427
175a93169J88976J90255n7012k23816r3757J55983J95371k2521k06543j16156
185a82389J24527J97326J0666j85492j34470R1355J92355L8912j62618j47043
$$ y = [-392430, -252821, 188055, 349880, 39676, -311669, -230068, 172993, 359215, 78738, -302741, -293109, 82952, 327963, 132282, -228606, -271279, 55223, 312579, 159502, -201324, -298748, -13588, 274248, 193159, -136301, -273100, -41377, 245631, 207295, -103403, -277211, -90703, 205628, 224518, -49574, -249051, -113211, 172353, 228006, -17707, -239068, -146761, 133509, 232610, 25737, -208744, -162137, 98903, 226553, 53732, -188776, -181720, 61947, 219408, 86861, -155613, -187640, 28488, 203568, 107721, -128742, -193169, -4193, 186062, 129050, -94766, -188523, -32540, 162831, 140310, -66233, -182389, -57862, 139464, 150130, -35362, -169832, -78477, 113878, 152790, -9828, -156871]
195a56871O1107J85357O4568j38465j56162L1274J74190Q5758j13973j60874M454
206a19637J61620J04190q9256j62515k1115J45823J18484o4378j59967m3679J28428
217b002J29198l9797j53900o3954J08473J35463j5997j43788q0555Q7354J37562
228I8057O408j30620r3707O5276J35452K6677j14883j02953M3655J30109M4320
239A07791r7729j08936K2814J22040N9350p9942j11822L585J12291P1805o2262
250C8985j12443j4170J01191Q1865m4801j10795l0158Q9116Q9611k7852j07168
261d6619m4492P5982R4972j1304j01407n6842O1941R7676M394r3385o6973M7132
273c8925R7568J8983q3334p4454L2030R4636L1974p1570p9272J7098Q9213M2966
$$ y = [-156871, -95764, 89593, 154161, 15696, -140466, -109192, 64998, 150756, 36783, -124091, -119637, 41983, 146173, 56917, -105598, -126713, 19110, 137594, 73216, -86751, -130430, -2002, 127196, 87399, -66501, -130455, -21982, 113481, 97484, -46304, -126859, -39505, 98057, 104465, -26155, -119862, -54586, 80866, 107543, -7340, -110293, -66638, 63471, 107791, 10062, -98874, -76060, 45980, 105330, 25388, -86434, -82849, 29442, 101247, 38985, -73458, -87628, 13563, 95428, 50627, -60168, -90326, -1210, 88401, 60549, -46619, -91111, -15129, 79843, 68539, -32868, -89710, -27769, 69907, 74301, -19084, -86057, -38925, 58643, 77626, -5708, -80162, -48132, 46504, 78478, 6908, -72364, -55266, 33947, 76913]
285G6913n8711q1423L031Q1852N1868m5501q1353r910P3173N8779l2414p9440
297d3136k1454O3735O3785j9848p6180l1552N3882O7307p960p1770m0345M3782
309a9754O9234L294o6261m7712L3425O9614J3701n9619n3539K2938O8288K3199
321E6808n1831n7646J2447O5119L1436m3068n9766K290O0281L8135l3644n9979
333c9418p156N3997M3218k3954n8426j5679M6756M6688j4560n5488k2963L9054
345g931M8709n651n1617k9075L1203M9540K563m7049l4141K3488M9405J0008m2033
358b581l8135J5923M8389J6762l6587m1173Q576M6435K2728l0647m3058J409M3469
371A1510K7814k4330m3718n364L9533L1786j7615m3091j1532L4634L4517j0874
$$ y = [76913, 18202, -63221, -60190, 21662, 73530, 28029, -53324, -63234, 9939, 68718, 36304, -43136, -64590, -855, 62930, 43082, -33098, -64650, -10768, 56539, 48579, -23191, -63536, -19754, 49480, 52774, -13487, -61199, -27774, 41840, 55541, -4078, -57617, -34679, 33609, 56808, 4977, -52669, -40222, 24897, 56333, 13265, -46501, -44211, 16070, 54205, 20561, -39418, -46574, 7423, 50641, 26687, -31739, -47418, -662, 46026, 31466, -24022, -46985, -7931, 40778, 35127, -16490, -45565, -14362, 35178, 37741, -9308, -43449, -19961, 29444, 39452, -2581, -40716, -24793, 23596, 40358, 3771, -37402, -28826, 17609, 40337, 9690, -33368, -31959, 11510, 39324, 14994, -28724, -34088, 5445, 37231, 19616, -23475, -35007, -373, 34144, 23270]
383B3270m1205j6895K9077L6078m370l8288k1373K3197L6480J709l4591k4879
395c1790J7275L5986P156l0541k7509J1569L4820J2010k6275k9457O147L3173
407A2564J6224k1904l0708J012L1109J9835j7456l1350l800K8541K2890j2882
419A4075l1282q284K5420K5210q206l0396j2276K1775K6690l555k8678j5759J7681
432g585K7336R52k6223j8475J3320K7075N073k3152k0515Q990K6098Q725j9743
445A876k1827M745K4571J1872j6225k2508Q12K2731J4445j2673k2802k767K0643
458B893J6606r236k2663o076J8360J8340n864k2132r033J5886J9592k565k1137
471g029j1666J3121K0339O69j9669j3824J0114K0438L720j7662j5520P021J9965
$$ y = [23270, -17935, -34830, -5753, 30325, 25955, -12333, -33706, -10509, 25971, 27680, -6911, -31790, -14515, 21471, 28627, -1914, -29423, -17854, 16966, 28976, 2701, -26756, -20609, 12564, 28788, 6884, -23824, -22812, 8297, 28132, 10676, -20674, -24474, 4067, 26957, 14075, -17207, -25491, -71, 25139, 16933, -13463, -25739, -3964, 22726, 19171, -9507, -25266, -7585, 19751, 20703, -5520, -23995, -10675, 16400, 21473, -1679, -22194, -13204, 12894, 21619, 1876, -19951, -15206, 9365, 21237, 5012, -17496, -16684, 6047, 20492, 7819, -14983, -17750, 2893, 19499, 10263, -12400, -18476, -116, 18224, 12360, -9772, -18805, -2919, 16673, 14108, -7029, -18695, -5574, 14765, 15434, -4235, -18059, -7945, 12493, 16213, -1449, -16969, -9948, 10017]
484A0017O451j5258j6578L863J8858Q866j2574j7125Q75J7359J0787r778j7176
497a1413j893J5595J2318p063j6807m371J3609J3468m404j6256o534J1655J4295
510A2199j941j5444q459R617J4859M28j4435j0108P510J5052K703j3145j1500
523a2664N340J4917M761j1575j2483L064J4368O637r744j3025Q12J3403Q166p692
537D285j3168j307J2064R368n536j2902l220J0471J0198l413j2306m896Q788J0684
551I110j421j1491o304P059J0959M16j0562p444N375J0992K060r498q417L753
565e413J0864L574q403r150K149J0561M931p158r673N89R978O135n805r916r48
580g685R191P065m312r853k365Q105P757k763r447l630O850Q145j260q822m682
$$ y = [10017, 16468, 1210, -15368, -11505, 7353, 16219, 3645, -13480, -12605, 4754, 15541, 5763, -11413, -13306, 2289, 14607, 7544, -9263, -13634, -25, 13443, 9039, -7217, -13751, -2096, 12199, 10258, -5186, -13645, -4028, 10831, 11259, -3176, -13284, -5774, 9278, 11981, -1164, -12664, -7324, 7593, 12354, 779, -11704, -8640, 5728, 12365, 2621, -10404, -9592, 3811, 11977, 4285, -8883, -10190, 1874, 11242, 5706, -7196, -10416, 55, 10253, 6840, -5466, -10362, -1574, 9110, 7689, -3802, -10106, -3047, 7912, 8328, -2234, -9678, -4303, 6689, 8749, -749, -9166, -5413, 5451, 9025, 622, -8528, -6379, 4182, 9113, 1955, -7718, -7129, 2849, 8984, 3179, -6737, -7685, 1506, 8571, 4259, -5594, -7959, 146, 7903, 5140, -4307, -7937, -1087, 7058, 5798, -3024, -7706]
595g706N493Q297J70q010n547M128Q233J436p104o185K835Q000K546o133o689
610f236J592P690L585n209p042M49P255M439m203p253o83O773N190l229p304j712
626e898O088N789k161p156k665N264O167j048o810l508M333O374J5o260m180L299
642b357O312J027n526m702K276O120J892m743n031J267N776K673l925n245L15
657c871N392L282l102n316m92M914L810k321n348j261M423M271j552n269j989
672d429L881M592q01n068k646L302M814n2m774l140K570M864P08m331l592J842
688b260M789J386l774l893J095M568J965l122m032L37M184K478k458m080l27L784
704F40K846j770m027r37L318L175j149l889j468K845L393n96l715j943K424L531
$$ y = [-7706, -2213, 6084, 6254, -1756, -7303, -3175, 5058, 6494, -610, -6795, -3960, 4040, 6586, 453, -6236, -4644, 3046, 6631, 1422, -5620, -5171, 2084, 6523, 2320, -4933, -5616, 1157, 6347, 3118, -4186, -5898, 190, 5979, 3818, -3338, -6003, -739, 5428, 4380, -2430, -5938, -1605, 4769, 4784, -1476, -5656, -2357, 3955, 4982, -544, -5246, -2970, 3150, 5042, 299, -4732, -3465, 2311, 4984, 1059, -4186, -3871, 1521, 4803, 1701, -3615, -4107, 807, 4617, 2296, -3052, -4313, 110, 4381, 2829, -2440, -4429, -548, 4044, 3243, -1825, -4471, -1169, 3645, 3593, -1181, -4321, -1751, 3113, 3821, -510, -4102, -2260, 2529, 3915, 141, -3752, -2657, 1911, 3876, 754, -3278, -2941, 1243, 3721, 1263, -2817, -3144, 640, 3486, 1716, -2311, -3248, 70, 3245, 2096, -1793, -3261, -416, 2977, 2381, -1334, -3277, -853, 2678]
720B678l2l521k344J921L638N14l264k677J415L608J011k896k939Q96L492J500
736C000k482l111L35L301J866j980l143k09K975K179j466l085o65K590K390r27
752A568k973j074K184K527m53k780j423J774K639l5k579j722J382K639M15k357
768b68j972J020K617P73k117k156O31K587J084j827k297K55K454J418j515k396
784a709j05K287J630j170k363m64K022J825p79k293p92J724J926l92k144j044
800a841J393J957n2j948j274J062J967K68j731j449P45J922N56j514j580M51J853
817G85P95j296j673J85J763J010j068j754p4J681J183q54j751l44J537J350o16
834H59j759n72J366J450l45j645q05J132J521q4j551r46Q68J503J91j370j093
$$ y = [2678, 2646, -875, -3219, -1298, 2340, 2854, -410, -3087, -1672, 1936, 2947, 51, -2888, -1992, 1500, 3000, 518, -2593, -2258, 1043, 2909, 929, -2214, -2423, 552, 2731, 1265, -1820, -2485, 105, 2495, 1568, -1405, -2479, -295, 2232, 1779, -1001, -2424, -650, 1989, 1954, -625, -2347, -965, 1674, 2089, -268, -2240, -1220, 1397, 2170, 53, -2103, -1472, 1115, 2199, 372, -1925, -1670, 784, 2202, 687, -1709, -1814, 473, 2103, 933, -1430, -1894, 128, 1953, 1174, -1119, -1911, -187, 1739, 1347, -797, -1841, -448, 1509, 1457, -491, -1765, -703, 1264, 1532, -199, -1648, -903, 1019, 1575, 61, -1519, -1068, 785, 1580, 284, -1389, -1204, 559, 1569, 501, -1253, -1327, 354, 1537, 683, -1068, -1412, 125, 1475, 859, -900, -1472, -106, 1344, 999, -646, -1451, -319, 1202, 1118, -433, -1379, -511, 992, 1183, -187, -1280]
851a280O07J469L69j142j174L61J392N93r83j236J29J307P45p79j278p4J213Q77
869A116o15j271k57J108J002m56j282m26R96J067k19j269n82Q52J135n8j178p41
887a078O90J188J01j080q31N04J162K71r45q85L16J079M58q10r38J19J012N80
905I13o43r68l1R41O35m67r59j68Q10P12l01r38l04P05P84j62r07m41O09Q30m8
926F02q59n24N07Q81O7q03o33L93Q82K10p44o85K66Q34L25o48p22J30P99M16n06
947A88p63J4P22M89l75p42j04O29N35k56p06k33N50N85j35o56l15M43O16l9o41
968a94l92L79O36N7n91m49K65O58J59n38n06K01O17K45m76n64R4O26L20m20n60
989d33J3N76L56l21n71o6N22M06k11n74j80M70M53j43n22k44L75M81o7m76k81
$$ y = [-1280, -673, 796, 1165, 23, -1151, -790, 602, 1195, 212, -1024, -895, 412, 1157, 378, -900, -974, 239, 1116, 501, -770, -1027, 81, 1083, 627, -655, -1081, -85, 982, 763, -506, -1088, -236, 899, 841, -337, -1078, -388, 800, 901, -179, -1010, -506, 656, 927, -18, -903, -587, 492, 950, 140, -798, -679, 333, 913, 270, -698, -729, 212, 847, 380, -579, -747, 63, 775, 474, -464, -768, -63, 721, 559, -348, -789, -180, 650, 602, -257, -781, -274, 607, 674, -129, -762, -369, 513, 723, -21, -706, -440, 394, 719, 71, -651, -521, 278, 694, 188, -575, -561, 161, 650, 275, -467, -571, 58, 593, 337, -369, -602, -52, 533, 398, -258, -573, -130, 486, 447, -194, -586, -207, 429, 486, -105, -554, -289, 369, 528, -10, -516, -315, 302, 547, 71, -493, -399, 227, 547, 127, -433, -420, 156, 512, 191, -380, -446, 76, 482, 271, -303, -483, -13, 440, 297, -225, -469, -94, 387, 320, -156, -437]
1010d37K89M81L7m56l17K17M57J02l88l56J50M31J71l28m14Q2M49K32l08m28J1
1031c23M37K66k19m57n4M19L22j95m41j14L62L43j04m44j58K90L77n1l91k14K34
1052a15L87K0l53k59J56L75P0k87k90J12L64J06k60l07O8L50J85k48l01oL15K07
1074B89j67l21m4K75K51j40l26p8K73K60r7l31j16K22L00o1l11j65K13K96mk98
1096h0j96J60L21L8k53k35J16K78Q0j99k45L5K88J25j54k64J2K27J70j47k30k3
1118a76K16J56r0k44n9J75K31o9k59q4J78K16l0k44j19J51K14J0k21j64J21K52
1140A61J6j88j78O7K47R2k16j74M3K15J16j61k12M5J98J30j45j81k9J89J15n0
1162A00k11n0J71J23l7j77o2J15J61l1j73q0J00J67J0j76j12Q6J77M1j75j03M8
$$ y = [-437, -148, 333, 370, -86, -403, -186, 271, 373, -15, -371, -221, 210, 381, 53, -361, -279, 170, 402, 94, -334, -323, 114, 380, 161, -296, -350, 69, 391, 196, -245, -359, 3, 346, 242, -202, -360, -70, 307, 256, -135, -349, -115, 272, 292, -61, -320, -164, 211, 281, -6, -296, -184, 180, 286, 26, -281, -213, 137, 322, 74, -227, -233, 82, 289, 122, -199, -243, 32, 283, 143, -183, -261, 12, 272, 175, -156, -272, -50, 250, 189, -122, -287, -74, 222, 218, -80, -276, -116, 205, 243, -10, -245, -129, 149, 229, 30, -215, -180, 108, 233, 79, -185, -173, 54, 224, 77, -153, -176, 40, 196, 106, -138, -197, -22, 209, 140, -119, -203, -25, 191, 161, -83, -202, -51, 163, 173, -48, -212, -91, 161, 177, -11, -189, -122, 125, 217, 1, -173, -130, 85, 201, 40, -172, -127, 71, 201, 56, -125, -154, 35, 150, 100, -111, -161, 10, 133, 96, -81, -143, -28, 133, 102, -71, -151, -51, 116, 126, -50, -162, -76, 101, 142, -33, -136, -88]
1185h8J86L7j32j27L8J58N6j10j44L0J55Q1r0j41nJ24J00p5j42l1J27J19o1j31
1209f6n1J09J15k1j44n1R2R8J8j26q6P1J08L6j16p9L8J26M3r4j21L2J35N0p3j23
1235h0JJ32O6o8j24j9J33Q2p1j19j6R7J00l0j36m8J03R0j7j32l3N6J04mr4n2L9
1262d0R7J9r8m9L3Q7J5p0o1K3Q0O0q2p7J7P2O4p0q2rP9Q2n1p3l3R0O0l0j13k9
1292h9Q1Q4k7r1k9O6Q1k6p8l6M7P5J2r0l4K0O2L9q0k5j1Q7L4p1l0pO6J8k1p5J2
1323c6N9L6l6p1LO2M2l7m8l2M6N9kn3n3N2O1j5n9k0J4O3j0k7o0K5N7J5k9m3mO4
1355B3L3n5l9jO0K6k7l7l2N7M7l8l0j2L5M2j2m9m3N0K6Ql4l3K1M8Nn4k7J9M1Q
1387B6l2m7L3K6K5l9l3J1L3K9l8l0QN4K7n6k6OL1M9m5k4mL4J7j8m2lN6Nrm7pK1
$$ y = [-88, 98, 135, 3, -124, -86, 72, 128, 18, -126, -96, 59, 140, 50, -91, -96, 28, 128, 53, -89, -120, 7, 126, 65, -66, -117, -8, 107, 86, -58, -109, -17, 81, 99, -27, -113, -42, 66, 102, -14, -93, -55, 71, 114, 20, -101, -69, 66, 116, 43, -80, -79, 53, 119, 51, -73, -92, 41, 123, 52, -67, -83, 14, 114, 84, -52, -100, 3, 93, 76, -56, -89, -33, 71, 67, -27, -79, -40, 57, 76, -22, -71, -38, 49, 64, -6, -67, -44, 36, 96, 14, -63, -46, 26, 90, 20, -62, -71, 8, 90, 39, -34, -67, 23, 83, 53, -60, -89, -8, 76, 49, -42, -71, -5, 76, 50, -28, -64, -17, 58, 70, -20, -54, -34, 28, 67, -13, -38, -49, 38, 72, 1, -29, -36, 30, 48, 27, -48, -36, 23, 59, 23, -48, -45, 17, 59, 22, -26, -58, -12, 47, 45, -8, -61, -9, 52, 37, -22, -42, -28, 35, 25, -2, -62, -37, 20, 35, 6, -37, -41, 23, 56, 1, -38, -39, 21, 47, 20, -17, -49, 8, 55, 17, -13, -25, 10, 52, 40, -9, -52, -2, 24, 32, -2, -35, -14, 34, 39, -15, -42, -23, 18, 26, -6, -53, -20, 6, 31, -8, -41, -30, 3, 32, -6, -36, -28, 26, 53, -3, -29, -23, 8, 57, 12, -12, -16, 18, 35, 17, -25, -28, 28, 33, 24, -23, -30, -9]
1421iL2j0k9j0RL3Qm1k0J4M0J1k1k1kmM5l1nl2M1K5k9ok1M7JMl0j5K2L8j3l1j7
1456b7L1L2j0m6J1jM2j4k4j2J4K6j6rknK8%k6j3RK4Mk7Mj6K0J2k1mmJ7K8j1j7
1491ck3K5L3j5J3m2J6K4Nl1oJ6PrJ1k2KJ2j1qj4LM1rl6J3KQKk6K9j6OK5l5KqK6
1529GRLl0QJ2JMl3K3j6L8pj6j5J8Rnl1QrK5J9qk8kK3K0kl8K0Ljj5j1OK1nJ7k9
1568gJ3MnJ4l7lK2LnmlK4Kj7olJ6RJl1J6J6pJ0l1%LK0nj0k1J3KK2j1j0nQJ2k0
1608a1J0k0RK1Ok5J1JQJ7l3POKK5k4mj0K5j2Lj8kK5oJ0j9jJ7Lk5%k0K6Qqqk4L0
1647@MNqnQLJj5j3J7J3pj1J7KqlJ0j1K1kMrNj2kJ1Qk5LjRj2oJ4%j6qRJ8j0J0N
1690A3j4nPljj3oK6J2j2j8J9rOJ9j8J8k9J6MoqJ9Llk0JNMnkJNPrLj1Nj3J8J2j8
$$ y = [-9, 23, 13, -16, -26, -17, 16, 24, -17, -37, -23, 17, 28, 7, -14, -16, -20, 25, -6, -11, -43, -2, 23, -6, -12, -33, 14, 15, 19, -11, -26, -4, 34, 21, -10, -27, 4, 36, 26, -20, -9, -10, 32, 18, -6, -18, -4, 22, 6, -3, -5, -10, 18, 18, -8, -21, -12, 12, 16, -11, -7, -23, -3, 9, -12, -16, -20, -3, 25, 14, -3, -26, -1, 32, 17, 30, -12, 4, 28, 33, 2, -4, 12, 19, 10, 21, -1, 1, 13, 2, -6, -20, -17, 24, 15, -21, -8, -6, 2, 4, -22, 7, -9, -3, 22, -13, -11, -19, 7, 16, 19, -11, -3, 9, 10, 14, -19, 4, -12, 26, 19, 3, -12, 6, 15, 10, -21, -13, -22, 3, 22, 14, -14, -16, 7, 27, 25, -13, 7, 10, 9, -6, -17, -11, 10, 5, 22, -7, 6, 10, 5, 19, -18, -21, 1, 4, -1, -5, -8, 16, 18, 1, -5, -8, 8, 17, 18, -13, 3, 19, 12, 22, -9, -9, -6, 14, 9, -1, -22, -9, -7, 15, 4, -6, -11, -3, 9, -11, -1, -21, -12, 9, 15, -10, 1, 2, 10, 27, -6, 1, 7, 9, 34, 10, 6, -4, 21, 9, 12, -6, -8, 17, 11, 21, 2, 1, 18, 21, -4, -4, -24, 2, 10, 2, -6, -30, 0, 4, 9, 1, -4, 4, 7, 8, -7, -20, -3, 10, 3, -8, 9, 11, 3, 0, 10, -1, 20, 18, 22, 13, 18, 6, 4, 15, 23, -2, 1, 0, 9, -3, -9, 5, 5, -11, -19, -10, 8, -2, 8, 13, -1, -6, 1, -2, -3, -16, -22, 4, 16, 4, -14, 5, -4, 2, 21, 3, 21, -8, 8, 12, 6, -2, 17, 20, 17, -3, -2, 3, 7, 2, 0, 1, 6, 13, 4, 7, -4, 1, -12, 6, 18, 0]
1732@qNj0J2j6J1kJ4Kj3K6j4MKj2j1J4J6j4j8K5nqjJ1j9JJ2jj5J2jJ8Oj1j8L3
1769B7j6qKk0J4KKloJ5rN%rR%MrK5j1k8K6OmLl1K3j7J9k9L9plPk4JlJ8j8NJ5k
1811A0j7PRj1kJ7jk3J6j0J6k0MJPnJmNRKRj6mJmMMn%K0%j7JlJ6j5nJ0rNj1K1j7
1855dj3PJ7j4Nj8J9k0K2lqmJ3Qj1K1l8L6j0lqJ2oj1K9j4%K5k1j0oJ1mNMpJ4j0
1893ElMoJK3k0Nj0rJ2nj3K6pjj0MJ9j7L%KmKjjOOj4mJ7nK3qj6jMJQk3J2J8j4P
1937A6j1QRk4lPopQj1OJ9l6L0j6J6nm%Nnj1J0mNrqJ8N%NOmONj6jOpJ2kOk3RpK
1983anjRRqk5L6j2qlmJkJ5mRk1OJ2nmQnMqlJ6L%mNj4%lK2l5K5MNqlrOJ2rj2Oj7
2031b0K1mrlRNJ1k3nK8j7qJ8Nj3nK3lk3J4J2nRk1MmK2k7J0lLMj7K3mjlMj1J0j1
$$ y = [0, -8, -3, -13, -1, -17, -6, -8, 6, 8, -5, 21, 7, 11, 13, 1, -10, 4, 20, 6, -12, 13, 8, 0, -1, 10, -9, -8, 4, 3, -12, 0, -1, 17, 23, 12, -6, 27, 11, 3, 5, -15, -1, 1, 3, 0, -6, 9, 0, 5, 5, -4, 5, 5, 9, 0, 25, 14, -14, 12, 18, 14, 17, -14, 9, -8, 11, -18, 21, 14, 11, 18, -6, -5, -8, 10, -8, -3, 12, 10, -7, 0, 9, -2, -4, 13, 12, -11, 5, -5, 11, -9, -5, -4, 3, -2, -1, -5, 0, 9, 11, 20, 4, 0, 1, -3, 1, 5, 0, 0, 20, 20, 3, 4, 1, 17, 2, -3, 7, -2, 3, -8, 13, -4, -17, -10, 7, -7, -2, -20, -1, -21, 1, -2, -10, -14, -1, 7, -4, 17, -21, 15, 5, 2, -6, 6, 0, -11, 18, 4, 4, 29, 8, -2, -8, 3, -1, 4, 8, 1, 15, 5, 2, 6, 0, 1, 24, 4, 9, -1, -10, 2, -3, -16, 10, 3, 2, -8, -4, 15, -2, 1, 1, 3, -1, 1, 0, -1, 5, 11, -3, -7, 10, 5, 28, 20, 4, 3, 7, 8, 16, -7, 5, 23, 9, 16, 5, 13, 22, -2, -5, 2, -4, -11, -3, -14, -8, 11, -25, 5, -11, 5, 0, -4, -4, 1, -4, -15, -5, -9, -4, -13, -21, -3, 2, 2, 7, 13, 9, 15, 20, 4, 3, 9, 2, 14, 12, 18, -5, 4, -3, -1, -6, -7, 2, 11, 3, -22, 14, 2, -6, -9, -13, -12, -14, 1, -3, 6, -15, -9, 3, -2, -6, 2, -3, 1, -7, -10, 6, 9, 9, 5, 10, -4, -4, -7, 15, -20, 5, 9, 14, 6, 3, -6, 0, 12, 3, -9, -3, -20, 1, -3, -12, -15, -6, -1, 10, -13, -18, 10, -7, -15, 3, 8, -5, -10, 13, 10, -13, 1, 13, 8, 17, -4, 0, -4, 18, -9, 1, -2, 1, 5, -12, 11, 7, 6, 3, 7, -4, 6, -5]
2072enK1j8mOPmjPjqJ2j1J1k1J2lOrK2nmK%kJ1j6rPjjlJ4OJj1N%Jl1J2Rlj0QK0
2118A4k0kJ5j6RJ4Qj7lQJj7J2PnpNNj1L3l0Mj5RRjj2J1k0LJ0kJ4k2J4qJ1Pj9o
2158a0K0Kk5J8j1j0J6jNj2JJ3j0MkkOj3PMJ2rRrPOqj6nJ7oJ2jl%j1K0j7%J3j8
2199gJj0RKK6k6j3PkjK5mqoqmL4mrQj9J4j2NNJ5j0jlLJ8nj8%J9k7%PLkPk0J6j2
2243gK1l1J6%QqJ7j4mJ0Oj7Pj3nOJJ6nmKMrK1j4Qj8K1Jj0lJ3oJ8j6jlQj0Nojq
2286dlJ8ok1QONkKj3J0mnkjOrK2j3Oj9J5kJ9k6L%%J4Mj4K3ljJpjj0PRj1okOk9
2331c0K6NJ2k1K1k0QNrQj5%K2k9J6lmqJ1pRNj1OJ3ompK4k2NKJK2qJj6JnMOllj
2375AOqJ3jmMj3NoJ5noRO%k2oLJ5JkoN%J9j4k0J2J7j4LnkKJ4%lj2K2j9kPl2K6
$$ y = [-5, -10, 11, -7, -11, -5, 2, -2, -3, 4, 3, -5, 7, -4, 7, -14, -2, -5, 1, -8, 14, 9, 5, 7, 7, 5, 16, 0, -9, -2, -3, -4, -7, 7, 13, 14, 3, 8, 8, 9, -22, -10, -1, -4, -14, -6, 14, -6, -8, 7, -9, 0, 14, 22, 5, 2, 10, 11, -6, 6, 13, 8, 1, 6, 11, 0, 33, 3, 7, -8, 1, 10, 9, -3, 8, -12, -9, 1, -1, 13, -9, 5, -3, 8, 15, -4, -10, 10, 12, -13, 5, -6, -16, 0, -1, 4, -8, -7, 6, -4, 0, -2, -4, 2, -11, -4, 0, 12, 3, 12, 3, 10, 16, 8, -8, -13, 4, -2, 10, 9, 6, 6, -5, 15, -2, -2, 11, -7, -6, -16, -7, -5, 21, -5, -18, -11, -13, -14, 11, 7, -1, -7, -15, -19, 15, 11, 2, 10, -9, 5, -7, -2, 3, 18, 8, 7, 4, 7, 25, 20, 2, 2, 21, -6, -6, 1, 4, 2, 9, -11, 5, -7, 14, -17, -1, -1, 7, -1, 16, 2, -2, 8, 14, -3, 4, -9, -14, -8, -7, 9, 4, 0, 2, 6, -3, 18, 4, 12, -6, 15, 16, 6, 3, 16, 10, 28, 12, 11, 8, 16, 6, 11, 5, 4, -4, -7, 11, 5, -16, -8, -2, 3, 1, 3, -10, 0, -4, -9, -11, -12, -6, -15, 7, -6, 0, -19, -4, -6, 13, -13, -10, -10, -10, 4, 8, -6, 17, 14, 13, 14, 7, 6, -4, 3, 12, 1, -5, -7, -1, -30, -4, 1, 13, -8, 13, -7, 1, 6, -3, 5, -10, -10, 12, -17, -1, -4, -8, -16, -5, -12, -3, 2, -9, -3, 10, 4, 0, -7, 17, -5, 0, 2, 3, 25, 17, 18, 2, 3, -2, 2, 8, 5, 2, 1, 7, -1, 12, 11, 7, 11, -2, 3, -3, 12, 7, 1, 10, 16, 16, -6, -12, -9, 6, 7, 5, -1, 4, 4, 23, 9, -11, 1, 18, 4, 7, 2, 0, 2, 16, 16, 13, 1, 23, 4, 2, 9, -23, 3]
2419Cj1J6j8J0KnMJj6K8ppJ0j7J3pRJ4j2Omj9J7JJm%j0RK%qPrJ6Pk6K0k4jLnk
2462a3J1%lJ1mk0M2n4J5J2Kj1%RK1j2l0K5K2j3mNj7J9nPqj0J2%J2k7pJ3kQj3J1
2500DPpj4J6j7mNjJ9j0j0Qj5K8qJrMRjpqlJ2Mj4MJ2J2qjRjlk0J6pJ4qj5J4Pk2
2543hMMKqJNPj6JmJ9j2j0K2kqj1J7lkLmLJ1PlrnkK2mj4OnJlpK2k2J4j3KJ4k1L
2588fJ1J0Lk8Rnj2JJ6%kmJ0Rk2LJ1mmJ7%qj3NJ3jj0loL2qJnmj2QOKqj9K4k1Nj3
2632b2J2j3K3JLj2NRQoj8J7j3nOLrlRjjJ8k1oK6j3RrqlJ9j3J7polmK9rj7%kpR
2676hj3OPjJ2k8J7Pk1NJ8j7%j0PK2j5K4l5M0%j5j0J0oK1oKj7rK2J0j6nnqK6j2
2714aOk0J9Jj9J4kj6OJ1j3OmNrlLJ2lKjJ9j9KrNJ6lPj0j0jRPppOj5K3j1KJ4j9
$$ y = [3, -8, 8, -10, 0, 2, -3, 1, 2, -14, 14, 7, 0, 10, -7, 6, -1, 8, 22, 10, 16, 12, -7, 10, 11, 12, 8, 8, -2, 7, 9, 9, 1, 8, -1, 15, 22, -4, 16, -8, -9, -6, -11, -13, -2, -2, -5, 6, 2, -18, 24, -30, -15, -3, -1, -12, -12, -3, 18, 6, -24, 1, 23, 10, 6, 11, -6, 13, 8, 15, 7, -3, 9, 9, 21, -6, -13, 0, -2, 6, -7, 4, 11, 4, -10, 6, -11, -15, -10, -11, 8, -2, -12, -4, -19, 9, 1, 2, -7, -3, 6, 5, -2, -10, -13, -1, 3, -11, -7, 5, 17, 9, 8, 17, 16, 13, -7, 9, 2, 16, 8, -7, 7, 14, -8, -4, 0, 2, -6, -5, 0, 7, -9, -8, -12, 7, -5, -15, 7, 5, -3, -14, 3, 0, -2, 1, -3, 0, 11, 18, 15, 6, 1, -1, 21, 17, 3, 9, 4, 5, 2, -5, 17, -5, 9, -4, -2, 12, -9, -6, 5, 15, 18, -10, -1, -6, -18, -17, -1, -1, -3, -7, 3, 12, -10, -7, 4, 0, -4, 13, 13, 5, -8, -3, 10, 9, -1, -4, -10, 22, 14, 15, 10, 6, -6, 2, 8, 10, 2, -17, 7, -14, -9, -22, -10, -23, 0, 1, 4, -8, -3, 6, 14, 8, -10, 7, -6, -11, -5, -2, -11, -14, -5, -6, -7, 11, -10, -16, 10, -3, 6, -3, -11, -14, 5, -8, 9, 2, -4, -7, -11, 18, 9, -8, -8, -10, -17, -8, -21, -15, -8, -9, 3, -25, -8, -1, -22, -17, 1, -16, -16, -26, -19, 3, -12, 12, -23, 17, 17, 2, -8, 2, -4, 17, 11, 13, -4, -13, 9, 19, 3, -2, -7, -15, 11, -1, 5, -15, 4, 5, -14, 0, -2, -18, -12, -1, -14, -8, -12, -7, -16, -19, -16, -4, -7, -5, -6, 13, -6, -4, -13, -8, 8, 5, 12, 2, -8, -9, 0, 7, 0, -7, -1, -16, 7, -4, -2, 12, -7]
2757gJ3oj1jJ5Jj5%RnlrJ2j4K1pJ6k4J2kLk7L2OnMJllj6KJ3J7k1J6k1J1jj1J1
2797CQj6mj2K3rj2MjQ%ljOj9L9k6J2k0K6k0%qJ4J2Lj5qK0mj8J7kMlMJJ0rJllo
2840gNJ9j3mNLomkmj5J8MOnJ3l3K1Mkj7MmOrJ5j0oJ7J3k2J1lJ9j8j0QMKpKkj4
2883a8QM%J0j0lJ2jKj7MlJ2JqJ2j7J8k3LJlK8j0kOk6J6J1j9J6K1j2j7kJ9rmNJ4
2923A9j8Ok0J5%Pj0Pk6J0J9rOj9K1j9J5Plj8QoK%Nj4J5J0Jj7MlNJ1jQj3oJ2Lm
2964A0j6NJ0qnJJ7moLpl%jJ6j8ONnJj1jMQNj0J0lj3PJ5k1J4kj6KJ2j8J0LJ6km0
3007c0L9%j1MopnJ6j4J3Lk2J8mJ7j6oMOlj7PkK6j0%rj5K3rpNMOR%pKPj6PjJ7k5
3051iJ7Jj1J8oJ1rj1oJ3lloNpjJ3Ok0rJ2%jJ8j8LmkjJLnPQqkLmj2OJ6k4J5J2L
$$ y = [-7, 6, 0, -11, -12, 3, 4, -11, -11, -2, -7, -10, -19, -7, -21, 0, -7, 9, -15, -3, -5, -2, -29, 3, 9, 4, 8, 9, 6, 3, -13, -11, 2, 19, -2, 14, -7, 4, 3, -8, 3, 11, -5, -9, -21, 2, -7, -19, -15, -16, -8, -8, -11, -12, -6, -25, 14, -12, 0, -20, 6, -14, -14, -22, -8, 4, 7, -8, -16, 4, 0, -18, -1, -3, 1, -2, 2, 3, 13, 4, 5, 2, -1, -7, -2, 17, 4, 0, 5, 8, 2, -2, -4, -8, -23, -5, -1, 5, 0, 13, -20, 1, 5, 3, -14, -10, -14, -8, -17, -2, -12, -18, -1, 12, -10, 1, -2, 17, -1, -11, -3, 1, 3, -4, -2, -4, -18, -10, -6, -6, 4, -6, -9, 3, 2, 4, -13, -9, -12, 0, 1, -7, 5, -12, 6, -17, -14, -13, -16, 12, 2, 0, 6, -20, -4, 7, -12, 4, 25, 13, -4, -6, 13, 4, 0, 5, 19, 1, 7, -13, 2, 2, 9, -1, 6, -20, -10, 9, 0, 6, -13, 8, -11, 4, 11, 8, -10, -2, -8, -6, -6, -1, -15, 0, 10, 11, -6, -2, -5, 0, 11, 10, 18, 5, -1, 11, 14, 10, -6, -1, 9, 1, -4, -3, 14, 10, 4, 7, 0, -3, -3, -4, 12, -6, 0, 5, 0, 1, -10, -11, -7, 1, 6, -4, 6, 3, -10, -3, 12, -9, 5, 3, -13, -11, 1, -17, -7, -4, 12, 10, -30, 9, 9, -2, 2, -4, -11, -16, 0, -14, -1, 2, -20, -2, -6, 11, -5, -11, -7, -1, -4, -21, -14, -16, 10, 0, 0, -9, -24, -1, -10, -17, -12, -8, -2, 7, 7, 0, 2, 9, -7, 0, -1, 16, -9, 8, 9, -2, 16, 10, 21, 12, 1, -5, 8, 5, 2, -4, 1, -6, -7, 6, 12, -8, -17, -5, -5, -6, 12, -6, -3, -7, -9, -10, -9, -6, -11, -4, 4, -4, -6, -3, -7, -19, -13, 3, -21, -6, 6, 9]
3096IKqlJ1j4MQj0PJj3oLJ6k7K6rk0LJ9p%nlPJ9k1lJ0J2nrrJ8Pk1J7kj1jJ2Oj
3139IMj3J9l2J0J0j3J6rQJ0k6lQpKlJ0KonpJ4j5%J6mj6kRRJ1lj2J6j0R%j6J6J0
3180A6q%Qkk9J0J2kqKJ0qRMj8PKrmKlNMj0J2jjj2J4MN%k2K7k2J3%knNMrjmJ1%
3226F%pRj0mkqQJ2n%j4PQOj2KQknnj9LJ1J0j2PK4l3mL3j2J0Mj5OkKk3J0NR%j4
3270hj0K4k7OJ7oj0JRPmMPk9KNJ2Km0L4j0J0Kj3J8j6QKKj5K1oJ1j2lNKj9K1n%
3311aj8J1LoJ3J0k2%J8k0K3qqNkpNpMl%Jj9K5Jj6kK2llLj7J7jj1NqJ5nPlJ4k4
3354a2J8J3k4J0lQk6K9j3%LoJj1pK5j0Jj1J9nJj9mJ3rJ8j7OK6l0J3KJ3k8J5J3
3391A2j1K6k2J3j6KK2k4j0kPLjJqJ3Jj4PnJ1qj7K1no%OJ1j1j5K9k1pJ0qJ1j0R
$$ y = [9, 11, 3, 0, 11, -3, 1, 9, -1, 6, 7, -6, -12, -9, 7, -20, 6, -3, -23, -20, -1, -8, -8, -13, -16, -9, 10, -11, -14, -4, 8, 3, -6, -15, 3, 10, -11, 6, 4, -7, -8, 4, 10, 9, 13, 0, 19, -13, -3, 7, -6, 10, 1, 9, 19, -7, -10, -2, -9, -7, -10, 0, 2, -4, -9, -16, -2, -17, -17, -1, -5, -21, -23, -14, -5, 6, 3, -9, 7, -3, 6, 6, -10, 6, 16, 8, 8, 16, 14, -15, -5, 7, 5, -3, -1, 9, 1, 10, 14, -4, 3, 5, -4, -8, -6, -9, -4, 0, -10, 2, 1, 0, -12, 2, 6, 11, 11, -11, 16, -6, 7, 7, 5, 0, 5, 9, 0, -1, -5, 6, 6, 6, -1, 8, -2, -6, -8, -16, -8, 4, -1, -1, -15, -8, 0, 6, -6, -4, 4, 2, -3, -8, -27, -24, -13, -3, -15, -8, 16, -17, -21, 12, 0, 10, 14, -1, 5, 3, 5, -18, -8, -3, 6, 6, -8, -18, 6, -21, -15, 2, -4, -14, -13, -4, 3, -1, 3, 10, -19, -17, -12, 0, 2, -38, -4, -14, -4, -2, -15, 3, -13, -5, -3, -1, -16, 5, -1, 10, -2, -5, 0, 2, -17, 4, -1, -1, -19, -8, -5, -11, 2, 12, -10, -10, 8, -12, 11, 3, -5, 0, -2, -9, -4, -11, -7, -10, -10, -9, -28, -3, -2, -18, -20, 2, -1, -4, -1, -18, -1, -2, -13, -8, -16, -1, -6, 1, -2, 12, -12, 6, 19, -5, 5, 2, 10, -16, 13, 0, 0, 3, -3, -2, -13, -20, 5, -5, -4, -15, 4, -1, 0, -19, -23, -10, -19, -1, -18, -12, 14, -16, -3, -1, 12, -16, -1, 12, 1, 27, 5, 18, 2, 4, 26, 2, -8, -10, -3, 0, -1, 0, -8, 5, 6, -8, -1, -6, 5, -3, -20, 1, -4, -10, -10, -4, 7, -4, -19, 10, -11, -18, -8, -16, -5, -15, -6]
3430fMJ%QopK2j9mJ2j2K4k1PPj5%QLj7J2J3k2lK6k0%Pmk0J3kLK6j6nkQmj2OJ6
3472Imj3j5J2OJJ6lJ0j8Nj0MJ0j3jPlKLRk3LmLkJ6%Jk7J9Pj2Lj0J7Jj2Lj4L3k9
3514a3j0K6k4J3J0j2J3J7k0nRRj1KjjJ5j1j2jJ2KqjLj5LMKj2QmmJ4J1qpJ0j3K0
3554A0k7M1m7J9kpK4k1J2k0K4j9J3qNkMMJ3k4MKJ0jMk7J8Mk0J6JLj7k3K3J0Qj4
3592gJ2j7K4l0J3n%j0K3mkJ7j9Nj0jLJ1j3J6qJ2mk4K5J4k9%OJ6j7%j4K3lj5K7
3629A5k1NLj2Oj3K5j2Oj2MJ8l1J3mK1k2MNOj0JOLPk1JJ0Rj1roJ2j3J6j1JJ4Mj9
3669a2J4j2j0J0lj4K0JrNNlMLNqjJ5j7LOJ2k6QJ1j5QK1j6lKnRk3K2j0J3Jj5OP
3710Ij7mJ8j2J0Pj2j9K7%k7J5lKnJ9LOk9J7pqjMJ0qJ0j2LmqJ6lN%JPoj9K7j6J0
$$ y = [-6, -2, -1, -1, 7, 1, -6, 16, -3, -7, 5, -7, 17, -4, 3, 10, -5, -5, 3, 6, -11, 1, 14, -8, -11, 15, -5, -5, 2, -2, -22, -9, -11, -8, 18, 2, -3, -5, 3, -1, -13, -7, 9, 5, -8, -23, -11, -5, -4, 12, 9, 19, 1, 6, -4, 0, 10, -3, -4, 3, 0, 2, 5, 14, -9, -6, -10, -7, -9, 7, 7, 8, -19, 0, 7, -5, -2, -12, 5, 6, -6, -3, -17, 16, -13, -23, 3, -21, -8, 2, -10, 3, 20, 0, -5, 4, 13, 2, 4, 3, 2, 17, 6, -6, -7, 5, 7, -1, -2, 1, -14, -11, -7, -5, -17, -9, -13, -17, -3, 8, 0, -7, 3, -10, 10, -17, 24, -23, -4, -6, -13, 11, -10, 2, -18, 6, -13, 0, -8, -3, -5, -1, 3, 16, -8, -4, -2, 8, 7, 11, -16, 2, 6, -14, 2, 3, 6, -11, -34, -11, -1, 7, -7, 5, -12, 12, -18, -5, -10, -10, -20, 3, -1, -3, 14, -5, 0, -10, -11, -8, 3, -10, 6, -2, 10, 6, -18, 7, 21, -8, -8, -2, 14, -3, -3, -17, 6, 3, -12, 15, -6, -1, 2, -10, -4, -17, 8, -4, 2, -10, -6, 12, -19, -6, -10, 11, -11, -7, -2, 4, -6, -5, 1, 4, 11, -10, -9, 1, 10, -1, -10, -16, -4, -17, -1, -12, -11, 3, 7, -12, 2, -10, -20, -10, -13, -27, -7, -6, -15, -10, -5, -8, -4, -1, 4, -4, -5, 10, -7, -4, 2, 14, -12, -4, 7, -8, 0, 21, 5, 2, 4, -1, 8, -15, 7, -3, 10, 11, -4, 2, 9, -8, -12, 6, -6, 4, 11, -1, -20, 7, 7, -20, -5, -8, -6, -11, 8, 11, 17, -12, 5, -2, -10, -11, -7, 3, -5, 5, -7, -4, -8, -16, 0, -3, 2, 2, 3, 10, 4, -15, 12, -4, 6]
3752Fj8KJ5j9JK0Kj8j0RmOKlO%%Qj0kONj4pK3nRlOl1J7PkJ4j4nRloLJj3J8j9J8
3797Gj7J5lmKj3J9j4J9k6J9jj1j1JL1j9J1jJJ0rk1J9qNlPorJ9MPk6J5J1knKrK
3838Hj6J2mj6L3j4oJ1oj0JjlMRj8NJJ3j3OKRj4KOlJ3Nj2k4J7kpK1ljj3MnOJ7j3
3881Aj3MNlR%k0Qjk%QKjk0K1k0J5JomJ1Rj5KJ2J2k9K1nJ2jk2J6NK%j1J3j3Kk4
3923a9K2j7J8mMplkJJ5Ok3j1J6MLj3K1j1J7j6lj6K1j0K1j2mJ2qnoj3K7MmQkRj1
3963IJj0JMJNj7jOOjkqQRk3Pj0KJ5%j4K6j2j3J8j2J0rMjrJ1%J1j1%j3J8oj1J6
4005EOj2qKRRk4QmnJ5mMk6L3qj3J5mRj7jJ1k3J3K2m%j0OKJj2PlJ5qJ2nj3R%pQ
4049A0rJ4j6%J7j8K4j4j0kKqJ9k5kK4Kk3ORrRj9JJ3Jj3LNMJ4qRLRk0pJ2plL0k4
$$ y = [6, -12, -10, 5, -14, -13, 7, 9, -9, -19, -10, -14, -8, -6, -9, -3, -3, -3, 5, -5, -7, -1, 4, -10, -17, 6, 1, 10, 7, 13, -18, -1, 6, 4, 18, 4, -1, 8, 5, -1, 2, 3, -10, 8, -11, 7, -10, 5, 2, -2, 0, -13, 6, -8, 11, -15, 4, 3, -8, -19, -18, 13, -6, 5, 4, 5, 15, 6, -15, 4, -4, 1, -2, 5, -1, -10, 9, 13, 20, -6, 9, 20, 18, 13, 15, 6, 8, -8, 4, 0, -16, 17, 3, -3, 8, 2, -8, -7, -8, -11, -7, 2, -16, -11, -10, 3, -10, -4, -2, 7, -7, -5, 1, -2, 11, 16, 4, -20, -3, -5, -12, 9, 6, 5, -8, -4, -9, -3, 14, 1, -12, -8, -3, -6, 3, 3, -17, -9, -10, -12, -12, -4, -2, -3, -23, -2, -22, -7, -6, -12, -16, -5, 4, -11, -9, 3, 15, -14, 7, 2, 14, 13, -9, 7, 12, 14, 14, 3, 16, 3, 5, -19, 3, -14, 4, 0, 4, -3, -6, -8, -7, 8, 14, -9, -20, -4, 0, 3, -10, 11, 0, 17, 1, -2, -18, 3, -7, 14, 2, -2, 10, 2, -3, -9, -22, 5, 9, 5, 13, 11, 20, 9, 10, 0, 1, 5, 6, 11, -6, -7, -1, 5, 4, 2, -6, 2, 11, -12, -5, -15, -13, 2, 2, -12, 14, 2, -11, 7, -5, 5, -4, 0, -1, -10, 1, 1, 12, 1, 1, -12, 6, 0, -11, 5, 11, -1, -9, -7, 2, 11, -13, -5, -9, -14, 1, -3, 1, -25, 8, 0, -13, 2, -2, 7, -10, -11, 0, -23, -10, 12, 8, 8, -2, 4, 6, 7, -5, 2, -1, 14, 6, 18, 13, 0, 9, 9, 2, 10, 1, 15, -1, -1, 16, -2, 22, 8, -2, -4, -2, -10, 9, -16, -18, 6, 8, -15, -9, 0, -9, 0, -19, -18, -5, -4, -17, -14, -9, -5, 9, 1, 10, 13, 22, 2, -5, 7, 0, -3, 27, 3]
4091CJ2k0LPLpnJ7qk4K5j1JMlLj7J9j0j4K2j0Qj%pPKQNo%jM%kpNj1J7j0JJ0Jj2
4136Aj0K3k0okJ2pLj5JJ0LROrj6PPQk3L%lL0j8jRNk8K1joJ2J2j3l6M5j3QJ2rj0
4178AJ4j4J2k3K2k5J5Mj0J2k4QJ2Rk5KMPlLj0J2Oj9J5j1jJ0%L%jmMnJ9j8J8qo
4218EK1k3lK%J5j2j1J9k0LMjjoJ4oqRQj0oj3J5lJ2j1J5%%JJ1j2j9K2k5J6PJ0k0
4258aJ4Jj0J0j4%LONjrJKj1LJjnoJ1j6K4j2pLJlqK3%Nk5J1Rlj4J4l%Pj1J0j6J
4302a1K1j0JJ1nj6K7k7JLj6J9j3J9pPj2j3J8j6J9Kk6J5mJ0mj6K3nj1J9NjJk1J1
4339bJJ0k2K5kJ1j2mk3NJ9j5K0j9J8j6nOK%Mpj4QJ2j5JJ4J%pOjoLJ8k4J9jj4P
4380AQj4oK0j5J2j0PJ0joPj1JkLnnPOnjorJ1j0J2oPqJ6mj7kJ3pNKnJ1LlqLJ1p
$$ y = [3, 15, -5, -2, 5, 8, 1, -4, 13, 5, -19, 6, -5, -4, 0, -3, 0, -17, 2, -8, -22, 0, -10, -2, -3, -3, -10, -3, -1, 7, 12, 6, 6, 5, 9, 9, 7, 0, 5, -6, 11, 1, 2, 12, 13, 1, -9, 14, -6, -12, -14, -2, -9, -6, -21, -20, -10, -7, 2, 8, -1, -17, -10, -3, 5, -18, -15, -15, -18, 12, -6, -7, 2, 7, -21, 0, -1, -7, 5, 17, 4, -32, 13, 0, 8, 20, 11, 1, 15, 1, 13, -10, 12, -13, 2, 6, -4, 8, -16, -8, 4, 13, -12, -10, -6, 1, -2, 1, -9, 3, 9, -10, 5, -6, -7, 3, 3, 6, 6, 5, 1, 5, 0, 19, 1, 19, 11, 5, 26, 3, 0, 2, 2, 17, 5, -6, 13, -7, -4, 0, -1, -2, -8, 6, 0, -8, 1, 9, -1, -7, -20, -5, -8, 4, -7, 8, 8, 8, 9, 20, 8, -11, 11, -14, 2, 9, 19, -1, 13, 14, 4, 14, 0, 0, 3, 9, 14, 13, 4, 5, 7, -4, -1, 0, -1, -6, -12, -1, -17, 7, -5, -12, -9, -8, -11, -19, 4, 4, 9, -16, -5, 4, 1, -13, 1, -2, -2, 5, -6, 4, -12, -11, 10, 0, 1, 12, 7, -9, 18, -9, -8, -5, -21, -2, -15, 4, -3, 4, -8, -21, -3, -19, 0, 2, -24, -9, -13, -3, -7, -23, 0, -5, -16, 3, 8, 7, 8, -13, -2, -1, 9, -13, 12, 10, 21, 9, 5, -18, -13, 6, -9, 11, -8, 10, -6, -11, -5, -3, -3, 1, -6, -20, -12, 0, -15, -14, 0, 1, 1, -6, 0, -1, -7, -4, 14, -10, 9, 8, -6, 1, 9, -5, -11, 9, -6, 6, -4, 3, 13, 12, 6, 13, 2, 3, 1, 4, -1, -6, 1, 7, 2, 1, -5, -14, -3, -13, -1, -7, 0, -8, 8, 4, -13, -15, -2, -9, -4, -2, -7, 4, 7, 4, -4, -1, 10, 3]
4426CLLrRjJ2knj2J4j0J0r%Oj1Pj2PLk0J4Lj4Qjj1MJ1k2J0L1l1J2j5kJ7J2lKj9
4467h%J9mj8K3j4J3j5K5k4jPqJ0mJ4pkmmNrJlJ4j2j2J5pj1J1lOmLJ0p%NlJ0Or
4510DRj6RRk4%K4j6nJ6pjPlknrK5l2K6j6jK2j9J3k6J5Nj6J0KrLJ2j9nK0Ojj2J6
4551IJ0j5j1LJ0Rj3Noj3J2Pkj0J1j6J0OlMj5oJ2J1k5KnOJ3jJ1j5pJ2q%LpJ6j6
4591a2POnJ6j5J9j0J0qj2J5qj0OJ9j5nkJ0j0PrMJ4j6RmQnoj6L3l7L1k2lJ4Rno
4631dQj6OJJ2jJj2JL%J5k3K0qmj1K2rNJ5j9Rj5jknJ5jj6QrPNKNk6J9klJnRmlK6
4677A6j1qPj3J9mLj7QOj0J3kpLMj5J3j4JJ5Mj3pJQnKj0%RMnmJ2nKPoj6J2J5j5
4720ckJ0j7J7npNLqL%JQqKK1k6LRj1ROk5K8j6MPj3Kj3K1l1NNJ6lrjjJ0k3K4%k
$$ y = [3, 6, 9, 0, 9, 8, 20, 18, 13, 1, 15, 5, 15, 6, 6, 12, 1, 8, -4, 3, 6, -14, 0, 3, -11, -3, -4, -15, -11, 0, -22, -12, 19, -12, 0, -15, -17, 0, 12, 9, 11, -8, -8, 11, 7, -11, 12, -2, 11, -4, 21, -3, -4, 3, -5, 5, 1, 15, 8, 6, 2, -2, 3, -6, -5, -8, 6, -6, -18, -3, -10, -21, -10, -13, -7, -11, -8, 2, -5, -5, 0, -3, 7, 13, 4, 13, -3, 6, 15, -9, -9, 15, -1, -6, 10, 3, 2, 9, 6, 4, -1, -10, 15, -17, 9, -7, -8, 14, -5, 8, -18, -3, 2, -14, -4, -2, -11, -8, 4, -15, -20, 0, 6, 5, -7, 9, 19, 4, -7, -4, 6, 15, 2, 7, 1, -12, 0, 7, 5, -5, 6, -10, 0, 6, 3, 7, -8, -14, -2, 9, -16, -14, -19, -13, 0, -1, 10, -5, -12, 0, -8, -8, -5, -12, 4, -12, -5, 1, -4, 12, -3, 16, 6, 16, 8, -4, 11, 3, -7, -1, 18, 3, -2, -4, 6, -4, 3, -6, -2, 12, -4, 5, 1, 9, 4, -2, -18, 15, -22, 9, -13, -16, -2, 7, 2, -4, 4, -12, -6, -5, 7, 6, 7, -5, -4, -1, -1, 14, -9, 11, 3, -1, -12, 10, 1, 6, 21, 2, 11, -4, -5, -7, -12, 3, 2, -14, -6, -15, -8, -3, -1, 4, -22, -3, -5, -8, -7, -12, -3, -7, -10, 16, 5, -3, 4, -9, 10, 6, 9, -8, 0, 6, -4, 9, 7, 0, 3, 7, -8, 5, -9, -8, 7, 11, -2, -9, -8, 0, -5, -3, -13, -13, -4, 0, -5, -9, 3, -2, 0, 7, 1, -15, -3, 12, -3, -5, 5, -12, 5, 0, -7, -2, 1, -7, -4, -4, -3, 5, -3, -1, 20, -6, -3, 6, -5, 4, 10, -15, 13, -3, 1, 8, -5, -3, -16, 5, -26, -21, -16, 0, -3, -12, -13, -14, -4, -27, -3, -3, -5]
4764eLORj6J2k0K6q%Lj0J5J9l1LmPmoRj0QMk3J6%nkj1J5kQk8J2ML%J1j0nOmj4
4807a9J8J1nj5K8j6j0J7j6J7Kj3L3k4nloJ7k0LK1k4J0J3j0J3l1J0nmjJ1p%lO%
4844gjllRQj4J8oP%lj4K0rMnJ2j2Qj0KRQj2jJKj8J3lj1KJ0%oJ7k1lJ3j2PJ0qn
4888gJ1pJ5k1NL%NPnJ4Nj4J2qJ4k7MpJ3Nmj6J6%j4NJ2j6pJ7roj5J4OjkJLkoJ9
4931A2j6j0Rj3J9J5j1qJ2k6K9qMQj8J7j2J6Lj2Lknoj1J3Rj1qK0k7J0lmJ0k2K0
4968drRKoj1J2L%lPLMk2K4J7j8Oj9J2koRPk0QJ4j0J1j7Po%j7J8J1nmj8J2KMk0
5010a5J4J9j3%%oLkJ0rnLPqqJ2MjKlrJ2j1POLnj4lK2oNmJ2j3j7J1j3J7moqJ8r
5054eNj1LJ0Kk0%K1NrlRj3RKj1K0j7J1LjLj6LnJ0%j5J2NmpK0k8J8j6oJ1m%J6q
$$ y = [-5, -2, 4, 13, -3, 9, -11, 15, 7, 7, 10, 0, 15, 34, 3, 6, 2, 9, 5, -1, 8, -2, 6, 10, -13, 3, 3, -2, -4, -15, 0, -2, 6, -22, -10, -6, -3, -3, 8, -2, -7, -1, -5, -19, -1, 10, 5, -10, 18, 2, -8, 9, -7, 10, 12, -1, 32, 8, 3, 0, -6, 11, -9, -6, 15, -9, 1, 14, 4, 17, -14, -4, -9, -13, -14, -3, -10, -10, -13, -7, -7, -8, -11, -14, -5, 3, -11, 7, 1, 8, 8, 5, -9, 11, 2, 6, 1, 13, 1, 9, -1, 1, 10, 18, 6, 5, 6, 8, -10, 3, 0, -11, -9, 1, 1, -5, 12, -9, -12, 1, -11, -4, 6, -2, -7, 4, -3, 12, -9, -4, -1, -1, 4, 11, 6, 20, 25, 11, 23, 15, 29, 2, 6, -1, 12, 17, 13, -3, 13, 13, -1, 4, 16, 0, -7, 10, 1, -5, -20, -6, 0, -1, -3, -2, 1, -1, -7, 12, -4, -14, -5, -18, 1, 16, 5, -3, 9, -17, 12, 4, 8, 16, -2, 15, 3, 19, 22, 10, 13, 11, 6, 0, -11, 2, 11, 0, -8, 12, -15, -5, -8, -12, -2, -24, -4, -13, -4, -2, -8, -19, -7, -4, -4, -7, 0, 3, 7, -15, 9, 26, 8, 14, -5, 7, 5, -1, 8, 15, -5, 3, 17, 7, 18, 1, 8, 2, 2, -15, 3, 14, 9, 5, -13, -1, 1, 5, -15, -1, 18, 5, 5, 5, -1, 2, 0, 10, 1, -4, -1, 6, -2, -10, 2, 6, 5, 7, 4, -5, 7, -4, 3, 9, 12, 7, -7, -10, 12, 6, 11, 7, 19, 6, -11, 0, -13, 4, 0, -6, -14, 4, -5, 0, -11, -8, 2, 4, -16, -16, 5, 10, 1, -2, 7, -6, 3, 5, -6, 14, -3, 8, 11, 10, 13, -3, 0, -5, 5, 5, -10, 2, 7, 3, -4, 16, -12, 6, -10, -16, -5, -9, -9, 7, -1]
5096aj3K3qJ3j4JJ%JkLj3QJ2Mk7LJ3%K2k6J0lLk2J1J3qj2%K3mrMoJ2mNooOj1J5
5139A1j0j2K6rj0J4Mj7mNjJ0%pJ2j5J2j0J5l0K0RJJ0l2K3Mj7k0L0oK3k0Mj3j0
5175a0L0j2j3LoJ6j7Mj5KJ4J4k2J6Nk0jK1Lk1oJ4K4k9NNrmK1jJ0j8oJ8Lpk3K9
5213A7j5J3%k2K0qLNk7J6j8K0JnmmJj0J7J2j8pK0jqoNJ0j8K3nmpMlRK2l0JRj7
5254ijKJ3Jmj1LmJ4jk1J0%MllQlpMKnJ5pJ3mj5MJ2Qj9lKNmJ0jqK3mkqJ0rOplJ0
5302A3j1oLqQMJ0j5Rk2J9j4PJJoNNmOJ4j0j1J2onOj8OJ8Ml0K3OlNMj7mnOJ4j0
5345DkjLJOj9Pj2nJ3J4Oj1lj0lJ2j2QJ1j4JLKOJ0j7K8l2K7j6NlPoOj2L8l4J0m
5386A2nJ1j6NK%Jmjj4J1KNj3RkOnqJ3Mj4J1%j5K0jmj0J2j5Qj3K4k3K4Lpj9J5N
$$ y = [-1, -14, 9, 1, 14, 0, 1, 2, 2, 3, 1, 4, -9, -1, 11, 15, -12, -9, 4, 4, 26, 0, 10, 7, 10, -12, -1, 12, 4, -8, -8, 15, 11, 2, 6, 0, 12, 8, 13, 7, 1, 7, -4, 11, 1, -11, 15, 6, -4, 10, 14, -3, -7, -2, -3, 7, 7, 0, 12, -3, 9, -1, 14, -16, 4, 13, 14, 24, -8, 15, 19, 2, -18, 12, 6, 29, 9, 13, 0, -10, 20, 8, -5, -2, -8, 8, -9, -5, -20, -18, -4, 10, -12, 4, 9, -11, -12, 9, 12, -9, -15, -1, 23, -6, -1, 4, -5, -9, 12, 11, 21, 3, -3, 15, 18, 11, -12, 17, 2, 15, 15, -7, 13, 5, 8, 13, -14, 2, -16, 4, 5, 0, -4, -8, -7, -17, 0, 12, -6, -13, 7, 6, -2, -8, -3, 7, -11, 12, 7, 3, -4, 0, -3, 6, 28, -2, -1, 8, -9, -10, -8, 5, 6, 2, -9, -6, -10, 4, 3, -18, -8, -8, -4, -7, -10, -2, -5, -12, -8, -6, -11, 4, -3, 10, 6, -9, -5, 7, 15, -4, -7, -5, 0, -4, 6, 5, -3, 20, 16, 14, 6, 16, 7, 13, 6, 3, 13, 2, -4, -1, -9, -1, 3, 13, -2, 7, -15, 4, -10, -3, -2, -1, -7, -2, 3, -1, 5, 19, 9, -2, 10, 4, -1, 5, -13, -7, 11, 15, -15, 8, 14, 11, 16, 20, 3, -1, -6, 0, 14, 4, 2, 1, 4, 5, 11, -8, -1, -13, -18, -5, 9, 15, 4, 1, -9, -12, 0, -12, -4, 7, -7, -6, -3, -1, 5, 15, -2, 26, -6, 21, 5, 10, 7, 14, 8, 14, 2, 40, 6, 16, 12, 7, 18, 2, 7, 9, 9, 10, 6, 5, -9, 2, 4, 9, -4, 5, 3, 9, 4, -4, 9, 13, -1, 10, 10, -5, 15, 14, 10, 0, 12, -3, 5, -8, 16, -7, 17, 20, 13, -6, 9, 14]
5427A4j5J1LmrJ0%j4Jj2J6Ok3JJ9Lj1oLKmQJJj2J4k2L1j1kK2jk5J8j2J6k1mLJ4
5467ImJ2j3j2K4mj5OQQj3j2oLPjNj1QpqLR%MPk1J3j2J3Pjj0K2j7nJ3LkJ3k0Ln
5510AjkqJ0Pj3Qj3J4Nqj1J1J3ploQpj7RK4lmk4J2pJ7m%j8K5Mknj0J0J5k4NrNK1
5553A8k1K3mj6JKpJ1%LjJMk4oJ8noJ1Mj9QJ0j5Rj0QLlmQQMJnqpNMJ3ooQ%j6J3
5599I%OlkKloOok1QlOJ2j5J0l3J7kKJ1k2L4j6MK1j6J2j5lPJ4k0JJ0JJ0k5OJ0Q
5640A6k3J8%j1pJ8k4L2j5J1k1%J8j6Oj8QKLPkj6J4Rk9K0mj6L4j6PKPooJj2J9j5
5679eQlK3l6J2J3oj4J3JJ1j5rPMRk6kj1K6rR%JpRj4J5k8j1K0PKpK0r%OmJ2j3j
5721bKK1njRj0j1QKj9QmMQj1kJ0qJrKK2k7K3k5J4jjPl2K6MlOjnj3K7JrK2j4j0
$$ y = [14, -1, 10, 13, 9, 0, 10, 10, -4, -3, -15, 1, 7, -16, -15, 4, 7, -4, -10, -7, -5, -9, -1, 0, 1, -11, 3, -19, 12, 1, -1, 21, 20, -5, 13, 1, 17, -4, -8, -5, 9, 5, 17, 4, -8, 16, 12, -3, 3, 11, 19, 6, -6, -12, -9, -2, -3, 2, -9, -1, -8, -16, -13, -4, -4, 0, 7, -14, -1, -13, 0, 7, 6, -4, 18, 1, -4, 9, 12, 10, 23, 3, 6, 1, 0, -2, -10, 0, 7, -6, 2, -11, 3, 8, 0, -11, 0, 13, 6, 3, -3, 5, -2, -19, -10, 14, 11, 7, -17, -5, -12, 5, 1, 1, -17, 8, 12, 10, 5, -5, 5, 20, -4, 1, -8, -3, 18, -3, 20, 16, 0, 1, 3, -4, 7, 7, 10, 9, 10, 14, -10, -16, 2, -3, -9, 2, 6, -13, -5, 5, -10, -1, -11, -3, 0, -3, -7, 1, 9, 13, 14, 9, 1, -6, -1, 3, 16, 10, 4, 12, 12, -4, 9, 9, 15, 12, 10, 12, 9, 3, 9, 3, -18, -10, -13, -7, 5, -10, 0, -33, -16, -18, -16, -5, -27, 7, -9, -5, 16, 0, 12, -3, -6, 1, 15, -5, -4, 6, 7, 17, -8, -2, 8, 16, -7, 11, 11, 0, -7, 11, -13, 19, 4, 15, -6, -6, 12, -4, 2, -16, -8, -6, -3, 4, 2, -14, 0, 9, -20, 0, -4, -20, 14, -2, 5, 7, 14, 8, 2, 3, -9, 10, -5, 3, 0, 23, -13, -1, 12, 6, -8, 5, 6, 17, 2, -7, 0, 4, 13, -13, -15, -26, 0, -9, 0, 0, 1, -6, 3, -11, 4, -24, -35, -15, -8, -6, -13, 7, -2, -2, 4, 0, 12, -1, -2, 0, 21, 16, 15, 24, 14, 3, 11, 13, -6, 2, -2, 2, 10, -1, -3, 7, -1, 0, -9, -7, 15, -12, 11, -14, 0, -1, -2, 5, -27, -1, 3, 0, 6, 5, 0, -13, 14, 15, 6, 28, 14, 4]
5764DRmKk0j0K4Kj4RJ6j6qK1nk8J9KLj8J0%kqK3k3J7qn%qL3k2rJ5J0rJ7j7J4k5
5804iL1k6J2oJ7qj1%j0J3qJ0Lo%mJ1pj1%oqJ6kPMLmj1lJ2j1J4J2l1K4llnlJ3k
5846D%Kj4JRJ4j1k3L4k8J4lK0j8kJj5K0klpJ4jj7kpJ6j3nK7nlmJKLjK0k0%RjJ2
5889A8oj4j8K8mj3K5j2JnPj7K2j1opJ2Rj2J9kqj4J2k0J1lK0k0J4j1NqJ1j0J2m
5926A%j0Pj3KK1k2J6kmRj2J3J0l0J4oK4Knj4OnNOk3K4j8NQk5K5j7J3MjJ1k9J1
5965Aj9J6Pkj1lJ8kj3NJ1mLk1J7J1qLMj1oJ7pJ6j2mROl1K8j5M%qJ2l6K4nj4PJ0
6006cKj2j4J3RJ0Nj4KJ6mpj6J1LLoMmJ6Mj7K3j1jj8J3j6J1Nj4J6mMJ4j5k4KOj1
6046a9K5lKrj1J6J6k0j1K0j7qJ8jnJ4j4KRjnKNmJ7qj9J7nJ0j6pJ9j1Qo%nJRo%
$$ y = [4, 13, 9, 11, -9, -19, 5, 7, -7, 2, 18, 2, -6, 15, 10, -18, 1, 3, 6, -12, -2, -2, -4, -12, 11, -12, 5, -3, -8, -8, -16, 17, -5, -14, 1, 11, 2, 19, 2, 16, -9, 22, -4, 8, 2, 19, 11, 0, 0, -10, 3, -5, 5, 8, 2, 2, -2, 9, 2, -9, -9, -15, -23, -7, -9, -2, 2, 5, 1, -10, -13, -1, -12, 2, 14, -17, 7, 4, 1, -4, -7, 6, 4, 4, 6, -8, -7, 2, 16, 5, -18, 16, -12, 2, -1, 19, 1, -1, 0, -15, 5, 3, 0, -7, 7, 6, -11, -13, -20, -4, -17, -22, 5, 0, -3, -7, -6, -4, -1, -2, 18, -2, -2, 7, 6, 18, 12, -2, -20, 8, 4, -9, 16, 4, 5, 0, 7, -10, 12, 1, -5, -12, 0, 9, -3, 16, 14, 6, -8, 4, -16, -5, -8, 12, -8, 6, -5, 0, -8, 3, -7, 5, 1, 1, -9, -2, -15, -13, 8, -14, 2, 0, -4, 5, -7, 6, 16, -14, 0, -6, 18, 20, 15, 1, 7, 2, 7, 13, -10, 14, -4, 1, 9, -16, 9, -8, 5, 9, 8, 19, -10, 1, -18, -2, 5, 3, -8, -11, 7, 5, -8, -3, 8, 4, 7, -14, 3, 14, 6, 9, 13, 2, -4, 13, 6, 22, 10, 6, 15, 21, -10, 18, 3, 7, 7, -1, 11, -25, -1, -6, -20, -13, -3, -1, -13, -27, -14, -5, 5, 10, -4, -2, 14, 10, 3, -13, -2, 1, 4, -2, 2, -2, 14, 18, 1, 24, 13, 12, -6, 7, -9, 2, 7, -7, 9, 5, 9, 23, 8, -16, -14, -8, -19, 6, 3, 5, -4, -15, 1, 17, -3, -14, 6, -11, -19, -1, -2, -7, 7, -7, -5, 4, 3, -2, 0, 5, 1, 18, 10, -9, 8, 3, 13, -3, -10, 9, -2, 6, 0, 0, -5, -4, 5, -1, -1]
6088amLkqJQj3J7%pJNrlLjJ8k9K0kkLjK3k3JjPKnMjLlMlj5jJ9j6j9J4J9k4J9%
6134AoK4j9pK5k0ljpK5j3Noj3OL0j5mK7k5qNJ5nj9K2oqP%j0Jj8J6nOJJJj4%Qk1
6177b7K3QmQqj1JMJ7j1Lj4L4k3nNJ9j8J2j6MJ8k0oPMnJ5j2k4L1j9NPJ4k8PMJ3
6216A2Kl5K1pK4k3P%oOj7K8qkLNrLJ6nj2jKK2oj5rMjMMrJ8k5RRj2J0kj6K3j4j
6259cj4J5j4RJ8rj9mJ9MJ3k1qJ2nK6j3j2J2J2j6j0J6j6J4Qqj2J9rrLMqJ0rjJ7
6297A1k3J2j0J1j1jMPmNJqrK2oj1J2k1KQmJ2j1K2k3J7kMj9J9jjJ3k4K0J3qqk5
6336a5K3j7kK0k3J4rL5l1Oj2LmQ%MkJ2j6J0j0J3j1Mj1JJ0Nj1MK6k6J5j3%LK%J
6375FJ2j3J4j7JqJJj5K3%%%pj2J6j6J8mj2JKJ8j0kOqpJ5j0LQj0RlN%qJ5kk3Pq
$$ y = [-1, -5, -2, -4, -12, -11, -3, -16, 1, 1, -6, -5, 0, -9, -12, -9, -10, 8, -21, -1, -3, -5, -2, -3, 20, -3, -2, -3, 4, 6, 1, 5, 4, 7, 4, 8, 5, -10, -11, 8, -8, -27, -13, 6, -18, 1, 1, -5, 19, 0, -7, 18, -2, -5, -6, -13, 12, -1, 4, -2, -15, -9, 21, 6, 2, 29, 4, -4, 1, 16, 11, -8, 14, 8, 0, 7, 7, -3, -2, -20, -4, -9, -3, -2, -1, 0, -14, -14, -6, -27, -4, 4, 0, 8, 0, -11, -10, -6, 11, 0, 3, -11, 23, 0, -5, 0, 19, 1, 13, -3, 1, 19, -1, -7, 0, 4, -1, 14, 2, -22, 9, -10, -5, 2, 16, -12, -5, -1, 12, 14, -21, 0, -7, 17, -6, 1, 1, -5, 1, -16, 12, 4, 2, 5, 10, 1, 4, 20, 15, 3, 2, 4, 26, 20, 5, -4, 0, -1, 3, 7, -2, 16, -9, 0, 9, -3, 7, 5, -11, 12, -2, -3, -17, -2, -16, -7, 11, 2, -17, -21, -2, 2, 15, -6, -14, -2, -7, 19, 6, -6, 6, 18, 2, -8, 8, -8, 6, 14, 6, -6, 13, 4, -5, -2, 2, -6, 4, -5, -6, 11, -12, 0, -10, 1, -10, -11, -7, 0, -4, 1, 2, -6, -15, 7, 1, -10, 2, -19, -17, -9, -13, -1, -12, 10, -13, 4, 2, 6, -13, 6, 5, 4, 17, -7, 13, 26, 18, 10, -15, 8, -9, -11, 9, -14, 0, -9, 26, -5, 1, -11, -8, -12, -4, -4, 0, -2, 10, -6, 4, -6, 7, -4, 0, -11, -10, 0, 5, -6, -2, 24, -2, 13, 0, 0, 3, 5, 5, 6, 18, 5, 19, 2, 3, -5, -4, -3, -18, 5, 5, 5, 5, -2, -14, 2, -14, 4, 0, -12, -11, -9, 9, -1, -3, 3, -5, -12, 3, -7, -4, 4, -6, 3, 0, 5, 5, -3, 12, 10, -13, -6, -14]
6418a4K3Ok5J4r%j0K4j7J1k3K3JrpJJ2k0K9j0mOj5J6ooJ1pLQLk1J7k3K8rlJ1j
6457Hj3KJ0jPj6J1ppLnJ1mmJ7k3%j0J7Mlk%j4KK4j0KnOj3%K1Jj3OkpJ3Qj5LJn
6501bJ5j8K9m1K4l%j9J1j3K9j0rJ7k1lK1j0pk%LJ9k8oJ2jK%K0kJj0%J4oLmJ8k3
6541@J1j3KJ2qj2J0J9j3j1j7RMnQjPkl0J3%K2j3Qj3MMKj2OQKmQKpJ7k6KJ2j5N
6583eK0oJ4%j2jpmpQK5l1J3Oj4mMJ0j3Nj2qJ5QrNoj1J5Jj1PpoRjMJ2j1kOolK0
6627A0rONl%oj0J3lj3%RrK0rOlnkj3mJ4opQJ0rJ0%j2K2k9K7k3%K3qRJk2K2lpL
6671ClPJ9k8J4rKKj2JMN%j0nJ0%k%joj2K0j9Qj3RKKJ0OKlj0J6mkKkP%j4J5j3K
6716@j1MK2l0J7j7JMJ6okk2K1Kj0mJ5Pqj1oMK0j7j0OOLKk0J6J4pnKQj5J8j4J3
$$ y = [-14, 9, 15, -10, 4, -5, -5, -15, 9, -8, 3, -20, 3, 4, -5, -12, -11, 1, -19, 10, 0, -4, 2, -13, 3, -3, -9, 2, -5, -2, 6, 9, -12, 5, -18, 10, 1, -2, 9, 8, -5, -3, 7, 6, 13, -3, 8, 1, -6, -3, -8, 3, -1, -5, 12, -11, -11, -21, -4, 0, -3, -5, -5, -19, -17, 7, -3, -1, -6, 0, -13, -13, 8, 9, -4, 2, 0, -7, 6, 14, -1, 2, 3, -2, 13, -5, 24, -17, 7, 4, 4, -15, -4, -17, 12, 2, -7, 10, -11, -14, 7, -3, -10, -12, -12, -9, 10, -18, -24, -12, -13, -11, -11, 9, 7, 8, -2, -2, 12, 6, 9, 5, 23, 0, 11, -2, 0, 12, 4, -8, 2, 21, 8, -3, -20, -11, -7, -12, -4, -5, 2, 0, -30, -17, -17, 5, -8, 0, -13, -9, -5, -3, -15, -9, -1, 1, -3, 5, 7, 0, 17, -9, -7, 5, -10, -5, 15, 9, 23, 23, 11, 10, 3, -1, -8, 0, 25, -6, 7, 13, -1, -5, -1, 9, -4, 1, -11, -19, -4, 4, -5, 0, -6, -17, -2, -1, -12, -5, -12, -18, -9, -10, -6, 6, -5, -7, -1, -7, -10, 10, 1, 7, 12, 9, 9, 3, -7, 6, 3, -10, -10, -1, -10, 10, 1, 7, 4, -1, -3, -16, -20, -6, -12, -19, -11, -1, -10, 0, 0, -12, 10, -19, 8, -15, -15, 8, 0, 9, 10, -12, 10, 7, 0, 3, 0, 7, 26, -2, 12, 3, 5, 7, -5, -4, 0, 5, 5, -5, -10, 0, 0, -2, -2, -3, -9, -21, -1, -20, -12, -25, -16, -14, -12, -2, 4, 6, 3, -7, 9, 5, 3, 5, 3, 10, 10, -4, 11, -2, 0, -11, -7, 15, -15, 2, -15, -14, -10, 6, 0, -2, -24, -3, -1, -11, -15, 0, 7, -1, -12, -18, -14, 6, -11, -21, -15, -9, -6, -4, -24, -8, 6, -1, -6, -4, 4, -11, 7, -7, 6]
6756FNj0rJ8j5NK2k9RQj5Qj7NjRoKPj6QjmkJ2k1J9o%qJ9okJ0l1J6MRpmK2mj3j
6800eRJ3j1J7k5J0JpNKj4mmmK3j6RJj3Oj4K4j9N%J4j7M%RjmjJ0n%LQj7K1j2Om
6843CQLnpqJ7kJ4j7j2kJ7k4J1J1Jj9LLJ1Mj1%rMlKQj1J3j6MJ9qmLQj6J1plJ8j6
6886dJ4qJ2j8LJ0qJ3k0Qj1J1J6j4j2ROmj0J3rJ2j0J%Ok6J9k5J9J1nJj3L2j3kj1
6924gQOrqJ3J0j%j0NjoK3k2Pj5J0oJ8rkj3J4lLnj3kLK6k7J5pK3j1kj6K1j2NK2
6965B5j0j0KRrmQj0PLk3K3rQj0Pj9J3JJ0j5J1k1Rj4J6j2J2qNJ9j0lLj5rJ4PPj4
7005fOnJ6k6K0K2k5nqK0j1J2Mj8oJ8oKppJ8%k7K4plnJ0qnJ7jqK9l2k%MLrJ7j5
7047a0QJknJ0Nj3lRJNKJ9j8joNqj0QjOMmJ5j6rJJ5%mk3J4Qj1J0KoJ3k1jlK2k1
$$ y = [6, 11, 1, -8, 10, -5, 0, 22, -7, 2, 10, -5, 3, -14, -9, -10, -1, -7, -5, 2, -14, -6, -7, -11, -13, -1, -22, -3, -9, -9, -17, 2, -4, -6, 4, -27, -11, -7, 2, -5, -9, 13, 9, -4, -5, 4, 17, 6, 23, -2, 8, 9, 2, 7, 9, -5, -9, -13, -17, 6, -10, -1, 0, -13, -7, -21, 3, -16, -11, -11, 3, -14, -10, -10, -1, -2, -6, -7, 3, -2, -2, 1, 9, -8, 13, 1, 7, 3, 11, 14, 9, 2, -6, 11, 9, 23, 6, -6, -8, 9, -15, -4, 7, 8, -11, -8, -5, 6, 10, -1, -1, -10, -6, -9, -7, 1, -10, 3, -13, -9, 10, 2, -2, 1, 9, -7, 4, -3, -6, 12, -4, 10, 2, 14, -4, -1, 9, 1, 14, -6, 2, -9, 2, 18, 4, -8, 1, 7, 3, -7, 6, -3, 9, -1, 0, 0, 6, -20, -1, -26, -7, 4, -1, 0, -13, 19, 6, 4, -7, 1, 7, -2, -10, 3, 13, 12, 12, 2, 7, 6, 0, 23, 1, 8, -7, 3, -3, 15, 6, 4, -9, 5, 2, 5, 0, -13, -15, -12, 14, -13, 2, -5, 18, 7, 5, -11, 10, -2, 3, 25, 15, 5, 7, 16, 7, 3, 11, 1, 8, 11, -12, 11, 2, 10, 0, 7, -12, 1, 2, 12, -3, 8, -13, -4, -18, -2, -14, -2, -10, -5, 14, 4, 1, 4, -11, -20, -6, 1, 8, -6, 0, -5, 11, -15, 5, 27, 2, -3, -11, 9, -2, 10, 14, -4, -10, 8, 2, 4, -3, -10, 8, 8, -19, 5, -2, -5, -10, 0, -8, -13, 4, 3, -5, 24, -8, -10, -10, -6, -3, -12, 5, -10, -2, -1, -3, -8, 2, 7, -6, -9, 0, 1, 6, 8, 27, 9, 8, 2, 7, -1, -11, -3, -4, 2, 6, 2, 17, 1, -8, -7, 8, 8, 4, -19, -5, 3, -8, 2, 4, -2, 11, -10, -11, -14, 8, -13]
7091a3LnJ6j6J7j4NJ3j6Pj0K1j3KoJ5qR%k1L9m4K2j7J3kLk1K0Kk8L6k2PpQnQj8
7130b0J6kjPMLj4jK0k1J9jj7J2NQj6j%LoJ2Jj7KMlj1K0rj3J3oKJ0j9PONpNj2J3
7173@OqQqJ7pj2NNj3jNPnjMRoj1K5mrj4K3j2lrJpJ8jj3RJk2RPrJ0KJj0JJ5j9K
7219a4L0j8OqJ%JKL0j5j5J5j2%J1j7pK6Plj6Qlj0JpQnJ6k1opRJ2ooJ5j3nMJ2j2
7261a2%J8Qj6PRKoj6jJ1J0j2KRj0ppJ0mKK0Pk2PLlj5J4j9NnRKpNj3OmPJ2pJpo
7306a3K8j3K6k8J4qRRj5j3K8j7j1J0kkJ3mj3PJ3k6RJ5j2OPj5k1J3JnmQrpK7j1
7344fJ6j3Lj0%oPJ2jJj2J9j7J2RLj7rK7nrJ8j6j5K7k0J4j7MkN%joj0NKmJ2Rkk1
7386a4J1oj3mJ4J3ln%J7j4LJ2KrRkj3K2j3Pj3Qqk0L3k1MpJ2j0J6j0LJ5k4PQj2
$$ y = [-13, -10, -15, 1, -15, 2, -12, -7, 6, -10, -3, -13, 8, -5, -3, -9, 6, -2, 7, 7, -14, 25, -19, 3, -14, -1, -3, 0, -21, -1, 1, -27, 9, -13, -6, -13, -5, -10, -2, -20, -4, -6, -7, 0, 4, 7, -7, -8, 12, -9, 10, 9, -8, 4, 9, 17, 1, 0, 0, 3, -3, 9, 10, -7, -5, -1, -4, -15, 5, -4, -17, -4, -10, -8, 2, -17, -10, -4, 1, -6, -1, -13, 0, 6, -2, 6, -2, 15, 8, -4, 1, 6, -7, -8, -3, 4, -1, -2, 2, 11, 5, -6, 19, 15, 6, -8, 15, 3, 0, -9, -8, -15, 3, 2, -11, -2, -1, -23, -14, -7, -16, -6, -4, -3, -13, -12, 3, -16, -14, 16, -2, 4, -4, -3, -3, -2, 0, 30, 15, 0, 15, 3, 3, 14, -3, -10, 16, 23, 20, 4, 12, 9, -1, 0, -7, 1, -4, 12, -9, -15, -22, -13, -1, -7, -13, 2, -11, -16, -12, 0, -12, -12, 6, 14, -2, 5, 14, 16, 10, -6, -7, 4, 14, 2, 4, 13, 3, -4, -11, -1, -5, -3, 17, 24, 2, 9, 12, 9, -6, 8, -11, -6, -11, -2, 0, -7, -2, -15, -9, -13, -6, 6, -1, 0, -7, -13, 15, 2, 28, 0, 14, 6, 15, 24, 9, -4, 24, 7, -4, 6, 4, 2, 15, 11, -2, 5, 18, -8, 1, 16, 4, 10, 17, 2, -19, -6, -5, -10, -14, -6, -15, -22, 5, -6, 10, -3, 0, -10, -10, -16, -9, 3, 2, 3, -9, 10, -7, 5, 14, 17, 0, -9, 18, 13, 4, 22, 6, -9, 18, -2, 12, -5, -1, -3, 2, 2, 1, -5, -15, -10, -8, -12, 0, 9, 7, -14, -3, -9, -22, -26, -12, 1, -2, -7, -7, 10, -4, -1, 11, 13, 4, 13, 11, -2, 20, 7, 14, 1, 9, 1, -19, 14, -7, -3, -10, 2, -8, 8, -2, 1, 16, -8, -1, 7, -5]
7425ej0J3L%j1K8mpj7OJ9j2J0j5J8kj4Oj6J0jj0J1LLMj4J6oJ0j3MpJlKJlJ3pk
7466BJ5j8kJ8ok2JJNJQoKjlJ1k0J1jrK6j8J5J2k4J4kNQl1kNpJ5J1mNk4%J3ljj1
7509a1J2Mj7KRnmKkOJ7j7J3J2l1KK0Jj0K%pLrJ2jOMj4J7j5lQJ2j5mmqLJ1j1MR
7552CqJ%lk0J0qK5jqJ7k1J4%K7l2j1J5OklqPJ2Kjj2K8k7NLJk0J9Ok3J8qk0L5k7
7593iOPk7NK3qlnnK0%k4K7nmj2j0K6kKPj8J4Rm2M4j4JmOPj6jMJ2pj7LK7l4J1R
7635CJ0plLj4QJj0%J5pNj5nK6k0ljJ6J5j4J3nqj1J3PrK2j7%Rjj4OKj0nJ2Qj9P
7677Cj5kK5k1J7j0lJRkoJ0k1J8k2J0KJ6Jj6JNQJ7j1jnj2OJpNO%KQj3qJ3j0J3o
7719FkmJ3j7JPkk9K6rnK2jpPj5PRKj3Mj5L4j3j7K3j7%LJ2k%nPj1KNQ%j1j5K6k4
$$ y = [-5, -15, -2, 1, 1, -10, 18, 14, 7, -10, -4, 15, 3, 13, -2, 16, 14, 0, 6, -10, 0, -1, -11, 0, 3, 6, 10, -4, 12, 6, 16, 3, 7, 0, 1, -2, 0, 1, -2, 11, 4, 2, 17, -1, -3, 15, 9, -13, -12, -11, -6, -5, 3, -3, -1, -2, -5, 6, -14, -3, -4, -13, 13, -5, 10, 22, -2, 12, 10, 15, 23, -8, -10, -5, -12, 3, 14, 10, 15, -9, -9, 4, 1, 0, -11, 1, 5, -12, -10, -1, -6, -10, -8, -10, -4, 13, -4, 9, 21, -10, -8, 12, 13, 3, 5, 5, -2, 1, -8, 4, 3, 9, 13, -1, 16, 1, -2, 6, 18, 3, -1, -5, -13, -10, 1, -10, -6, 3, -5, -4, -4, -7, -27, -17, -25, 0, -1, -9, 8, -13, 1, 1, 28, -4, -15, 0, 6, 4, 1, -7, 0, 12, 14, 13, 1, 29, 2, 7, 10, 11, -9, 10, 16, -7, 11, 3, -17, 18, -9, -3, 4, -23, -18, 5, -3, -6, -11, -16, 4, 4, -20, 7, 2, -2, -14, -24, 2, 0, 2, 9, -9, 5, 14, -28, 16, 2, 3, -1, 5, 12, -4, -5, -1, 11, 4, -13, -10, 17, -17, -6, 3, 13, 6, 3, 6, -8, 0, 1, -9, -9, 6, -1, 4, -11, -16, 10, -10, -13, -14, 2, 17, 3, 16, 11, 3, -8, 5, 12, 3, 25, 8, 8, 17, 16, 2, 8, 10, 0, -5, 7, 15, -4, 3, -12, -14, 11, -10, 7, -3, -6, -5, 4, 2, -4, 6, -15, 3, -19, -9, -7, 9, 10, -6, -5, 0, 8, 25, 14, 13, 8, -4, 2, 3, -4, 1, 7, 7, 9, 17, 4, -4, 9, -1, 12, 6, 4, 0, 13, -4, -3, 4, 2, -27, -1, -10, -15, 7, 6, -1, 6, -9, -2, 7, 9, -4, 0, -15, 19, 6, -11, 12, -5, -5, -2, 10, 8, 8, 3, 10, -1, 1, 6, 14, 14, 3, -12, 14, -10]
7762a0J5Kj0J3j1nqK6jk2MJJ2j7J0knjQojjJ5MplJJ8k2nQj1L1omnRoPj3QmnnR
7807EqqlMJ0jjj6J9nQkj4J5Rqmj5RK2j2mNjlJ1Mj5lJ0k1PPLJ5lq%j7jJ8j9J1j5
7851a5J8nnjK3rj1j6QPRrJ2KMj3LLj6J1LLPrrK7j5jMpNj2%J6KKmk0J2J6k0K%q
7895fj3J9k4J5J4jj6PKkJpNQKrJ1j4J6JmpJ0J7j5j7J0KPj1%JMoqPOj0J8k0MLj3
7938a3MKj4K0%ppJ0rJ5j0kPQlnLKnlK2l0J5j0OLMmKJJ2j1%NrOOj5J6j8p%J6rJ1
7983Ej9OJ5pj0Lj6QKpRJJ6lOKj5%kjOJ9j3kkj2J9J1k8J1QpNj3NPLj9JkOorj3L4
8028B%k1K0j3j2L1olj0J4J4k3qKj2K2J3pNj1Q%oLOJm%MJ1pJJj3NMj4pqQJMj0J7
8072Bj3J1Jj2QQJok2K2j1kJ1j1K9rj1J9j1J0j3jQlj0K0j6jRJ1lj4JLrJ0j6J1J4
$$ y = [-10, 5, 7, -3, 10, -1, -6, -14, 12, 11, -11, -7, -6, 6, -11, -1, -3, -8, -9, -1, -7, -8, -9, 6, 10, 3, 0, 1, 19, -3, -8, 0, -11, 20, 14, 10, 5, 14, 8, 15, 2, 10, 6, 1, -4, 5, -3, -11, -14, -10, 0, -1, -2, -18, 1, -4, 4, 2, -12, 3, 12, 4, 0, -15, -6, 16, 4, 0, 5, 4, 1, 12, 16, 1, -2, 8, -13, -6, 1, 4, 19, 16, 8, 8, -9, -10, 8, -11, 0, -15, 3, -2, -7, -8, 15, 6, -5, -21, -13, -6, 3, -6, 6, 8, 12, -1, 2, 5, -11, 0, 3, 6, 13, 4, -5, 22, 7, 6, 10, 3, 8, -4, -4, 12, 14, 16, 12, -8, 4, 20, 0, 2, 2, -6, -19, 0, -24, -9, 5, 4, -12, -5, -3, -5, -4, -11, -6, 2, 4, -5, 6, -8, 8, 9, 5, -2, 8, 25, 10, -7, 3, 5, 12, 1, 1, 2, 6, 0, -8, -1, 5, -5, 13, -7, -3, 0, -13, -9, -7, -21, -1, -1, -8, -15, -5, -14, 1, -9, -11, -4, 4, 1, -4, -1, 1, -4, -7, 15, -15, 0, -10, -4, -1, 3, -1, 1, 2, 14, 3, 3, 8, -1, 5, 11, -4, 12, -6, -13, -13, 3, -6, 5, -14, -8, 7, 0, -10, -7, -23, -15, -13, -20, -11, -10, 6, 3, 9, 11, -4, -4, -6, -7, -1, 18, 5, 3, 1, -11, 8, 19, -9, 2, 10, 3, 8, -5, 0, 7, 10, -9, -8, -10, -4, -10, -19, -32, 2, 2, -19, 1, -12, -24, 7, 1, -2, -12, 2, 16, -7, -15, -13, -25, -3, 10, 3, 8, -3, 5, 5, -1, 2, 8, 9, 5, 5, 9, 20, 13, 14, 15, 2, 7, 11, -3, -10, -18, -10, -9, -5, -15, 2, -11, 0, 1, -11, -3, 5, 6, 0, -22, 0, -11, -13, -2, -13, 16, 7, -4, 15, 4, 14, 1, 0, 8, 5, -5, 15, -1, -2, 7, 18, 15, 1, 2, 5, -4, 6, -10, 1, 15]
8111A5m0K4j6QnmLQpkJ6%JpJ8Jk8J2J2knoRMj2Rnj0J4j4K2rJ6k0LJ1k3mJ1kko
8153a2J9j3MPLj1J2j6JJ3k6K8j5rJ3NNoQj0J1nnLj6NNOpmK2rk2L1Jj1j2K
$$ y = [15, -25, -1, -17, -9, -14, -18, -15, -7, -14, -16, 0, 0, 1, -6, 12, 13, -15, -3, 9, 7, 2, -4, 5, 9, -3, 6, 1, -9, 5, -9, 13, 4, 20, 0, 3, 14, -9, -13, -2, -4, -6, -12, 7, -6, -2, 5, 8, -3, 9, -7, -6, 7, -19, 9, -6, -15, -2, 3, 8, 2, 10, 0, 11, 6, 1, 4, -12, -7, -2, 4, -3, -7, 15, 6, -16, 15, 16, 5, -7, -5]
8191e
##END NTUPLES=NMR FID
##END=
