##TITLE=1H_ES-ZC-IPA
 
 8 sc, 
 18.1.2023
##JCAMPDX= 6.0         $$ Bruker NMR JCAMP-DX V2.0
##DATA TYPE= NMR FID
##DATA CLASS= NTUPLES
##ORIGIN= UXNMR, Bruker Analytische Messtechnik GmbH
##OWNER= root
$$ XWIN-NMR		Version 3.5
$$ Wed Jan 18 16:21:30 2023 Russian Standard Time (UT+4h)  she@DPX200
##.OBSERVE FREQUENCY= 200.13135
##.OBSERVE NUCLEUS= ^1H
##.DELAY= (6, 6)
##.ACQUISITION MODE= SIMULTANEOUS
##.ACQUISITION SCHEME= undefined
##.AVERAGES= 8
##.DIGITISER RES= 18
##SPECTROMETER/DATA SYSTEM= spect
##.PULSE SEQUENCE= zg30
##.SOLVENT NAME= CDCl3
##.SHIFT REFERENCE= (INTERNAL, CDCl3, 0, 15.7039)
##AUDIT TRAIL= $$ (NUMBER, WHEN, WHO, WHERE, WHAT)
$$ ##TITLE= Audit trail, XWIN-NMR		Version 3.5
$$ ##JCAMPDX= 5.01
$$ ##ORIGIN= Bruker BioSpin GmbH
$$ ##OWNER= she
$$ F:/spectra/data/she/nmr/H-F/1/audita.txt
$$ ##AUDIT TRAIL=  $$ (NUMBER, WHEN, WHO, WHERE, WHAT)
(   1,<2023-01-18 16:20:05.07 +0400>,<she>,<DPX200>,
      <created by zg, POWCHK disabled, PULCHK disabled
       configuration hash MD5:
       00 E9 B6 7A A2 85 ED C7 34 08 36 98 17 FE 4E 26
       data hash MD5: 16K
       69 7E 78 0F 6C 02 0C 0C 5E 4C 2C 65 1E 24 21 05>)
$$ ##END=
$$ 
$$ hash MD5
$$ 6E 44 3D E2 6F 94 AF 7F 65 46 EF 53 FD 05 95 24
##$RELAX= 
##$RELAX= 
##$RELAX= 
##$RELAX= 
##$RELAX= 
##$RELAX= 
$$ Bruker specific parameters
$$ --------------------------
##$DU= <F:/spectra>
##$EXPNO= 1
##$NAME= <H-F>
##$PROCNO= 1
##$TYPE= <nmr>
##$USER= <she>
##$AMP= (0..31)
100 100 100 100 100 100 100 100 100 100 100 100 100 100 100 100 100 100 
100 100 100 100 100 100 100 100 100 100 100 100 100 100 
##$AQSEQ= 0
##$AQ_mod= 1
##$AUNM= <au_zg>
##$AUTOPOS= <>
##$BF1= 200.13
##$BF2= 200.13
##$BF3= 200.13
##$BF4= 200.13
##$BF5= 200.13
##$BF6= 200.13
##$BF7= 200.13
##$BF8= 200.13
##$BYTORDA= 1
##$CFDGTYP= 0
##$CFRGTYP= 5
##$CHEMSTR= <none>
##$CNST= (0..31)
1 1 145 1 1 1 1 1 1 1 1 1 1 1 1 1 1 1 1 1 1 1 1 1 1 1 1 1 1 1 1 1 
##$CPDPRG= <>
##$CPDPRG1= <>
##$CPDPRG2= <>
##$CPDPRG3= <>
##$CPDPRG4= <mlev>
##$CPDPRG5= <mlev>
##$CPDPRG6= <mlev>
##$CPDPRG7= <mlev>
##$CPDPRG8= <mlev>
##$CPDPRGB= <>
##$CPDPRGT= <>
##$D= (0..31)
0 1.2 0 0 0 0 0 0 0 0.06 0 0.03 0 0 0 0 0.0002 0 0 0 0 0 0 0 0 0 0 0 0 
0 0 0 
##$DATE= 1674044404
##$DBL= (0..7)
120 120 120 120 120 120 120 120 
##$DBP= (0..7)
150 150 150 150 150 150 150 150 
##$DBP07= 0
##$DBPNAM0= <>
##$DBPNAM1= <>
##$DBPNAM2= <>
##$DBPNAM3= <>
##$DBPNAM4= <>
##$DBPNAM5= <>
##$DBPNAM6= <>
##$DBPNAM7= <>
##$DBPOAL= (0..7)
0.5 0.5 0.5 0.5 0.5 0.5 0.5 0.5 
##$DBPOFFS= (0..7)
0 0 0 0 0 0 0 0 
##$DE= 6
##$DECBNUC= <off>
##$DECIM= 32
##$DECNUC= <off>
##$DECSTAT= 4
##$DIGMOD= 1
##$DIGTYP= 9
##$DL= (0..7)
0 120 120 120 120 120 120 120 
##$DP= (0..7)
150 150 150 150 150 150 150 150 
##$DP07= 0
##$DPNAME0= <>
##$DPNAME1= <>
##$DPNAME2= <>
##$DPNAME3= <>
##$DPNAME4= <>
##$DPNAME5= <>
##$DPNAME6= <>
##$DPNAME7= <>
##$DPOAL= (0..7)
0.5 0.5 0.5 0.5 0.5 0.5 0.5 0.5 
##$DPOFFS= (0..7)
0 0 0 0 0 0 0 0 
##$DQDMODE= 0
##$DR= 18
##$DS= 0
##$DSLIST= <SSSSSSSSSSSSSSS>
$$ [...]
##$SUBNAM2= <"">
##$SUBNAM3= <"">
##$SUBNAM4= <"">
##$SUBNAM5= <"">
##$SUBNAM6= <"">
##$SUBNAM7= <"">
##$SUBNAM8= <"">
##$SUBNAM9= <"">
##$SW= 18.05172834244
##$SWIBOX= (0..15)
0 0 2 0 0 0 0 0 0 0 0 0 0 0 0 0 
##$SW_h= 3612.71676300578
##$TD= 16384
##$TD0= 1
##$TE= 0
##$TE2= 300
##$TE3= 300
##$TEG= 300
##$TL= (0..7)
0 120 120 120 120 120 120 120 
##$TP= (0..7)
150 150 150 150 150 150 150 150 
##$TP07= 0
##$TPNAME0= <>
##$TPNAME1= <>
##$TPNAME2= <>
##$TPNAME3= <>
##$TPNAME4= <>
##$TPNAME5= <>
##$TPNAME6= <>
##$TPNAME7= <>
##$TPOAL= (0..7)
0.5 0.5 0.5 0.5 0.5 0.5 0.5 0.5 
##$TPOFFS= (0..7)
0 0 0 0 0 0 0 0 
##$TUNHIN= 0
##$TUNHOUT= 0
##$TUNXOUT= 0
##$USERA1= <user>
##$USERA2= <user>
##$USERA3= <user>
##$USERA4= <user>
##$USERA5= <user>
##$V9= 5
##$VALIST= <valist>
##$VCLIST= <CCCCCCCCCCCCCCC>
##$VD= 0
##$VDLIST= <DDDDDDDDDDDDDDD>
##$VPLIST= <PPPPPPPPPPPPPPP>
##$VTLIST= <TTTTTTTTTTTTTTT>
##$WBST= 1024
##$WBSW= 4
##$XGAIN= (0..3)
0 0 0 0 
##$XL= 0
##$YL= 0
##$YMAX_a= 465472
##$YMIN_a= -436723
##$ZGOPTNS= <>
##$ZL1= 120
##$ZL2= 120
##$ZL3= 120
##$ZL4= 120
##$ABSF1= 10
##$ABSF2= 0
##$ABSG= 5
##$ABSL= 3
##$ALPHA= 0
##$AQORDER= 0
##$ASSFAC= 0
##$ASSFACI= 0
##$ASSFACX= 0
##$ASSWID= 0
##$AUNMP= <proc_1d>
##$AZFE= 0.1
##$AZFW= 0.1
##$BCFW= 1
##$BC_mod= 2
##$BYTORDP= 1
##$COROFFS= 0
##$CY= 11.3945322036743
##$DATMOD= 1
##$DC= 2
##$DFILT= <>
##$DTYPP= 0
##$F1P= 2.36226072786647
##$F2P= -0.459571619588291
##$FCOR= 0.5
##$FTSIZE= 0
##$FT_mod= 4
##$GAMMA= 1
##$GB= 0.15
##$INTBC= 1
##$INTSCL= 1
##$ISEN= 128
##$LB= 0.24
##$LEV0= 0
##$LPBIN= 0
##$MAXI= 10000
##$MC2= 0
##$MEAN= 0
##$ME_mod= 0
##$MI= 1.114404
##$NCOEF= 0
##$NC_proc= 0
##$NLEV= 6
##$NOISF1= 3.799351
##$NOISF2= 2.8
##$NSP= 1
##$NTH_PI= 0
##$NZP= 0
##$OFFSET= 15.70392
##$PC= 1
##$PHC0= -19017.51
##$PHC1= 12.20073
##$PH_mod= 1
##$PKNL= yes
##$PPARMOD= 0
##$PSCAL= 0
##$PSIGN= 0
##$REVERSE= no
##$SF= 200.130013532006
##$SI= 16384
##$SIGF1= 3
##$SIGF2= 2
##$SINO= 400
##$SIOLD= 16384
##$SREGLST= <1H.CDCl3>
##$SSB= 0
##$STSI= 0
##$STSR= 0
##$SW_p= 3612.71676300578
##$SYMM= 0
##$S_DEV= 0
##$TDeff= 0
##$TDoff= 0
##$TI= <>
##$TILT= no
##$TM1= 0
##$TM2= 0
##$TOPLEV= 0
##$USERP1= <user>
##$USERP2= <user>
##$USERP3= <user>
##$USERP4= <user>
##$USERP5= <user>
##$WDW= 1
##$XDIM= 8192
##$YMAX_p= 0
##$YMIN_p= 0
$$ End of Bruker specific parameters
$$ ---------------------------------
##NTUPLES= NMR FID
##VAR_NAME=  TIME,          FID/REAL,        FID/IMAG
##SYMBOL=    X,             R,               I
##VAR_TYPE=  INDEPENDENT,   DEPENDENT,       DEPENDENT
##VAR_FORM=  AFFN,          ASDF,            ASDF
##VAR_DIM=   8192,          8192,            8192
##UNITS=     SECONDS,       ARBITRARY UNITS, ARBITRARY UNITS
##FACTOR=    0.0002768,     1,               1
##FIRST=     0,             0,               0
##LAST=      2.2672688,     0,               0
##MIN=       0,             -436723,         0
##MAX=       2.2672688,     465472,          0
$$ Real data points
##PAGE= N=1
##DATA TABLE= (X++(R..R)), XYDATA
0 0 0 0 0 0 0 0 0 0 0 0 0 8 -8 8 -8 8 -16 16 -24 24 -28 32 -40 48 -56 64 -72 80 -92 108 -124 140 -156 174
34 174 -196 222 -247 275 -304 338 -376 416 -461 508 -561 617 -679 749 -825 907 -1000 1101
52 1101 -1216 1347 -1490 1656 -1848 2072 -2338 2663 -3060 3565 -4226 5127 -6428 8438 -11889
67 -11889 18852 -37839 184532 465472 -275545 96562 281206 -436723 36918 381911 -364430
78 -364430 -36460 293278 -350640 45754 430151 -316079 -95429 296444 -310299 -13375
88 -13375 411438 -288202 -139801 317764 -240838 -50278 392834 -259193 -183646 322532
98 322532 -183355 -89902 369395 -222717 -212483 326577 -129130 -128864 339863 -185484 -233878
109 -233878 325027 -79912 -164540 308649 -144747 -247078 317104 -36840 -196772 275571
119 275571 -101621 -253147 302082 804 -223294 241617 -57178 -252972 279303 32893
129 32893 -242328 207461 -13470 -247424 249854 59558 -253020 174115 27348 -237966
139 -237966 215639 81438 -255727 142240 63744 -225769 178884 99126 -251551 112591
149 112591 94892 -212228 141666 113372 -242088 85454 120698 -198322 105260 125044 -228419
160 -228419 60571 141283 -184355 70434 134693 -211369 37469 156613 -170144 37829
170 37829 142430 -191392 15663 166662 -155042 7830 147990 -168884 -5082 171249
180 171249 -138426 -18826 150649 -144487 -24368 170500 -120221 -41499 150030 -119275
190 -119275 -41702 165086 -100848 -59873 146126 -94331 -56573 155982 -81011 -73960 139443
201 139443 -70672 -68704 144420 -61648 -84182 130831 -49078 -78378 131635 -43245 -91255
212 -91255 120985 -29800 -85833 118405 -26062 -95733 110296 -12779 -91239 105156 -10189
223 -10189 -98082 98938 2076 -94593 91985 4265 -98539 86840 15104 -95733 78710
234 78710 17275 -96995 73963 26235 -94477 65309 28442 -93420 60576 35434 -90800
245 -90800 51944 37516 -87954 47134 42516 -84978 39004 44231 -80911 34222 47483
256 47483 -77599 26932 48758 -72897 22354 50546 -69360 16149 51342 -64522 11853
267 11853 52029 -60859 6691 52365 -56164 2819 52279 -52517 -1371 52179 -48088
278 -48088 -4784 51537 -44446 -8197 50984 -40297 -11125 49829 -36611 -13819 48754 -32732
290 -32732 -16193 47158 -29089 -18236 45521 -25431 -19952 43506 -21883 -21301 41340 -18462 -22390
303 -22390 38938 -15170 -23085 36395 -12141 -23479 33742 -9257 -23564 31004 -6639 -23370
315 -23370 28279 -4262 -22932 25574 -2179 -22306 22983 -347 -21483 20437 1242 -20534
327 -20534 18058 2554 -19502 15809 3661 -18333 13708 4502 -17145 11759 5177 -15832
339 -15832 9932 5599 -14517 8260 5914 -13127 6699 5966 -11723 5324 5864 -10245 4036
352 4036 5592 -8755 2938 5170 -7245 1996 4569 -5780 1213 3828 -4345 613 2981 -2950
366 -2950 152 2022 -1640 -81 973 -436 -174 -158 680 -79 -1330 1649 202 -2474 2434 585
382 585 -3647 3101 1106 -4742 3600 1743 -5839 3953 2484 -6881 4181 3327 -7898 4275 4272 -8859
398 -8859 4197 5266 -9700 4013 6331 -10502 3675 7426 -11227 3246 8572 -11852 2636
411 2636 9767 -12348 1962 10935 -12744 1145 12123 -13042 208 13238 -13141 -809 14344
424 14344 -13163 -1908 15398 -13008 -3101 16346 -12726 -4344 17262 -12312 -5644 18059 -11762
437 -11762 -6977 18797 -11114 -8324 19412 -10342 -9707 19964 -9461 -11117 20379 -8486 -12480
450 -12480 20746 -7404 -13889 20977 -6255 -15205 21142 -5024 -16578 21116 -3671 -17821
462 -17821 21070 -2290 -19131 20799 -791 -20248 20472 706 -21400 19913 2352 -22259
474 -22259 19293 3874 -23284 18490 5603 -23879 17540 7105 -24640 16520 8924 -24993
486 -24993 15260 10308 -25484 14083 12094 -25582 12580 13360 -25752 11338 15137 -25701 9622
499 9622 16244 -25612 8377 17942 -25427 6417 18952 -25028 5233 20510 -24780 3130 21465
512 21465 -24060 1959 22792 -23779 -286 23639 -22657 -1448 24707 -22331 -3794 25517
524 25517 -20756 -4983 26146 -20371 -7277 26907 -18381 -8468 27013 -17898 -10630 27737
536 27737 -15545 -11871 27267 -14960 -13738 27921 -12361 -15058 26877 -11663 -16483 27514 -9005
549 -9005 -17920 25960 -8176 -18859 26639 -5593 -20451 24690 -4558 -20843 25350 -2223
561 -2223 -22699 23125 -946 -22494 23688 1041 -24550 21323 2693 -23836 21694 4210
573 4210 -26029 19323 6280 -24835 19281 7236 -27035 17037 9778 -25399 16464 10140 -27438
586 -27438 14474 13063 -25522 13232 12842 -27170 11603 16008 -25081 9704 15257 -26209 8568
599 8568 18488 -24162 6030 17307 -24644 5459 20429 -22873 2358 18991 -22617 2340
611 2340 21872 -21263 -1156 20339 -20276 -651 22826 -19485 -4425 21442 -17774 -3521
623 -3521 23355 -17592 -7434 22308 -15153 -6339 23501 -15505 -10128 22912 -12414 -9026 23240
636 23240 -13154 -12504 23098 -9598 -11620 22552 -10553 -14526 22828 -6669 -13963 21382 -7683
649 -7683 -16154 22012 -3746 -15942 19765 -4681 -17315 20699 -896 -17514 17823 -1636
661 -1636 -17989 18962 1712 -18644 15658 1342 -18286 16897 4086 -19372 13475 4102
673 4102 -18259 14663 6178 -19740 11346 6677 -18043 12327 8003 -19746 9268 8988 -17683
686 -17683 9906 9615 -19465 7281 11031 -17165 7406 11022 -18803 5257 12782 -16434 4866
699 4866 12219 -17747 3226 14140 -15421 2337 13145 -16300 1209 15073 -14133 -140
711 -140 13773 -14495 -767 15568 -12621 -2472 14096 -12471 -2609 15620 -10944 -4500 14133
724 14133 -10329 -4301 15345 -9230 -6260 13988 -8227 -5780 14809 -7522 -7697 13668 -6225
737 -6225 -7141 14114 -5833 -8871 13212 -4337 -8307 13262 -4187 -9807 12646 -2559 -9301
750 -9301 12283 -2526 -10508 11854 -856 -10100 11152 -881 -10945 10815 736 -10618 9873
763 9873 713 -11099 9595 2184 -10855 8415 2218 -10971 8180 3471 -10805 6908 3538
776 3538 -10586 6686 4539 -10478 5386 4657 -10052 5191 5392 -9983 3973 5562 -9383
789 -9383 3747 6044 -9338 2681 6271 -8670 2426 6532 -8647 1502 6778 -7943 1216
802 1216 6903 -7865 451 7145 -7157 104 7112 -7029 -513 7338 -6331 -891 7166 -6115
816 -6115 -1412 7325 -5433 -1819 7068 -5107 -2199 7131 -4456 -2581 6789 -4058 -2861 6756
830 6756 -3471 -3231 6349 -3028 -3393 6226 -2498 -3681 5848 -2053 -3751 5631 -1618 -3980 5247
845 5247 -1200 -3987 5004 -824 -4132 4660 -455 -4106 4405 -182 -4184 4074 194 -4120 3803
860 3803 421 -4158 3499 717 -4075 3213 917 -4060 2941 1174 -3932 2641 1323 -3877 2378
875 2378 1531 -3725 2044 1659 -3575 1783 1791 -3382 1465 1855 -3201 1216 1944 -3001 951 1987 -2768
892 -2768 729 1994 -2566 479 1973 -2350 314 1969 -2132 120 1912 -1929 -18 1859 -1737
907 -1737 -158 1810 -1538 -243 1721 -1385 -329 1633 -1218 -411 1537 -1057 -473 1479 -923 -515
923 -515 1359 -801 -547 1262 -676 -551 1146 -570 -561 1036 -437 -535 912 -339 -513 780 -250
940 -250 -484 665 -175 -423 548 -129 -367 421 -58 -300 310 -27 -217 215 -4 -121 113 -25 -33 11 -17
961 -17 58 -40 -41 143 -137 -79 245 -161 -122 323 -198 -163 382 -210 -230 478 -237 -299 579 -223 -394 622 -226
984 -226 -459 688 -211 -554 751 -176 -621 818 -132 -731 853 -75 -820 897 -27 -901 921 52
1002 52 -987 928 121 -1097 949 218 -1176 931 283 -1258 941 389 -1327 882 465 -1394 865
1019 865 591 -1451 829 684 -1516 777 823 -1551 700 904 -1595 633 1018 -1624 545 1115 -1656
1036 -1656 476 1252 -1677 371 1326 -1685 294 1445 -1707 165 1545 -1660 75 1643 -1666
1051 -1666 -69 1714 -1614 -160 1802 -1574 -310 1892 -1502 -436 1942 -1461 -585 2020 -1326
1066 -1326 -702 2051 -1271 -847 2097 -1138 -969 2092 -1063 -1095 2172 -913 -1234 2128 -828 -1354 2153
1083 2153 -668 -1508 2113 -562 -1587 2119 -410 -1741 2065 -302 -1795 2057 -145 -1938 1985
1098 1985 -1 -1996 1977 147 -2139 1863 295 -2148 1793 434 -2252 1686 617 -2253 1600
1113 1600 733 -2344 1466 925 -2314 1346 1026 -2358 1225 1188 -2306 1078 1295 -2331 956 1486 -2281
1130 -2281 761 1523 -2276 653 1698 -2243 470 1737 -2182 366 1862 -2128 156 1904 -2055
1145 -2055 92 2036 -1995 -126 2063 -1907 -184 2158 -1854 -402 2185 -1733 -461 2271 -1690
1160 -1690 -670 2275 -1518 -753 2307 -1477 -943 2343 -1272 -1017 2309 -1230 -1188 2328 -1015 -1264
1176 -1264 2262 -954 -1403 2276 -738 -1489 2164 -674 -1593 2188 -451 -1667 2023 -361 -1753 2043
1192 2043 -145 -1835 1883 -60 -1847 1907 115 -1969 1730 203 -1937 1736 350 -2048 1547
1207 1547 490 -1999 1551 594 -2112 1343 723 -2038 1341 816 -2150 1156 983 -2056 1064 1032
1223 1032 -2130 928 1191 -2007 834 1227 -2050 668 1379 -1927 535 1378 -1942 412 1546 -1802
1239 -1802 232 1516 -1770 147 1662 -1633 -48 1614 -1586 -103 1753 -1472 -277 1664 -1412
1254 -1412 -327 1766 -1301 -520 1706 -1176 -532 1788 -1116 -733 1737 -980 -732 1769 -933 -922
1270 -922 1709 -778 -915 1737 -742 -1067 1699 -569 -1063 1659 -539 -1189 1604 -360 -1203 1531
1286 1531 -322 -1273 1521 -132 -1298 1397 -105 -1335 1372 68 -1351 1242 111 -1388 1225
1301 1225 276 -1382 1064 288 -1396 1048 421 -1399 906 462 -1359 878 601 -1394 725 614
1317 614 -1344 715 703 -1367 567 749 -1299 546 801 -1326 432 848 -1224 400 865 -1243 291
1334 291 949 -1158 214 958 -1137 126 1006 -1057 47 1001 -1054 -15 1050 -954 -111 1019
1350 1019 -903 -161 1044 -815 -266 1024 -764 -301 1032 -675 -373 1006 -622 -421 1012 -533
1366 -533 -480 976 -459 -510 972 -410 -548 916 -330 -569 897 -291 -626 870 -209 -632 827
1383 827 -165 -667 810 -101 -669 770 -73 -705 733 -13 -699 708 26 -729 660 88 -709 601
1401 601 111 -725 557 175 -713 501 193 -704 454 244 -682 397 282 -654 350 334 -634 302 332
1420 332 -590 264 378 -592 221 375 -565 188 390 -544 124 404 -514 101 411 -494 46 425 -454 25
1440 25 418 -439 -15 420 -416 -33 414 -379 -53 418 -346 -82 416 -315 -110 393 -283 -124 397 -272
1460 -272 -136 393 -234 -161 368 -193 -157 336 -152 -178 339 -114 -189 320 -110 -215 285 -84 -215 281 -57
1481 -57 -196 262 -37 -192 228 -32 -210 214 8 -194 179 6 -205 182 27 -174 155 36 -175 157
1501 157 39 -175 132 50 -159 117 56 -162 99 75 -135 83 56 -141 79 53 -122 47 52 -119 55 58 -91
1524 -91 48 61 -87 42 56 -59 28 47 -57 15 44 -46 7 37 -42 -7 33 -18 9 16 -18 3 15 -4 13 13 -5 13 12
1553 12 4 21 -11 30 27 -10 6 43 -34 11 38 -32 14 34 -41 7 47 -67 23 42 -56 18 50 -71 4 60 -66 7 78 -77
1583 -77 16 94 -75 12 96 -83 5 88 -90 -9 102 -72 -27 104 -54 -13 137 -97 -39 131 -80 -48 128 -83
1607 -83 -58 154 -70 -52 140 -54 -74 163 -65 -93 152 -63 -116 166 -38 -108 152 -31 -126 169 -17 -118 151
1630 151 -18 -137 162 -8 -139 167 7 -149 151 20 -143 145 16 -166 151 40 -189 140 52 -193
1650 -193 132 67 -195 109 62 -190 104 89 -213 102 108 -203 85 109 -223 85 120 -212 75 138 -200 53 143
1673 143 -210 68 171 -189 45 165 -209 24 178 -199 29 176 -189 6 205 -190 -24 206 -187 -32
1693 -32 210 -192 -53 231 -156 -40 236 -148 -76 217 -137 -93 230 -116 -105 229 -96 -128 229 -91 -122 233
1715 233 -84 -138 235 -87 -146 217 -56 -148 214 -43 -172 220 -18 -179 224 -10 -184 217 -7 -205 190
1736 190 24 -213 184 13 -227 192 31 -221 181 47 -215 152 70 -226 159 80 -217 125 99 -224 120
1757 120 104 -220 111 109 -221 106 133 -202 76 145 -202 77 155 -194 72 166 -199 56 159 -207 28 186
1779 186 -188 12 178 -176 -16 189 -177 -8 196 -190 -26 198 -184 -40 206 -161 -60 202 -144 -70
1799 -70 199 -125 -70 203 -103 -92 198 -113 -87 213 -87 -103 206 -80 -120 198 -66 -134 192 -55 -129 197 -34
1822 -34 -136 198 -30 -163 174 1 -165 157 10 -165 155 16 -181 157 24 -173 136 49 -159 136 69
1843 69 -163 124 61 -171 128 86 -146 107 89 -154 78 69 -176 77 92 -176 82 87 -155 56 94 -148 53
1866 53 94 -157 38 119 -143 28 117 -130 8 114 -135 23 114 -131 9 127 -133 -31 147 -107 2 121
1888 121 -113 -6 139 -96 -38 130 -84 -43 129 -69 -42 138 -71 -60 128 -68 -59 121 -70 -87 114 -54
1910 -54 -81 128 -57 -82 120 -33 -98 118 -41 -91 119 -31 -97 107 -1 -92 104 -17 -99 80 6 -98 97
1933 97 12 -94 81 19 -102 95 35 -101 91 19 -104 75 25 -94 54 38 -100 40 58 -107 35 63 -104
1956 -104 31 68 -78 48 67 -82 31 64 -84 16 72 -86 4 57 -73 -1 59 -73 33 73 -82 5 55 -47
1980 -47 -16 52 -66 -4 65 -51 -1 72 -48 11 85 -40 -12 66 -38 -20 70 -14 -36 55 -27 -20 68 -21 -32 58 -20 -37
2008 -37 63 -10 -31 44 -7 -43 52 -8 -37 64 -10 -28 37 7 -42 42 7 -31 53 -4 -31 34 7 -44 36 12 -39 24 17 -53
2038 -53 42 1 -37 22 7 -42 8 4 -47 24 -2 -23 -3 9 -27 16 32 -39 16 28 -18 23 12 -25 9 33 -18 7 40 -19 28
2069 28 19 -31 14 12 -21 10 12 -18 3 7 -19 1 3 -11 -2 20 -12 -1 11 8 7 -1 -23 -20 21 -15 -3 -3 -12 -7 4 -7 -4 10 -3 3 -5 -3 -12
2108 -12 -4 1 -14 18 -14 -11 20 8 -6 5 5 -12 22 9 -2 3 3 -11 4 14 -6 -2 8 -3 5 3 -5 2 7 -5 -4 0 -1 -2 -3 4 7 18 23 2
2148 2 -5 34 12 17 -2 -4 -1 13 14 -3 15 -4 -2 0 -7 -22 7 -10 -9 6 16 3 6 -2 -12 -6 -10 -12 9 6 -10 1 -5 0 22 6 -7 8 7 -4
2188 -4 16 14 -15 4 9 -3 15 0 -11 7 -2 1 -5 4 -20 6 17 -18 21 15 -2 -5 11 -20 -4 8 -16 -4 26 -3 15 18 -4 10 14 -17
2224 -17 -6 -1 -13 0 3 -20 3 15 -6 -2 9 -4 10 18 3 -8 7 -2 -4 31 -20 6 33 11 -14 24 -3 -9 25 7 -6 15 -7 -16
2258 -16 7 -17 5 21 -6 0 25 1 -11 24 -11 -24 18 7 -19 0 9 -3 9 7 -19 34 11 -14 13 -3 -14 10 26 -14 24 -3
2290 -3 -11 15 2 -6 22 20 -16 3 9 -23 20 12 -5 4 22 -20 23 16 -8 9 10 -19 -8 2 -14 9 21 -7 7 17 -10 12 16 5 -9
2325 -9 34 -25 11 28 -20 2 11 5 -2 27 -8 -11 18 3 12 23 -2 -16 7 -9 6 5 -10 5 18 3 -3 23 -9 -26 18 -14 -10 3 -7
2360 -7 -14 12 2 -17 23 4 -5 23 13 -8 12 -21 -16 20 1 -18 4 0 -12 22 7 -9 10 2 -14 16 2 -14 3 9 -18 2 9 -23
2394 -23 -1 16 -4 13 -2 -25 6 14 -15 -4 29 -14 30 10 3 2 19 -15 5 24 -26 5 28 -10 10 24 -16 6 12 -15 6 1 3
2427 3 3 4 -23 -11 21 -14 -1 10 -8 -3 4 -4 -11 20 -14 -11 15 -3 2 5 -3 -11 12 -6 1 7 2 7 14 3 -4 19 -6 9 34 20 -13 10 5 4
2467 4 23 1 6 0 -23 -10 5 -3 -30 2 2 -9 14 -16 -26 1 -6 5 7 -9 -13 12 8 -8 -8 2 -6 4 9 0 11 9 -10 10 3 -5 6 7 -16
2506 -16 9 16 -2 5 23 -4 8 6 -15 -6 -1 -11 2 5 -12 0 12 6 11 9 13 -10 21 15 -8 1 -19 -7 9 1 -24 6 6 -3 5 4 7 14 4 -7
2546 -7 6 -6 4 13 -1 6 6 -1 -11 4 -6 0 21 0 7 11 13 -17 7 -6 -14 18 11 -18 -8 -16 -18 5 -4 -1 3 -9 1 0 -6 -14 13 7 -15 5
2586 5 16 4 -10 1 -5 4 3 -7 -10 -6 -14 21 -9 -11 5 -17 -11 -3 -15 8 7 14 2 8 12 -1 -2 -5 -9 15 -8 -2 1 14 -10 3 5 -8 14 3
2626 3 -3 15 14 -3 4 16 12 7 22 15 13 14 8 4 11 -4 7 8 -3 -14 5 -11 7 8 8 -1 -9 0 -7 -6 2 -2 3 -1 -6 -9 2 6 0 1 4 11 23 -7 22 -14
2672 -14 -4 6 0 10 -7 2 8 11 5 -6 -6 9 1 7 8 1 -4 -1 3 -6 6 -1 4 1 -19 -9 3 -6 -6 12 -5 -14 -12 -5 -18 -2 -14 14 7 3 10 -3 11
2715 11 -4 13 -16 1 5 8 9 -2 -4 -6 13 5 -5 2 8 0 -19 -14 -18 1 5 1 -9 5 12 -9 12 -9 1 -7 30 5 -3 2 -12 14 0 -13 10
2754 10 2 13 7 -1 2 5 7 15 -1 6 10 14 5 7 16 0 0 6 19 -23 -1 -19 -3 -7 -14 -2 -13 4 13 13 -2 6 -6 3 1 -3 12 -2 -14 11 2 -6 6
2797 6 13 9 10 3 -17 13 3 4 -5 -13 -7 -12 6 7 2 7 -7 -8 4 2 -10 -12 18 7 6 9 -10 22 -1 0 -13 -12 14 -13 -3 -13 14 1 -2 18 -12
2838 -12 -7 -6 12 10 11 -9 -4 -14 -18 -1 9 -3 13 -4 -10 7 6 -3 19 23 -16 5 -15 -2 17 13 -9 -6 -20 1 -2 3 14 6 8 8 -5 16 4
2877 4 9 -4 6 -2 -1 13 -1 11 -11 0 12 14 24 1 -5 5 9 -3 -4 -9 5 5 25 -7 -16 4 -8 -21 10 -5 -13 -6 -12 1 -3 7 9 3 -2
2916 -2 -8 5 17 -12 -6 -10 -12 2 -16 21 4 -1 7 13 3 -8 -8 -9 18 6 -1 12 17 26 4 0 12 -2 5 13 -13 -1 -1 -14 12 2 1 2 -5 -6 -5
2957 -5 -8 -4 14 14 3 16 -19 -7 11 18 1 18 15 2 7 13 18 12 -10 7 7 -3 2 -8 4 13 -2 14 -1 3 10 -10 -14 -14 -17 -13 -8 -12 -4 9 -1
2998 -1 -11 0 2 -10 10 9 -7 -9 12 -6 -8 4 8 12 13 1 0 4 26 -1 7 -9 0 -3 -20 -17 2 14 12 -8 -9 -4 -1 17 5 6 -27 -1 0 -14
3038 -14 -15 12 3 -21 -4 2 15 -2 6 -2 5 -17 -11 13 -2 4 7 2 -12 5 5 1 10 -1 -2 8 -16 -14 13 -4 11 11 11 -7 1 20 23 13 -9 1
3078 1 -8 -11 -18 0 -4 -6 -14 8 1 -9 4 -6 5 -6 0 3 -8 7 -10 4 2 -3 6 16 -4 5 -4 7 3 1 -2 1 -16 0 2 -11 8 6 0 1 0 5 5
3121 5 -1 -3 1 -10 2 1 2 -6 2 -12 0 -9 -20 9 1 -10 -7 -5 -2 -4 6 -3 7 0 12 3 5 7 4 2 7 1 10 -11 -5 8 -1 23 -3 6 3 7 -11 18 17
3166 17 -9 -3 -19 2 -2 10 13 18 -8 0 -5 14 -12 -5 -15 -6 -4 5 2 -1 9 14 1 13 5 12 7 -13 15 1 5 19 1 8 1 23 -3 15 6 1 -9
3207 -9 -2 -5 -5 -11 -10 -14 5 -6 -19 -5 4 -6 -3 -6 -15 -15 4 -3 2 -2 0 3 -2 6 -4 10 15 3 -19 15 -5 -8 6 12 0 -9 -10 0 5 -4 3 0 -1 1 -2 9
3253 9 12 -7 0 -3 -6 1 6 7 -3 19 10 -6 -5 7 -15 6 4 -4 14 7 5 11 -3 -3 7 13 0 -3 1 20 4 20 -6 9 -7 5 5 -12 -4 -15 23
3294 23 -10 -9 -2 1 2 6 -3 15 -12 -5 -2 -7 16 12 14 -11 -21 -6 -13 4 -6 -2 2 -15 5 9 8 11 4 10 3 -2 5 0 6 14 -1 -4 5 0 12 10 -11 11 9
3339 9 9 -4 8 -14 3 -5 -16 -3 -22 5 11 10 -17 2 0 9 3 7 -15 -9 13 1 18 8 14 25 -1 10 7 3 -11 -17 -19 -8 6 -14 1 10
3377 10 -3 -19 -13 -9 3 -3 -13 1 0 8 4 16 0 20 8 -3 -7 -19 -2 -13 -3 -10 3 6 7 -6 18 5 3 3 6 13 2 -6 9 7 -6 7
3415 7 -2 -1 1 4 6 9 -2 4 -7 0 -24 9 -3 -3 6 14 10 4 -5 -11 5 -6 2 6 -3 0 -9 2 -11 -6 2 -6 1 -11 16 -8 0 6 0 -3 4 15 6 10 -3 1 5
3462 5 -17 5 5 -7 -16 -2 1 -14 -10 -9 5 -13 15 0 12 10 -1 0 14 11 -4 -2 5 12 -20 -12 -3 14 19 -7 12 13 19 2 6 18 -2 19 -5
3501 -5 -11 10 5 10 1 9 12 -6 -19 0 -1 -4 -17 -13 -3 -7 -16 12 -6 -1 -5 3 22 -17 3 0 -7 10 11 -1 -12 9 -10 26 9 -8 3 -8 -4 -6
3541 -6 -8 17 3 -4 3 -4 4 -18 -2 25 -5 2 -17 2 16 5 -2 8 9 3 -21 -18 14 -5 -10 0 -2 1 3 -14 7 -1 -5 -12 -1 10 6 11 1 -10
3581 -10 3 -19 6 12 22 14 3 -3 2 -5 14 10 -11 18 8 -2 -8 2 -7 -6 5 -6 -17 0 -2 -15 3 0 -1 -1 -7 -23 -14 5 -1 0 0 -5 9 -10
3621 -10 -11 3 -3 19 7 0 8 -3 6 10 -5 -2 8 7 -17 1 -6 -12 -2 -15 0 -13 -9 8 -12 -6 -1 -6 6 1 -1 -14 19 1 1 4 15 18 -4 5
3661 5 18 22 1 -2 3 1 2 -3 -1 0 16 -2 1 -5 -4 12 11 -1 8 -6 -1 10 7 10 -3 5 -5 3 0 -4 11 -19 -11 -1 -9 20 -11 7 4 6 8 -2 -9 -2
3705 -2 3 -7 2 9 17 -1 7 -6 -12 -8 6 7 -13 -6 1 12 12 -22 -1 3 -5 10 -5 -8 2 7 -9 -3 -7 -3 4 0 -9 -2 -8 10 -4 -13 10 -4 8 9 1 -8
3749 -8 -2 -7 11 3 4 16 -11 6 21 11 -4 10 7 -5 6 4 -1 8 -2 6 -6 3 4 -3 1 -3 -4 -15 1 0 -10 -8 14 -4 -12 -3 -15 6 12 28 13
3790 13 -7 9 5 -11 -14 -3 0 -1 -4 5 -5 13 -6 -6 1 1 1 -6 1 -9 -4 13 -4 -11 -3 -17 -8 -9 -4 -5 2 4 -1 -3 19 -8 -6 -2 -7 -11 -6 -10 -1 9 13 -4
3836 -4 -11 -10 -3 -8 9 12 -3 -12 -2 5 -4 -8 -6 -4 4 -4 1 13 -10 -5 4 -31 -23 -18 -18 -4 0 4 -2 10 7 -8 1 16 1 -6 -9 6 3 -4 -5 -6 -7 5 0 -7 -4 14
3884 14 -8 -3 -14 -15 3 -4 -10 -7 -16 7 -12 1 -6 0 -1 4 -16 -14 -5 -10 -21 5 -5 7 0 0 9 2 -8 -3 3 -8 -16 4 -3 -9 -1 -6 3 17 -15 0 21
3927 21 9 -11 7 6 -1 -8 6 10 5 7 -21 6 7 -5 -3 -15 -2 -12 4 13 -1 -13 -5 -7 0 -3 11 -1 -6 -5 -14 -1 3 -3 -13 -1 -2 -6 -11 30 -1
3968 -1 20 -10 -5 3 16 10 -1 11 1 3 -8 0 -7 14 0 7 6 7 -5 3 0 14 3 11 -9 5 14 9 12 9 -4 -12 10 -8 2 9 -14 11 10 -1
4008 -1 -12 -1 14 9 -4 22 -8 -24 -2 -19 1 -13 -12 -5 6 -9 6 -13 15 -10 8 -6 9 -4 -2 -4 2 -13 -14 0 -10 -8 2 18 4
4043 4 -1 -4 12 -11 2 -2 9 -5 8 5 4 9 4 -1 15 -3 -15 -1 -3 15 1 -14 1 4 11 2 2 12 2 -4 8 -4 -13 7 -10 -1 0 -10 6
4082 6 4 2 3 9 9 -5 0 0 -12 -12 2 5 6 16 6 6 1 9 8 7 2 -4 -4 -5 15 -4 9 26 6 5 -6 9 3 6 10 -2 -2 6 17 -13 6 10 -3 5
4126 5 -7 -8 24 21 5 7 12 1 8 9 2 6 5 -4 1 -1 11 -21 9 1 -3 6 -9 1 11 11 0 5 0 18 11 11 -2 14 3 -24 -3 -8 5 12 -9 7
4168 7 8 7 3 1 3 6 1 -8 -4 1 5 -1 -2 -9 -17 17 7 16 12 -7 17 6 -2 11 -1 1 4 3 -11 10 6 -3 26 8 0 -3 3 7 2 -1 1 4 9 10 -11 6 -2 -6
4216 -6 14 -18 1 -8 0 -5 4 5 -3 3 -9 5 -5 19 11 -10 10 5 13 1 16 -8 2 5 -4 1 4 12 -21 -3 -5 -9 7 0 17 2 -3 1 2 -11 6
4257 6 0 3 -7 7 11 -6 10 0 1 4 6 2 14 19 1 15 4 9 16 -16 -7 14 7 9 -10 -1 -17 9 -1 10 -2 8 -2 -23 0 10 -4 2
4295 2 8 5 -1 11 2 7 3 -4 2 12 8 -3 17 -4 9 -4 8 -5 -5 8 6 9 0 7 -6 15 3 7 3 17 -11 -8 -5 1 11 -3 -6 -11 6 -2 -18 -2
4337 -2 3 -25 -7 -5 14 11 -1 -16 3 -4 -12 1 19 1 2 1 1 -2 -9 20 7 8 7 8 10 -23 -18 3 14 -1 7 2 16 5 8 12 15 6 -1 -6 3 11 8 -2
4381 -2 0 -4 -1 5 8 -7 5 9 1 -12 -9 -2 1 1 -7 8 -5 1 8 18 7 -1 8 -15 19 10 -2 -15 -4 4 4 -4 -8 -9 5 10 -2 -4 -2 12 -1 -4 6 6
4425 6 -15 -7 4 -8 8 1 9 2 2 7 -2 -12 -2 -3 -1 -8 5 3 1 6 4 17 8 -7 17 -1 5 17 -6 4 5 -3 12 5 -7 20 -4 -4 15 -4 -13
4466 -13 -17 -4 0 -26 -6 7 -5 6 19 16 -2 7 8 -1 10 2 4 -5 -5 14 9 0 4 13 4 5 15 -1 7 3 8 -8 -1 2 5 -2 1 5 2 4 3 -13 -4 5 -10
4511 -10 -25 -1 1 -5 -12 0 17 20 -8 -11 6 -1 6 -4 0 -3 1 0 8 7 14 5 1 -7 4 -5 7 7 19 12 16 4 8 11 -1 -2 -5 -3 12 14 2 -16 8 -5
4555 -5 -1 -2 -20 -14 4 -7 0 -1 -4 18 3 -2 -3 -1 5 -8 7 20 15 -1 7 6 12 9 2 7 14 10 -1 -5 2 11 -5 1 -1 3 -3 1 -8 5 -26 -2 -1 -14 -3
4600 -3 2 14 7 14 6 -12 -6 16 -3 7 7 12 11 -9 -7 18 32 -11 4 11 5 5 13 -13 12 5 0 4 6 -1 5 -2 -3 11 -1 1 7 -2 1 -8 2 4 -1 -13 0
4645 0 -6 0 11 10 -16 -12 -25 11 -7 16 1 14 0 -23 10 19 16 2 0 23 -14 -1 7 11 3 -10 4 8 0 -8 -14 8 -9 -4 -9 -6 -14 -12 -4 -1 3 14
4687 14 -1 -4 3 1 -10 0 12 12 2 -2 5 28 13 7 4 -6 -11 -1 -10 5 7 12 -3 -6 -1 13 6 4 5 4 12 5 3 5 -8 -3 -6 8 3 -13 -12 19 -1
4730 -1 -6 5 -6 -7 0 9 5 3 0 -5 14 -3 -29 3 3 6 15 -10 -12 3 -14 -1 7 6 0 -7 6 4 6 9 6 7 -8 -16 1 -7 5 13 -4 4 -4 -15 -10 16
4774 16 9 5 9 -13 11 6 8 5 10 1 9 5 5 -9 -2 13 -10 -4 16 6 8 4 10 -11 -2 -6 -3 3 4 -7 0 -4 -10 -4 -9 0 0 -10 -4 -3 3 3 -4 12 -6 -10 -4 13
4822 13 -4 -4 9 -2 20 6 -8 -6 -1 11 2 15 0 -14 -12 -7 -7 -9 -7 -9 2 11 -6 11 3 -9 4 -5 2 1 -11 4 -7 -5 -7 -10 -14 8 6 3 -23
4863 -23 15 6 2 4 -6 -7 -28 -18 0 -7 -2 4 15 -9 -2 11 -11 12 -5 0 -9 -2 -4 -8 2 5 0 2 -7 -11 -6 10 11 -6 -19 -9 3 -6 -1 -15 -19 -12
4905 -12 5 -7 7 12 7 6 3 -1 7 -18 2 10 -4 8 -3 7 -3 7 10 -14 15 -5 -3 5 18 -1 11 -6 -13 -10 -8 4 -3 -7 -13 3 -6 -2 1 -1
4945 -1 -12 -11 -21 -6 -14 -17 8 13 6 -4 2 3 2 -10 -13 -1 -6 4 7 17 13 -5 1 12 2 10 17 -2 19 18 15 6 6 2 -5 -11 2 1 -17 -3 -13 -10 -12
4988 -12 1 -4 -9 -1 -1 10 -6 4 -2 4 6 19 3 -2 -2 -5 -18 16 13 -6 13 14 8 8 0 -4 18 -1 -3 6 -4 -4 -1 5 -11 -13 -3 4 0 0 -15 13 -4
5031 -4 3 6 -20 -5 2 0 15 -6 -8 -8 -9 -10 -1 3 -16 -5 13 -14 4 -3 0 0 -3 -4 -1 5 -31 0 17 -5 15 -13 17 -17 -1 -4 1 -4 5 4 -2 -18
5073 -18 0 -9 1 7 -2 -14 -10 5 6 -6 10 -7 7 -9 -2 -3 12 11 0 -3 7 16 5 -9 8 -4 -14 8 -4 8 -3 -1 -3 -21 -2 1 -4
5110 -4 3 -3 5 0 0 -5 -4 -6 -14 -1 -8 8 -2 16 2 12 -2 11 -13 -5 -14 -5 -5 -18 0 -4 29 21 4 7 3 -9 1 -19 10 9 -3 7 7 -10 1
5151 1 9 -4 8 -10 -9 7 2 -5 -13 -3 14 -12 2 -7 -9 5 -1 11 -9 -5 -11 -3 -10 -20 -6 4 2 17 24 0 -8 8 0 0 -8 -3 -5 -11 -6 -9 -11 -7 -11 -7
5195 -7 -9 -3 -1 10 -6 -8 -9 -7 0 3 -6 -3 -1 4 21 14 -2 3 -3 -11 -18 -3 1 -6 15 9 -7 15 -6 -6 2 19 12 1 -16 -10 -4 13 -6 -5 -1 -8 8 -1 3 15
5241 15 -3 -14 14 8 -2 -1 10 -15 -14 -4 5 3 -2 -6 4 15 -7 -11 6 -3 -10 -14 14 -2 9 30 -2 12 0 -5 8 1 -1 -9 15 0 -4 7
5279 7 -13 5 -1 17 -3 -3 -15 2 15 -1 1 3 -18 -3 -17 0 -2 2 8 4 3 13 2 6 8 -1 0 0 -2 2 -4 9 13 9 19 -1 -10 -12 -11 -12 11 -2
5321 -2 1 -20 12 -18 21 -28 -23 6 -3 12 -7 -6 1 -5 -9 16 0 19 0 2 -12 0 25 8 3 -6 8 19 -8 -4 6 16 9 3 20 23 -16 0
5359 0 11 5 14 -2 9 6 -16 -3 3 -12 -9 2 -20 -5 2 -7 -17 -12 -2 -5 -5 7 12 -7 10 0 2 -2 2 -11 19 5 9 11 2 7 11 -6 -1 -10 -2 -9
5401 -9 -5 6 -12 1 -5 -20 -4 6 -8 -8 4 2 3 -4 -13 10 -14 -8 -14 -4 -11 -11 0 6 -11 19 4 -3 -7 9 -5 16 6 4 1 11 -4 4 10 7
5441 7 16 21 13 15 -2 -13 -4 1 5 -1 -5 8 -7 14 6 4 11 -4 -3 -24 -2 -14 -13 -2 -6 -7 13 11 -6 5 16 0 11 9 10 5 -12 1 12 1 11
5482 11 17 0 9 -4 -1 -10 -3 -18 2 -4 -16 -10 -12 -21 -9 21 -6 4 -4 -9 7 -14 8 1 -15 0 5 3 -1 -1 19 -1 -8 -9 7 0 13 -10 -1 -15
5522 -15 15 7 7 4 11 5 23 7 4 1 -8 5 -8 -6 2 -14 -1 -6 -16 -17 -6 -3 -8 -11 -7 -3 -15 -26 1 -2 17 -1 6 3 -7 -9 10 23 0 2 -2 -11
5564 -11 4 5 6 -2 9 9 6 1 -13 3 16 0 6 11 20 -4 -4 4 -8 -2 -3 2 0 -2 25 6 4 -2 -11 -2 8 -15 -9 -4 -4 -1 5 15 3 0 2 7 14 8 -3
5609 -3 -4 15 -2 13 -1 4 11 0 10 -4 4 4 -4 3 -11 -13 -1 8 1 -1 -3 -8 19 -4 11 -10 -10 5 6 -4 -2 6 -10 4 6 24 -6 0 11 8 -3
5650 -3 2 -12 -14 6 16 2 13 -1 10 11 16 6 14 2 6 -7 -2 -17 3 10 -8 11 -4 16 2 9 -7 -8 6 0 -11 -9 -6 4 5 17 7 6
5688 6 3 5 -4 2 -1 9 5 22 4 -11 9 2 3 16 12 -6 8 -5 11 -4 -10 -5 -15 -8 18 -9 3 -4 17 -6 10 -9 1 -4 -15 -6 6 -22
5726 -22 -8 -3 -24 0 3 6 -4 4 2 14 -12 -8 -11 20 7 10 4 0 16 5 9 4 14 2 -4 0 13 -6 -7 10 1 2 -4 -3 0 -4 2 -3 0 -12 -4 -8 -6 -6
5770 -6 13 8 -5 4 1 -12 -7 7 -7 -13 6 11 -11 -8 -1 14 5 5 4 -24 1 -2 -6 -29 -9 -5 2 3 -13 3 9 14 -15 -2 -10 16 -19 -23 -3 4 6 0
5812 0 3 12 1 7 -19 0 -2 9 -16 -2 -12 -14 24 -7 -5 -3 1 14 -1 10 1 2 -3 -5 1 6 -7 -13 -4 3 -7 22 0 -11 -9 13 -3 -14 2 1
5852 1 -17 -10 -10 -7 7 -1 -15 20 -9 -6 8 5 8 6 1 -9 -4 -2 9 -1 12 -1 16 17 9 -6 3 5 -16 -15 9 2 -11 -25 -14 -5 -16 2 13 -1
5892 -1 13 5 3 8 0 -9 -10 -1 6 -11 5 -3 6 11 -8 1 11 15 -1 8 15 0 10 3 19 15 8 -13 3 -21 -7 -2 0 -6 -3 1 -5 -7 8 -12 8 -14 -3
5935 -3 9 -6 -13 2 -15 -4 -5 -5 4 16 -1 7 -6 7 6 3 2 -9 -15 2 -4 -3 12 8 9 6 -1 6 -1 21 6 2 5 13 13 6 -10 1 -9 -2 1 7 2 -5
5979 -5 -4 -4 1 4 -14 -10 2 18 9 7 22 5 11 6 3 10 15 8 12 4 20 -5 8 8 14 23 12 8 -8 2 9 1 -13 -8 -3 -1 0 5 -15 7 -20 -7 -4 -14
6023 -14 -25 -7 -11 -6 -6 4 -11 -4 4 14 9 14 11 -3 12 15 0 -10 11 -4 11 -6 20 11 -8 0 8 3 -11 5 -12 -9 8 -1 -11 -4 -8 12 4
6062 4 8 7 -9 -11 4 6 5 6 -17 2 -3 -3 5 9 -1 -7 13 13 7 2 1 20 -19 4 4 -18 -1 3 2 6 3 16 1 -2 -1 3 -2 -2 -5 -7 -4 -11 -11 -8 6 -10
6108 -10 -2 5 15 2 17 16 -19 -8 3 1 -15 -5 0 8 0 -5 -5 4 9 10 7 4 7 1 9 10 9 9 0 -3 -4 1 -12 -7 -11 6 -19 -6 3 -10 3 -2 12 -7
6152 -7 4 -10 -1 -18 -7 3 -19 2 -15 15 1 5 12 -6 1 12 -3 4 4 1 -19 -5 11 -4 -14 -14 -5 10 11 16 0 -4 -7 -11 7 12 2 -10
6190 -10 -3 -7 -5 6 -5 -5 0 -6 13 -8 -10 -14 7 1 4 -7 14 -6 -2 1 1 19 23 10 2 11 7 5 -1 0 2 -7 -3 1 -20 16 1 3 -6 -6 -1 3 6 -11 -14 4
6236 4 -5 5 21 -15 -2 -1 -6 -2 -10 10 9 4 13 6 14 1 -5 4 2 -10 8 11 4 10 9 5 -1 -1 1 4 7 24 1 20 1 -21 -2 -9 -5 -13 1 20 17 -12
6280 -12 0 3 -19 2 5 -28 1 -11 -3 1 -3 -3 20 10 6 4 1 32 2 -4 -2 18 4 17 9 -4 -5 14 -7 0 15 7 1 10 -4 3 -1 3 -4 9 9
6321 9 2 -8 3 8 -12 10 -13 9 3 10 -11 4 2 -14 -9 9 1 9 8 -8 -12 -4 -1 3 14 4 0 8 -5 1 13 -3 -13 8 8 -3 -4 6 1 3 -2
6362 -2 -2 1 2 8 -2 -5 -3 10 14 -9 -3 6 -10 -3 -3 9 -11 -9 -5 0 -4 0 -10 25 8 5 5 10 1 12 15 5 13 13 10 -6 10 4 2 -7 -5 -2 -4 -14 -6 0 -5
6409 -5 7 -12 0 -13 -10 4 -15 11 0 -2 -11 -10 6 -17 -3 -13 10 -5 -5 14 10 7 9 -3 -14 10 1 -8 11 13 -2 -11 -22 9 2 -6 9 -1
6447 -1 0 -7 -5 2 -8 8 0 3 15 -17 3 10 -5 0 9 -2 10 14 -2 12 6 -5 7 -3 11 -15 12 8 9 10 9 7 -2 20 12 4 7 1 -6 2 9 -20 5
6490 5 12 4 0 -5 3 0 -25 -1 -6 8 9 -6 -5 -5 -1 9 6 0 -3 12 9 15 25 5 5 10 5 -4 8 8 -3 -4 9 -8 -2 8 2 4 6 -17 -3 -5 9 -14
6534 -14 1 -6 -6 8 -3 -8 11 2 10 -4 -6 -23 9 19 4 5 -1 -9 1 7 10 -8 -2 2 12 -8 10 -5 -1 -1 3 8 -8 2 -5 -3 3 15 -10 12
6574 12 -6 2 6 -1 13 -13 9 1 -1 4 6 -2 -8 2 0 3 -4 9 11 0 -8 -13 4 8 2 15 3 13 -4 7 -2 -4 3 -5 16 -12 2 4 14 -3 12
6615 12 3 -2 -5 0 -12 -14 -7 -19 8 -17 1 -3 -10 12 2 0 1 9 1 -8 -21 -4 -10 7 8 16 5 -2 6 20 -3 3 0 3 -9 0 12 3 -3 1 22 4 -8
6658 -8 -12 -6 -6 7 1 -2 -1 -5 -16 -1 -19 -8 7 -12 -14 11 -11 -1 -3 -7 5 -5 11 10 0 -9 -1 -5 4 -2 1 6 0 5 3 23 12 2 12 -6 4
6699 4 11 -7 -12 -9 4 -16 -5 -11 -14 -11 2 10 -2 -1 -12 13 -9 -14 -5 4 1 -16 8 -9 -12 6 1 4 -9 -5 -3 5 -7 11 8 15 8 20 -18 2 14
6740 14 -9 7 5 0 -7 -2 7 -11 -15 -10 -9 -6 -17 19 -2 -5 6 -8 6 -10 -22 8 -14 12 -4 2 -4 -6 -2 8 9 -11 -20 -6 11 2 16 -13 0
6779 0 6 7 2 -12 -1 0 8 -4 1 -12 6 -13 7 8 -17 -6 3 -2 -11 -18 -4 -2 0 -16 -18 4 -7 -2 -10 -4 -7 -3 1 -4 10 14 -3 -10 -2 4 -6 -14 14 4
6823 4 -1 1 4 0 -4 24 1 -21 -7 9 -5 -17 -5 -15 1 -4 -24 -12 -14 8 -3 -3 16 -1 -9 -12 -3 -15 1 10 -10 5 -4 -10 -17 16 7 13 -1
6862 -1 -11 7 -8 11 6 3 15 7 5 1 13 4 -5 -14 8 -8 14 -8 -14 -19 -7 7 -7 2 5 1 -1 1 -16 8 -22 -6 -2 2 9 1 8 9 15 -4 25 3
6904 3 -3 12 -4 2 2 -14 -5 -2 12 17 6 -13 7 4 14 -5 -2 -7 -12 -8 -3 1 -3 -9 -6 -6 -11 -3 -1 -2 -7 -6 -5 0 -9 2 -4 5 -5 12 11 -2 11 1 10 19
6950 19 -3 0 16 -7 -13 24 27 10 -6 -6 12 -16 5 0 -4 -8 -17 -19 -5 -6 6 -11 -9 8 9 -21 1 6 1 -6 -13 -1 2 -1 7 -6 11 2 6 -4 9
6991 9 9 7 4 2 13 -11 13 -2 -6 10 1 9 20 -4 -17 -10 -11 -10 1 1 4 -9 -1 -1 -18 -15 -30 -18 0 6 0 2 5 -6 7 -7 4 0 5 5 7 12 -6
7034 -6 -6 -6 -1 1 -20 -1 8 0 -1 11 -6 -8 14 24 4 -9 9 -17 -8 -6 -8 14 1 14 17 -17 0 -12 -7 -2 9 -9 11 -13 1 -24 -7 10
7072 10 -3 3 3 16 5 -1 -3 0 12 2 13 3 -4 4 10 3 3 11 7 -2 1 -5 -9 4 -3 2 -4 10 -9 13 -13 -5 -2 8 -4 -4 -22 -6 -13 -16 -4 -5 -18
7115 -18 -9 -1 1 16 11 6 -2 -8 9 3 11 7 4 3 -11 11 2 -21 -7 0 17 -10 2 -7 -25 -1 -10 0 -12 -6 -1 5 1 -13 -1 5 -15 1 -1 -16 -5
7156 -5 6 -5 -10 7 5 13 -14 -11 5 -11 6 6 2 2 13 -11 -1 3 7 -15 3 4 3 1 1 -23 -1 2 -8 1 -2 0 7 3 6 -25 7 -12 -21 -12 -5 18
7198 18 -9 -19 2 -2 17 11 7 -1 -2 10 9 -1 -9 0 -3 -8 1 8 -11 -3 10 12 7 0 4 -13 -2 6 -3 -18 -14 -19 12 5 -7 10 -1 0 -14 9 2 12
7240 12 5 -8 3 3 9 6 13 8 -7 0 0 17 -2 -10 -8 11 -15 7 -10 8 9 10 6 1 -5 14 8 -17 2 -13 1 -1 -11 -5 -4 -1 -22 -9 6 -3 1
7281 1 -8 1 -7 0 -2 -7 3 8 0 6 7 5 -6 -7 9 2 8 -6 -1 20 2 16 23 10 -6 0 -12 16 -5 8 0 -1 -11 6 -8 -21 -10 -8 -3 2 -7 -1 -7
7324 -7 -6 -3 5 6 9 -17 2 9 7 -2 -1 -6 3 15 14 8 12 7 12 1 -14 20 -5 -7 5 9 -12 -13 0 13 -10 -14 -20 3 -9 1 7 -2 -1 6 -7 -12 4 -1
7368 -1 6 14 -12 -8 -7 19 -4 0 3 8 9 -2 16 -2 0 8 3 19 -13 -16 -3 1 -9 9 -9 4 -2 -20 -9 -8 10 5 4 -5 -12 -9 5 5 8 -5 -10 -13 2
7411 2 -2 8 -12 5 -15 -1 8 -9 -3 1 1 -12 -7 9 25 -11 -14 3 19 -7 9 5 -8 2 -9 -2 7 -18 -2 -9 -11 3 -8 -7 -18 1 -4 -9
7449 -9 -5 -2 1 2 -7 -7 -4 2 13 15 10 -18 5 2 7 15 -7 15 -15 -2 -7 -1 -16 8 0 -11 6 -2 -2 5 -5 -7 12 3 -6 -17 -12 5 9 -1 13 9 11 3
7493 3 -1 -11 6 8 -6 -3 -3 -16 -20 5 0 4 3 4 5 4 -6 3 2 12 -2 -3 9 10 9 -7 8 20 8 2 2 5 4 -2 -3 3 -24 -8 -19 1 -9 6
7535 6 -21 -12 3 -4 -5 -13 -6 -19 -15 -14 7 21 5 6 -5 -2 -2 -3 13 -13 14 12 3 7 -14 0 17 5 0 10 -17 -9 -8 -9 5 -11 -2 -5 9 -5 -1
7576 -1 -12 -13 -24 -8 2 9 -8 -4 1 -10 -8 0 10 4 -2 12 6 5 11 6 13 20 8 10 8 21 -9 -8 -2 11 -6 -6 -3 -7 3 -4 -10 -25 -6 -19 -8 -2 6
7619 6 -7 3 -4 4 -7 4 -3 -21 2 -1 -10 3 -1 -3 -2 3 6 2 -2 10 5 13 8 1 -16 3 -2 -10 5 -11 -6 11 7 -22 7 -8 2 19 0 -18 7
7660 7 -3 4 -8 2 -5 5 10 -15 -5 15 -13 -4 12 3 -5 8 4 14 10 7 -4 -1 -6 -3 14 0 19 7 -4 6 22 1 -5 -16 7 2 -5 3 11
7699 11 -4 -6 5 9 7 -14 -15 -5 -9 1 9 -8 1 1 2 -10 -18 -7 11 2 8 4 3 -8 2 10 -1 -3 14 -2 -5 4 1 -10 -4 -4 8 15 -2 -8 7 0
7741 0 16 -2 0 -13 -17 -16 -4 1 -19 4 2 0 8 0 7 -15 -15 -4 -23 -20 5 3 3 -3 -3 6 1 9 -2 0 -11 2 6 -12 -15 -4 19 3 18 0 1 -2
7783 -2 -14 -7 -2 5 -29 -8 -10 -17 -3 -13 -16 -16 14 -6 -2 0 -21 -13 -8 0 0 -18 -21 -5 8 0 12 11 -2 7 5 -8 10 -1 -3 12 -4 -8 3 1 -14
7824 -14 -10 18 1 18 -7 -1 12 0 -10 -9 2 -13 -4 -1 -15 7 -4 -19 18 -6 -3 -12 -14 10 3 -2 8 -2 5 10 21 4 15 -2 6 -7 15
7861 15 -12 -5 1 6 -13 2 20 2 1 -1 -1 -8 9 -9 -9 -1 -11 3 -2 -22 2 9 -7 -1 15 2 -5 1 12 -11 -13 4 -11 -9 -5 -7 -2 -13 5 0
7901 0 10 9 -9 9 2 2 23 19 -6 -9 -8 3 5 2 -13 3 8 -4 -3 -8 -10 -5 -21 -2 -6 6 5 -4 -8 2 -15 1 -16 -15 -4 -8 8 4 -4 -18 -4
7942 -4 4 1 6 1 -9 7 -2 -3 -6 -15 -1 3 8 -7 6 20 -8 3 -11 -3 -10 -20 -3 -20 -5 -2 3 -14 -8 0 7 -6 -14 -4 -18 -18 1 -8 -2 -5 2 10 3
7985 3 3 12 2 -7 1 8 2 -7 2 7 15 11 -1 -8 2 2 -7 10 -11 11 -19 0 3 -14 7 -6 -9 -14 4 -4 1 -2 -10 -14 -2 -2 19 -3 6 -1 3 20 4 31
8029 31 27 12 7 2 4 1 10 -12 6 -2 5 -3 4 11 13 -5 11 -11 2 4 -10 -6 -5 -2 -10 -5 -20 -16 -23 -6 15 -7 4 -1 -3 -11 -2 -11 -8 10 -1 -7 -2 -6 -17
8074 -17 10 15 -5 11 -2 13 20 -1 -13 -10 13 1 7 0 1 -14 -5 -5 6 8 -13 -3 -7 -16 7 6 2 4 -2 -29 0 -7 -4 0 0 0 7 4 -1 16 15 -8
8116 -8 4 -2 -14 1 -10 -4 20 5 -2 -7 -9 1 8 14 9 11 9 -20 7 3 6 2 -4 -7 -11 -14 8 7 -10 -22 -13 -17 -11 -12 3 -6 -4 23 -15 10 21 12 -6
8159 -6 5 14 18 21 5 2 6 -2 14 5 -6 -5 9 -8 -6 -12 1 16 -25 -2 -10 4 -7 1 13 -16 -6 -1 -4 9 6 0
8191@
$$ Imaginary data points
##PAGE= N=2
##DATA TABLE= (X++(I..I)), XYDATA
0 0 0 0 0 0 0 0 0 0 -8 8 -8 8 -16 16 -24 31 -32 40 -54 64 -80 90 -109 128 -152 176 -206 238 -272 314 -360
31 -360 411 -466 528 -597 672 -757 848 -949 1056 -1176 1309 -1453 1609 -1780 1965 -2169
47 -2169 2393 -2637 2907 -3199 3524 -3884 4285 -4734 5238 -5808 6463 -7220 8114 -9177
61 -9177 10474 -12093 14183 -16993 20989 -27157 37986 -62519 232246 -136399 -240857 344922
73 344922 -342029 -138091 438903 -222474 -245233 391405 -182120 -128305 440471 -202451
83 -202451 -305692 351523 -131206 -173033 408852 -153139 -314069 349473 -62148 -207548
93 -207548 359560 -118619 -329193 333427 -3287 -233394 315389 -75265 -331613 314191
103 314191 44690 -258861 268143 -32399 -327019 291749 85697 -278513 222817 10881
113 10881 -316949 263762 118187 -292518 179640 53590 -301749 230658 143381 -299140
123 -299140 138956 93806 -282540 192482 161806 -297055 101253 129392 -260120 151014
133 151014 174082 -286517 66995 158679 -235797 108447 181388 -268673 36249 181012
143 181012 -210752 66879 184778 -245558 9065 196523 -186145 27881 185401 -219086
153 -219086 -14810 206019 -162695 -7656 184321 -190712 -35929 210180 -140492 -39310
163 -39310 181993 -161254 -54793 209383 -119129 -66753 178393 -131355 -71769 203892
173 203892 -98055 -89591 172992 -101573 -86804 193853 -76719 -107482 165076 -72593 -99351
184 -99351 179706 -55396 -120025 154391 -45376 -108849 162458 -34498 -127547 141178 -20710
195 -20710 -115162 143175 -14722 -130538 126113 801 -118373 123178 3271 -129938
205 -129938 110180 19059 -119050 103637 19374 -126849 94069 34219 -117771 85078
215 85078 33494 -122025 78183 46649 -114850 67845 45704 -115927 62686 56581 -110340
226 -110340 51845 55944 -108768 47549 64362 -104168 36869 64052 -100385 32845 69911
237 69911 -96165 22883 69722 -90761 18895 73144 -86554 10036 72814 -80095 6088
248 6088 74101 -75642 -1408 73379 -68750 -5110 72974 -64123 -11118 71825 -57345
259 -57345 -14493 70245 -52686 -19065 68696 -46405 -21993 66386 -41872 -25365 64507
270 64507 -36263 -27803 61839 -31955 -30216 59714 -27022 -32111 56886 -22988 -33734 54474
282 54474 -18695 -35108 51517 -14930 -36047 48813 -11177 -36775 45698 -7742 -37077 42708
294 42708 -4505 -37145 39464 -1511 -36793 36251 1207 -36185 32960 3662 -35211 29656
306 29656 5840 -33988 26417 7714 -32560 23246 9252 -30887 20232 10513 -29148 17321
318 17321 11485 -27243 14649 12192 -25336 12166 12672 -23378 9897 12895 -21448 7863 12957
331 12957 -19512 6013 12800 -17678 4409 12506 -15816 2987 12046 -14059 1775 11479 -12326
344 -12326 713 10747 -10643 -100 9914 -9032 -803 8927 -7463 -1252 7867 -5978 -1551
357 -1551 6662 -4600 -1653 5427 -3327 -1584 4129 -2217 -1368 2814 -1255 -982 1479 -391 -438 141
373 141 280 241 -1132 782 1050 -2342 1097 1925 -3434 1244 2841 -4443 1222 3821 -5326 1066 4841
390 4841 -6114 788 5920 -6802 338 7013 -7382 -220 8110 -7848 -891 9211 -8191 -1667
404 -1667 10285 -8405 -2530 11344 -8490 -3512 12372 -8456 -4590 13310 -8274 -5699 14178
417 14178 -7980 -6897 14962 -7523 -8123 15671 -6937 -9375 16243 -6248 -10643 16720 -5411
430 -5411 -11899 17077 -4447 -13133 17280 -3406 -14342 17375 -2266 -15533 17356 -1053 -16635
443 -16635 17253 246 -17741 16982 1582 -18781 16627 2985 -19769 16150 4451 -20655
455 -20655 15561 5882 -21523 14848 7448 -22228 14047 8924 -22939 13100 10536 -23428 12061
468 12061 11986 -23908 10890 13582 -24083 9598 14940 -24285 8274 16495 -24159 6744 17699
481 17699 -24042 5343 19165 -23678 3594 20147 -23201 2133 21449 -22593 257 22226
493 22226 -21846 -1166 23323 -21114 -3154 23946 -20044 -4500 24843 -19266 -6574 25337
505 25337 -17923 -7856 25968 -17098 -9944 26367 -15487 -11163 26702 -14668 -13193 27053 -12737
518 -12737 -14357 27015 -11887 -16284 27305 -9650 -17404 26753 -8761 -19066 26969 -6310 -20172
531 -20172 25886 -5355 -21448 26016 -2805 -22574 24440 -1746 -23381 24453 769 -24500
543 -24500 22393 1920 -24713 22360 4252 -25911 19964 5553 -25561 19852 7536 -26879
555 -26879 17280 9046 -25981 17044 10596 -27369 14466 12396 -26018 14029 13406 -27518 11596
568 11596 15534 -25766 10821 15988 -27203 8646 18447 -25187 7419 18305 -26407 5617 20987
581 20987 -24230 3835 20290 -25037 2507 23083 -22830 151 21883 -23070 -686 24585
593 24585 -20958 -3546 23007 -20510 -3779 25453 -18724 -7051 23647 -17543 -6715 25668
605 25668 -16198 -10251 23866 -14292 -9451 25347 -13503 -13074 23733 -10945 -11943 24567 -10773
618 -10773 -15474 23359 -7641 -14202 23471 -8049 -17497 22781 -4432 -16316 22046 -5233 -19150
631 -19150 21900 -1344 -18220 20349 -2353 -20367 20693 1631 -19789 18354 560 -21122
643 -21122 19046 4424 -20966 16035 3520 -21407 16968 7007 -21632 13467 6382 -21142
655 -21142 14503 9267 -21764 10755 8993 -20405 11783 11191 -21404 8035 11335 -19366 8933
668 8933 12718 -20667 5435 13348 -18112 6071 13900 -19606 3013 15017 -16815 3270 14839
681 14839 -18304 779 16366 -15425 537 15552 -16764 -1309 17363 -13990 -2030 16084
693 16084 -14971 -3257 17984 -12400 -4460 16341 -12929 -5099 18182 -10665 -6689 16301 -10648
706 -10648 -6757 17876 -8792 -8604 15926 -8236 -8254 17151 -6815 -10217 15244 -5771 -9468 16033
720 16033 -4795 -11414 14324 -3377 -10492 14653 -2866 -12274 13246 -1202 -11263 13154 -1032
733 -1032 -12833 12094 775 -11847 11617 690 -13089 10895 2526 -12269 10086 2330 -13147
746 -13147 9610 4073 -12500 8510 3843 -13011 8217 5472 -12489 6906 5219 -12589 6728
759 6728 6619 -12217 5283 6448 -11951 5102 7542 -11684 3594 7410 -11058 3442 8204
772 8204 -10839 2009 8124 -10008 1837 8597 -9814 543 8590 -8826 350 8793 -8655
785 -8655 -757 8843 -7648 -979 8779 -7485 -1858 8888 -6506 -2133 8680 -6332 -2802 8802
799 8802 -5421 -3115 8449 -5201 -3635 8563 -4387 -3983 8155 -4099 -4328 8185 -3348
812 -3348 -4663 7712 -3009 -4865 7661 -2346 -5199 7138 -1929 -5267 6981 -1342 -5526 6431
826 6431 -899 -5487 6192 -386 -5680 5645 76 -5547 5333 467 -5617 4795 894 -5444
840 -5444 4436 1178 -5468 3966 1562 -5255 3570 1774 -5209 3145 2068 -4984 2788 2215 -4900
855 -4900 2411 2458 -4695 2084 2561 -4555 1790 2761 -4339 1453 2827 -4172 1186 2965 -3939 852
871 852 3008 -3713 623 3057 -3487 319 3059 -3223 119 3050 -2971 -135 2998 -2674 -300
886 -300 2935 -2428 -542 2817 -2134 -676 2721 -1893 -840 2585 -1634 -947 2449 -1444 -1035 2311
902 2311 -1205 -1096 2142 -1026 -1149 2011 -815 -1173 1858 -664 -1172 1718 -514 -1165 1572 -392
918 -392 -1121 1455 -287 -1099 1310 -175 -1071 1213 -96 -1017 1043 -17 -949 919 44 -889 791
935 791 76 -800 666 119 -712 541 141 -613 416 160 -526 301 137 -419 231 125 -332 126 92 -199
955 -199 81 45 -87 20 15 30 11 -62 114 -30 -117 209 -45 -204 270 -18 -272 339 -4 -361 384 18 -449
978 -449 433 62 -563 470 93 -630 503 149 -724 522 225 -789 542 289 -894 547 364 -970
996 -970 527 468 -1024 514 558 -1098 490 654 -1130 479 751 -1191 405 848 -1213 365 955
1013 955 -1272 295 1032 -1286 220 1131 -1315 127 1220 -1295 43 1323 -1321 -91 1398 -1303
1029 -1303 -173 1491 -1290 -292 1576 -1254 -377 1647 -1231 -506 1725 -1178 -606 1770 -1142 -726
1045 -726 1853 -1037 -848 1904 -985 -982 1942 -873 -1082 1967 -777 -1221 2003 -647 -1318 1982 -562
1062 -562 -1439 1976 -439 -1541 1932 -314 -1656 1922 -173 -1782 1841 -61 -1853 1829 116
1077 116 -1952 1749 232 -1995 1691 374 -2085 1577 544 -2115 1536 677 -2182 1423 827 -2203
1093 -2203 1338 961 -2283 1215 1115 -2250 1114 1234 -2324 973 1378 -2269 870 1480 -2311 732
1109 732 1629 -2252 558 1694 -2230 397 1854 -2157 233 1886 -2122 106 2018 -2044 -101
1124 -101 2059 -1945 -202 2169 -1852 -414 2160 -1740 -492 2269 -1634 -688 2258 -1484 -766 2324
1140 2324 -1412 -959 2311 -1246 -1045 2334 -1198 -1208 2349 -1005 -1293 2318 -958 -1471 2315 -752
1156 -752 -1500 2279 -700 -1695 2259 -492 -1758 2170 -423 -1865 2167 -216 -1924 2057 -130 -2000
1172 -2000 2014 89 -2052 1861 181 -2085 1868 404 -2138 1636 482 -2145 1657 674 -2209
1187 -2209 1413 760 -2133 1365 925 -2211 1158 985 -2140 1132 1129 -2211 919 1237 -2128 880 1307
1204 1307 -2173 662 1435 -2044 595 1488 -2084 420 1630 -1958 351 1650 -1992 201 1775
1219 1775 -1831 85 1766 -1817 -54 1893 -1662 -194 1844 -1635 -298 1969 -1449 -476 1877
1234 1877 -1401 -528 1991 -1264 -726 1884 -1140 -774 1945 -1029 -961 1863 -892 -991 1876 -789 -1168
1251 -1168 1784 -638 -1146 1807 -563 -1320 1718 -382 -1285 1713 -347 -1440 1618 -161 -1401 1571
1267 1571 -114 -1520 1542 77 -1479 1457 96 -1598 1394 296 -1566 1291 294 -1617 1246
1282 1246 474 -1592 1078 485 -1616 1046 634 -1617 876 672 -1584 842 805 -1572 690 816 -1494
1299 -1494 643 927 -1488 465 961 -1410 435 1035 -1394 286 1089 -1294 243 1116 -1290 112
1315 112 1160 -1193 73 1173 -1191 -55 1203 -1072 -94 1192 -1062 -184 1229 -956 -266 1211
1331 1211 -943 -354 1246 -830 -412 1200 -811 -468 1228 -698 -534 1166 -635 -586 1193 -520
1347 -520 -661 1123 -451 -677 1129 -369 -738 1060 -279 -728 1060 -210 -810 958 -126 -787 926
1364 926 -72 -839 859 11 -840 828 58 -864 767 120 -841 719 154 -902 647 224 -860 604
1382 604 255 -875 558 322 -859 499 345 -850 471 407 -801 411 422 -796 358 477 -785
1399 -785 308 479 -738 261 529 -703 196 527 -668 158 549 -651 88 537 -599 44 561 -570
1417 -570 -8 547 -516 -56 540 -499 -106 543 -465 -129 538 -414 -161 539 -363 -173 538 -337 -211
1436 -211 536 -290 -220 516 -267 -230 502 -216 -239 498 -200 -262 474 -151 -285 430 -135 -287 425 -102 -308
1457 -308 385 -85 -301 360 -72 -319 329 -20 -322 327 -7 -326 283 31 -307 257 31 -299 218 68
1477 68 -278 203 68 -289 200 96 -247 161 124 -248 153 130 -233 133 112 -223 121 141 -207 97 118 -191
1499 -191 80 123 -178 52 118 -174 29 109 -152 31 103 -142 18 114 -137 -2 104 -112 -9 109 -94 -7
1521 -7 84 -93 -6 78 -63 -7 80 -64 -1 77 -30 1 64 -20 -4 60 -16 12 42 -10 8 26 -10 -32 16 -36 -4 2 -17
1550 -17 2 -8 -7 -10 -22 0 12 -19 -18 30 -32 -19 24 -32 -14 49 -19 7 52 -31 1 70 -47 0 73 -33 -17 66 -41 -27
1580 -27 82 -47 -30 83 -25 -41 112 -35 -52 107 -43 -77 100 -27 -74 87 -41 -84 112 -22 -95 113 -55
1603 -55 -104 124 -20 -107 132 -4 -107 128 4 -113 132 16 -124 139 34 -140 132 48 -149 134 61 -157
1625 -157 131 56 -171 109 68 -171 107 73 -173 89 83 -201 70 86 -190 92 106 -199 52 111 -205 39 147
1648 147 -206 53 160 -190 33 169 -174 38 170 -172 28 192 -146 7 200 -151 -12 187 -170 -29
1668 -29 210 -153 -47 207 -154 -66 211 -155 -96 207 -132 -86 208 -140 -119 220 -121 -102 227 -101 -129 218
1690 218 -80 -142 226 -84 -154 227 -64 -172 229 -46 -167 246 -7 -164 227 -23 -167 216 6 -204 208
1711 208 11 -184 203 45 -203 173 43 -223 157 64 -234 156 67 -239 157 85 -240 134 92 -224 132
1732 132 112 -245 133 130 -228 117 153 -229 107 146 -217 76 181 -224 86 158 -217 56 180 -196 55 185
1754 185 -181 24 225 -187 23 211 -202 -25 198 -171 -28 204 -177 -27 210 -162 -59 211 -157 -71
1774 -71 216 -148 -85 211 -122 -87 228 -106 -97 225 -108 -97 232 -78 -104 217 -70 -110 237 -56 -141 213 -51
1797 -51 -143 196 -22 -157 209 -33 -149 196 -5 -188 167 -11 -184 155 1 -191 162 34 -201 134 49
1818 49 -200 112 40 -186 126 52 -174 121 97 -169 123 95 -176 108 116 -157 114 121 -183 71 120 -170 84
1841 84 135 -157 41 123 -177 52 136 -167 27 137 -154 -6 136 -172 12 156 -146 2 146 -153 -1
1862 -1 145 -137 -31 141 -137 -22 169 -103 -39 174 -98 -36 158 -77 -45 165 -61 -49 171 -67 -64 155 -48
1885 -48 -87 156 -45 -95 131 -37 -95 138 -47 -114 117 -9 -116 108 -22 -95 124 -1 -104 110 -14 -107
1907 -107 113 6 -114 98 14 -114 108 14 -108 82 9 -117 100 58 -99 94 59 -95 94 56 -91 57
1929 57 51 -97 56 53 -121 31 63 -111 36 61 -105 4 53 -106 7 73 -97 22 81 -103 -1 86 -82 -13
1953 -13 81 -102 -13 104 -69 -1 83 -66 0 90 -57 -12 102 -51 -5 104 -52 -26 94 -38 -19 90 -29 -47
1977 -47 92 -42 -48 63 -43 -58 41 -25 -67 47 -26 -63 51 -25 -44 68 -20 -57 69 -6 -47 58 -2 -29 68 -8
2003 -8 -46 58 15 -22 49 23 -30 30 28 -42 50 23 -51 50 18 -61 37 16 -48 32 28 -63 20 -1 -55 7 -1 -54 -2 13 -54
2034 -54 -2 22 -59 6 30 -36 7 17 -37 4 29 -23 19 42 -12 24 42 -26 13 36 -34 -7 28 -20 7 15 -30 -9 26 -16 -2
2065 -2 45 -10 -8 23 -19 -2 25 -21 -9 16 -14 -28 23 -14 -19 19 -13 -4 16 9 -23 21 13 -7 12 8 9 39 7 -9 38 1 -6 12 12
2100 12 -18 5 9 -8 25 -7 -4 -20 -1 -19 1 0 -19 1 -15 -14 -22 5 -27 2 1 -22 0 -3 -16 4 -4 -4 11 13 12 7 4 17 6 0 5 11
2138 11 19 9 15 -5 14 14 3 1 6 -8 -11 -8 -14 -2 1 -7 -18 -11 -14 -6 -8 -24 -8 -1 -9 -10 -1 -19 9 0 -9 -5 15 -16 0 10 -4 11 11 -2 18
2179 18 37 -6 16 16 7 15 12 4 17 15 -6 31 25 6 4 25 -6 -13 6 -24 -21 2 -26 -16 10 -17 4 8 -28 14 16 6 -3 6 4 3 32 -9
2217 -9 2 15 2 8 24 -14 -3 30 -3 18 33 3 4 15 2 -4 23 3 -19 15 5 -6 10 12 -36 10 -8 -20 2 -27 -24 20 -10
2250 -10 -29 12 16 -35 9 3 -20 27 2 -3 18 19 1 30 24 -8 20 9 -8 10 25 -27 18 31 -22 17 6 -3 4 19 -11 13 21 -14
2284 -14 -1 5 -22 -8 -5 -18 -5 -1 -15 9 -3 -10 -4 6 -14 1 2 -17 5 -6 -18 1 41 4 -3 24 6 19 32 -7 -9 22 -1 6 16
2319 16 -17 -6 28 -6 -9 6 -5 -13 19 -18 -31 12 -20 -19 9 -12 -11 29 -14 -31 19 -10 -22 9 -4 -9 3 -6 -12 9 9 -2 20 10
2353 10 -14 30 13 -19 22 8 7 19 -13 -3 16 4 -21 16 4 -31 11 -21 -22 -17 0 -24 -1 -1 -24 -3 2 -31 5 -3 -18 -4 15
2386 15 -25 4 15 -14 17 20 -13 13 31 -12 12 25 0 15 21 9 18 28 -21 -6 14 -6 10 15 -22 -17 7 -25 -25 2 -17 -19 8 -31
2420 -31 -14 -2 0 -21 18 -12 -18 9 -1 -15 9 10 -9 35 -14 11 17 -9 5 16 -6 0 19 2 -9 3 11 14 13 -3 -16 8 -9 -19
2454 -19 14 -8 -8 -5 -2 -19 -4 14 -23 -5 -9 -23 4 -1 -28 18 16 -4 -12 -1 -16 8 25 9 12 20 -8 7 33 1 21 17 8 21 9 -3
2490 -3 9 -3 1 -7 -3 1 -2 -3 -12 -15 1 -17 -11 -8 -17 -11 6 -31 -8 -13 -5 -2 7 4 -8 4 -25 -1 0 6 -3 11 -1 -4 23 -3 -5 22 10 15 18 14 17 2
2534 2 -12 -23 12 -1 -10 9 1 -20 0 -25 -25 0 5 -14 2 -2 -28 10 -13 -23 8 -10 -16 17 -2 -14 18 0 -14 -9 -1 -9 11 25 16 18
2570 18 9 -13 16 20 14 6 -1 17 -2 11 -2 4 -14 -4 5 -14 -16 -5 -3 -15 -13 -14 -18 -7 2 4 0 5 -20 -3 6 8 -1 11 9 1 17 16 -3 15 -1
2611 -1 12 21 18 4 4 18 4 18 3 -12 8 7 -2 2 -1 2 -11 -17 -2 -13 -12 -19 -13 -16 -16 -4 -1 -3 -15 -2 -17 -6 -6 -15 -5 -9 0 16 -11 10 12
2652 12 7 18 -1 8 4 21 2 7 9 -6 15 7 -3 0 -2 5 6 -7 9 4 5 -7 -18 -3 -17 -29 -11 -18 -10 6 -11 -2 -4 -5 -12 -9 7 -3 -4 10
2692 10 32 21 4 6 14 17 13 21 6 -3 12 14 0 15 -2 -3 5 -6 -13 -9 3 1 -2 -3 -7 1 -4 -20 -4 -16 -10 -7 -11 -13 -21 -16 -22 -11 -7 -8 -9 4 2 11 8
2737 8 1 8 25 20 13 8 22 28 5 -16 14 13 11 1 1 -9 4 -2 -14 0 1 -8 -21 -15 -17 -9 -17 -22 4 0 -18 1 -16 -11 -16 -10 -7 2 8 -16 0 -6 12
2780 12 2 9 9 18 5 9 2 15 6 10 8 4 17 15 -12 5 0 -21 -3 5 -3 -21 2 -7 -8 -13 -3 -8 -30 -23 -1 15 -4 -13 6 -10 -6 -9 -10 -4 -1 -3 -1
2823 -1 8 14 9 13 9 0 -6 13 12 21 6 28 1 -18 -4 1 -3 5 -6 13 12 -5 0 1 6 -9 -3 -6 -30 -2 -15 -9 -5 -6 1 -4 -12 -12 5 -1 4 4 9 -3 -4 6
2869 6 10 0 -1 4 -5 16 11 -9 -8 17 4 10 8 2 7 -1 -9 0 -9 -1 -13 11 2 -10 -19 -2 -18 -25 2 -30 -9 -1 -9 -23 1 2 7 -4 5 -5 8 20
2911 20 16 8 34 0 20 5 13 6 22 4 10 21 7 -10 -2 -9 -11 -15 -4 -13 -16 -12 -22 -19 -15 -13 -18 -17 -13 -4 -13 -7 -23 1 -3 -6 7 -3 16 0 -13 7
2953 7 8 19 16 4 3 -5 1 22 6 13 11 -7 7 6 15 7 2 0 -1 -2 -8 0 -23 14 -27 -6 1 -6 -9 -7 -7 5 -2 -15 6 13 2 -10 -7 -13 -3 13 2
2996 2 -1 3 0 6 7 2 14 16 24 18 16 4 7 -2 20 17 8 -10 11 -10 1 -13 -25 -5 -11 -12 -15 -14 -30 -5 -32 -14 0 1 -17 -12 -9 -4 -9 5 13 19 24 -3
3040 -3 -5 -4 8 -4 -3 -1 16 29 21 20 3 17 -1 16 8 3 18 5 13 4 -3 -10 -22 -1 4 -25 -25 -18 -5 -12 -16 1 -18 -2 -7 9 -3 1 6 8 14 2
3082 2 12 8 6 10 8 2 2 12 -2 10 21 12 -4 14 4 7 16 3 -6 8 0 -4 -6 4 0 -15 -13 -15 0 -11 0 1 -4 -14 -25 8 -16 -9 4 3 14
3123 14 18 14 17 -3 -6 11 4 15 8 19 11 11 16 13 0 7 -6 1 -10 14 -9 7 -11 -4 -5 -20 -4 -5 4 -10 5 5 3 1 0 -12 -8 14 -3 16 -13
3164 -13 1 -13 -12 3 -9 8 14 14 20 3 2 20 4 22 27 9 22 12 14 3 -4 0 0 0 -26 -13 0 -10 -24 -9 -21 -4 -3 3 -1 -11 -13 -19
3202 -19 -11 -10 -7 -5 -10 9 -10 3 13 1 9 -1 -6 -2 9 17 -3 2 24 -4 19 12 14 9 19 -8 -6 26 3 6 -8 -2 -13 -13 -6 -17 -21 -19 -14 -15 -11 -22
3244 -22 5 -5 -10 -21 -12 10 1 19 6 12 4 17 -2 3 18 2 6 12 27 0 6 17 10 15 13 17 8 6 2 10 5 7 2 6 -18 -2 -2 -12 -7 3 -14 -14
3286 -14 -15 -13 -16 6 -7 -30 3 -6 12 -1 2 0 2 2 20 9 12 30 14 18 12 27 1 8 12 5 -2 -2 3 -3 -5 -1 -5 6 -16 -3 -18 -8 -24 -9 -14
3327 -14 -22 -3 -5 -11 -5 -19 -20 -10 5 4 11 15 5 6 24 24 33 23 2 20 13 20 11 35 10 7 4 3 7 3 -2 4 12 -9 -18 -6 -8 -13 -4 -15 -19 -18 -6 4
3371 4 0 -20 -9 -17 -14 -12 -23 -4 -13 -3 -8 12 6 3 -7 -8 5 5 10 14 34 1 13 16 16 21 24 3 2 7 12 5 -2 -8 -5 -5 1 5 -23 -14 -8 3 -12 -3 -16
3416 -16 -19 -13 -1 -5 -8 -2 6 -6 -15 0 4 -2 4 3 20 5 0 13 -7 17 27 16 17 5 1 2 4 -6 -15 18 1 8 -14 -6 -1 2 -7 -19 1 -15 -19 2
3458 2 -25 -2 -12 -6 -24 -13 6 3 3 -14 -9 14 -3 10 -4 -1 13 -8 31 13 13 9 20 1 3 19 8 3 3 1 8 4 -3 2 7 13 3 -10 0
3497 0 -22 -25 -1 -20 8 -10 4 -15 -11 0 2 -12 11 8 3 2 9 2 12 11 5 19 16 12 12 9 14 16 12 13 -7 2 11 -17 6 4 19 -9 12 -18 7
3538 7 -6 -14 -5 -14 3 -24 -13 -10 -9 -2 7 -7 -3 -9 -7 -5 16 -8 18 12 18 17 11 13 4 13 20 23 8 15 29 10 14 14 21 4 6 6 -14 8 8 -3 5 -2 6 -4
3584 -4 -11 -2 -24 -4 3 -9 6 -11 2 -19 -14 2 -8 -5 -4 8 0 20 19 10 6 20 -9 12 12 18 13 11 7 29 16 -4 -2 9 -1 3 -1 -12 -8 -11 -5
3625 -5 -14 1 8 -11 3 -6 -1 -1 -11 -22 -4 10 0 -18 -6 8 6 21 22 28 -15 7 -9 1 7 4 -1 18 19 1 15 24 14 3 20 13 6 -4
3663 -4 -8 4 1 -6 -2 8 -20 -17 -15 2 -1 -21 -6 -17 -15 -7 18 -6 -4 -2 -1 2 17 -2 15 -8 13 11 21 5 5 2 15 9 -6 5 15 13 15 12 -5
3704 -5 23 -5 -2 3 -16 7 -3 5 -9 -4 -8 -12 -18 -10 1 -8 -2 -11 -13 -10 -9 5 -5 3 14 12 21 -3 16 20 13 34 9 10 14 3 14 13 7 7 -8 8 14
3747 14 11 5 11 -4 14 6 -9 6 -7 -2 5 2 5 -2 -16 -11 -19 -12 -1 -5 -1 -11 -4 1 3 -11 0 8 11 23 1 19 -4 34 4 10 14 20 18 7 16 -4
3789 -4 22 11 4 5 7 -6 -4 9 2 9 -13 2 -4 -5 -6 -15 -4 -20 1 -9 -11 3 -3 -10 7 -2 -18 9 1 16 -3 11 1 -1 11 23 28 7 19
3828 19 11 15 15 12 4 8 -3 -6 -17 -9 -17 -8 -7 14 -4 -11 -27 -9 -14 -16 -14 -15 -28 -18 -6 18 2 4 12 -4 15 10 2 6 22 9 19 9 8 6 19 24
3870 24 -3 15 13 -7 5 -7 7 7 -5 4 -1 -11 -4 -9 4 -9 -15 -9 -20 -32 -16 -7 -6 -15 -10 4 -11 12 -8 21 -17 6 -4 2 9 34 0
3907 0 -2 20 11 17 12 8 9 4 9 -1 17 -1 6 1 -1 -14 -3 8 1 3 3 -7 -6 -11 -19 -23 -13 -2 -12 -14 -13 -14 -13 -1 -14 -2 -10 -20 -3 8 13 3 20
3950 20 20 12 2 13 21 -6 0 0 0 5 13 -14 16 -4 -11 -8 -15 -5 -4 0 -1 -15 2 -7 8 -12 -16 -3 -18 -12 -12 -17 -8 -3 -7 -11 5 -2 9 -20 28 1
3992 1 0 2 7 21 13 25 7 11 13 15 8 7 4 -2 8 1 -3 -3 -5 -1 6 -3 -9 -20 -16 0 -8 -5 -8 11 -3 -14 -9 -21 8 -25 -24 10 1 -5 3 1 1 2 -4 -15 -4
4039 -4 18 -8 4 -5 7 17 9 16 -1 -5 -9 16 7 2 7 10 10 -15 -7 -8 -1 -3 -5 -25 -10 -9 -2 -13 16 3 -1 -17 1 -12 3 5 -8 5 33 12
4079 12 -5 -1 18 11 12 -1 -7 28 15 21 15 0 -1 5 24 5 12 11 -10 -15 -6 -13 -17 -6 -2 -5 5 -20 -11 -12 -9 -4 -7 -10 -22 -19 12 6 11 11 19 0 4 9 4
4124 4 4 20 10 9 2 9 11 4 8 4 -2 -1 16 -8 1 2 -3 -5 -6 2 0 -10 -3 -12 -13 -19 -11 -7 -16 -12 -7 -19 7 -14 -23 1 -4 1 6 5 -12 8 11 15 13 24 8 -8
4172 -8 1 28 13 2 -12 14 -8 -3 -8 1 7 13 -15 -9 3 -27 -11 -1 1 -18 -21 -11 -19 -4 -20 -14 -13 -5 -6 -8 -5 8 25 10 12 15 16 13 2 10 30
4213 30 23 16 11 9 32 19 18 20 3 17 8 18 -11 6 9 -16 -8 -20 -7 -7 -10 -3 -26 0 -7 -16 -7 -16 -2 -8 6 12 -3 -6 -11 2 25 3 -1 -2 22
4254 22 11 25 11 19 19 18 3 12 1 12 8 -11 -2 -1 7 -1 -1 -20 -9 0 -12 -8 -15 -17 -11 -12 -8 -11 -5 5 -4 -11 14 -15 10 -6 5 7 -6 12 1
4295 1 18 0 9 6 14 12 9 0 5 17 5 9 24 0 3 3 2 -14 2 -11 -12 -12 -6 6 -17 2 -14 -15 -13 3 -24 -20 -10 0 -4 7 -7 -6 -1 11 -4
4336 -4 3 17 3 1 6 12 13 0 16 0 0 29 -2 5 10 19 16 -6 -12 -9 -9 1 -2 12 0 -6 -1 -12 -10 -5 -4 -19 -2 -16 -30 0 -10 -1 -17 -4 4
4377 4 14 4 -1 5 -1 30 16 18 3 18 12 34 -5 1 5 0 17 2 6 2 0 4 8 -9 9 -5 -13 -14 -11 -4 -22 -5 -17 6 -23 -9 -7 -19 -6 -17
4417 -17 -8 -4 10 15 6 20 -1 -1 3 0 10 33 28 25 13 17 19 19 22 7 8 17 19 -7 -6 11 6 -8 0 13 -4 -4 -7 -11 -2 4 5 -8 -4 -3 4 -6 -20 -1
4461 -1 8 9 -2 11 18 0 8 18 1 22 19 11 6 12 3 18 2 21 22 20 -10 -3 14 -6 -4 -22 1 -3 2 -23 -11 -12 -5 13 -24 -15 -6 -7 -4 -3 12 5
4503 5 -10 18 -5 5 27 6 0 4 4 6 23 -21 0 7 5 2 19 7 4 8 2 -2 5 0 -2 10 0 -16 -11 -15 -10 -3 -6 -9 -12 -11 -7 0 -23 -35 -8 9 -3
4546 -3 9 1 -5 10 1 16 5 2 -15 16 7 12 -3 23 29 7 9 0 15 10 9 18 11 -2 -6 -3 -13 -4 2 -13 -1 -2 -13 -1 -10 -20 -15 12 -1 -15 -11
4587 -11 -10 17 6 9 -13 4 6 21 16 15 -4 1 9 9 18 30 13 12 28 13 9 10 24 0 -3 2 3 12 5 0 4 0 -6 -8 -10 -3 -14 -15 -13 4 5 -10 -4 9
4631 9 9 -3 -14 -11 4 19 -2 12 13 19 -5 11 22 9 23 14 4 27 26 12 20 10 5 19 -7 -3 -12 -7 9 -26 10 -2 -2 7 1 3 -9 -11 6
4670 6 5 -8 -9 -1 2 -5 -4 11 10 -9 2 8 4 15 -12 15 14 17 14 -7 1 22 13 17 7 4 14 -3 -4 2 6 0 -3 0 -5 -15 -28 0 -10 -13 -5 -13 -10 -6 0
4715 0 2 -7 1 -3 -15 -1 9 -10 13 9 15 15 0 18 -7 7 15 -7 -5 3 38 10 11 37 16 2 -3 23 3 4 0 4 -16 -7 2 -15 -15 -18 5 -24
4755 -24 2 -13 0 -8 23 -6 0 -1 12 5 -6 7 3 13 -2 -2 -4 8 21 0 -4 23 6 9 11 4 20 10 5 -7 1 -6 -2 1 6 -9 -9 -23 -19 -2
4795 -2 0 -18 -10 -7 -4 -11 -7 -21 -12 -2 -4 5 -7 19 -2 6 6 19 3 25 9 18 8 15 13 12 7 5 -7 7 11 -8 2 6 -8 4 -2 1 25 2 -8
4836 -8 -11 3 -6 0 -3 11 -5 1 -7 -4 -1 -21 2 8 -10 -2 15 4 4 15 15 11 11 17 14 25 19 1 14 5 16 8 12 8 -5 -4 -2 -9 3 8 -8 1 -16 -9
4880 -9 -15 0 -17 8 -15 -14 -11 1 -10 -9 -1 -10 7 -1 2 0 7 18 -14 12 2 6 14 5 20 20 5 16 -1 12 19 -11 32 0 9 15 -7 -8 -16 -19 -3
4921 -3 -18 -15 -8 -29 -24 -10 -3 -13 -19 5 3 -3 -7 6 12 2 -9 1 -1 9 17 5 -6 8 0 3 10 7 13 7 14 19 15 21 9 1 -2 -13 -12 13 1 1 2 4
4965 4 -27 -16 -3 -1 -5 -18 -16 0 -13 -6 -8 -17 -11 -4 7 4 25 -14 28 9 7 12 2 0 7 -3 16 -3 3 6 4 15 -1 0 -5 8 1 -11 10 5 3
5006 3 2 -6 7 -10 -23 -19 -2 3 -6 -3 -4 -14 -23 -9 -17 -11 9 5 11 19 5 7 14 5 -4 22 4 -1 26 28 4 30 16 10 2 8 -13 -5 16 8 -15 1 -24
5049 -24 -11 12 -12 -1 -19 -28 -21 0 -13 -22 -17 -6 -12 -18 -10 -17 -10 -7 -1 -26 -7 14 21 10 5 3 19 18 16 24 3 15 -5 22 12 10 4 -1 -3 -5 -14 3
5091 3 -5 -1 6 -8 -5 -3 -13 -24 -26 -8 -12 -12 -7 -9 -12 -13 6 -3 -7 11 -6 10 2 -2 -5 0 4 11 9 25 -2 7 7 10 7 15 10 16 -5 16 9 -13 5 -6 -20
5136 -20 -19 -14 -15 -5 4 -12 -1 -12 -3 -10 6 -10 -16 -5 -5 -5 5 -2 3 2 5 7 9 1 -3 13 -2 8 12 18 19 4 11 13 11 6 -2 13 0 6 -10 1 0 -17
5180 -17 -1 -3 -22 -10 -40 4 -1 -12 -3 -19 -21 -22 -24 -12 9 -1 -10 14 -15 -3 -2 20 18 7 5 1 -3 15 22 14 14 9 1 4 18 -3 8 0 -12 -6
5220 -6 3 -12 -16 -7 3 -22 2 -23 -7 4 -19 -17 -10 -8 -2 -23 5 -1 -17 -12 1 -21 3 2 4 6 -7 16 2 6 12 1 15 8 5 3 1 1 -2 2 -15
5261 -15 3 -11 -6 -6 -11 -15 -8 4 -2 10 -14 -20 -16 -16 -15 7 3 -17 -16 -3 -18 -17 -12 -14 0 1 14 13 -1 5 -1 10 9 -2 16 8 6 11 9 2 29 7 3
5304 3 -16 1 -9 -15 -6 -7 -13 -6 -4 -25 -7 -9 -8 -13 -23 -15 6 -2 5 3 12 7 -6 -9 -5 7 5 8 -1 -3 8 4 4 25 3 15 8 1 9 4 18 18 16 5 13 -10
5350 -10 -14 -7 -19 -18 -10 5 -29 -9 -2 -15 -5 -31 -15 4 -3 -13 -12 -16 6 -17 -3 4 12 -7 -2 -3 -7 19 3 -2 -3 18 -15 -2 10 23 -8 19
5388 19 2 6 -2 0 8 -6 3 2 -25 15 -14 6 -21 -16 -6 -19 -10 -30 -10 -22 -25 0 3 1 -13 -18 13 11 6 10 13 3 -11 3 3 14 8 10 10 12 6
5429 6 12 6 -6 2 -2 2 10 4 6 -6 -12 -15 -6 -19 -28 -11 -8 -30 -22 -22 -21 -3 -12 -16 -10 -17 -4 -11 -11 -3 15 -4 16 8 8 -1 -7 2 12 23 39 22 12 19 4
5474 4 5 0 6 9 -1 2 -4 -25 -8 -14 3 2 -12 -19 -4 8 -7 -10 -5 -19 -6 -8 -11 -11 5 -21 -18 -16 -20 9 2 16 -2 -16 16 7 5 12 18 13 15 6 20
5517 20 1 -7 5 3 10 -1 -2 0 -7 -11 -14 -6 -7 -19 5 -9 -10 -22 -1 3 -10 -1 -4 -4 -1 0 5 -3 8 3 4 1 7 -1 13 17 -13 23 9 2 22 22 6 8
5561 8 -4 10 15 -6 -16 0 -1 -3 0 -12 8 5 -12 -5 -20 -19 -39 -4 -22 1 -11 -15 -28 -2 -12 -9 6 -2 2 4 16 14 6 10 3 8 14 3 7 2 11
5602 11 -4 12 -7 8 -11 -3 0 -15 -3 -9 -18 -17 -13 -12 -14 -19 9 -5 -10 -4 -8 -12 -15 0 -3 -19 -9 1 -7 -10 20 -12 21 4 10 13 8 8 -9 9 -10
5643 -10 16 21 15 -22 2 -16 4 -8 3 6 4 0 -18 -16 -3 -3 -1 -8 -15 -10 -11 -16 -1 -18 2 5 -17 -10 -4 -6 4 4 10 -7 3 8 5 17 2 10 18 10
5685 10 6 15 7 5 -6 1 -8 7 -3 5 -10 -2 5 -14 -5 -4 -7 2 0 -4 -8 -8 -4 -9 -7 -17 -2 0 -2 3 -3 8 17 -1 15 9 -3 0 -1 14 17 5 13 25 4
5730 4 16 -8 3 -4 10 20 4 -2 -11 -3 -7 -10 -17 -13 -15 -10 -12 -11 -25 0 -12 -7 -6 4 -11 -13 -4 3 9 -2 2 2 0 5 2 20 18 -2 -3 1 12 10 13 0 10
5775 10 -3 4 11 2 -10 -9 -11 -10 -27 0 -7 -1 -11 -15 -18 -24 -26 -7 -18 -9 -17 4 -27 -23 -11 -15 -4 -2 -8 -11 9 7 -1 0 26 10 0 25 29 -2 12 -11
5817 -11 5 3 3 6 -1 12 24 -11 -5 -17 -13 -18 -15 -21 -10 5 -4 -23 -17 -18 -13 -13 -16 -11 -17 10 -2 2 14 -2 0 6 8 7 5 2 19 -2 9 6 1 0 -4 -1 20
5862 20 21 9 12 -2 5 7 -13 2 3 -12 -10 2 -22 -1 -4 -35 -10 -6 -22 5 1 -8 -10 -17 -3 -14 -1 13 -8 23 11 6 27 3 13 14 20 18
5900 18 21 16 2 26 22 12 5 6 3 -2 -13 0 -4 -2 2 -16 -6 -10 -2 -10 -11 -3 -5 -5 -18 -13 -14 -8 0 4 -8 3 -2 -9 8 15 13 12 7 10 10 20 8 -7 7
5945 7 8 17 21 6 11 10 5 -3 7 -24 -11 -12 -17 -19 -11 -12 -24 -9 -3 -12 -7 -6 -11 -11 -8 -13 -1 -13 0 -1 4 9 9 20 -4 -10 -6 0 1 8 -2 6 23 20 12 18 0
5992 0 14 -15 -2 10 15 -15 -6 -4 -15 -12 9 -13 -10 -3 -3 -22 -15 -8 -10 -9 5 -9 25 -9 1 -5 -12 2 7 8 3 -10 22 3 11 2 6 10 3 6 23 7
6034 7 7 20 9 10 -1 12 -1 -5 14 17 10 5 -14 -2 -7 -12 -15 -25 -26 -19 -22 -16 2 0 -16 5 -9 6 -14 5 18 12 23 21 4 4 1 14 3 6
6074 6 13 -4 7 18 8 8 -2 25 -6 -1 -5 -1 1 -18 -6 -7 11 -18 3 2 -6 -10 -15 -17 -3 -4 -8 -2 -15 -20 -25 13 9 -1 8 9 14 -3 19 10 34 21
6116 21 23 1 17 6 31 -1 6 22 22 6 0 3 2 -6 -11 -2 5 0 -1 -3 -4 2 -12 -7 -13 -2 -17 -13 -3 10 3 -11 -3 -13 -19 -2 5 -9 0 13 -2 10
6158 10 21 25 11 15 16 6 -11 10 11 2 20 13 -9 22 -15 -9 -11 -21 -10 -10 -8 -3 0 -15 -15 -7 1 0 -10 12 -7 7 -12 1 -5 -9 -9 -1 17 2
6198 2 25 0 2 11 1 15 15 24 15 10 17 -8 1 17 15 12 14 -5 -16 -4 -8 -1 -8 -2 -8 -33 -20 -34 -17 -13 8 -6 -15 -5 1 -1 1 0 -9 14 1 0 25
6241 25 9 0 14 17 12 4 16 23 15 11 -1 14 -1 12 19 -5 -3 -6 -2 -2 -7 -19 -1 -12 -8 -18 -11 -17 -21 -19 -20 -7 -21 -1 -4 -10 9 -7 -6 15 12 -6
6283 -6 19 8 9 14 17 16 9 -1 -2 11 5 7 13 12 2 19 -7 -3 -8 2 -1 3 -19 -14 -15 -7 -6 2 -21 -10 -4 -24 -12 5 -2 -5 -22 -2 -23 1 -3 -8 5
6326 5 16 15 25 10 2 11 22 12 2 14 2 7 8 -1 -1 -13 5 -6 5 12 2 -4 -17 -23 5 -3 -25 -8 -13 -10 -18 15 -11 -5 -30 -2 4 0 20
6365 20 -11 -3 -9 3 -5 24 0 3 4 5 23 10 0 6 24 23 16 23 -7 3 0 -9 2 6 10 -11 -2 -15 12 8 -16 -13 -9 -7 5 -6 0 -7 2 9 -2 -8
6407 -8 3 16 9 3 13 15 16 -7 -8 25 2 22 12 9 20 11 14 9 3 18 5 -4 19 -7 9 -14 -12 -10 -3 -16 -6 -9 -21 -7 -1 -12 -11 -3 -2 -10 -8
6448 -8 6 13 -10 -1 -12 5 -6 1 -10 -13 -3 1 13 12 -9 18 5 10 16 -4 9 20 -6 -1 -7 -3 -2 -11 -1 -9 1 -16 1 -11 -1 -20 -12 -10 -9
6487 -9 -19 -15 -30 1 -2 -11 -1 7 9 -3 25 1 3 17 -2 25 19 18 13 3 7 1 18 3 15 13 16 -2 1 -9 3 -10 5 -6 3 3 20 -3 -3
6526 -3 -4 -14 -12 -23 -2 -13 -13 -17 0 7 -1 -8 12 2 6 7 -9 15 12 -2 4 14 18 31 33 16 18 3 12 -3 3 8 23 -2 11 9 -4 -3 -15 -14 -15
6567 -15 -6 -4 -15 4 -10 7 -12 -21 -12 -1 2 0 2 1 2 8 8 11 3 -4 17 16 17 0 25 24 10 25 17 9 10 22 14 1 13 -13 12 2 -11 4 3
6608 3 -14 -8 -5 3 -1 0 -2 -17 5 15 -20 5 -6 -3 20 -4 21 1 10 2 7 5 7 23 18 16 34 18 15 20 -7 4 15 3 8 14 10 12 -3 -9 -14 5
6650 5 -12 -1 -20 -2 -13 -5 -11 -22 0 -13 -18 15 19 -13 11 -19 -5 7 1 -6 -7 15 6 1 14 -1 25 5 15 12 20 -2 10 10 1 3 30 7
6688 7 -13 -20 2 5 -3 -1 12 -1 -18 -9 -24 -15 -16 -31 0 -20 2 2 -5 -15 -10 -2 0 8 -1 5 -12 25 16 24 14 15 4 15 25 0 18 18 0 1 16
6729 16 9 2 0 18 1 -3 8 -7 17 -3 4 -16 19 -14 -16 -15 14 6 -11 -15 -15 -4 -13 -12 5 12 6 18 13 4 21 16 13 27 14 28 13 12 3 21
6769 21 21 5 2 -9 1 15 2 10 7 2 5 -10 -1 -8 -17 -11 8 3 -8 6 -2 0 3 -18 17 -14 18 9 -4 -6 13 -2 4 10 0 8 10 14 24 6 2
6810 2 8 17 2 -9 5 3 16 2 12 -8 0 -5 3 3 1 -13 -7 -11 -18 -7 -15 -11 17 -8 -12 -4 26 2 8 2 0 5 4 34 -5 4 3 23 2 11 0 3 10
6853 10 -2 6 5 17 3 21 14 17 4 6 8 -15 4 6 9 -8 -31 -4 5 -14 0 10 -10 -14 -5 -10 6 -6 13 16 -8 -4 -3 7 33 13 10 11 29
6892 29 21 6 7 0 21 18 3 10 -10 16 16 11 8 4 15 -6 -8 16 15 6 10 4 -31 -18 -12 -4 2 -20 -9 -12 -4 -14 -17 -8 3 32 -4 -8 12 15 6 17
6934 17 4 34 15 6 17 3 27 3 13 9 12 -4 5 18 6 5 -6 -17 5 -11 2 -11 15 -1 10 -24 8 -14 -1 8 -9 -7 -10 6
6968 6 -3 -4 -7 -2 -8 -7 9 8 12 33 9 9 19 11 18 -2 28 11 24 -4 22 12 -13 4 8 -11 -9 3 -34 -2 -16 -3 -10 -5 -1 7 -8 -9 -11 -2 2
7009 2 -4 -14 12 3 -5 -8 1 6 -6 15 -14 13 7 4 4 6 17 20 15 24 14 8 3 -6 7 15 6 -13 -4 -2 -10 4 5 -10 -14 -23 -8 5 -19 -11 9 -13 -17 8
7053 8 -1 -10 -34 3 -4 -5 -4 14 11 -10 4 -1 18 9 17 13 -5 23 6 14 24 24 13 17 12 10 4 1 -14 -13 -1 -9 -15 -11 8 -6 -18 -15 -14 14 -3 -8 -3
7096 -3 1 2 -10 -1 3 -4 1 7 16 30 21 11 15 27 -2 9 -2 8 4 10 1 2 15 -7 5 -6 -1 -2 1 2 -13 -19 -11 -12 -14 -7 -24 -13 -8 -16 -7 -5 -16 0
7140 0 -3 -4 -1 -20 3 5 9 3 -6 12 -13 7 17 14 13 22 1 15 -9 8 15 16 5 9 3 -3 8 -4 -6 -11 -3 -22 -3 -15 -13 6 -2 -6 -9 -18 -11 -3 -17
7183 -17 -4 -11 1 20 -7 -16 -7 3 -10 4 10 20 16 24 20 6 8 18 5 -8 4 19 6 -11 -7 -4 8 -4 2 1 -10 12 1 -17 0 -12
7219 -12 -2 6 0 -6 -21 4 5 -3 1 4 -5 -17 1 5 10 15 0 7 10 16 1 21 9 9 7 16 11 2 24 10 3 2 -1 1 8 -13 -1 -4 -16 -2 -12 -16 -2
7262 -2 -12 -2 -14 -2 -10 -10 25 -6 7 4 -7 3 19 9 2 0 24 3 2 0 -7 4 -3 0 -15 11 11 14 21 5 25 18 11 11 -4 11 2 -1 -25 -17
7302 -17 -4 -14 -3 8 -17 -15 6 1 -7 2 9 -2 -12 -1 5 -10 23 2 4 3 -3 7 3 8 3 15 3 14 14 -7 4 -8 4 5 18 16 -4 11
7340 11 7 -6 -6 -6 -19 -9 -4 12 6 6 -16 -3 2 -1 -1 -14 5 -10 -5 -6 22 14 18 -8 16 11 19 12 21 22 26 6 9 14 3 14 -9 1 -7 -2 -4 12
7382 12 14 0 8 -8 -5 -13 -13 13 -2 -30 -10 0 -2 -21 3 8 -16 -7 -14 -4 -3 -17 -8 6 11 2 1 21 5 2 20 31 -1 9 21 11 20 14 17
7421 17 5 0 3 5 19 -6 -3 -7 -13 3 1 -1 10 -5 -19 3 -11 -15 -1 8 1 3 -12 -6 17 -4 7 23 12 14 19 1 9 1 9 6 8 5 16 14 13 1
7463 1 12 5 6 4 4 1 -4 -18 9 8 1 -21 -2 -17 -18 5 -5 -9 0 -9 5 -13 10 2 2 1 -3 4 13 13 -4 13 -2 -2 2 18 0 20 -1 3 11 11 18
7506 18 -6 25 12 6 12 14 4 9 0 -5 -17 -16 8 -14 -15 -9 -16 -23 -1 -16 -3 6 12 -5 -17 6 -5 -13 17 0 6 0 3 3 21 23 -11 -2 8 9 15
7547 15 2 8 12 -6 5 4 4 -5 5 -21 -1 5 -7 -2 -12 -22 -14 -27 -24 -10 -3 -31 -11 6 -7 2 -2 -26 -8 -10 -3 6 -11 7 8 18 -1 0 8
7586 8 28 17 9 -4 13 3 22 15 5 9 7 1 -4 21 -13 -2 -3 -1 0 3 0 -17 0 -4 -15 0 -4 -13 -11 0 -25 -21 -5 -11 -1 2 1 -4 10 13 14 6
7628 6 0 20 17 11 27 1 4 9 5 15 14 -6 1 -13 1 -1 1 -3 -1 -1 -9 -10 1 -1 -1 -6 -15 3 -11 -3 -5 -8 -20 -23 -2 -5 -1 15 4 14 8 18 14 19 8
7673 8 32 23 22 18 11 12 4 9 10 -11 -3 14 10 11 7 -19 -7 -14 -15 -12 -36 1 -4 -7 5 -10 -6 6 7 -10 1 8 7 8 8 -5 13 10 0 28 16 14 14 8
7717 8 13 3 -5 -3 6 11 14 -4 8 15 -5 3 3 3 -3 -8 -1 -8 -12 -6 -1 0 -19 15 5 -8 -10 -10 1 10 -5 9 -1 -10 2 8 13 8 26 7 20 10 -4
7760 -4 7 5 3 -2 11 1 -2 4 25 1 -6 6 4 9 -2 -2 9 -10 2 -4 -1 -21 -1 -23 4 1 -8 -17 -16 -6 -9 14 -1 -12 -9 24 19 0 5 15
7800 15 13 -8 2 11 1 14 13 13 20 -6 3 2 9 19 -3 -2 -10 2 -6 5 -7 -14 14 -8 0 -4 -13 -1 1 -6 -11 -9 -6 3 5 -3 4 9 19 1 12 15 4
7843 4 12 -6 -4 11 7 0 4 6 5 14 21 -2 -3 -2 -3 5 -8 -5 -21 -2 -16 -17 -24 -32 -4 -10 5 -15 -8 -7 8 -6 1 0 2 8 -8 -9 -2 -2 7 15 9 8 10 18 11 22
7891 22 12 26 3 17 11 -1 15 12 18 16 8 -8 1 6 -11 -13 -3 -3 -10 -25 0 -19 2 2 -17 8 -9 -2 -5 -2 7 5 0 32 6 10 10 3 4 -4 15
7932 15 3 3 12 13 13 5 -9 2 -5 -3 12 0 -5 -4 10 7 -1 -7 -2 -16 -2 -5 -12 8 -21 -15 -2 -2 1 -12 -6 -4 -17 12 -21 5 8 -4 15 9 18 2
7974 2 12 11 12 7 3 14 18 -6 11 3 20 22 -3 10 -5 4 -5 -9 5 10 -4 3 6 13 0 -24 -16 -2 -7 -14 1 -6 -20 -3 -4 1 1 4 3 14 14 25 0
8017 0 9 18 15 -1 4 -2 -10 5 3 -2 4 4 -5 4 -7 0 -11 -7 -7 0 -6 -16 8 14 4 4 -12 -4 -13 -2 -7 2 -2 -2 -9 12 13 6 6 18 22 13 14 22 1 18 7
8064 7 8 14 22 13 3 19 23 16 8 14 8 0 -1 -22 -6 -8 -7 -15 22 0 -14 -2 -6 -3 2 4 4 -5 3 6 0 -3 12 -8 -9 26 2 1 4 11 4 7 4 25 18 3 21
8111 21 11 0 12 7 -11 0 3 3 2 -13 5 8 -14 -23 0 -11 -20 -11 -21 5 -5 -1 9 -4 11 2 -1 0 -3 15 24 7 25 9 10 3 17 16 16
8150 16 2 18 17 18 6 17 8 8 12 0 6 3 1 3 -10 -1 -16 -9 -16 -5 -13 -18 -10 2 -2 -13 -21 -8 -11 -3 -1 -4 1 -6 5 -7 -2 23 12 11 7
8191G
##END NTUPLES=NMR FID
##END=
