##TITLE=1H_ES-ZC-EtCel
 
 8 sc, 
 19.1.2023
##JCAMPDX= 6.0         $$ Bruker NMR JCAMP-DX V2.0
##DATA TYPE= NMR FID
##DATA CLASS= NTUPLES
##ORIGIN= UXNMR, Bruker Analytische Messtechnik GmbH
##OWNER= root
$$ XWIN-NMR		Version 3.5
$$ Thu Jan 19 13:50:07 2023 Russian Standard Time (UT+4h)  she@DPX200
##.OBSERVE FREQUENCY= 200.13135
##.OBSERVE NUCLEUS= ^1H
##.DELAY= (6, 6)
##.ACQUISITION MODE= SIMULTANEOUS
##.ACQUISITION SCHEME= undefined
##.AVERAGES= 8
##.DIGITISER RES= 18
##SPECTROMETER/DATA SYSTEM= spect
##.PULSE SEQUENCE= zg30
##.SOLVENT NAME= CDCl3
##.SHIFT REFERENCE= (INTERNAL, CDCl3, 0, 15.7039)
##AUDIT TRAIL= $$ (NUMBER, WHEN, WHO, WHERE, WHAT)
$$ ##TITLE= Audit trail, XWIN-NMR		Version 3.5
$$ ##JCAMPDX= 5.01
$$ ##ORIGIN= Bruker BioSpin GmbH
$$ ##OWNER= she
$$ F:/spectra/data/she/nmr/H-F/1/audita.txt
$$ ##AUDIT TRAIL=  $$ (NUMBER, WHEN, WHO, WHERE, WHAT)
(   1,<2023-01-19 13:48:50.68 +0400>,<she>,<DPX200>,
      <created by zg, POWCHK disabled, PULCHK disabled
       configuration hash MD5:
       00 E9 B6 7A A2 85 ED C7 34 08 36 98 17 FE 4E 26
       data hash MD5: 16K
       CB 38 24 7C 0D 55 7E B1 76 8D 0C AC 39 A4 89 6F>)
$$ ##END=
$$ 
$$ hash MD5
$$ A8 B6 E9 B4 81 42 F2 5E C8 CF 55 79 87 AA BD 59
##$RELAX= 
##$RELAX= 
##$RELAX= 
##$RELAX= 
##$RELAX= 
##$RELAX= 
$$ Bruker specific parameters
$$ --------------------------
##$DU= <F:/spectra>
##$EXPNO= 1
##$NAME= <H-F>
##$PROCNO= 1
##$TYPE= <nmr>
##$USER= <she>
##$AMP= (0..31)
100 100 100 100 100 100 100 100 100 100 100 100 100 100 100 100 100 100 
100 100 100 100 100 100 100 100 100 100 100 100 100 100 
##$AQSEQ= 0
##$AQ_mod= 1
##$AUNM= <au_zg>
##$AUTOPOS= <>
##$BF1= 200.13
##$BF2= 200.13
##$BF3= 200.13
##$BF4= 200.13
##$BF5= 200.13
##$BF6= 200.13
##$BF7= 200.13
##$BF8= 200.13
##$BYTORDA= 1
##$CFDGTYP= 0
##$CFRGTYP= 5
##$CHEMSTR= <none>
##$CNST= (0..31)
1 1 145 1 1 1 1 1 1 1 1 1 1 1 1 1 1 1 1 1 1 1 1 1 1 1 1 1 1 1 1 1 
##$CPDPRG= <>
##$CPDPRG1= <>
##$CPDPRG2= <>
##$CPDPRG3= <>
##$CPDPRG4= <mlev>
##$CPDPRG5= <mlev>
##$CPDPRG6= <mlev>
##$CPDPRG7= <mlev>
##$CPDPRG8= <mlev>
##$CPDPRGB= <>
##$CPDPRGT= <>
##$D= (0..31)
0 1.2 0 0 0 0 0 0 0 0.06 0 0.03 0 0 0 0 0.0002 0 0 0 0 0 0 0 0 0 0 0 0 
0 0 0 
##$DATE= 1674121729
##$DBL= (0..7)
120 120 120 120 120 120 120 120 
##$DBP= (0..7)
150 150 150 150 150 150 150 150 
##$DBP07= 0
##$DBPNAM0= <>
##$DBPNAM1= <>
##$DBPNAM2= <>
##$DBPNAM3= <>
##$DBPNAM4= <>
##$DBPNAM5= <>
##$DBPNAM6= <>
##$DBPNAM7= <>
##$DBPOAL= (0..7)
0.5 0.5 0.5 0.5 0.5 0.5 0.5 0.5 
##$DBPOFFS= (0..7)
0 0 0 0 0 0 0 0 
##$DE= 6
##$DECBNUC= <off>
##$DECIM= 32
##$DECNUC= <off>
##$DECSTAT= 4
##$DIGMOD= 1
##$DIGTYP= 9
##$DL= (0..7)
0 120 120 120 120 120 120 120 
##$DP= (0..7)
150 150 150 150 150 150 150 150 
##$DP07= 0
##$DPNAME0= <>
##$DPNAME1= <>
##$DPNAME2= <>
##$DPNAME3= <>
##$DPNAME4= <>
##$DPNAME5= <>
##$DPNAME6= <>
##$DPNAME7= <>
##$DPOAL= (0..7)
0.5 0.5 0.5 0.5 0.5 0.5 0.5 0.5 
##$DPOFFS= (0..7)
0 0 0 0 0 0 0 0 
##$DQDMODE= 0
##$DR= 18
##$DS= 0
##$DSLIST= <SSSSSSSSSSSSSSS>
$$ [...]
##$SUBNAM2= <"">
##$SUBNAM3= <"">
##$SUBNAM4= <"">
##$SUBNAM5= <"">
##$SUBNAM6= <"">
##$SUBNAM7= <"">
##$SUBNAM8= <"">
##$SUBNAM9= <"">
##$SW= 18.05172834244
##$SWIBOX= (0..15)
0 0 2 0 0 0 0 0 0 0 0 0 0 0 0 0 
##$SW_h= 3612.71676300578
##$TD= 16384
##$TD0= 1
##$TE= 0
##$TE2= 300
##$TE3= 300
##$TEG= 300
##$TL= (0..7)
0 120 120 120 120 120 120 120 
##$TP= (0..7)
150 150 150 150 150 150 150 150 
##$TP07= 0
##$TPNAME0= <>
##$TPNAME1= <>
##$TPNAME2= <>
##$TPNAME3= <>
##$TPNAME4= <>
##$TPNAME5= <>
##$TPNAME6= <>
##$TPNAME7= <>
##$TPOAL= (0..7)
0.5 0.5 0.5 0.5 0.5 0.5 0.5 0.5 
##$TPOFFS= (0..7)
0 0 0 0 0 0 0 0 
##$TUNHIN= 0
##$TUNHOUT= 0
##$TUNXOUT= 0
##$USERA1= <user>
##$USERA2= <user>
##$USERA3= <user>
##$USERA4= <user>
##$USERA5= <user>
##$V9= 5
##$VALIST= <valist>
##$VCLIST= <CCCCCCCCCCCCCCC>
##$VD= 0
##$VDLIST= <DDDDDDDDDDDDDDD>
##$VPLIST= <PPPPPPPPPPPPPPP>
##$VTLIST= <TTTTTTTTTTTTTTT>
##$WBST= 1024
##$WBSW= 4
##$XGAIN= (0..3)
0 0 0 0 
##$XL= 0
##$YL= 0
##$YMAX_a= 657942
##$YMIN_a= -552507
##$ZGOPTNS= <>
##$ZL1= 120
##$ZL2= 120
##$ZL3= 120
##$ZL4= 120
##$ABSF1= 10
##$ABSF2= 0
##$ABSG= 5
##$ABSL= 3
##$ALPHA= 0
##$AQORDER= 0
##$ASSFAC= 0
##$ASSFACI= 0
##$ASSFACX= 0
##$ASSWID= 0
##$AUNMP= <proc_1d>
##$AZFE= 0.1
##$AZFW= 0.1
##$BCFW= 1
##$BC_mod= 2
##$BYTORDP= 1
##$COROFFS= 0
##$CY= 11.3945322036743
##$DATMOD= 1
##$DC= 2
##$DFILT= <>
##$DTYPP= 0
##$F1P= 2.36226072786647
##$F2P= -0.459571619588291
##$FCOR= 0.5
##$FTSIZE= 0
##$FT_mod= 4
##$GAMMA= 1
##$GB= 0.15
##$INTBC= 1
##$INTSCL= 1
##$ISEN= 128
##$LB= 0.24
##$LEV0= 0
##$LPBIN= 0
##$MAXI= 10000
##$MC2= 0
##$MEAN= 0
##$ME_mod= 0
##$MI= 1.114404
##$NCOEF= 0
##$NC_proc= 0
##$NLEV= 6
##$NOISF1= 3.799351
##$NOISF2= 2.8
##$NSP= 1
##$NTH_PI= 0
##$NZP= 0
##$OFFSET= 15.70392
##$PC= 1
##$PHC0= -19026.92
##$PHC1= 12.80073
##$PH_mod= 1
##$PKNL= yes
##$PPARMOD= 0
##$PSCAL= 0
##$PSIGN= 0
##$REVERSE= no
##$SF= 200.130013532006
##$SI= 16384
##$SIGF1= 3
##$SIGF2= 2
##$SINO= 400
##$SIOLD= 16384
##$SREGLST= <1H.CDCl3>
##$SSB= 0
##$STSI= 0
##$STSR= 0
##$SW_p= 3612.71676300578
##$SYMM= 0
##$S_DEV= 0
##$TDeff= 0
##$TDoff= 0
##$TI= <>
##$TILT= no
##$TM1= 0
##$TM2= 0
##$TOPLEV= 0
##$USERP1= <user>
##$USERP2= <user>
##$USERP3= <user>
##$USERP4= <user>
##$USERP5= <user>
##$WDW= 1
##$XDIM= 8192
##$YMAX_p= 0
##$YMIN_p= 0
$$ End of Bruker specific parameters
$$ ---------------------------------
##NTUPLES= NMR FID
##VAR_NAME=  TIME,          FID/REAL,        FID/IMAG
##SYMBOL=    X,             R,               I
##VAR_TYPE=  INDEPENDENT,   DEPENDENT,       DEPENDENT
##VAR_FORM=  AFFN,          ASDF,            ASDF
##VAR_DIM=   8192,          8192,            8192
##UNITS=     SECONDS,       ARBITRARY UNITS, ARBITRARY UNITS
##FACTOR=    0.0002768,     1,               1
##FIRST=     0,             0,               0
##LAST=      2.2672688,     0,               0
##MIN=       0,             -552507,         0
##MAX=       2.2672688,     657942,          0
$$ Real data points
##PAGE= N=1
##DATA TABLE= (X++(R..R)), XYDATA
0 0 0 0 0 0 0 0 -8 4 -2 8 -8 11 -16 16 -24 31 -32 40 -48 64 -72 84 -98 116 -136 156 -180 210 -239 272 -309
31 -309 351 -398 447 -500 562 -628 703 -783 868 -964 1069 -1181 1303 -1438 1587 -1747 1924
48 1924 -2116 2332 -2567 2827 -3117 3444 -3813 4234 -4715 5278 -5939 6736 -7706 8922
62 8922 -10493 12597 -15560 20018 -27388 41569 -77946 342943 650045 -458708 -164203
73 -164203 84970 379670 -339477 -289611 657942 -212081 -309087 119727 248237 41074
83 41074 -552507 396396 236549 -421236 53486 112976 203593 -351733 -67260 489620 -317770
94 -317770 -101183 124006 120658 -45557 -323715 387543 -5465 -283965 155062 23499
104 23499 92576 -254176 81129 254548 -320216 85320 66621 7012 -45395 -136818 293999
115 293999 -167486 -103544 187431 -81187 38563 -131777 136793 54901 -239801 199132
125 199132 -26341 -43723 -2704 -22322 161998 -215196 61557 132417 -151040 52997 -36596
136 -36596 109785 -72744 -110312 225242 -117608 -41402 47518 23767 40314 -181038 159368
147 159368 42890 -160726 80167 7510 58021 -122222 1751 181347 -170226 -1336
157 -1336 69917 16816 -32529 -110504 185650 -42844 -128830 103032 12002 8647 -117029 74503
169 74503 106950 -175750 46576 57558 -3270 -54192 -44225 158771 -96662 -67020 102849
180 102849 -11312 -12699 -76735 96584 30855 -136712 79397 25583 -16610 -45078 3429
191 3429 106025 -108978 -6298 75765 -28667 -9352 -40417 82671 -15556 -80043 80745
202 80745 -7833 -14362 -22442 21104 50075 -87270 33562 36759 -34714 1958 -15307 55139
214 55139 -37904 -30671 64258 -30819 -3494 -6314 17325 14641 -54670 44148 2115 -26654 14093
227 14093 -8303 25573 -34567 4596 33531 -39670 13756 637 4909 -3192 -23547 39542
239 39542 -20136 -13353 20346 -8636 7376 -20609 17699 8558 -30059 21875 -1288 -2860 -4834
252 -4834 -1690 22857 -26586 3461 18397 -12877 114 -4668 17682 -7359 -17303 23918 -3439
265 -3439 -8405 -974 8823 7144 -21679 11540 11056 -13009 -662 3609 10109 -12990 -4664 18891
279 18891 -8614 -7848 5012 7579 -3923 -12571 13018 3892 -12429 660 7097 1559 -11695
292 -11695 2777 10425 -9062 -4362 5942 3227 -6571 -4194 9478 -1313 -8622 3831 5249
305 5249 -4327 -4936 5384 3269 -6777 -1061 6680 -683 -6190 2354 5552 -3420 -4075 4950 2444
320 2444 -4812 208 4231 -88 -3846 1576 5033 -3796 -2158 4871 390 -2806 -266 3870 -309
335 -309 -3856 2873 2229 -2541 -1351 2845 1263 -4173 1076 2979 -2264 -1514 1067 1874 -2377 -1920
351 -1920 3521 -763 -3258 1302 1834 -1896 -2202 1959 1192 -2933 -926 2663 -362 -2944 844 2160
367 2160 -1736 -1993 2434 627 -2591 314 1616 408 -2485 507 3321 -2763 -343 2125 -194
382 -194 -213 -1234 2984 -388 -2355 2951 -274 94 -993 1149 2245 -3899 2702 632 -1475 1511
398 1511 -1953 3349 -2388 -1017 4144 -3939 1689 -598 171 1485 -4335 4518 -2168 -1477 2738 -3219
414 -3219 3183 -3955 1395 2721 -6220 4860 -2398 -34 1221 -4118 6024 -5426 643 3585
428 3585 -5070 3997 -3850 3301 167 -5639 7849 -4838 990 1020 -2533 6192 -7972 4966 2227
443 2227 -6271 6199 -4338 4556 -2176 -3512 9353 -8126 3132 994 -1811 4558 -8465 8965
457 8965 -2053 -5692 8026 -5825 5256 -5074 -18 8551 -11904 6735 -346 -2059 3100
470 3100 -7650 10886 -7021 -3015 8619 -7590 5170 -6431 4152 4448 -12958 11184 -3503
483 -3503 -1638 2072 -5532 11226 -11301 1622 7910 -9221 5864 -5919 6618 -346 -10207
496 -10207 13892 -7379 280 1636 -2961 9247 -13445 7852 4461 -10174 7914 -5532 7542
509 7542 -4576 -5831 14593 -11418 2928 1328 -1292 5917 -13039 12608 -1399 -8739 9548
522 9548 -6317 7235 -7845 -216 12161 -15054 6996 219 -1225 2797 -10309 14542 -7449
535 -7449 -5284 9953 -7166 6013 -8801 4869 6793 -15256 11098 -2560 -951 1117 -6564
548 -6564 13637 -11879 72 8959 -8407 5447 -7323 7777 911 -12153 13679 -5708 73
561 73 261 -2741 10823 -14039 6078 5728 -9023 6309 -6040 8600 -3901 -7391 14181 -9295
575 -9295 1845 292 -449 6520 -13257 10728 517 -8047 7098 -5252 7753 -7432 -1799
588 -1799 11898 -12119 4545 -231 179 2819 -10369 12293 -4451 -5339 7107 -4916 5838
601 5838 -8233 3047 7167 -12067 7287 -1661 489 494 -6557 11656 -8094 -1476 6538 -5109
615 -5109 4432 -6947 5862 2385 -9816 8986 -3270 937 -746 -2852 9345 -9890 2913
628 2913 4444 -5372 4187 -5449 6785 -1624 -6432 9416 -5283 1509 -942 -445 5869 -9504
642 -9504 6078 1216 -4630 3914 -4302 6311 -4397 -2615 7871 -6719 2694 -1210 454 2922
656 2922 -7485 7115 -1794 -3118 3579 -3271 4702 -5302 834 5043 -6760 3870 -1645 1029
670 1029 781 -4996 7040 -4011 -1105 3180 -2811 3469 -4771 2888 2208 -5491 4620 -2164 1336
685 1336 -462 -2460 5838 -5204 1288 2108 -2501 2865 -4004 3818 -71 -3783 4688 -2790 1567
700 1567 -914 -827 3893 -4965 2816 476 -1903 2201 -3070 3746 -1834 -1847 3909 -3262 1776 -1216
716 -1216 27 2264 -4169 3204 -702 -1205 1555 -2259 2964 -2465 -180 2494 -3100 2056 -1387
731 -1387 572 955 -3018 3299 -1592 -438 1267 -1655 2342 -2364 776 1458 -2345 2009 -1408 1041
747 1041 243 -1815 2721 -1958 611 692 -1302 1940 -2024 1307 500 -1687 1913 -1334 987 -205
763 -205 -942 1974 -1804 866 68 -648 1321 -1786 1335 -163 -923 1326 -1437 1046 -375 -596 1211
780 1211 -1472 948 -281 -441 832 -1209 1090 -567 -375 838 -1056 934 -690 -53 851 -1177
796 -1177 861 -461 23 592 -997 916 -440 5 435 -699 823 -585 221 379 -686 791 -558
813 -558 322 224 -614 873 -594 201 297 -428 594 -589 350 220 -456 463 -398 414 -83 -300 531 -544
833 -544 360 -57 -272 425 -574 445 -128 -353 439 -432 264 -218 -98 341 -535 308 -181 -40 140 -474
853 -474 533 -357 -77 296 -457 411 -318 92 231 -511 504 -202 22 120 -243 548 -487 193 246 -298
873 -298 428 -429 418 93 -460 644 -387 245 109 -247 526 -557 367 154 -370 384 -394 466 -210
892 -210 -299 630 -605 309 -116 -112 453 -824 531 -33 -378 398 -545 524 -327 -229 551 -675 413 -221
912 -221 15 278 -775 812 -358 -222 426 -535 697 -614 51 626 -800 607 -317 145 254 -683
930 -683 910 -554 42 362 -473 713 -729 466 340 -817 874 -485 284 33 -534 1057 -854
947 -854 183 333 -436 605 -825 676 -17 -720 882 -676 450 -258 -282 944 -1133 604 89
964 89 -462 565 -827 873 -388 -481 919 -787 538 -432 82 638 -1203 976 -274 -240 485 -777
982 -777 1072 -820 -87 871 -982 730 -503 314 293 -1051 1266 -626 -32 325 -514 1036 -1139
999 -1139 522 562 -1025 925 -671 568 -72 -804 1400 -1004 221 256 -372 817 -1218 923 57
1016 57 -870 965 -758 695 -514 -355 1254 -1409 639 32 -313 583 -1183 1251 -471 -647 1002
1033 1002 -861 718 -748 164 865 -1485 1092 -318 -127 375 -952 1468 -1006 -131 960 -980
1049 -980 824 -811 563 398 -1312 1376 -600 86 155 -599 1339 -1342 471 604 -962 902 -877
1066 -877 822 -82 -977 1510 -972 262 77 -322 967 -1415 938 133 -839 857 -811 909 -614
1083 -614 -460 1375 -1317 581 -113 -148 656 -1344 1269 -365 -602 847 -773 857 -866 138 947
1100 947 -1388 932 -331 72 298 -1015 1446 -867 -177 774 -760 825 -902 540 464 -1186 1105
1117 1105 -521 211 22 -562 1258 -1160 356 518 -704 725 -851 817 -40 -921 1207 -691
1133 -691 283 -163 -228 945 -1213 699 133 -519 598 -768 890 -493 -444 1035 -950 504 -283
1150 -283 2 590 -1132 955 -217 -342 485 -626 824 -738 13 710 -929 646 -441 223 262
1167 262 -865 1045 -584 -35 413 -539 714 -762 363 364 -773 716 -435 342 -33 -476 914
1184 914 -749 265 188 -373 605 -733 578 2 -542 728 -535 343 -154 -220 664 -770 440 -18
1202 -18 -253 417 -615 626 -314 -263 607 -620 454 -288 -15 438 -702 579 -218 -131 316 -443 554
1221 554 -429 43 377 -536 465 -340 185 194 -549 646 -355 69 219 -353 481 -435 191 179 -424 443
1241 443 -308 228 6 -277 530 -467 185 67 -227 373 -456 346 23 -320 407 -316 235 -86 -148 370
1261 370 -415 255 -50 -108 241 -366 364 -192 -135 343 -337 264 -191 -9 275 -398 291 -114 -49 140 -283
1282 -283 321 -210 20 161 -265 262 -212 67 115 -300 305 -201 41 97 -203 274 -239 77 128 -196 202
1303 202 -202 142 31 -156 255 -217 143 -4 -128 265 -236 152 17 -131 217 -202 140 -20 -95 204
1323 204 -187 167 -51 -35 154 -213 175 -93 -44 115 -221 204 -98 -55 133 -185 165 -98 -38 123 -153
1344 -153 138 -91 25 65 -168 179 -129 40 83 -129 186 -142 45 112 -159 144 -96 46 44 -95 146 -104
1366 -104 78 -3 -57 134 -145 109 2 -99 150 -153 91 -18 -76 154 -156 81 -6 -41 96 -139 125 -60
1388 -60 -35 115 -139 128 -93 4 110 -156 152 -47 0 101 -150 153 -74 3 97 -107 125 -108 56 49 -123
1411 -123 163 -107 47 35 -95 162 -136 75 74 -140 126 -118 71 3 -99 154 -141 70 -7 -67 131 -168
1433 -168 114 -8 -80 156 -137 114 -47 -61 149 -160 125 -7 -39 88 -132 170 -62 -41 97 -139 134
1454 134 -105 5 133 -183 160 -76 -31 76 -135 182 -108 -12 90 -115 115 -119 71 54 -158 176 -116
1475 -116 44 29 -117 174 -165 62 57 -117 135 -101 91 -8 -102 158 -119 82 -3 -23 139 -165 137 -14
1497 -14 -87 118 -147 120 -55 -65 150 -164 110 -40 -23 95 -168 156 -71 -26 87 -123 150 -113 27 99
1519 99 -186 124 -83 42 55 -129 167 -110 11 63 -91 120 -132 109 34 -117 144 -108 70 -2 -67 178
1541 178 -168 74 41 -97 104 -140 117 -18 -104 131 -120 91 -43 -21 145 -171 129 -27 -62 108 -134
1562 -134 156 -76 -38 131 -143 113 -68 33 79 -154 165 -81 17 49 -90 145 -132 34 95 -135 134 -85
1584 -85 57 38 -127 171 -105 20 16 -68 99 -149 83 13 -93 120 -125 77 -28 -84 166 -130 73 13 -64
1607 -64 112 -134 126 -21 -82 120 -92 96 -40 1 108 -131 93 -12 -26 104 -122 115 -51 -29 114 -95
1629 -95 113 -68 17 58 -111 110 -70 -28 38 -95 112 -117 1 62 -116 94 -67 42 33 -95 126 -45 8
1652 8 35 -35 95 -88 46 25 -53 98 -46 58 -23 -63 118 -80 55 13 -28 71 -75 82 -1 -57 70 -46
1676 -46 54 -40 -25 79 -104 57 -33 -19 44 -93 98 -38 -11 59 -67 72 -51 8 42 -84 64 -22 -12 7
1700 7 -47 96 -58 32 54 -63 59 -41 35 26 -49 76 -28 23 11 -26 73 -53 28 25 -32 66 -55 58 -7 -57 68
1727 68 -62 43 -17 -19 51 -88 36 14 -39 32 -36 50 -9 -21 59 -71 56 -10 -18 47 -71 59 -7 -9 50 -20 43 -15
1755 -15 0 47 -30 48 -27 11 27 -41 51 -40 12 22 -65 43 -44 8 24 -67 51 -13 -2 14 -42 38 -30 26 28 -12 36 -27
1785 -27 47 9 -21 61 -30 18 16 -7 42 -35 20 6 -16 42 -34 40 -27 -11 25 -43 30 -8 -10 38 -57 38 -16 -8 26 -26 20 -28
1817 -28 -9 31 -37 20 -26 -14 18 -11 33 -21 23 24 -27 34 -5 4 16 -36 29 -3 9 11 -33 24 -12 6 17 -3 42 -31 18 2
1849 2 -27 40 -16 15 -3 -34 32 -30 32 6 -23 23 -28 4 -27 -12 15 -39 20 -4 -2 37 -17 16 -17 -21 31 -19 28 -13 -9 21
1881 21 -9 42 2 23 32 -22 24 -18 7 21 -8 52 -12 6 7 -43 31 -12 -2 4 -21 15 -28 17 7 1 33 -22 16 4 -28 29
1913 29 -23 2 18 -7 13 -11 10 20 0 23 -20 8 16 9 26 -18 30 1 -5 17 -25 16 7 -4 21 2 28 -6 6 10 -23 43 -1
1946 -1 -8 14 -7 15 -18 0 11 -32 24 -6 -9 6 -24 28 -17 -2 1 -13 23 5 21 3 3 14 -5 10 -1 4 36 -3 22 26 -5 26
1980 26 -6 4 2 -10 14 -15 7 -10 -13 3 -17 0 -21 -13 8 -25 26 1 -12 34 -6 2 6 2 18 10 25 -3 11 19 -7 20 -11 16
2014 16 14 -21 23 -2 -13 15 -10 -4 -5 -5 11 1 21 11 -2 5 -38 2 -10 -16 5 -22 13 -23 -2 20 -30 16 -11 4 -21 -16 1 -22
2048 -22 9 2 -15 24 -1 -1 16 7 23 -25 14 6 -7 14 -10 6 2 14 24 -3 6 -7 -5 7 -32 -5 -26 -8 18 -24 2 -21 -6 11
2082 11 -20 15 -17 6 4 -19 11 -9 8 1 -8 24 -12 11 11 -18 28 -4 8 10 0 20 1 4 9 -24 8 -1 9 -8 8 22 -8 12
2116 12 -13 -8 28 -26 12 -9 0 22 -11 2 -11 -15 4 -19 12 -6 -21 7 -9 -1 -14 -3 16 5 13 9 0 5 4 18 0 7 26 -4 12
2151 12 6 17 22 2 17 2 5 5 -19 10 -14 5 -3 11 12 -15 -4 4 -1 3 -1 11 -8 -12 -8 -9 -11 7 10 13 -5 12 -10 -3 3 -3 3 2 -2 23 -2
2192 -2 24 12 2 18 1 28 -9 0 18 -20 19 -35 -5 18 -10 17 -21 1 11 -5 14 -12 4 5 0 -5 -20 29 8 -13 11 -16 2
2225 2 17 -8 17 1 2 18 2 4 -3 13 4 -5 18 -11 21 16 13 1 0 16 3 8 13 -23 22 -4 0 4 -3 5 -17 -10 8 -7 -11 -17 -21 18 -10 7
2265 7 -17 17 5 -17 20 -16 7 1 6 8 -18 -8 3 -7 2 1 17 13 11 26 -10 21 -3 9 -3 -6 17 10 -11 -1 -35 -8 6 6 -17 -26
2301 -26 8 -10 12 -25 -31 12 -14 -4 -4 -6 10 2 4 -1 10 8 19 5 11 3 17 15 -7 10 0 1 -1 5 17 -6 -5 -9 -1 2 6 -6 -9 5 -5 -3
2341 -3 4 0 -4 -7 -13 -16 -3 3 -3 -14 13 8 3 -3 3 4 1 4 5 6 16 -1 8 -2 12 9 1 1 10 11 11 -1 4 3 -2 13 1 15 -3 -1 -3 -5 14 -5 -6 -2 -27
2388 -27 5 -26 -3 4 -13 11 -9 -3 -11 -4 13 -7 -1 22 2 7 0 11 0 1 7 10 -1 1 14 18 -16 8 6 -3 11 -4 -3 -15 -15 5 -12 6
2426 6 -3 -6 9 11 -1 -3 -18 -19 5 -7 -1 -9 3 -5 12 6 1 2 -5 14 -2 6 -12 -2 -5 2 12 11 5 20 8 11 10 0 10 7 18 2 -4 -9 -3 8
2468 8 -13 3 -4 -10 8 -3 -12 6 4 3 -4 -5 10 20 11 -7 4 0 -1 10 -5 -22 15 6 -15 -9 12 18 -2 14 12 7 -6 -16 17 13 -3 23 -12
2507 -12 -2 -19 3 3 -10 2 -15 -7 2 -8 -11 -10 3 0 -4 5 -3 -1 -8 -8 5 10 -3 2 4 17 0 22 17 2 6 -2 15 19 5 9 2 5 -11 11 -4
2548 -4 8 -2 -8 6 18 -5 16 -11 6 -15 1 7 -8 -15 -22 -16 9 -17 -10 1 3 7 0 -5 -7 12 -10 -3 9 -4 6 12 6 12 -5 20 6 -7
2586 -7 0 2 19 0 8 -11 -19 10 5 4 4 1 -16 -8 -10 0 -17 -8 -5 -17 5 -7 -7 -14 10 -7 -15 -1 -1 -11 9 11 12 6 -5 -2 -2 14 -6 11 10 5
2628 5 9 -5 -3 12 18 12 8 12 -10 -13 -6 16 1 19 10 -5 -14 -8 -6 -1 -1 -22 -24 -4 -1 -1 -8 0 -3 -12 5 -8 -13 16 5 10 -9 9 -11 8 28 -7
2670 -7 -6 -10 7 5 -3 -4 -5 -9 14 7 -16 -18 -5 -5 -14 -15 -20 -5 -5 -3 -13 -4 -17 -13 -6 -7 -7 1 0 -4 -7 -13 -11 -3 -6 -18 6 -1 -13 -13 19 13 2 9 14 25 -9
2717 -9 -7 11 8 3 -12 4 3 -4 5 -12 -6 5 8 1 -16 -7 -15 -11 -7 6 -13 -8 -10 -9 -2 -2 -16 -3 -5 -15 7 -2 -7 8 0 -5 -3 16 -6 -1 -4 15 11 -5
2761 -5 16 -1 -7 2 1 -4 1 5 -14 -13 -15 -6 -16 10 12 -10 -19 -19 -17 -16 23 -13 -6 -25 -27 19 -3 7 -11 11 -7 6 -10 -1 -16 2 16 -5 -8 6
2801 6 -1 0 -4 -6 1 7 -9 -1 19 17 12 8 -2 -10 -5 1 -6 -3 -3 -21 9 -2 6 0 -19 -23 2 -8 -10 0 -13 -6 0 6 3 7 -1 24 -13 3 -6 4 5 10 7 19
2847 19 3 -5 -7 12 0 7 4 -4 -16 3 2 -19 -5 -10 0 -19 10 4 -5 4 -3 -7 -5 -14 0 12 11 -8 11 -6 -3 6 5 -1 12 -8 3 5 3 5 17
2888 17 13 -4 20 5 11 2 28 -5 0 9 -19 -9 2 -22 -7 10 4 -10 21 -5 -1 -12 4 -15 -21 18 -7 1 -6 5 4 -1 -6 14 -13 -5 -19
2925 -19 -14 2 0 14 3 12 -1 -1 -7 -4 -4 -1 17 10 8 4 0 -4 10 -11 -1 5 10 -12 -12 -7 4 -17 -9 -16 -6 -18 -19 -12 5 4 -16 -3 -7 -8 1 -24 -3
2968 -3 -5 -4 13 12 -1 16 2 5 5 6 8 8 13 -8 12 5 -8 7 9 3 17 -18 -12 -11 -14 -2 4 -22 -6 -22 -22 -19 -6 -5 -21 3 -10 6 5 -9 -10
3009 -10 6 -8 -6 26 -3 5 15 -1 0 18 5 12 1 12 0 -9 0 4 -2 3 8 8 0 -12 -16 -2 -5 -24 -17 -17 -5 -6 -9 5 -8 -11 -10 -2 -4 4 -10 1
3051 1 -2 -13 -10 -8 0 4 11 -9 1 3 -3 11 16 1 1 8 13 11 15 -1 13 -1 -13 5 1 19 7 1 -7 -2 -11 5 6 1 -23 -4 -32 -1 -12 -15 -15 -6 4
3094 4 -19 5 4 -1 7 3 1 14 6 8 -4 7 21 7 12 2 6 24 1 13 5 -9 -8 7 7 0 6 -14 13 1 4 6 0 -11 -23 -7 20 -11 -6 -11
3134 -11 -3 -4 14 4 -1 8 -10 -5 4 4 27 20 10 0 4 -5 -14 4 15 -7 3 -2 2 12 4 -4 -3 17 3 -2 8 -18 -15 0 -8 -18 -4 -11 -15 -18 -12 -13
3176 -13 -7 -7 -14 -7 2 6 1 4 2 5 2 -3 3 9 4 0 20 14 1 -7 4 22 13 6 0 12 0 -5 15 9 0 -3 7 2 7 8 -17 -16 -3 -6 -22 5 -4 12 8 -21
3222 -21 5 -4 1 17 -1 -2 5 -8 6 -4 0 3 6 7 -7 -4 5 15 -5 7 -11 3 6 -9 10 9 1 4 -9 2 -9 18 -1 -23 -10 -5 -11 -7 3
3261 3 -20 -13 -4 -9 -15 -3 -3 -22 0 2 4 11 -13 -1 -6 7 -1 11 17 2 5 11 13 0 -8 -4 9 11 12 8 -8 -1 -9 0 15 10 7 16 4 4 -8 -14 -15 -20 -7
3306 -7 -9 -27 -9 3 -3 3 -4 -3 10 -2 1 3 9 20 4 12 8 14 5 10 -5 -5 11 16 -3 -6 -2 10 6 -14 -4 -16 -4 -18 -3 6 12 -15 -2 6 4 -16
3348 -16 -4 2 -5 -7 -3 -16 -14 -9 14 -26 -4 -15 -3 -5 -18 -2 0 -2 1 7 -7 15 -14 19 0 4 0 -1 5 10 -2 -1 -12 -15 1 -22 -5 -12 -13 -14 0
3389 0 -6 2 7 5 3 -10 -3 -1 7 8 -7 4 -11 -9 -12 18 6 1 1 -9 18 5 13 12 -1 15 15 0 6 -2 -7 6 -6 -3 1 -3 17 16 -11 -11 4 -13 -10
3432 -10 -5 9 -7 -27 -2 -17 0 1 -9 -3 -5 8 -12 -2 -7 6 8 3 14 -2 15 1 25 0 2 11 13 -7 3 17 6 9 9 11 2 -2 11 -5
3470 -5 -4 -11 -11 -10 -3 -19 -6 -22 -13 -10 -4 8 16 -8 -13 -7 0 9 -14 -3 2 7 8 7 -15 5 16 -11 11 6 19 -4 11 8 14 -3 10 10 0 23 1
3511 1 2 -6 8 -9 -11 -9 -4 -10 -6 -19 -11 -15 1 -2 -1 3 -15 0 -8 0 17 16 -18 2 5 -8 0 0 -2 11 13 6 -13 1 7 5 -8 10 0 8 -13 24 5
3554 5 18 0 -11 -2 -12 12 -8 4 6 -9 0 3 0 -8 12 5 -6 -3 -14 0 -2 -9 8 9 11 17 10 8 1 5 7 8 4 14 12 14 -3 14 16 35 2 8 2
3597 2 -13 17 -1 0 15 -9 7 11 -11 2 2 -6 -10 15 4 -5 -6 3 -3 5 18 -13 9 9 6 -3 5 2 6 15 10 12 3 23 11 9 6 17 -1 4 7 2 3 11
3641 11 7 11 -9 10 10 -2 2 -15 3 3 -1 10 -5 -6 -3 -4 10 3 12 7 18 -4 22 6 15 2 -1 10 -4 -15 15 7 11 13 0 -5 0 18 -6 18
3681 18 2 20 6 -18 5 8 3 5 -13 -3 10 7 -6 5 -7 -1 -12 0 -7 6 5 -13 -9 -14 -9 12 2 8 29 -7 -8 -1 6 5 2 9 4 -7 11
3720 11 24 -1 9 27 10 4 12 16 16 -1 22 -7 -4 -3 -13 -10 -3 -5 -8 6 -1 -1 17 -10 -10 -31 4 -2 -4 -13 -10 -6 5 3 1 0 -4 17 6 2 -6 5
3762 5 -7 -7 -9 -4 3 -1 14 4 9 9 -1 -1 -14 23 2 -17 -19 -2 -5 2 -6 -8 -7 0 -8 5 0 -2 -13 1 -4 -7 -6 22 -9 -9 0 4 5 24 18 -1 -19 11
3806 11 -2 7 18 8 7 19 15 0 0 1 5 -2 11 -5 -4 5 -15 3 -5 9 4 -4 -7 -14 -13 21 -16 2 -17 2 -4 11 -7 -11 10 10 8 5 10 7 -3
3847 -3 1 -13 18 -1 10 21 7 17 17 12 2 17 24 25 6 -3 -10 -12 0 8 -10 -11 7 -8 -4 16 4 -7 -11 -6 -19 -18 1 8 -3 19 -7 -10 8
3886 8 0 -2 -12 -3 0 -2 20 7 8 8 10 8 5 3 15 8 -9 -20 5 5 -3 -10 1 3 4 -8 -25 1 -10 -1 -2 8 4 3 -6 -27 9 -11 1 -5 2 -2 -6 27
3930 27 -9 -10 -6 20 -5 2 9 14 3 9 0 1 -9 11 3 17 -6 0 16 2 8 6 -4 4 2 -23 -3 -15 -1 -3 -13 -9 -2 -2 -4 -5 1 3 0 0 4 0 -10
3973 -10 -9 0 -13 -12 8 12 17 -15 -7 0 -6 -3 -8 -3 4 8 4 4 -3 4 14 -12 -5 9 7 -4 -15 -8 0 -12 -14 -12 -8 -3 3 -3 -7 -27 -4 -11 -18 -11 14 -14 4 -1
4019 -1 -1 8 13 10 -3 1 -15 11 1 -1 -1 -8 9 4 10 -4 12 -4 4 13 -10 -13 -22 0 -6 -8 -6 -13 -15 -1 -9 17 -5 -10 -16 -14 -14 -21 8 11 17 8 -1 -13 9
4064 9 -9 2 5 4 5 17 16 7 8 2 1 5 1 -7 -4 -2 -8 11 -9 -3 -7 17 7 -19 3 -10 -5 -9 -5 10 -15 -8 -10 -9 8 3 3 3 6 -11 5 11 -27 6
4108 6 -13 13 2 14 0 7 0 26 12 7 9 -9 9 -5 -11 5 4 3 -15 -6 -8 -10 -9 -6 4 2 -3 -18 -24 -9 -4 -16 3 -3 5 -11 -4 9 -19 8
4148 8 16 11 8 11 10 -12 -3 12 1 13 -11 10 1 18 -14 8 8 8 -4 5 -8 6 5 -1 4 -11 1 0 -10 -3 -26 -4 1 1 7 3 -9 3 9 7 11 18
4190 18 12 2 1 7 15 3 7 24 -1 13 7 5 -2 -8 11 -10 -7 -6 28 -11 6 9 6 -8 20 13 -8 -11 -3 -6 -7 -12 0 -3 -4 0 -21 8 -9 8 -4
4231 -4 7 4 -20 -20 7 -5 -4 12 -8 -2 -12 11 -11 3 18 2 16 10 -4 17 16 13 -5 2 -1 -4 -4 -3 8 -12 18 -9 -13 1 -5 -15 -17 -14 14
4270 14 -7 -20 -9 -2 8 -12 17 -16 -4 1 11 20 -1 14 13 9 16 7 2 16 8 -8 12 5 14 -2 -9 3 -3 -9 -7 -24 12 -4 -10 4 12 -1 1
4309 1 0 -19 3 -8 -4 -3 -11 10 4 -12 -4 -15 11 -12 -2 10 11 16 11 -17 11 16 1 19 14 -5 -4 8 3 6 6 -11 -9 4 9 -3 -8 -13 -14 -14 3
4350 3 -7 2 -9 -13 -3 -9 -3 -2 -5 4 -7 -13 -7 12 6 1 7 1 15 0 -13 3 -9 -2 -9 15 -1 -3 12 -22 15 2 -1 4 -11 11 8 -2 -8 -4 4 2
4392 2 3 -3 -1 1 -10 -2 -13 8 12 8 4 -11 1 0 2 -2 3 8 -14 20 -4 2 -1 12 4 12 10 16 7 6 4 6 5 -11 5 6 5 -9 -16 5 -9 -13 -12 -6 -9 -25
4438 -25 -14 -6 -31 -12 -5 -12 -7 7 8 11 3 3 11 -4 2 -6 -16 11 9 -3 22 4 14 0 -6 2 2 2 0 0 -16 -2 10 -5 -8 -18 -12 -5 -32 7 11
4479 11 1 -4 -13 -16 -22 -8 -9 -16 -3 -19 -23 -6 1 -16 -1 1 -7 2 -1 8 -2 4 -9 15 14 28 6 16 10 19 -9 5 7 4 8 -3 3 -4 -1 -11 1 5
4521 5 -3 -23 -19 1 -1 -20 6 -7 -21 1 -14 2 6 1 -7 7 6 10 9 -8 -10 0 8 7 -3 1 0 -4 19 16 2 0 5 5 -10 6 -14 12 0 13
4561 13 2 2 -4 10 17 7 -3 3 -6 -5 -26 -13 -6 -16 -9 3 -7 2 9 4 2 8 7 2 1 -2 -16 -9 10 7 11 8 6 8 14 -4 -8 3 -3 4 -16 -9 -14 -2 -1
4606 -1 -9 2 -18 -2 -7 -7 -6 1 12 -11 -7 -12 -17 -4 -3 3 2 5 -18 4 -4 -26 -11 3 1 -17 -10 6 -1 15 18 -4 15 -8 2 2 -9 4 8 -17
4646 -17 3 -13 -4 -6 1 -11 -21 12 7 1 10 -18 -10 -7 -7 -4 -8 -5 0 -2 -10 18 5 -3 -7 -5 3 -2 -3 0 8 7 6 -6 -1 -13 -5 10 2 19 -7 -2 -8 -4 17 -10
4692 -10 8 -3 2 -1 -10 -10 -6 -5 -17 -11 -4 -11 -15 -12 -3 -8 3 9 -5 0 -9 -24 3 7 17 4 -2 -5 15 0 2 15 8 1 14 23 7 0 2 4 2 -1 2 -4 0 0
4738 0 -9 -7 -5 4 -12 -5 -3 12 8 7 -3 -3 -12 -2 1 -7 -6 1 -10 0 14 9 5 1 10 8 4 3 6 10 7 12 27 13 -9 -7 0 -8 -10 -18 0 1 2 3 -11 -25 -20 2
4786 2 -15 -21 -5 0 -10 -13 -6 -16 -20 6 -4 -1 -18 11 27 -3 7 0 -14 13 -5 14 12 10 17 11 32 19 -3 7 7 -8 1 15 4 2 -8 7
4824 7 -8 -8 3 -3 -13 -17 -1 -1 -14 -2 -9 -12 4 -15 -1 10 -4 2 3 10 17 1 -1 -9 14 12 13 -6 5 13 9 19 11 19 -8 24 8 23 -5 3
4864 3 7 2 1 -13 7 -1 6 -6 2 -3 2 -17 -5 -5 -21 -6 5 -15 -8 16 13 5 5 -15 6 7 17 -5 -4 17 -10 9 12 34 4 3 1 5 0 2 1 -2
4906 -2 10 11 7 8 21 -5 3 4 13 -6 -7 -16 -5 14 -9 -8 2 8 -14 6 16 -5 0 -11 -9 6 0 -2 3 5 8 3 6 -16 2 18 -9 4 -11 4
4946 4 16 2 -7 1 14 -4 -5 25 5 2 -3 -1 6 2 2 -1 -21 5 -19 -10 -12 -4 -4 -9 0 -5 -11 -18 10 4 -2 -4 11 9 15 13 3 26 5 17 4 -11 14
4989 14 12 6 8 -8 -4 -4 9 14 1 -4 -9 -30 -1 -10 5 -2 -31 -6 -13 -18 2 -15 -8 -10 -9 0 -19 12 3 -12 -6 -11 9 5 -18 22 -10 -3 14 8 17 -2
5031 -2 19 19 5 -4 5 -5 3 2 -1 -6 6 -5 2 0 -19 4 -10 -9 -1 5 -18 -18 10 -9 -2 1 7 -1 13 10 -11 -1 11 2 -6 4 -2 -7 10 6 -4 7
5073 7 -15 13 -1 9 6 -10 4 8 4 7 10 5 -4 -21 5 -13 -5 1 -20 -34 -14 -4 -5 -7 -12 3 -8 -2 5 12 21 -2 10 19 -2 -10 7 3 -1 1 -9
5114 -9 4 10 12 -17 3 -3 14 -6 0 9 -6 -13 6 4 2 -4 -10 -7 3 -14 -29 -10 -3 -15 -34 -4 -26 -21 7 -21 -9 3 11 -4 -11 8 -1 -4 -1 -6
5154 -6 -7 21 12 5 0 12 8 -13 18 7 1 0 -3 27 5 5 10 -7 -15 -9 9 -13 -5 -1 8 -22 -27 1 0 -4 -10 -9 7 -5 -2 -19 7 15 1 -3 2 11 10 2
5198 2 -17 11 0 11 22 27 5 2 16 0 -3 20 -1 0 17 -1 -2 16 1 -19 11 20 13 2 -9 7 -2 -5 -9 -5 10 -4 0 -8 -12 4 -3 0 -15
5237 -15 -5 -13 -8 17 2 -1 29 18 12 18 16 -1 13 13 20 -4 8 33 15 10 1 -6 7 -13 1 -1 -13 3 -3 -10 -17 -18 -14 4 2 -19 -37 2 -22
5276 -22 -11 -5 2 11 -10 -23 3 -1 -24 13 -6 15 15 17 7 7 19 2 -2 3 -1 -2 9 8 2 8 11 -9 9 1 -10 -13 -8 -3 0 -10 -13 -14 -16 -2 -11 8
5318 8 9 -16 14 7 -20 -11 3 15 3 1 9 1 13 9 6 13 11 13 2 16 -2 9 7 -5 2 10 -8 2 -5 -12 16 -1 -7 -6 -7 3 -12 3 -2 4 -3 2
5360 2 1 -20 10 11 3 -15 -12 -7 -26 -3 5 20 3 0 -5 4 10 7 -2 -1 0 2 9 13 17 13 -7 -20 -13 6 -10 -7 12 -1 -8 0 -5 -4 -2 -7 12 -3 -23 14
5404 14 7 -16 -2 -2 2 -1 6 -10 -2 0 14 10 17 9 -5 20 6 5 2 5 6 -18 11 7 -26 -3 -2 15 -2 -7 1 1 -19 -23 6 -16 -7 2 -27 -7 -11 7
5446 7 -8 -12 -10 4 5 -3 -2 -2 2 3 -1 2 7 2 -15 8 14 7 9 8 17 -15 -12 14 3 15 -25 2 4 5 8 -7 2 2 -9 -2 -6 -4 -6 11 -4 -2 -9 -10 -9 0 -8
5493 -8 -19 -4 0 10 -5 -3 -14 3 -2 -8 9 15 1 1 4 10 7 6 5 10 17 -3 4 1 6 2 10 -1 3 -8 -5 -5 -20 -17 -6 -11 -16 -4 -1 -6 -5 10 -10 -6 -14
5538 -14 4 -13 4 -11 14 8 9 -8 1 -7 -11 14 -1 3 21 13 11 -5 6 -1 10 14 -3 -2 9 20 5 18 -17 -5 -13 -12 -7 1 -4 -23 -18 -14 5
5577 5 -5 -6 9 -2 1 1 2 18 -3 0 13 14 12 2 -2 2 2 5 22 -4 1 -4 5 0 9 14 -10 -12 12 6 -19 7 10 -23 -7 -14 -4 -18 -16 -12 -10 -14 -5 -1
5621 -1 -14 9 -6 -3 -7 -5 11 5 1 -9 0 10 6 3 -7 -5 22 3 2 9 0 -9 0 11 -4 -14 -3 -7 -1 -12 2 1 1 9 -11 -20 -3 -2 -11 5 -18 1
5663 1 -12 0 -3 -14 -7 7 -11 -9 -1 1 4 17 4 -18 -13 -6 -2 -1 17 12 1 -3 -5 9 13 12 9 0 2 7 -17 31 6 0 2 -12 -16 -7 1 3 -38 11 -20
5706 -20 -12 11 -9 -16 -6 -28 0 -5 -14 9 -10 -4 0 20 0 -7 -1 18 5 8 19 15 24 14 15 20 7 5 12 10 26 7 -11 -3 4 5 -5 -4 3 10 -2
5747 -2 -3 5 -8 0 3 2 -4 -4 -6 -2 9 -11 9 2 7 -5 -2 19 0 5 -4 -7 17 -4 0 7 7 0 -1 3 -8 14 25 10 -21 -3 0 -8 3 16 -6 -19
5789 -19 -5 -11 -3 -2 -9 -19 -7 -9 1 -3 7 -10 -4 14 -1 -1 13 5 1 16 -12 12 -1 8 14 16 5 -2 5 13 15 5 -3 7 0 -5 19 4 12 -7 -7
5830 -7 -2 9 -5 -5 -4 -4 -19 8 -8 -13 -20 -8 -13 -1 -1 -2 9 -5 24 -8 11 7 4 8 16 7 9 14 44 11 10 13 3 -5 -5 3 0 11 15 -14 1 -9
5872 -9 16 21 -8 -16 -3 -10 5 -12 -10 -1 -6 -17 0 -6 -5 11 -3 6 9 -6 -4 -7 15 8 -8 1 0 -2 -8 7 12 0 4 10 6 14 1 3 2 6 -17 -9 6 -5
5916 -5 8 -7 -10 -5 4 -7 2 -10 -5 0 3 -2 -3 -4 -12 -4 -9 -6 -11 -16 8 20 -2 3 3 2 -1 4 10 12 -1 10 16 5 5 10 17 8 8 19 5 -9 -8 10 11 -7
5962 -7 -6 -9 -11 -1 -6 -2 -3 -10 -16 13 -18 -20 -15 3 0 2 7 1 6 17 -3 16 3 11 4 5 -4 9 10 -6 6 25 17 16 2 -7 13 -10 -4 -20 5 -18 -9
6005 -9 0 -7 -9 -10 -2 -2 11 5 2 1 -9 6 -7 -6 10 -1 -9 1 -6 1 21 2 -5 -3 -2 15 15 7 18 -2 3 12 19 11 11 10 19 19 6 -6 7 0 -10 9
6049 9 -5 -12 0 10 -5 -5 -26 -15 5 -20 9 1 -20 -27 6 0 -4 3 13 17 14 -19 2 0 -2 26 14 -8 -2 12 -3 -8 14 -6 2 -9 13 -16
6087 -16 -9 5 -7 15 6 1 10 -3 0 1 -10 -7 -4 -14 -16 -18 6 -9 -13 -14 10 3 0 5 -20 -5 25 14 6 5 16 9 14 -3 8 24 -6 15 23 20 14
6128 14 3 19 9 -15 2 -5 -14 5 -9 15 -8 3 9 -15 -12 -5 -10 -10 -2 -10 -12 -17 2 -14 11 1 -8 7 6 20 7 15 13 15 37 6 30 8
6166 8 -6 2 24 11 -5 11 12 15 12 13 -6 -2 -13 6 11 4 -5 4 -17 5 0 -8 13 -13 -2 -6 2 -2 3 2 1 10 3 0 -7 -6 18 18 11 0 8 0 -3 11 16
6211 16 2 -1 8 8 6 15 -1 26 -6 -6 4 6 3 -6 -3 8 14 2 -2 -16 0 6 0 13 5 9 -5 3 8 -9 -9 6 0 9 6 0 9 13 -4 7 21 -4 0
6254 0 12 3 16 9 13 10 11 1 7 13 14 -9 -6 7 -13 -6 -12 -2 -1 -1 -6 7 -16 5 4 -9 3 14 7 -1 20 -16 4 -1 -5 -9 -1 17 9 8 2 15 -4
6297 -4 5 13 11 -1 -3 1 -7 -6 15 -4 -6 -3 -1 -3 -6 -14 -7 -9 -11 -12 11 -15 -13 -4 1 -2 -18 4 6 3 -10 2 -9 0 -3 -4 6 8 5 11 15 -1 0 5 9 16 8 12 19
6346 19 -9 3 -11 -5 -6 -9 4 -2 -3 3 11 -18 -7 -4 19 1 -1 -13 -6 -19 -28 -5 -2 -16 18 -1 8 -12 -14 10 8 3 -7 -10 18 14 14 -7 -4 22
6386 22 -5 -4 9 -8 -17 -3 -18 8 0 18 -14 -24 1 -5 -4 -14 -10 -8 -3 3 0 -14 -6 -9 0 -3 5 19 -16 9 17 14 0 9 -2 4 2 14 5 8 15 14
6428 14 -3 -6 21 4 20 12 0 0 -8 4 7 -1 -9 -3 -4 -8 -9 -14 5 -18 1 -12 -1 15 -5 -17 10 -4 -13 18 11 1 -3 7 1 3 -10 -8 1 13
6468 13 2 6 20 9 -6 1 22 -3 6 7 17 13 12 7 3 -13 8 8 2 3 -7 17 -23 -27 -32 -16 -3 -3 -19 8 15 8 0 -5 3 0 11 -4 0 12 -5
6509 -5 0 6 3 -6 11 4 11 -13 1 10 6 7 -2 14 6 -4 20 7 -18 -2 2 -10 0 3 -20 -9 -20 -19 -29 -25 13 -5 -9 -18 -11 18 15 -17 -12 7 -1
6550 -1 3 4 14 1 12 20 -4 17 -6 12 -7 2 3 22 2 9 0 15 6 3 2 2 6 3 -2 -8 3 -12 3 -3 -4 8 -1 -9 -3 15 -4 7 -15 -1 -16
6591 -16 3 22 -18 -3 7 10 10 21 23 0 0 -1 -6 9 16 5 -3 -2 0 -11 -9 11 -16 -7 -6 -32 -5 -9 -2 -9 -3 0 -3 -11 -13 11 0 -19 -13 21 9
6632 9 -6 9 -2 -3 0 5 10 11 15 -6 6 0 1 23 2 6 6 8 34 20 14 11 -2 0 -2 8 -4 -19 -12 3 7 -9 -8 5 6 -18 -7 5 -12 5
6672 5 -8 -4 7 -10 -24 1 15 4 -4 -13 1 19 26 0 3 9 9 5 32 4 12 21 5 10 6 -3 -17 14 14 -8 -5 10 0 3 -7 -5 -6 7 -16 -4
6712 -4 7 -6 1 -17 -24 -9 12 10 -7 11 -9 -14 -2 5 -5 3 0 -11 1 1 14 21 17 11 -1 2 -2 -2 21 -1 -4 2 4 7 -9 -9 -3 3 19 -6 6
6753 6 0 -9 -29 -11 -11 -7 -3 -13 0 -7 -5 16 5 7 -5 7 13 2 22 -9 -4 5 19 2 5 3 2 4 0 -4 7 -1 -3 -21 -5 -3 -3 -7 -2 -4 -7 4 -6
6796 -6 -4 -11 -4 -34 -5 -26 14 -10 -15 -9 3 14 -2 9 -1 -4 -4 -11 7 -7 7 2 -7 -3 6 25 6 -3 3 7 18 -8 -23 -11 4 0 -5 -10 7 -10
6836 -10 -1 4 -7 6 -13 -7 -20 -11 3 7 9 -4 5 4 0 6 -9 13 2 12 2 9 4 14 0 4 19 12 12 -2 -10 11 2 10 15 10 -1 -6 -1 -22 9
6877 9 -28 -6 -7 5 4 0 -9 -19 -2 -23 -5 -8 -9 -19 -9 -12 2 -5 7 -5 -9 -4 0 4 19 13 15 7 -2 4 24 25 12 3 8 0 12 8 -18 -17 3 -2 -6
6920 -6 2 6 6 -9 0 -8 1 -10 -6 13 1 -1 -6 -10 10 2 5 5 5 8 9 0 -5 6 3 -3 7 25 8 8 9 -14 20 -7 20 24 11 23 15 24 35 14 -13
6963 -13 5 -5 4 -15 -5 -6 -13 4 1 -8 -8 9 -8 -16 -18 -6 -11 27 5 -10 -7 -16 -9 7 3 20 20 9 6 17 11 20 2 3 9 13 11 -2 19 -1 11
7004 11 -11 -10 3 5 -12 21 6 -4 5 -7 -13 -4 -2 6 -2 5 1 -3 14 -6 -8 6 3 8 9 -6 13 0 18 8 9 3 22 16 9 11 -7 7 6 6 3 -4
7046 -4 11 -3 -2 9 4 7 -4 -3 4 -8 -4 -20 -5 -10 -11 -10 -4 0 -5 1 -24 14 12 -10 -6 5 9 -2 7 10 10 13 -2 -6 10 -5 2 5 6 2 -1 24 -6 2
7090 2 -6 10 8 7 -8 -11 -3 10 -2 -1 -6 -4 0 -7 -5 -13 -8 -1 -9 -13 1 1 -12 -12 -13 -12 5 -16 15 16 -7 -15 -2 4 1 -12 -3 18 17 16 -5 -16 -5 -10 -1
7135 -1 21 -1 9 6 8 2 -6 -11 -6 -16 -6 -3 9 -30 -15 -10 0 -9 -6 -13 2 9 -10 13 -6 1 8 5 1 8 -16 9 0 25 10 14 5 21 2 9 -11
7176 -11 13 6 6 13 -8 10 5 -5 7 -7 -14 -6 -12 -11 -23 -16 -9 -6 -8 3 -14 -10 -18 3 -16 -19 1 2 10 -1 -11 4 4 10 4 2 17 14 0 14 4
7217 4 6 -10 18 -14 15 4 6 23 1 -13 -2 0 2 3 -8 -9 -16 -19 -8 -21 -22 -12 -3 1 9 -8 2 -17 -16 -8 7 9 -6 9 4 0 10 2 -1 2 -4
7258 -4 20 12 14 6 2 -1 7 1 -2 -22 -9 -22 7 -8 -8 1 -25 -10 -20 -19 -13 -11 -12 -25 -16 -10 -16 -7 9 12 -5 8 -10 -13 5 11 -2 -7 4 -5 12 5 3
7301 3 5 6 16 -3 6 1 -22 10 18 9 4 -11 -3 -9 -2 4 -11 -8 -15 -12 -7 -5 14 6 -5 -4 4 -14 -6 -8 3 -1 -12 12 -13 -2 -10 13 23 0 18 2
7343 2 1 8 18 2 17 4 17 -1 8 10 1 7 -6 14 0 4 4 4 4 -14 -24 -2 -16 -4 -30 -5 2 14 0 0 6 0 -2 -5 9 -8 6 -5 4
7382 4 9 10 5 6 6 13 26 13 7 34 -9 8 14 13 16 -11 0 -2 -4 -15 -2 2 5 -9 -7 13 0 2 -8 -5 -18 -1 13 1 9 5 4 -9 -2 -2 19 10
7424 10 5 -5 -3 8 15 -9 -1 7 7 9 -2 -12 -5 -1 5 -3 5 9 18 20 7 -1 4 -3 -1 4 -18 12 -10 -5 -1 0 -19 0 4 -6 3 -10 -2 7 -1 15 14 -1 13
7469 13 5 5 8 14 30 21 15 9 -1 3 18 16 -4 0 4 -4 1 -17 6 7 -3 2 1 -27 -23 -4 -2 -6 6 -3 7 -14 8 0 -6 2 -12 -1 0 -4 -14 -5 5
7512 5 13 16 -6 12 5 1 10 7 4 4 9 20 12 -2 -5 -5 0 14 0 -11 -24 0 -2 -8 5 -18 -6 -13 8 -2 9 -15 -25 -6 -19 2 -11 -8 7
7551 7 -4 19 -2 5 3 0 5 -3 7 8 11 7 17 3 16 9 3 16 -12 2 -11 2 16 -1 10 2 3 0 6 -7 6 -11 3 -9 6 4 -25 0
7589 0 -1 -5 6 8 12 -24 6 -9 -8 -4 14 14 8 8 1 13 10 9 11 19 21 18 19 13 7 16 0 -9 5 5 2 -5 -13 5 -1 -4 -9 4 -3 -6 8 -9 -6 14 -6 0 10
7636 10 2 -1 0 3 13 19 12 -13 13 -2 8 3 17 7 4 -8 6 3 19 8 10 16 14 26 -9 12 26 10 -3 -5 -9 -2 4 12 0 -10 8 -15 -4
7675 -4 -3 10 3 -19 -13 5 1 4 9 3 -4 2 5 12 10 -15 7 12 1 -5 11 3 1 8 1 14 14 22 10 3 4 29 -8 -9 -15 -13 -11 0 9 15 -3 -1 -11 -20 -16 -20 -5
7722 -5 -6 11 1 -3 -1 18 -14 14 6 13 -6 -6 21 0 13 15 7 12 10 16 10 7 17 -3 8 -2 3 -13 8 5 -5 -8 -4 14 -5 3 -2 -2 -18 -6 -4
7763 -4 11 0 17 3 2 20 -4 8 15 19 16 -8 -6 21 8 1 9 6 -2 17 17 29 3 -7 12 -3 -8 -4 13 -11 -1 -4 -3 -6 -23 -10 8 8 -12
7802 -12 15 -1 -3 0 -7 -11 -13 -1 17 -6 10 -11 -5 0 17 20 -7 -4 3 9 9 -2 11 3 -18 -4 6 1 2 -14 4 20 6 8 -9 10 -3 -7 -4
7841 -4 -17 -7 -10 -4 15 -3 -8 -2 -8 -12 -5 6 -4 -8 -14 -9 -21 20 -8 5 1 -1 -10 4 23 -5 7 11 7 19 12 15 5 4 16 -4 4 1 -3 -3 -1 -19
7883 -19 -14 -17 -10 -13 -4 -14 -10 -6 3 3 0 -11 0 -16 -2 7 -11 -3 10 0 -6 -14 16 9 14 -3 -10 -12 -17 5 8 8 7 -11 15 19 9 13 6 -9 9 -1 -14
7926 -14 -15 -7 8 -5 -9 -9 -6 -9 -13 -10 1 -7 9 -6 0 -23 -7 -7 -8 8 1 0 -16 -4 9 -2 1 15 1 16 21 24 -1 15 -5 -3 17 8 -4 7
7966 7 0 -13 -13 -6 7 -10 -12 -3 -7 -8 0 -1 -2 -3 4 -19 -11 -17 4 -2 5 11 10 -10 3 18 -13 17 16 5 -7 4 -7 6 -4 0 6 -2 1 3 -19 2 -7
8009 -7 8 -14 0 5 -7 3 -5 -12 -11 -2 -1 -27 -13 -2 -4 -1 -11 -8 -9 7 -8 5 -4 -8 19 0 6 2 12 18 4 10 4 20 14 8 -2 0 8 13 6 10 18
8052 18 6 -10 -11 -12 -5 -13 -1 2 -9 -11 1 -28 13 -28 -2 7 -6 -4 3 -13 1 -16 0 0 8 10 -1 9 23 26 5 14 1 13 9 28 3 20
8090 20 7 19 5 7 -7 14 -5 -12 -3 -14 -12 4 -13 -10 2 -12 -25 -2 10 -6 1 -18 -2 -16 -9 1 -10 -11 6 -14 7 6 11 8 14 -6
8126 -6 -3 1 17 8 -1 7 3 7 -8 4 24 5 10 14 -5 1 -11 -6 -5 16 0 -1 5 11 -8 -21 -2 8 -12 3 -3 -3 -10 -5 -5 7 -9 23 7 19 16
8167 16 19 21 2 2 22 11 12 16 10 10 16 2 9 -12 15 8 29 -1 -4 -3 0 3 -14 4
8191D
$$ Imaginary data points
##PAGE= N=2
##DATA TABLE= (X++(I..I)), XYDATA
0 0 0 0 0 0 0 0 0 8 -8 8 -8 16 -24 24 -32 40 -56 64 -80 96 -120 144 -168 200 -238 278 -322 372 -432 497
30 497 -568 648 -740 840 -949 1069 -1202 1350 -1510 1686 -1880 2091 -2321 2571 -2845 3145
46 3145 -3472 3830 -4221 4650 -5120 5640 -6214 6850 -7561 8359 -9262 10290 -11474
59 -11474 12863 -14506 16492 -18951 22079 -26225 32003 -40697 55453 -87365 301428 -374571
71 -374571 -410469 306099 182134 -87119 -460520 600070 -2130 -513947 241589 193782
81 193782 27873 -424306 141977 481320 -516252 -4174 225845 60487 -173383 -222208
91 -222208 500700 -168067 -311245 283134 23949 -4908 -274289 219892 204604 -415200
101 -415200 158180 103918 -26416 -101315 -76328 332986 -259700 -69562 225136 -103048
111 -103048 15992 -128537 192685 6068 -256532 249993 -46621 -48692 -11143 2705 159249
122 159249 -248178 105393 114898 -162954 72525 -45594 119007 -97850 -83135 231072
132 231072 -162857 -2468 52191 3155 30279 -163946 189734 -14826 -154019 125660
142 125660 -16552 35624 -119459 47056 149133 -208249 57873 65464 -19144 -35303 -71467
153 -71467 191614 -109040 -95681 146290 -29940 -14710 -88288 111072 53965 -193816 109387
164 109387 45551 -42717 -49736 2357 147358 -152726 -21739 129244 -52375 -23649 -46934
175 -46934 118793 -18847 -136861 131262 2011 -44765 -28459 36475 81887 -142900 40291
186 40291 82894 -63646 -10470 -13931 92731 -58638 -68252 115474 -34454 -26082 -9576 37572
198 37572 31352 -103197 65389 30488 -54344 8508 -1481 52490 -62341 -12062 75521 -52520
210 -52520 -2027 1286 24685 -978 -59407 66274 -9450 -34888 20867 -3803 23887 -45822
222 -45822 15912 34952 -48215 18732 -197 7998 -8639 -20984 46241 -31832 -6667 23858
234 23858 -13311 8818 -23123 25672 4077 -33790 30186 -5515 -2116 -4693 -53 23106 -31392
247 -31392 11562 14979 -16525 5398 -5943 18816 -12804 -12795 28868 -14018 -4851 3458 6654 3444
261 3444 -22666 19639 5843 -17917 4858 4390 7412 -16932 1216 19192 -16186 -3073 6648
274 6648 4634 -6493 -10710 18403 -3695 -14094 8252 5218 -2744 -11598 8274 9130 -14770 -222
288 -222 8592 423 -8987 -705 12341 -7013 -7227 8045 2934 -5307 -4294 8371 1899 -9584
302 -9584 3358 6854 -3896 -4744 4909 4573 -6013 -1863 7091 401 -6194 1806 6171 -2661 -4632
317 -4632 4404 3580 -4936 -830 4662 -231 -3665 595 4700 -2638 -3955 4788 836 -3852 -288
332 -288 2900 189 -4387 1555 2933 -3194 -1703 2204 1318 -3830 -502 3742 -2327 -2237 1424 1321
348 1321 -1592 -2448 3005 476 -3741 1173 2344 -1601 -2034 1895 1792 -2472 -998 2893 432 -2736
364 -2736 776 2736 -1102 -1907 2282 1654 -2498 267 2253 163 -1554 -173 3501 -1567 -1892 3154
380 3154 -363 -589 -513 1443 1094 -3347 2343 816 -1661 212 -387 2390 -3128 22 2876 -3363
396 -3363 1407 -1078 690 418 -3709 4440 -2530 -1423 2326 -2382 2371 -3543 1605 1690 -4661 4095
412 4095 -2351 638 169 -2519 5341 -5586 1833 2495 -4079 4107 -3935 3514 -151 -4217 7012
427 7012 -4882 1603 911 -1661 4564 -6777 5669 423 -4667 5591 -4316 4706 -3080 -1751
441 -1751 7835 -8517 4327 309 -1874 3655 -7139 8354 -3397 -3997 6974 -5741 4602
454 4602 -4958 1655 5431 -10907 8194 -2128 -1679 2412 -6287 10260 -8448 -899 7682 -8021
468 -8021 5310 -5563 4426 1871 -10468 11697 -5394 -723 1842 -3761 9545 -12042 4972
481 4972 5780 -9528 7021 -5535 6581 -2213 -7621 13906 -9208 1348 1955 -2010 6959 -12435
495 -12435 10005 1251 -8931 8600 -5802 7042 -5967 -2497 12974 -13461 5189 1245 -1680
508 -1680 4152 -11216 13384 -4458 -7011 9761 -6672 6237 -8130 2724 8873 -15397 9702
521 9702 -1417 -1410 1889 -8327 14477 -10548 -2438 10029 -8510 5771 -7914 6614 3337 -14058
535 -14058 13352 -4541 -753 649 -4291 12491 -13960 3879 7520 -9460 6479 -6741 8431
548 8431 -1949 -9851 15041 -8276 707 885 -1400 8483 -14157 9271 3098 -9093 7104 -5624
562 -5624 8443 -6314 -4250 13844 -11908 3604 461 -379 4608 -12393 12596 -2466 -7387
575 -7387 7993 -5431 6747 -8390 1432 9751 -13662 7080 -891 36 1318 -8836 13594
588 13594 -7786 -3599 8094 -5948 5348 -8068 5325 4639 -12323 9630 -2690 313 -373
601 -373 -4470 11509 -10662 1380 6261 -6183 4737 -6606 7241 -97 -9029 10876 -4926
614 -4926 768 -595 -1325 8006 -11023 5399 3254 -5787 4368 -5032 7342 -3956 -4674 10084
628 10084 -7343 2232 -763 158 4498 -9763 8028 -433 -4831 4424 -3986 5912 -5867 -406
642 -406 7343 -8296 3889 -1363 954 1607 -7226 8734 -3765 -2594 4196 -3613 4556 -5776
656 -5776 2425 3963 -7376 5131 -1920 1131 -150 -3901 7596 -5700 184 3227 -3161 3518
670 3518 -4933 4144 935 -5609 5814 -2729 1246 -753 -1518 5527 -6079 2493 1680 -2668 2708
685 2708 -3794 4543 -1645 -3135 5392 -3790 1791 -1168 -195 3477 -5652 3831 -99 -2062 2246
700 2246 -2952 3830 -2868 -851 3819 -4024 2276 -1480 621 1544 -4354 4290 -1661 -1085 1818 -2288
716 -2288 3084 -3083 616 2358 -3447 2420 -1494 996 380 -2632 3762 -2433 230 1236 -1679
731 -1679 2409 -2757 1680 1019 -2679 2597 -1526 1112 -157 -1432 2970 -2483 883 522 -1013 1807
747 1807 -2349 1873 -121 -1535 2218 -1877 1278 -508 -712 2020 -2374 1332 -44 -811 1203 -1787
763 -1787 1698 -712 -776 1446 -1528 1212 -913 -134 1254 -1860 1342 -613 -243 900 -1465 1350
779 1350 -777 -157 917 -1209 1068 -718 160 571 -1135 1221 -689 177 421 -876 1264 -879
795 -879 146 564 -750 1006 -792 350 453 -724 856 -633 376 144 -486 869 -755 427
811 427 107 -423 726 -788 526 2 -531 706 -611 317 -121 -270 626 -693 281 -63 -145 320 -656
830 -656 469 -257 -160 390 -593 427 -264 -46 350 -638 453 -146 -124 192 -373 464 -348 23 295 -328
850 -328 371 -354 281 140 -441 591 -317 161 161 -270 540 -428 260 213 -346 394 -273 367 -83 -269 581
871 581 -425 253 -82 -96 472 -651 434 -17 -309 441 -470 371 -223 -205 539 -613 267 -136 -36 244
891 244 -651 615 -283 -231 371 -484 528 -509 1 557 -730 464 -231 59 281 -611 707 -393
909 -393 -55 377 -433 563 -575 346 353 -760 713 -358 249 101 -578 962 -661 124 370 -465 601
928 601 -656 503 124 -641 787 -550 356 -119 -358 878 -972 497 165 -513 593 -755 730
945 730 -207 -622 894 -680 373 -271 -89 701 -1059 720 -134 -317 488 -759 914 -595 -257 903
963 903 -939 587 -384 96 495 -1072 1008 -373 -183 407 -598 936 -917 239 667 -972 815
980 815 -582 427 146 -905 1295 -796 107 384 -512 840 -1059 712 279 -928 933 -647 593
997 593 -277 -523 1276 -1204 487 161 -409 705 -1145 1048 -193 -796 1002 -773 601 -556 -100
1014 -100 993 -1386 822 -154 -253 458 -1010 1300 -787 -393 1026 -944 750 -700 341 638 -1395
1031 -1395 1213 -410 -95 284 -709 1318 -1213 227 798 -1006 866 -834 750 130 -1175 1518
1047 1518 -858 127 193 -465 1105 -1402 753 394 -957 866 -808 909 -420 -699 1448 -1223
1063 -1223 492 -47 -292 831 -1414 1149 -119 -817 938 -788 822 -715 -134 1155 -1377 795
1079 795 -213 -61 428 -1175 1462 -715 -388 918 -846 847 -885 330 746 -1376 1082 -422
1095 -422 75 179 -746 1387 -1134 138 703 -809 807 -944 767 205 -1172 1300 -691 233 28
1112 28 -448 1141 -1278 568 372 -716 703 -812 897 -338 -670 1243 -960 412 -151 -127 797
1129 797 -1319 954 -7 -607 627 -687 873 -688 -241 963 -1038 582 -359 95 377 -1077 1152
1146 1152 -509 -286 565 -626 792 -848 223 638 -1004 728 -408 266 99 -697 1101 -765
1162 -765 93 335 -476 716 -864 580 191 -799 867 -571 348 -51 -369 897 -895 359 167
1179 167 -349 477 -722 710 -178 -478 728 -642 444 -254 -132 613 -888 589 -115 -293 424 -606
1197 -606 657 -423 -141 561 -614 479 -338 125 284 -712 712 -355 -54 308 -490 626 -552
1214 -552 115 358 -563 512 -362 208 76 -421 664 -487 141 138 -325 496 -566 348 118 -434 507
1233 507 -394 227 -28 -269 491 -491 239 19 -189 337 -449 419 -125 -243 433 -406 299 -174 -71 390
1253 390 -503 345 -73 -113 239 -368 376 -222 -70 276 -336 300 -223 67 185 -401 420 -214 -33 141
1273 141 -276 385 -288 55 207 -282 265 -227 132 67 -259 339 -239 120 53 -172 308 -286 172 53 -197
1294 -197 274 -239 156 -10 -149 272 -224 113 -8 -85 207 -239 189 -34 -84 170 -236 217 -93 -83 209
1315 209 -238 178 -77 -78 166 -217 178 -88 -42 104 -183 202 -151 16 109 -194 199 -154 48 123 -194 201
1337 201 -130 23 96 -146 187 -100 27 54 -103 170 -132 110 22 -115 182 -176 88 15 -106 170 -174
1358 -174 55 43 -86 122 -137 118 -23 -57 133 -126 111 -68 -37 139 -160 121 -50 -45 108 -144 138 -52
1380 -52 -56 109 -131 112 -80 14 84 -146 137 -89 32 52 -115 156 -124 12 74 -130 143 -111 45 43 -128
1403 -128 145 -99 42 19 -84 140 -150 64 10 -98 142 -128 104 -25 -99 172 -145 88 9 -47 118 -144
1425 -144 123 -22 -55 110 -124 118 -85 -5 127 -176 136 -53 -45 94 -164 149 -97 -37 101 -127 123 -91
1447 -91 33 67 -161 136 -95 21 29 -131 169 -143 30 85 -136 139 -116 76 29 -149 180 -118 52 14
1469 14 -63 161 -177 128 25 -93 145 -137 132 -34 -97 186 -149 81 -14 -51 99 -174 131 -45 -63 95
1491 95 -133 138 -98 -19 117 -168 130 -70 6 95 -163 162 -74 -15 90 -104 135 -118 46 73 -144 149
1513 149 -105 53 9 -110 190 -142 63 82 -107 119 -121 95 23 -115 148 -100 57 -27 -65 144 -155 108
1535 108 4 -81 100 -159 137 -53 -84 161 -123 88 -56 -22 99 -164 131 -51 -14 70 -105 145 -114 18
1557 18 107 -141 137 -60 41 59 -140 179 -72 4 60 -91 135 -129 71 52 -125 125 -94 88 -14 -109
1579 -109 176 -129 46 27 -90 119 -150 102 4 -102 130 -104 87 -50 -41 150 -142 105 -5 -40 106 -138
1601 -138 145 -49 -73 123 -106 100 -66 0 107 -137 109 -41 -28 57 -101 159 -103 5 95 -106 123 -85
1623 -85 43 74 -121 128 -72 19 46 -87 109 -107 52 28 -68 102 -93 66 15 -73 155 -96 47 35 -54
1646 -54 119 -121 57 30 -63 108 -63 57 -14 -14 95 -116 68 -13 -30 64 -80 113 -18 -46 77 -82 71
1669 71 -44 -30 78 -117 58 -39 -11 27 -66 90 -60 15 49 -73 76 -59 23 46 -86 91 -36 13 19 -41 83
1694 83 -74 37 32 -49 47 -46 35 8 -58 78 -50 34 3 -34 73 -73 36 9 -48 54 -59 29 -24 -31 66 -40
1720 -40 29 -14 -6 37 -81 70 -23 -15 64 -43 41 -30 -7 51 -56 29 -18 10 37 -49 93 -36 26 23 -34 65 -25 16 20
1749 20 -41 46 -40 -6 14 -53 44 -38 17 9 -35 34 -49 13 6 -58 63 -42 17 15 -29 46 -48 25 4 -23 31 -28 31 1 -31
1780 -31 45 -47 25 -6 -9 22 -59 42 -19 -9 30 -48 21 -18 -15 28 -28 17 -33 -14 31 -41 39 -19 -8 7 -41 32 -22 0 19
1811 19 -43 44 -22 5 9 -21 42 -21 30 14 1 55 -28 28 20 -11 43 -17 19 24 -27 35 -30 -3 2 -8 31 -15 5 5 -9 18 -27
1844 -27 29 4 -13 26 -44 23 -8 3 42 -29 31 -13 -19 22 -16 33 -3 -7 33 -18 23 2 11 19 -29 40 -10 26 27 -13 18 -5 0
1877 0 15 -16 22 -6 5 -2 -24 12 -44 9 -3 -12 13 -7 10 5 -27 21 -10 17 30 -8 8 -3 12 8 0 35 -12 20 -4 -6 36 -19
1911 -19 28 4 -6 25 -6 29 -3 -9 13 -26 13 -3 -4 15 -14 -2 1 -15 3 -9 18 -11 -9 12 -9 14 0 0 7 -18 17 -18 15
1944 15 9 -5 19 -27 4 14 -6 43 -7 25 15 -1 24 -34 -4 4 -3 27 -12 3 -13 13 -4 -9 14 -6 -12 16 -27 15 -15 -12 16
1977 16 -7 5 -10 -2 -1 -19 11 -1 -13 10 -19 5 4 -2 10 -2 16 -5 5 18 -7 33 -10 -5 -1 -13 3 17 10 22 2 17 -16 4
2011 4 3 -19 23 -17 7 13 -23 18 -18 1 5 -26 13 11 28 3 0 19 -26 19 -7 -9 19 -3 18 2 -18 25 -10 18 21 1 17 -12
2045 -12 14 4 3 -4 -16 2 9 -11 10 -7 18 -16 -11 30 -29 10 1 12 20 -9 30 -16 7 7 -27 4 -9 0 -2 -3 29 7 7 14 5 20 -23
2082 -23 0 8 -7 26 -12 8 13 -5 10 2 15 -4 -6 22 -12 13 21 -16 10 -28 15 -14 -18 36 -5 12 -8 -18 20 -7 5 -6 -9 17
2116 17 -20 20 -17 12 26 -17 7 4 -8 -5 -17 6 -1 0 18 2 21 -10 7 10 -26 11 3 -13 5 -21 18 -12 11 1 -13 18 2
2149 2 -1 12 -14 2 -13 4 -1 -6 23 -20 7 1 -5 8 -25 4 2 -5 27 -15 32 11 7 26 -8 4 -11 0 15 -18 16 -8 7 -11 -14
2184 -14 2 -2 -5 -5 -8 13 4 -3 6 -6 5 -18 -1 -6 -10 33 0 -4 -6 -30 11 -13 16 -1 3 26 1 3 3 -7 26 7 3 13 3 31 -8 6
2222 6 -1 4 24 -9 13 16 5 17 -11 0 6 -10 0 -25 -1 -10 -5 5 -13 26 -8 -12 -8 5 -1 -6 1 -3 -15 25 -2 1 23 12 15 -4 -6 5
2260 5 -14 -5 13 -6 8 -5 22 4 7 14 -16 22 -11 0 -5 -11 -3 -16 6 1 0 -3 0 -8 11 -19 9 -20 1 -27 -15 8 -17 11 -16 11
2296 11 8 1 28 7 1 16 -6 8 -4 18 4 -2 13 4 13 6 -11 8 0 -5 0 -13 6 -5 12 -12 -17 -2 -2 8 9 -18 1 0 -4 2 4 2 -26
2335 -26 -13 -10 -19 -5 -6 20 9 -11 -4 7 5 -15 14 -4 5 -6 5 0 12 -6 16 0 -12 14 -1 1 -19 -17 10 -7 5 2 2 5 -16 16
2371 16 1 -7 -2 1 -8 7 -11 17 -4 7 3 -4 -1 -9 11 14 19 14 -1 12 0 9 28 -6 1 -17 1 2 -2 12 1 -1 3 -11 5 -19 11 0 -19
2410 -19 -3 -2 8 -4 -3 -13 -7 4 -5 -3 -8 -29 11 7 -3 18 7 5 11 3 18 -5 23 0 -2 21 1 2 -1 18 9 5 27 15 33 18 2 6
2448 6 -10 8 4 -4 -7 0 -12 -6 -7 -10 -17 3 -7 21 16 4 9 3 6 9 -2 3 1 0 1 -4 6 14 12 0 -8 15 7 -2 23 -14 12 7 5 -2 6 16 3 -3 0
2493 0 -24 16 3 11 3 0 18 16 6 -11 2 23 -7 -8 28 5 -7 22 4 -8 8 8 5 24 3 0 15 8 -11 11 0 11 -6 10 4 0
2529 0 10 3 15 -3 -1 7 2 2 4 6 -14 -9 28 -2 7 15 3 14 -7 -13 9 -20 25 -14 -4 -1 -9 5 3 20 -14 10 11 2 3 -5 4 9 -1 16 18
2570 18 13 10 23 3 5 13 6 4 9 1 -8 1 -25 0 -15 -12 8 -6 -1 -2 8 13 15 9 -21 0 1 3 -21 5 -4 12 18 0 31 21 9 -4 2 10 28
2611 28 11 1 29 9 10 -4 4 16 17 29 7 5 16 16 3 3 11 -1 0 20 -4 17 -5 10 -6 8 -8 -5 -7 5 12 4 5 0 1 -4 -5 9 10
2650 10 17 0 1 18 10 18 26 10 17 24 11 -6 -9 0 3 1 12 4 14 1 -8 -2 -14 -1 5 26 -16 -3 5 12 -1 -12 -15 -15 -1 13 14 10 7 -3 0 -7
2692 -7 20 2 3 14 -2 5 0 19 15 -24 21 22 29 5 -2 16 10 -4 13 -8 3 -23 21 -19 -5 -3 -9 7 -7 8 13 -3 11 3 11 15 -10 12
2730 12 11 5 3 1 -3 10 6 7 -7 30 5 -2 -2 1 6 9 -1 15 7 2 3 8 12 2 -4 1 4 16 -12 19 -9 -4 8 1 -4 -6 5 -13 3 18 -2 2 12
2773 12 -9 -12 -2 3 14 -1 10 8 5 18 -3 17 -10 -12 -17 9 11 6 13 -4 24 -5 -1 5 17 7 6 2 18 -8 -3 -5 23 4 16 -6 3 6 -9
2812 -9 -3 9 18 -8 6 12 11 9 2 -1 -8 1 3 -2 -5 7 10 12 8 10 -7 -1 8 15 20 1 20 -5 7 -4 3 -5 0 -15 -1 9 -3 4 7 2 2 -10 -3 6 -16
2857 -16 -9 6 4 6 -6 -3 -2 23 13 3 -17 14 11 2 4 10 -5 -4 2 13 -2 18 5 -13 1 7 6 1 -9 -8 -8 2 -10 -18 -17 -9 11 -3 -3 4 4
2898 4 -6 -16 -11 11 -5 0 -5 -12 14 9 0 -18 -5 -6 1 14 -2 -7 -12 8 3 -13 -13 14 16 14 6 -5 -7 -17 -18 -3 5 2 16 2 -7 -1 4 -12 -1 14
2940 14 -11 -19 -7 -15 -4 14 8 9 -3 19 -12 32 6 -1 7 14 9 -4 7 3 15 15 1 8 6 9 7 -14 14 3 11 1 -16 2 -11 -27 -7 -3
2978 -3 4 -15 -16 0 7 4 4 -6 -11 7 0 4 -6 7 9 -1 -6 -3 11 17 -9 11 -5 7 18 5 8 11 3 7 16 4 -22 8 6 -16 16 3 -24 -4
3018 -4 6 19 3 10 -14 4 2 -7 -10 5 2 -1 -10 -8 8 0 16 4 -6 12 0 4 14 -1 -16 4 -10 -21 5 3 -1 11 11 -7 -4 8 -4 -6
3056 -6 12 -11 -5 4 -1 13 -3 -2 -22 -8 -19 -1 -3 5 -5 -2 -1 7 1 -19 -11 -6 11 -5 -2 -13 -5 6 -8 -15 -3 7 4 -17 16 11 4 16 18 11 -5
3097 -5 1 7 0 0 2 -10 -2 -8 4 -7 -6 -7 -3 -7 0 -5 5 -3 8 3 5 15 13 -4 -17 -4 4 9 -16 6 -20 5 15 3 2 22 24 6 14 8 21 3
3139 3 7 10 10 -7 -7 -9 9 -8 -5 2 11 -7 2 14 3 23 -5 -15 -4 13 1 13 -5 -6 14 19 -21 13 16 6 7 -7 19 10 2 10 5 0 -4 18
3179 18 2 4 18 -5 14 21 -6 -11 15 11 10 5 8 -5 9 12 3 -1 17 -1 -8 -9 -6 1 19 -1 3 -10 -1 1 23 13 11 3 7 2 11 -1 8 11 31 19
3221 19 11 2 10 1 7 3 1 10 -2 1 -13 8 0 2 -4 -14 -10 1 -1 -3 -12 -2 0 -4 -8 -17 7 4 -1 10 3 -7 5 20 -1 5 4 -9 13 -6 9 6 2 0
3265 0 19 1 11 2 -1 -5 -9 -10 -9 -10 4 15 13 9 -4 -12 -4 -2 -1 -1 -7 3 -4 -9 7 17 -18 5 3 4 0 0 21 2 -11 35 1 -2 15 6 -3 9 -9
3308 -9 -5 -4 5 22 2 1 5 4 2 16 -2 6 3 -9 -4 1 -11 16 2 -3 -13 -33 -9 -4 8 -13 -4 -8 -9 -6 -10 -1 -8 -2 -6 -6 -14 -1 -3 7 -4 1 -2 7 -3
3353 -3 -17 6 3 11 5 -10 11 0 -2 4 -8 -18 10 7 10 -14 -6 9 14 0 -1 1 -20 2 12 17 -2 -2 1 1 -14 -3 6 9 -7 -7 4 2 14 -11
3393 -11 8 1 -10 4 0 6 -8 -11 15 3 2 -15 0 -7 25 9 -6 -4 -12 10 -9 3 11 -16 -5 1 -7 -10 -21 -1 17 -13 4 9 3 1 1 -3 0
3432 0 -2 -6 -6 -7 2 -3 2 -6 18 10 6 10 7 7 -6 -3 -5 2 -19 -17 3 -13 14 17 0 -5 -9 -6 -6 -25 0 -8 -14 -23 -11 0 -5 0 17 -14 10 4 -6 -15 2
3477 2 -6 -5 -12 -6 10 8 -3 0 -4 19 8 1 0 -1 -1 1 6 -8 4 -7 -3 -19 -8 -11 12 16 -20 -6 -15 3 -1 0 -18 8 -1 -8 -4 9 3 0 0 1 -9 -4
3521 -4 -14 -23 -7 13 5 21 4 1 -3 2 3 11 13 8 -8 2 11 8 -15 -4 8 22 -4 14 -5 -7 1 12 -2 -4 4 6 1 -28 2 4 11 -18 13 -7
3561 -7 10 -8 -3 -1 6 9 8 -6 10 15 6 15 10 16 21 -3 -14 -15 9 -10 8 25 17 -2 9 3 3 3 5 6 -17 -4 1 -14 -9 -6 -11 8 -1 -6 6 19 8
3604 8 -6 5 21 -13 5 -8 2 -1 2 8 -1 -1 2 8 -14 -7 8 9 15 4 -3 16 1 -2 -11 3 -11 10 -8 0 -12 -9 -5 1 -8 -3 2 17 0 12 6
3645 6 -8 4 -5 3 -10 -9 -3 -1 3 8 10 20 -7 7 -2 23 10 5 -9 9 -8 -2 -9 -12 -3 -10 24 -2 10 -11 2 6 15 -10 1 -8 4 4 -1 6 4 -2
3687 -2 -13 -11 -2 -11 11 4 11 13 -1 3 5 12 0 5 5 0 -11 -3 -8 -11 3 -14 2 -9 7 -22 -4 -30 7 -1 0 -2 -3 4 -19 6 -6 8 -15 4 0
3728 0 9 -17 2 1 -3 -17 -3 -4 -5 -15 1 -9 -11 9 4 5 -2 0 -2 0 2 -9 -1 5 -8 2 -8 11 10 25 -10 -4 -11 -8 9 0 6 7 -23 1 17 8
3770 8 -2 6 -3 -2 0 5 -1 -4 5 4 15 -20 -20 3 13 19 10 6 11 22 -3 12 9 -17 4 4 2 7 0 6 13 18 -11 20 -7 -5 -4 -1 -5 0 2 -9 4 0 0 -17
3816 -17 -8 -4 3 -1 -10 -1 -19 11 -4 -9 -18 0 0 -3 11 -9 0 -11 -6 -3 -2 5 -7 2 0 -10 19 7 0 12 -6 10 5 12 12 -3 -14 23 -19 6 3
3857 3 0 10 -6 -6 -4 4 -1 8 23 2 7 -4 4 -2 1 13 -1 0 -8 22 -9 1 -2 0 -11 -7 -3 12 10 4 -4 19 12 -3 12 6 12 0 20 -11 7 -13
3899 -13 13 -1 10 3 -5 1 4 1 -20 0 -17 -7 13 -19 10 11 -5 4 -4 12 15 12 5 -4 8 2 -4 4 -15 5 19 -4 14 -2 5 -5 18 3
3937 3 2 5 -12 -17 4 4 -9 2 -15 2 -3 -7 5 -11 -11 -11 20 -12 5 -10 -9 6 8 1 7 1 9 5 -26 7 9 -19 10 9 -11 3 -4 3 4 -17 5
3978 5 -2 0 7 2 22 -7 -14 8 1 8 -13 -3 -9 1 -10 -8 11 17 -5 -11 15 3 14 14 23 -4 28 22 20 26 12 -8 26 4 5 15 16 16 1 2 1
4019 1 1 -2 -3 15 1 14 -10 0 -4 -2 -12 -7 0 10 -16 -9 -11 3 -2 12 -2 9 -1 -2 8 -5 11 -13 0 -10 -9 4 16 0 -9 -9 1 16
4057 16 11 -12 4 5 3 -12 -15 -5 8 -36 -7 -1 0 -6 -2 -1 -2 10 -4 -6 -14 9 -9 2 -10 -21 -4 -6 -3 3 -10 -2 3 6 10 5 -10 -1 -1 1 -2 5 11
4100 11 14 12 9 -12 -9 6 -2 -2 0 -12 2 7 -7 -9 4 -5 2 -24 -8 1 -16 -18 3 -4 -11 4 -8 -13 7 6 -6 20 -1 2 -8 14 -4 -5 13 17
4140 17 -1 7 27 -10 0 -5 2 -5 3 20 1 -3 -5 11 16 5 7 15 7 -12 -7 9 7 1 -1 18 2 -14 -14 -11 2 -13 0 -3 -9 -8 -8 -2 2 -17 -1 2
4182 2 4 6 -9 -8 0 12 -14 -17 -7 5 7 7 -2 -12 4 -12 -6 -10 -9 1 9 15 6 -12 -10 7 15 -2 -4 11 -16 18 10 -12 -7 -8 6 11 5 0 0 0 -4 -2
4226 -2 0 8 2 -4 -4 9 11 1 -5 -8 1 -5 -4 2 -9 10 3 2 7 12 11 5 5 -21 -2 -16 -15 -1 -3 -17 10 -16 -9 -5 14 2 -20 11 16 3 0 3 -6 7
4270 7 -2 -5 8 -5 12 14 5 0 0 17 18 4 8 -1 21 -15 -12 3 11 0 -9 -10 0 -18 -5 0 15 6 -14 2 -32 -10 0 -3 -22 4 17 3 17
4309 17 -17 13 -4 9 5 -5 12 -2 -2 3 9 -15 -3 -2 1 -9 4 1 -8 1 9 -9 5 5 -5 -2 -1 -2 -1 12 -11 9 5 21 -5 2 -26 -29 4
4348 4 1 -9 -3 8 4 11 -3 1 -16 12 -10 6 22 0 6 4 -10 6 16 -8 11 11 3 -5 -8 -10 0 1 -13 1 17 -11 -4 -10 -3 17 -14 -7 -16 -27
4388 -27 -15 -8 -8 -15 -1 17 -13 -10 -1 -12 -3 -5 -14 1 -6 7 2 -2 -7 -18 17 10 7 -4 -9 -34 7 4 -15 -7 -28 2 -5 4 1 -24 1 -9 -8 2 4
4429 4 -2 -3 0 -8 2 7 -4 -2 8 -3 -4 13 0 -2 6 2 -4 -6 4 2 -8 8 -4 -12 6 2 10 15 2 -1 -7 -4 -12 1 1 0 -12 -9 2 12 -13 -2 1
4472 1 -14 3 -1 -6 -6 1 -15 -1 4 2 14 16 5 -5 -3 -13 -3 -8 -11 12 -14 -2 2 -10 5 6 -14 7 -11 -7 7 -4 -8 2 -3 3 -8 8 -6
4511 -6 -6 3 4 5 -24 -6 13 -22 5 -16 11 -1 2 12 0 -6 -27 -14 14 -10 -2 -13 13 10 -15 -12 -12 3 -14 8 2 3 0 5 5 1 -18 9 3
4550 3 -9 -5 8 10 -18 3 -6 -11 -17 9 3 11 -13 -1 1 -10 -19 -12 5 -1 0 -11 -15 0 -2 2 -2 -3 2 2 7 10 14 3 -2 -5 0 7 0 -9 -7 -13 9 -6 3 -2 -21
4597 -21 -2 -1 -13 -15 -6 7 -10 10 -4 13 -11 8 3 -4 -4 15 2 5 -1 -9 12 -16 13 -6 -2 1 7 7 30 15 6 7 3 8 12 -8 4 7 -14 1
4637 1 -11 -15 -18 9 -5 -11 -17 -7 -14 -18 2 -10 -7 -8 0 -7 -4 1 3 19 -3 -21 1 8 4 1 -1 28 -5 5 19 6 4 -21 1 -10 -3 -13 1 -1 -11
4678 -11 -17 -1 0 -2 10 -6 11 12 7 -3 -7 -4 -4 -6 -11 -6 4 4 2 8 2 3 5 21 -20 -2 0 13 -3 -3 -14 7 -4 28 4 13 2 3 8 15 -9 16
4720 16 15 -5 6 -7 0 -2 7 14 -10 -13 -3 14 -8 1 -12 6 10 2 -21 4 23 -12 21 -6 -5 -5 24 6 10 6 0 11 3 -5 -2 -4 2 23 22 13 4
4761 4 -8 -4 -11 7 -26 0 3 9 -11 -19 -11 -12 -1 -6 10 -7 -6 10 18 12 10 5 7 0 -17 0 8 6 -11 16 -3 7 1 7 4 7 -14 12 -15 9 -13
4802 -13 14 5 -15 -7 10 19 -19 11 8 14 0 1 7 4 -8 -10 12 -4 -13 0 0 14 -4 -2 15 -14 8 10 -2 7 -3 5 12 -21 14 14 -11 1 24
4841 24 1 10 -1 10 5 9 22 9 13 0 10 -18 6 -10 1 -2 2 -2 -8 -4 2 4 -7 -3 5 8 -8 10 1 -1 6 11 8 17 19 12 0 2 6 -6 1 11 5
4884 5 19 -4 19 3 4 -9 6 -3 -1 -2 -3 12 -1 5 19 4 -6 9 -8 -15 5 -10 4 12 0 -14 -7 -11 11 -24 -6 -1 -6 18 1 -8 8
4921 8 -2 0 -2 6 -3 6 0 0 3 11 5 -5 -5 4 -10 8 4 0 9 0 -3 -4 10 -5 11 8 -8 -24 -5 -8 -8 -8 6 -14 -5 -6 6 -3 2 -4 0 -7 5 -16 -1
4966 -1 11 -12 3 6 1 12 10 4 7 -10 5 9 -5 -5 13 -13 4 1 1 -2 9 -7 -4 -14 -8 13 -5 -10 6 -15 -21 -8 -5 -14 -4 -5 -6 2 7 2 0 -3
5008 -3 11 -7 1 -4 -14 3 -7 -3 16 -4 -3 1 -1 0 3 -1 3 -12 -1 -18 6 5 -3 -8 -2 7 -11 -14 -13 -6 -1 -3 5 8 8 5 5 10 -13 -4 -4 0 7 6 0 11 -2
5055 -2 1 -12 18 -15 2 -1 9 -13 -7 11 -2 -12 25 15 5 20 1 1 -3 -9 -5 -15 -5 5 13 -12 0 -1 9 10 -1 2 -22 -6 3 15 7
5092 7 4 -11 7 -3 -7 -7 -8 1 1 -4 -6 0 20 7 8 10 -2 -7 -4 19 -2 2 -8 -1 8 -1 -12 7 -18 -9 -9 12 -7 -2 -4 0 -1 -3 12 -7 -17 -21 -6
5135 -6 -8 -11 -13 3 -11 -12 2 4 2 -9 9 -6 2 12 -3 0 16 -9 2 -5 0 3 9 -12 -4 7 3 3 -8 -13 5 -3 -3 -8 -15 4 2 14 -21 1 5 7
5177 7 2 -8 -13 -16 17 9 -12 -1 -4 -5 3 -5 0 -13 7 6 -10 -17 -2 -6 2 -20 -1 15 -11 -7 9 5 -20 11 13 3 -8 -8 -11 8 -11 -6 11 1
5217 1 -6 -12 7 -17 0 3 1 -5 -11 -2 18 -1 2 8 1 8 0 15 2 0 8 4 -10 -12 -11 -2 17 7 -9 6 -20 7 1 1 -11 0 31 1 2 0 -8 -6 -9
5260 -9 -10 -8 -3 -12 1 -2 -8 3 -3 6 -1 4 -21 7 7 -16 -6 4 -3 -10 -3 -23 2 -10 -3 -18 -11 1 13 2 -11 9 2 -1 -16 3 0 -7 -3 -11 5 1
5302 1 -12 -1 -22 -20 10 -1 0 -22 -13 3 -15 -2 7 12 -6 0 -1 14 -8 9 14 17 23 11 -20 -6 15 -7 -2 -6 -4 -15 -2 -3 -20 4 5 15
5340 15 0 -3 6 -6 -3 4 -9 -13 11 -19 -3 -13 -9 11 11 0 -14 8 -23 -4 15 1 6 -4 7 -5 -13 4 13 12 11 -14 16 13 -11 2 -27
5377 -27 -3 -8 13 5 -1 -5 -17 3 -1 7 -15 1 -6 27 -4 -4 5 11 -14 -1 -1 -6 -21 -2 6 6 -14 3 -12 1 7 2 11 -3 -2 4 13 -14 14 -10
5417 -10 6 -7 -19 -4 -1 -9 -16 -5 9 -3 -1 -2 4 -16 -13 1 -14 -8 -5 -23 -12 -4 8 -9 -6 8 6 15 -5 7 7 -4 5 -7 10 -3 7 -14
5455 -14 -3 10 8 -18 5 13 -7 1 -6 -1 16 -10 -6 31 -12 -8 -2 -8 2 -20 -2 -11 -10 -4 -18 -8 -3 -11 -6 -9 -15 -12 -5 4 -11 -8 -3 7 -2 20 13 -8
5497 -8 -6 0 -6 5 -5 2 -5 -2 12 -5 3 -3 -1 -11 -8 -7 -6 1 -20 -7 6 1 9 3 6 0 0 -6 -9 18 -4 4 8 2 15 -12 -2 -4 14 0 8 -5 -3 3 2
5542 2 -12 -20 -10 -1 5 0 -14 -14 12 -15 3 -21 -22 5 -9 0 -9 0 1 1 15 10 -5 13 -9 0 -4 6 -8 -11 -12 8 -1 6 -6 1 -9 1 10 -6 10
5583 10 7 -9 4 2 -7 -6 11 -10 -3 8 2 -4 25 5 -18 19 -7 1 -2 9 -13 -3 -13 -4 0 -10 0 9 -9 -12 7 -3 -8 4 -7 -13 -3 16
5621 16 0 17 6 26 -12 -11 1 9 17 8 -1 -10 21 -3 13 1 2 14 16 -6 0 -2 -8 6 0 -6 -9 10 8 0 0 7 11 -5 -22 15 5 4 3 -3 15
5662 15 -5 -2 17 -11 -6 -12 -12 6 -10 -7 12 -15 -4 -1 8 2 -9 10 3 -6 10 10 -13 14 4 -11 -3 -5 -11 -2 2 -20 11 -16 -3 1 -8 -16 0 -12
5702 -12 -5 4 1 -2 4 1 1 0 7 -8 -9 -4 -6 2 8 3 0 -8 11 -10 -2 -8 9 0 0 14 -2 -6 3 -9 -6 9 14 -3 -7 -7 -3 -3 8 -5 8 -9 8 -7 -11
5747 -11 -13 -22 24 3 11 -2 2 13 3 -22 -9 7 -5 -9 2 2 7 -5 -10 4 -5 -2 -1 -8 7 13 14 3 9 14 -16 -25 0 2 -3 -14 -12 3 -10 -6 3
5788 3 -1 -4 -16 -5 1 1 7 -5 3 -8 -4 -1 9 -16 -14 -4 3 -13 6 7 -11 -7 -8 -11 18 14 7 -5 5 -4 -7 -11 -1 7 -6 -3 6 -6 -12 12 0 -2 -18
5831 -18 -16 7 3 -6 3 9 4 -2 -8 3 -11 -7 2 10 4 -4 3 -1 -13 4 2 9 -12 1 12 1 4 21 1 -3 6 7 -10 -3 -10 -2 -3 -5 -5 -5 -1 2 -7 -5 -9 -3 -1 -14
5879 -14 2 -19 -8 -11 -11 -22 -7 -13 4 -13 -10 -9 6 3 10 12 -7 0 5 -1 3 5 0 -6 -8 11 -3 1 1 4 0 28 -7 6 0 -3 3 -3 -5 11 -13 0 5
5922 5 -8 -6 -6 -7 9 0 -15 8 -1 -8 5 -6 -3 -14 3 1 13 -17 -15 2 -9 3 -12 -9 3 -2 -11 -1 1 -5 -4 8 3 -3 10 9 7 -3 10 -24
5962 -24 -2 0 1 -7 4 -3 0 -18 0 -2 -7 0 2 -1 -3 -6 1 14 2 5 -24 -5 5 11 -16 -23 -11 0 11 7 1 -6 5 8 -8 12 10 5 -5 -3 14 -2
6004 -2 -3 7 -1 -12 -2 -3 0 3 -12 1 -7 -7 9 2 17 5 9 4 10 17 0 3 -10 -9 6 -4 13 13 -14 0 5 6 -1 2 -6 13 0 3 8 7 3 -6 -4 17
6048 17 5 7 -6 -10 -13 14 1 -6 23 5 7 -8 -22 -17 -1 4 5 1 -10 2 8 15 7 9 -3 -1 -8 8 -3 -12 -6 -6 5 10 12 -1 -17 -1 15 -8
6088 -8 9 -7 -8 -1 -19 -9 -8 -7 17 -7 -1 -6 -8 13 -17 11 1 -14 7 -2 -2 -5 7 -9 2 1 5 -5 4 8 -3 2 -7 16 2 -12 -4 6 4 1
6128 1 11 6 -16 -4 -2 -10 -1 6 -2 -9 1 -5 -15 1 16 7 -1 6 -6 11 10 5 -6 -11 1 -6 15 8 12 -3 4 -2 2 4 -5 14 -7 3 -10 8 7 10 -8
6171 -8 11 -14 8 6 9 -10 -2 -18 -11 -2 -8 -4 12 2 4 -2 -12 5 -10 4 7 -5 0 2 1 2 -2 6 -6 15 -1 17 8 -2 20 -3 -6 22 19 6
6211 6 -2 14 16 17 6 1 3 -19 -1 -3 16 -5 -9 -8 -7 -15 5 0 -11 -12 -8 15 -10 7 -3 5 21 -7 13 14 10 -5 4 -1 6 -2 7 1 3 3 -9 -14 5
6254 5 7 1 4 12 2 16 13 20 -12 7 9 4 -4 10 -5 2 -1 -2 0 3 7 4 5 6 0 -1 3 3 0 13 -10 10 -11 11 3 1 0 0 7 -6 -2 11 15 10 4 2 19
6301 19 -10 11 21 10 -1 -6 -4 -15 -25 -4 -21 -10 -13 -11 -3 -5 -2 -15 -8 2 -5 11 15 1 -1 0 0 1 3 -8 -8 3 4 3 0 8 10 14 -16 -5 -17
6342 -17 -17 -9 -8 -2 -1 -2 6 1 0 -15 2 -2 -5 4 -3 -8 3 -4 1 -3 14 1 6 -16 -4 8 17 -4 3 10 -1 -7 0 4 5 22 5 -6 -3 -9 -5 -20 0 -9 -5
6387 -5 8 10 -2 8 9 5 3 5 9 -11 -10 -18 -5 -7 -5 6 -2 8 -8 6 -21 1 -1 5 2 -4 -5 -3 3 -6 -8 -3 -16 5 -7 -9 9 20 -2 -12 -4 -25
6429 -25 2 3 9 9 -9 -5 1 -8 -10 -9 -9 -5 -4 6 -3 -12 13 2 11 8 -15 3 -6 -6 -3 -4 -9 20 15 -3 11 1 14 14 16 8 3 10 12 0 -21 9 5 3 4
6474 4 -1 11 -3 -10 -7 -12 -16 -22 -24 -14 -7 -1 -4 4 -17 -2 -1 -14 7 4 -12 -6 9 -1 10 20 -12 -2 -13 -6 9 -17 10 1 8 -4 7 -13 1
6513 1 -21 4 6 0 18 -1 -3 -11 -5 3 6 0 10 -1 0 -16 9 -1 -12 -3 -7 0 -10 -2 16 -3 6 12 -8 -19 -11 -2 -5 -8 10 1 -1 -3 6 0 1 -15 6
6556 6 9 3 2 -16 21 13 8 -13 -12 3 1 -9 3 6 -17 -15 -9 -2 -16 -27 -4 19 0 -2 -10 2 -6 -33 -17 -10 2 5 -5 8 7 -9 10 10 -7 -18
6596 -18 -1 -7 7 11 -5 5 -11 1 7 -7 -4 -9 -5 3 -14 -10 -7 -10 -13 3 -11 -15 2 1 -19 4 17 -2 -9 -8 -25 6 2 -6 0 -10 5 -9 3
6635 3 -5 8 3 13 4 -2 6 -7 -8 5 14 24 26 2 5 3 1 2 -18 -1 6 -12 -7 2 5 7 -2 0 -13 1 2 -4 12 -3 -2 3 16 -1 -3 2 3 -3 8 3 -2
6680 -2 12 6 -5 3 1 7 10 1 -2 -3 18 17 -4 3 -9 -5 8 6 -11 -5 8 1 -4 -10 -11 3 -17 1 -6 -3 9 -13 -2 -8 -6 -24 -1 4 1 9 -1 -12 -8
6723 -8 -8 -3 1 22 4 -8 -5 7 14 15 0 4 1 1 -7 -8 -1 11 16 -5 4 -2 11 9 11 -2 1 -11 -6 7 -2 5 -11 -7 -5 1 5 -12 2 1 7 -23 2 4 1
6768 1 1 -14 6 -1 -7 0 4 -3 -2 -5 6 -4 -11 -14 -5 -6 -21 2 -7 7 7 -9 8 10 -12 -21 -5 -11 -9 3 -15 -15 -5 -5 -13 -5 7 5 -7 20 3 12 10
6811 10 5 13 15 9 -17 -4 4 -18 18 2 3 -6 -2 12 17 10 -3 -5 -13 8 -9 11 -11 -13 -9 4 0 -4 -12 -8 -2 3 12 4 -3 -10 3 2 9 7 -2 5 7 0 3 -4 6
6858 6 2 -1 8 6 -7 6 17 6 9 -4 -6 -2 -3 -13 14 16 -12 -7 -5 -12 -6 17 5 6 -16 6 4 -6 -9 1 -5 14 -4 2 2 5 1 -5 -3 -8 -1 -9 0 6 5
6903 5 23 14 -15 6 9 -1 -7 -3 22 -14 9 -5 7 -13 -16 -17 -21 -13 1 -10 -15 8 1 -1 -1 -16 10 -1 7 -10 3 1 -7 -4 2 24 3 -7 0 1
6943 1 12 1 -2 1 -7 4 1 4 15 -10 3 -4 7 12 10 2 -8 -10 5 -3 -8 -2 2 1 -12 3 -8 -8 14 -14 2 -8 -17 -9 0 14 13 2 -4 6 -11
6984 -11 13 11 9 3 0 -5 5 0 -4 -8 1 -2 -10 -2 -4 -7 6 1 7 8 -1 16 -23 4 13 2 -22 -7 -3 -13 -25 -10 0 -6 -19 -4 -9 -19 -2 0 -13 -9
7026 -9 -20 1 -11 1 11 4 8 -1 3 -3 -2 -1 -3 -1 4 8 12 1 0 -1 -5 4 -6 -18 -17 0 -1 7 -4 0 -1 -11 5 0 8 -20 13 -11 -7 1 0 2 14 3
7070 3 8 -8 -11 8 0 11 -5 -12 -14 -5 11 2 14 2 -4 -4 3 -9 10 -9 -12 -4 -2 7 -12 3 -6 10 -3 -5 -9 -18 -15 9 -3 0 -5 -2 -11 7 0 4 4 -4
7114 -4 17 13 3 -14 5 4 12 3 19 -6 6 4 -12 9 0 3 -7 -5 -8 -6 3 5 -2 13 -6 16 -9 -11 9 -3 -17 -5 -8 10 -6 11 5 -4 2 0
7154 0 0 6 4 7 11 7 17 -23 8 -5 3 1 19 -5 1 -2 25 4 -1 8 -5 8 9 7 -8 3 -1 -9 9 -1 7 2 -3 -7 14 -9 -6 12 4 0 5 -8 -4
7197 -4 5 -3 -3 -2 -17 -10 -3 -10 6 -22 9 4 5 -1 11 6 -3 7 6 -22 4 -10 8 1 -11 -5 9 -10 7 -6 -1 8 -10 -2 3 -6 -24 3 -6 -1 4 -19
7239 -19 14 -15 5 -2 -13 10 3 11 -20 -10 0 10 9 4 1 -10 9 2 20 -1 -15 -1 3 11 11 -19 -8 4 -1 0 9 6 -16 -3 -5 -8 -5 -3 -2 -4
7279 -4 17 26 -15 -6 9 -14 0 -9 2 4 13 3 -1 -11 -1 0 0 5 -3 8 -7 -4 13 -5 14 5 -9 -2 -11 -14 7 -2 -12 7 -10 -4 -5 -13 1 -7 -7
7320 -7 -4 0 -4 -10 23 0 9 8 6 1 15 10 5 0 -5 -14 -1 -5 -14 17 6 -6 10 9 23 -3 16 5 2 11 8 -5 -12 1 -11 7 15 -6 -9 -9 -3 -1 -17
7363 -17 5 5 12 -9 -12 -2 12 -6 -4 18 2 -2 2 -9 -6 3 3 18 -5 -1 -1 11 22 15 7 -4 6 5 9 -16 -13 11 11 -8 3 0 -1 6 -4 -2 -18
7404 -18 -2 -10 0 -22 -12 5 3 11 3 3 -1 -10 -11 4 6 3 -10 -1 10 4 5 -10 -22 0 2 18 14 0 0 -6 -5 -9 6 -7 -15 -1 10 -10 5 1 -8
7445 -8 4 0 -5 0 -3 0 -7 0 3 7 -1 -4 6 3 5 6 -4 -13 5 13 -11 2 5 -2 12 12 9 5 3 -9 10 -3 -2 -7 6 6 0 13 -10 15 -4 3 -1 13 3
7490 3 -3 20 -3 1 6 4 -8 22 -17 -3 15 -12 14 -3 3 -6 10 1 -10 9 5 5 2 0 -10 26 17 5 5 26 18 9 8 -8 4 -2 -13 -5 9 -11
7530 -11 -5 0 4 5 -8 -5 -3 -9 -14 -6 -11 -2 8 2 -9 22 16 -5 11 6 -3 -11 0 2 5 5 15 -4 -5 -2 -6 -3 -2 -6 -11 11 -5 6 2 -18 -20 -19 3 -12 -13
7575 -13 -3 -9 -10 -4 2 -23 -8 -18 1 -7 8 -12 -29 -6 10 -3 -2 -7 -7 -2 -6 -8 -3 -2 -12 17 -14 -13 -9 -13 7 -15 -17 -5 1 -3 1 4 -9 0 0 -4
7617 -4 -4 6 12 10 -10 2 4 22 -9 -9 5 7 -2 1 -5 -1 7 11 -13 4 1 6 3 8 -9 5 -5 -5 7 16 2 -4 16 -11 1 5 6 -1 2 -4 -12 -11 -11 -2 1
7662 1 -9 6 -9 -22 -12 5 0 6 -6 -4 -1 -20 -6 -4 -8 5 13 6 -10 5 15 7 -5 -7 7 11 -1 8 27 14 9 -1 -13 1 3 5 6 5 -10
7701 -10 3 17 8 -1 4 -9 -6 -16 -8 -8 -12 1 -7 -1 0 11 -3 -5 -4 -9 -8 -16 -7 -11 -4 9 -3 2 -4 18 -3 4 12 0 -8 -6 -20 -12 -11 5 -8 -2 -10 -25
7745 -25 -2 -4 -9 -11 -1 -1 -19 7 -28 -5 -9 -3 2 -8 -2 -12 -3 -1 -3 7 -2 -17 -11 -4 0 5 -3 4 -6 5 15 10 11 -8 12 10 -10 -13 -4 -8 5 -7
7787 -7 -5 -3 11 4 0 -17 -12 1 4 -16 -2 -17 -21 -10 -17 -11 -3 -2 -6 0 -3 12 10 7 8 -3 11 9 -9 5 11 15 9 2 10 12 2 5 15 8 1 1 2 23 7
7832 7 2 -3 3 -3 4 1 -20 -27 -15 -4 7 -8 3 7 3 3 -2 -7 5 8 5 4 -7 12 14 2 2 14 10 1 11 6 -2 -11 27 -2 7 0 20 -1 8 5 10 16 9
7877 9 -3 -18 6 13 -17 4 -8 -9 0 2 16 0 -12 7 14 -3 7 4 3 6 -13 -22 -8 -8 0 -8 20 4 14 8 13 10 6 13 -4 -5 6 12 3 0 3 -3
7919 -3 -2 5 -1 10 -8 -23 -3 -11 -11 4 -8 -2 -27 2 2 10 5 2 -18 3 -7 -14 5 -2 -3 -13 -3 -5 -18 -6 4 -2 -6 18 7 -1 8 6 -10 16
7959 16 9 -7 6 3 -10 6 -19 2 -10 -10 -7 -4 10 -5 6 0 -14 -11 16 -19 0 7 2 5 0 5 -4 9 -16 -2 5 2 13 18 -2 2 6 -13 -2
7998 -2 7 14 -14 4 4 9 13 2 -2 -1 14 5 -3 2 13 -3 -3 11 -10 -5 -10 -7 -1 -1 19 -4 10 -2 7 0 -11 -11 -5 0 -6 -5 -2 3 5 10 -10 15 5 13 -1
8043 -1 -2 -2 11 20 -4 -10 -20 15 3 0 0 -2 10 5 -5 -18 -2 -2 -4 9 12 4 -12 3 -5 -31 -4 9 -12 1 0 -4 -4 -23 4 -5 -3 11 2 2 -3
8084 -3 -7 -4 3 19 12 -1 -2 4 9 -7 9 8 6 -13 -5 -5 5 -4 7 7 -11 -8 -1 1 -1 -8 -15 -12 -13 -6 1 7 1 -6 -12 21 6 -15 -4 6 3 -23 6 16 4
8129 4 2 1 0 14 -21 -3 -8 -1 -5 -2 11 -8 7 6 -2 0 -4 -15 17 1 -8 -5 -9 0 -23 -22 -15 0 -10 -7 -14 -15 8 -9 5 15 5 9 4 -1 -7 5 12
8172 12 8 15 4 11 9 9 -4 -13 4 -6 -12 4 -8 -13 0 -11 -10 3 -2
8191b
##END NTUPLES=NMR FID
##END=
