##TITLE=1H_ES-TMMOS-2
 CDCl3
 8 sc, 
 10.4.2023
##JCAMPDX= 6.0         $$ Bruker NMR JCAMP-DX V2.0
##DATA TYPE= NMR FID
##DATA CLASS= NTUPLES
##ORIGIN= UXNMR, Bruker Analytische Messtechnik GmbH
##OWNER= root
$$ XWIN-NMR		Version 3.5
$$ Mon Apr 10 13:53:15 2023 Russian Standard Time (UT+4h)  she@DPX200
##.OBSERVE FREQUENCY= 200.13135
##.OBSERVE NUCLEUS= ^1H
##.DELAY= (6, 6)
##.ACQUISITION MODE= SIMULTANEOUS
##.ACQUISITION SCHEME= undefined
##.AVERAGES= 8
##.DIGITISER RES= 18
##SPECTROMETER/DATA SYSTEM= spect
##.PULSE SEQUENCE= zg30
##.SOLVENT NAME= CDCl3
##.SHIFT REFERENCE= (INTERNAL, CDCl3, 0, 15.7039)
##AUDIT TRAIL= $$ (NUMBER, WHEN, WHO, WHERE, WHAT)
$$ ##TITLE= Audit trail, XWIN-NMR		Version 3.5
$$ ##JCAMPDX= 5.01
$$ ##ORIGIN= Bruker BioSpin GmbH
$$ ##OWNER= she
$$ F:/spectra/data/she/nmr/H-F/1/audita.txt
$$ ##AUDIT TRAIL=  $$ (NUMBER, WHEN, WHO, WHERE, WHAT)
(   1,<2023-04-10 13:51:23.43 +0400>,<she>,<DPX200>,
      <created by zg, POWCHK disabled, PULCHK disabled
       configuration hash MD5:
       00 E9 B6 7A A2 85 ED C7 34 08 36 98 17 FE 4E 26
       data hash MD5: 16K
       BC 7C D3 07 9B 29 A4 7F 15 69 74 60 65 33 1F 0E>)
$$ ##END=
$$ 
$$ hash MD5
$$ BA B7 DE 0A 2D 31 6B 9C C9 6C 48 93 1F C5 E4 19
##$RELAX= 
##$RELAX= 
##$RELAX= 
##$RELAX= 
##$RELAX= 
##$RELAX= 
$$ Bruker specific parameters
$$ --------------------------
##$DU= <F:/spectra>
##$EXPNO= 1
##$NAME= <H-F>
##$PROCNO= 1
##$TYPE= <nmr>
##$USER= <she>
##$AMP= (0..31)
100 100 100 100 100 100 100 100 100 100 100 100 100 100 100 100 100 100 
100 100 100 100 100 100 100 100 100 100 100 100 100 100 
##$AQSEQ= 0
##$AQ_mod= 1
##$AUNM= <au_zg>
##$AUTOPOS= <>
##$BF1= 200.13
##$BF2= 200.13
##$BF3= 200.13
##$BF4= 200.13
##$BF5= 200.13
##$BF6= 200.13
##$BF7= 200.13
##$BF8= 200.13
##$BYTORDA= 1
##$CFDGTYP= 0
##$CFRGTYP= 5
##$CHEMSTR= <none>
##$CNST= (0..31)
1 1 145 1 1 1 1 1 1 1 1 1 1 1 1 1 1 1 1 1 1 1 1 1 1 1 1 1 1 1 1 1 
##$CPDPRG= <>
##$CPDPRG1= <>
##$CPDPRG2= <>
##$CPDPRG3= <>
##$CPDPRG4= <mlev>
##$CPDPRG5= <mlev>
##$CPDPRG6= <mlev>
##$CPDPRG7= <mlev>
##$CPDPRG8= <mlev>
##$CPDPRGB= <>
##$CPDPRGT= <>
##$D= (0..31)
0 1.2 0 0 0 0 0 0 0 0.06 0 0.03 0 0 0 0 0.0002 0 0 0 0 0 0 0 0 0 0 0 0 
0 0 0 
##$DATE= 1681120282
##$DBL= (0..7)
120 120 120 120 120 120 120 120 
##$DBP= (0..7)
150 150 150 150 150 150 150 150 
##$DBP07= 0
##$DBPNAM0= <>
##$DBPNAM1= <>
##$DBPNAM2= <>
##$DBPNAM3= <>
##$DBPNAM4= <>
##$DBPNAM5= <>
##$DBPNAM6= <>
##$DBPNAM7= <>
##$DBPOAL= (0..7)
0.5 0.5 0.5 0.5 0.5 0.5 0.5 0.5 
##$DBPOFFS= (0..7)
0 0 0 0 0 0 0 0 
##$DE= 6
##$DECBNUC= <off>
##$DECIM= 32
##$DECNUC= <off>
##$DECSTAT= 4
##$DIGMOD= 1
##$DIGTYP= 9
##$DL= (0..7)
0 120 120 120 120 120 120 120 
##$DP= (0..7)
150 150 150 150 150 150 150 150 
##$DP07= 0
##$DPNAME0= <>
##$DPNAME1= <>
##$DPNAME2= <>
##$DPNAME3= <>
##$DPNAME4= <>
##$DPNAME5= <>
##$DPNAME6= <>
##$DPNAME7= <>
##$DPOAL= (0..7)
0.5 0.5 0.5 0.5 0.5 0.5 0.5 0.5 
##$DPOFFS= (0..7)
0 0 0 0 0 0 0 0 
##$DQDMODE= 0
##$DR= 18
##$DS= 0
##$DSLIST= <SSSSSSSSSSSSSSS>
$$ [...]
##$SUBNAM2= <"">
##$SUBNAM3= <"">
##$SUBNAM4= <"">
##$SUBNAM5= <"">
##$SUBNAM6= <"">
##$SUBNAM7= <"">
##$SUBNAM8= <"">
##$SUBNAM9= <"">
##$SW= 18.05172834244
##$SWIBOX= (0..15)
0 0 2 0 0 0 0 0 0 0 0 0 0 0 0 0 
##$SW_h= 3612.71676300578
##$TD= 16384
##$TD0= 1
##$TE= 0
##$TE2= 300
##$TE3= 300
##$TEG= 300
##$TL= (0..7)
0 120 120 120 120 120 120 120 
##$TP= (0..7)
150 150 150 150 150 150 150 150 
##$TP07= 0
##$TPNAME0= <>
##$TPNAME1= <>
##$TPNAME2= <>
##$TPNAME3= <>
##$TPNAME4= <>
##$TPNAME5= <>
##$TPNAME6= <>
##$TPNAME7= <>
##$TPOAL= (0..7)
0.5 0.5 0.5 0.5 0.5 0.5 0.5 0.5 
##$TPOFFS= (0..7)
0 0 0 0 0 0 0 0 
##$TUNHIN= 0
##$TUNHOUT= 0
##$TUNXOUT= 0
##$USERA1= <user>
##$USERA2= <user>
##$USERA3= <user>
##$USERA4= <user>
##$USERA5= <user>
##$V9= 5
##$VALIST= <valist>
##$VCLIST= <CCCCCCCCCCCCCCC>
##$VD= 0
##$VDLIST= <DDDDDDDDDDDDDDD>
##$VPLIST= <PPPPPPPPPPPPPPP>
##$VTLIST= <TTTTTTTTTTTTTTT>
##$WBST= 1024
##$WBSW= 4
##$XGAIN= (0..3)
0 0 0 0 
##$XL= 0
##$YL= 0
##$YMAX_a= 268152
##$YMIN_a= -243123
##$ZGOPTNS= <>
##$ZL1= 120
##$ZL2= 120
##$ZL3= 120
##$ZL4= 120
##$ABSF1= 10
##$ABSF2= 0
##$ABSG= 5
##$ABSL= 3
##$ALPHA= 0
##$AQORDER= 0
##$ASSFAC= 0
##$ASSFACI= 0
##$ASSFACX= 0
##$ASSWID= 0
##$AUNMP= <proc_1d>
##$AZFE= 0.1
##$AZFW= 0.1
##$BCFW= 1
##$BC_mod= 2
##$BYTORDP= 1
##$COROFFS= 0
##$CY= 11.3945322036743
##$DATMOD= 1
##$DC= 2
##$DFILT= <>
##$DTYPP= 0
##$F1P= 2.36226072786647
##$F2P= -0.459571619588291
##$FCOR= 0.5
##$FTSIZE= 0
##$FT_mod= 4
##$GAMMA= 1
##$GB= 0.15
##$INTBC= 1
##$INTSCL= 1
##$ISEN= 128
##$LB= 0.24
##$LEV0= 0
##$LPBIN= 0
##$MAXI= 10000
##$MC2= 0
##$MEAN= 0
##$ME_mod= 0
##$MI= 1.114404
##$NCOEF= 0
##$NC_proc= 0
##$NLEV= 6
##$NOISF1= 3.799351
##$NOISF2= 2.8
##$NSP= 1
##$NTH_PI= 0
##$NZP= 0
##$OFFSET= 15.70392
##$PC= 1
##$PHC0= -19381.34
##$PHC1= 11.0008
##$PH_mod= 1
##$PKNL= yes
##$PPARMOD= 0
##$PSCAL= 0
##$PSIGN= 0
##$REVERSE= no
##$SF= 200.130013532006
##$SI= 16384
##$SIGF1= 3
##$SIGF2= 2
##$SINO= 400
##$SIOLD= 16384
##$SREGLST= <1H.CDCl3>
##$SSB= 0
##$STSI= 0
##$STSR= 0
##$SW_p= 3612.71676300578
##$SYMM= 0
##$S_DEV= 0
##$TDeff= 0
##$TDoff= 0
##$TI= <>
##$TILT= no
##$TM1= 0
##$TM2= 0
##$TOPLEV= 0
##$USERP1= <user>
##$USERP2= <user>
##$USERP3= <user>
##$USERP4= <user>
##$USERP5= <user>
##$WDW= 1
##$XDIM= 8192
##$YMAX_p= 0
##$YMIN_p= 0
$$ End of Bruker specific parameters
$$ ---------------------------------
##NTUPLES= NMR FID
##VAR_NAME=  TIME,          FID/REAL,        FID/IMAG
##SYMBOL=    X,             R,               I
##VAR_TYPE=  INDEPENDENT,   DEPENDENT,       DEPENDENT
##VAR_FORM=  AFFN,          ASDF,            ASDF
##VAR_DIM=   8192,          8192,            8192
##UNITS=     SECONDS,       ARBITRARY UNITS, ARBITRARY UNITS
##FACTOR=    0.0002768,     1,               1
##FIRST=     0,             0,               0
##LAST=      2.2672688,     0,               0
##MIN=       0,             -243123,         0
##MAX=       2.2672688,     268152,          0
$$ Real data points
##PAGE= N=1
##DATA TABLE= (X++(R..R)), XYDATA
$$ [...]
2598c450N172l702L891J271p384M520l38j061N681o561n53M228l787N048j244
2613A731o032N476j839O86M145p396J819K765l166N534l639l972N640k924K342
2628A170K102p304L809J054k032N249n468j675N080l486L704j13o445N152o02
2643A95o24M349o642O81L936l396M513k357m823N729j958Q97K817p029K845K427
2659A560k846M711m270k683N612k932K229Q80o472M542O88j783M229n687l32M838
2675B284l401L282j110n272N593r55m99L217o401J890L508l276L928l107l482
2690c801N874k285R35J659o364L800J845k624L947m618j408N484l130K129n6n594
2706d207N155J39j601L352n602Q58M455l470K913j835m090N849j431m50K305n890
$$ y = [-3450, 1722, -1980, 1911, 3182, -4202, 318, -20, -1081, 4600, -1961, -2514, 1714, -2073, 2975, 1731, -4301, 1175, -664, 22, 4167, -3229, -1410, 1355, -1811, 3723, 84, -3888, 1752, -1172, 1170, 3272, -4032, -223, 831, -1201, 4048, -1420, -3095, 1985, -1501, 2203, 2090, -4355, 797, 195, -429, 3920, -2722, -2041, 1895, -1501, 3012, 655, -4168, 1561, -397, 500, 3317, -3712, -867, 1560, -1286, 3425, -845, -3528, 2084, -848, 1381, 2261, -4211, 331, 1019, -764, 3465, -2222, -2554, 2284, -1117, 2165, 1055, -4217, 1376, 421, -78, 3139, -3262, -1372, 2136, -1140, 2788, -319, -3801, 2073, -212, 723, 2382, -3982, -182, 1663, -961, 2986, -1632, -3040, 2444, -686, 1443, 1387, -4207, 948, 1087, -514, 2838, -2764, -1906, 2549, -921, 1992, 157, -3933, 1916, 485, 35, 2340, -3550]
2722c550K919K950l312L333l402k219N809k646P74Q88n507M529J233k642L267
2737B424m631r3N093l418J894p46m428N541n20j548K616n309K040L796l608K623
2753A726k309k851N913k047l59J513n193L767K173l332K910l561q89N480l178
2768b37P80K45m507N066L65k606K735m405J130M469l803J743j132l262N697j314
2784I64j522K088m723K946L003l834K417k489j607N645k673l11J059m432M427
2799I58J237l301K610l539K53M967l647Q34j68l507N321n40k474K390m063K094
2815e75L638m111J820j450k125N592k183j343J711m044L691J967l936K364k481
2830a465n01N146l412r1P59l506M774J74l247K512l254J239M138m129J026l65
$$ y = [-3550, -631, 2319, -993, 2340, -1062, -3281, 2528, -118, 656, 1544, -3963, 566, 1799, -843, 2424, -2207, -2300, 2793, -625, 1269, 523, -3905, 1636, 1116, -432, 2184, -3125, -1085, 2711, -897, 1726, -583, -3434, 2479, 432, 73, 1586, -3607, 160, 2333, -999, 1911, -1650, -2539, 2941, -237, 543, 788, -3719, 1347, 1712, -894, 1841, -2564, -1434, 3035, -768, 975, -157, -3419, 2278, 964, -558, 1530, -3193, -247, 2756, -1078, 1339, -1150, -2757, 2888, 215, -96, 963, -3469, 958, 2195, -1106, 1504, -2035, -1782, 3185, -462, 372, 204, -3303, 2018, 1478, -996, 1394, -2669, -575, 3063, -1048, 772, -678, -2803, 2789, 606, -737, 974, -3070, 621, 2588, -1348, 1016, -1465, -1966, 3180, -232, -323, 436, -3070, 1704, 1878, -1369, 1143, -2111, -872, 3266, -863, 163, -202]
2846b02k530N317j511k286K189l567K832K688m291J894j474j130N180k974j017
2861h82J500l352M108Q70l866K362k340M32M458m025K95N84k686M833r22k984
2877a615K466k920J995L158m419J371m68j620M973k461j830K138l072L255J608
2892B559m321K145j374l69M600l655n74J439k781M250j15l702K511k129J068L627
2908C179m375O34N88k017M622j772k670K497k542K397K229m568J763m19r94M513
2924C065l191j415K207k622L438O12m201K479j267K32L799m158J6J435k225M076
2940B280j134l282K779j969J534K675m642J268N06j461M248k635k090K650k272
2955a545K653J184m507K241m29m38L839l799o96K169k234L464m47l841K898j270
$$ y = [-202, -2732, 2585, 1074, -1212, 977, -2590, 242, 2930, -1361, 533, -941, -2071, 3109, 135, -882, 618, -2734, 1374, 2244, -1622, 740, -1600, -1168, 3290, -735, -440, 144, -2542, 2291, 1369, -1615, 851, -2069, -74, 3084, -1335, 36, -432, -2052, 2921, 460, -1370, 768, -2304, 951, 2559, -1762, 383, -991, -1360, 3240, -415, -989, 450, -2331, 1919, 1804, -1898, 613, -1516, -448, 3179, -1196, -562, 26, -1991, 2631, 859, -1811, 686, -1856, 541, 2770, -1798, -35, -454, -1448, 3065, -126, -1541, 666, -1956, 1482, 2094, -2107, 372, -895, -663, 3136, -1022, -1006, 429, -1796, 2280, 1146, -2136, 643, -1326, 208, 2883, -1759, -491, 15, -1446, 2802, 167, -1923, 727, -1545, 1108, 2292, -2215, 26, -403, -841, 2998, -801, -1497, 672, -1562, 1902, 1455, -2386, 512, -758]
2971g58O81K943m492P34J388j812L813k023k707L043j893J812J634m585J958M15
2987A51j074L678l317j368K848k164K722J30m139K823n74n8L099m197J38K115
3003H13j985L299j388l258L265j335R85K019m555J487J251j532L412k722j957
3018b201L220j855J879P54m351K568K79q05L070l747n13K823k066K583o78l631
3034b671L306p40J39K289m280R48K032j922K967k052k452L481j453J074J172m319
3050b481K226J002j349K887l210j060L296j946J898j19l861L163l1o30K414l928
3066a729M31K625k049K385j390k870L646j006K17J578m186J822J675j817K543
3081A875k517j593L659j751J056N32l942K920O35j325K389l362j74L196k129J730
$$ y = [-758, -77, 2866, -1626, -892, 496, -1316, 2497, 474, -2233, 810, -1083, 729, 2363, -2222, -264, 151, -923, 2755, -562, -1930, 918, -1246, 1476, 1606, -2533, 290, -284, -342, 2757, -1440, -1302, 813, -1172, 2127, 739, -2519, 746, -589, 396, 2415, -2140, -653, 598, -934, 2478, -244, -2201, 1019, -836, 1043, 1797, -2554, 14, 293, -512, 2558, -1189, -1702, 1121, -945, 1638, 960, -2671, 635, -105, 34, 2323, -1957, -1009, 1023, -899, 2068, 16, -2436, 1045, -408, 666, 1838, -2481, -255, 747, -602, 2285, -925, -1985, 1311, -635, 1263, 1144, -2717, 446, 415, -215, 2199, -1729, -1298, 1327, -722, 1663, 273, -2597, 1049, 43, 260, 1838, -2348, -526, 1149, -668, 1875, -642, -2235, 1424, -327, 729, 1261, -2681, 239, 874, -451, 1938, -1424, -1598, 1598, -531, 1199]
3097A199o68l201L578m34n73J882l844J197K419k190K173j844k086L810j334K21
3113C05J011l857K498J338j891K252k793p29L588k020J017j6l370L399J64j303
3129d07J989l401P18K909k375J636j113k387L826r53n17J380l606K033J917k311
3145f62J969k089j268L853j813K73N88l351L006P90j901J930k801P7L377k359
3161c81R88m02k678L690l89j272J636l205J434K467k532J511j310j685L874j442
3177C04m81J070l196K588J317k376J821k133m55L597k215L11K87k771L335K06
3193A209j915J743k668Q19K921k666J005n86k002L777r59j252J457k919K003J957
3209A924k725J484j437r63L778j956l69Q11k727K947P36k427J729k077K77L213
$$ y = [1199, 531, -2670, 908, 474, -99, 1783, -2061, -864, 1555, -635, 1538, -306, -2392, 1418, 84, 305, 1316, -2541, -43, 1295, -596, 1656, -1137, -1866, 1722, -298, 719, 703, -2667, 732, 896, -407, 1582, -1819, -1101, 1808, -567, 1069, -44, -2431, 1395, 442, -75, 1305, -2301, -268, 1649, -662, 1307, -782, -2050, 1803, -10, 263, 851, -2500, 506, 1296, -605, 1325, -1476, -1399, 1978, -381, 607, 205, -2473, 1217, 828, -444, 1192, -2013, -579, 1888, -644, 867, -443, -2128, 1746, 304, -177, 893, -2303, 285, 1602, -774, 1047, -1086, -1541, 2056, -159, 152, 439, -2332, 1003, 1209, -706, 1037, -1631, -812, 2109, -557, 448, -138, -2140, 1637, 678, -574, 883, -2036, -33, 1924, -801, 683, -754, -1717, 2061, 105, -264, 547, -2180, 767, 1503, -924, 805, -1272, -995, 2218]
3225B218k619M43N7k137L534n29j845J688k469J447K293k890J131p03j314L665
3241A970j631j025J309k537K447J194k783J566j420k52L364k450j75P24k204L141
3257A238Ok357J725j937Q91K655k941O46nj582L486j189j662J627k152J846J672
3274A967l047J268p01o84L324k168p31J193k086K674M45k699J658j303K64K833
3290B207k802J50N86j669L085o73k159J785j722J276K006l104R05n4j037L195
3306A975j742j298J530j842K124R25l008J497p00j94K876k565l87J131j669K690
3322A343k34k558J824j199O58K218l001M71N79j249K888j323j797J872j523J471
3338D40J297l066J223p7o15K779k193r12J595j571K136K66k840J736o18J11K357
$$ y = [2218, -401, 42, 99, -2038, 1496, 967, -878, 810, -1659, -212, 2081, -809, 322, -381, -1695, 1970, 339, -686, 623, -1914, 533, 1727, -1056, 510, -910, -1162, 2202, -248, -423, 301, -1903, 1238, 1244, -1113, 612, -1325, -434, 2221, -720, -74, -79, -1661, 1825, 636, -1026, 601, -1551, 295, 1967, -1080, 188, -513, -1197, 2127, -41, -772, 421, -1665, 1009, 1454, -1245, 413, -890, -626, 2207, -595, -445, 141, -1528, 1557, 884, -1275, 510, -1212, 64, 2070, -1034, -129, -183, -1220, 1975, 233, -1065, 465, -1377, 747, 1672, -1336, 161, -539, -733, 2143, -422, -809, 322, -1347, 1343, 1109, -1449, 375, -824, -166, 2052, -949, -478, 101, -1148, 1740, 417, -1380, 492, -1031, 440, 1737, -1329, -106, -183, -798, 1981, -212, -1124, 471, -1100, 1036, 1302, -1538, 198, -420, -309, 2048]
3355B048k832LJ133j369K541q22k232J954j100Q85J598l079Q46N70r47K606j815
3372a2j393J929j367J560O70k976J568n0l68K310k485m65J629j390K034l16k513
3389a635J965o44L23J773k929M72J143j213K300j290j820K107j046R38J028l015
3405a543J280N16p71K215k126r18K003j271J499Q3k702J880j19k06J876k672L3
3422i43J579j231J840q30k124K199o42M00J207k883R57J036j049J954j673j299
3438a502K245j074R48M38k751J685L81o87J844k312m05K004j237J383m42k279
3454a761K146k55j07J368k677N71J496j227J631j217j626K345p39M04P49k699
3470a598J378Q72r81J614j844p82K230j107Q43M1k408K004K13o32J404k336K15
$$ y = [2048, -784, -781, 352, -1017, 1524, 702, -1530, 424, -676, 209, 1807, -1272, -426, 144, -803, 1803, -12, -1405, 524, -843, 717, 1387, -1589, -21, -71, -439, 1871, -614, -1079, 550, -840, 1194, 878, -1635, 330, -314, 9, 1782, -1147, -675, 468, -745, 1555, 265, -1555, 552, -494, 444, 1472, -1543, -263, 253, -518, 1697, -429, -1347, 656, -615, 884, 967, -1735, 145, 26, -180, 1696, -976, -943, 636, -595, 1245, 415, -1709, 490, -152, 248, 1455, -1428, -471, 565, -484, 1470, -203, -1502, 743, -331, 617, 1055, -1696, -11, 370, -317, 1527, -785, -1190, 814, -423, 960, 518, -1761, 385, 130, 23, 1391, -1286, -715, 781, -446, 1185, -32, -1658, 687, -52, 352, 1101, -1598, -220, 652, -329, 1285, -559, -1341, 889, -218, 625, 666, -1742, 262, 475, -157, 1247, -1089, -874]
3487h74J846j304J208p31j845K354m23j42R60k523J074J288j243J386j433j078
3503a480K391r19L80L44k408J761O71r77J311j967j64K140j267P97l24j954K224
3520E59p9n69J059k280P47J637j365J100j028j312K421o47j46O11k261J510R71
3537I28j266J187j539m66K288j179L34P9j961K012K93r72J078j897L50J944j399
3554a86O78n34j443K323l79n77P88j979J090J384j449R00j092p45K338r33j48
3571C6L58j886J763O67j297R64j486L7K107j356K98j58j506K190l9j022Q74j655
3589a111P24J624j535O29o18r38K257o66n38N66j690J452R42j503Q21j053k60
3606h97K165j240r4K24j480J905K58j285Q55j336M53J793j543L05k35j030K160
$$ y = [-874, 972, -332, 876, 145, -1700, 654, 231, 89, 1049, -1474, -400, 888, -355, 1031, -402, -1480, 911, -8, 372, 716, -1692, 69, 740, -237, 1074, -893, -1057, 1083, -184, 613, 289, -1665, 559, 480, -89, 970, -1310, -563, 1074, -291, 809, -219, -1531, 890, 243, 97, 708, -1553, -43, 928, -338, 849, -690, -1156, 1132, -47, 287, 366, -1595, 417, 710, -262, 816, -1081, -731, 1213, -186, 492, -42, -1485, 838, 459, -118, 670, -1309, -219, 1165, -284, 616, -476, -1221, 1117, 184, 36, 394, -1492, 271, 938, -359, 605, -881, -844, 1263, -93, 205, 47, -1459, 731, 692, -330, 544, -1111, -387, 1237, -298, 331, -287, -1225, 1032, 366, -172, 394, -1296, 156, 1098, -405, 416, -637, -897, 1268, 28, -66, 158, -1322, 583, 841, -444, 411, -925, -472, 1321, -222, 83, -152, -1182, 978]
3623I78m29r57P62j470J104J207j590N67o15m74K115j003m98M89j332J587N47
3640I88j518P87r40J30J886j448k8J40j066J904j43j245Q20j135P49J413j673
3657c79L43j98o62K018p55q75O86j176J306P81j661O42n45j34J888j278m07M37
3675C1r98J662J32j511Q35p99M48J493j600P7J56p17J819n22j167Q56r42R57R63
3694A173j706L97j26l09J752j063o85O88r10J358L50j652P19m16J34J564j503
3711b35k28M94p38J596k84j410Q91o20O07J109j711K45J96m54J636q37r72Q52
3729A37p27R97N69j733O34q4q4J480j309m88P24p15J307j9j561Q79l27K84J166
3748A130j615K5N42n71J409n83j182R61n25O67P46j728M27K79l16J414j108p59
$$ y = [978, 549, -408, 354, -1116, -12, 1195, -395, 172, -443, -917, 1198, 195, -303, 186, -1146, 441, 988, -530, 257, -683, -553, 1333, -115, -143, -3, -1069, 835, 692, -553, 267, -868, -119, 1294, -379, -36, -234, -896, 1122, 367, -508, 178, -998, 308, 1089, -572, 70, -475, -609, 1279, 1, -406, 31, -967, 695, 827, -684, 151, -648, -200, 1293, -307, -230, -74, -791, 1028, 506, -661, 195, -747, 210, 1173, -533, -136, -262, -571, 1181, 118, -567, 121, -789, 569, 919, -733, -14, -430, -296, 1268, -235, -463, 31, -707, 889, 605, -805, 86, -534, 73, 1182, -529, -284, -88, -542, 1094, 257, -715, 137, -590, 407, 976, -757, -123, -207, -291, 1189, -120, -608, 116, -599, 708, 689, -872, 7, -320, -36, 1130, -485, -460, 82, -489, 920, 337, -845, 116, -409, 258, 1004, -724, -297, -18, -334, 1080, -28, -787]
3766g87R59o12J000K07j628P45QJ6J209j449k65P95n87J178l28j388J010l14L96
3785A65Q24j665K54N47m39J239q65r48J066m65O80L80j652O57K60j82J115j249
3803b78m68J005n61R15j26j471R86l6J10Q78j570O8Q25m92J039o48j151J172k74
3822g7L53M88j611N29N97m50J025j049o78J164m51O08P4j538R47K36k00Q99j409
3841e43j12J050n58P72l86j249J191n6K3O22j530L89Q19n54Q67q37q41J306l74
3860aL30K56j543Q10N13m38Q29j184l61J262n24N03j72j308J153J40k17O22j372
3879g02J74J019n90O58n55r79J307j93j8M14j439O51P56n99P20r25n27J345m65
3898E2K42Q0j364J031M03m98O64j204j9J223o44M52l20j122J334rk61M80j315
$$ y = [-787, 172, -440, 560, 767, -861, -116, -108, -92, 1117, -332, -597, 198, -389, 789, 461, -927, 83, -231, 165, 989, -676, -422, 125, -314, 925, 60, -888, 178, -287, 393, 773, -879, -222, 38, -144, 971, -278, -746, 259, -302, 613, 487, -984, 2, -34, 76, 954, -616, -548, 277, -215, 824, 176, -975, 197, -77, 276, 764, -847, -318, 279, -171, 854, -195, -873, 291, -160, 448, 522, -1016, -69, 167, -33, 866, -543, -655, 395, -163, 609, 223, -1026, 165, 109, 132, 754, -776, -387, 432, -122, 745, -92, -933, 373, -1, 329, 585, -958, -148, 365, -73, 756, -428, -789, 473, -51, 452, 280, -1028, 125, 265, 48, 670, -702, -528, 491, -99, 559, 4, -975, 332, 139, 121, 535, -904, -253, 503, -96, 624, -301, -828, 517, 52, 294, 374, -990, 41, 444, -54, 610, -594, -613, 610, -34, 418, 98, -1024, 310, 301, 40, 520, -795]
3917g95M60R71p47N90p13o71J393l34k9K23j304R02O32o82O11r71k12J348o07
3936F5J72j15j108J270K08n81N49j144K55J148p64L59l87q55J440k26l31M11j220
3955h54P33Q05q39N22p32l92J441n40j04J49j105J097M07p68N76r68N7J325q60
3974e0J96j50q52J330on70M31j083N48J024r83M06m53n51J466m71l27L13j075
3993h57R59N84r36N02p00j17J391p94n9J01r23J240J42q30N58q81L40J157j012
4012a35K02j80o53J418l10n76M61r36P51P50j041M05m32k77J378o74l16L09r32
4031g88J146L14j009M99o44J28J247r91oP1o85J316j49q59N89q04N46R29j139
4050b89K79j81m25J393n80n38M81q13Q95N09j138M87m02n4J298r48k43L54p34
$$ y = [-795, -335, 636, -111, 479, -234, -905, 488, 154, 125, 348, -956, -54, 578, -104, 507, -464, -676, 672, 65, 237, 122, -986, 284, 492, -89, 460, -684, -429, 719, -45, 314, -73, -928, 512, 286, -45, 366, -854, -121, 684, -155, 367, -365, -757, 684, 144, 40, 189, -916, 181, 588, -180, 396, -572, -515, 810, -50, 146, -4, -856, 474, 468, -102, 329, -754, -206, 818, -165, 241, -212, -763, 703, 232, -95, 218, -857, 102, 686, -250, 252, -448, -565, 826, 32, -27, 74, -849, 391, 533, -297, 261, -620, -280, 877, -135, 67, -113, -766, 652, 342, -234, 227, -709, 42, 792, -249, 156, -276, -553, 825, 151, -165, 144, -788, 358, 672, -337, 162, -482, -354, 893, -98, -104, -33, -718, 598, 449, -410, 179, -625, -79, 850, -289, -10, -191, -616, 777, 197, -341, 140, -673, 222, 731, -407, 80, -322, -376, 922, -26, -269, 85, -649]
4069f49J182K7j012N88n89L22J048j169J14Q7n46J328m26p73O09o71O61P00j288
4088d57M04j06k69J278q04m65N46p17R83K62j196N89l22O0J137j086j03L59o32
4107e39J191k06j024P29n33M13Q25j249K35J55l98J197o53o73P15o47P51M35j324
4126f00N48q4j58J156r94l12N90n99R77mj187P19k87J48R62j256J13M04n77J142
4146G01m42r12Q42m98M70O11j350M33J67l15J120q69n10P72o05P79J80j281P27
4165B0j19m8R75j144j03O03n64R57k60j055Q95l56K72P03j344L00M40m87J044
4184G29o78p36R34m86M96L75j332O31J61k59R61j007l67Q69n86P78r1j162Q98
4203A28j57j4Q05j235R4O50n74R01m97q69J009l88K71N15j328N08M16m62Q91q04
$$ y = [-649, 533, 560, -452, 136, -453, -131, 917, -252, -138, -51, -597, 731, 305, -468, 141, -530, 131, 831, -457, -53, -159, -428, 850, 46, -419, 127, -590, 393, 655, -541, 48, -274, -214, 923, -163, -266, 93, -539, 652, 446, -578, 151, -382, 31, 856, -393, -158, -3, -401, 796, 143, -530, 185, -462, 289, 724, -600, -52, -136, -294, 862, -132, -444, 146, -453, 524, 520, -667, 52, -235, -87, 875, -381, -268, 136, -441, 701, 259, -653, 189, -309, 161, 772, -578, -145, 22, -293, 827, -42, -552, 220, -385, 394, 574, -707, 20, -99, -147, 828, -316, -419, 184, -380, 577, 317, -738, 157, -199, 73, 776, -568, -268, 172, -315, 729, 51, -685, 249, -237, 259, 634, -698, -67, 94, -165, 796, -211, -578, 291, -295, 483, 392, -770, 128, -29, -43, 762, -473, -379, 271, -303, 598, 101, -768, 241, -147, 124, 639, -689, -181, 235, -227, 664, -140]
4223a40m95R69n25N05J28j245Q52P8k36Q27j131p3Q93o17O84k56j012J012j85
4242C3k1O35j296L77O22n59P85o09p16J096m49K55L32j267P56K60m06P89r76k27
4262e86J031n74M38l3j073R51J1k37O93j152J56Q16o32O62m16q04J107l18J1M64
4282E15j198N29N69n92P16p36m46J130n42K40J36j123Q74K44m62O90j011NR88
4301E26o60M71k14q98J102j43k53N46j085L87P16o91N93n01n83J176m33k3L45
4320C78j106P52L96n88O35p88j95J081o22K29K8r92J029P2m79O12r64K09Q98p47
4340a62L97k80o83J161k55k70M66j051N71O33p34N43n23m26J173n49lK42r72Q83
4360A61K90o83O02p98L9J040p59K24m7q00J096m2n39N82r42L83Q08q05M04l51
$$ y = [-140, -635, 334, -191, 314, 442, -803, 49, 127, -109, 718, -413, -486, 407, -210, 474, 218, -794, 218, 33, 12, 647, -649, -272, 350, -209, 576, -33, -749, 347, -102, 153, 485, -782, -26, 234, -172, 617, -359, -586, 445, -129, 309, 276, -797, 154, 165, -72, 621, -531, -375, 441, -191, 471, 55, -749, 358, 40, 51, 515, -683, -154, 415, -177, 539, -197, -643, 487, -55, 185, 321, -802, 72, 316, -146, 544, -467, -462, 526, -134, 337, 123, -775, 327, 184, -69, 477, -608, -221, 495, -196, 397, -104, -687, 489, 56, 33, 378, -728, 24, 420, -168, 467, -321, -516, 565, -57, 172, 200, -792, 237, 309, -170, 442, -522, -313, 585, -162, 235, -45, -728, 433, 178, -92, 374, -677, -106, 527, -207, 336, -187, -613, 560, 11, 8, 250, -722, 161, 451, -232, 370, -428, -389, 651, -108, 116, 69, -731, 365, 323, -216, 366, -576, -193, 615, -190, 214, -137]
4380a37n23J231m56k22L52r15P28N03q19N11n34k15J153o65m0K07q64J003J21
4399D19o67N63p70K03R35q38K29o5o25J133k66m89M90q34N42O65r14M57l28l71
4419e31J179n99k30L58q12Q58K72q31N43n38j3J042q24P0J29o82J052n5p17N49
4439B20o89L54Q22r54K86j13m52J148m34m60N01p81O79M67r63M80l14j72J076
4458G01p49j68L38o81R11P0q22N68n08J17R33r49J30J48n77J079l18o12N81o26
4478d34M91O11j027L85j05l30J075o20l48N02o83P81K73j028N96l39o2R83q71
4497a50m6L33o14R23j11p96O07m86K91P11j028K71J46m38R88m92n41N86n40N45
4517A59M16j033M65j09j92J000p78k81N10n71P83P1r41N99k59Q1P81r84M9L48
$$ y = [-137, -660, 571, 115, -107, 245, -670, 58, 561, -258, 253, -281, -496, 657, -8, -48, 159, -705, 298, 419, -248, 315, -455, -252, 683, -155, 74, 9, -616, 517, 251, -238, 252, -582, -40, 625, -289, 168, -160, -531, 648, 49, -181, 177, -635, 223, 495, -336, 207, -331, -344, 698, -126, -56, 73, -609, 443, 388, -329, 220, -469, -115, 707, -247, 39, -74, -526, 622, 188, -272, 229, -552, 127, 594, -369, 111, -203, -375, 701, -48, -216, 122, -559, 352, 422, -400, 168, -340, -223, 710, -239, -109, 39, -538, 541, 223, -389, 192, -434, 57, 668, -359, 26, -79, -409, 666, 46, -302, 200, -483, 298, 571, -457, 139, -200, -262, 721, -150, -196, 137, -477, 446, 335, -461, 146, -340, -49, 662, -366, -95, 51, -387, 601, 109, -432, 154, -386, 159, 575, -458, 7, -102, -294, 706, -72, -353, 157, -414, 369, 440, -501, 98, -161, -80, 701, -283, -234, 114]
4537A14m96R06l42o98O87m23L11N57j076L61J14l20R30o56m57O61n10O28J98j013
4557e24N29o3r3Q13q70r2M77n26P92j60q47P13l09J47O52j048K24L41m03Q00m92
4578F1n89P08l99L82L53j049M70J19k65Q28p95k61O69m91N83K5r71O77q7l1O92
4599F29r70M6M94m62P25l02p38P34k62J91M58j030L30L36l84P52n95m74P80m12
4619a54L69J90r82N80R4k10O71q31j35O61m54N38j21q49P58j14j2N28r76K03M93
4640B47m44O21m17n79Q24l21J78L32r85M83K99l43O04o84l01P97l96L28Oq48O74
4661G5N0k00N77q76N7O29m45M72k71o91Q17j63j3L80r37L51M95m53N53n07m64
4682e64Q75l29J53J41q61N76K56l43N17p29p0P58m66L34j09p54Q11k3j84L86q46
$$ y = [114, -382, 524, 182, -516, 171, -252, 59, 616, -460, -99, 15, -305, 625, -31, -488, 173, -337, 291, 489, -524, 5, -58, -151, 662, -208, -300, 177, -349, 443, 283, -564, 149, -160, -13, 639, -409, -185, 156, -247, 553, 61, -528, 180, -219, 163, 516, -533, -63, 56, -209, 619, -176, -437, 232, -259, 324, 349, -622, 55, -32, -63, 629, -341, -295, 199, -263, 462, 160, -578, 156, -106, 85, 543, -487, -157, 179, -205, 547, -48, -522, 258, -154, 215, 405, -577, 3, 97, -113, 558, -273, -408, 253, -201, 337, 216, -633, 125, 11, -1, 527, -449, -246, 247, -197, 424, 7, -572, 252, -69, 109, 441, -544, -61, 238, -105, 499, -185, -486, 311, -85, 243, 249, -599, 75, 125, -75, 502, -374, -317, 312, -133, 339, 68, -623, 194, 31, 18, 398, -539, -188, 307, -146, 407, -100, -564, 311, -18, 135, 276, -585, -9, 247, -96, 421, -308, -378, 380, -86, 248, 139, -615, 196, 173, -11, 375, -471]
4703d71K03O46m94M39l61n06Q53k55RK20q27M89L83m73M75n67k24Q30l80J44J9
4724A52p59P42J14l49M45p47J25P20n25K89j72n96Q26q3k00K87p51L94N01m96
4744h3L48m07l30Q64l25m3J26p05O27K78m65L80n79n2Q10m83J24l4n99P90j9l51
4766a28L64o84K75O09n45K82k51m33Q83k13k20K50o91N43L79n67L53m29j30Q37
4786D84m85QP2o14P40J32m80L34n46J30P24n71J21j03m72Q60j20l64L24o16M18
4807b4M81n96K33k38k25Q26l81j66K06n63N81K79n89L03l89M6P34n40OL8m75P63
4829C10pm99L42n36L27N71o71J52r4l19Q62k88l42K96n11M92L59o69K72k53o8
4850b74P95n17j46J91m45O73Q4o02L44l78J71O34o40J9Q5l82Q26k24m58L55m49
$$ y = [-471, -268, 378, -116, 323, -38, -544, 309, 54, 63, 283, -544, -55, 328, -145, 330, -237, -461, 369, -11, 133, 152, -607, 135, 249, -100, 345, -402, -277, 443, -82, 207, 35, -561, 265, 182, -18, 269, -482, -88, 413, -83, 265, -142, -472, 392, 67, 24, 150, -555, 72, 350, -115, 265, -314, -366, 444, -39, 85, 51, -548, 242, 223, -128, 236, -448, -173, 436, -109, 173, -78, -511, 372, 159, -61, 189, -502, 41, 420, -147, 206, -223, -353, 484, -1, 7, 79, -535, 205, 337, -143, 191, -355, -225, 499, -72, 49, -54, -526, 334, 214, -150, 174, -442, -24, 457, -139, 94, -144, -369, 457, 76, -90, 116, -447, 134, 413, -176, 127, -262, -216, 518, -22, -16, 22, -453, 310, 303, -196, 146, -390, -63, 508, -163, -11, -105, -424, 438, 150, -192, 104, -407, 85, 444, -225, 47, -206, -274, 521, 4, -142, 49, -396, 277, 361, -241, 103, -275, -104, 530, -110, -91, -6, -388, 438, 214, -244, 111, -338]
4871c38L79M60o99J89r4j94P68m22k74L07m34N50J88o93L25j87K0O81o37j01K01
4892el32O92o9o13L67k77K29N55p73J31P9k42P54l42m61M06l78M79K67p70K67
4913c6r1l8O96n63k41L49l71N81N5p19M14k01J09N97p44JK26k87O72k48n46M50
4935F5k85L24L55p77K30O7j73P36n60l19M49l47N03R3p43L72m8%N88p09q3L30
4957F8k84N86j67o52M93j83K07M16q31J57K46k51O18m20m17N10k84L59K25q09
4977d13L47O6j16O13o29k10M84l01M65m1p09M88o9L6M85p72N1L33k36N41l35m98
4999d20N38j94J91K79q21L04K00j99N64n66k99N98k97L65L8p69M77N6n9M71p30
5020b73k7M55k84M60j91o43O32j34O8L50q18K19L65k94N19m54m10O47k15K08J43
$$ y = [-338, 41, 501, -198, -9, -103, -297, 471, 49, -225, 82, -352, 198, 386, -307, 18, -169, -149, 532, -105, -206, -5, -337, 355, 286, -327, 40, -237, -8, 547, -226, -95, -16, -258, 496, 154, -307, 99, -279, 200, 467, -303, -36, -127, -165, 531, -32, -273, 76, -295, 286, 341, -378, 36, -165, -56, 541, -203, -202, 24, -263, 409, 161, -385, 65, -220, 104, 459, -318, -88, -21, -194, 542, -18, -337, 112, -235, 268, 361, -382, -10, -58, -58, 530, -179, -262, 68, -216, 370, 203, -449, 44, -139, 68, 484, -347, -190, 56, -195, 423, 3, -414, 96, -188, 171, 396, -413, -66, 0, -116, 497, -132, -342, 142, -159, 306, 265, -444, 44, -25, 11, 496, -276, -225, 108, -128, 413, 78, -420, 118, -76, 115, 394, -427, -123, 77, -122, 442, -124, -423, 175, -122, 243, 281, -488, -11, 45, -14, 457, -273, -300, 155, -129, 331, 140, -503, 129, -5, 63, 413, -405, -186, 179, -115, 404, -50, -460, 187, -28, 180, 323]
5041C23q30M43J95j88M75o52j49O09l15L60j27o67N95J8q7L84p75J25N06l48M34
5062C29l23n26P19j75O3K36q20L96L40l26M59n30k51O77k94K10L2p30N57J48k28
5083c7L96o87MO51l92L05k01n61O84o0r8L01p70L04M94m22M05m15l94Q00k68N4
5105I3J42p55N51K21l39M09n99o4P14l76J94o6o47O99K5k61L64p23J98O10m62
5126g2L34l01m84Q28k08r5K25p44M64M05m72L66m91j62P67l52R3K6o92P06J39
5147B80l55L41o59J26P05m88J77j53n04Q32j15k42K67o69L84N15n58L17l66k83
5167d48Q62l26j29J75o75O15K78n27L87n36jQ11n44Q2jn81Q07J9m02L36o32L06
5189a24O12o08K08j79l75Q82k67k54K57o32N45L88o31L34l74j27Q66n17l7J30
$$ y = [323, -507, -64, 131, -57, 418, -234, -383, 226, -89, 271, 144, -523, 72, 90, 3, 387, -388, -263, 243, -105, 329, 6, -520, 199, 24, 87, 323, -497, -101, 239, -87, 372, -158, -409, 268, -26, 184, 216, -514, 43, 191, -37, 359, -328, -324, 327, -65, 240, 39, -522, 162, 102, 4, 305, -465, -161, 333, -89, 316, -99, -493, 307, 39, 93, 235, -520, 31, 252, -87, 322, -277, -341, 373, -3, 191, 125, -522, 177, 202, -59, 305, -418, -220, 390, -72, 262, -39, -523, 305, 97, 2, 227, -517, -53, 352, -120, 246, -245, -407, 360, 8, 101, 127, -565, 141, 280, -75, 266, -393, -267, 438, -50, 127, -26, -530, 302, 187, -55, 212, -457, -73, 442, -116, 201, -165, -448, 414, 88, -41, 134, -541, 74, 352, -175, 212, -324, -325, 486, -58, 24, 23, -558, 249, 268, -134, 202, -430, -124, 488, -120, 88, -91, -466, 416, 149, -105, 152, -480, 65, 453, -178, 156, -218, -345, 521, 4, -33, 97]
5209I7o24P66J03n54L91n25J78P20o88J39n0m34Q63j76m25L49n75M36M93p14L01
5230G1k37k14R02m51j95K57n77O56J89o61L94l80L0P95o87M2J12m94Q27q5n77
5251b83L88m60L04O36p89J99o0l22Q79l92l45L80n72N74L52q03L88k63p9Q58o54
5272f4r1K06m64P46J2o87M72l89J59O90p78R1J14l98Q60l03m86M28m64M17M47
5293E18q52L01o4j97Q53n72k66L72m63O03J67q14M61k29K2P40p69jK62m34P76
5314D14j73o62N57l96K83N49q85K06J25l21Q33m66m25N31m39M95K44q71M10p1
5334f2q8P35p19j68M50m74O58l2p92N78k79J31O31r13J58K99m10P60l38n77N81
5355A29l59L39L93r53L94J22k84P58o25l10N99m55N47M3q53N94j14l6O47q27M
$$ y = [97, -527, 239, 342, -212, 179, -346, -168, 552, -136, 3, -47, -481, 382, 206, -219, 130, -445, -9, 484, -230, 71, -166, -380, 522, 71, -124, 133, -444, 212, 401, -260, 134, -246, -216, 579, -108, -66, 46, -448, 379, 294, -283, 105, -355, -51, 585, -204, -5, -65, -387, 492, 100, -245, 135, -437, 137, 489, -314, 74, -189, -268, 590, -64, -155, 51, -413, 333, 345, -342, 130, -259, -100, 590, -188, -97, 17, -381, 479, 176, -310, 118, -346, 71, 518, -334, -33, -97, -294, 559, -13, -279, 93, -370, 233, 400, -414, 47, -182, -160, 580, -189, -190, 72, -362, 414, 241, -421, 136, -260, 23, 572, -313, -107, 18, -303, 530, 64, -361, 170, -269, 226, 470, -401, 9, -62, -150, 585, -134, -302, 148, -326, 332, 300, -492, 86, -193, -62, 569, -344, -186, 113, -297, 463, 125, -452, 129, -230, 109, 502, -451, -57, 65, -219, 539, -86, -396, 203, -252, 295, 338, -515, 79, -35, -71, 576, -251, -247]
5376b47M18m41O88k44p00O66k96J81M86r57L38K15l17P15n29m41O58l74L77J96
5396C92r32N43N3j78O46p63j11N84m35N72j60p74O82j39K2N00q81J68M33m24O52
5417D50m37n38P58l85K52L34r89M91K27l51O71o59k34O94m73M48j6q45O88j4j59
5438h7N82q45L8O07m80N58k80o59Q03k54M8L84r21L75L55l87N75n08l78P98m01
5459g7K36J44q94O33J36l10N99p65o3O97m88M20j58p17Q19j31j36M94r02K61N56
5480C54n33N10l84m86Q58l50P6L00q84N34K71m17N73o62j75Q31m86K46J3q03P83
5501A69K6k75M49p78J62O63n72L94k38n84Q91k20j32L43q60M53M56n42M95m73
5521a73l19R50m75Q2J73q30P01J77m55N24o77mQ04o07K81p2o54Q76j35k80M33
$$ y = [-247, 171, -270, 418, 174, -526, 140, -156, 25, 511, -446, -108, 107, -210, 505, -24, -465, 193, -181, 196, 392, -540, 3, 56, -122, 524, -239, -350, 234, -201, 371, 211, -563, 119, -20, 2, 502, -379, -211, 222, -202, 450, 13, -525, 233, -152, 100, 434, -555, -64, 163, -188, 483, -176, -410, 284, -189, 259, 243, -602, 86, 72, -87, 495, -350, -312, 295, -185, 373, 93, -566, 237, -17, 31, 415, -506, -131, 224, -163, 412, -96, -474, 324, -77, 159, 303, -591, 42, 178, -132, 467, -298, -361, 336, -152, 268, 110, -607, 212, 81, -55, 439, -463, -202, 354, -179, 331, -53, -539, 319, -31, 45, 345, -539, -5, 266, -151, 422, -240, -415, 416, -70, 176, 189, -614, 169, 195, -80, 369, -409, -247, 416, -156, 238, 0, -584, 307, 87, -45, 298, -562, -109, 347, -195, 300, -173, -492, 458, -17, 65, 238, -592, 109, 286, -169, 355, -322, -326, 478, -129, 152, 80, -574, 302, 167, -113, 320]
5542C20q06L30O13o34M34l50m24R34l58j14L03q11O32L15o02M59n14j23R16o08
5562h8J11J03p09Q41J4m55M84o90K12O89o82L06j65m82R25k76k67L89p38M88M46
5583D56o72M15l44k61R12n03q0K22o92P18J71n64M37n34M6Q19o89J48L3n80R27
5604C85j87m30M43o47L57N93p27L11j87l28R02m27k22L54o71O28K88p05M59m21
5624b32o8Q74o74L3J77o17Q20j7n94N00n53K10O80p72K20J8m65R10l21l99M28
5645A58n84M79M43p97L59k00j92Q92n73j49K85n47P14Q7p04M81l87O9P89q18J14
5666h1J50m84Q35j82n50M71n01L59N24q73L53p7k83Q52n12k66M21n55N79K43q32
5687d09M76k31n0P90p08n1K99n25Q03j25o75N65m13K21N97q54K22R6l42Q31m56
$$ y = [320, -486, -156, 457, -177, 257, -93, -517, 417, 59, -55, 248, -563, 69, 384, -218, 241, -273, -396, 520, -88, 23, 126, -583, 258, 272, -183, 301, -389, -177, 512, -170, 136, -29, -511, 414, 138, -129, 260, -478, 10, 456, -216, 199, -145, -406, 506, 3, -77, 145, -547, 171, 342, -222, 215, -319, -273, 546, -143, 5, 38, -542, 385, 198, -232, 211, -436, -79, 514, -213, 98, -89, -417, 485, 58, -164, 190, -481, 147, 435, -270, 189, -232, -300, 574, -100, -67, 110, -507, 313, 296, -298, 202, -351, -141, 539, -233, -13, 5, -460, 450, 129, -270, 158, -426, 53, 496, -301, 58, -142, -334, 558, -15, -164, 121, -426, 288, 375, -329, 152, -235, -166, 623, -195, -81, 69, -415, 420, 238, -312, 159, -342, 17, 541, -332, 21, -56, -339, 513, 1, -265, 156, -399, 180, 423, -409, 67, -164, -214, 576, -132, -183, 116, -409, 394, 269, -406, 159, -254, -33, 564, -290, -68, 28, -314, 517, 61]
5708F1m21N40m64M15L55q88M35q9j68P88o84j42M07m90O54Mp54N56k99Q8O55q41
5730b82J08K71m35P92l12n52N82l92K75M54q79L48O3k46P37n97k66N17m47M97
5750B36J23p90M98j24o7O88p94l0M17m14O35j83o79O47k80J27M81q74K31K41l25
5771b36O88m69m18O12l95L97K19q85M93M4j89O61p05j45N45m28N20p3p37O19j61
5792d3J9N04p97J24L75l76N93l63n04O57l09J95L16q24L77J75k96O43o03k69O75
5813B69m28L40P7p91N96Pj51N46p75N0N08m36N09k10o20O83j80RL76q16K96L85
5835B44l92N43m76l59P12l58K11J69q55N92J23l12N45o60o5O23m34L93j26o54
5855e36O98j21r0M17p80K19N05m68M64l63m25P78k83M7K51q05M82K54l97N15n65
$$ y = [61, -360, 180, -284, 131, 486, -402, 33, -56, -224, 564, -120, -262, 145, -345, 309, 313, -441, 115, -184, -96, 559, -282, -174, 97, -338, 454, 142, -410, 172, -220, 55, 509, -370, -22, 41, -205, 532, -65, -331, 186, -261, 236, 359, -431, 67, -57, -124, 564, -230, -260, 157, -257, 378, 195, -484, 163, -117, 10, 491, -383, -152, 89, -236, 452, -17, -435, 177, -218, 179, 398, -487, 6, 50, -139, 522, -183, -328, 217, -211, 309, 236, -501, 118, -43, -24, 480, -317, -193, 182, -194, 399, 36, -468, 189, -120, 75, 391, -433, -56, 119, -177, 466, -137, -406, 269, -159, 181, 258, -533, 63, 70, -81, 465, -310, -260, 248, -188, 321, 111, -509, 174, -6, 3, 379, -437, -141, 244, -148, 395, -81, -440, 272, -86, 125, 294, -561, 31, 154, -158, 387, -273, -338, 285, -149, 244, 118, -536, 162, 41, -49, 368, -412, -193, 312, -156, 308, -55, -480, 298, 15, 62, 313, -492, -10, 244, -153, 362, -203]
5876b03j89P46m44K46K5p11O49O4k73M32o92J07O00m82L59k07n52P81j96r9L24
5897B85p93M12M23m86M49m29k81P68l68P7J27o82N92J57l61M25n96kO75m80K26
5918A38n9n76P46p9k67L79o95L18M56n07L46k71l96Q29l04q4K44p13N39K71m80
5939a65L97m65j11P61m70Q8P4o13P18J7l71M03o05J71O25n66K31j22m51Q03k08
5960A41k57L23o35M43L75n93L68l00k21Q00m33n0J61n89O12J75n30M32n13P6O65
5981D50n65J52j3m80P63r4m02L77n46L17M96o45L03k02k74P76l52j79K71n72N52
6002A33K51o08L77l53m4P22n22kJ39n48P43k8n22L98m18J78N70o43J80l4l70P96
6024C95k78l45L72n14M36L63o89L29j80k04P84m61j44K61m92N69J32o13M17l56
$$ y = [-203, -392, 354, -90, 156, 181, -530, 119, 183, -90, 342, -350, -243, 357, -125, 234, 27, -525, 256, 60, -39, 285, -508, -96, 327, -159, 290, -139, -420, 348, -20, 57, 184, -498, 94, 251, -110, 315, -281, -283, 392, -88, 138, 79, -497, 249, 170, -97, 282, -413, -95, 361, -146, 200, -71, -467, 362, 58, -26, 218, -495, 44, 315, -165, 232, -233, -344, 417, -53, 35, 109, -504, 214, 231, -140, 263, -342, -171, 454, -112, 119, -3, -454, 349, 141, -116, 207, -428, 15, 390, -203, 165, -135, -356, 444, 11, -39, 122, -467, 145, 320, -210, 222, -291, -215, 450, -115, 37, 24, -456, 307, 213, -189, 188, -358, -41, 455, -190, 113, -89, -363, 413, 61, -118, 153, -419, 133, 384, -224, 153, -200, -244, 478, -44, -46, 93, -455, 288, 260, -262, 136, -282, -104, 466, -177, 3, -31, -401, 395, 117, -228, 144, -370, 66, 429, -260, 69, -111, -315, 469, 8, -136, 125, -367, 202, 334, -279, 138, -218]
6044b18N0O72o36Q0J08m27P24j59m68M35m50L08M57p40K27l5k43P83m45k53L51
6065A21m84N16K34o91L71j91p1P09n95q6K70m62O92m8o18M67l25J64N18p27K06
6086c0P4l56P36l20m04M48m17L68L38p55L20m3j61O77n19j90L66m12N30M6o70
6107c74M48k22N4O02p23P0K72m08O53k05n58N23k94J89M27p80K55J03k45O80m65
6128Bl32M81m10M88J53q02M45p8o8O25o96j03M43m16N62q6o43N48k03P8M69p43
6150b86J46K60l34O09l32m68N93l48K86K48p77L99P4k40O45n95k23N49l93M39
6170B52j4o72N14q4j03N87p79P2M19m18N83k78n34O26k70J46L37p93L16K30l29
6191a92N81m68l14O14l80L53J12p72N14M1k01N51o54o5N40m44M64j29o32O41j69
$$ y = [-218, -168, 504, -132, -52, 56, -371, 353, 194, -274, 161, -289, 19, 476, -264, -37, -72, -315, 468, 23, -230, 121, -363, 153, 387, -304, 67, -124, -195, 514, -81, -167, 103, -359, 333, 285, -333, 134, -191, -27, 491, -236, -30, 44, -312, 424, 104, -300, 148, -269, 99, 437, -318, 2, -41, -202, 475, -44, -234, 132, -280, 250, 296, -374, 74, -148, -94, 508, -215, -145, 127, -281, 372, 167, -391, 132, -162, 27, 454, -326, -71, 32, -213, 467, 2, -330, 151, -259, 229, 382, -420, 25, -53, -121, 504, -192, -295, 148, -268, 294, 208, -435, 113, -90, -12, 457, -286, -140, 120, -214, 395, 63, -405, 188, -160, 126, 374, -403, -4, 70, -170, 475, -120, -343, 206, -187, 252, 238, -434, 80, -4, -107, 480, -299, -227, 192, -226, 357, 79, -455, 171, -99, 47, 384, -409, -93, 137, -192, 389, -79, -393, 221, -159, 194, 306, -466, 48, 89, -112, 439, -215, -280, 260, -184, 280, 151, -481, 160, -9]
6212inM43q41K50L99m10N45m03m33P28l33J30K61q00M66J79l37N88o25j54O59
6233B98m65L73pp21O38kj81M68p34P4N73m68M57k40n78P59k32j7L60q22M04L43
6255B80m51N10m47l25P64l99J56J49p88O37J26l63N53o95LO47m76L24j03o29P47
6276B20j14j93M36p91K99M94n11M43l41m20Q24l43L4K47p99N43K40m29M87n27
6296b01j66P81n01J98O1o92P03J0l27M64o92J62O01n90L61j96m73Q22k54j46L44
6317B69p37M60L60n40M47m05k57Q12m35K7J75p35P18J21m71M88o02L5P34o04K38
6338I8qn84Q00j18l51M58p02K91N55o65M11k18m60R05m12j07L09p09N94K66n99
6359b46M78m48j11Q18n88O4J76o50P84l7m62N14o16J62O65o78K75q8m68Q62k99
$$ y = [-9, -14, 429, -412, -162, 237, -173, 372, -31, -464, 264, -69, 61, 322, -478, -12, 167, -170, 418, -207, -361, 298, -167, 206, 199, -522, 116, 114, -67, 401, -333, -259, 314, -154, 303, 63, -515, 244, 12, -5, 355, -467, -63, 280, -171, 339, -108, -433, 331, -68, 88, 237, -551, 86, 212, -151, 402, -293, -290, 357, -119, 205, 102, -527, 220, 106, -87, 349, -442, -143, 351, -160, 283, -58, -478, 346, 3, 37, 284, -515, 28, 268, -161, 326, -201, -367, 414, -87, 111, 172, -520, 183, 193, -134, 330, -362, -200, 401, -189, 172, -24, -497, 325, 71, -75, 269, -468, -8, 352, -188, 259, -146, -403, 409, -26, 1, 176, -559, 159, 280, -191, 297, -305, -270, 464, -140, 98, 90, -494, 306, 188, -163, 295, -407, -116, 439, -226, 185, -33, -493, 412, 0, -107, 202, -507, 87, 353, -246, 232, -216, -327, 491, -97, -33, 143, -507, 277, 240, -222, 292, -324, -162, 503, -175, 100, 12, -456, 406, 107]
6380A07l08M11o21M30M37p15M33l41k21R05n53j09L04o65P13J14o16M83m78L3
6400b57P82o98J58Q2n40Q53j76m54M67n69L08N54p69L33j06l71R13m42k67L95
6420A96o38O05K67p36M73l67o0Q25o83kK72n93P51n3o02N13m65J63O82q08K40
6441b0N1m20Q58l41m33M93n54M46M14q45M32j63k16Q68o06j69L71n89O93Q6p14
6462c58N07l45J9P23p25N7K48m93P67k03n68N62m87K87N29q59L13L7l50Q47m92
6483A6l51N37n53N45K09q11M89j71j46Q09p41m7L95n22O82n2o83N65l43J01O35
6504E63q65J67K42m41Q12l82n04O24m78L59L58q70M33Rk94Q08o58k11N28n23N67
6525B44Q3q12N98j91o7P18q54N8M07m86P09k30o55O78l37J76M65r07L27K07l88
$$ y = [107, -201, 210, -411, 19, 456, -259, 174, -167, -388, 517, -36, -145, 159, -506, 207, 321, -295, 188, -290, -257, 525, -173, -15, 67, -473, 380, 204, -250, 217, -352, -44, 510, -259, 74, -32, -403, 510, 68, -199, 196, -442, 163, 430, -306, 167, -200, -260, 565, -118, -120, 152, -441, 310, 257, -345, 168, -297, -134, 548, -260, -20, 31, -389, 469, 128, -305, 188, -366, 80, 494, -351, 81, -82, -298, 570, -36, -205, 166, -423, 270, 356, -358, 149, -196, -177, 546, -179, -122, 126, -367, 400, 197, -371, 191, -296, -9, 520, -339, -26, 11, -339, 508, 16, -335, 202, -351, 194, 403, -408, 81, -90, -236, 573, -168, -215, 180, -342, 340, 288, -395, 170, -173, -72, 563, -302, -135, 107, -334, 478, 96, -408, 216, -262, 97, 455, -415, 18, 27, -267, 541, -117, -328, 200, -323, 244, 327, -485, 113, -78, -145, 573, -281, -223, 184, -302, 407, 177, -478, 200, -137, 39, 504, -403, -76, 131, -257]
6546b57P33n08l83O65m78L75K58q98N38j9j96P06p66o6N23n29N94p3p17O41j97
6567e4k3N92q76K06L75n10P31l82n45P36l83K30L68r28M53J56l50O98o53k24O61
6588B78m82M25P6q43O45p5j20N78q13N6N45n17O04k43o37P54k69J2M68q96L51
6609a03L43m64O54n03m11P78m41K67K12q71O14J14l72O31p26p8P08n21M53r4p52
6630e62P57j05j34M88q46K37M93n50N47l25n44Q60l52O4L43q96M90K86m38N70
6650C83n71k38P95m93K80R0q02O91M6l28N47p50Q6O76n88M09j61o05Q25k21j34
6671f3M34q50L90M41n56N22m28l47Q40m05O8K02p88O23J99m44N15o09q6Q03o03
6692a42K92l6o61P96j04k87M76p43K39N85o15M51l00m52Q84l33j08L15p70N48
$$ y = [-257, 476, -32, -415, 250, -228, 147, 405, -493, 45, 26, -170, 536, -230, -296, 227, -302, 292, 219, -498, 143, -54, -77, 515, -361, -155, 220, -290, 441, 59, -486, 250, -133, 97, 465, -463, -10, 146, -204, 494, -159, -383, 278, -204, 221, 297, -546, 99, 24, -96, 482, -331, -275, 270, -247, 357, 114, -523, 231, -38, -26, 442, -454, -103, 240, -224, 430, -73, -484, 294, -147, 120, 332, -539, 75, 189, -183, 448, -278, -356, 352, -169, 284, 190, -562, 195, 90, -44, 444, -402, -165, 328, -222, 325, 0, -544, 316, -36, 28, 371, -525, -35, 251, -187, 383, -188, -426, 369, -124, 156, 246, -556, 135, 181, -147, 400, -350, -264, 412, -176, 233, 72, -533, 292, 71, -63, 371, -479, -89, 352, -204, 318, -110, -457, 383, -22, 46, 248, -540, 83, 282, -162, 353, -256, -342, 461, -142, 150, 114, -547, 249, 145, -142, 334, -409, -170, 415, -200, 251, -49, -501, 383, 50, -58, 257, -513, 35]
6712C5L47n77M93n05j99Q62n05R2J11o91P42M4m39M65o20R2P30o27K79j03n47
6733e21Q50j74l03M08p26M29M62o42M30l34k95Q66m31n7K52p10O36J96n66M91
6753B61n12k4P57n95J65K9n73P89l5m45M41o27K27O30o87K99j45m24Q97l62k15
6774a49L58o38M90L58o54M09l49j90Q69n47k7J96n80O91N1n42M63m62Q7O94o93
6795a65J72L2m61Q40k19m34M36n72L58N10p29L18j87k55Q34m58j96L30n79N77
6815A52K23o70M27l28n7P65o41M1J80n25P49n4n48M64m57K21N71p30K32k1l45
6836c51Q06l62l34M18n31M56L43p43L62j64j48P73n90j37L34m98O39M3o52M73
6856A37l11O9O13o79O1J71m03P12j83n20M73m03L21M25p82K97mk77Q08m99k85
$$ y = [35, 382, -195, 298, -207, -406, 456, -49, 43, 154, -537, 205, 249, -190, 275, -345, -253, 477, -150, 129, 26, -521, 329, 155, -148, 260, -466, -37, 425, -217, 213, -121, -416, 450, 19, -38, 214, -496, 140, 336, -230, 261, -251, -275, 482, -113, 52, 81, -492, 297, 262, -183, 258, -369, -142, 488, -199, 100, -45, -469, 428, 66, -149, 209, -429, 61, 419, -235, 174, -175, -365, 504, -43, -70, 126, -454, 237, 288, -254, 209, -253, -166, 528, -165, 7, 39, -422, 418, 199, -235, 201, -371, -13, 497, -232, 86, -101, -356, 478, 20, -176, 154, -425, 152, 375, -295, 132, -196, -253, 512, -129, -88, 92, -433, 316, 262, -286, 178, -279, -58, 513, -217, 15, -6, -351, 455, 93, -241, 177, -354, 102, 445, -298, 64, -100, -248, 525, -65, -202, 132, -366, 273, 316, -336, 137, -174, -105, 508, -171, -110, 61, -342, 370, 187, -333, 140, -263, 58, 483, -299, -2, -6, -283, 525, 26, -259]
6877b59M23m45M68J88p06M26j89q6P04o85k9L14m38O58j05o09M86l01J64M89p45
6898b77J94J53l41P30m01m12M91l69L57K93p86L52K2j90O61n75j77M31m13N53
6918B96J4p25N16j66L1N32p47N9L40l90O58l00n10N15k82K42L42p76K84J40k63
6939a90O36m95l08N54l90L89R9p04M39l2j08N81o88n9M53l70N07j39n98N42j86
6960f7P1M39p81J89K99l22N55l84l90O02l19K35K21p72L78J54k43N50n85j75N27
6981A82l45M01l4o77N60o8o3M68p51J15M44l78M92k84n05O19k07P9L02p21K99
7002g2K26k79N01m75k91O38l37K44R8p16N28M5j76M39o27k2N62m03L55j45n45
7023d52N80r3n4L34p01K48L54l52M44l38l97O49k34J01J63o94M56J80k92M31n24
$$ y = [-259, 164, -281, 187, 375, -331, 95, -94, -180, 524, -161, -190, 124, -314, 344, 239, -370, 116, -185, -21, 468, -277, -83, 70, -271, 459, 58, -354, 137, -232, 125, 418, -368, -16, 6, -184, 477, -98, -275, 156, -257, 296, 310, -415, 101, -65, -34, 498, -249, -190, 150, -240, 418, 118, -392, 123, -159, 83, 425, -351, -67, 73, -190, 446, -49, -357, 197, -193, 196, 295, -409, 30, -2, -110, 471, -217, -276, 177, -193, 314, 175, -423, 119, -67, 4, 443, -338, -149, 150, -172, 383, -1, -391, 211, -108, 127, 348, -424, -46, 108, -135, 415, -170, -345, 182, -163, 238, 204, -473, 87, 19, -44, 424, -327, -212, 232, -146, 346, 62, -443, 176, -31, 48, 350, -371, -72, 154, -125, 376, -99, -390, 248, -89, 155, 253, -463, 65, 110, -66, 373, -254, -276, 286, -117, 238, 93, -452, 128, 35, -19, 315, -386, -138, 216, -136, 308, -30, -427, 222, -12, 89, 252, -442, 14, 194, -98, 333, -191]
7044a91j14N97l34K10k7n95N87Rj92L76o41J30M59l60K99k16m38O43j69j1K09
7065B31o47L45L08l63L64l96k08O57l15R4Q9o11N43J27l19L73n55L9N65l70J88
7086A39r4n04O74n5k04K78n92K34M33m10K96k59l42P14k56n1K08o36M51K39l89
7107a26L29m23p7O35l69R1K0n05N76O6l14L23n49J62N33m53J94j26l81P02j89
7128A19j78K40n67L76L39m52K80k94j60O57l61m3J52n19N46J39m04K97m35O3N87
7149C82m40Q8l0m16O65r9k99K85m61K52M75n43K09j84k29O96k77j50K00m88M49
7170H5K58n01K78l17l5O48m35oM7m08O10J0m04L10m21J82M99m85R6m6l19O83k13
7193A16k90L14m69L75L40n72K39j82j25O49m03j12J80l96N29P8m90L24l10M9N91
$$ y = [-191, -305, 292, -42, 168, 141, -454, 133, 142, -50, 326, -315, -185, 274, -86, 213, -3, -441, 202, 33, 22, 231, -416, -71, 237, -126, 238, -158, -366, 291, -24, 70, 159, -452, 91, 218, -101, 272, -283, -244, 321, -49, 139, 45, -459, 215, 160, -44, 234, -358, -124, 309, -101, 195, -64, -406, 308, 52, 1, 209, -427, 24, 263, -126, 203, -220, -297, 338, -31, 60, 80, -425, 151, 217, -97, 226, -323, -161, 372, -81, 113, -13, -394, 308, 119, -59, 181, -386, -10, 329, -123, 157, -137, -297, 360, -1, -44, 108, -411, 135, 274, -130, 167, -268, -205, 382, -58, 30, 0, -416, 249, 150, -149, 136, -325, -73, 402, -141, 68, -116, -345, 351, 74, -76, 124, -364, 85, 343, -158, 120, -197, -232, 416, -19, -25, 22, -386, 224, 234, -170, 140, -281, -99, 400, -85, 11, -35, -354, 329, 116, -174, 140, -329, 46, 386, -186, 53, -129, -254, 395, -8, -120, 60, -336, 193, 271, -219, 105, -205, -156, 435]
7214D35n50N4R2l46O31j32m01L34l81K64M12o06K11q3k08O85l73k49L11l85L83
7235I8K47o00L14j93l8N88n06n3K27l99N81l3n03L69l02J52M90o17J52L8k74O14
7257C52k28l64L44l48L24K88o08K41o4j60O17l96k02K76l23M44O6n71L34j46K0
7278a04N22n74JK31l24N49j21n00M00k70K09L70o28J87P3k06N97l69l36M39l47
7299b01L66J65o73L64o1o7N29n11j18L30l68M80l2n59M34k02J00M21o38Q9K38
7320H6k98N31k74l67M27k33K06K66o34K34J06k05N62m75k21M41l01L34O8o15M20
7341E8o6l2M42o12J8L37l12M72k04m59M85j92J05L29o71J95K03k52M92l72k91
7362c27M88k96K71J29o39L60P4j42M51n25r4M24l12L77p8n65N16j33QL82o30J37
$$ y = [435, -115, -61, 31, -315, 316, 184, -217, 117, -264, 0, 412, -194, 17, -66, -274, 411, 38, -211, 100, -285, 98, 345, -255, 59, -134, -172, 416, -90, -143, 84, -315, 266, 233, -270, 99, -203, -51, 439, -178, -26, 12, -262, 352, 124, -240, 104, -244, 80, 368, -240, 1, -63, -223, 394, -2, -204, 72, -251, 193, 259, -312, 22, -124, -104, 418, -156, -155, 76, -248, 301, 180, -320, 80, -190, 19, 389, -239, -52, 21, -185, 412, 43, -293, 146, -201, 165, 330, -343, 21, -40, -107, 422, -89, -207, 123, -245, 235, 203, -356, 78, -124, -24, 397, -241, -152, 86, -212, 319, 45, -322, 105, -128, 78, 344, -290, -56, 50, -155, 407, -68, -289, 152, -149, 185, 253, -362, 58, -8, -40, 402, -210, -192, 145, -167, 305, 101, -358, 127, -65, 40, 369, -302, -107, 96, -156, 336, -36, -327, 161, -135, 136, 265, -374, -14, 60, -82, 369, -156, -250, 174, -138, 239, 161, -404, 112, -21, -13, 369, -261, -124]
7384a24K93k99M18k69m02N56k46J35K29o79L26J99k60M78n00j72N26l01K47K2
7404A77n79M74nj50M26o04N3M34l59L61j55m77N67j36j0K81o57K70K91l12M12
7425C02l84k62N91k89J44J30o34M10J53k49M23n33o3N13l41K51m8n13N30n2j18
7446c9L18n91J60L91l40L08k38l78O49k12l7K48o02L76K24l50L80m33j32N88l35
7467d5J21P4n48N23L2k58L73n35O9M99l97K49j38m22O22j51j32K88n70K74L33
7488B61l86L30k93k28O08l28O0J22n46M64J71l66L60m30k4N61l92J59j1m87N82
7509A87m4k53L42n32J92M49m43K19j58l28O60k49j28K39n06L74K95m67L36l38
7529a53j11N99l59K0J03m78N20R0l94L43m16Q8N18m68J84o5l84O50j92k14L18
$$ y = [-124, 169, -130, 288, 19, -383, 173, -73, 62, 291, -388, -62, 137, -123, 355, -145, -317, 209, -92, 155, 177, -402, 72, 67, -83, 343, -261, -208, 226, -133, 228, 73, -404, 163, 27, 17, 298, -359, -89, 202, -110, 302, -82, -344, 247, -42, 102, 232, -402, 8, 161, -88, 335, -198, -261, 252, -89, 162, 114, -399, 131, 79, -39, 279, -312, -152, 239, -101, 207, -31, -409, 240, 28, -9, 239, -363, 13, 237, -113, 267, -166, -298, 290, -45, 76, 150, -398, 125, 157, -101, 272, -263, -194, 305, -92, 157, 19, -403, 219, 68, -64, 224, -346, -72, 261, -125, 205, -88, -316, 292, -36, 24, 146, -400, 64, 235, -131, 229, -201, -225, 336, -56, 103, 92, -395, 187, 143, -110, 232, -300, -108, 341, -102, 117, -41, -369, 291, 42, -86, 153, -353, 21, 316, -151, 185, -153, -264, 335, -24, -4, 99, -379, 141, 231, -163, 180, -236, -148, 370, -98, 86, 21, -363, 287, 95, -119, 199]
7550A99n14L04L57n02K82j88k31O50l55p4K21n17M67J24m16L34l31k2N89m63N5
7571c1R8m51O00m1l68L36m09J77M52n53K31q6k62O38k53k23K94m41L29K80n17
7592b00L08k06j09O00m25n4J90m37N27M4m33L58l50N5N25n40J24O7l60O10j68
7613A26l45L25l62K70L42n69K65q2k21O40l66k11L28m17M27J41n33L39k19rN46
7634D15n13J4J53l57N71r4m36L73l04J67L93n91J78L4k64O15l25k69L70l77L07
7655F0K47n67K89r6j21N86m57q8K58l74M70K3m95L63k15M5M78n75R9J27k92N07
7677B72j61l60L72k96K26K77n91K44K9j92N26l95j62L41l70L76J00n64L70j00
7697e8o3M94n28NK75l88N12j19m41M33k51J05L73n78J54J55k64N24l09k81L95
$$ y = [199, -315, -11, 346, -156, 126, -62, -293, 357, 2, -72, 149, -368, 99, 223, -193, 141, -190, -212, 377, -86, -31, 67, -384, 216, 175, -193, 143, -266, -89, 363, -190, 41, -45, -307, 331, 78, -145, 149, -292, 37, 317, -200, 108, -98, -207, 393, -32, -86, 104, -333, 194, 238, -195, 163, -187, -132, 393, -147, -23, 44, -316, 294, 126, -219, 106, -256, 14, 356, -213, 52, -30, -251, 389, 23, -188, 140, -277, 150, 291, -242, 97, -122, -131, 415, -98, -84, 69, -288, 283, 189, -247, 126, -178, -11, 382, -209, -31, 3, -261, 354, 29, -240, 130, -247, 60, 307, -260, 29, -67, -188, 398, -59, -147, 111, -263, 207, 230, -265, 98, -117, -72, 406, -169, -70, 57, -235, 272, 111, -249, 123, -173, 53, 330, -261, -17, 12, -180, 346, -49, -211, 130, -240, 136, 236, -328, 42, -58, -121, 373, -155, -150, 125, -263, 249, 130, -311, 122, -129, -24, 349, -229, -75, 80, -184, 340, 31, -250, 145]
7718A45k98K67J77n95L17K1j53M82m68j09L54l00L27K0n36L97j03LL91n71R4K85
7740A47l30M18j60m09M58k18J45K43n88K70J09k50M87l66k36M51l00K64R2n45
7760c18L74k2j24M18m93k8L63l36L71r0m67M72j74L8K90n73K03K45l01M13k92
7781c1k83M74k63J72J68n66L24J03k16M10m21j10M11k84K65Qn29M52n3o7K98m76
7803b14Q2L05l06L48j82l38M84k10K6K20n18K61J84k45L39l07k16N22l15J81M4
7824A45m83L90N0j69L23m45k1M16l25K59o1m31M89r0r7K87n00J81K94l18L08k54
7846e2k37N12k29L7J71n22L39J50l06L45l55r0M76l13J98k0m26M09rj70L08m65
7868b49J03L82l56K53j29l51N53j82m8J91m45K79K37l59L22k87j76N22k65L9Q6
$$ y = [145, -153, 114, 291, -304, 13, 34, -119, 363, -105, -214, 140, -160, 167, 187, -349, 48, -55, -52, 339, -232, -138, 147, -183, 235, 75, -334, 124, -94, 51, 294, -294, -24, 85, -165, 322, -44, -280, 171, -129, 135, 227, -318, 56, 34, -90, 328, -165, -193, 170, -166, 205, 115, -352, 120, -54, -16, 274, -299, -96, 149, -152, 261, -31, -314, 160, -103, 69, 237, -329, -5, 98, -118, 292, -129, -239, 172, -112, 153, 161, -368, 84, 31, -36, 262, -214, -132, 173, -133, 215, 33, -305, 179, -31, -5, 215, -303, -42, 142, -103, 236, -71, -287, 235, -80, 101, 145, -338, 52, 102, -67, 256, -189, -210, 206, -119, 140, 79, -352, 137, 47, -50, 237, -263, -82, 212, -106, 202, -52, -289, 223, -6, 31, 202, -320, 19, 169, -137, 208, -147, -237, 239, -74, 124, 104, -322, 87, 78, -92, 216, -249, -146, 236, -120, 133, 4, -347, 206, 24, -24, 167, -278, 1, 238, -121, 201, -86, -262, 260, -5, 34, 120]
7889A20m44M35N4k63K79l35l4M32k96J22m2l47M89j00j41K40m52K39K85l51K41
7910A31j84k25N24k19n5J62m35L44J75l41K69k84o3M92l37P6L9l81M60Pk71L00
7932A84m10J23L76l78J64o7l06N49j59j77K35m19K98K33l79K48k03j26M94l02
7952b2m9J50l80M29M4l36K81k88M0M26l74P7K3l12N03q4k52K44l38K10L02m24
7974a30K11j19j85N16k50j47J76l37L37J36l48K27k06m3M59l61oJ29l30M56k0
7995A65l49K86k92J24L65m14J22qk42N29j99k37K37l01K67K21m05J82j12j49M95
8016B85k87j26J95k89L73M0l80K39j56J6M05l94J2J04k76M53r9k95K83k61J66
8037HK74m33J46j2j64M48k53j75K72l10K83J30l96K17r9o9M41l50n2J65k80M08
$$ y = [120, -324, 111, 165, -98, 181, -154, -188, 244, -52, 70, 28, -319, 170, 70, -71, 169, -283, -44, 241, -110, 131, -53, -278, 246, 27, -28, 134, -301, 43, 218, -123, 146, -138, -201, 291, -46, 30, 69, -312, 148, 155, -116, 184, -226, -103, 273, -105, 59, -8, -314, 235, 76, -101, 134, -285, 13, 246, -133, 115, -88, -214, 280, -22, -71, 79, -301, 128, 172, -164, 117, -171, -131, 295, -79, -2, 21, -291, 212, 128, -124, 120, -218, -8, 294, -130, 81, -38, -223, 293, 43, -104, 72, -265, 72, 208, -140, 87, -119, -162, 297, -64, -70, 59, -271, 185, 165, -184, 102, -190, -66, 299, -115, 7, -1, -243, 286, 87, -150, 87, -214, 53, 274, -131, 51, -61, -210, 285, -2, -128, 67, -222, 151, 191, -189, 50, -106, -90, 315, -79, -67, 37, -239, 214, 115, -180, 103, -158, 8, 282, -151, -5, -17, -181, 267, 14, -161, 111, -199, 84, 214, -182, 35, -64, -133, 308, -42, -94, 71, -209, 199]
8059A99l8l38K39j66O6L34m71J16Q9k09M30k18k36L07k46K04J76m61K14l3r9M11
8081B70l23j15K67k66K97N1m13K82j18KL42l84k3J95k36M10j41l20L05j66R7K36
8103B49m42J48N7j40L81k72j84L07k45K66P1m33K47l0n7L30l55p6K58k14K93k3
8125A36l97L29j03jK85m01Q1J50j74L41k11k63L32j92J48J73m53K13M0j24L59
8146B68l34j14K87k13K36K0m04K90m9k7K79m00K2K40j98K91j45l23L65j27O8K10
8168B42m53J49J52k04L42k58j78L63k11J45R3m43K96Po6K84l70m1K95k13K04o1
8190G4l42
$$ y = [199, 161, -177, 62, -104, -38, 296, -175, -59, 30, -179, 251, 33, -203, 104, -142, 62, 238, -223, -9, -42, -141, 270, -53, -168, 99, -167, 130, 181, -232, 50, -68, -66, 276, -108, -131, 64, -172, 238, 97, -223, 82, -84, 13, 249, -193, -45, 12, -128, 253, -19, -203, 104, -141, 125, 196, -237, 10, -20, -77, 253, -102, -178, 80, -134, 159, 136, -261, 68, -35, -36, 249, -152, -71, 79, -95, 246, 35, -228, 104, -88, 60, 233, -220, -7, 33, -91, 268, -66, -180, 107, -106, 130, 150, -254, 36, -13, -40, 239, -161, -139, 101, -97, 194, 49, -274, 91, -36, 32, 242, -211, -62, 90, -114, 228, -30, -208, 155, -56, 89, 182, -261, 35, 42, -24, 260, -110, -151, 144, -69, 135, 74, -268]
8191b68
$$ Imaginary data points
##PAGE= N=2
##DATA TABLE= (X++(I..I)), XYDATA
0@%%%%%%%%%%qJ6j6J6j6K4l3M1n4O2p2Q8j05J29j53J78k10K42k79L20l68M23m81
33b56N47o19O97p84Q81r88J105j233J371j522J688j866K063k281K518k778L061
50A604l369L709m086M504m970N492o079O745p511Q400r450J0713j2255J4193j6718
65i078K0155k5144L3149m8722J26712k38451J01825J23640k85053M43828k32114
76A0747j88641L14388k81841J81724J84818m41359K71529m6185j41758L91031
86B54453l23184o0116K59083l00512K89863J7570l54716L11575j40474k7738L21661
97B47465l87630Q0709J53894k55216L36664j21553k49902L17188k14159R2082
107d58K09941l94582J89085M6610j84516L45053k40845j22590K78464k48812J91547
$$ y = [0, 0, 0, 0, 0, 0, 0, 0, 0, 0, 0, -8, 8, -8, 8, -8, 16, -17, 24, -30, 32, -40, 48, -57, 72, -81, 97, -113, 129, -150, 170, -198, 225, -256, 291, -328, 369, -415, 466, -522, 583, -650, 721, -801, 887, -979, 1084, -1197, 1321, -1457, 1604, -1765, 1944, -2142, 2362, -2608, 2884, -3195, 3550, -3961, 4439, -5011, 5702, -6553, 7640, -9078, 11077, -14067, 19082, -29640, 97072, -141379, -39554, 84086, -200967, 242861, 10747, -177894, 136494, -145347, 36377, 221195, -220164, 51365, 5180, -136578, 254453, -68731, -128847, 130236, -170276, 119587, 137157, -217559, 94016, -46458, -74196, 247465, -140165, -59456, 94438, -160778, 175886, 54333, -195569, 121619, -92540, -458, 209483, -185099, 3986, 50596, -133920, 211133, -29712, -152302, 126162, -122650, 68897]
118F8897Q3008l58111K65226n6817r1748L07509l19514O287K07531k45826K60037
129A26479m5472k79046K96435j41222R438K30858l51222J21244J14691k05415
139a23232K87500j58115j71482K81999j94860J03316J28895l35342K04904J8306
149D1889j36204K73419k41457n5559K32820k12919J75637J9230k81747K52385
159F7494o6875n3531K26307k90455N3101J62705k00130K20243q5346k01699K66367
170I8181j34638K9712J55330l03339J45961P9766j62020K35229j74335j04291
180a34444K47533j79216J04820O8297k78564K13630p035j02664K18731k37148
190h6060r07J97218j92994J62167k5392k19628K47065q3620l0611J70918k65099
$$ y = [68897, 151905, -206206, 59020, 2203, -89545, 217964, -101550, -95263, 112268, -133558, 126479, 81007, -198039, 98396, -42826, -33388, 197470, -153752, -32508, 82183, -123232, 164268, 6153, -165329, 116670, -78190, 25126, 154021, -181321, 23583, 41889, -94315, 179104, -62353, -117912, 114908, -98011, 77626, 96856, -184891, 67494, 619, -52912, 173395, -117060, -63959, 98746, -101384, 118859, 33513, -168186, 98181, -36457, -6745, 148585, -154754, -8793, 70973, -91047, 144182, -30153, -134444, 113089, -66127, 38693, 106990, -171574, 42056, 35021, -67643, 151088, -86060, -86967, 110251, -82743, 79424, 54032, -165596, 81469, -2151, -32762, 138156, -126943]
201a26943R2774J25221j74359J91874j11104j38367K44238j37003M0190J01011
211A07532k57502J65098M6820j32178J92037j76908m8063K12337j65130R9628
221D3671K2263k20468K11982k8197p6686J67449k18018M1373J58711j70699J43081
232G4462n5187j60788K31079r3817j4471J22868k32288J20672R0169j53457J65931
243I5173j23596q5137K20684j41569M7356O2668k17857J79969J6452j14263J63177
254A03057j74774k385J83318j64228R8498o301j75446K12184n1819o0509J34740
265I6335k01052P5689J26142j60541J30161p2342j12371K15258j06081l224Q8289
276G6263j99916J39037N8610j35650J41422j26114l9261J92794j42351N0132L2373
$$ y = [-126943, -34169, 91052, -83307, 108567, -2537, -140904, 103334, -33669, 6521, 107532, -149970, 15128, 61948, -70230, 121807, -55101, -103164, 109173, -55957, 43671, 65934, -154534, 57448, 29251, -47435, 120014, -98004, -56631, 102080, -68619, 74462, 19275, -141513, 89566, -4251, -18722, 104146, -128142, -7470, 82699, -70758, 95173, -28423, -113560, 107124, -34445, 12911, 75579, -142278, 37691, 54143, -60120, 103057, -71717, -74102, 109216, -55012, 43486, 37185, -138261, 73923, 22104, -38405, 96335, -104717, -29028, 97114, -63427, 66734, -5608, -117979, 97279, -8802, -12026, 76263, -123653, 15384, 73994, -61656, 79766, -46348, -85609, 107185, -35166, 14966, 47339]
287D7339j74619J82529j1023r5280J34010j63248L4994J49415j58161R4194k7321
298A2829j29455K03022p4744m4273J07392j79716J03092R0165j51339J22555q4160
309b4632o8392J97692j23503R835O3613j71039J55812K3313j23026J29275j27759
320e8811L90J66500j50273N7662J0918j38476J84788m0374q0039J14789j50839
331h3765O5035J16226j54035R2358m0460q9826J88364r2596l0705Q4936j53601
342i8069J17956N6753j38534J11674q4439l2820J70699j29735J8454M5071j38421
353a01411J55967m826j07870J14832j17714K7280J35454j49887O1755p43j06107
364i3270J75443o2953o5481J00965j35637Q4211Q4957j49785R3405m6704n8688
$$ y = [47339, -127280, 55249, 44226, -51054, 82956, -80292, -45298, 104117, -54044, 40150, 12829, -116626, 86396, 11652, -32621, 74771, -104945, -1853, 88312, -63027, 59528, -24632, -93024, 104668, -18835, -9000, 54613, -116426, 39386, 62699, -60327, 68948, -58811, -58421, 108079, -42194, 15468, 26386, -112090, 72698, 32324, -47715, 67074, -83765, -18730, 97496, -56539, 35819, -4641, -94467, 93897, 1301, -29404, 55532, -98069, 19887, 76640, -61894, 49780, -34659, -67479, 103220, -26515, -8061, 37010, -101411, 54556, 49730, -58140, 56692, -61022, -33742, 101712, -48175, 13580, 12837, -93270, 82173, 19220, -46261, 54704, -80933, 3278, 88235, -61550, 31855, -14849, -73537]
375g3537J72061j10123j6687P1509j33153J28447K5730j28566J08145q4332l982
386d4488J45824j38500K9903L2197j11114J53369l2690r1602J05024j08191M9245
397a1023J02722j46529O7416j0018p4768J58502q2577m7103Q7012j16195R4573
408B2012N0657j36715R2434m9095k9660J45736j19934r36N8105j08731J28375
419E2248m930j11936J03669q0436J8872J16183j41339M2400K1719q6526J45829
430G5753n8048p4269R9262r9672O4880P2208j43132P6943j7001n1666J43193j00656
442a2205k8842P9315j02963J01370K0710j25524R6760n1022r464J21719j27181
453c7327J5733M8796r0252J23368l0129r4060J00573p5121L3349Q6380j37233
$$ y = [-73537, 98524, -11599, -28286, 43223, -89930, 38517, 64247, -64319, 43826, -40506, -44488, 101336, -37164, -7261, 24936, -86178, 67191, 34501, -57101, 47923, -60268, -11023, 91699, -54830, 12586, 2568, -72200, 86302, 3725, -43378, 43634, -72561, 22012, 72669, -64046, 28388, -20707, -50367, 95369, -24565, -25501, 32604, -76127, 52248, 47318, -64618, 39051, -41385, -22513, 93670, -47669, -5269, 16450, -70076, 75753, 17705, -56564, 42698, -56974, 7906, 80114, -63018, 13925, -3076, -54742, 88451, -12205, -41047, 38268, -64695, 36675, 57385, -68139, 28621, -22401, -31865, 89854, -37327, -21594, 27202, -63050, 60318, 30189, -63871, 36702, -38419, -5070, 81310, -55923]
464e5923N3703J4089o5215J29822p5181n4355R1278q7781P1530M2251j31439Q2544
476A5323k0602l1690J20857j10363j0087P0788q8474J00786o134j09880R9397
487B9921n1812O420R6880j30797L3193M0793p5989J16650n2639p5115J00749p3944
499c5690M3916O0440j33158O8342O342n0951J16149r0627l3152Q7156q2392P4976
511C1351J6770j18456R0789k5745j8255R9958j15410Q934O3124p7325R5026k7396
523B3365r1027R9880n1230J5757P1939j25742M6935L3143o2278J03061o6956n4752
535e7905R6658o8981M7486L6126j21577P7821K33l9121R8887r7963j3393Q1259
547C9530p6769P3798m115j03132R7470l1255r591Q1470j16828K8005N5346p1919
$$ y = [-55923, -2220, 11869, -53346, 76476, 1295, -53060, 38218, -49563, 21967, 64218, -67221, 15323, -5279, -36969, 83888, -26475, -36562, 34226, -54248, 46538, 40404, -69476, 29921, -21891, -15471, 81409, -49388, -16195, 24598, -51391, 65259, 12620, -62495, 38254, -35690, 8226, 68666, -64492, 3850, 10192, -40759, 75390, -15237, -48389, 38767, -43625, 31351, 48121, -70335, 20454, -5291, -23546, 76412, -38998, -30064, 33060, -44265, 50761, 23365, -67662, 32218, -19012, -3255, 68684, -57058, -10123, 23020, -39258, 63803, -3153, -57905, 38753, -30228, 17258, 53384, -68193, 9628, 9861, -29260, 69627, -28336, -41729, 39530, -37239, 36559, 32444, -70688, 26782, -4473, -14064, 67406, -49422, -21417, 33929, -37990]
559c7990Q9992m4307p2197J02399n5558K2021N1927j20137O3056K3926n4978R2316
571F0470p8086l3423R3198o8964M9490J5506j07854Q7356p596l0411Q1469j00487
583c9332O776P3090p1592O9007k1393q3434R9300l5817k799O1007j10580M4050
595a1717M5273o4596P9811n5542n0313R9128n8108K5324L2914j07981P4938J3183
607B2314m8211Q0105q3452j1938Q6662p0667N0068p78r1862R5223j8593k4325
619a5454O8103j00628K6852O3371p1244O6420l4897o3933J01716m4820K348M5511
631D3345j03539N9984L3415o0708P1967o3379k9031R4481o2270K7309J7076r3069
643f4419Q3541J683m2292O7407q3028P424P6334p0155M7601j2981p2489R6208
$$ y = [-37990, 52002, 7695, -64502, 37897, -17661, 4360, 56287, -63850, -794, 23132, -31846, 60470, -17616, -51039, 42159, -26805, 22685, 38191, -69663, 17693, 10097, -20314, 61155, -39332, -32556, 40534, -31058, 37949, 16556, -66878, 32422, -3395, -6194, 54813, -55767, -11717, 33556, -31040, 48771, -6771, -57084, 42044, -16064, 9260, 42174, -65807, 9131, 22314, -25897, 54208, -29244, -41182, 45480, -25187, 24881, 24103, -67759, 27464, 8871, -15454, 52649, -47979, -21127, 42244, -29000, 37420, 2523, -61410, 40306, -4514, -2166, 43345, -60194, -210, 33205, -27503, 44464, -18915, -47946, 46535, -15735, 11574, 28650, -64419, 19122, 20805, -21487, 45920, -37108, -29684, 46650, -23505, 24096, 11115, -61374, 34834]
655C4834k7811j9096N3927r3107M1982N0495o8552O1200m2292m3742R7768n2335
667f729O322L2560r2203P1402J9722n7357O5583o6849r322Q7151o8360L0221N550
680A7691p8849R0929j2052l7937N9282q2145K5681O5321p3198M8149k2334n4937
692e4399R7149l9657j3973M3807q5775N5605L6560o7086N7770m6732k4898R1135
704D9506n9664J0172K2292p8579P7679N748n2677N8598o5135P350P5343p1106
716b0473L1418k346o2282R0888k4212l2635N1283p5994L8842N1557p3445M7730
728B0331k7473l8023R3394n0289q858L6337p7026O5670K1855o5705N6652m9348
740b2483q421Q3674o8288J5374J5347o7201Q3332r434m8758N5918o4058K1883
$$ y = [34834, 7023, -12073, 41854, -51253, -9271, 41224, -27328, 33872, -8420, -52162, 45606, -6729, -407, 32153, -60050, 11352, 31074, -26283, 39300, -27549, -36871, 50280, -18080, 12141, 17691, -61158, 29771, 17719, -20218, 39064, -43081, -17400, 47921, -25277, 22872, 538, -54399, 42750, 3093, -10880, 32927, -52848, 2757, 39317, -27769, 30001, -16731, -41629, 49506, -10158, 14, 22306, -56273, 21406, 27154, -25523, 33075, -32060, -24710, 50633, -20473, 10945, 8599, -53683, 37205, 12993, -19642, 31641, -44353, -5511, 46046, -27399, 20331, -7142, -45165, 48229, -2060, -10918, 25419, -51607, 14063, 35918, -29787, 26865, -22483, -30904, 52770, -15518, -144, 15203, -51998, 31334, 21900, -26858, 29060, -34998, -13115]
752a3115O3336p5434L5440q092m8066Q9560l7194k6420M6057o9457M8984L6290
764D1889p2307M8615l0210k2477Q5023n8843k473K9719o5542P0121O144o0715
776c1056N4204m8026N994P0720p2710K0506R310n3252Q2802k3957m2025N2148
788B4658n9802L3903M8008p6965L9965j2774l3671Q4947n0178j8040M1941o3280
800d1288N7614J9650p0322N2197l3053q965P5911o8091O549K5097n6973P3154
812C1480r626n4817N5075m7633J6941N7610p6137K7443N332m2293P9098l6137
824F336l4072M9759n4696M0365L3267p4819M3083j4250k2217P5736n7446j0615
836a9569L8364n4694N8999N676o4958N2832l1975P91O3771p1726J3474K1718m7600
$$ y = [-13115, 50221, -25213, 10227, 2135, -45931, 43629, 6435, -19985, 26072, -43385, 5599, 41889, -30418, 18197, -12013, -34490, 50533, -8310, -10783, 18936, -46606, 23515, 29659, -31056, 23148, -24878, -18884, 51836, -20874, -368, 8942, -44310, 38492, 14535, -27490, 24658, -35144, -1241, 46767, -30198, 9767, -3007, -36678, 48269, -1909, -19949, 21992, -41288, 16326, 35976, -34346, 17851, -15202, -24167, 51744, -16347, -9798, 15299, -41674, 31480, 21854, -32963, 22112, -25521, -8580, 49030, -27107, 336, 5668, -36625, 42473, 6336, -27736, 22023, -32673, 7692, 40959, -33860, 9223, -5027, -27244, 48492, -8954, -19569, 18795, -35899, 23100, 28776, -36182, 16650, -15325, -14534, 49237, -22489, -9015, 12703, -34897]
849c4897P0946k2507m7308N5067m5681K4490M3952p6771L4806J773l3288P3968
861D4550m7254k4338M8678n1906M5511J8477p1603M9436j7534j3240O6820o5031
873a7434R6L5307m9348O0028q799n7610N5731l2763Q585N0935p3684K2313J8059
886A1416l9576O6286l3623l7735N4241m2693K8933K9555p3309M0476p50k4790
898b1569O4736n3909j4183M5911m6834M6048M972o4511N2875j9180o215N5492
910D3633o7852J0230L1628m4210N7840k0462m8259N7703l4252J4057L8766p3325
922c4503L2062J3565l4247O1690m3329k6479N4238m2999L2546J6575o9052M8218
934H285n187j8765N6611n9833k480M3323m4386M5922p296n6028N6626k1740r66
$$ y = [-34897, 36049, 13542, -33766, 21301, -24380, 110, 44062, -32709, 2097, 3870, -29418, 44550, -2704, -27042, 21636, -30270, 15241, 33718, -37885, 11551, -5983, -19223, 47597, -17434, -17338, 17969, -31379, 28649, 19850, -37760, 17971, -14792, -6207, 44728, -28956, -6643, 11416, -28160, 38126, 4503, -33232, 21009, -21684, 7249, 36804, -36505, 3971, 3221, -21569, 43167, -10742, -24925, 20986, -25848, 20200, 25172, -39339, 13536, -5644, -11859, 43633, -24219, -13989, 17639, -26571, 31269, 10807, -37452, 20251, -14001, 56, 38822, -34503, -2441, 11124, -23123, 38567, -4762, -31241, 22997, -20002, 12544, 29119, -39933, 8285, 3098, -15667, 40944, -18889, -21369, 21954, -22432, 23490, 16194, -39834, 16792, -4948, -5914]
947e914M4100o8119K0141K7471l9440N3226k9550l7255N7535l4494J6938K6495
959C1134o8494L9404Q894k8900N4006m8535j4637N1488m2070L3172N086o1006
971d0458N3406r969j3968M7598o2023R420L8957m3054M4993j7675m5883N9950
983B1294k6428L329L4002o7231L1377K1693l6986M9923l7854k5174N7778l7695
995a1972J9923J5638o3290M7753K752k5327M7510n2484k373M8069m2476L3134
1007A6857m505n1640N6952j4959j0398L8664o0571J9585L3276m1124M1671k4215
1019d07l4498N9393k9646N684K4563o1648L8894J5269l4104M4590m1554j3200
1031b6664N4799l9900K1088O686n5209N3311m142k2165M1103n3867R696M3033
$$ y = [-5914, 38186, -29933, -9792, 17679, -21761, 31465, 1915, -35340, 22195, -12299, 4639, 31134, -37360, 2044, 10938, -17962, 36044, -12491, -27128, 24360, -17710, 15462, 20548, -40458, 12948, 2979, -10989, 36609, -25414, -15994, 22963, -20091, 24902, 7227, -38656, 21294, -5134, -1805, 32197, -35034, -3657, 18036, -18950, 30973, -6881, -32055, 25723, -11972, 7951, 23589, -39701, 8052, 10804, -14523, 32987, -19497, -21870, 26199, -16277, 16857, 12352, -39288, 17664, 2705, -7693, 30971, -29600, -10015, 23261, -17863, 23808, -407, -34905, 24488, -5158, 526, 25089, -36559, 2335, 17604, -16500, 28090, -13464, -26664, 28135, -11765, 9323, 16009, -39200, 14111, 9969, -12196, 28907, -24960, -15264, 27769]
1043B7769m3835L3284j2668m1426O0098k1950o922L1162n8648L0438K5965m0610
1055a7343M0028l0279k2443N8365l5047Q745J6491n5409M6153P013l1536M0176
1067B4914m3482j418M9638m2081K2008m90m5360N5701j1279j8906L4492n1217
1079b7480J9346L5640m3458L1678j7566l0003N8739k7388m229K4082n2812L7697
1091D246J7817l9056L6971l2745j0917N4499l9312J0935R974m7678N1098j755
1103A4077k9011L6584m3861R526M3210m4977K3911o091l6011N7247j9624j5328
1115a0348L0032m8621K8155K7086m3706L1981k1137j9559N5943l3413p33J8863
1127A4543m6537M2729Q838l6876L4598l2967r22M8113m2214J2720N264l8505N1887
$$ y = [27769, -16066, 17218, 4550, -36876, 23222, 1272, -5650, 25512, -33136, -2698, 23267, -17343, 22685, -7594, -30037, 28328, -6719, 2026, 18517, -36892, 9261, 16274, -15262, 24914, -18568, -19986, 29652, -12429, 9579, 9089, -36271, 19430, 8151, -10755, 23737, -27480, -8134, 27506, -15952, 15726, -1840, -31843, 26896, -492, -4721, 19361, -33451, 4246, 22063, -16993, 19978, -12767, -23684, 30815, -8497, 2438, 12412, -35266, 15832, 14077, -14934, 21650, -22211, -12685, 30525, -14452, 9459, 3368, -32643, 24604, 4980, -10348, 19684, -28937, -782, 26304, -17402, 14579, -6558, -26117, 29826, -3587, -4320, 14543, -31994, 10735, 19573, -17303, 17295, -15672, -16594, 31519, -10695, 2025, 7289, -31216, 20671]
1140B0671r603k5898L2389m0684J7658L4885m5443K4080r257k5748N4823k6353
1152A520j1745K5506m3311L4169J7649m2511L1738k2942r452N0855l8912L476
1164c960J4453l9913M6303j259l3763L3724l3292Q384M0397m5430J6725J158l0300
1177b6773N1856j8812k1280K9993l8139K4778K5292m5541K6144j1741j6579N0630
1189B9828l2726p229K2031l7404L7618P869l9900L1189k2606j075M3461m1936
1201a0880O755J1346l2067M5702r629k9824L1879l0622J4562L1484m5857J9291
1213B140j123k2412M8515k5678j6340K7779l4434K8999J5590m3839K8374j3381
1225e810r034M5084l8112j453J9334l2654L9606k014l6187L2373k3090N964L5436
$$ y = [20671, 11068, -14830, 17559, -23125, -5467, 29418, -16025, 8055, -1202, -26950, 27873, 1520, -10225, 15281, -28030, 6139, 23788, -18723, 13015, -9927, -19379, 31476, -7436, -3960, 10493, -29420, 16883, 15624, -18139, 15585, -17707, -9323, 31074, -14356, 2369, 3527, -26773, 25083, 6271, -15009, 14984, -23155, 1623, 26915, -18626, 7518, -4223, -20802, 29828, -2898, -10127, 11904, -25500, 12118, 19987, -19913, 11276, -11330, -12405, 31056, -10880, -4125, 7221, -24846, 20856, 11227, -18597, 13282, -17340, -2778, 28706, -17151, 2140, 1017, -21395, 27120, 1442, -14898, 12881, -21553, 7446, 23036, -20803, 7571, -5810, -14844, 30240, -7872, -9325, 10009, -22645, 16961, 14947, -21240, 11133, -11957, -5993, 29443]
1238B9443m4800J2175Q452k5658M4359j8487k4361L1151k8642J9709K1663m5242
1250b0238K2844l015j5184M3319l1601j0424K5607k9913L0709N931m0195K9702
1262G542j3623k681L7156m0544L881J6875k7070L8019j0201l0732L2242k1969
1274a1105J0400K6587m4550J6823O104k0068M0578k4951j8028L0245k6685K2394
1286G744J2560m2870K6647m887r846L7648l6162l740K3979k6919L1214k853l5765
1299b3250L1995j4447J817K9588m2043R800J4739k2931L5499j7110k4726L2412
1311A1343k1045J2969J8140m2486K0865M284j5573L5220k8873j1469K8682k4190
1323a2133K2471M618l8181K8811o002n965L0485l7289K544K1660k3714K9214r821
$$ y = [29443, -15357, -3182, 5270, -20388, 23971, 5484, -18877, 12274, -16368, 3341, 25004, -20238, 2606, -409, -15593, 27726, -3875, -14299, 11308, -18605, 12104, 18035, -22160, 7542, -6081, -8762, 28394, -12150, -8269, 8606, -18464, 19555, 9354, -21378, 10864, -11105, -705, 25882, -18668, -1845, 4259, -15809, 24769, -182, -18210, 12035, -14650, 7744, 20304, -22566, 4081, -806, -10652, 26996, -9166, -12906, 11073, -15846, 15368, 12515, -23250, 8745, -5702, -3885, 25703, -16340, -6540, 8199, -14732, 20767, 3657, -21069, 11343, -9702, 3267, 21407, -21079, -214, 4070, -11503, 23717, -5156, -16625, 12057, -12133, 10338, 14956, -23225, 5586, -416, -6381, 24104, -13185, -10641, 11019, -12695, 16519, 6698]
1336F698k9432L2884j5017M782K1577m1094J5829J1911j9439L1921k2988j7151
1348a9519L2221k1144J4932R649l9312K6060J163j1946K9929l2553l433K6917
1360A2964k3291K2605l212l2512L1802q603k826K3707l7525R504J8642k1573K6770
1373A6452j5308k2341L3051j5941O343J4484l7936K0426R020j6802K7209k5477
1385f820j0075L0614k0601J4495L313l4023K8724j172r775K4094l2694L171K4523
1398A3774k2290K0815q489k6092L3115j0722j162J7561l5850J5626J5361k0310
1410h663K4172j9436j4860L2853j7957P603Q277l4182K5422M841j4980K3501k7535
1423a0944k279K8343k1632J4712k308k8095L1288n060p788J9063l1835R977K0717
$$ y = [6698, -22734, 10150, -4867, -85, 21492, -19602, -3773, 8138, -11301, 20620, -2368, -19519, 12702, -8442, 6490, 16139, -23173, 2887, 4050, -7896, 22033, -10520, -13953, 12964, -10327, 12278, 9066, -23446, 8356, -247, -3073, 20634, -16891, -7387, 11255, -10318, 16452, 1144, -21197, 11854, -4087, 2256, 16740, -21196, -770, 8250, -8552, 18657, -6820, -16895, 13719, -6882, 7613, 10926, -23097, 5627, 4455, -5320, 18774, -13920, -10749, 13774, -8516, 12299, 3810, -22282, 10833, 111, -1051, 16510, -19340, -3714, 11647, -8663, 15509, -3927, -18787, 14066, -3891, 3712, 11989, -22193, 3229, 8070, -6910, 16591, -10944, -13223, 15120, -6512, 8200, 5892, -22203, 9085, 4025, -3763, 15300, -16535, -6558, 14159]
1436A4159k1805J9081j2518j8681L3109j3380LJ1944l2116K0610J1204j9062K0680
1449A3228k1116p243L0878j9433P647L216k8564K8413P33j3610J9363k7171M707
1462h952K4936k2416J4134o260k1559L2379r063o283J4946k9824J5791J6324k1841
1475g688J7955j5033j1813L2183j6722J399Q021k8296K4573O318j8214J8527k1655
1488a0445o86K8089k1408Q008o2k3025K9917l560j2518J6213k5342J0112K0921
1501A6214k2969J3041q152j5155L1604j2384n459J1597k5932J9531J1647k1501
1513g918J6182j5462n423K9612j9201K073N109k3344K6632J341j7137J6613k0934
1526a1857N134K4031k3091Q791k479j7480L0281q484j0820J4085k3266J4932J5799
$$ y = [14159, -7646, 11435, -1083, -19764, 13345, -35, -32, 11912, -20204, 406, 11610, -7452, 13228, -7888, -15131, 15747, -3686, 3961, 7177, -21387, 7026, 7759, -5851, 13512, -13659, -8952, 15984, -6432, 7702, 1442, -20117, 12262, 3199, -3084, 11862, -17962, -2171, 14153, -7688, 10267, -4766, -16579, 15604, -1118, 281, 8302, -19994, 4579, 10897, -7317, 11210, -10445, -11131, 16958, -4450, 3558, 3496, -19529, 10388, 6828, -5690, 10523, -14819, -4707, 16214, -6755, 6286, -1866, -17021, 14583, 2199, -3260, 8337, -17595, 1936, 13583, -7918, 8264, -7198, -12621, 16991, -2210, -137, 4972, -18372, 8260, 9601, -7536, 9077, -11857, -6723, 17308, -5783, 3008, 529, -16951, 13330, 4846, -5974, 8111, -15155, -223, 15576]
1539A5576k3659J3395r600r127L0014j6512l712R373k2250K2548O147k1070J5539
1552F662j5188K07K6015k1726L172L312j8302K7143l532j6023J5143j8730R264
1565b583J9351k4005R112l229j2159K8559j2235r346J2520j9973J7329J0772k3305
1578i192J3345r440m336K6848j9251k011P956j8373K3553R48j9841J5295j4330
1591h829M554K1673k3744N156K096j3895K6678q731j3969J4646j6983J2811J3909
1604A5372k4753J0789l894p404K6255j6628o739J1618j6935J9250M764k2364J4173
1617C504r148J29K2589k1885O21O908j4472K3288m493j7655J5353j2968P737J6355
1631A5863k4444P289J404r823K4521j3098j1046J4222j4789J4681Q094k4042J2606
$$ y = [15576, -8083, 5312, -4288, -13415, 16599, 87, -3625, 5748, -16502, 6046, 12193, -8877, 6662, -8526, -8319, 17696, -4030, -858, 2454, -15848, 11295, 7763, -8260, 6883, -11847, -2583, 16768, -7237, 1875, -1354, -13513, 15046, 2811, -6535, 5985, -13988, 3341, 14113, -9192, 4153, -5287, -9623, 17225, -2026, -4037, 3919, -14454, 9099, 10047, -9794, 5501, -8829, -4275, 17398, -6346, -1190, 906, -12989, 13689, 4958, -9011, 5635, -11348, 1463, 15372, -9381, 1408, -2486, -9890, 16365, -263, -7002, 4616, -12319, 6931, 11695, -10669, 3504, -5644, -5515, 17074, -4811, -4190, 2718, -11754, 11534, 7041, -10614, 4739, -8229, -492, 15863, -8581, -1292, 112, -9711, 14810, 1712, -9334, 4888, -9901, 4780, 12874, -11168, 1438]
1644A438m155l555K2680j9939l433J1074j4307J9826j034k0645J5693q956L421
1657a892J7929k3938M070O206j1489K2267r654j4804J6140j2167R976J1097k4662
1670a0921J0150Q53o894K1848j6628p734J4230j3187J5289L134k2613J4385m127
1683b215j195J8801k1646k78J0720j2181J8736n345j8053J6734q414M986J3308
1696A3958k4174P036N848r263J9969j3356j1376J6727j1315J0789O046k3658J3093
1709C24K58m767J8610j9488l572J4216j2213J5259j979k0175J6872n039P31J4729
1723A3766k3029M100R845j0931J7673r664j4445J8017q950O208Q821k3685J0685
1736a589M686p813J7522j6075p282J6900j1073J0793J733k1531J5618o21l570
$$ y = [1438, -2717, -6272, 16408, -3531, -6964, 4110, -10197, 9629, 8595, -12050, 3643, -5313, -1892, 16037, -7901, -3831, 2375, -9114, 13153, 3499, -11305, 4835, -7332, 2644, 13741, -10921, -771, 82, -6812, 15036, -1592, -9326, 4904, -8283, 7006, 10140, -12473, 1912, -2215, -3410, 15391, -6255, -6533, 4187, -7994, 10742, 5397, -12656, 4078, -4336, 650, 13958, -10216, -3180, 2668, -6595, 13374, 18, -11358, 5369, -5946, 4843, 10889, -12769, 324, 582, -4185, 14425, -5063, -8635, 5581, -6632, 8627, 6648, -13527, 3345, -1694, -963, 13766, -9263, -5163, 4682, -6249, 11424, 1760, -12685, 5332, -3618, 2590, 11411, -12274, -1589, 3097, -4716, 12806, -3269, -10551, 6349, -4724, 6069, 7802, -13729, 1889, 1268, -2302]
1749b302J5114k0551L89J3855j1607J4024n576j7012J8449n581J334J0813k2662
1762a1313P768R003j0187J5631j2387j0593J8801r557O471M952k2118J3952L223
1775C646p058J5122j7798l028J6665j1599J0673j867j8772J7955k360k756J2167
1788A0990k0956M638J2581j1627J3120q556j3177J9601p118J890P377k1433J1415
1801a255P335r941J3648j4200o058J8743j0530O235J492j9277J6593J327o632
1814b520J2305j8192J526J5556j2219R846m723j4936J9515m506k213R133k0047
1827a1475Q820J0487j1802J1936j0707q645J9863r204K471M327j9278J4790M513
1840F096r611J2065j5300j406J7763j2138O484j232j6037J8719j518o196J0229
$$ y = [-2302, 12812, -7739, -7350, 6505, -5102, 8922, 3346, -13666, 4783, -798, 536, 11349, -11313, -3545, 5458, -4729, 10902, -1485, -12078, 6723, -2834, 3637, 8589, -13529, 423, 3646, -3412, 11710, -6088, -9116, 7549, -4050, 6623, 4756, -14016, 3939, 1579, -1177, 10990, -9966, -5328, 7253, -4374, 8746, 190, -12987, 6614, -504, 1386, 8763, -12670, -1255, 6080, -3861, 9787, -4413, -10471, 8272, -2258, 3977, 5469, -13808, 2785, 4112, -2520, 9785, -8407, -6881, 8675, -3544, 6302, 1579, -13357, 6158, 1652, -561, 8572, -11475, -2655, 7832, -3970, 7966, -2741, -11386, 8477, -727, 1744, 6071, -13207, 1583, 6096, -3515, 8550, -6750, -8156, 9607, -2531, 3953, 2721, -13316, 5403, 3885, -2311, 7918]
1853G918j7870N795J3590j3117R273o628j0895K0158o842k019O852j8194J1936
1866d3Q159j2165J0711j1345m634J9207j0894K387K378j6467J6719J949r571J0593
1880F984j5002K359J6053j3366O314k785j2606J9541m268n690Q592j6706R180
1893a400J0984j3847R092p826o959J9894r602j218N126j6085J4803M733j2366
1906d671J0229j1848k65J7656j3245L155O99j3318J8328j656r196R614j4279O121
1920b676J3416j4755O681l872q946J9577p379m995P433j4942J1845P791j4314
1933e136R064q113l328J8548j1948m08M055j3588J6199J440j2143R930j1382K882
1947c928J5344j4884L965p2j0421J8659m959q501R182j3160Q830J0319j5756P502
$$ y = [7918, -9952, -4157, 9433, -3684, 5589, -1039, -11934, 8224, 1382, -637, 6215, -11979, -43, 8116, -4049, 6662, -4683, -9317, 9890, -1004, 1383, 3761, -12706, 4013, 5962, -3609, 6984, -8018, -5659, 10394, -2972, 3342, 557, -12049, 7492, 3224, -2466, 6126, -10580, -1400, 9584, -4263, 4829, -2997, -9956, 9938, 336, -882, 4244, -11841, 2962, 7695, -4671, 5558, -6290, -6555, 11101, -2144, 1011, 1710, -11608, 6720, 5064, -4132, 5482, -8797, -2676, 10740, -4015, 2666, -1206, -10152, 9425, 2046, -2949, 4484, -10458, 1387, 9178, -5136, 3928, -4185, -7513, 11035, -913, -1321, 2734, -10854, 5345, 6785, -5358, 4572, -6810, -3928, 11416, -3468, 497, 425, -9996, 8663, 3704, -4797, 4385, -8775, 55, 10374, -5382, 2120]
1961B120m332n779J8769j0359l924O906j3113J3640M323j4524R608q076l05J6649
1975A1603j4120Q17L492j1299J6776j913j1542J0055j0650N249J2658j6040N013
1988I9m37p811J7964p773p372Q983j1735J0340P158j6008Q318m276l201J7028
2002A1277j2630k498O647j1210J4289Q70j3975J0230p618K003J3999j5771K514
2015a873L182r124J6572n370j0246J0465r953P155R356j6712O683p65n584J6761
2029A0547j0648n494R023j0712J1498L708j5631R593m457j115J4866j4459m99
2042c780O393r742J4308k304j2807J1022p317L561J1198j6519M255K995p376J5454
2056I341q019q564J0869r102Q012O149j6597Q325q67l815J4737j2697l332R098
$$ y = [2120, -2212, -7991, 10778, 419, -3505, 3401, -9712, 3928, 8251, -6273, 3335, -4741, -5046, 11603, -2517, -1700, 1792, -9507, 7269, 5356, -6186, 3869, -6781, -1532, 11126, -4914, 99, -338, -8149, 9815, 2042, -5330, 3653, -8082, 2258, 9416, -6592, 1726, -2550, -5751, 11277, -1353, -3851, 2796, -8414, 5875, 6745, -7230, 3000, -4618, -2615, 11384, -4387, -1873, 1309, -7815, 8757, 3387, -6859, 3606, -6347, 808, 10164, -6548, 135, -630, -6214, 10547, -101, -5595, 3428, -7284, 4214, 7922, -7709, 1884, -2573, -3688, 11178, -3281, -3780, 2613, -7129, 7179, 4875, -7932, 3090, -4227, -666, 10532, -5987, -1732, 1263, -6113, 9341, 1322, -7242, 3627, -5475, 2537, 8686, -7911, 414, -453, -4268, 10469, -2228, -5560, 3538]
2070C538r563J1661K77j4530J0938m579N38J2146j5728K023N952q441J3849n580
2084B501j0757J1814p378M980P904j6698O733K140n797J4094j0641n811J0977
2097D061q811Q776K625j5532J0206j597k296J2395j4237m52Q717q756J1352k969
2111C482j2494J2121m902J657R120j6069M698N343p334J2538q077q129J2281p376
2125c141N511M793j5902Q883J397m730J2188j2259k923J0777q581Q810l32j3809
2139i318J1741k501j227J0040j4936K469P913q271J0814n480j0067J2944n729
2152a608K483O447j5604P205M288o662J1239r883n215J2380p792N788K022j4391
2166i303J0848K91m031J0164j3022PJ0267q545Q320k682j1535J2855l437p17P742
$$ y = [3538, -6025, 5636, 5913, -8617, 2321, -2258, -1720, 10426, -5302, -3279, 2673, -5768, 8081, 2501, -8256, 3558, -3820, 1160, 9064, -7634, -901, 1239, -4558, 9536, -1105, -6916, 4061, -4750, 4026, 6651, -8881, 1325, -272, -2568, 9827, -4410, -4862, 3855, -4901, 6451, 3482, -9012, 3109, -1793, -136, 8984, -7085, -2387, 2956, -4378, 8160, 83, -8046, 4235, -3141, 2370, 7163, -8739, 144, 1541, -3189, 8999, -3260, -6183, 4594, -3987, 4823, 4491, -9318, 2423, -78, -1305, 8735, -6201, -3732, 4181, -4090, 6724, 1244, -8823, 4121, -1608, 875, 7322, -8282, -1077, 3211, -3451, 7788, -2095, -7310, 5070, -2722, 3066, 5088, -9303, 1545, 1836, -2195, 7969, -5053, -5046, 5221, -3324, 4996, 2314, -9221, 3634, 197, -520, 7222]
2181G222j4620N037O937p987R798p225p297J3214o448K811M047j4377R321K904
2195C337o139R817j0897k195J1896q314N831k64j2319J2311j255l416Q334j3167
2209f440L049R113q816P933m632q727J3521m887j75N590j3737P643N352p857Q783
2224E713q344m250J2968p486K999K062j2573J1005J248n800Q390j1078O47J0875
2238F376q821N637j930r895J3029k804k917O667j2484N459P535q884P343n711
2252a400n922J3363o222K24L860j2165R483L447p675P868q809j226J2005q507
2266a676L228L96j0287J2146q60n309P125j0725L394R228r401N566l127p217J3162
2281E643m548k389N261j1281P421N591q897O875o220l303J2602p412O01K639j0374
$$ y = [7222, -7398, -2361, 4576, -3411, 6387, -838, -8135, 5079, -1369, 1442, 5489, -8888, 433, 3337, -2802, 7015, -3882, -6077, 5819, -2495, 3336, 3072, -9247, 3064, 1809, -1607, 6727, -6440, -3391, 5722, -3094, 4839, 207, -8520, 5001, 114, -61, 5529, -8208, -565, 4787, -3070, 5713, -2631, -6881, 6087, -1399, 1600, 3662, -8911, 2094, 3342, -2458, 5932, -5146, -4499, 6376, -2445, 3192, 1262, -8633, 4396, 1592, -1325, 5342, -7142, -1683, 5852, -3032, 4311, -1400, -7322, 6041, -181, 43, 3903, -8262, 1221, 4668, -3007, 4861, -3948, -5174, 6831, -1676, 1552, 1948, -8339, 3807, 2947, -2362, 4763, -5962, -2568, 6660, -2741, 2825, -302, -7519, 5643, 1095, -1294, 3967, -7314, 107, 5698, -3199, 3676, -2544, -5847, 6755, -657, -56, 2583, -7791]
2296g791J0546J486p333P106q571J041J0606r222L334m52q086J2335k649m884
2310b534O204r753N233P358r704N453l530m798J2577o165j868M379r765Q727L413
2325E227q791O599o239r50J1330q578J145J760q418J1045o55o795O565q037L018
2340a774Q751r733L691j110n945J1980m396m139N533q724O616N230r655N540l753
2355a888k660J1453p447j155L721q193R332J262q385O401n833R43R576r429J848
2370d54J253o520J0879k714o063O242p223M501O564r999M223j390l947J1070o093
2385C29l128N038p544P521K926r328N804l795p79R948q618m0L090o680R536r48
2401C332p573O414n546K460P588r873K687Q08m849J0321m590m968O058o453N450
$$ y = [-7791, 2755, 4241, -3092, 4014, -4557, -3516, 7090, -2132, 1202, 750, -7336, 4999, 2350, -2534, 3670, -6083, -850, 6508, -3196, 2257, -1273, -6071, 6506, 341, -1527, 2852, -6913, 1814, 5227, -3564, 3035, -3204, -4154, 7176, -1402, -257, 1503, -6915, 4130, 3475, -3320, 3245, -4792, -1774, 6977, -2756, 935, -175, -6120, 5860, 1464, -2675, 2858, -5866, 750, 5980, -3675, 1865, -1888, -4548, 6905, -542, -1697, 2024, -6169, 3163, 4425, -3960, 2441, -3392, -2449, 7127, -2302, -454, 799, -5721, 5158, 2444, -3619, 2623, -4600, -99, 6465, -3534, 689, -701, -4648, 6422, 329, -2799, 2239, -5305, 2216, 5142, -4186, 1618, -2177, -2956, 6992, -1626, -1666, 1424, -5256, 4280, 3332, -4241, 2173, -3373, -913, 6675, -3198, -511, 297, -4552, 5769, 1179, -3789, 2269, -4184, 1266]
2416A266M353r903M886j430k408R770p394k015M811o383P730P47q699O190l556
2431b035M70Q155r201R62K842n389R096k824o556O479n056L401N577r919L629
2446c69N18l504R313o022l711N879n715N930K201r341N623j661j126Q265q328
2461b048n95M477n441P561j255p662O640l494J471O235r547K279K565m335Q246
2476E097m409n211O647m674L886L487r518M614L25k484P939p010k292N786n096
2491b913N886L44q444O227j773k59O597q730Q18M098m623P027k881o307O867l427
2507a493K044M332r249L514K077l462P204n618l539O556m397M031J550q652N576
2522D74k8j779O474p561o31N412m591N470j327p078O744j992K45M887q556K142
$$ y = [1266, 5619, -4284, 602, -828, -3236, 6534, -860, -2875, 1936, -4447, 3283, 4030, -4669, 1521, -2035, -1565, 6590, -2611, -1649, 1193, -4196, 4900, 2076, -4480, 1999, -3057, 344, 5921, -3998, -369, 149, -3355, 5958, -64, -3775, 2104, -3611, 2319, 4520, -4821, 802, -859, -1985, 6280, -2048, -2643, 1834, -3607, 3954, 2699, -4963, 1677, -1817, -346, 5889, -3658, -1379, 1186, -3149, 5097, 688, -4523, 2124, -2550, 1336, 4823, -4695, -81, 244, -2240, 5699, -1311, -3603, 2183, -2913, 2973, 3317, -5127, 1100, -673, -932, 5665, -3065, -2247, 1851, -2772, 4255, 1374, -4933, 1934, -1493, 551, 4883, -4366, -852, 1225, -2237, 4967, -651, -4190, 2366, -2031, 2000, 3550, -5102, 474, 446, -1333, 5141, -2420, -3051, 2361, -2230, 3240, 1913, -5165, 1579, -413, -168, 4719, -3837, -1695]
2538a695L679m077O194l991m815O987l370K167K679q532M496J652k880O035o195
2553a666k039O328m199L857P1p489O213m69j255N002p605R20M920m311M926k601
2569F03n496O995k283M98L290q016L504L075l705N271m806l059O847l545K186
2584A359J210p494N468R55k540M883o411l84N898m185L511j107o090O641r87j042
2600c15L783p255K185M328m107M262l259m050P017k648N44K166p182M444K365
2615B278l501M372n064j463O514l806J970J76o224O072K27k347L830o161J066
2630b061N255m315L144j884m599O854j679r25K754o575L370L528m132L699l692
2645a258k457O799l157N43J189o117N231J476l392L682n006o2N943m091J819n62
$$ y = [-1695, 1984, -2093, 4101, 110, -4705, 2282, -1088, 1079, 3758, -4774, -278, 1374, -1506, 4529, -1666, -3705, 2623, -1576, 2281, 2352, -5137, 1076, 607, -648, 4354, -3251, -2331, 2589, -1722, 3204, 603, -4893, 2102, -181, 317, 3607, -4409, -905, 2170, -1535, 3736, -1070, -4129, 2718, -827, 1359, 2569, -4925, 543, 1498, -1042, 3841, -2570, -2954, 2944, -1241, 2270, 1163, -4927, 1714, 727, -315, 3468, -3787, -1602, 2726, -1381, 2881, -378, -4428, 2589, -59, 485, 2651, -4531, -87, 2278, -1223, 3149, -1915, -3378, 3136, -670, 1300, 1476, -4748, 1324, 1551, -796, 3034, -3127, -2061, 3194, -1121, 2023, 139, -4460, 2394, 715, -210, 2544, -4031, -661, 2867, -1265, 2434, -1258, -3715, 3084, -73, 470, 1659, -4458, 773, 2249, -1143, 2539, -2467, -2529, 3414, -677, 1142, 580]
2661E80m912O380o01k247L066n656K256M461m456K730k205l197O763k408q48J973
2677A679n670M311K519m200L271l704r98O286l745N79N66n011N739M71l275L106
2693A924m701J200N148m468J792j007l673O471j493k086K509n071L236L492m631
2708a358K628k404j871O412l173o86J532m783M849J499m123K938l506J37N606
2723C697m292O21K85l872N892n90l167K818m186K160M204m858J827j088k519O231
2739C163k436j826K207m362L914K394m693K578k392o83N812l873l80J160l874
2754c291N201L43l997K865l314J185M722m783R62K6k850N787j631k847K651l705
2770b676K926L067m999J989j131j382N686l330j448K059l616M322J134m621K704
$$ y = [580, -4332, 2048, 1447, -800, 2266, -3390, -1134, 3327, -1129, 1601, -604, -3801, 2962, 554, -294, 1679, -3991, 320, 2839, -1361, 1910, -1794, -2792, 3494, -251, 328, 894, -4117, 1622, 2093, -1182, 1924, -2777, -1577, 3571, -897, 895, -112, -3785, 2686, 1193, -893, 1616, -3455, -219, 3273, -1358, 1270, -1134, -3005, 3407, 234, -452, 1080, -3703, 1146, 2645, -1478, 1460, -2046, -1909, 3697, -595, 26, 311, -3561, 2331, 1741, -1426, 1392, -2794, -634, 3570, -1288, 539, -549, -3068, 3163, 727, -1099, 1108, -3254, 660, 3054, -1639, 939, -1453, -2136, 3676, -197, -577, 583, -3291, 1910, 2253, -1744, 1121, -2193, -1008, 3714, -1069, -107, -81, -2931, 2856, 1225, -1622, 1029, -2676, 250, 3317, -1682, 307, -824, -2206, 3480, 150, -1298, 761, -2855, 1467, 2601, -2020, 684]
2785F84k180K57M936m473rJ112l036N185p99l681K872k889J893L611n070J311
2801b76j4j950N445k630k402K628l168L392J870m991K339j115n42M974m028r07
2817a375J966k945M408k7m366K965k035R80L930m947O36J018k229M866j909l182
2833b246L016k516K348K461n149J879p3j213M819l478j719K652k721L569O94m806
2849b483K782j085J00M135m608k05J932k384M249j164l834L221j851J409K880
2864C094n109J317R13j663M453k861k444L176k301K611J286n027K547j26p16M058
2880C208m102r08K726k423L459l84m291L243j109M62L204m886O21J857k025L912
2896B564k035l168L512j803J630J894n063J979Q64j345L882l436j731L311k154
$$ y = [684, -1496, -1239, 3697, -776, -785, 327, -2709, 2476, 1677, -2004, 868, -2021, -128, 3483, -1587, -276, -290, -2240, 3205, 575, -1827, 801, -2367, 1025, 2895, -2096, 243, -872, -1414, 3560, -468, -1375, 591, -2354, 2054, 2027, -2339, 626, -1409, -429, 3501, -1446, -810, 208, -2021, 2845, 936, -2246, 770, -1746, 602, 3063, -2086, -207, -280, -1493, 3326, -152, -1871, 781, -1940, 1629, 2323, -2483, 299, -786, -686, 3449, -1159, -1364, 568, -1816, 2433, 1269, -2565, 656, -1195, 214, 3094, -2015, -698, 215, -1448, 3005, 144, -2300, 876, -1425, 1186, 2472, -2555, -8, -134, -850, 3208, -894, -1802, 924, -1499, 1960, 1576, -2715, 528, -581, -119, 3085, -1801, -1180, 677, -1348, 2564, 529, -2639, 873, -930, 700, 2594, -2469, -490, 374, -971, 2911, -525, -2256, 1055, -1099]
2911a099K536M14m657L026k16l96L302m400j21K696k214L217j227l697L621j161
2927c76O45K303m874J445J742j828L437k695k336L688j843J677R67m751K726O18
2943E45j135L238l871p75L350k212K469n06m051L555m50j80K513m570Q27K543
2959A290k131K914j965k871L932j373P22J464m665K281J460j734K973l232j348
2974b283L796k023J615J38m190L385K50j034K594m055K52L178k317K289j278l209
2990b892M001q50j41J801m398J759K170k161K628k504j948M130j763Q10P32m244
3006b870L053R90j692K497l445l63L685k303J542n16l477L887k69r60K017l975
3022b199J211K841k513K052j662k358M235j371j17J226m023K590J687k302K294
$$ y = [-1099, 1437, 1851, -2806, 220, 4, -392, 2910, -1490, -1611, 1085, -1129, 2088, 861, -2836, 785, -376, 269, 2572, -2302, -857, 885, -943, 2494, -201, -2537, 1151, -692, 985, 1952, -2799, -73, 545, -590, 2648, -1223, -1998, 1352, -860, 1609, 1103, -2948, 607, 157, -23, 2490, -2080, -1253, 1290, -841, 2073, 108, -2763, 1169, -204, 518, 1982, -2683, -402, 1058, -676, 2297, -935, -2283, 1513, -510, 1105, 1243, -2947, 438, 688, -346, 2248, -1807, -1555, 1623, -694, 1595, 317, -2892, 1109, 259, 118, 1919, -2479, -720, 1450, -711, 1917, -587, -2535, 1595, -168, 642, 1374, -2870, 183, 1173, -519, 1978, -1467, -1830, 1855, -448, 1094, 578, -2899, 988, 719, -241, 1776, -2199, -988, 1853, -660, 1392, -270, -2628, 1607, 236, 119, 1345, -2678, -88, 1599, -703, 1591]
3037A591k718r24M014k136P55J62l573L626L65j674K106l459O05L341k569J454
3053I66r72k657M176q49r18J562l761K089K291k653J937k004j374M177j895rP24
3070H30l468L210R84k304K051k809K9L713k592P97k04k828L989l49j664J815l238
3087b038J435K803k901J466j209j816M219j506q04J240l277K666J666k848J888
3102I84k075n43L952k423O4M99k956L617L11k332J909k670P69L254k953Q72l62
3119h3k187M081j005j563J650k956K086K159l120J526j301r97L998k144o46J103
3135F01k831L098Q61k823J843k001K07L519k923L05L13k288L737m78k232J873
3151G81k503J424K661l271J066n03j450L948j699j344J511k541K503J413l199
$$ y = [1591, -1127, -2051, 1963, -173, 582, 744, -2829, 797, 1162, -512, 1594, -1865, -1260, 2081, -488, 966, -6, -2663, 1513, 664, -254, 1308, -2453, -364, 1927, -726, 1211, -793, -2167, 2010, 115, 106, 830, -2638, 572, 1556, -748, 1303, -1506, -1477, 2236, -356, 441, 237, -2591, 1398, 1049, -615, 1200, -2038, -603, 2200, -701, 765, -444, -2260, 1959, 453, -351, 889, -2388, 278, 1944, -904, 984, -1091, -1634, 2318, -105, -41, 458, -2498, 1119, 1430, -902, 1007, -1663, -894, 2360, -593, 279, -83, -2270, 1811, 806, -757, 893, -2063, 23, 2182, -938, 588, -713, -1710, 2288, 144, -502, 601, -2230, 868, 1729, -1094, 749, -1252, -1045, 2474, -449, -144, 169, -2119, 1618, 1140, -1092, 781, -1722, -298, 2363, -908, 158, -345, -1795, 2153, 454, -890, 621, -1920, 583, 1996, -1203]
3166a203J649j305l63L680k674l83R72k304L288P8k780J957j842P26K958l290
3182h36N87K58j719L654j204k003J912k206J823J924l451J344n04q62L628k329
3198A6j034J541k184K677P01l205J841j193J39L146l093l9R72j888L299o46k579
3215a529K048j654J166K283l515R21K30j235L399j828j669J969j939K068J117
3230A832l413J672n13l84L131k806n72J542j855K751j70k947K120j113N33K478
3246B286l381M57R27j507L121j391k167K229j565J461J504l542J363J90q31L021
3262B175k412j162K025j737K187L23l175J980n25m3K548l131l4J504j582K636
3278A577q59k551K364j110P48J781l438R64Q97j207K767j948j579K278j473J525
$$ y = [-1203, 446, -859, -1222, 2458, -216, -599, 373, -1931, 1357, 1435, -1345, 612, -1230, -504, 2454, -836, -249, 9, -1710, 1944, 740, -1263, 649, -1557, 266, 2190, -1261, 83, -421, -1283, 2345, 16, -1018, 523, -1661, 1016, 1717, -1488, 353, -840, -701, 2445, -648, -687, 285, -1603, 1696, 1050, -1529, 519, -1135, 31, 2314, -1201, -280, -50, -1285, 2114, 286, -1383, 586, -1353, 715, 1832, -1581, 91, -422, -806, 2325, -481, -1053, 489, -1366, 1385, 1215, -1732, 388, -725, -192, 2286, -1095, -638, 289, -1218, 1903, 512, -1655, 574, -991, 470, 1974, -1568, -205, -15, -846, 2175, -237, -1399, 626, -1111, 1076, 1399, -1776, 204, -321, -364, 2184, -947, -981, 523, -1059, 1577, 718, -1833, 531, -579, 169, 1950, -1488, -524, 373, -834, 1933, -15, -1594, 684, -789, 736]
3294G36P92l328J754J24n56K504k732n84K016j556K090l31k849K310n94J72J956
3311A924l256N18J437j381K386j428k027K459j085R12J120l328J440P48r82K350
3327A807k298j046K351j382J498J25l001K161k8m12J992k878M8J925j481J920
3343A301q81k367K572p07K55J381l164J049J274j261K071j774j491K614j160Q44
3359E56N78l092J928N66q58J923k514m10K311j430J377l61k550K464k10l08J479
3376A449k868O57J764j477J689j237j814K711q48K22R03k930J554J085j273J728
3392A315j976q26K607j301P69J16k650K282K91q57J552k522J90K171j506J211
3408H66p05k060K656m15l23J106k729J146J575j512J457j508j172K748j071K27
$$ y = [736, 1528, -1800, -46, 78, -478, 2026, -706, -1290, 726, -830, 1260, 929, -1920, 390, -204, -32, 1924, -1332, -814, 623, -758, 1628, 200, -1827, 632, -453, 459, 1579, -1749, -309, 439, -543, 1807, -491, -1537, 814, -568, 930, 1055, -1946, 215, 187, -225, 1767, -1111, -1063, 862, -619, 1301, 420, -1947, 625, -82, 173, 1554, -1610, -561, 713, -548, 1523, -251, -1742, 872, -288, 556, 1134, -1958, -30, 536, -322, 1601, -913, -1323, 988, -442, 935, 574, -1976, 488, 278, -30, 1449, -1419, -762, 1002, -475, 1214, -23, -1837, 874, 26, 248, 1151, -1779, -225, 860, -413, 1315, -661, -1487, 1120, -181, 588, 704, -1946, 336, 627, -230, 1322, -1200, -1010, 1161, -345, 866, 161, -1899, 757, 342, 19, 1125, -1604, -458, 1117, -395, 1062, -446, -1618, 1130, 59, 286]
3424B86M78k597J977P65j270J471k051k43K496j479O85k29k139K524o0q37J207
3441I84k366P53J919j663J085r32j459K745p45l46Q11k454J617J222j623J301
3457H49j591n77K673j337J92K24k206K290M21j314J219j991L68K234j699O63m30
3474a2j642K625m07q43R91k182J233J601j823J003j008r02K685j097l43N50k029
3491a600J948Q00j667J161j510n5K421j642K56J6j688K424n5j275J052j783Q00
3508c97J896j894O40n03j118K639q44p62P92j851J555J176j895R51j040l35K481
3525A491j454k38L93j635K136L18j631J064j393M32K032j812K60o1j200K404m82
3542F24j245J014j544J189J404j995P07n34o14K411j199o89P29j533J793O57j864
$$ y = [286, 764, -1833, 144, 909, -361, 1110, -941, -1184, 1312, -167, 518, 289, -1850, 674, 614, -223, 984, -1382, -629, 1290, -373, 712, -220, -1679, 1066, 321, -25, 786, -1668, -51, 1171, -452, 849, -742, -1319, 1354, 17, 209, 433, -1773, 517, 938, -376, 843, -1148, -780, 1454, -245, 418, -12, -1654, 971, 564, -279, 712, -1470, -237, 1364, -459, 544, -464, -1366, 1319, 222, -121, 429, -1600, 348, 1148, -519, 642, -868, -923, 1498, -144, 112, 128, -1560, 864, 809, -466, 586, -1197, -397, 1499, -395, 245, -258, -1376, 1263, 419, -343, 449, -1402, 153, 1329, -566, 385, -655, -990, 1491, 37, -201, 192, -1443, 693, 1011, -620, 444, -949, -517, 1515, -297, -37, -98, -1298, 1106, 624, -621, 393, -1151, 38, 1442, -553, 154, -380, -994, 1417, 218, -471, 258, -1275, 518, 1175, -689]
3559f89R47r32O6K147j696j39L47j237K157j98j503J027j208P83J592j983L92
3576a27o2p90K258r05j057R17j269J381R38k002P80n08k12K129j540m54P03j208
3594a028J814J46j776J039p98L71J695j862N6L41q73K010o29j369J075r99R96
3611B09J128k067N54m7m29K017j298q14R29j024J464M07j941R19m11R7J752j749
3629c04k61O85q71J755l37j635J124o67N50J290j989K88L93o25J811r74j150J148
3647B31q34J060O27j996P55J4k40J686j515n79J018q30J403m3j795J064l26K80
3665b0J311j853j9P38o78J588p29j366J198n57P20Q02j982N42L56l96J543j285
3683h7q58J215o83J025K18j880R69L4o1J302j693k46J039o76J219m17j530J226
$$ y = [-689, 258, -674, -608, 1539, -157, -296, 51, -1186, 971, 773, -730, 297, -911, -128, 1464, -519, -127, -189, -979, 1279, 374, -683, 234, -1035, 346, 1284, -718, 62, -446, -658, 1471, -69, -523, 180, -1028, 786, 932, -844, 195, -603, -232, 1463, -399, -343, -2, -875, 1135, 506, -863, 212, -787, 209, 1337, -730, -176, -223, -652, 1365, 67, -747, 182, -842, 622, 1029, -912, 7, -404, -307, 1445, -304, -565, 120, -751, 1004, 667, -968, 156, -511, 39, 1329, -660, -372, 21, -604, 1207, 233, -917, 231, -603, 457, 1084, -912, -157, -143, -383, 1303, -212, -791, 227, -603, 800, 757, -1038, 26, -300, -20, 1291, -562, -581, 157, -521, 1067, 338, -1028, 170, -387, 333, 1135, -847, -305, 51, -345, 1198, -87, -945, 270, -413, 612, 830, -1050, -81, -47, -108, 1194, -499, -745, 294, -382, 837, 420, -1110, 116]
3701A16k75K89R43j888L22P23n35J303r91j051J346n32O59M11j893Q25L89k67
3719a06J161j419n18J251o51R63j79j642J196lJ5R31j698R1R93o27J028o70j216
3738a100J343k79L03N39j762O10O79m80J063j147p28J361m95N72O7j616J009L29
3756B68k94R25j495j59J269o46P86m07j388J378p1m5O52j659M20R75o45Q59q53
3775a30r12J471l71K33K73j628R30N58n03Q38j239l60J392o01N02k01j370J259
3793A41J96l30P20j498K08J171p02O11n50j017J473j80j13M04j503P38Q57p14
3811h8P02r82n28J511n22J66L8j386J151M58n81O47j245k1J362p11L78l15j119
3830a085J443K3l89M91j367N51J054q27N49p08o77J517l64j18K26j326J012O38
$$ y = [116, -159, 130, 1073, -815, -493, 230, -305, 998, 7, -1044, 302, -230, 429, 840, -1053, -228, 161, -106, 1055, -364, -882, 369, -282, 681, 502, -1140, 56, 53, 68, 999, -699, -608, 385, -242, 786, 116, -1100, 243, -36, 267, 806, -956, -346, 333, -147, 916, -231, -959, 402, -93, 479, 546, -1070, -61, 268, -26, 899, -596, -755, 514, -132, 654, 247, -1141, 237, 166, 121, 773, -886, -466, 509, -136, 723, -130, -1042, 429, 58, 291, 564, -1064, -134, 424, -79, 759, -480, -840, 552, -49, 453, 252, -1118, 141, 337, 7, 727, -771, -563, 608, -94, 517, -33, -1050, 423, 243, 130, 534, -969, -231, 626, -88, 614, -368, -896, 615, 93, 259, 297, -1089, 62, 520, -61, 586, -659, -680, 682, -29, 349, 34, -1085, 358, 381, -8, 483, -884, -333, 721, -106, 443, -265, -942, 575, 211, 93, 319, -1007, 5, 643]
3848F43p66N86r71k13J483o77R2o4j157J344K16o46N33j168L23J251q67L03l72
3867a27q47J525j98m54L95j193Q02Q75r36M50o75l72J501n65j79J33j093J189
3885B31M38q90N17q98J12J369q78P4j25q38J424m8p12M74j022N98J025j015L22
3904A58m16n03J529m73m83L31r97R94O35j051M41o09j32J467q31j64J43r05J307
3923D41J84r31M83q01L53J191j048J22j42o02J466l05p44N02r07P88Q36j216M19
3942H9l77l11J478p28m26L64q50J127L45j126N45n90J40J275j071p0J45o63J331
3961F27j52r17O03p56N57R57j228K31j00m08J423n94o45N29p76R22N48j252M39
3980Hl41l3J305r55l16L97p10J188N5j141O24n18L33J053j235N6J82n10J292m18
$$ y = [643, -123, 463, -508, -721, 762, 85, 177, 113, -1044, 300, 516, -130, 403, -765, -442, 809, -58, 245, -127, -974, 551, 353, -101, 294, -899, -97, 778, -158, 292, -383, -755, 746, 181, 2, 135, -958, 231, 669, -221, 296, -602, -490, 879, 1, 75, -50, -888, 536, 488, -224, 250, -772, -174, 851, -164, 158, -258, -761, 768, 295, -188, 143, -854, 140, 775, -276, 165, -444, -576, 891, 60, -104, 39, -866, 441, 625, -306, 177, -624, -271, 920, -128, -6, -148, -750, 716, 411, -333, 169, -738, 50, 886, -330, 89, -288, -599, 879, 151, -275, 89, -761, 366, 711, -415, 130, -460, -320, 955, -116, -186, -41, -704, 627, 475, -442, 161, -595, -38, 919, -309, -78, -178, -586, 837, 243, -402, 127, -649, 273, 821, -431, 8, -333, -366, 939, -16, -332, 65, -645, 543, 598, -543, 81, -437, -104, 949, -286, -230, -48, -558, 734, 316]
4000C16q87O91o32O80O62j337M25p3k53J298q43n42N97o39R54K40j247O33l02
4019b59Q9J129j165j66M32n76J174k56j053P35m51M48P85j341K41K07l72J244
4037H45p11p64P58n55P44L78j334N47k6j12J140j083l19O71n92R75j00j166P62
4056E8k79K06Q75j284Q0M47m66J103n46r12Q68m28M66N96j416M50K16l15J117
4075H36r16n64Q52n41P71J54j349P42pp4R35j214j15P23n37R02l15j065R18k35
4095i9J93O86j361K72M95m52R83o89p72R99m53M84L25j359O66K16l02R09j033
4114b92l16Q92n08O93j02j222R32l1p6P78j276J09P20n62Q48m93r12J070l13K03
4134A42M79j347N19M81m54Q57q50n33J073n13M75J12j294Q90J68l13Q01j122q2
$$ y = [316, -571, 120, -512, 168, 830, -507, -82, -155, -408, 890, 47, -495, 102, -537, 417, 657, -590, 43, -259, -170, 959, -206, -372, 60, -516, 658, 402, -651, 84, -367, 81, 866, -475, -234, -27, -399, 845, 134, -630, 128, -427, 317, 695, -639, -92, -118, -230, 910, -173, -492, 179, -413, 562, 462, -704, 58, -221, -15, 860, -424, -344, 103, -363, 740, 194, -718, 150, -278, 188, 784, -632, -182, 34, -281, 836, -80, -644, 208, -333, 438, 592, -757, -15, -22, -96, 839, -375, -490, 233, -304, 598, 283, -782, 136, -99, 94, 780, -581, -309, 186, -266, 717, 28, -744, 255, -198, 286, 611, -748, -82, 134, -168, 741, -292, -608, 284, -224, 469, 367, -855, 77, 46, -30, 748, -528, -419, 301, -261, 587, 94, -818, 252, -61, 142, 621, -726, -207, 274, -180, 677, -173, -706, 367, -146, 329, 441, -853, 37, 205, -108, 693, -429, -511]
4153e11R38n98O04k26j095J117j33p6O03j293L56O87n79P72o25p26J173m14K11
4172A85K60j269P70L82m82P58r46k81J105n93M35n9j133J055N9k98O27j153J68
4191d10R22o81N92m06q49J235l14n1M31j224N79O45o99P14p37m18J164n13J77
4210A57J64j186R75K90n58O80j004k6J092o79L69j77r21J196j07l34N37j128M11
4229b49Q28p93O11n31o21J271m06p9L47j148P93M85p04O09p81k10J203o61J41
4248A05M7r79J111N8n41O08r66K24R85q15L77k49p13J227k87l13M80j039O30O55
4268F05q45N63n77l56J253o09o0K33r42R38K81p41N82p39nJ111q02J76qq14J177
$$ y = [-511, 427, -171, 433, 207, -888, 229, 96, 20, 623, -670, -314, 373, -206, 566, -59, -785, 388, -26, 185, 445, -824, -54, 328, -154, 604, -342, -623, 482, -111, 324, 265, -868, 187, 246, -52, 575, -578, -410, 512, -169, 423, 17, -832, 403, 89, 38, 469, -755, -176, 469, -230, 484, -253, -671, 493, -20, 157, 321, -865, 110, 400, -158, 522, -482, -508, 584, -95, 274, 97, -824, 372, 265, -69, 468, -660, -249, 579, -214, 397, -134, -755, 516, 110, 31, 378, -770, 23, 508, -196, 413, -368, -578, 625, -36, 105, 152, -827, 284, 342, -199, 409, -557, -333, 652, -163, 214, -35, -748, 479, 192, -121, 359, -680, -50, 605, -240, 323, -254, -610, 643, 34, -26, 207, -735, 203, 484, -257, 325, -414, -419, 692, -110, 66, 58, -756, 421]
$$ [...]
8191A0
##END NTUPLES=NMR FID
##END=
