##TITLE=1H_ES-TMMOS-1
 CDCl3
 8 sc, 
 10.4.2023
##JCAMPDX= 6.0         $$ Bruker NMR JCAMP-DX V2.0
##DATA TYPE= NMR FID
##DATA CLASS= NTUPLES
##ORIGIN= UXNMR, Bruker Analytische Messtechnik GmbH
##OWNER= root
$$ XWIN-NMR		Version 3.5
$$ Mon Apr 10 14:00:04 2023 Russian Standard Time (UT+4h)  she@DPX200
##.OBSERVE FREQUENCY= 200.13135
##.OBSERVE NUCLEUS= ^1H
##.DELAY= (6, 6)
##.ACQUISITION MODE= SIMULTANEOUS
##.ACQUISITION SCHEME= undefined
##.AVERAGES= 8
##.DIGITISER RES= 18
##SPECTROMETER/DATA SYSTEM= spect
##.PULSE SEQUENCE= zg30
##.SOLVENT NAME= CDCl3
##.SHIFT REFERENCE= (INTERNAL, CDCl3, 0, 15.7039)
##AUDIT TRAIL= $$ (NUMBER, WHEN, WHO, WHERE, WHAT)
$$ ##TITLE= Audit trail, XWIN-NMR		Version 3.5
$$ ##JCAMPDX= 5.01
$$ ##ORIGIN= Bruker BioSpin GmbH
$$ ##OWNER= she
$$ F:/spectra/data/she/nmr/H-F/1/audita.txt
$$ ##AUDIT TRAIL=  $$ (NUMBER, WHEN, WHO, WHERE, WHAT)
(   1,<2023-04-10 13:58:51.56 +0400>,<she>,<DPX200>,
      <created by zg, POWCHK disabled, PULCHK disabled
       configuration hash MD5:
       00 E9 B6 7A A2 85 ED C7 34 08 36 98 17 FE 4E 26
       data hash MD5: 16K
       7A B5 51 7B 84 20 7F 49 70 56 18 3B 61 8A E7 EA>)
$$ ##END=
$$ 
$$ hash MD5
$$ 81 4E 63 02 4B 0B 76 B3 63 EB 3B 23 84 2B A8 9E
##$RELAX= 
##$RELAX= 
##$RELAX= 
##$RELAX= 
##$RELAX= 
##$RELAX= 
$$ Bruker specific parameters
$$ --------------------------
##$DU= <F:/spectra>
##$EXPNO= 1
##$NAME= <H-F>
##$PROCNO= 1
##$TYPE= <nmr>
##$USER= <she>
##$AMP= (0..31)
100 100 100 100 100 100 100 100 100 100 100 100 100 100 100 100 100 100 
100 100 100 100 100 100 100 100 100 100 100 100 100 100 
##$AQSEQ= 0
##$AQ_mod= 1
##$AUNM= <au_zg>
##$AUTOPOS= <>
##$BF1= 200.13
##$BF2= 200.13
##$BF3= 200.13
##$BF4= 200.13
##$BF5= 200.13
##$BF6= 200.13
##$BF7= 200.13
##$BF8= 200.13
##$BYTORDA= 1
##$CFDGTYP= 0
##$CFRGTYP= 5
##$CHEMSTR= <none>
##$CNST= (0..31)
1 1 145 1 1 1 1 1 1 1 1 1 1 1 1 1 1 1 1 1 1 1 1 1 1 1 1 1 1 1 1 1 
##$CPDPRG= <>
##$CPDPRG1= <>
##$CPDPRG2= <>
##$CPDPRG3= <>
##$CPDPRG4= <mlev>
##$CPDPRG5= <mlev>
##$CPDPRG6= <mlev>
##$CPDPRG7= <mlev>
##$CPDPRG8= <mlev>
##$CPDPRGB= <>
##$CPDPRGT= <>
##$D= (0..31)
0 1.2 0 0 0 0 0 0 0 0.06 0 0.03 0 0 0 0 0.0002 0 0 0 0 0 0 0 0 0 0 0 0 
0 0 0 
##$DATE= 1681120731
##$DBL= (0..7)
120 120 120 120 120 120 120 120 
##$DBP= (0..7)
150 150 150 150 150 150 150 150 
##$DBP07= 0
##$DBPNAM0= <>
##$DBPNAM1= <>
##$DBPNAM2= <>
##$DBPNAM3= <>
##$DBPNAM4= <>
##$DBPNAM5= <>
##$DBPNAM6= <>
##$DBPNAM7= <>
##$DBPOAL= (0..7)
0.5 0.5 0.5 0.5 0.5 0.5 0.5 0.5 
##$DBPOFFS= (0..7)
0 0 0 0 0 0 0 0 
##$DE= 6
##$DECBNUC= <off>
##$DECIM= 32
##$DECNUC= <off>
##$DECSTAT= 4
##$DIGMOD= 1
##$DIGTYP= 9
##$DL= (0..7)
0 120 120 120 120 120 120 120 
##$DP= (0..7)
150 150 150 150 150 150 150 150 
##$DP07= 0
##$DPNAME0= <>
##$DPNAME1= <>
##$DPNAME2= <>
##$DPNAME3= <>
##$DPNAME4= <>
##$DPNAME5= <>
##$DPNAME6= <>
##$DPNAME7= <>
##$DPOAL= (0..7)
0.5 0.5 0.5 0.5 0.5 0.5 0.5 0.5 
##$DPOFFS= (0..7)
0 0 0 0 0 0 0 0 
##$DQDMODE= 0
##$DR= 18
##$DS= 0
##$DSLIST= <SSSSSSSSSSSSSSS>
$$ [...]
##$SUBNAM2= <"">
##$SUBNAM3= <"">
##$SUBNAM4= <"">
##$SUBNAM5= <"">
##$SUBNAM6= <"">
##$SUBNAM7= <"">
##$SUBNAM8= <"">
##$SUBNAM9= <"">
##$SW= 18.05172834244
##$SWIBOX= (0..15)
0 0 2 0 0 0 0 0 0 0 0 0 0 0 0 0 
##$SW_h= 3612.71676300578
##$TD= 16384
##$TD0= 1
##$TE= 0
##$TE2= 300
##$TE3= 300
##$TEG= 300
##$TL= (0..7)
0 120 120 120 120 120 120 120 
##$TP= (0..7)
150 150 150 150 150 150 150 150 
##$TP07= 0
##$TPNAME0= <>
##$TPNAME1= <>
##$TPNAME2= <>
##$TPNAME3= <>
##$TPNAME4= <>
##$TPNAME5= <>
##$TPNAME6= <>
##$TPNAME7= <>
##$TPOAL= (0..7)
0.5 0.5 0.5 0.5 0.5 0.5 0.5 0.5 
##$TPOFFS= (0..7)
0 0 0 0 0 0 0 0 
##$TUNHIN= 0
##$TUNHOUT= 0
##$TUNXOUT= 0
##$USERA1= <user>
##$USERA2= <user>
##$USERA3= <user>
##$USERA4= <user>
##$USERA5= <user>
##$V9= 5
##$VALIST= <valist>
##$VCLIST= <CCCCCCCCCCCCCCC>
##$VD= 0
##$VDLIST= <DDDDDDDDDDDDDDD>
##$VPLIST= <PPPPPPPPPPPPPPP>
##$VTLIST= <TTTTTTTTTTTTTTT>
##$WBST= 1024
##$WBSW= 4
##$XGAIN= (0..3)
0 0 0 0 
##$XL= 0
##$YL= 0
##$YMAX_a= 212193
##$YMIN_a= -173983
##$ZGOPTNS= <>
##$ZL1= 120
##$ZL2= 120
##$ZL3= 120
##$ZL4= 120
##$ABSF1= 10
##$ABSF2= 0
##$ABSG= 5
##$ABSL= 3
##$ALPHA= 0
##$AQORDER= 0
##$ASSFAC= 0
##$ASSFACI= 0
##$ASSFACX= 0
##$ASSWID= 0
##$AUNMP= <proc_1d>
##$AZFE= 0.1
##$AZFW= 0.1
##$BCFW= 1
##$BC_mod= 2
##$BYTORDP= 1
##$COROFFS= 0
##$CY= 11.3945322036743
##$DATMOD= 1
##$DC= 2
##$DFILT= <>
##$DTYPP= 0
##$F1P= 2.36226072786647
##$F2P= -0.459571619588291
##$FCOR= 0.5
##$FTSIZE= 0
##$FT_mod= 4
##$GAMMA= 1
##$GB= 0.15
##$INTBC= 1
##$INTSCL= 1
##$ISEN= 128
##$LB= 0.24
##$LEV0= 0
##$LPBIN= 0
##$MAXI= 10000
##$MC2= 0
##$MEAN= 0
##$ME_mod= 0
##$MI= 1.114404
##$NCOEF= 0
##$NC_proc= 0
##$NLEV= 6
##$NOISF1= 3.799351
##$NOISF2= 2.8
##$NSP= 1
##$NTH_PI= 0
##$NZP= 0
##$OFFSET= 15.70392
##$PC= 1
##$PHC0= -19383.12
##$PHC1= 12.4008
##$PH_mod= 1
##$PKNL= yes
##$PPARMOD= 0
##$PSCAL= 0
##$PSIGN= 0
##$REVERSE= no
##$SF= 200.130013532006
##$SI= 16384
##$SIGF1= 3
##$SIGF2= 2
##$SINO= 400
##$SIOLD= 16384
##$SREGLST= <1H.CDCl3>
##$SSB= 0
##$STSI= 0
##$STSR= 0
##$SW_p= 3612.71676300578
##$SYMM= 0
##$S_DEV= 0
##$TDeff= 0
##$TDoff= 0
##$TI= <>
##$TILT= no
##$TM1= 0
##$TM2= 0
##$TOPLEV= 0
##$USERP1= <user>
##$USERP2= <user>
##$USERP3= <user>
##$USERP4= <user>
##$USERP5= <user>
##$WDW= 1
##$XDIM= 8192
##$YMAX_p= 0
##$YMIN_p= 0
$$ End of Bruker specific parameters
$$ ---------------------------------
##NTUPLES= NMR FID
##VAR_NAME=  TIME,          FID/REAL,        FID/IMAG
##SYMBOL=    X,             R,               I
##VAR_TYPE=  INDEPENDENT,   DEPENDENT,       DEPENDENT
##VAR_FORM=  AFFN,          ASDF,            ASDF
##VAR_DIM=   8192,          8192,            8192
##UNITS=     SECONDS,       ARBITRARY UNITS, ARBITRARY UNITS
##FACTOR=    0.0002768,     1,               1
##FIRST=     0,             0,               0
##LAST=      2.2672688,     0,               0
##MIN=       0,             -173983,         0
##MAX=       2.2672688,     212193,          0
$$ Real data points
##PAGE= N=1
##DATA TABLE= (X++(R..R)), XYDATA
$$ [...]
2438c854M405L131n391j093N157n67l850Q89K324J12j550j467K039K062l520j253
$$ -3854 551 3682 -1709 -2802 2355 1788 -2062 -1173 1151 1263 -287 -1754 285 2347 -1173 -2426
2454b426M852n58n038K449L869l633k002L720N75l016l07K116J041j751k054K214
$$ -2426 2426 1868 -3170 -721 3148 -485 -2487 1233 1808 -1208 -1515 601 1642 -109 -2163 51
2470E1K633l382k340M567J428n194j62M860r88l781J703K523j745j598J157J492
$$ 51 2684 -698 -3038 1529 2957 -2237 -2399 2461 1473 -2308 -605 1918 173 -1425 -268 1224
2486A224n02k030M01K836j249l332K844L065m465j885N100L36m629R22L314j079
$$ 1224 722 -1308 -907 1929 680 -2652 192 3257 -1208 -3093 2007 2343 -2286 -1364 1950 871
2502H71k194J49J970J029k716j510L930P12m696R86M471k692l190L480J587l181
$$ 871 -1323 -1174 796 1825 -891 -2401 1529 2241 -2455 -1469 3002 310 -2880 600 2187 -994
2518i94l95K299J76j629p99J723J634k547j967L644J513m536m22M769p17m379
$$ -994 -1389 910 1086 -543 -1342 381 2015 -532 -2499 1145 2658 -1878 -2300 2469 1752 -2627
2534b627J526L464j728k517J454J871r85j789O36K232q07k767J608K896k822k261
$$ -2627 -1101 2363 635 -1882 -428 1443 458 -1331 -695 1537 730 -2037 -429 2467 -355 -2616
2550b616L896J040m334L11L888j112k909J025K178l25k185m41L013M98l977K59
$$ -2616 1280 2320 -2014 -1703 2185 1073 -1836 -811 1367 1042 -1143 -1584 1429 1927 -2050 -1791
2566a791M456j594l903K696K627l041j326K630N54j864n80J513J000j807j345
$$ -1791 2665 1071 -2832 -136 2491 -550 -1876 754 1308 -556 -1136 377 1377 -430 -1775
2581a775K671J161l581m55M086m81m055J287L588j730k983J792K460j556k231
$$ -1775 896 2057 -1524 -1979 2107 1626 -2429 -1142 2446 716 -2267 -475 1985 429 -1802
2596a802J268K236j164k384J401K512k007k298K761J672l383o22L520m24l142
$$ -1802 -534 1702 538 -1846 -445 2067 60 -2238 523 2195 -1188 -1810 1710 1286 -1856
2611a856J085K475j046k074N60K315k10l035M31L710j257l831K272L187k896k138
$$ -1856 -771 1704 658 -1416 -856 1459 1249 -1786 -1355 2355 1098 -2733 -461 2726 -170 -2308
2627b308K817J232k272q55J763R76j699j190K134J048k783m69L226l19l304J071
$$ -2308 509 1741 -531 -1386 377 1353 -346 -1536 598 1646 -1137 -1606 1620 1301 -2003 -932
2643i32L071j504k786J715K561j778k409J805K351j904k209J928K114k027k024
$$ -932 2139 635 -2151 -436 2125 347 -2062 -257 2094 190 -2019 -91 2023 -4 -2028
2658b028K279J770k577j321K913N48k970K05K717p74k307R52K033q28k163P93
$$ -2028 251 2021 -556 -1877 1036 1584 -1386 -1181 1536 762 -1545 -593 1440 612 -1551 -758
2674g58K638j136l027J817L006k520k487K860J761k710j239K281J119k017j207
$$ -758 1880 744 -2283 -466 2540 20 -2467 393 2154 -556 -1795 486 1605 -412 -1619
2689a619K122J164k489p50K795M8k817O51K566j095k282J310K178j459k248J715
$$ -1619 503 1667 -822 -1572 1223 1271 -1546 -895 1671 576 -1706 -396 1782 323 -1925 -210
2705b10K337k116k241K490J884k604j527K504J317k363j257K405J124k598p58
$$ -210 2127 11 -2230 260 2144 -460 -1987 517 1834 -529 -1786 619 1743 -855 -1613
2720a613K756J73k752M91K465r56k093J163J917j262k010J520K127j896k118K387
$$ -1613 1143 1316 -1436 -945 1520 564 -1529 -366 1551 289 -1721 -201 1926 30 -2088 299
2736B99J834k641j505K671J260k583j122K537J036k675p48K788K12k705L36K399
$$ 299 2133 -508 -2013 658 1918 -665 -1787 750 1786 -889 -1637 1151 1363 -1342 -1006 1393
2752A393p57j963Q34J808r19j885J113K154j668k213K384J868k892j271K997O72
$$ 1393 636 -1327 -493 1315 396 -1489 -376 1778 110 -2103 281 2149 -743 -2014 983 1655
2768A655k629m98K256O80k158r07K426Q58k800l96L021l79k786J097K234j494
$$ 1655 -974 -1472 784 1464 -694 -1601 825 1683 -1117 -1513 1508 1129 -1657 -560 1674 180
2784A80j691J591J351j586j272J642J357j891j414K253J316k588j147K862Q79
$$ 180 -1511 80 1431 -155 -1427 215 1572 -319 -1733 520 1836 -752 -1899 963 1842
2799A842l080m61L092j5k883M43K486p02j973O93J661n20j689M97K001r31k221
$$ 1842 -1238 -1699 1393 1378 -1505 -1062 1424 722 -1251 -558 1103 583 -1106 -609 1392 461 -1760
2816a760J742K051k571j440L079N61l012J39K460k27j949j88J880O72k304q11
$$ -1760 -18 2033 -538 -1978 1101 1662 -1350 -1211 1249 1022 -927 -1115 765 1437 -867 -1678
2832a678K956L07l301N71L070j405k353J839J467j755q92J458P35j224r41J361
$$ -1678 1278 1585 -1716 -1145 1925 520 -1833 6 1473 -282 -1174 284 1019 -205 -1146 215
2848B15J189j835j247K473R70l002m27L269k46l180Q62K696j113k106J006J649
$$ 215 1404 -431 -1678 795 1765 -1237 -1664 1605 1359 -1821 -959 1737 624 -1482 -476 1173
2864A173o25j554L26J828l77k237R53K357j881j886K688R40k998J00K619o94j937
$$ 1173 548 -1006 -680 1148 771 -1466 -513 1844 -37 -1923 765 1705 -1293 -1193 1426 732 -1205
2881a205O31J427o3j552m77K261M89l056J13L431j111l026J874K163k159j170
$$ -1205 -574 853 790 -762 -1239 1022 1511 -1545 -1432 1999 888 -2138 -264 1899 -260 -1430
2897a430J806O32j245n66Q34R11r69j206J580J228k384p67K948j0l124Q86K800
$$ -1430 376 1008 -237 -803 31 942 -27 -1233 347 1575 -809 -1576 1372 1362 -1762 -876 1924
2914A924j467k229J573J612j174j331N99J505l02j987N27K446j295k411K205J705
$$ 1924 457 -1772 -199 1413 239 -1092 -493 1012 710 -1277 -750 1696 401 -2010 195 1900
2930A900k763n33K682n28k087R76J365o57r88o1J337M58k156j85K996p25l270
$$ 1900 -863 -1396 1286 758 -1329 -353 1012 355 -633 -694 643 1101 -1055 -1240 1756 1031 -2239
2947b239J763K762k361j763K332P91j774l91J086O60p60j142R03J428j555j211
$$ -2239 -476 2286 -75 -1838 494 1285 -489 -880 206 866 106 -1036 -133 1295 -260 -1471
2963a471K362M84k851M51K820j274k277J712J533j676j036J255J085p50j539M94
$$ -1471 891 1375 -1476 -1025 1795 521 -1756 -44 1489 -187 -1223 32 1117 367 -1172 -678
2979f78K130q24k444J684K186k594j347K930K77k503N70J644q84q16M61P20J40
$$ -678 1452 628 -1816 -132 2054 -540 -1887 1043 1320 -1183 -613 1031 147 -669 -208 512 652
2996F52j291m60K200J2k825J082K818k219k181K765J248k514m91J681L17r51p03
$$ 652 -639 -1099 1101 1113 -1712 -630 2188 -31 -2212 553 1801 -713 -1204 477 794 -157 -860
3013h60Q06J263j220j575J923J241k483l39K634p43k318J487J752j684j128J453
$$ -860 -54 1209 -11 -1586 337 1578 -905 -1244 1390 647 -1671 -184 1568 -116 -1244 209
3029B09P35j003q24P45J340q32k021J388K261k080j904K711R46k856N5K378o23
$$ 209 944 -59 -883 -138 1202 370 -1651 -263 1998 -82 -1986 725 1671 -1185 -1130 1248 625
3046F25j541N84P50r3o02m15J237L92k131K47K648j257k466K310J531k647o22
$$ 625 -916 -332 418 325 -277 -692 545 937 -1194 -947 1701 444 -2022 288 1819 -828 -1450
3063a450K398R2j619k55R68Q43r34j324J482J370k205r24K651J33k583P66J978
$$ -1450 948 1040 -579 -834 134 977 43 -1281 201 1571 -634 -1558 1093 1226 -1357 -591 1387
3080A387j315j307J436P94j160o67Q06Q75p06j272R83J635j631j713K352J355
$$ 1387 72 -1235 201 995 -165 -832 -26 849 143 -1129 -146 1489 -142 -1855 497 1852
3096A852k782n90K687j71k163N73J490m82r32o2R44M68j410l54K014l83k271J402
$$ 1852 -930 -1520 1167 996 -1167 -594 896 414 -518 -580 364 832 -578 -932 1082 699 -1572 -170
3114a70J950k194j133K397K52k010J10J462P8j092o58J229J125j762j125K380
$$ -170 1780 -414 -1547 850 1102 -908 -798 664 742 -350 -1008 221 1346 -416 -1541 839
3130H39N65k658K46K403q56j833J145J169j088p33Q49O60o90q87P73J186j126
$$ 839 1404 -1254 -1008 1395 539 -1294 -149 1020 -68 -801 48 708 18 -869 -96 1090 -36
3147c6j302J689J161k248p57K572J23k435L50K025n48j488L88J169rj248k26J601
$$ -36 -1338 351 1512 -736 -1493 1079 1202 -1233 -883 1142 594 -894 -506 663 654 -594 -820 781
3165G81O7j973N30K013j327j568J881Q41j963j78J635o8j264j04J123N16j416
$$ 781 848 -1125 -595 1418 91 -1477 404 1245 -718 -896 739 671 -593 -697 426 942 -474
3182d74p61J940N83k354q1K444m70k179Q55J693r50j226Q40R66o68r51O94R80
$$ -474 -1235 705 1288 -1066 -1147 1297 827 -1352 -497 1196 246 -980 -140 826 158 -793 -99 881
3200H81q24j048J121J016j542p73J896M15k129O5K045l75j867N49J535m24j393
$$ 881 57 -991 130 1146 -396 -1169 727 1142 -987 -922 1123 748 -1119 -570 965 541 -852
3217h52K21J446j07j698K71J885p17j763J201J379j535p87J528L15j334j19J162
$$ -852 -631 815 708 -990 -719 1166 449 -1314 -113 1266 -269 -1056 472 787 -547 -666 496
3234D96K13j200l55J490L39j870p1K126l80k035O87J825q41j580Q41J342p39j267
$$ 496 709 -491 -846 644 983 -887 -958 1168 788 -1247 -560 1265 424 -1156 -315 1027 288 -979
3252i79P52J201q64j105J042R26j200p16J364M80j517k40J642k2j758L33J696
$$ -979 -227 974 110 -995 47 973 -227 -943 421 901 -616 -856 786 764 -994 -661 1035
3269A035n08j578N73J507n61j491N22J626o66j655Q88J559j156j235J287Q57j268
$$ 1035 527 -1051 -478 1029 468 -1023 -501 1125 459 -1196 -308 1251 95 -1140 147 1004 -264
3286b64n52J195L52j129l27J232K42j461k2J647k86j711N85J621p73j477Q02J407
$$ -264 -816 379 731 -398 -725 507 749 -712 -734 913 627 -1084 -499 1122 349 -1128 -326 1081
3304A081p78j440Q44J463j025j328J175J093j312p48J271N06j165l60J149K97
$$ 1081 303 -1137 -293 1170 145 -1183 -8 1085 -227 -975 296 802 -363 -723 426 723
3320G23j289j44J517j61j598M77J597p78j442R02J304r07j287R25J272r58j308
$$ 723 -566 -710 807 646 -952 -475 1122 344 -1098 -196 1108 201 -1086 -161 1111 153 -1155
3337a155J100J176j217r83J257P72j274n57J300L28j305j19J365j46j399M42J325
$$ -1155 -55 1121 -96 -1079 178 950 -324 -881 419 747 -558 -677 688 542 -857 -415 910
3354I10o46j182P04J167p00j280P94J411j031j444J366J232j565q72J577M47j270
$$ 910 264 -918 -214 953 253 -1027 -233 1178 147 -1297 69 1301 -264 -1136 441 888 -382
3371c82l22J013L50r26m54J093M13j434p2J648m79j575R74J253j188r40J123Q28
$$ -382 -704 309 659 -267 -721 372 785 -649 -721 927 448 -1127 -153 1100 -88 -1028 95 923
3389I23j025q26R02J027r79j141J214J052j426q34J566N26j561j96J422q2j257
$$ 923 -102 -928 -26 1001 22 -1119 95 1147 -279 -1113 453 979 -582 -778 644 562 -695
3406f95L01J098m71r08M70Q84m61r83N63J175q21j314J208J262j639r02J783M60
$$ -695 -394 704 233 -675 -205 679 218 -765 -202 973 152 -1162 46 1308 -331 -1233 550 1010
3424A010j646j15J262R0r02l50Q49N70j109n63J529J33j718M88J582j060j113
$$ 1010 -636 -751 511 601 -301 -651 198 768 -341 -904 625 758 -960 -472 1110 50 -1063
3441a063J310N85j197l35R38M17p36p32Q55J004j207j014J597P51j820l26J801
$$ -1063 247 832 -365 -700 238 655 -81 -813 42 1046 -161 -1175 422 1173 -647 -973 828
3458H28r5j536L59J144l98q76L43P19k50p83K38J001m31j194Q12J248j347r82
$$ 828 733 -803 -444 700 302 -574 -231 488 238 -545 -307 694 263 -931 -119 1129 -218 -1200
3476a200J743N07j804n9J539j67j134R6Q15K78q93n82J274N62j679r2J825o11
$$ -1200 543 1050 -754 -813 726 559 -575 -479 336 614 -279 -861 413 975 -704 -796 1029 418
3494D18j512J126R64j307l59J038R1o93j99N07N52p03r02J225Q89j693n41J951
$$ 418 -1094 32 996 -311 -670 368 459 -234 -433 74 626 -77 -979 246 1135 -558 -1099 852
3512H52k2j860M91J494o46j056N29P12k44o67O3Q38j09j094M04J247q71j131J369
$$ 852 830 -1030 -539 955 309 -747 -218 494 250 -417 -354 484 375 -719 -315 932 61 -1070 299
3531B99O95j661j19J655l28j310L87R17j41p38k15R22M59j409l36J842j65j871
$$ 299 994 -667 -786 869 541 -769 -382 535 394 -344 -559 363 822 -587 -923 919 754 -1117
3549a117P51J472j207p67J222K12r00l2M64K51l40n52N81P67j145o62J675K76
$$ -1117 -366 1106 -101 -868 354 566 -334 -366 98 349 9 -543 38 805 -340 -1002 673 949
3567I49j905K72J708o88j280Q13R08o50o74K61P40or72P6J207m59j265R83J023
$$ 949 -956 -684 1024 336 -944 -131 777 127 -547 -286 454 448 -524 -448 759 300 -965 18 1041
3586A041j372n58J498l6j310M56R46m85o77J57O69J95r43l28J384P9j772N20J744
$$ 1041 -331 -889 609 573 -737 -281 665 180 -497 -340 329 524 -419 -747 637 716 -1056 -536 1208
3605A208j020j322J243O99j086k04P07O8l26l52K97P08n77q20J101N14j540K0
$$ 1208 188 -1134 109 808 -278 -482 225 293 -33 -385 -88 620 43 -777 324 838 -702 -682
3623f82J686n57j490Q93J030q46o81N94N90l29p94K09J064k87j283O44J183j033
$$ -682 1004 447 -1043 -150 880 34 -647 -53 537 208 -586 -377 687 400 -883 -239 944 -89
3641h9q43J308L76j343Q4J088l53o94L68M57j40n70p2R25J14j377K13J585p14
$$ -89 -932 376 752 -591 -507 581 228 -466 -98 359 219 -351 -423 502 616 -761 -548 1037 323
3660C23j477J194J016j313n40J062K29o26k12K68M95l26p50O82P80j128m56J421
$$ 323 -1154 40 1056 -257 -797 265 494 -132 -344 -76 419 93 -657 25 805 -323 -779 642
3678F42j33j391O63J100q87p58P95N55n58n31L15P75l39j042N60J183q61j079
$$ 642 509 -882 -219 881 -6 -764 31 586 28 -503 -188 587 248 -794 -234 949 88 -991
3696i91J126P48j242l22J175m1r37K43O19j77m62L1M98R5q02j1J188l58j344Q37
$$ -991 135 883 -359 -681 494 453 -484 -241 378 201 -261 -230 268 363 -439 -450 738 380 -964 -127
3716a27J174j182p86J256L97j061j93O58L26m80n57N11P55p85p22J183L17j291
$$ -127 1047 -135 -921 335 732 -329 -522 136 462 -18 -575 -64 691 -94 -816 367 684 -607
3734f07J73J161n72q24P05N53o61l96M73N02l99o97M74Q93p25r22J013P73j212
$$ -607 -434 727 155 -669 36 589 -72 -468 5 507 108 -589 -115 778 53 -869 144 917 -295
3753b95n17J220K43j104oQ74j05o42K8N88J8o28l9P96j02r77M19J028q10q69J088
$$ -295 -812 408 651 -453 -459 415 310 -332 -304 284 302 -326 -365 431 329 -648 -229 799 -11 -880 208
3774B08N70j141k85R79K14p54k78O17M80o95o41R75N05j166k14J208j65j042M56
$$ 208 778 -363 -648 331 545 -209 -487 130 610 -85 -726 249 754 -412 -626 582 417 -625 -169
3793a69P33n31n02M83L90l79m91M36O10o10o81Q10O43r96n16J136L30j153j38
$$ -169 564 33 -469 14 404 25 -466 -30 580 -30 -711 99 742 -254 -770 366 696 -457 -595
3812e95J026O9r39J7P98Jp50LP60n4p93K02Q00l90p89O56O50q59m05Q91K51q66
$$ -595 431 500 -439 -422 376 377 -373 -370 390 336 -457 -255 545 155 -634 22 672 -187 -592 299 550 -316
3834c16j64P71K38p82l34Q74L52j039k25J145j2j066J91R12l09p49L47O09l18
$$ -316 -480 291 529 -253 -587 287 639 -400 -625 520 508 -558 -367 545 236 -513 -166 443 125
3853A25n75L77N39m74n11O15M80p77l95R10K63r70j44R73R7r84j1R29or29Q7Q87
$$ 125 -450 -73 466 -8 -519 96 576 -201 -596 314 577 -393 -537 436 533 -451 -462 467 461 -468 -381 506
3875E06j49q36K17P45k63p24L68O65n16n41O19M45p63k71P64J82p85j40Q40Q1
$$ 506 357 -479 -262 483 220 -504 -136 529 13 -528 91 536 -227 -498 266 448 -337 -477 363 444
3895D44q97l5R57m1r83J41R73k26q58K35Q04k50p86L51O97m18o19N78M47o47l08
$$ 444 -453 -488 469 428 -555 -414 559 333 -525 -290 514 264 -522 -171 526 108 -511 67 514 -133 -441
3916d41O74J87o82j31P10R9p76p9R00j7j011J49J005k91r05L59Q12l98o79L34
$$ -441 233 420 -262 -393 317 416 -360 -439 461 444 -567 -418 587 296 -609 -250 562 164 -515 -181
3936a81O59l58o11L81O03m88n30O28L88p25k12P68Q9q07M1Q31j43q07J96P68j94
$$ -181 478 120 -491 -110 493 5 -525 103 491 -234 -446 322 411 -396 -355 476 333 -474 -278 490 296
3957B96p79K00Q37k56q42K63R00m19q26N46O52o42m28O55K37n71j48N14J06m89
$$ 296 -483 -283 554 298 -544 -281 619 200 -626 -80 572 -70 -498 157 394 -177 -325 189 295 -194
3977a94j82O21J94q42j5R79k22j006M59Q54n50o70N18N52m12n15L09O01l28o69
$$ -194 -376 245 439 -403 -418 561 339 -667 -208 646 96 -574 -56 496 84 -431 -122 479 151 -518
3997e18M55O54o34m83P47K60p92j8P44j59o59K34N84k46n65J90N99j59p34K27
$$ -518 -63 591 -43 -526 221 481 -311 -329 415 256 -403 -169 415 169 -396 -206 393 234 -500 -273
4017b73Q60l73r25N94Q02p32n85P81L39o82j42M95J19l46k05L51L12n55k60Q00
$$ -273 587 214 -711 -117 685 -47 -632 149 488 -194 -336 159 278 -68 -273 78 390 -165 -425 375
4037C75M2r61K83R39n99p13O98M73o12l18L97L91k66n92K70P27m39p45P24N40
$$ 375 417 -544 -261 678 79 -634 64 537 -75 -393 4 395 129 -463 -193 534 95 -650 74 614
4057F14q76k65Q43mp24K16N01k23l98J64M11p2n21Q8P08k15q55M89Q46p26o95
$$ 614 -262 -527 316 312 -412 -196 305 82 -316 -152 259 187 -334 -246 462 247 -608 -119 727 1 -694
4078f94Q45M74q23k45O64J17m61j79L54L16l83m30N71L65q25q2R43l01q71O41
$$ -694 151 625 -198 -443 221 338 -123 -302 52 368 -15 -445 126 491 -334 -416 527 226 -645 -4
4098dN60p20k56N50J58l32k90K43N44l30p33N51P48q34n13J007J58r28J03O91
$$ -4 556 -164 -420 130 288 -44 -334 -91 453 123 -610 -59 689 -145 -658 349 507 -421 -318 373
4118C73j86m23J47K65l8l14k5M89kp08K02Q06n20p24P80N19r12k73Q48Q1o38l9
$$ 373 187 -236 -89 176 138 -176 -201 288 286 -422 -220 586 66 -658 122 641 -271 -544 304 385 -253 -292
4140b92M24J53l51l41M62M34o78l65Q92N9q98L03P58o12m30O20J82m58p9K43K26
$$ -292 132 285 -66 -407 55 489 -189 -554 338 397 -501 -198 560 -52 -482 138 320 -138 -217 26 252
4161B52j98m58L64O55o63o55R34M14j052l5R15j87o80K45M13q5k99j05L52J32
$$ 252 54 -404 -40 615 -48 -703 231 645 -407 -442 473 286 -394 -149 264 179 -120 -225 127 259
4181B59n16mO81k43p55N09O47p46l35Q21Q6p76N2N92om28j35L92L38n59l66P96
$$ 259 -257 -261 420 177 -578 -69 578 -168 -503 318 404 -372 -320 272 266 -162 -297 95 433 -126 -492 304
4203C04K28r73L3R43l32p04N31L71n43j17L49J05j67k48J26M60l28n74O91M73
$$ 304 532 -441 -408 535 203 -501 30 401 -142 -259 90 195 28 -220 -94 366 38 -536 155 628
4223F28r93k02J033q0q60K43O10k32m32Q2L83J03m76j59O37J6p15K43O87n34n01
$$ 628 -365 -567 466 386 -474 -231 379 147 -285 -203 180 283 -193 -352 285 301 -414 -171 516 -18 -519
4244e19O99K69p21k2N95r1m58L8M05J29m57k91O33K89q33j35R82j86q95M04O68
$$ -519 180 449 -272 -294 301 210 -248 -210 195 324 -133 -424 209 498 -335 -470 512 326 -569 -165 503
4265E03n03l61M01J58k26j60R9L32j47m71L29N42o67l65R00N7r13K17P40l06n20
$$ 503 0 -361 40 198 -28 -188 -89 243 96 -375 -46 496 -171 -536 364 421 -492 -275 465 159 -361
4286c61K21M23q0m17p6N81O7p44R0P55k91o80N17M57o18k15N95Mm50L7L44K2l62
$$ -361 -140 283 203 -214 -290 291 358 -386 -296 459 168 -512 5 462 -156 -371 224 228 -222 -185 159 181 -181
4309a81q6M31J75o20j43Q30j5r25K52Q25m15o46N08L85l78k63K18K77j00m03J70
$$ -181 -267 164 339 -281 -424 406 391 -534 -282 543 128 -518 -10 375 -3 -266 -48 229 129 -274 -104
4330a04N12l81m78O14K86p68oP67k29o40L22M47k15m38J20M50Ro39P7P52k68p26
$$ -104 408 27 -451 163 449 -319 -325 442 213 -427 -105 342 127 -311 -191 259 268 -371 -294 458 190 -536
4352e36M05O27n12m43N42K58m92j28M05J07l89p6L94Q7m57p3N65J9o93J36P55
$$ -536 -131 496 -16 -459 83 341 -151 -279 126 233 -156 -232 162 249 -208 -281 284 303 -390 -254 501
4373E01l26p09M46N77m80m31M22L47l05l54K14M33k54n15M56M03n62k57O76jo23
$$ 501 175 -534 -88 489 9 -422 0 347 42 -312 -98 335 81 -434 22 425 -137 -394 282 281 -342
4394c42J62N16k25m35K06L89j28m88J47O01k25o83L60O59m60n44N20M18n11l12
$$ -342 -180 336 111 -324 -118 271 143 -345 -198 403 178 -505 -145 514 54 -490 30 448 -63 -375
4414c75M72K32m21k01M13J75m41r4M39N4n07L9N56j59n91K53N85l68n20M42M38
$$ -375 97 329 -92 -293 120 295 -146 -240 199 253 -254 -215 341 182 -409 -156 429 61 -459 -17 421
4435D21m56m02M24L89l63m17M02M23m68l79N61K36n85j04N67m5m71J17M05j28
$$ 421 -35 -437 -13 376 13 -404 -2 421 -47 -426 135 371 -214 -318 249 204 -267 -150 255 127
4455A27m01J53M60k12n17L26N05m21m92N09M21n08l71N09L13m84l01M74K71n02
$$ 127 -274 -121 339 127 -390 -64 441 20 -472 37 458 -50 -421 88 401 -83 -384 90 361 -141
4475a41j99N30P8n20L8M79j28m03J23M46k08m72L02M67l61m82M85M12n23l48N15
$$ -141 -340 190 268 -252 -214 265 137 -266 -143 303 95 -377 -75 392 31 -451 34 446 -77 -425 90
4496I0L23n04l05N33K72n38k20N23J49n14p0N02j3m84R7M75k13m44K80M29l79
$$ 90 413 -91 -396 137 409 -129 -349 174 323 -191 -261 241 228 -256 -159 316 103 -341 -61 368 -11
4517a1l75M30L24m48l08M53L35m89l44N52L39o48k35O44J39o33RN30n2m67J13
$$ -11 -386 44 368 -80 -388 65 400 -89 -433 119 458 -190 -425 219 358 -275 -266 264 212 -255 -142
4538a42L72o4l97Q9M57k08m70L31M87n15l85O02K71o26j63N77J49n37j62N08J86
$$ -142 230 166 -231 -142 315 107 -363 -32 455 -60 -445 157 428 -198 -361 216 365 -172 -334 174 360
4559C60n33j88N75J31o27j1N97j05n57K21M63l20l36L55K73l68k15L42K66l78
$$ 360 -173 -361 214 345 -282 -293 304 199 -358 -137 326 6 -330 25 298 -70 -285 57 323 -55
4579e5l06M62L31n94k63P22J21p29k5O93j14n33J16M15o3l89RM26l7m78J31N43
$$ -55 -361 101 432 -162 -425 297 418 -311 -336 357 243 -290 -174 241 178 -211 -202 224 187 -291 -160 383
4601C83l45m74N04L29n79j80O17J6n17j0M76M7m40j60N27J82o36j43P35kp35J83
$$ 383 38 -436 68 397 -182 -362 255 271 -246 -256 220 267 -173 -333 194 376 -260 -403 332 330 -405 -222
4623b22O31k92m97M04K78k95k46K71J81k03k75L02L36m55l26O21K01p49m2P94
$$ -222 409 117 -380 24 302 7 -239 32 213 10 -265 37 373 -82 -408 213 414 -335 -377 417
4643D17j61o81K56M95j99l91Q3L86K0n02L0N97j53o29L69N41n86k66O09M3n37
$$ 417 256 -425 -169 326 127 -264 -181 205 225 -277 -247 350 197 -432 -63 478 -108 -374 235 278 -259
4664b59O2M31m9l55n5L89J46n17j36O84K4q04J56P73l10o61M27M44m08k84L19
$$ -259 -197 234 185 -170 -225 164 310 -207 -343 341 365 -439 -283 490 180 -481 -54 390 -18 -302 17
4685A7K00k12k35J72L34k41m09M51L05o36j64P86o7p49K86N79l52l99K76L23q7
$$ 17 217 5 -230 -58 276 35 -374 77 382 -254 -418 368 301 -448 -162 417 65 -334 -58 265 178
4706A78m04qN42k4o84K04P03m55n82O54K91o33l0M74p1l26N9K33Q3l30j77M99
$$ 178 -226 -234 308 284 -400 -196 507 52 -530 124 415 -218 -248 226 155 -171 -112 121 204 -126 -303 196
4728A96J43o88J8Q04k78p49M66N99n09m13M28K61l20k00K22K92j81m31K67M77
$$ 196 339 -349 -331 473 195 -554 -88 511 2 -411 17 278 -42 -242 -20 272 91 -340 -73 404
4748D04m45l59O45J12p20J27O84l22m97L72K92k78k36J19L59p1n67J32P23l21
$$ 404 -41 -400 245 357 -363 -236 448 126 -371 1 293 15 -221 -102 257 186 -381 -249 474 153
4768A53p03N47N19o79k53O53L9m86O1K39L5j85j40K80K22n12j21O86q5p57L58
$$ 153 -550 -3 516 -163 -416 237 276 -210 -149 90 125 -60 -200 80 302 -210 -331 355 270 -487 -129
4789a29O60n45m96N87L60n16k31L30K66k32l36K13M74l82m63N45L42o72j00O61
$$ -129 531 -14 -510 77 437 -79 -310 20 286 54 -282 -69 405 23 -440 105 447 -225 -325 336
4809C36j38o02L29M03l12k77K11K59j11l47Q2N46k25o55M09O76o53m62P23K28
$$ 336 198 -404 -75 328 16 -261 -50 209 98 -249 -167 379 154 -501 -92 584 -69 -531 192 420
4829D20o61j8M87j8l15r2K58K28l51k30N08Q9o71J34P15l80n92N16M07n48k52
$$ 420 -241 -259 228 210 -105 -197 61 289 -62 -292 216 305 -366 -232 483 103 -489 27 434 -114 -366
4850c66M86J85l70k57K79L83l24m58M77M10o03k91P23O7o76J37N21k24l81K61
$$ -366 120 305 -65 -322 -43 340 16 -442 35 445 -158 -449 274 341 -335 -198 323 99 -282 -21
4870b1K57j63k81J15L75j30n20K62N98n07n18P13L15p35j41O38K8m64n2L62J19
$$ -21 236 73 -208 -93 282 152 -368 -106 492 -15 -533 180 495 -240 -381 257 285 -179 -231 131 250
4891B50l48k20M48K18n87p5O51j80n90L70M69m69l11M70J96l83j71L34K42l56
$$ 250 -98 -318 130 348 -239 -314 337 157 -433 -63 406 -63 -374 96 292 -91 -262 72 314 -42
4911d2l31M48L70n54l40O81K00p17k8O48j32n12J91L93j84k78R3K93q2l91J60
$$ -42 -373 75 445 -109 -449 232 432 -285 -313 335 203 -309 -118 275 91 -187 -94 199 117 -274 -114
4932a14M72l11n12N28M07o94k00O51J05o12OM91K9m17j10M42J69n40j30O18Oo48
$$ -114 358 47 -465 63 470 -224 -424 227 332 -280 -274 217 246 -171 -281 161 330 -210 -340 278 284 -364
4954c64J85N58l12m18L77K92l95j98L64J95l36k51L93K67m73k90O03K23o83j22
$$ -364 -179 379 67 -351 26 318 -77 -275 89 284 -52 -303 90 357 -116 -406 197 420 -263 -385
4974c85O95Ko34J04N55j72m42J39L84j21l83J32L76j37m45K97M34m90k95N66J59
$$ -385 310 312 -322 -218 337 165 -277 -138 246 125 -258 -126 250 113 -332 -35 399 -91 -386 180 339
4995C39o00k8N52pm64l0M36R1m92j15O05L1o20N0O38j92n47K84M05l06l34L03
$$ 339 -261 -289 263 256 -208 -238 198 289 -203 -318 287 318 -302 -252 386 194 -353 -69 336 30 -304 -1
5017aK70k94k62L63K29m38k06N17J32n48o1N67J8n93N1N89q1n84J29N44j74m79
$$ -1 269 -25 -287 76 305 -133 -339 178 310 -238 -299 268 286 -307 -256 333 252 -332 -203 341 167 -312
5039c12J91M45j86m51K39M28l48l39L83K92m46j95M97Q0n04NM79j2m89RN20l2
$$ -312 -121 324 138 -313 -74 354 6 -333 50 342 -104 -299 198 278 -226 -221 258 246 -243 -234 286 254
5061B54n85Q6N95j54n84K24N20k60m42K83L86l16l41L42L15l99k33M47J47m79
$$ 254 -331 -245 350 196 -388 -164 356 96 -346 -63 323 7 -334 8 323 -76 -309 138 285 -194
5081a94p3M87K4m82K1N04m6n39R4N72j91n50K44N18l08m45L17L53k77l33K83L18
$$ -194 -267 220 244 -238 -217 287 241 -298 -204 368 177 -373 -129 389 81 -364 -47 306 29 -304 -21 297
5103B97l14k76L48K48m42j38M67M8m76K7M91r3n22J67N09k06n03K59M61k55m48
$$ 297 -17 -293 55 303 -139 -277 190 238 -238 -211 280 187 -335 -168 341 135 -368 -109 352 97 -351
5124c51K46M74k70m37K93M36l77l72M54K28m59j02M30J7l94J3L56%m11L4M68o5
$$ -351 -105 369 99 -338 -45 391 14 -358 96 324 -135 -237 193 210 -184 -171 185 185 -226 -192 276 211
5146B11n74J92N61l13n19M21M01l99l19L37L08l36k71L07L22l36l06M26K23m95
$$ 211 -363 -171 390 77 -442 -21 380 -19 -338 -1 307 -29 -300 7 329 -7 -313 113 336 -159
5166a59r2N03l7n14J89M41k56l69K25L43k26l20K17L90k67m52L33M58m10m30M98
$$ -159 -251 252 215 -299 -110 331 75 -294 -69 274 48 -272 -55 335 68 -384 -51 407 -3 -433 65
5187F5L21n25j89M97M2l89ML26j8l01j2L38L1m46O2N26j94n64M10M77n18l19M89
$$ 65 386 -139 -328 169 211 -178 -174 152 134 -167 -179 159 190 -256 -194 332 138 -426 -16 461 -57 -376 113
5210A13J93l88j81L10K35k89l00L24L45m50k76N74R9n78O7N06j77m17K46L05k50
$$ 113 306 -82 -263 47 282 -7 -307 17 362 -88 -364 210 309 -269 -202 304 127 -290 -44 261 11
5231A1k25J92K79k19l52K44M38l45m66M74M09o10k41O14R3n40L5L87j4k67o1K89
$$ 11 -214 -22 257 38 -314 -70 368 23 -443 31 440 -170 -411 203 296 -244 -209 178 164 -103 -164 125
5253A25J00l80r5N25o0n65K76M94m41l59N38J81n08q8L86Q9k92j85L03K90m07
$$ 125 225 -155 -250 275 215 -350 -74 420 -21 -380 158 339 -169 -257 129 218 -74 -259 44 334 -73
5274g3l51N61K53o58o1O38j37m94K25L63k48k43K04K16j41k46J35L41k27m25L89
$$ -73 -424 137 390 -268 -329 309 172 -322 -97 266 18 -225 -21 195 54 -192 -57 284 57 -368 21
5295B1M29n75k96O60J25o43J6N31o8l94L3L03O5l18j44M26J18n54O0N79k71n09
$$ 21 450 -125 -421 239 364 -279 -263 268 200 -194 -161 142 207 -111 -255 171 289 -265 -205 374 103 -406
5317d06M45L05m98j13M26K1l27m4K76J48k64l05M57K70o06j66P19j5o75J79N12
$$ -406 39 344 -154 -267 159 180 -147 -191 85 233 -31 -336 121 391 -215 -381 338 323 -352 -173 339
5338C39k68l12K24K11j41k18Q8K86j14l53K09L93l98l30N88J64o15m7N76q3m80
$$ 339 71 -241 -17 194 53 -165 -77 209 95 -258 -49 344 -54 -384 204 368 -247 -294 282 199 -281
5359b81J55L36q8k86n8L54J33m84o5N90j16n86L09M85m44k72M55Q9l55nK30M4
$$ -281 -126 210 122 -164 -222 132 265 -219 -284 306 190 -396 -87 398 -46 -318 137 226 -129 -134 96 140
5381A40k03j61L21K18m44k39O35M7o57J37O17k75m86K84L21k24k11J29J98n5l28
$$ 140 -63 -224 97 315 -129 -368 267 314 -343 -206 411 136 -350 -66 255 31 -180 -51 147 92 -236
5402b36J21M21k46m39M16L33n20j48N76n8n25J48M19j53l14Q9K84K4l91j9M91
$$ -236 -115 306 60 -379 37 370 -150 -298 278 220 -305 -157 262 109 -205 -116 168 192 -199 -218 273
5423B73ro00J59N90l56m23M44K54m66m7K97L3k02j08K04J44k84j82M37J52n99
$$ 273 264 -336 -177 413 57 -366 78 332 -134 -181 116 149 -53 -161 43 187 -97 -279 158 310 -289
5444b89J8O22j88n53L28M02l41k98K80K17j38k61J11L51j56m15K89L91m33k30
$$ -289 -271 351 163 -390 -62 340 -1 -299 -19 198 60 -201 -90 261 105 -310 -21 370 -63 -293
5464b93M78Q6m86N0M12j17l49J39K60n9l52O8M15q2m91J41N85l05n19L96L87m52
$$ -293 185 271 -215 -165 247 130 -219 -80 180 121 -231 -163 252 170 -321 -180 405 100 -419 -23 364 -88
5486h8k15M02J08k97o8K31J07k25j84K99J67m11q5N32o4n71K72M65l83l05L23
$$ -88 -303 99 207 -90 -158 73 180 -45 -229 70 237 -174 -259 273 209 -362 -90 375 -8 -313 10
5507A0K75k53k67K20K83j94l65K64L76l95l17M77J93m72n3M33q4l34J10K85j24
$$ 10 285 32 -235 -15 268 74 -291 -27 349 -46 -363 114 307 -165 -218 215 131 -203 -93 192 68
5528F8k66J11K90j09l51J17M50k34m48L71L95m48k90M45J93l94j19L02J35k68
$$ 68 -198 -87 203 94 -257 -140 310 76 -372 -1 394 -54 -344 101 294 -100 -219 83 218 -50
5548e0j34K64J62l31j32M11L4m67J43M26k60l63L02K79l08k14K56K25k55k65K76
$$ -50 -184 80 242 -89 -221 190 224 -243 -100 326 66 -297 5 284 -24 -238 18 243 -12 -277 -1
5569aK88l32k97M11K36m57j28M49P0m22J1L70j00k61Q7K69j11l06J53L24j85l45
$$ -1 287 -45 -342 69 305 -152 -280 169 239 -183 -172 198 98 -163 -76 193 82 -224 -71 253 68 -277
5591b77K74L47l70k77L99K25m23j74L97J37l71j16L31J12l29j33L85P2m18L7M13
$$ -277 -3 344 -26 -303 96 321 -102 -276 121 258 -113 -229 102 214 -115 -248 137 209 -209 -172 241
5612B41j38l51J81L12k49k26K51K26k69k34L02K21l43j98L97J62m07j31M22R7
$$ 241 103 -248 -67 245 -4 -230 21 247 -22 -256 46 267 -76 -274 123 285 -122 -253 169 266
5632B66m11n8M01j0l80M8L52p7l59J34L22j69k82K08K46k52k34L16J93l80j40
$$ 266 -145 -203 198 188 -192 -144 208 131 -228 -94 228 59 -223 -15 231 -21 -255 61 254 -126 -266
5653b66L82J35m20p2L82P0l69p2M13J6l88K2L73m7l48P2L22j58k51J93K50k13
$$ -266 116 251 -169 -241 141 211 -158 -230 183 199 -189 -167 206 159 -189 -117 205 47 -204 -11 239 26
5675B6k48K71J95l24j73L96R9l76q1L94N4m04l1L97K8m12j7M22m7m29J13L87j50
$$ 26 -222 49 244 -80 -253 143 242 -134 -215 179 233 -171 -202 195 223 -189 -206 216 169 -260 -147 240 90
5698I0l20J91K47k12k01K23J78k25j94L17J39l36j24M17M1m26PM11m3l86P9L63
$$ 90 -230 -39 208 -4 -205 18 196 -29 -223 94 233 -103 -227 190 231 -195 -188 223 180 -206 -127 236
5720B36q7l56Q5L49j35k94J15L24j76k87K07K65k88k07L72Q2l65j5L33k2l10%
$$ 236 149 -207 -122 227 92 -202 -87 237 61 -226 -19 246 -42 -249 123 205 -160 -175 158 136 -174 -174
5742a74L38J6l48k5M16m8m43J04M65j93l91K51K89k57k02K40J41j97j28J72J94
$$ -174 164 180 -168 -193 223 175 -268 -164 301 108 -283 -32 257 0 -202 38 179 -18 -146 26 220
5763B20k44j82L27J09m06l6M44o4m24J66L45j64l29J52L14j25l34J17L47j47l37
$$ 220 -24 -206 121 230 -176 -212 232 168 -256 -90 255 91 -238 -86 228 103 -231 -114 233 86 -251
5784b51J88L42k66k87L46J70l74m6L36l8k75O6K58m5k41J8K73ml87P4M40j90m32
$$ -251 -63 279 13 -274 72 242 -132 -178 158 120 -155 -89 169 124 -117 -99 174 170 -217 -143 297 107 -325
5807c25L04L48l23k88L46J40k33j22J49J77j80j95K21K16l47j36M57l5m26J39
$$ -325 -21 327 4 -284 62 202 -31 -153 -4 173 -7 -202 19 235 -112 -248 209 174 -252 -113
5827a13L94k42k83K20K50k01k26J59K49j28l30J72L83k64l49L53K50l97j11L64
$$ -113 281 39 -244 -24 226 25 -201 -42 207 79 -251 -79 304 40 -309 44 294 -103 -214 150
5847A50J0l08N7K25n3j51l4K16K8k71j9L95j30m38K76L89l78l00M17J62l60j05
$$ 150 160 -148 -91 134 81 -70 -104 112 140 -131 -150 245 115 -323 -47 342 -36 -336 81 243 -117 -222
5869b22K78R5j71j60J67K49k60k25L49J19l97L9M02j79l25K62K16k62j47J86J71
$$ -222 56 151 -20 -180 -13 236 -24 -249 100 219 -178 -139 263 84 -241 21 237 -25 -172 14 185
5890A85j67k07J33L05k08l57L38K97m01j96M17Q4m10O2K71p0j84J9J49M3k06l6
$$ 185 18 -189 -56 249 41 -316 22 319 -82 -278 139 223 -187 -125 146 76 -108 -89 60 103 -103 -139
5912a39L04k4l84J64L69k95l13M29J45l94p8L60L0k26r1J82J78k15k48L10K08
$$ -139 165 141 -243 -79 290 -5 -318 111 256 -138 -216 144 174 -52 -143 39 217 2 -246 64 272
5933B72l95j07M52q2l59J85K51k69j29K20R6j36j44J14K05j66k70K81K62l62k33
$$ 272 -123 -230 222 140 -219 -34 217 -52 -181 39 135 -1 -145 -31 174 8 -262 19 281 -81 -314
5954c14M64J10m63LM27j17k74O5K13k5j91j2K29M2l14N0L56j98l21L08K43l72
$$ -314 150 260 -203 -200 227 110 -164 -99 114 89 -102 -114 115 157 -157 -107 249 51 -270 38 281 -91
5976i1j39M12j8l15RK47J7j88j59K74K09l99j23M49Om62J46L74k20k62K33J20
$$ -91 -230 182 164 -151 -142 105 122 -66 -225 49 258 -141 -264 185 191 -271 -125 249 29 -233 0 120
5998A20j71o8J49Q7r7j82J80K18k81k16M08J35n01L1M53j25l16P7K73r4k17K2
$$ 120 -51 -119 30 117 20 -162 18 236 -45 -261 147 282 -219 -188 265 140 -176 -99 174 80 -137 -115
6020a15K44Rk87K8K92n5l86K30K94l13j71L43P0l67M7K60k3k28%K05Q4k75j16
$$ -115 129 138 -149 -121 171 116 -270 -40 254 -59 -230 113 183 -184 -137 123 100 -128 -128 77 161 -114 -230
6043b30M14K8m52Q2M59k27l16K55K04k26j41J68J04j05j27R5J86j83k10L19J33
$$ -230 184 212 -240 -158 301 74 -242 13 217 -9 -150 18 122 17 -110 -15 171 -12 -222 97 230
6064B30l95k9M03p0l96J49L19j55k53J04K37n5k64O3K97q0l54J83L00k11k75L32
$$ 230 -165 -194 209 139 -257 -108 211 56 -197 -93 144 89 -175 -112 185 105 -249 -66 234 23 -252 80
6086H0J35l27j8K74l4k43O9J91j4k26k8L05K0l82N7M17j66l98K66K78k62k01K19
$$ 80 215 -112 -130 144 110 -133 -64 127 113 -113 -141 164 184 -198 -141 276 110 -288 -22 256 -6 -207 12
6109A2J40j78j32J38J56j28k08K10J91l09r0L50k7l38J20L10j64k56J56K28j27
$$ 12 152 -26 -158 -20 136 8 -200 10 201 -108 -198 152 125 -213 -93 217 53 -203 -47 181 54
6130E4k38J33K60j35k91J61L03k41k58K98J82k87j13K84L9k77M2J85k0k11J7K40
$$ 54 -184 -51 209 74 -217 -56 247 6 -252 46 228 -59 -172 112 151 -126 -84 101 81 -130 -113 127
6152A27k8k64O2L15j56l16K18K92k75k42L07J66k59j55K16J55j78j33J92J67k57
$$ 127 99 -165 -103 212 56 -260 -42 250 -25 -267 40 206 -53 -208 8 163 -15 -148 44 211 -46
6173d6j05K91K2k98J7L12j15k59J72J97j82j79J77K02j70k49K12K28k48k17K65
$$ -46 -151 140 162 -136 -119 193 78 -181 -9 188 6 -173 4 206 36 -213 -1 227 -21 -238 27
6194B7J98l02j65L14J07k95l3K50Ok19J6K06l4k11L4K57j05k43J81K46k53j91
$$ 27 225 -77 -242 72 179 -116 -149 101 107 -112 -96 110 76 -135 -101 156 51 -192 -11 235 -18 -209
6216b09K53J91k79j45K52J48k72j41K91J22k84j21K96P9l05l3K99m1k24M4K02
$$ -209 44 235 -44 -189 63 211 -61 -202 89 211 -73 -194 102 181 -124 -157 142 101 -123 -79 123
6237A23j07j84J36K01j99j62K32J63k68j57K67J49k84j04K90J19l19j10L28P5
$$ 123 16 -168 -32 169 -30 -192 40 203 -65 -222 45 194 -90 -194 96 215 -104 -214 114 189
6257A89l03l9L06k5k70L5K68q0k30J32J76j41j79J86J59k20j49K65J10l07r0L17
$$ 189 -114 -153 153 128 -142 -107 161 81 -149 -17 159 18 -161 25 184 -36 -185 80 190 -117 -207 110
6279A10O8l28n9L44K2l15L1K61l6k31K9K40n5k30Q5K31j46k06K09J56k37j17K72
$$ 110 178 -150 -209 135 157 -158 -127 134 98 -133 -104 136 81 -149 -64 167 21 -185 24 180 -57 -174 98
6302I8M8k53k7K41N7k78m8K91M7l26k8L58l5l22P7K78j32k30J29K10j55j19J18
$$ 98 146 -107 -134 107 164 -114 -162 129 176 -150 -178 180 145 -177 -100 178 46 -184 -55 155 0 -119 -1
6325aJ23j34j63J93J32k39r2L10M1l25j6L45m0l08O6K83p2k55O6K16j6k48M3K88
$$ -1 122 -12 -175 18 150 -89 -181 129 170 -155 -171 174 134 -174 -108 175 103 -152 -86 130 114 -134 -91 197
6349A97j33k34J64K21k19j66K62N7k69LK32qk17J4K09J3k59m0L43l4l90J12L76
$$ 197 64 -170 -6 215 -4 -170 92 149 -120 -117 115 107 -110 -96 113 126 -133 -173 170 136 -254 -142 234
6372B34j62l02J92K11j99j24J32J38j22j14J25J27j55j48K34J03l07%L35p1l14
$$ 234 72 -230 -38 173 -26 -150 -18 120 -2 -116 9 136 -19 -167 67 170 -137 -137 198 127 -187
6393a87J20K66j30k36J19K11r7k21M9K69p5k98J33L06k21k25K43J28k43j5K02
$$ -187 -67 199 69 -167 -48 163 66 -155 -106 163 88 -210 -77 229 8 -217 26 154 -89 -104 98
6414I8j8j81K9J60j0j40p2K58J3l24N9L68j60l34K43K51k43j68J97J25j56j13
$$ 98 80 -101 -72 88 78 -62 -134 124 137 -187 -128 240 80 -254 -11 240 -3 -171 26 151 -5 -118
6436a18Q2J76j15j87J66J80k63r1L03ml15R5K68j65k01J63J62j30j59P5K33r4
$$ -118 -36 140 25 -162 4 184 -79 -170 133 129 -186 -91 177 12 -189 -26 136 6 -153 -78 155 61
6458F1k40J30K88k15k78K85J96l14o9K72Pk21M6J17j0j07k0J51M3k23nL10j29
$$ 61 -179 -49 239 24 -254 31 227 -87 -156 116 123 -98 -52 65 55 -52 -72 79 122 -101 -106 204 75
6481G5l26K09L00k85k27K99J31k44r2J55J21j15j90J55K22k14k01L17P4l18K9
$$ 75 -251 -42 258 -27 -254 45 176 -68 -160 -5 116 1 -189 -34 188 -26 -227 90 164 -154 -125
6502a25L20j45k30J80J47j72r5J25J12q7k02J30K47j79k62K64K32l41j23L29M5
$$ -125 195 50 -180 0 147 -25 -120 5 117 30 -172 -42 205 26 -236 28 260 -81 -204 125 170
6523A70k85J4J86l1r3m2J22M9j73o9K66k1k95J46K66k41k09L25J09l06o2K42M4
$$ 170 -115 -101 85 54 -39 -81 41 90 -83 -152 114 93 -202 -56 210 -31 -240 85 194 -112 -174 68 112
6546A12j65q5J30J81k00j93L02J41l72k5L31o4k46J35J93j59j30J19Q4o4j13N4
$$ 112 -53 -138 -8 173 -27 -220 82 223 -149 -174 157 93 -153 -18 175 16 -114 5 89 25 -88 -34
6568c4J68j27k20K37J96k91j66L56N7l43K6K79n2k00K5J38M3j52n3K03J9k46M3
$$ -34 134 7 -213 24 220 -71 -237 119 176 -167 -141 138 86 -114 -89 49 92 -60 -113 90 109 -137 -94
6591i4K87j46k38K39J36k79o4K78k0j89mJ60Q1j90j25K37J47l44o5L49k7l24R1
$$ -94 193 47 -191 48 184 -95 -159 119 99 -90 -94 66 147 -43 -168 69 216 -128 -193 156 129 -195 -104
6614a04K80j37j97J43J19j11j02P5J24o7j66J33J75k20j60L41P1l68K6L40j05
$$ -104 176 39 -158 -15 104 -7 -109 -34 90 23 -143 -10 165 -55 -215 126 197 -171 -145 195 90
6635I0k33Q4J70l1j62kJ88M5k55j4L02q7k77J87J67k25j08K59Ok02J5J66oj50
$$ 90 -143 -59 111 80 -82 -84 104 149 -106 -120 182 95 -182 5 172 -53 -161 98 104 -98 -83 83 77 -73
6659g3l9J71Q3k50p7L38ql51J10K72j31k42J66J64j21j11P6J04m2j45R0J60j57
$$ -73 -112 59 142 -108 -185 153 145 -206 -96 176 45 -197 -31 133 12 -99 -23 81 39 -106 -16 144 -13
6682a3j31K22Q1k79j0L00o3k73Q5K49j19j87N2J94l8k06M2K24m2k79J18K47j88
$$ -13 -144 78 159 -120 -130 170 107 -166 -81 168 49 -138 -86 108 70 -136 -94 130 88 -191 -73 174 -14
6705a4j67K22P7k00l2J91j4j40qJ59M5k11j6K40j8k89P7L09j53k51J68J94j48
$$ -14 -181 41 118 -82 -114 77 63 -77 -85 74 119 -92 -108 132 114 -175 -98 211 58 -193 -25 169 21
6728B1j62J42J27r1j68J22J42j34j42J79R6j88q9K31mk28P3K23j11k11J19K04
$$ 21 -141 1 128 37 -131 -9 133 -1 -143 36 132 -56 -145 86 82 -146 -73 150 39 -172 -53 151
6750A51j24k04J21K17j21k11J38K29j77k00J99J32j96r0J90N7j72k4J58K4j78
$$ 151 27 -177 -56 161 40 -171 -33 196 19 -181 18 150 -46 -136 54 111 -61 -85 73 97 -81
6771h1PJ80qk22N2K36j06k48J66K06j93j62J53J75j98j08J49J46j61j46J87J12
$$ -81 -74 106 98 -124 -72 164 58 -190 -24 182 -11 -173 -20 155 -43 -151 -2 144 -17 -163 24 136
6793A36j87r8K07M2j93JJ87m6j71J06J55j10j53R8J58j12j74J51K01k15j53K04
$$ 136 -51 -149 58 100 -93 -92 95 49 -122 -16 139 29 -124 -26 132 20 -154 -3 198 -17 -170 34
6815C4J48k12j25K07P7j64r7J95J5j41l8J63Oj59K0J71p1j67J28J45j37j45J52
$$ 34 182 -30 -155 52 129 -35 -132 63 78 -63 -101 62 68 -91 -71 100 29 -138 -10 135 -2 -147 5
6838EJ47j76j50K22J17k14j12K06J04k02q5K36J2j71l0J73j2j54L2J35m7j48O0
$$ 5 152 -24 -174 48 165 -49 -161 45 149 -53 -138 98 110 -61 -91 82 70 -84 -52 83 36 -112 -52
6861e2J77j39j49J96R5j75j03J97R7j95j00K00R0k01q4J94N3j85m4K08j1j62N2
$$ -52 125 -14 -163 33 128 -47 -150 47 144 -51 -151 49 139 -62 -146 48 101 -84 -128 80 69 -93 -41
6884d1J36l9j55R8J04j02j03J20Q2j04j19J53J39k10j27K50N7k32l7K28Rk09j7
$$ -41 95 56 -99 -1 103 1 -102 18 100 -4 -123 30 169 -41 -168 82 139 -93 -130 98 107 -102 -119
6907a19J92J6j68j7J64lj78M8J68r9j68J81J07j93l3J66L2j68k4J43O7j64r9K41
$$ -119 73 89 -79 -96 68 65 -113 -65 103 4 -164 17 124 -69 -102 64 96 -72 -96 47 114 -50 -149 92
6931I2L7k16m2K52k1k30M9K05m8j94Q5J25p5j29P7J24r7r4J10J04j86o7K46K1
$$ 92 129 -87 -129 123 102 -128 -79 126 78 -116 -31 94 19 -110 -33 91 -6 -100 10 114 -72 -139 107 128
6955A28k53MK25ok47M4J94j5j53j4J69K5j93QJ91m6j85J05J73j74p7J65J1j46
$$ 128 -125 -121 104 98 -149 -105 89 74 -79 -93 76 101 -92 -84 107 61 -124 -19 154 -20 -97 68 79 -67
6979f7J0J15K6j31k3J50L1k15m1K83k5k81P9K53j28k01J48J29j11r0N7R9m3j25
$$ -67 -57 58 84 -47 -70 80 111 -104 -145 138 113 -168 -89 164 36 -165 -17 112 1 -89 -32 67 24 -101
7003a01O4J24j01j04J57P1k16J6K23n1k20Q8J87j21j19P4J32l7j80L4J98n7j98
$$ -101 -37 87 -14 -118 39 110 -106 -90 133 82 -138 -50 137 16 -103 -29 103 66 -114 -80 118 61 -137
7026a37Q1K17j68j35J71P2j80oJ42k2j00K1P3L7j46j7J88Rk49N3K60j34j97J44
$$ -137 -56 161 -7 -142 29 101 -79 -85 57 35 -65 -44 29 66 -80 -97 91 100 -149 -96 164 30 -167 -23
7050b3J83j90p6J31P0p4j28P2J44q1j27J21J12j92o4K28j9k10Q8J79j12j41J19
$$ -23 160 -30 -106 25 95 21 -107 -35 109 28 -99 22 134 -58 -122 106 87 -123 -35 144 32 -109 10
7073A0R1j10q4L0J66p5j84J14K25j84j70J91J06j93m6J78j5j02J8N8J6o0n8J17
$$ 10 101 -9 -93 -63 103 28 -156 -42 183 -1 -171 20 126 -67 -113 65 50 -52 -34 24 40 -20 -78 39
7097C9M5j69J7K42j14k37K04J60k24j13K22K5j36l9J02P8j05j17J23J47j84j13
$$ 39 84 -85 -68 174 60 -177 27 187 -37 -150 72 97 -39 -78 24 102 -3 -120 3 150 -34 -147
7119a47K19K2k14O4J58q0j20J29N1j14o5Q6R3n3j30Q9J58j17k04K24J30k33o8
$$ -147 72 94 -120 -56 102 22 -98 31 82 -32 -97 -11 82 29 -101 -12 146 29 -175 49 179 -54 -122
7142a22K05Pj57NJ05J0q5k1R3L3j34j7J70m0j96J41J71k04j16K19M1k07JJ42J7
$$ -122 83 90 -67 -62 43 53 -32 -53 40 73 -61 -78 92 52 -144 -3 168 -36 -152 67 108 -99 -98 44 61
7167F1j13o3J22J12j67j03J86J00k37%K20n1j71R5J04q7n4P6L3n2o5O7R5j04j67
$$ 61 -52 -115 7 119 -48 -151 35 135 -102 -102 118 67 -104 -9 95 8 -46 30 63 11 -54 13 108 4 -163
7192a63K07J11k23q3K53Mk11L5J42j6j21QR4L0j42k0J78j2k13Q9J86j50j22J84
$$ -163 44 155 -68 -151 102 106 -105 -70 72 56 -65 -57 37 67 -75 -95 83 71 -142 -53 133 -17 -139 45
7216D5M5j88J3J72rj42jJ03K5p3j03K01M0k22qK31l6k08O5J62r7j01R3N5m6o4
$$ 45 90 -98 -85 87 78 -64 -65 38 63 -10 -113 88 128 -94 -102 129 93 -115 -50 112 15 -86 7 62 16 -48
7242d8M1P8p1r7J24O9j49q0K24Ok26N0J86p4j44N4J25Jj36LJ33j1j47L2J68q2
$$ -48 -7 71 0 -97 27 96 -53 -133 91 97 -129 -79 107 33 -111 -57 68 69 -67 -64 69 58 -89 -57 111 29
7268B9j47J40P6j47j3J47k2j40M5J01j4j31k4J65K6j96J3K30o9k19Q5J72j04j29
$$ 29 -118 22 98 -49 -62 85 63 -77 -32 69 55 -76 -100 65 91 -105 -92 138 69 -150 -65 107 3 -126
7292a26J27O7q2o0P4M7n7o0P7Q4j35m7J55K9j84K5K00p0j72R3J57j00j41P5J19
$$ -126 1 68 -14 -74 0 47 -10 -70 7 91 -44 -91 64 93 -91 -66 134 64 -108 -15 142 42 -99 -24 95
7317I5l7j45L7J67q2j46J11J33j57p2J16M7j33nJ36k7j05K1J12j1j46M7J61q4
$$ 95 58 -87 -50 117 35 -111 0 133 -24 -96 20 67 -66 -71 65 38 -67 -46 66 55 -91 -44 117 33
7341C3j83J17J78j20j43J31J13j05j33J21Q1r3n1O6Q3j12m0J24J3j44oJ74n4j57
$$ 33 -150 -33 145 25 -118 13 126 21 -112 9 90 -3 -54 12 95 -17 -57 67 80 -64 -70 104 50 -107
7365a07M5J81j19j08R3J20j03j21P6J42p9j67J44J22j33j00J49N0j28l5J35%j23
$$ -107 -62 119 0 -108 -15 105 2 -119 -43 99 20 -147 -3 119 -14 -114 35 85 -43 -78 57 57 -66
7388f6PJ23k8q8KJ33n4j31Q6J69j53j23J43J28j77r7J55J00j32j08J47N0j17p4
$$ -66 -59 64 36 -52 -50 83 29 -102 -16 153 0 -123 20 148 -29 -126 29 129 -3 -111 36 86 -31 -105
7412a05J39N1j50k0J42j8j31N3J11o1j12O8J28j36o2J20J05j36r9J39Q4j58n1
$$ -105 34 85 -65 -85 57 39 -92 -39 72 11 -101 -33 95 -41 -103 17 122 -14 -113 26 110 -48 -99
7435i9J38Q9j61p3J75J7j57NJ35pj28K0J23k2j33N7J26j26p7Q9J12j38q6J39J11
$$ -99 39 128 -33 -106 69 86 -71 -66 69 62 -66 -46 77 55 -78 -21 105 -21 -98 -9 103 -35 -121 18 129
7460A29k00o2J81O6j79m1J74L9j81J0J43j4j30K1J00k0j08O7J01p9j16J23Q9j49
$$ 129 -71 -133 48 114 -65 -106 68 107 -74 -64 79 65 -65 -44 56 36 -72 -5 96 17 -99 24 113 -36
7484c6o6J77L6j86m5J89Rj60lJ38M7j88k4J73Rj55K8J37p2q4N8Q4p9q3J19M1q7
$$ -36 -102 75 111 -75 -120 69 78 -82 -85 53 100 -88 -112 61 70 -85 -57 80 8 -76 -18 66 -13 -96 23 64 -23
7511b3n6J09O8j37n9J61M6j87j1J97lk13O1J50m1j45M2J03l2j18N6J14m0j44R6
$$ -23 -79 30 98 -39 -98 63 109 -78 -89 108 105 -108 -47 103 62 -83 -41 62 30 -88 -32 82 42 -102 -6
7536fJ00j28q8J77K3j65kJ58j2j14j6J52j2j51rJ87pk02M8J63n5j53Q5J43r7j03
$$ -6 94 -34 -122 55 78 -87 -89 69 57 -57 -73 79 67 -84 -93 94 87 -115 -67 96 41 -112 -27 116 19 -84
7562h4J11N9j01k3N4L9q8m8J29L2j61J3J74j7k16N7J95r4j53R6J02n6j25M3J47
$$ -84 27 86 -15 -38 16 55 -33 -81 48 80 -81 -68 106 89 -127 -70 125 31 -122 -26 76 20 -105 -62 85
7587H5o3j26Q2J31j29j19J77O5j73nJ62l4j17K9J07k0j07RJ51k1k02N6J63n8j81
$$ 85 22 -104 -22 109 -20 -139 38 103 -70 -75 87 53 -64 -35 72 52 -55 -46 105 84 -118 -62 101 43 -138
7612a38J09J81j63j12J55N9j22k9O6N2p4p0J02M2j19l3J81j4j87N8K03j52j21
$$ -138 -29 152 -11 -123 32 91 -31 -60 6 58 -16 -86 16 58 -61 -94 87 73 -114 -56 147 -5 -126
7635a26J18J21r8j07P5J19o4j35M9J76j21j28J54R6j78n8J82j0j42L5J03m8p3
$$ -126 -8 113 15 -92 -17 102 38 -97 -48 128 7 -121 33 129 -49 -107 75 65 -77 -42 61 13 -60
7658f0L2R4k3j32N1J63r0j89J24K02j75j59J80Q9j54l2R0N9j05n0R5Q0j16n8J68
$$ -60 -28 66 43 -89 -38 125 35 -154 -30 172 -3 -162 18 107 -47 -79 11 70 -35 -85 10 90 -26 -84 84
7683H4J1j72L2J79r8j73J35J28j43q5J20M8n6j07Q6J64j50j31J32J36j95r6K30
$$ 84 95 -77 -45 134 36 -137 -2 126 -17 -102 18 66 10 -97 -11 153 3 -128 4 140 -55 -151 79
7706G9J0j67J3J22k6r5NR0J2j16L1J32n8j55J04J51j39j54K00R0k00m6J87L2j38
$$ 79 89 -78 -65 57 31 -64 -59 31 43 -73 -42 90 32 -123 -19 132 -7 -161 39 129 -71 -117 70 102 -36
7731c6m8J12P6j29o4J52L5j87J6J70o1j61J02J32j37j05J62N2j39l2R6P3j07j15
$$ -36 -84 28 104 -25 -89 63 98 -89 -73 97 36 -125 -23 109 -28 -133 29 81 -58 -90 6 79 -28 -143
7755a43J61J29k23q0K36J3j94K2J73l8j32L1J09l0q9RJ12k1j39P7J44j22j46J76
$$ -143 18 147 -76 -156 80 93 -101 -79 94 56 -76 -45 64 34 -55 -46 66 45 -94 -17 127 5 -141 35
7779C5J04k08l8K01j0j71j7J56L6j31o8J54P7j95k6J88ok08O0J96j26j21J39N4
$$ 35 139 -69 -107 94 84 -87 -104 52 88 -43 -111 43 120 -75 -101 87 81 -127 -67 129 3 -118 21 75
7803G5r5m3P5O1j01m3J00Q7j65p6K26L6k63M2K02m8k02P2J61o1j12J0J47l2j63
$$ 75 -20 -63 12 73 -28 -71 29 116 -49 -125 101 137 -126 -84 118 70 -132 -60 101 40 -72 -62 85 53 -110
7828a10M8J81j14j32J27J13j88n7J98J4j81J4J72l1j40KJ74mj75j7K43o5j88N7
$$ -110 -62 119 5 -127 0 113 -75 -132 66 80 -101 -87 85 54 -86 -84 90 86 -89 -106 137 72 -116 -59
7852e9J91q4j72J13J05j11p9J21L9p1o2R9Q5j52n3J65J5k07nK51q3j90Q3J98j11
$$ -59 132 48 -124 -11 94 -17 -96 25 64 -7 -69 30 115 -37 -90 75 90 -117 -122 129 46 -144 -61 137 26
7877B6j41P2J30m3j59O7J46n3j54J13J27j63q1J69M0j85RJ91n3j25J7J48l9j39
$$ 26 -115 -43 87 44 -115 -48 98 45 -109 4 131 -32 -113 56 96 -89 -80 111 58 -67 -50 98 59 -80
7901h0QJ91j6k40R1J80j08j89J61J30j39r9J21P6j06q7J37N8j50j8J43K2j69j7
$$ -80 -72 119 103 -137 -46 134 26 -163 -2 128 -11 -110 11 87 -19 -106 31 89 -61 -79 64 86 -83 -100
7925a00J86l8j84Q4J89p9k00J14J36q6j17R1J03q8j46J33J27j32j13J67O4j63
$$ -100 86 48 -136 -52 137 58 -142 -28 108 22 -95 -4 99 11 -135 -2 125 -7 -120 47 111 -52
7947e2l4J60Qj81L4J47m2j24J3J68n9j63P3J80r3j65J18J57j62j34J66J10j34
$$ -52 -86 74 82 -99 -65 82 40 -84 -71 97 38 -125 -52 128 35 -130 -12 145 -17 -151 15 125 -9
7970ir5J33P1j20o8J25Q4j68j9J66m4j31J8J67p2j52R9J44j22j10R6J38j26j40
$$ -9 -104 29 100 -20 -88 37 121 -47 -66 100 56 -75 -57 110 38 -114 -15 129 7 -103 -7 131 5 -135
7994a35J39J17j41j30J75P4j50p1J71K0j42j9J50nj39L4J37m7j40O3J31r7j11
$$ -135 4 121 -20 -150 25 99 -51 -122 49 69 -73 -92 58 53 -86 -52 85 38 -102 -39 92 -5 -116
8017a16J31J13j27j27J46J18j52j10J88Q2k02l7J48M3j65j4J52j5j15nJ45m4j56
$$ -116 15 128 1 -126 20 138 -14 -124 64 146 -56 -93 55 98 -67 -81 71 56 -59 -64 81 37 -119
8040a19P8J56j08j18J06J24j52j16J62J02j75p8J74Q5j93n6J76O3j55n9J76J2
$$ -119 -41 115 7 -111 -5 119 -33 -149 13 115 -60 -138 36 121 -72 -128 48 111 -44 -103 73 85
8062H5j67OJ94n8j63O6J47j06r9J20J10j67o9J33P9j23j28J92P8j79p7K00L1j94
$$ 85 -82 -76 118 60 -103 -37 110 4 -95 25 135 -32 -101 32 111 -12 -140 52 130 -49 -126 74 105 -89
8086h9j2J66J2j69RJ74l2j58K9J66p2j23R1J14j13j22J80Q6j88m6J70M3j84k7
$$ -89 -101 65 77 -92 -83 91 59 -99 -70 96 24 -99 -8 106 -7 -129 51 137 -51 -97 73 116 -68 -95
8110i5J83J7j72j4J81rj78j6K03k5j85O3J50j10j17J26Q1r4q4J04P2j00q7J45
$$ -95 88 105 -67 -81 100 91 -87 -103 100 75 -110 -47 103 -7 -124 2 83 -11 -95 9 81 -19 -106 39
8134C9P0j83p8K42K2k24K1K35p2j83O8J69n7j42J2J50l6j65P7J43r8j40J24J28
$$ 39 109 -74 -152 90 112 -112 -91 144 72 -111 -43 126 69 -73 -61 89 53 -112 -35 108 10 -130 -6 122
8158A22j76p0J81K7j69KJ61Lj56j1J49kj66K6J87k6k21N0K19r6j76J43J12j18
$$ 122 -54 -124 57 84 -85 -83 78 81 -75 -86 63 61 -105 -79 108 82 -139 -89 130 34 -142 1 113 -5
8182er7J26M4q2p1J10M6j00q5
$$ -5 -102 24 68 -14 -85 25 71 -29 -114
8191a14
$$ Imaginary data points
##PAGE= N=2
##DATA TABLE= (X++(I..I)), XYDATA
0@%%%%%%%%%%%Kj0J6j6J6k4L2m0M8n6O6p5R0j10J33j53J77k05K34k69L06l47L96
$$ 0 0 0 0 0 0 0 0 0 0 0 0 2 -8 8 -8 8 -16 16 -24 24 -32 34 -41 49 -61 72 -81 96 -109 125 -144 162 -185 211
34B11m49N05n69O39p15P98q88R90j100J219j350J494j650J818k004K207k432K680
$$ 211 -238 267 -302 337 -378 420 -468 522 -578 641 -709 785 -865 953 -1051 1156 -1276 1404
52A404k951L253l591L971m398M887n451O107o885P824q983J0456j2401J5101j9127
$$ 1404 -1547 1706 -1885 2086 -2312 2575 -2876 3231 -3654 4170 -4813 5643 -6758 8343 -10784
67a0784K5834l9656J14128j95624o6060L69496j84201j48159J90854p083j04297
$$ -10784 15050 -24606 89522 -106102 -172162 197334 13133 -135026 55828 48745 -55552
78e5552R8889p4473j8611J55578j03765j35558K14760O989k25610J09560J79968
$$ -55552 43337 -31136 -49747 105831 2066 -133492 81268 88257 -137353 -27793 152175
89A52175j78894r8002J78163L7748j60068P230J31332k8070j01495L2880N4755
$$ 152175 -26719 -124721 53442 91190 -68878 -61648 69684 41614 -59881 -27001 27754
100B7754R42j7260o2205K2569J23343r7256j29721K00760N6568k59520P3601K14573
$$ 27754 28696 11436 -50769 -28200 95143 -2113 -131834 68926 125494 -134026 -60425 154148
112A54148j83169q3547K01168n1836j16397R8895o225l1926P3489r1294l1771
$$ 154148 -29021 -112568 88600 36764 -79633 19262 13037 -18889 54600 -36694 -68465
123f8465J76109q9704j64556K03785P1723k35980L3675J80118q6189r1083P1191
$$ -68465 107644 17940 -146616 57169 128892 -107088 -73413 106705 20516 -70567 624
134F24L4674k3387l5241j1030O6690J1081q8225J2086Q4800l4807p2482M7372
$$ 624 35298 11911 -23330 -34360 32330 43411 -44814 -32728 52072 17265 -55217 -7845
146g845P0674o1098p8106Q8371P2401j22981l6695J40806j6376j22444N0894P5018
$$ -7845 62829 1731 -76375 11996 84397 -38584 -75279 65527 49151 -73293 -22399 52619
158E2619m0260l3189o866L2325N1364p5362n3914J28893P336j48935N7684J17234
$$ 52619 12359 -20830 -27696 4629 55993 -19369 -73283 55610 62946 -85989 -28305 88929
170H8929r8482n5665R5182P531o3048kL6093K3666l8452m6449O5558M3924r2636
$$ 88929 -9553 -65218 29964 37495 -25553 -25555 10538 34204 -4248 -50697 14861 58785 -33851
183c3851j9552R9897l557q9633P561P9962J920q5192l412J00448j6708j05128
$$ -33851 -53403 46494 42937 -46696 -39135 40827 42747 -42445 -45857 54591 37883 -67245
195f7245M9750Q4428p1617m5561O5162J3589l6831j0029J3092L3929j7532o1666
$$ -67245 -17495 66933 -4684 -50245 14917 28506 -8325 -18354 -5262 28667 11135 -50531
207e0531N1679O5709r4434l7663J18664o255j12045L9756Q4083m6979n6449L2075
$$ -50531 1148 66857 -27577 -65240 53424 47169 -64876 -25120 58963 11984 -44465 -12390
219a2390M5018j2612n0757M001O3363r224p1666K2159P1906l6606o6251N1524
$$ -12390 32628 20016 -30741 -26740 36623 27399 -44267 -22108 49798 13192 -53059 -1535
231a535N6218o7691l9540Q1998J4772q6104J2458P4028k9886n0922K6609L2808
$$ -1535 54683 -13008 -52548 29450 44222 -41882 -29424 44604 14718 -36204 -9595 23213
243B3213m615l5712j9200O2124K3565r6622Q80J14872m3353j01274P9311O1001
$$ 23213 18598 -17114 -36314 25810 49375 -47247 -46367 68505 25152 -76122 3189 64190
255F4190q7529j6279O5578q648l0667L769P418K1127j0847m4635L8523M8458p3721
$$ 64190 -23339 -39618 25960 17312 -13355 -9586 -2168 18959 8112 -36523 2000 50458 -23263
268b3263k8314R7432o232r9733L8942Q2829n7065n7459N6680L5646m2341k6030
$$ -23263 -51577 45855 39623 -60110 -21168 61661 4596 -52863 3817 39463 -2878 -28908
280b8908K3438L0617j0242m5277J0543O1305k6329o7842N2528N7183p7654k9231
$$ -28908 -5470 25147 14905 -30372 -19829 41476 15147 -52695 -167 57016 -20638 -49869
292d9869Q9222o338q0502L4529N6241m2934l0753L0070J9677p211l0582q291N6977
$$ -49869 39353 33015 -47487 -12958 43283 349 -30404 -334 19343 12132 -18450 -26741 30236
305C0236L594q2495K1206R0576n3621p5251P6193M3986p8112j2619O0953m471
$$ 30236 33830 -48665 -27459 63117 9496 -65755 10438 54424 -23688 -36307 24646 20175
317B0175l6941L064K0836J0155k0994k2598L6095K3988n6756j1062P2517j1488
$$ 20175 -16766 -13702 7134 17289 -3705 -26303 9792 33780 -22976 -34038 38479 26991
329B6991p6533L5086O8214n1774n2220N7217L5365n1866k4097L9883K1946k8341
$$ 26991 -49542 -14456 53758 1984 -50236 6981 42346 -9520 -33617 6266 28212 -129
341a29k8570K3822L8812l0154m5008M5626M0087o3001k2166P3041l529o9723K7003
$$ -129 -28699 -4877 33935 3781 -41227 4399 44486 -18515 -40681 32360 28831 -40892 -13889
354a3889N4673l8821l6079L6528K4582k5417k6055J5871L8218j6147n2419K7746
$$ -13889 40784 1963 -34116 2412 26994 1577 -24478 -8607 29611 13464 -38955 -11209
366a1209N9197m5081n4120N9570L9282o5460k1140O1699N769n1836L300M0714
$$ -11209 47988 2907 -51213 8357 47639 -17821 -38961 22738 28507 -23329 -20029 20685
378B0685o169l2386M563K9603j556l3432J101M2816o811n3601K0708N9588m0001
$$ 20685 14516 -17870 -13307 16296 14740 -18692 -17591 25225 18414 -35187 -14479 45109 5108
391E108n5261N7648M0330o5393k0787N9443O512m3870m645K8792J4480k4476k7242
$$ 5108 -50153 7495 47825 -17568 -38355 21088 27600 -16270 -20915 7877 22357 -2119 -29361
404b9361L3785L1512n0759k1329O4289n44o5938K4416N4707m0472l7164M4495
$$ -29361 4424 35936 -14823 -36152 28137 27593 -38345 -13929 40778 306 -36858 7637
416G637K2224l9026j5694L0687J8348k5477k6573K6825L5486l4941m0039M7586
$$ 7637 29861 -9165 -24859 5828 24176 -1301 -27874 -1049 34437 -504 -40543 7043
428G043L6720o0356k4072O7367M674o3736J4468M9005k5174k9367K2696J5229
$$ 7043 43763 -16593 -40665 26702 31376 -32360 -17892 31113 5939 -23428 -732 14497
440A4497j0698j5085l08K8715q82m6639J8010N5525m3869m7509O4771K6082o9771
$$ 14497 3799 -11286 -11594 17121 16239 -30400 -12390 43135 -734 -48243 16528 42610 -27161
453b7161l292N8301q439l9737M998K6930P539k6839j7953L7147J7954m9348o822
$$ -27161 -30453 27848 19409 -20328 -15330 11600 19139 -7700 -25653 11494 29448 -19900 -26722
466b6722N5487j0208n2697K6298M2950l7279l0393M1922J8578m1058j0271L6248
$$ -26722 28765 18557 -34140 -7842 35108 -2171 -32564 9358 27936 -13122 -23393 12855
478A2855P719l0592j1863K8582K0346l4022k6781M6568K4223n9831j0299O4891
$$ 12855 20574 -10018 -21881 6701 27047 -6975 -33756 12812 37035 -22796 -33095 31796
490C1796r341n6522K4320L8298k6792k0904J7842J4593o954k1616N185L4035j6712
$$ 31796 22455 -34067 -9747 28551 1759 -19145 -1303 13290 6336 -15280 -10095 23940 7228
503G228m0128L5512L3520n0789j7688N4683K700m8209L290L9275j41l5584n381
$$ 7228 -32900 2612 36132 -14657 -32345 22338 25038 -23171 -19881 19394 19253 -16331 -21712
516b1712L9041O030m4876l5M6998q665m3161J5249L6237j8507l0525K1016K7391
$$ -21712 17329 23359 -21517 -21552 25446 16781 -26380 -11131 25106 6599 -23926 -2910 24481
529B4481k5365k4646L1003J9654l5120j3022L6051Q082l5755p137L7682Q198m3007
$$ 24481 -884 -25530 5473 25127 -9993 -23015 13036 21118 -14637 -21774 15908 24106 -18901
542a8901o226M8494j552m8893J2007M2174j8016l2136J5604K5782q397k7265N548
$$ -18901 -25127 23367 21815 -27078 -15071 27103 9087 -23049 -7445 18337 9940 -17325 -11777
555a1777L3838j3578l7319K9911L0625m4073j4456M6493k661l6873J0181K4632
$$ -11777 22061 8483 -28836 1075 31700 -12373 -26829 19664 17003 -19870 -9689 14943
567A4943m596k1135p570L0258J4360m5569p910N5909r073n4110K5896M1739l2380
$$ 14943 10347 -10788 -18358 11900 26260 -19309 -27219 28690 19617 -34493 -8597 33142 762
580G62k6688K7239J6860j7779j4706J2797J7690j5674k0930K3164K0993l0621
$$ 762 -25926 1313 18173 394 -14312 -1515 16175 501 -20429 2735 23728 -6893
592f893j7264L6550J0288m2057j097M6735r336m7102J8661L9650k3068k6713J9488
$$ -6893 -24157 12393 22681 -19376 -20473 26262 16926 -30176 -11515 28135 5067 -21646 -2158
605b158J6847r280j8387m19L1400M95m5627J3364M8068l5119l3019N1324P546
$$ -2158 14689 5409 -12978 -13397 18003 18498 -27129 -13765 34303 -816 -33835 17489 25035
618B5035n0474J3690L3130j9105j2510Q208M917Q481j6899j7515L9923J1159n7617
$$ 25035 -25439 -11749 21381 2276 -10234 -2026 2891 11372 -5527 -23042 16881 28040 -29577
631b9577P567N8397k8068m3739L9207K4759l6767j2332K5105R796j3307j3308
$$ -29577 -22010 36387 8319 -35420 3787 28546 -8221 -20553 4552 14348 1041 -12267
643a2267Q740J7879j2822k0761K2303K1062l2812j6746M1303N949m5825J0277
$$ -12267 -3527 14352 1530 -19231 3072 24134 -8678 -25424 15879 21828 -23997 -13720
655a3720M4256k5782l5198L2030K1275k5064j0484R679J1233K694k5182k028M3065
$$ -13720 30536 4754 -30444 1586 22861 -2203 -12687 -3008 8225 10919 -14263 -16291 26774
668B6774j3308n0271L4776L8097m9291j1751M8056j2674l2391K0817J3202j0604
$$ 26774 13466 -36805 -2029 36068 -13223 -24974 23082 10408 -21983 -1166 12036 1432
680A432l693o351J0302J5287k8423q799M5596q625n0734K6259M1522l5581k5414
$$ 1432 -2261 -8612 1690 16977 -11446 -20245 25351 16726 -34008 -7749 33773 -1808 -27222
693b7222L4803J2676k8038q775K0356J1716j5391j6008J4599J7844j8287j6726
$$ -27222 7581 20257 -7781 -16556 3800 15516 125 -15883 -1284 16560 -1727 -18453
705a8453K5593J3091l3916n937L9308n453l8256J8834L0312k7901j9138K7186
$$ -18453 7140 20231 -13685 -19622 19686 14233 -24023 -5189 25123 -2778 -21916 5270
717E270J1175j7444j1561O883K0365n213l1598J5644L6505l1969k9679M2889J3408
$$ 5270 16445 -999 -12560 -5677 14688 9475 -22123 -6479 30026 -1943 -31622 11267 24675
730B4675m1324L207K9274j0886j6087P006J0870K156j6004o737K6608Q50l4480
$$ 24675 -16649 -13442 15832 4946 -11141 -4135 6735 8891 -7113 -13850 12758 13608 -20872
743b0872J2768L4688k5746k7914L1379J9137k9072j3404K3905J2538k1178j4542
$$ -20872 -8104 26584 838 -27076 4303 23440 -5632 -19036 4869 17407 -3771 -18313
755a8313K2341J5872k5215j4420K7191J0267k7747m935K7818o07k7926O155K6993
$$ -18313 4028 19900 -5315 -19735 7456 17723 -10024 -14959 12859 12252 -15674 -9519 17474
768A7474j1655k3839J6069J9151j7949j5664J7264J6033j6382j9676J8432K3167
$$ 17474 5819 -18020 -1951 17200 -749 -16413 851 16884 502 -19174 -742 22425
780B2425k4496k2126L1723J5410l5220o015L2027q54k4141J831J7344J813j6771
$$ 22425 -2071 -24197 7526 22936 -12284 -18299 13728 12874 -11267 -9436 7908 9721 -7050
793g050m926K2390K487k9312O601L1192j8408k5744K6879J6090k8240q191K3735
$$ -7050 -11976 10414 12901 -16411 -9810 21382 2974 -22770 4109 20199 -8041 -16232 7503
806G503O437j8487j0389J7527J5653k2021j7364K9000J3551l3873n835L3796k191
$$ 7503 13940 -4547 -14936 2591 18244 -3777 -21141 7859 21410 -12463 -18298 15498 13307
819A3307k9342P745K3143j0046j8026J0073J5320r648j4865J0030J6133j2266
$$ 13307 -16035 -8290 14853 4807 -13219 -3146 12174 2526 -12339 -2309 13824 1558
831A558j8028J6734J9127k3016j7703K9468J2789l3385n359L2674j534k7355M471
$$ 1558 -16470 264 19391 -3625 -21328 8140 20929 -12456 -17815 14859 13325 -14030 -9559
844i559K0517k272j6516k579J7926N331k3701k029K9085p306k9309J8555K2705
$$ -9559 10958 8686 -7830 -10409 7517 12848 -10853 -12882 16203 8897 -20412 -1857 20848
857B0848k6158j2297K6879L611k2174q52J6788M179j5455r658J9637J2438k6725
$$ 20848 -5310 -17607 9272 12883 -9291 -10143 6645 10824 -4631 -14289 5348 17786 -8939
870h939r889L2398L143l3580M646K9975j0156k3798J2211J7868j1667j4025J0354
$$ -8939 -18828 13570 16713 -16867 -12221 17754 7598 -16200 -3989 13879 2212 -11813 -1459
883a459J2471r804j2783J0969J3821j4249j4425J9353J3165k5123r234K9507L051
$$ -1459 11012 1208 -11575 -606 13215 -1034 -15459 3894 17059 -8064 -17298 12209 15260
896A5260l0463L331K7490p169k2189O883J7943l516j7258L88K0290r64k4035O147
$$ 15260 -15203 -11872 15618 8449 -13740 -6857 11086 7570 -9688 -9300 10990 10026 -14009 -7862
910g862K4932j3813k1069K0173J3696k2497o389K0911K246j8243j907J7419L258
$$ -7862 17070 3257 -17812 2361 16057 -6440 -12829 8082 10328 -7915 -9822 7597 10855
923A0855j9409l737K2868J915k5520J447K6107m734k5033P187K3382r050k1576
$$ 10855 -8554 -12291 10577 12492 -13028 -11581 14526 9792 -15241 -8054 15328 6278 -15298
936a5298J1170J9189j3474j5588J5031J1384j5034q049J4032O834j3912p351J6251
$$ -15298 -4128 15061 1587 -14001 1030 12414 -2620 -10669 3363 10197 -3715 -11066 5185
949E185P396k0718n021K5110j13k6851N951K4947r790k1035J0273J7815q576j6922
$$ 5185 12581 -8137 -13158 11952 11839 -15012 -9061 15886 6096 -14939 -4666 13149 4573 -12349
963a2349P235J7834q046j8461J0958J7139j4192j3882J6377J0128j7488o895J8466
$$ -12349 -5114 12720 4674 -13787 -2829 14310 118 -13764 2613 12741 -4747 -11642 6824
976F824M202j9978j021K1303k935k1200O463J9295p981j6993O804J6625m880j9050
$$ 6824 11026 -8952 -9973 11330 8395 -12805 -6342 12953 4972 -12021 -5217 11408 6528 -12522
990a2522N077K2457r072k3387J5325J9598k0120j2008K0342M603j6254j093J1446
$$ -12522 -7445 15012 5940 -17447 -2122 17476 -2644 -14652 5690 10293 -5961 -7054 4392
1003D392K292r939n276J3303N938j9190k231K3666m482k4129J0748K0978j3947
$$ 4392 6684 -3255 -8531 4772 10710 -8480 -10711 12955 8473 -15656 -4908 16070 2123
1016B123j6844J3781J4213j2327j3545J1452J3624j1841j3167J2741J2014j3750
$$ 2123 -14721 -940 13273 946 -12599 -1147 12477 636 -12531 210 12224 -1526
1028a526j0567J5121Q881j7364o029K0139J061k1413N180J9784j0285j5395J1583
$$ -1526 -12093 3028 11909 -5455 -11484 8655 9716 -11697 -6517 13267 2982 -12413 -830
1041h30J1266q928j0714N293J4689m941k0256R755K2650j7509j8959K3202J0455
$$ -830 10436 1508 -9206 -3913 10776 5835 -14421 -4666 17984 475 -18484 4718 15173
1054A5173k2914k309J7233j060j0614j163Q057N360j1212o570J7323K466k1736
$$ 15173 -7741 -10050 7183 6123 -4491 -5654 2403 7763 -3449 -10019 7304 9770 -11966
1067a1966N152K1642j2115j7723J5441J3097j5009j0465J3160J0357j2204j1340
$$ -11966 -6814 14828 2713 -15010 431 13528 -1481 -11946 1214 11571 -633 -11973
1079a1973J2757J1755j4023j1117J5122R783j6222p940J7706N044j9299m85J9441
$$ -11973 784 12539 -1484 -12601 2521 12304 -3918 -11858 5848 10892 -8407 -8892 10549
1092A0549m964j6909R156J2377r924q794P624Q967n066j3207N988J8233j1668
$$ 10549 5585 -11324 -2168 10209 285 -8509 -885 8082 3016 -10191 -4203 14030 2362
1105B362j9475J9288J4962k3983o858K2406K36j5888J066R394K645p876p104J2100
$$ 2362 -17113 2175 17137 -6846 -13704 8702 8938 -6950 -5884 3510 6155 -1721 -8825 3275
1119C275P571j8400k350K1688o039j9506J3097J3629j5643q137J3960O102j1035
$$ 3275 10846 -7554 -9904 11784 5745 -13761 -664 12965 -2678 -10815 3145 9247 -1788
1132a788p423R935R865j1655j1154J4976J0481j7903q307J9281N272j9316j568
$$ -1788 -9211 724 10589 -1066 -12220 2756 13237 -4666 -12973 6308 11580 -7736 -9304
1145i304J8330k491j6319N795J3185p054r762O021P962m284r333M421J3334q355
$$ -9304 9026 6535 -9784 -3989 9196 2142 -7620 -1599 6363 2079 -7254 -2833 10501 2146
1159B146j6477J5225J5106k1477q612K3434N50j9905L897J3385k041q481l932
$$ 2146 -14331 894 16000 -5477 -14089 9345 9895 -10010 -6113 7272 5231 -3250 -7182
1172g182Q865Q444j4271p126K0546q1k2763R062J8652j4909j0594J5518L497j2326
$$ -7182 1683 10127 -4144 -11270 9276 9195 -13568 -4506 14146 -763 -11357 4161 7658 -4668
1186d668j326Q814M065p783q505J0125J0877j4690r486J9428N447k2230o88K1865
$$ -4668 -5994 2820 6885 -898 -9403 722 11599 -3091 -12577 6851 12298 -9932 -10620 11245
1200A1245l377j8491O222J3521p376r167O330P300l735q430J704J1585l234j4455
$$ 11245 7868 -10623 -4401 9120 1744 -7423 -1093 6207 2472 -5958 -4254 7331 4097 -10358
1214a0358R269J4520j7442j0381K2977L082k2383L964J6398o749r537L716O803
$$ -10358 -1089 13431 -4011 -14392 8585 11667 -10716 -6752 9646 2897 -6640 -2924 3879
1227C879K768r923p472J6508N999k1776J707K2011j1033j6921J6566Q935j5584
$$ 3879 6647 -3276 -10748 5760 11759 -10017 -8310 13701 2668 -14253 2313 11248 -4336
1240d336k309J0446k19n879j749N239N997q753r073J4104Q427j8760l783K1065
$$ -4336 -6645 3801 3582 -2297 -4046 1193 7190 -1563 -10636 3468 11895 -6865 -10648 10417
1254A0417k549k0589P677J7483r652j2588Q493P916n515n898K693P699j813j1870
$$ 10417 7868 -12721 -5044 12439 2787 -9801 -1308 6608 1093 -4805 -2112 5587 3774 -8096
1268h096M118J4933r552j3653J6070P525k0368O04J9590o508j4197P414P909l703
$$ -8096 -3978 10955 1403 -12250 3820 11345 -9023 -8419 11171 4663 -9534 -2120 5789 2086
1282B086n531j419R013M090j5927j972K1153m202k0786J1301J4919j5373p128
$$ 2086 -3445 -4864 4149 8239 -7688 -9660 11493 7291 -13495 -2194 12725 -2648 -9776
1295i776J4503J795j0071o66N574K762m379n508P384O605j2774n006J7308J006
$$ -9776 4727 6522 -3549 -4215 1359 4121 -258 -5766 1618 8223 -4551 -9557 7751 8757
1309H757j8900M036J7396q403j4089J0387J0587r477q085O566P351l781q534L272
$$ 8757 -10143 -6107 11289 2886 -11203 -816 9771 294 -7791 -1225 6126 2345 -6189 -2917
1323b917J0880n873j2389J0610J0997j5097n935J6904q16j5183N973J1021o840
$$ -2917 7963 2090 -10299 311 11308 -3789 -9724 7180 6364 -8819 -2846 8175 1335
1336A335p254L824O456Nr402j107J4257k078j7609P812J6854j2817j2108J4427
$$ 1335 -5919 -2095 4361 4366 -5036 -6143 8114 6036 -11573 -3761 13093 276 -11832 2595
1350B595O030j2274k089Q457J841n760m076N925O063q718n545J2417K195j4856
$$ 2595 8625 -3649 -5738 2719 4560 -1200 -5276 649 6712 -2006 -7551 4866 7061 -7795
1364g795K405J5029o401j3085Q595J0349q950q227Q122P461o969q053O283R288
$$ -7795 -5390 9639 3238 -9847 -1252 9097 147 -8080 42 7503 534 -7519 -1236 8052
1378H052o803j0166Q726R704j1433p435J3678L500j3957Q25J1926l795q701M277
$$ 8052 1249 -8917 -191 9513 -1920 -9355 4323 7823 -6134 -5309 6617 2822 -5879 -1602
1392a602O459k769o710J146R437j604j2778M901J4258r676j2514J3255Q345j3687
$$ -1602 4857 2088 -4622 -3476 5961 4357 -8421 -3520 10738 1062 -11452 1803 10148 -3539
1406c539m164J1131K202p741l035O061N143p204o119J0200M455j2845n21J3445
$$ -3539 -7703 3428 5630 -2111 -5146 915 6058 -1146 -7265 2935 7390 -5455 -5976 7469
1420G469l904j1783O990R116p986o975P455O311o798o820O803P817p763q412R294
$$ 7469 3565 -8218 -1228 7888 -98 -7073 382 6693 -105 -6925 -122 7695 -68 -8480 814
1435H14Q145j0929o918J2225M728j2718j970J2060o76j0320K429Q094k735o627
$$ 814 8959 -1970 -8888 3337 8065 -4653 -6623 5437 4761 -5559 -3130 4964 2229 -4398
1449d398K105O833j783q566L028J0580o191j1021J0080R091j2695n638J2780K566
$$ -4398 -2293 4540 2757 -5809 -2781 7799 1608 -9413 667 9758 -2937 -8575 4205 6771
1463F771j0650j597Q181K780p323m586Q664M956j1040k985J2563n91j2138M102
$$ 6771 -3879 -5476 2705 5485 -1838 -6424 2240 7196 -3844 -6829 5734 5143 -6995 -2893
1477b893R928o108p385O513N837o205n638O379O117p355o435Q852O081j0153n258
$$ -2893 7035 927 -6458 55 5892 -313 -5951 428 6545 -810 -7245 1607 7688 -2465 -7723
1492g723J1068M155j1562k957J1804J467j1622L29J0631j872r105K720P569k769
$$ -7723 3345 7500 -4062 -7019 4785 6252 -5370 -5041 5590 3718 -5387 -2667 4902 2133
1506B133o940K791P354l697q165N943Q181q824o667J0951M152j1393j925J0417
$$ 2133 -4807 -2016 5338 1641 -6524 -581 7600 -1224 -7891 3060 7212 -4181 -6106 4311
1520D311J068r179j603R007K316r945k018J1118L49j1385J905J0274l651q534
$$ 4311 5379 -3800 -5403 3604 5920 -4025 -6043 5075 5424 -5961 -4056 6218 2567 -5967
1534e967M447P134m778o566N507O326o965n647Q650M186r627k577R683J585r263
$$ -5967 -1520 5614 836 -5730 -223 6103 -862 -6509 2141 6327 -3300 -5877 3806 5391 -3872
1549c872j535R374J864j0294j493J1494r1j1795K271J0727m076q631M631O724
$$ -3872 -5407 3967 5831 -4463 -5956 5538 5447 -6348 -4077 6650 2574 -6057 -1426 5298
1563E298m321n867M086N932m845o076O553N429q388l949R552K264r908j066R920
$$ 5298 977 -4890 -804 5128 283 -5793 760 6189 -2199 -6148 3404 5668 -4240 -5306 4614
1578D614M38j0190K90J0518j369j0325K622R320l274q006L123P247k722p440L135
$$ 4614 5052 -5138 -4848 5670 4301 -6024 -3402 5918 2644 -5362 -2239 5008 2286 -5154 -2019
1593b019Q102n082p869P860N837r955k554J0145m23q591J500O795n27o524j114
$$ -2019 6083 1001 -6868 992 6829 -3126 -5680 4465 4042 -4549 -3049 3746 3219 -3305 -4419
1608d419Q267J528j0873J97J2451l346j1682O057R108o981o218O144M528m797
$$ -4419 3848 5376 -5497 -5300 7151 3805 -7877 -1820 7288 307 -5911 233 4761 -36
1622c6m322M326M783n126m790O640L924q135k483R189Q63r834P15J0157k384r974
$$ -36 -4358 -32 4751 -375 -5165 1475 5399 -2736 -5219 3970 4833 -5001 -4286 5871 3487 -6487
1638f487L950Q985m899p379M607O189l416o202K377P551k940q903N436Q613q674
$$ -6487 -2537 6448 1549 -5830 -1223 4966 1550 -4652 -2275 5276 2336 -6567 -1131 7482 -1192
1653a192n808J0630J525r964J931P289k804m751J174M419J025o742j446J0095
$$ -1192 -7000 3630 5155 -4809 -2878 4411 1607 -3144 -1970 2449 3474 -3268 -4714 5381
1667E381p91j2115M624J1336p791q311Q574N007p096l262M955L511l902m617M483
$$ 5381 4590 -7525 -2901 8435 644 -7667 907 5914 -1182 -4444 511 4022 120 -4497 -14
1682a4N151o159m329P891K402q913j56R232j976q867L722P997n000o713N444N472
$$ -14 5137 -1022 -5351 2540 4942 -3971 -4127 5105 3129 -5738 -2016 5981 981 -5732 -288 5184
1698E184m871n001L657N822l071p424M153Q478o839p625R709M442j0655l56Q954
$$ 5184 313 -4688 -1031 4791 1720 -5704 -1551 6927 88 -7537 2172 6614 -4041 -4397 4557
1713D557k549n639K802L124p41l349j394O170J284r553J777J1022o276r481R479
$$ 4557 2008 -3631 -829 2295 1554 -1795 -3189 2981 4265 -5288 -3511 7511 1235 -8246 1233
1728A233O015r747k753P369J558m604k587L446M499m505n573O832M721q732k193
$$ 1233 7248 -2499 -5252 2117 3675 -929 -3516 -70 4429 -76 -5649 1183 5904 -2828 -5021
1743e021R312r42q537L461P120m752n584M920M316m451l730L857M180l629n616
$$ -5021 4291 3349 -5188 -1727 5393 641 -4943 -23 4293 -158 -3888 -31 4149 520 -5096
1758e096M280P154o020p457Q410N626j0269k210J0294j172p968K622M633j667
$$ -5096 -816 6338 318 -7139 1271 6897 -3372 -5582 4712 3540 -4428 -1806 2827 1160
1772A160k448n61L145J923o269p93R416k783j0092P095P553r892l360R773K34
$$ 1160 -1288 -1849 1296 3219 -3050 -3843 5573 2790 -7302 -207 7346 -2546 -5906 3867 4101
1787D101p163M1M187K047l007m591M515N573p632m259J0139J303j0380J910Q387
$$ 4101 -3062 -3021 1166 3213 206 -4385 130 5703 -1929 -6188 3951 5254 -5126 -3216 5171
1802E171m273n473N149L234m556k500L267L030k314m238K794N432m772o157P645
$$ 5171 898 -4575 574 3808 -748 -3248 19 3049 735 -3503 -709 4723 -49 -6206 1439
1817A439N621r982l465J0592K53r194K417O529l044l960J167K983J476m110k503
$$ 1439 7060 -2922 -6387 4205 4458 -4736 -2319 4210 1166 -2794 -1627 1356 2832 -1278 -3781
1832c781O620O35q865L573Q862p649o167R575J968q544J168N920j444l641r83
$$ -3781 2839 3474 -5391 -1818 7044 -605 -6772 2803 4771 -3773 -2605 3315 1871 -1770 -2753
1847b753L263M011n011n259P915L630j0219j10J0442l256q451M953N186m725k474
$$ -2753 510 4521 -490 -5749 2166 5796 -4423 -4533 5909 2653 -5798 -845 4341 -384 -2858
1862b858L516J436k258k363J845M228k709n509M795N371p553l634R765J007j0206
$$ -2858 658 2094 -164 -2527 -682 3546 837 -4672 123 5494 -2059 -5693 4072 5079 -5127
1877e127J523Q567k990n755K811L535j182l285p96N061J404p383K43Q536l765
$$ -5127 -3604 4963 1973 -3782 -971 2564 1382 -1903 -2699 2362 3766 -3617 -3374 5162 1397
1892A397p444P268M364q745q82P573j368m909J382K947M58l234k537N567L213
$$ 1397 -6047 1221 5585 -3160 -4042 3531 2163 -2746 -1364 1583 2041 -1193 -3730 1837 5050
1907E050q371j703R921j302r371M159P236n456m605M795K774l164k218J870K821
$$ 5050 -3321 -5024 4897 3595 -5776 -1617 5619 163 -4442 353 3127 -37 -2255 -385 2436
1922B436j893l895L240M505n310l948P287K065q420M70Q326k647p090L551N301
$$ 2436 543 -3352 -112 4393 -917 -4865 2422 4487 -3933 -3463 4863 2216 -4874 -1323 3978
1937C978k939l970J415M039k12n419L50P097k044p720M662O320o734l406P227
$$ 3978 1039 -2931 -1516 2523 2311 -3108 -2758 4339 2295 -5425 -763 5557 -1177 -4583 2644
1952B644M40o073J162M138q06k968p07L560J788n594j381P778n35q725L029P833
$$ 2644 3084 -2989 -1827 2311 1505 -1463 -2170 1390 3178 -2416 -3797 3981 3446 -5279 -2250 5583
1968E583m756n816N117L886m278k958L111L091k461l713K836M031m021l607N431
$$ 5583 827 -4989 128 4014 -264 -3222 -111 2980 519 -3194 -358 3673 -348 -3955 1476
1983A476K383o467p24O877j088o460K496N515l137m559K907M055k138m429J647
$$ 1476 3859 -2608 -3332 3545 2457 -4003 -1507 4008 871 -3688 -781 3274 1136 -3293 -1646
1998a646N395k017o322L466O299n271m943O458K668o301n49N022m30l542O8K998
$$ -1646 3749 1732 -4590 -1124 5175 -96 -5039 1419 4087 -2214 -2763 2259 1829 -1713 -1645 1353
2014A353Q52l887j114N560Q1o936K027P057m127n900N177M255m971l092L985K982
$$ 1353 2205 -1682 -2796 2764 2845 -4091 -2064 4993 866 -5034 143 4398 -573 -3665 320 3302
2030C302l248l508L303L930m050l666M952K727n603j354N764j7n514J177N089
$$ 3302 54 -3454 -151 3779 -271 -3937 1015 3742 -1861 -3215 2549 2532 -2982 -1805 3284
2045C284k069m599K645M118k876l871K836M022k850m522L325M952m328m818N507
$$ 3284 1215 -3384 -739 3379 503 -3368 -532 3490 640 -3882 -557 4395 67 -4751 756
2060G56L798o174k209N933P20m878p0L804K40l405o90M049M75n123P29N781k537
$$ 756 4554 -1620 -3829 2104 2824 -2054 -2124 1680 1920 -1485 -2175 1874 2349 -2774 -2045 3736 1199
2077A199n476M157M326m823l162M602K595m046k806L884L216m311l258N010K690
$$ 1199 -4277 -120 4206 -617 -3779 823 3418 -628 -3434 450 3666 -645 -3903 1107 3797
2092C797n473j658N412O71n026M3M681o16m493J275M375k076m125K876L673l398
$$ 3797 -1676 -3334 2078 2749 -2277 -2234 2447 1831 -2662 -1387 2988 912 -3213 -337 3336 -62
2108f2l272L620L145l845l274M325L310n088k869N670J978n758r84N298L07m633
$$ -62 -3334 286 3431 -414 -3688 637 3947 -1141 -4010 1660 3638 -2120 -3104 2194 2501 -2132
2124b132n3M177N3m227L16M482j173m516K315M119l323l338L804K749l947k548
$$ -2132 -2185 1992 2045 -2182 -1866 2616 1443 -3073 -758 3361 38 -3300 504 3253 -694 -3242
2140c242M155K553m589k469N187J919n567j082N423L52m873q0M329J56m295KM566
$$ -3242 913 3466 -1123 -3592 1595 3514 -2053 -3135 2288 2640 -2233 -2313 2016 2172 -2123 -2121 2445
2157B445o53m810J912M439l145l492L897K392l943j740L735J695l711k003M228
$$ 2445 1792 -3018 -1106 3333 188 -3304 593 2985 -958 -2698 1037 2732 -979 -2982 1246
2172A246K099n012j700N599R01n714o7N431o10m895J027M344j350l923J659L504
$$ 1246 3345 -1667 -3367 2232 3133 -2581 -2648 2783 2173 -2722 -1695 2649 1299 -2624 -965 2539
2188B539j999l126K316K898k689k801L281K749m164k398N139J528n714l70N581
$$ 2539 540 -2586 -270 2628 -61 -2862 419 3168 -996 -3394 1745 3273 -2441 -2811 2770
2203B770n80m794Q23L990l61l723k70M187L49n050N70N441k183m798L609L351
$$ 2770 2190 -2604 -1781 2209 1848 -1875 -2145 2042 2391 -2659 -2089 3352 1169 -3629 -20 3331
2219C331m260j723L926P20l178p07K835J278l260j729M303J537n379o77N958n08
$$ 3331 -929 -2652 1274 1994 -1184 -1891 944 2222 -1038 -2767 1536 3073 -2306 -2983 2975 2467
2235B467n797J524N140k128m223K241L410k057k872J750K711j633k901K001L121
$$ 2467 -3330 -1806 3334 1206 -3017 -776 2634 577 -2295 -545 2166 533 -2368 -367 2754
2250B754k879l052M173K210n270p26N659q88n033J771L938j644l031O58L149K32
$$ 2754 -125 -3177 996 3206 -2064 -2790 2869 1981 -3052 -1281 2657 1013 -2018 -1360 1789 2021
2266B021m199j76N437j076n811K884M857m264k954M491J094l638j82K481M33j993
$$ 2021 -2178 -2354 3083 2007 -3804 -920 3937 -327 -3281 1210 2304 -1334 -1516 965 1398 -595
2282e95j254K566J700l893j288N226N7n831J406N541k554m598L078L511k899k745
$$ -595 -1849 717 2417 -1476 -2764 2462 2519 -3312 -1906 3635 1081 -3517 -439 3072 173 -2572
2298b572K286K561j719k741J495L189j992l407L103L058m420j893N265Q0n125
$$ -2572 -286 2275 556 -2185 -690 2499 507 -2900 203 3261 -1159 -3052 2213 2293 -2832
2313b832J578M089k373k813J936K216p56k745r8M143l27n445K001N651l954m461
$$ -2832 -1254 2835 462 -2351 -415 1801 1045 -1700 -1798 2345 2018 -3427 -1426 4225 271 -4190
2329d190N054K376m704n05L306j62j914m99J557J567k364k033L864J222n126N88
$$ -4190 864 3240 -1464 -1969 1337 1175 -739 -1238 319 1886 -478 -2511 1353 2575 -2551 -1963
2345a963N456k444m800L524L572l588k419K973J870k228k164J883K859j988l483
$$ -1963 3493 1049 -3751 -227 3345 -243 -2662 311 2181 -47 -2211 -328 2531 543 -2940
2360b940K656L493l744k587M733J055n122O32M499j834l142K188J810j606j525
$$ -2940 -284 3209 -535 -3122 1611 2666 -2456 -1824 2675 841 -2301 -113 1697 91 -1434
2375a434P18K459k80m080J018N160k789m868M707L309n629j286M904n5l114J72
$$ -1434 -716 1743 1463 -2617 -1599 3561 772 -4096 611 3920 -1709 -2995 1909 1854 -1260 -1088
2391a088J522P38j273j789K458K094m226j047N212r37m942K951L690m057k241
$$ -1088 434 1172 -101 -1890 568 2662 -1564 -2611 2601 1664 -3278 -327 3363 -694 -2935
2406b935L879J329k875j210J869J805j698k639K445L196l637l015M639J954m990
$$ -2935 944 2273 -602 -1812 57 1862 164 -2475 -30 3166 -471 -3486 1153 3107 -1883
2421a883l31M655j231l702K026K501j813j554J016J370l37k195N45L518j790m387
$$ -1883 -2214 2441 1210 -2492 -466 2035 222 -1332 -316 1054 717 -1478 -933 2585 795 -3592
2437c592L607L865n050k158N465J19m573Q91L060m94j805q13J624J910k694j827
$$ -3592 15 3880 -1170 -3328 2137 2256 -2317 -1426 1634 1140 -665 -1478 146 2056 -638 -2465
2453b465M261M25n121J567M586l146k962L823J191l428l12K535N67j810j575J869
$$ -2465 1796 2221 -2900 -1333 3253 107 -2855 968 2159 -1269 -1581 954 1521 -289 -1864 5
2469EK419k734k600M044J924m988q09N140m35m387J392L159j794k024J528J452
$$ 5 2424 -310 -2910 1134 3058 -1930 -2739 2401 1966 -2421 -1029 2130 336 -1688 -160 1292
2485A292q17j695L34K427o81l137J978L342l738k577M967J091n021M25L980j123
$$ 1292 475 -1220 -886 1541 860 -2277 -299 3043 -695 -3272 1695 2786 -2235 -1810 2170 1047
2501A047k684P33J932M33k215j408L283J275m374O0M716j923l912L238K365l426
$$ 1047 -1637 -904 1028 1461 -754 -2162 1121 2396 -1978 -1918 2798 875 -3037 201 2566 -860
2517h60r20K771J90j895m13J555J234k045j901L100J832m172r85M728j78m644
$$ -860 -1780 991 1181 -714 -1127 428 1662 -383 -2284 816 2648 -1524 -2509 2219 2041 -2603
2533b603J199L936j677l004J658K119j209j775P62J985o38k525J129K892k179
$$ -2603 -1404 2532 855 -2149 -491 1628 419 -1356 -594 1391 753 -1772 -643 2249 70
2548G0k652L424J694m243l42M204p93l415J181K458o76k087j22K516O08l533k33
$$ 70 -2582 842 2536 -1707 -2049 2155 1362 -2053 -872 1586 910 -1177 -1299 1217 1825 -1708 -1941
2565a941M350r14m324K234L329l002j936K917Q28k236m90J643P61j570j222K198
$$ -1941 2409 1495 -2829 -595 2734 -268 -2204 713 1541 -695 -1185 458 1219 -351 -1573 625
2581F25J319l161q56L918j6m123R19L860j550l317J807K718j680k322J407K171
$$ 625 1944 -1217 -2073 1845 1829 -2294 -1375 2485 935 -2382 -575 2143 463 -1859 -452 1719
2597A719j186k258J216K440j652k444K372K055l135j157L520N7l386Q31K823j140
$$ 1719 533 -1725 -509 1931 279 -2165 207 2262 -873 -2030 1490 1547 -1839 -1008 1815 675
2613F75k217P93K135l24k631K06L421p77l867J769L615k636k703K932J639k570
$$ 675 -1542 -749 1386 1062 -1569 -1363 2058 1281 -2586 -817 2798 162 -2541 391 2030 -540
2629e40r85J975Q90j656j105J873J193k466q31L028R5l320P42L216j338k937J634
$$ -540 -1525 450 1340 -316 -1421 452 1645 -821 -1652 1376 1471 -1849 -1107 2109 771 -2166 -532
2646e32K678j762k468J773K391j850k291J898K206j992k082K132J911k394j588
$$ -532 2146 384 -2084 -311 2080 230 -2061 -163 2043 51 -2031 101 2012 -382 -1970
2661a970K772R50k988j54K900n69k511R45K138r22k060P85K357r09k843J443L076
$$ -1970 802 1752 -1236 -1390 1510 941 -1570 -625 1513 591 -1469 -684 1673 764 -2079 -636 2440
2678B440k179k797K752K109k813j459K476J156k123j134K015J209k274j014K665
$$ 2440 261 -2536 216 2325 -488 -1947 529 1685 -438 -1572 443 1652 -622 -1636 1029
2693A029L88k818L04K730r34k393J242K186j397k179J565K281j874k333K344K057
$$ 1029 1417 -1401 -1097 1633 699 -1694 -452 1734 337 -1842 -277 2004 130 -2203 141 2198
2709B198k578j680K551J389k396j256K346J200k485r82K697M88k788J90K608p49
$$ 2198 -380 -2060 491 1880 -516 -1772 574 1774 -711 -1693 1004 1492 -1296 -1106 1502 753
2725G53k281J079J990j210j924J338K060j684k143K140J980k502j669K673J355
$$ 753 -1528 -449 1541 331 -1593 -255 1805 121 -2022 118 2098 -404 -2073 600 1955
2740A955k645j150K536J104k609r03K733M99k782Q3K575n84k164Q24J837q51j807
$$ 1955 -690 -1840 696 1800 -809 -1712 1021 1520 -1262 -1179 1396 812 -1352 -528 1309 458 -1349
2757a349R38K039j344k232K035K084k706j591L042R36k881n21K459N35k185p90
$$ -1349 -411 1628 284 -1948 87 2171 -535 -2126 916 1852 -1029 -1550 909 1444 -741 -1531
2773a531K259R38k617o99K965K2k956P75K551j339j972J557J497j566j269J590
$$ -1531 728 1666 -951 -1650 1315 1337 -1619 -844 1707 368 -1604 -47 1450 -116 -1385 205
2789B05J301j766j367K042J379k421j239K725J024k998o56L075K59l052K58K739
$$ 205 1506 -260 -1627 415 1794 -627 -1866 859 1883 -1115 -1771 1304 1563 -1489 -1231 1508
2805A508o24k235P26J784o06j622M81J787o28k130J269K227k181j801K907R86
$$ 1508 884 -1351 -625 1159 553 -1069 -588 1199 571 -1559 -290 1937 -244 -2045 862 1848
2821A848l117j28K706k24k177Q0J827M59k058q20K661O19l207J02L273j003k762
$$ 1848 -1269 -1397 1309 1085 -1092 -1012 815 1274 -784 -1604 1057 1676 -1531 -1429 1844 841 -1921
2838a921J682J902j833j131J616P38j296p84J227J070j564j237K118J171k768
$$ -1921 -239 1663 -170 -1301 315 1053 -243 -1027 200 1270 -294 -1531 587 1758 -1010
2853a010p24L196P2l256N71K956j032k410J093J855q58j519M37J650k57k075O14
$$ -1010 -1734 1462 1534 -1722 -1151 1805 773 -1637 -544 1311 453 -1066 -629 1021 764 -1311 -697
2870f97K370j414k172K330J429k901m06K877m72k281P29J634l52j450k22J848
$$ -697 1673 259 -1913 417 1846 -1055 -1461 1416 944 -1337 -608 1026 674 -776 -998 850
2886H50N84k685k83L352o12l325J529K680k133j645K063Q30j508n69J000O99q47
$$ 850 1434 -1251 -1534 1818 1206 -2119 -590 2090 -43 -1688 375 1205 -303 -872 128 827 -20
2903b0j055J214J269j981j049K707M51l120M52K977j184k520J583J898j428j434
$$ -20 -1075 139 1408 -573 -1622 1085 1536 -1584 -1132 1845 661 -1859 -276 1622 194 -1240
2919a240Q87J366l68j750L37K253q59k518J773K149k556j174K797%k468Q63J697
$$ -1240 -353 1013 645 -1105 -768 1485 626 -1892 -119 2030 -526 -1700 1097 1097 -1371 -508 1189
2936A189q86j088L10J050L36j702m16K613k14l256J275L115k142k287K423J238
$$ 1189 303 -785 -475 575 911 -791 -1207 1406 1192 -2064 -789 2326 184 -2103 320 1558
2952A558k097n10J401M99r10q60P62J364j227j406J986Q81k660rK911q81k606
$$ 1558 -539 -1049 352 851 -59 -919 -157 1207 -20 -1426 560 1441 -1219 -1228 1683 802 -1804
2969a804J541J906j751j222J500R87j000j270N75J858n98k380J247K386k158j852
$$ -1804 -263 1643 -108 -1330 170 1157 157 -1113 -538 1320 722 -1658 -411 1975 -183 -2035
2985b035K846Q43k818K03K103q07j203P60O63j49r27l92J731L51k582M77K922
$$ -2035 811 1654 -1164 -961 1142 335 -868 -108 555 406 -521 -913 818 1169 -1413 -936 1986
3002A986j692k557K598J728k719q24K095L34j258m43P96R93r47j507J577J489
$$ 1986 294 -2263 335 2063 -656 -1480 615 949 -309 -752 44 1037 90 -1417 160 1649
3018A649k227q87K623k08k544J191K073j649j438J595Q76j205p30Q46J076p89
$$ 1649 -578 -1465 1158 950 -1594 -403 1670 21 -1417 178 1054 -151 -881 -35 1041 252
3034B52j676J061K212j706k165K401J485k835m55K729m08k001O82J099l83o23
$$ 252 -1424 -363 1849 143 -2022 379 1864 -971 -1426 1303 895 -1106 -424 675 292 -331
3050c31j54Q56M66j663j55K466p61k636J808K095k603j063K629K59k018j12J264
$$ -331 -485 371 837 -826 -981 1485 724 -1912 -104 1991 -612 -1675 954 1213 -805 -917 347
3067C47N30r05j087J134J436j834j225K491N59k704L37K323j075j648J462R88
$$ 347 877 -28 -1115 19 1455 -379 -1604 887 1446 -1258 -921 1402 327 -1321 141 1129
3083A129j367o64J001O94o92j059P84J463j263j738K005J610k631j001K818J92
$$ 1129 -238 -902 99 793 101 -958 -174 1289 26 -1712 293 1903 -728 -1729 1089 1281
3099A281k482M39J810n96j155K40Q78K96j134m91J746O4k265Q99K211j853j599
$$ 1281 -1201 -762 1048 452 -703 -463 415 711 -423 -914 832 896 -1369 -470 1741 -112 -1711
3116a711K403O55k274LJ717q5j200l63J091R44j460j193K092Q83k557j79K585
$$ -1711 692 1347 -927 -924 793 708 -492 -855 236 1180 -280 -1473 619 1502 -1055 -1234 1351
3133A351n69k166J063J494j143q97R47O55p57p29P01J009q77j281J383J306k016
$$ 1351 782 -1384 -321 1173 30 -867 80 735 -22 -751 -50 959 82 -1199 184 1490 -526
3150e26r74K438M27k554J32K269n07j749N35J261k02j153j46J424J92j840K08
$$ -526 -1500 938 1365 -1189 -1057 1212 705 -1044 -509 752 550 -603 -749 675 867 -973 -765
3167g65K049r44j826J657J202j987m60J851k2j435L4J159K93j219o56J653P12
$$ -765 1284 340 -1486 171 1373 -614 -1074 777 755 -680 -646 513 806 -413 -1069 584 1296
3184A296k158l89K442j90k354P10J938r54j438R16J072p65r12O38R60p24j027
$$ 1296 -862 -1251 1191 1001 -1353 -643 1295 341 -1097 -181 891 126 -786 -148 812 88 -939
3201i39R65J040j372q80J763O03k046j77K110k04k025N09J712n10j440K94J436
$$ -939 26 1066 -306 -1186 577 1180 -866 -1043 1067 863 -1162 -653 1059 549 -891 -597 839
3218H39j44j588J44J819m80j851R85J569j377j069J543N43j459j89J220J51j130
$$ 839 695 -893 -749 1070 590 -1261 -276 1293 -84 -1153 390 933 -526 -715 505 656 -474
3235d74k93J314L91j679k40K015j44k113N42J948p81j711Q61J447p76j320P57
$$ -474 -767 547 938 -741 -981 1034 890 -1223 -681 1267 486 -1225 -364 1083 307 -1013 -256
3252b56J225p88j156R22J008j081q17J252O04j424l79J619Q1j711J92J718m13
$$ -256 969 181 -975 -53 955 -126 -943 309 913 -511 -890 729 810 -901 -709 1009 596
3269E96j649N74J525n77j474N13J569n68j657P55J617j043j416J256J044j296
$$ 596 -1053 -479 1046 469 -1005 -492 1077 509 -1148 -393 1224 181 -1235 21 1065 -231
3285b31o91J245M19j128l36J176K73j348j53J592j21j713M74J655o86j541P86
$$ -231 -922 323 742 -386 -722 454 727 -621 -774 818 697 -1016 -542 1113 427 -1114 -328
3302c28J426p76j433Q27J442r04j436J103J220j238r26J290O04j189m35J110L60
$$ -328 1098 322 -1111 -284 1158 254 -1182 -79 1141 -97 -1023 267 871 -318 -753 357 717
3319G17j198k48J375L4j575L09J639o56j516Q46J389r23j296R18J286r15j312
$$ 717 -481 -729 646 680 -895 -586 1053 397 -1119 -273 1116 193 -1103 -185 1101 186 -1126
3336a126J019J260j167j089J253Q85j280o62J280M14j283k21J341j2j390L05J353
$$ -1126 -107 1153 -14 -1103 150 1035 -245 -907 373 787 -496 -717 624 612 -778 -473 880
3353H80n68j218O47J167o90j192P11J361q66j479J193J359j468j068J579O57j426
$$ 880 312 -906 -259 908 218 -974 -263 1098 232 -1247 -54 1305 -163 -1231 348 1005 -421
3370d21l51J113L16r20m10R71M57j255k65J558k00j608O88J465j106j123J209
$$ -421 -772 341 657 -263 -673 298 755 -500 -765 793 593 -1015 -327 1138 32 -1091 118
3387A18Q43j068q02R67Q90r35j067J096J123j355r66J528O97j610l26J515K0j338
$$ 118 961 -107 -909 58 948 13 -1054 42 1165 -190 -1156 372 1069 -541 -867 648 668 -670
3405f70J82J189l75j010M84Q67m82r22N11J097o83j288J019J325j435j101J738
$$ -670 -488 701 326 -684 -200 667 185 -737 -226 871 188 -1100 -81 1244 -191 -1292 446
3422D46O84j744k63J471M3j029k09Q58M59r61n83J285M17j645J54J673q04j367
$$ 446 1130 -614 -877 594 637 -392 -601 257 716 -245 -828 457 874 -771 -617 1056 252 -1115
3440a115J247Q32j285m15J037L44q02n65P49R08j039j043J414R38j770n36J840
$$ -1115 132 964 -321 -736 301 645 -157 -722 27 935 -104 -1147 267 1205 -565 -1101 739
3457G39J25j707K69J324l98j008M20P54k70p27K09Q60k75j119N93J252j092j155
$$ 739 864 -843 -574 750 352 -656 -236 518 248 -479 -270 590 315 -804 -211 1041 -51 -1206
3475a206J593P57j819k76J717j04j346K11R29O5q15m49J025O55j493l76J822k52
$$ -1206 387 1144 -675 -951 766 662 -684 -473 456 521 -294 -743 282 937 -556 -932 890 638
3493F38j752R33J255j291o22J238J47q58j14N61L79n79p46R38R60j473p61J847
$$ 638 -1114 -181 1074 -217 -839 399 546 -312 -426 135 514 -65 -811 127 1087 -386 -1147 700
3511G00K96j956K59J708n87j300O25Q83l83o94J40P44o4r71K23J228o30j233J100
$$ 700 996 -960 -701 1007 420 -880 -255 628 245 -449 -309 435 371 -600 -377 851 221 -1012 88
3530H8R43j547m03J695r9j536M16J117l39p62l5P66L77j152m18J645J25j934M75
$$ 88 1031 -516 -919 776 677 -859 -443 674 335 -427 -462 304 681 -471 -889 756 881 -1053 -578
3549e78J748j049j141J298M50j098p9O77Q6l21m17L78P36q47p98J491M97j883
$$ -578 1170 121 -1020 278 728 -370 -449 228 314 -7 -424 -46 690 -157 -955 536 1033 -850
3567h50J3J862n24j517P84J100p50p95M50P23j28q41JJ104k43j270P17J185j223
$$ -850 -837 1025 501 -1016 -232 868 118 -677 -227 496 368 -473 -472 632 389 -881 -164 1021 -202
3586b02q10J477K56j414K99J146n53p99L85O30lp49l19J140K83j625K00J807p90
$$ -202 -1012 465 721 -693 -394 752 199 -600 -215 415 412 -337 -656 484 767 -858 -658 1149 359
3605C59j591J191J039j237l79R10L7m79k01L04N54m37p89Q19P24j346k35J629
$$ 359 -1232 -41 998 -239 -618 292 329 -150 -351 -47 507 70 -719 100 824 -522 -757 872
3623H72k81j626P33J259q78q10P36N67m88o32K56R22j98j226M38J266q05j069
$$ 872 591 -1035 -302 957 79 -731 5 572 84 -548 -292 630 432 -794 -356 910 105 -964
3641i64J225O05j387j28J244k49q85M08N40k87m52lP32J51j149MJ481m18j586
$$ -964 261 866 -521 -649 595 346 -539 -131 409 122 -330 -333 399 550 -599 -595 886 468 -1118
3660a118R73J251j290p79J255L52q56j93M17L41k77o04M64Q05r14o56J310J73
$$ -1118 -145 1106 -184 -963 292 644 -212 -405 12 353 76 -528 -64 741 -173 -829 481 654
3678F54j421M07J245q21r08Q99O19o86n05M21O23k97r14M27J142p16j146J003
$$ 654 -767 -360 885 64 -844 55 674 -12 -517 -96 527 230 -684 -257 885 169 -977 26
3696B6R23j236n21J239J22j046J58P70k30n27J22M27O2o49o9R96j43j284N75J312
$$ 26 949 -287 -808 431 553 -493 -335 435 205 -322 -200 227 289 -360 -429 567 424 -860 -285 1027
3716A027j029j023J277N83j184k62Q78K21n49m29M44O92o42p64J005N14j256q7
$$ 1027 -2 -1025 252 835 -349 -611 267 488 -61 -490 -46 646 4 -760 245 759 -497 -584
3734e84J287m04j050P04O76p08m52N70M33m24n89M06Q29o18r37R20Q64j165o50
$$ -584 703 299 -751 -47 629 -79 -531 39 472 48 -541 -135 694 76 -861 59 923 -242 -892
3753h92J236M04j194r9R95o4p53Q2N88rn79m6P07m4q66K56J017o04j011R92P31
$$ -892 344 748 -446 -545 450 386 -367 -285 303 294 -285 -331 376 332 -534 -278 739 135 -876 116 847
3774H47j146m11J064K17q68k00O62L76o47n83Q63N56j078l67J210K7j154L23Q90
$$ 847 -299 -710 354 571 -297 -497 165 541 -106 -689 174 730 -348 -715 495 522 -632 -309 581
3793E81m87o12N20M37m20m60M18N46n04o74O93P03r31n80J094M02j145k23J118
$$ 581 94 -518 2 439 19 -441 -23 523 19 -655 38 741 -190 -770 324 726 -419 -642 476
3812D76N5r69j0Q61j0p73jP43j5p87J02Q41l13q18N46P08p55n28Q85L42r09k05
$$ 476 531 -438 -448 413 403 -370 -371 372 357 -430 -328 513 200 -618 -72 636 -119 -647 238 580 -329 -534
3834e34Q34K03p82k69Q21L37r43k97J067J39j126Q6J022k49q39L40O53l32n74
$$ -534 300 503 -279 -548 273 610 -333 -630 437 576 -550 -464 558 309 -530 -190 463 131 -443
3853d43L58N62m36n41N42N20p20m15Q29L17r42k10R83J10r64q6J004j2r46O2Q95
$$ -443 -85 477 41 -500 42 562 -158 -573 256 573 -369 -579 404 514 -450 -536 468 456 -490 -428 467
3874D67j03q63J92P88k13p70L16P01m40o34N94N14o99l45P49K17p62j53Q16J05
$$ 467 364 -499 -307 481 268 -502 -186 515 75 -559 35 549 -150 -495 254 471 -291 -444 372 477
3894D77q64r9R42K1r73N9R67j70r01K23Q25k65p59K95P29l68o69N11N48o38l84
$$ 477 -387 -486 456 477 -496 -437 530 360 -541 -318 507 242 -517 -222 507 139 -530 -19 529 -109 -493
3915d93O53K65o97j52P07J40p47j25Q48M2r59O9J029k11r90L18Q72l90p12L60
$$ -493 160 425 -272 -424 283 423 -324 -449 399 441 -518 -449 580 369 -621 -303 569 179 -533 -173
3935a73O44l28o29L61O05m13n65N67M37o82l05P62J22q06J2Q32j19p95J52P95
$$ -173 471 143 -486 -125 480 67 -498 69 506 -176 -481 281 403 -403 -391 441 322 -473 -321 474
3955D74k24p37J88P89j92q38K56Q34l38q41N00P35o29n28O50L53o60j40N36J27
$$ 474 250 -487 -299 490 298 -540 -284 550 212 -629 -129 606 -23 -551 99 452 -208 -348 188 315
3975C15m96j46N24K12p38j04R28j17j002L46R53n20q04N66N95m64n25L45N65l00
$$ 315 -181 -327 197 409 -329 -433 495 378 -624 -278 675 155 -649 -83 512 48 -477 -132 433 133
3995A33o22L40O97n47n88P07L98q12j39P84m5p20J91O36k55n48K20N98j99o77
$$ 133 -489 -149 548 1 -587 120 518 -294 -433 351 306 -414 -223 413 158 -390 -170 428 229 -448
4015d48J76Q18l14q78M97Q50o73p13Q06M22p37k20N92J25m35j47L42K85m63l01
$$ -448 -272 546 232 -646 -149 701 28 -685 121 543 -194 -414 178 303 -132 -279 63 348 -115 -416
4035d16O64J71q91R0R96m69q10O57N95o73l78N12L21l02m82K51O63l53p70O16
$$ -416 248 419 -472 -382 614 145 -665 -8 587 -86 -464 48 369 67 -415 -164 499 146 -624 -8
4055hO65q14m05Q70J00p93J35O03k21m43J89L95j22m27L3O15j32p57L26Q51o14
$$ -8 657 -157 -562 308 408 -385 -250 353 132 -311 -122 273 151 -276 -243 372 240 -517 -191 660 46
4076D6p83Q21N67q65l34P76J30n60r3L88K21l39l77M49M17o91k32R06j19r30M79
$$ 46 -737 84 651 -214 -548 228 358 -202 -295 93 314 -25 -402 47 464 -227 -459 447 328 -602 -123
4097a23P34o78m10O58J85m63k13K93L94k35o63M06P78p04o44R38L40j011KQ41
$$ -123 611 -67 -477 181 366 -97 -310 -17 377 142 -521 -115 663 -41 -685 253 593 -418 -416 425
4117D25k08n49K17L14j02k70j6M20Mn93J21P37l66p51O81N92q82l67Q92J76p53
$$ 425 217 -332 -115 199 97 -173 -189 231 235 -358 -237 500 134 -617 64 656 -226 -593 299 475 -278
4138b78n2N09J07l70k69M18M10n70m50P99K47r32J14Q54m60o23O58L06n70j26
$$ -278 -330 179 286 -84 -353 65 475 -95 -545 254 501 -431 -317 537 77 -546 112 418 -152 -278
4158b78L60J13j68l52K48O04n24o94Q19N83j034k30R91p8p96K29N44j87l34OK93
$$ -278 82 195 27 -325 -77 527 3 -691 128 711 -323 -553 438 360 -436 -207 337 150 -184 -178 115
4179A15J26m25p9N87p4p56L81P04o47m94Q31J76q06J6O68l3n08p5L86K65m43l92
$$ 115 241 -184 -263 324 250 -506 -125 579 -68 -562 269 445 -361 -345 323 290 -218 -293 93 358 -85 -477
4201d77O81L34q97j26R71j85q24M41N28n60k11M55P5k31j76J35L54k06n33N11
$$ -477 204 538 -359 -485 486 301 -523 -82 446 -114 -325 130 205 -26 -202 -67 287 81 -452 59
4221E9N29q35l66J024O0r67J78P51k52m80J44L91Jm11j45N35J26o84Q9P53m19
$$ 59 588 -247 -613 411 471 -496 -318 433 181 -299 -155 236 237 -174 -319 216 342 -342 -253 500 81
4242H1o24O46L80p20j35O70n4n38R0M00M6m06k09N28L01p19k30R19j5r59K82Q22
$$ 81 -543 103 483 -237 -372 298 244 -294 -204 196 242 -164 -373 155 456 -263 -493 426 411 -548 -266 556
4264E56m69n35M93K24l01j38J46K12r7l85K09N48n26m46P71K16r19P9Q76l12o29
$$ 556 87 -448 45 269 -32 -170 -24 188 91 -294 -85 463 -63 -509 262 478 -441 -362 514 202 -427
4285d27K73M65j62l98J1M73O7o46K1P38j75p20L72O10n87l37O37J07n65J8M26
$$ -427 -154 311 149 -249 -238 235 302 -344 -323 415 240 -480 -108 502 -85 -422 215 322 -243 -225 201
4306B01k1l43o3L98J34n22j64P21Q3q82J23R01l63p60N15M99m46l44L24K49j67
$$ 201 180 -163 -226 172 306 -216 -380 341 424 -458 -335 566 203 -557 -42 457 11 -333 -9 240 73
4327G3l34J26M60k45n19N09L81p01j78Q11j25o83K83N23k93m00J76M23p0n18K5
$$ 73 -261 -135 325 80 -439 70 451 -250 -428 383 258 -425 -142 381 88 -312 -136 287 217 -301 -276
4348b76O64j08p71L34O87m68n24N05L53n15j83M59P1l78n0L48R6m26j06N26P5
$$ -276 388 280 -491 -157 530 62 -462 43 396 -119 -302 157 228 -150 -200 148 244 -182 -288 238 313
4369C13o68O3P36k24p35L68O53m64m84M22L93l39l58K54L86k20m87L37M88m91
$$ 313 -355 -292 444 220 -515 -147 506 42 -442 -20 373 34 -324 -70 316 96 -391 -54 434 -57
4389e7l68O29J34o46Q8N77k01m81K26L93j51m46J20N42j59o37K77O64m12o17N19
$$ -57 -425 204 338 -308 -220 357 156 -325 -99 294 143 -303 -183 359 200 -437 -160 504 92 -525 -6
4410fN01n44l49M75K64m42k27M40J81m44j19M49P1m95pN63j17n82K37N91l43n53
$$ -6 495 -49 -398 77 341 -101 -328 112 293 -151 -270 179 250 -245 -252 311 194 -388 -151 440 97 -456
4432d56M38M75m64m15M30L85l68m05L59M26l92m28N13K98n60j73N82J0n23Q4M65
$$ -456 -18 457 -7 -422 8 393 25 -380 -21 405 13 -415 98 396 -164 -337 245 255 -268 -184 281
4453B81j41m23J55M37k01m99K73N34l69n12M76M33n04l76N03L43n03l12N05K90
$$ 281 140 -283 -128 309 108 -391 -118 416 47 -465 11 444 -60 -436 67 410 -93 -405 100 390
4473C90n05k52N23J69n26m5M73k0m65J07M45j71m62K60M66l39m59M32M06n11l47
$$ 390 -115 -367 156 325 -201 -246 227 207 -258 -151 294 123 -339 -79 387 48 -411 21 427 -84 -431
4494d31N06L27n32k79N18K67n24k23N30K00n76j06N58J5n03N9M82j60m50K45M11
$$ -431 75 402 -130 -409 109 376 -148 -371 159 359 -217 -323 235 250 -253 -194 288 128 -322 -77 334
4515C34l09l78L85L46m48l07M58L10m71l26N15L16n38l40O66J78o81k4N64j1m90
$$ 334 25 -353 32 378 -70 -377 81 391 -80 -406 109 425 -113 -453 213 391 -290 -314 250 239 -251
4536b51M2M32r0l81R5L92j16m63K69M55m11m22N71K94o02k12O11J38n27j72N15
$$ -251 -209 223 133 -248 -153 239 123 -340 -71 384 -27 -449 122 416 -186 -398 213 351 -176 -348 167
4557A67J54m88j91N47J88o04j00O22l9n98J74N08k73m04L29L03l52k30L38K43
$$ 167 321 -167 -358 189 377 -227 -327 295 256 -342 -168 340 67 -337 -8 295 -57 -287 51 294
4577B94l82k56M01L29n03l49O71K10p34n6P27q1o13J59M54j14l78M3L87Lm76P3
$$ 294 -88 -344 57 386 -117 -466 205 415 -319 -375 352 271 -342 -183 271 157 -221 -178 209 212 -264 -191
4599a91N61k67n22M34L96n61k39O17R3n67m4N21N5m77j27M97J74n71j77O89O2
$$ -191 370 103 -419 15 411 -150 -389 228 321 -246 -290 231 286 -191 -318 179 353 -218 -395 294 356
4620C56p39R9O90k50n53L39L69l12k79L11J81k45j96K42K95l56l51N24L16p16
$$ 356 -383 -284 406 156 -397 -58 311 -1 -280 31 212 -33 -229 13 308 -48 -399 125 441 -275
4640b75j25P90j04p08K38N67k45m39J31L91j9m38k7N53l4o56K35O14m50m46N98
$$ -275 -400 390 286 -422 -184 383 138 -301 -170 221 202 -236 -263 290 256 -400 -165 449 -1 -447 151
4661A51J93n99K1M87q3l96K9L51J35m99j39O22J08p54M3Q04k32p45L89N42m25
$$ 151 344 -255 -234 253 170 -226 -197 154 289 -210 -349 273 381 -373 -330 474 242 -503 -114 428 3
4682Cl33L62K40k77k21J99K83k02l71L54L47n41k53P15N4p99K07O70l42m90L17
$$ 3 -330 32 272 -5 -226 -27 256 54 -317 37 384 -157 -410 305 359 -440 -233 437 95 -395 -78
$$ [...]
8191F8
##END NTUPLES=NMR FID
##END=
