##TITLE=1H_ES-Si-MeGlut
 
 8 sc, 
 9.4.2024
##JCAMPDX= 6.0         $$ Bruker NMR JCAMP-DX V2.0
##DATA TYPE= NMR FID
##DATA CLASS= NTUPLES
##ORIGIN= UXNMR, Bruker Analytische Messtechnik GmbH
##OWNER= root
$$ XWIN-NMR		Version 3.5
$$ Tue Apr  9 14:18:35 2024 Russian Standard Time (UT+4h)  she@DPX200
##.OBSERVE FREQUENCY= 200.1309
##.OBSERVE NUCLEUS= ^1H
##.DELAY= (6, 6)
##.ACQUISITION MODE= SIMULTANEOUS
##.ACQUISITION SCHEME= undefined
##.AVERAGES= 8
##.DIGITISER RES= 18
##SPECTROMETER/DATA SYSTEM= spect
##.PULSE SEQUENCE= zg30
##.SOLVENT NAME= CDCl3
##.SHIFT REFERENCE= (INTERNAL, CDCl3, 0, 15.7039)
##AUDIT TRAIL= $$ (NUMBER, WHEN, WHO, WHERE, WHAT)
$$ ##TITLE= Audit trail, XWIN-NMR		Version 3.5
$$ ##JCAMPDX= 5.01
$$ ##ORIGIN= Bruker BioSpin GmbH
$$ ##OWNER= she
$$ F:/spectra/data/she/nmr/H-F/1/audita.txt
$$ ##AUDIT TRAIL=  $$ (NUMBER, WHEN, WHO, WHERE, WHAT)
(   1,<2024-04-09 14:17:46.45 +0400>,<she>,<DPX200>,
      <created by zg, POWCHK disabled, PULCHK disabled
       configuration hash MD5:
       00 E9 B6 7A A2 85 ED C7 34 08 36 98 17 FE 4E 26
       data hash MD5: 16K
       98 DB BE 24 08 FE 4E 19 83 5A B1 BD 8A 0B C6 6D>)
$$ ##END=
$$ 
$$ hash MD5
$$ 95 D3 1D 5C 4A 92 7F DB 61 4F 8D B9 AF 73 42 D2
##$RELAX= 
##$RELAX= 
##$RELAX= 
##$RELAX= 
##$RELAX= 
##$RELAX= 
$$ Bruker specific parameters
$$ --------------------------
##$DU= <F:/spectra>
##$EXPNO= 1
##$NAME= <H-F>
##$PROCNO= 1
##$TYPE= <nmr>
##$USER= <she>
##$AMP= (0..31)
100 100 100 100 100 100 100 100 100 100 100 100 100 100 100 100 100 100 
100 100 100 100 100 100 100 100 100 100 100 100 100 100 
##$AQSEQ= 0
##$AQ_mod= 1
##$AUNM= <au_zg>
##$AUTOPOS= <>
##$BF1= 200.13
##$BF2= 200.13
##$BF3= 200.13
##$BF4= 200.13
##$BF5= 200.13
##$BF6= 200.13
##$BF7= 200.13
##$BF8= 200.13
##$BYTORDA= 1
##$CFDGTYP= 0
##$CFRGTYP= 5
##$CHEMSTR= <none>
##$CNST= (0..31)
1 1 145 1 1 1 1 1 1 1 1 1 1 1 1 1 1 1 1 1 1 1 1 1 1 1 1 1 1 1 1 1 
##$CPDPRG= <>
##$CPDPRG1= <>
##$CPDPRG2= <>
##$CPDPRG3= <>
##$CPDPRG4= <mlev>
##$CPDPRG5= <mlev>
##$CPDPRG6= <mlev>
##$CPDPRG7= <mlev>
##$CPDPRG8= <mlev>
##$CPDPRGB= <>
##$CPDPRGT= <>
##$D= (0..31)
0 1.2 0 0 0 0 0 0 0 0.06 0 0.03 0 0 0 0 0.0002 0 0 0 0 0 0 0 0 0 0 0 0 
0 0 0 
##$DATE= 1712657865
##$DBL= (0..7)
120 120 120 120 120 120 120 120 
##$DBP= (0..7)
150 150 150 150 150 150 150 150 
##$DBP07= 0
##$DBPNAM0= <>
##$DBPNAM1= <>
##$DBPNAM2= <>
##$DBPNAM3= <>
##$DBPNAM4= <>
##$DBPNAM5= <>
##$DBPNAM6= <>
##$DBPNAM7= <>
##$DBPOAL= (0..7)
0.5 0.5 0.5 0.5 0.5 0.5 0.5 0.5 
##$DBPOFFS= (0..7)
0 0 0 0 0 0 0 0 
##$DE= 6
##$DECBNUC= <off>
##$DECIM= 32
##$DECNUC= <off>
##$DECSTAT= 4
##$DIGMOD= 1
##$DIGTYP= 9
##$DL= (0..7)
0 120 120 120 120 120 120 120 
##$DP= (0..7)
150 150 150 150 150 150 150 150 
##$DP07= 0
##$DPNAME0= <>
##$DPNAME1= <>
##$DPNAME2= <>
##$DPNAME3= <>
##$DPNAME4= <>
##$DPNAME5= <>
##$DPNAME6= <>
##$DPNAME7= <>
##$DPOAL= (0..7)
0.5 0.5 0.5 0.5 0.5 0.5 0.5 0.5 
##$DPOFFS= (0..7)
0 0 0 0 0 0 0 0 
##$DQDMODE= 0
##$DR= 18
##$DS= 0
##$DSLIST= <SSSSSSSSSSSSSSS>
$$ [...]
##$SUBNAM2= <"">
##$SUBNAM3= <"">
##$SUBNAM4= <"">
##$SUBNAM5= <"">
##$SUBNAM6= <"">
##$SUBNAM7= <"">
##$SUBNAM8= <"">
##$SUBNAM9= <"">
##$SW= 18.0517689322627
##$SWIBOX= (0..15)
0 0 2 0 0 0 0 0 0 0 0 0 0 0 0 0 
##$SW_h= 3612.71676300578
##$TD= 16384
##$TD0= 1
##$TE= 0
##$TE2= 300
##$TE3= 300
##$TEG= 300
##$TL= (0..7)
0 120 120 120 120 120 120 120 
##$TP= (0..7)
150 150 150 150 150 150 150 150 
##$TP07= 0
##$TPNAME0= <>
##$TPNAME1= <>
##$TPNAME2= <>
##$TPNAME3= <>
##$TPNAME4= <>
##$TPNAME5= <>
##$TPNAME6= <>
##$TPNAME7= <>
##$TPOAL= (0..7)
0.5 0.5 0.5 0.5 0.5 0.5 0.5 0.5 
##$TPOFFS= (0..7)
0 0 0 0 0 0 0 0 
##$TUNHIN= 0
##$TUNHOUT= 0
##$TUNXOUT= 0
##$USERA1= <user>
##$USERA2= <user>
##$USERA3= <user>
##$USERA4= <user>
##$USERA5= <user>
##$V9= 5
##$VALIST= <valist>
##$VCLIST= <CCCCCCCCCCCCCCC>
##$VD= 0
##$VDLIST= <DDDDDDDDDDDDDDD>
##$VPLIST= <PPPPPPPPPPPPPPP>
##$VTLIST= <TTTTTTTTTTTTTTT>
##$WBST= 1024
##$WBSW= 4
##$XGAIN= (0..3)
0 0 0 0 
##$XL= 0
##$YL= 0
##$YMAX_a= 225157
##$YMIN_a= -184770
##$ZGOPTNS= <>
##$ZL1= 120
##$ZL2= 120
##$ZL3= 120
##$ZL4= 120
##$ABSF1= 10
##$ABSF2= 0
##$ABSG= 5
##$ABSL= 3
##$ALPHA= 0
##$AQORDER= 0
##$ASSFAC= 0
##$ASSFACI= 0
##$ASSFACX= 0
##$ASSWID= 0
##$AUNMP= <proc_1d>
##$AZFE= 0.1
##$AZFW= 0.1
##$BCFW= 1
##$BC_mod= 2
##$BYTORDP= 1
##$COROFFS= 0
##$CY= 11.3945322036743
##$DATMOD= 1
##$DC= 2
##$DFILT= <>
##$DTYPP= 0
##$F1P= 15.7292609196834
##$F2P= 12.9074282941183
##$FCOR= 0.5
##$FTSIZE= 0
##$FT_mod= 4
##$GAMMA= 1
##$GB= 0.15
##$INTBC= 1
##$INTSCL= 1
##$ISEN= 128
##$LB= 0.24
##$LEV0= 0
##$LPBIN= 0
##$MAXI= 10000
##$MC2= 0
##$MEAN= 0
##$ME_mod= 0
##$MI= 1.114404
##$NCOEF= 0
##$NC_proc= 0
##$NLEV= 6
##$NOISF1= 3.799351
##$NOISF2= 2.8
##$NSP= 1
##$NTH_PI= 0
##$NZP= 0
##$OFFSET= 15.70392
##$PC= 1
##$PHC0= -25385.34
##$PHC1= 14.98731
##$PH_mod= 1
##$PKNL= yes
##$PPARMOD= 0
##$PSCAL= 0
##$PSIGN= 0
##$REVERSE= no
##$SF= 200.130013532006
##$SI= 16384
##$SIGF1= 3
##$SIGF2= 2
##$SINO= 400
##$SIOLD= 16384
##$SREGLST= <1H.CDCl3>
##$SSB= 0
##$STSI= 0
##$STSR= 0
##$SW_p= 3612.71676300578
##$SYMM= 0
##$S_DEV= 0
##$TDeff= 0
##$TDoff= 0
##$TI= <>
##$TILT= no
##$TM1= 0
##$TM2= 0
##$TOPLEV= 0
##$USERP1= <user>
##$USERP2= <user>
##$USERP3= <user>
##$USERP4= <user>
##$USERP5= <user>
##$WDW= 1
##$XDIM= 8192
##$YMAX_p= 0
##$YMIN_p= 0
$$ End of Bruker specific parameters
$$ ---------------------------------
##NTUPLES= NMR FID
##VAR_NAME=  TIME,          FID/REAL,        FID/IMAG
##SYMBOL=    X,             R,               I
##VAR_TYPE=  INDEPENDENT,   DEPENDENT,       DEPENDENT
##VAR_FORM=  AFFN,          ASDF,            ASDF
##VAR_DIM=   8192,          8192,            8192
##UNITS=     SECONDS,       ARBITRARY UNITS, ARBITRARY UNITS
##FACTOR=    0.0002768,     1,               1
##FIRST=     0,             0,               0
##LAST=      2.2672688,     0,               0
##MIN=       0,             -184770,         0
##MAX=       2.2672688,     225157,          0
$$ Real data points
##PAGE= N=1
##DATA TABLE= (X++(R..R)), XYDATA
0@%%%%%%%%%%%qJ6j6J6j7K5l2M0m8N6p2Q2r8J20j36J52j76K08k40K72l12L55l99
$$ 0 0 0 0 0 0 0 0 0 0 0 0 -8 8 -8 8 -9 16 -16 24 -24 32 -40 42 -56 64 -72 80 -96 112 -128 144 -168 187 -212
34b12M52n12N76o42P18q04Q96r94J102j222J351j495J652j822K008k210K435k683
$$ -212 240 -272 304 -338 380 -424 472 -522 580 -642 709 -786 866 -956 1052 -1158 1277 -1406
52a406K956l260L600l985M419m912N487o163O968p946R168j0743J2861j5878K0549
$$ -1406 1550 -1710 1890 -2095 2324 -2588 2899 -3264 3704 -4242 4926 -5817 7044 -8834 11715
67A1715k8830M7857j70798m4714L21529O907r0042r6287m3943j7735P3888Q6054
$$ 11715 -17115 30742 -140056 -184770 136759 143666 53624 -42663 -86606 -104341 -30453 55601
79E5601Q7966l6031j55632q9776R1768R6303N4794J8519q8619j42111R521R5847
$$ 55601 143567 107536 -48096 -137872 -46104 50199 104993 123512 34893 -107218 -97697 -1850
91a850L9338J0348L534o8403p0925j321N7408Q7971L9580q9002r1465K2720M9280
$$ -1850 37488 47836 51370 -17033 -87958 -89279 -31871 56100 95680 6678 -84787 -62067 -12787
104a2787J8470M1057J9682m1304m3670k8139j424Q1703P9631n3395j06248k5280
$$ -12787 5683 46740 66422 25118 -18552 -46691 -48115 33588 113219 59824 -46424 -71704
116g1704L5810M9407L8274j4154m4458k5751j9412N301N8747L6972l1134l2828
$$ -71704 -35894 13513 51787 37633 -6825 -32576 -51988 -46687 12060 49032 17898 -14930
128a4930j7507j8568L4256P3562O335o0242l8057O148K8941K9301L578j1235j2737
$$ -14930 -32437 -51005 -16749 56813 63148 2906 -35151 -29003 -62 29239 32817 21582 8845
141H845l4799k0729M9404N3783k6227n7271j6479J7527K8808J9844j0141k1721
$$ 8845 -25954 -46683 2721 56504 30277 -26994 -43473 -25946 2862 22706 12565 -9156
153i156j0363n202J1085L4089J5105k4461k9868j1151J5511M1815K4229l1539
$$ -9156 -19519 -24721 -13636 20453 35558 11097 -18771 -29922 -14411 27404 51633 20094
165B0094m7988r159K9713L6147Q460k8443l0385m894P112J3451K5594J0843k7195
$$ 20094 -27894 -37053 -7340 28807 37267 8824 -21561 -26455 -19343 -5892 19702 30545 3350
178C350l6748o029K9407L6230O968k5921k4808l995P947J6278K1657O892j8317
$$ 3350 -33398 -39427 -10020 26210 33178 7257 -17551 -21546 -13599 2679 24336 31228 12911
191A2911k7712j4542J2781L1979J9227j3489k9761j9595J765J9508K2868J0310
$$ 12911 -14801 -29343 -16562 15417 34644 21155 -8606 -28201 -26436 -6928 15940 26250
203B6250r341k6379k7234J31L5539L8613K647l5216l8388o381K9101L6679J5497
$$ 26250 16909 -9470 -36704 -36573 -1034 37579 40226 5010 -33378 -39759 -10658 26021 41518
216D1518j4245l3974l0800l99L5919M2048P531l6047m6428j4389K8420M3151K1206
$$ 41518 27273 -6701 -37501 -37900 -1981 40067 47598 11551 -34877 -49266 -20846 22305 43511
229D3511j6242l9701l1439L660L7399L9716P214l1919m2239j4554K5511M1561
$$ 43511 27269 -12432 -43871 -40211 -2812 36904 44118 12199 -30040 -44594 -19083 22478
241B2478K1145j5629l6654k6477M544L0446L0546N256k4311l3254j4149J6463
$$ 22478 43623 27994 -8660 -35137 -30593 -147 30399 35655 11344 -21910 -36059 -19596
253a9596L1558J8954q905k7363k2040P65K1230K3441P482j3326k2486j3451O222
$$ -19596 11962 30916 22011 -5352 -27392 -26627 -5397 18044 25526 12200 -10286 -23737 -17515
266a7515K0457J8093J325j5961j9689p648J0104J9178J2534m405j7554j6505k403
$$ -17515 2942 21035 22360 6399 -13290 -20938 -10834 8344 20878 16473 -1081 -17586 -19989
279a9989J3686J8524P747r837j8928j2025N158J7934J5205m33j4974j6359l821
$$ -19989 -6303 12221 19968 10131 -8797 -20822 -15664 2270 17475 17042 2068 -14291 -18112
292a8112J2227J7586P416q818j6649j0074N243J5450J1231k840j3407j1956l10
$$ -18112 -5885 11701 19117 10299 -6350 -16424 -11181 4269 15500 12660 -747 -12703 -13013
305a3013J1195J1811J531r291j1089l038P618J0617L356o247q962l347N257Q840
$$ -13013 -1818 9993 11524 2233 -8856 -11894 -4276 6341 9697 3450 -5512 -8859 -3602 5238
319E238L624m966q009l367M368Q054L630m678q117l689L807P822M522l513q327
$$ 5238 8862 3896 -4113 -7480 -3112 4942 8572 3894 -4223 -7912 -4105 3717 8239 4726 -3601
334c601n311K387P957O623j056p842p164p0O815P847K164n296p855l752L179P523
$$ -3601 -8912 -6525 1432 8055 6999 -843 -8007 -8077 -1262 6585 8749 3453 -4402 -8154 -4975 2548
350B548N883r05p053p131j399N163P473L712l011p283n983j76O090Q053L537m575
$$ 2548 8431 7526 473 -6658 -8057 -2894 4579 8291 5280 -2003 -7986 -8162 -2072 5981 9518 4943
366D943r259o251K302R362Q946Q23q214j0462m308N750J1918Q320l311j2642j1259
$$ 4943 -4316 -10567 -8265 1097 10043 10866 2652 -7810 -12118 -6368 5550 13870 10559 -2083 -13342
381a3342L9J1940J3623K768j0453j4097o292O688J4607J0122l590j4072j2666
$$ -13342 -13303 -1363 12260 15028 4575 -9522 -15814 -9126 5481 15603 12013 -2059 -14725
394a4725l62J3138J5116L023j1115j4681o183P461J4780Q696m520j2550j0420
$$ -14725 -15087 -1949 13167 16190 5075 -9606 -15789 -8328 6452 15148 10628 -1922 -12342
407a2342k81J0564J2208L106p920j2219o740N460J2581P097l451q801p387j081
$$ -12342 -12623 -2059 10149 13255 5335 -6884 -13624 -8164 4417 11514 8063 -738 -8125 -9206
421i206O157Q054L961k600q132p228J419Q116O179M92m273o466l461K267N189
$$ -9206 -3049 5005 8966 6366 -1766 -8994 -7575 541 6720 7212 2939 -3527 -6988 -4721 468
436D68M883J752m441p717l198L847P345N228k266q090m935J808M555M631K674
$$ 468 5351 7103 2662 -5055 -8253 -4406 2939 8167 5901 -2189 -7124 -5316 -761 3870 6544
451F544k418o406m921R05P444P647j648r168n282K555N157L665N14k716l940k669
$$ 6544 4126 -2280 -7201 -6296 1148 8795 7147 -2021 -7303 -4748 409 4074 4588 1872 -2068 -4737
467d737O07N172M853k053o010k395J947L428K682q91l723j567J787J794L03p24
$$ -4737 -4130 1042 5895 3842 -2168 -4563 -2616 812 3494 2603 -1120 -2687 -900 894 1197 473
483D73p24J46k53q07J589K382k248m255J216N065J365l710l752O23L717J616j472
$$ 473 -251 -105 -358 -1165 424 2806 558 -3697 -2481 2584 3949 239 -3513 -2890 827 2443 971
500I71p83lj689j099K186L001N69k276l445j120K864L490N33k097k715j065J564
$$ 971 188 185 -1504 -2603 -417 2584 3153 877 -2568 -3688 -824 2666 3199 1102 -1613 -2678 -1114
517a114J776J54L54P40j695l239l21L629L378r26l777j401J800M83j180J636L457
$$ -1114 662 816 1170 1910 215 -3024 -3345 284 3662 2736 -1041 -2442 -642 -159 -1339 297 3754
534C754o96n105l066K634N028J873k272l192j879k64J943L686J850j878l889k988
$$ 3754 3058 -2047 -5113 -2479 2549 4422 2150 -1042 -2921 -3185 -1242 2444 4294 2416 -1473 -4461
550d461J77M293N343N07n787o088L65N986M461q71l056k267j894q25L262N719
$$ -4461 -4284 9 5352 5859 72 -6016 -5651 335 4796 3925 869 -1398 -3292 -4117 -855 4864
566D864J338n696o326L68N817L978j040k868j831r78k11J862L225J309k354l819
$$ 4864 6202 506 -5820 -5452 365 4343 3303 435 -1396 -2374 -2585 -723 2502 3811 1457 -2362
582b362j504K161L547J499j716k729r17J014Q28J50J010J514r52l693j876K933
$$ -2362 -3866 -1705 1842 3341 1625 -1104 -2021 -1007 -179 -29 981 2495 1543 -2150 -4026 -1093
598a093M135J21l144j808O73M50l28J251K524j00l815k982J715M143J711j792
$$ -1093 3042 3163 19 -1789 -1116 -666 -994 257 2781 2681 -1134 -4116 -2401 1742 3453 1661
614A661k581j129L98J190J560J026n94k068j853J45K342K533l4k828k446P36K580
$$ 1661 -920 -2049 -1651 -461 1099 2125 1531 -537 -2390 -2245 97 2630 2596 -232 -2678 -1942 638
631F38J108j036r92J75m1q37J44J704R22j425j781L01J667M26j197o14J021Q77
$$ 638 1746 710 -282 -107 -148 -985 -841 863 1785 360 -1421 -1120 547 973 -224 -838 183 1060
649A060p32j246j31J005R20m5p31n90j85K0M87Q85M88n20j389j081O90K129J076
$$ 1060 328 -918 -1049 -44 876 831 100 -490 -675 -655 -168 717 1205 685 -704 -1785 -1095 1034 2110
668B110j292j942m60J068J102K23j69j43p39j135K01J766J085q27j513n36O84
$$ 2110 818 -1124 -1584 -516 586 809 640 497 -242 -1377 -1176 590 1675 848 -665 -1201 -517
685e17R14J05l22J9j3n10l53K38O25O28j16q95n31K83L05J94M33K77m17r13p07
$$ -517 397 502 180 199 186 -324 -677 -439 186 814 698 -197 -728 -445 -140 54 487 764 347 -566 -1273
706a273M76J604Q53r02j473o25L94J113R73J1p60j076q44M68J793J118p31j652
$$ -1273 -797 807 1660 758 -715 -1340 -946 167 1140 1151 391 -685 -1529 -1061 732 1850 1119 -533
724e33j104L59J508J121k19r20r43n33N07J275O82l45r93r68L3J106Q37j44n05
$$ -533 -1637 -1278 230 1351 1132 212 -731 -1264 -757 518 1200 855 -138 -1106 -1073 33 870 726 221
743B21m97l58J53M46L43K79j04o60m55J83L79L81L24j63n84m42j50L57Q77N24
$$ 221 -276 -634 -481 -35 308 587 483 -177 -632 -449 -70 311 635 472 -112 -554 -704 -347 530 1054
763A054n12r57n60J50R25R08k7q61q75l74N33J209O29m95j077p85J04J049R95
$$ 1054 542 -415 -975 -825 100 1008 981 120 -755 -1129 -596 613 1242 747 -330 -1115 -1011 38 1033
782A033l5q20q94l23N59R90M43l56p70o09K7P24O68K9m15n31l07K01M99K99J6
$$ 1033 998 178 -716 -1039 -480 510 953 597 -173 -782 -755 -31 637 666 251 -280 -587 -386 113 412 428
803D28k23l75k68J02L21L06J71j74m44l32L1L59M77K42l31o12l59J76O07N81j
$$ 428 205 -170 -438 -336 -15 291 462 288 -156 -488 -457 -98 379 621 290 -322 -681 -505 102 683 682
824F82o31o79j47N00P41L47l75p39m79J90O99O22k6o48o63q8N12O40K28l85n87
$$ 682 51 -628 -775 -275 466 813 438 -301 -780 -590 109 731 705 57 -606 -694 -182 458 686 301 -286
845b86k43J85M42L46m6l61l42n2K34L10R4j80j93l8M8J7K5O1Q9L6j23j91n2J36
$$ -286 -529 -344 98 444 398 37 -305 -357 -123 187 281 101 -92 -130 -82 -65 -40 21 110 146 23 -168 -220 -84
869h4J58J25K4j74k65j09J51L74K83j95n04k54K03M02K82r2l37k51n6J47L27K72
$$ -84 74 199 223 49 -216 -325 -174 200 483 288 -216 -470 -267 135 417 325 -12 -263 -319 -172 155 427
891D27j29m35k69J23L65K54j15k63j20J9J7Q9J43P9n9j87j90M2K26J36rn3q0j64
$$ 427 298 -137 -406 -283 82 336 221 -42 -162 -143 -126 -37 106 185 126 -61 -251 -209 17 153 144 91 11 -153
915a53j30P5L53L26j12n46l70K03N06L18o3l39l75j57J59M97M54j31o48n43J14
$$ -153 -283 -208 145 471 359 -187 -557 -354 152 470 407 68 -307 -464 -305 192 646 515 -133 -676 -562
936e62O44N49n1n31n24r6L54M86K55j42m51m52n1M61O33J22n34n79n1M00L41Q0
$$ -562 82 631 580 49 -475 -571 -217 269 524 382 -69 -521 -572 -111 522 644 110 -469 -520 -120 221 301
958C01o4j28l07k38J58M92L13k32m54k11J41K41J70Q0n8k00k63j06K27M11K16
$$ 301 237 109 -198 -436 -278 214 527 295 -159 -370 -229 12 182 262 204 4 -259 -365 -138 273 489
979D89k64n02k30K67M43J83j47k56j91j52O9M11M18j10o35m27K62O12K39k37l16
$$ 489 225 -277 -507 -240 203 386 239 -17 -208 -360 -291 120 538 428 -207 -634 -372 240 479 242 -74
1000g4j47o1R5L00K79p8m14l14J25L96K67j21l07j91O8K25R7o9p4J5n1j00L6K11
$$ -74 -221 -282 -187 113 392 314 -100 -414 -289 107 374 253 -54 -245 -177 48 145 76 2 17 -34 -134 -98 113
1024A13Q8k04j92J14K36n7k51j4K61R9j89j79O2J59K1n7K3M2r5j23L6J72R9m6
$$ 113 201 -3 -195 -81 155 98 -153 -167 94 193 4 -175 -113 46 67 10 33 75 -20 -143 -107 65 164 118
1048A18j66j22L9J98J27r6j62oP8j4p7Q6J66k5k52j27J73K08n2j25M0O0j41j47
$$ 118 -48 -170 -131 67 194 98 -64 -70 8 -6 -83 3 169 144 -108 -235 -62 146 94 -31 9 69 -72 -219
1072b19R8K92J00k03k76n3J63J93J27m4j94j84m3J46K38J88q4l44l13R4M37L41
$$ -219 -121 171 271 68 -208 -261 -98 95 222 178 -16 -200 -243 -97 141 329 245 -99 -412 -318 119 460
1094D60j42m07k14O5J83K03J62l6l18l75L8M48L87j05m13k67M4K17K32J12q0k48
$$ 460 318 -89 -303 -238 -55 148 310 274 -44 -419 -381 67 454 349 -64 -331 -287 -70 162 274 194 -54
1116e4k29kK36L03O9k32l04j04J77K77J01r9j39j22p0L6K17K20k4k83k53N2K76
$$ -54 -283 -285 -49 254 323 91 -213 -317 -140 137 238 139 0 -122 -192 -156 61 281 257 -26 -279 -227 49
1139D9J66k4j07j31j38j8J80K45Q0k28k95o9J87K59J09j30k24j51M5J72J80O4
$$ 49 215 191 84 -47 -185 -203 -23 222 302 74 -221 -290 -103 156 265 135 -89 -240 -195 -23 157 221
1161B21j42k39j14J30K57J52j28k47j01J06J42Q3mq1j01p1N1J59R9q3j62l8Q0
$$ 221 79 -160 -274 -144 113 265 137 -110 -211 -105 37 120 116 35 -66 -137 -86 73 172 89 -73 -111 -31
1184c1Q9K1n1m9mJ1J0J0J1Jl8j1K1L8j1n0k5M9O1k0o5l3K9M2M6k5j1j9k8j0L6
$$ -31 58 79 28 -21 -25 -14 -4 6 17 18 -20 -31 -10 28 17 -33 -58 -9 52 32 -33 -66 -37 5 51 26 15 -4 -32 -42 -6
1215fO6J4n6o5qN1N2J0nk7m9l2J0P1O9jr7r4OO8Q9L5m4q9q2j6J08J28M2j12j57
$$ -6 60 74 18 -47 -55 -4 48 58 53 26 -23 -55 -45 26 95 94 -3 -97 -91 -23 66 101 57 -32 -114 -130 -22 106 148 36 -121
1246a21o9Q0J92R2o5j49j32J0J40J65O3j21j99j12J16K04J24n5j86j54OJ62J72
$$ -121 -190 -110 82 174 109 -40 -172 -162 -22 143 206 85 -114 -226 -110 94 218 163 -23 -177 -171 -9 163
1269A63N0j22j95r7O2J91J35k6j80j48mJ24J59O2r0j39j18K9J37J23J7j05j27
$$ 163 213 91 -104 -201 -139 52 187 161 -19 -167 -171 -47 112 174 84 -55 -173 -144 -7 116 133 28 -99
1292i9o0N9J45J02k7j10j08l6P4J34R7o9j33r5KJ31J27J2p9j42o1M7J24J03l6
$$ -99 -159 -100 45 147 120 10 -98 -134 -60 74 171 102 -31 -126 -124 7 134 146 67 -75 -136 -89 35 138 102
1317A02j03j25j0J00J34L5q5j22n9N0J03P6j1q4j02j1Q2R4L8p0r3l2M4P6M3qp9
$$ 102 -1 -126 -136 -36 98 133 48 -74 -133 -83 20 96 85 1 -101 -112 -30 64 102 32 -61 -93 -49 27 70 62 -17
1344a7k7kL6N7Jl2m1j0J3M4J8l1j0j6J4J7nk4ORnPrMk1kJ8K1%j8k6oJ9K7Mj5n
$$ -17 -44 -46 -10 47 48 16 -25 -35 -22 22 40 9 -1 -17 -3 14 9 -15 -9 0 -5 2 -7 -3 -24 -26 -8 13 13 -5 -31 -37 -18 9 13 -2 -7
1381gk2OLL4J8ok7m4K0L9K8j6mm1k3J3L8M8Qn7o3k6O0P0J9m3o6l2PN6O6Nn1p8
$$ -7 -29 -23 -20 14 32 26 -1 -45 -25 14 42 26 22 -19 -42 -29 9 57 65 8 -55 -81 -21 49 68 25 -41 -73 -66 -10 56 61 10 -68
1415f8m4O1R2M6m4j03m6L7R2N2Qn2r2m3N2R8O5l8j04n8J4P8P7kn0p1k9K6O6O1
$$ -68 -112 -51 41 87 43 -60 -106 -69 23 75 83 31 -61 -104 -52 46 111 73 -31 -89 -75 3 80 78 28 -43 -72 -46 20 81
1445H1ro8r5JO5Q4J6n5o7k3RM6N9K3l7q8l7M2R0L5k4n4m1j0M5N2M1k8o2n5J0O5
$$ 81 72 4 -91 -90 -25 59 75 20 -47 -70 -61 -15 44 67 30 -58 -95 -53 37 72 48 -6 -47 -57 -12 40 81 53 -9 -64 -54 11
1477A1O5mn7o4j4N0M9L5k4m5n2pM3O7J0n1o5k0M9N8Mj8k2l7%J4M5J1j6m7k1L5
$$ 11 76 72 15 -49 -63 -13 36 71 47 2 -50 -57 -14 53 63 12 -53 -73 -24 34 38 20 -2 -39 -39 -25 20 31 15 -32 -53 -18
1509a8L1J7j7qqnJ0QPQj2k2%J8J8ql4PK7pk0pPJ5pj9J3Ljj9%K2J0j1j5%PJ5lp
$$ -18 13 30 13 5 -3 -8 2 10 17 25 13 -9 -9 9 27 19 -15 -8 19 12 -8 -15 -8 7 0 -19 -6 -3 -4 -23 -23 -1 9 -2 -17 -17 -10 5 2 -5
1549ePj0PJJJ6Rpl2pL2K0mk7j1j0QJ9K1Nj9l5oJ6L6J5l6k4j8J1J0L0Nj5m3pL1
$$ -5 2 -8 -1 0 1 17 26 19 -13 -20 12 32 28 1 -10 -20 -12 7 28 33 14 -21 -27 -11 25 40 4 -20 -38 -27 -17 13 18 3 -40 -47 -16
1586a6K0L2j6m6k8J5M5L3j6j7l0JJ1K8M2j3m0l3KL1L0oj9j5k2J0J9L6nk6k9pJ2
$$ -16 4 36 20 -26 -54 -39 6 39 23 6 -24 -23 -12 16 58 45 5 -28 -26 5 35 29 10 -5 -27 -17 2 38 33 7 -22 -29 -17
1619a7K0J1j3k1k2J0J7K4Lj4j4k4J6J5L2jl0j9kL0J3NMk3k0jK9K0Nk8j7j4J8K6
$$ -17 3 14 1 -20 -42 -32 -15 9 12 -2 -16 -40 -24 -9 23 22 -8 -27 -29 1 14 19 23 0 -20 -21 8 28 33 5 -12 -26 -8 18
1653A8Qrk2k4J0J8J6Nj9j8j7J3J8J5j9npmJ8J3kronJJ2ljNrJ4nNLNQj4j7J6o%
$$ 18 26 17 -5 -29 -19 -1 15 20 1 -17 -34 -21 -3 12 -7 -12 -19 -23 -5 8 6 -3 -9 -14 -13 -1 -4 -5 0 -9 5 0 5 8 13 21 7 -10 6 0 0
1694@j0PjMnJ3j9jJ5j6jLLJJj1OMllQjNKpQpJ3ojOpKj2K3J0j2mj0lOQJ3k1mmj1
$$ 0 -10 -3 -4 0 -5 8 -11 -12 3 -13 -14 -11 -8 -7 -6 -17 -11 -7 -10 -13 -5 -6 -1 1 -6 2 -5 8 2 1 7 0 2 -10 13 23 11 7 -3 -6 0 8 21 0 -4 -8 -19
1741a9QJ9Pqj9mNoK5qqk3JJ9J4j2Mmj0jK0J8qqrJ5qMMPj7okJ9Qm%j1k1NJ9Kkk
$$ -19 -11 8 15 7 -12 -16 -11 -17 8 0 -8 -31 -30 -11 3 -9 -5 -9 -19 -20 0 18 10 2 -7 8 0 4 8 15 -2 -8 -10 9 17 13 13 2 -19 -14 5 7 5 3
1785Cj4oQJ2lPk7MNj2J8lqLkNJ3L%pnnJJ7Qljj2kJ2MJ0j3nkjJkQj2kNjkmJ2j1
$$ 3 -11 -17 -9 3 0 7 -20 -16 -11 -23 -5 -8 -16 -13 -15 -10 3 6 6 -1 -6 -11 -10 7 15 12 11 -1 -3 9 13 23 10 5 3 2 3 1 9 -3 -5 0 -1 -3 -7 5 -6
1832frNNJLrmmQPRpLj3pJ3J0jJlJoOJ1jolJ8j3kqJ4pRj2j0RplRlkoM%nlJjJJ3
$$ -6 -15 -10 -5 -4 -1 -10 -14 -18 -10 -3 6 -1 2 -11 -18 -5 5 4 5 2 3 -3 3 14 13 7 4 22 9 7 -1 13 6 15 3 -7 2 -5 -8 1 -2 -4 -10 -6 -6 -11 -14 -13 -14 -13 0
1883@pj2J0NpPknmK6j0qRqJ1JoPlOj0J2PpoqjkKRq%qmJ1MpLKoLrJ3rKNkM%QrL
$$ 0 -7 -19 -9 -4 -11 -4 -6 -11 -15 11 1 -7 2 -6 5 6 0 7 4 10 0 12 19 12 6 -2 -3 -5 -3 6 -2 -2 -10 -14 -3 1 -6 -3 -1 -7 -4 -13 0 -9 -7 -2 -4 0 0 8 -1 2
1935BmnJ1%QjnMnJ1kLjorKmlLpkNl%JmKqJ0NkoqkjK1j0LkMJQQplrQjNlJ1ojJj0
$$ 2 -2 -7 4 4 12 11 6 10 5 16 14 17 16 10 1 3 -1 -4 -1 -8 -10 -5 -8 -8 -7 -11 -9 -17 -7 -2 -4 -10 -18 -20 -21 0 -10 -7 -9 -5 -4 4 12 5 2 -7 1 0 5 2 13 7 6 7 -3
1990cJ0%%kqrJ2%mKokKJ%JrQOj2jNOnpK1j5MRoLoQkMN%kkLjnkQj8NLJkrPnlNr
$$ -3 7 7 7 5 -3 -12 0 0 -4 -2 -8 -10 -8 -7 -7 -6 -15 -7 -1 -13 -14 -9 -3 -8 -15 6 -9 -5 4 -2 1 -5 3 1 5 10 10 8 6 9 8 3 1 9 -9 -4 -1 0 -2 -11 -4 -9 -12 -7 -16
2045a6RkkNJJ0qoOpPoMjRqONrJ2rJ2jj5PkJQ%J0j9Nn%QpMokPJr%oNpkJ4j2Mkj
$$ -16 -7 -9 -11 -6 -5 5 -3 -9 -3 -10 -3 -9 -5 -6 3 -5 1 6 -3 9 0 12 11 -4 3 1 2 10 10 20 1 6 1 1 9 2 6 0 -2 5 6 -3 -3 -9 -4 -11 -13 1 -11 -7 -9 -10
2097a0JNnQMnJ3j9J0J3jKnqk%PMljj3RPJKqJlj3OqKpPnRKn%J4j6mJ2%Lj1MjJ6
$$ -10 -9 -4 -9 -1 3 -2 11 -8 2 15 14 16 11 3 1 1 8 12 9 8 -5 4 11 12 14 6 7 4 -9 -3 -11 -9 -16 -9 -14 -5 -3 -8 -8 6 -10 -14 -2 -2 1 -10 -6 -7 9
2146IkkNrPpQLoloJ6q%J3j3MjjMj4MnKkJjLoKjn%ROpj1KKMNR%lpOMNkMqmljJ5
$$ 9 7 5 10 1 8 1 9 12 6 3 -3 13 5 5 18 5 9 8 7 11 -3 1 -4 -2 -4 -3 -4 -1 -7 -5 -6 -11 -11 -2 4 -3 -14 -12 -10 -6 -1 8 8 5 -2 4 8 13 11 15 7 3 0 -1 14
2201A4%oj2mLOjrjKMokMjKNmOqRj0pJ4MKplkJJ5oJ7orRmLqJjJ0rlMoNQlj3nKK
$$ 14 14 8 -4 -8 -5 1 0 -9 -10 -8 -4 -10 -12 -8 -9 -7 -2 -6 0 -8 1 -9 -16 -2 2 4 -3 -6 -8 -7 8 2 19 13 4 13 9 12 4 5 4 14 5 2 6 0 5 13 10 -3 -8 -6 -4
2254djrJ0nnOnQJmRpQpJ1knj0NNjkRJnLLj0K0qpKQj8NOKOj5nQQj7%PnoPj1MlO
$$ -4 -5 -14 -4 -9 -14 -8 -13 -5 -4 -8 1 -6 2 -5 6 4 -1 -11 -6 -1 -2 -4 5 6 1 4 7 -3 17 9 2 4 12 -6 -1 5 7 13 -2 -7 1 9 -8 -8 -1 -6 -12 -5 -16 -12 -15 -9
2306iOmlNN%nJ1j4QL%nKNOJMj3%KlrOLLmrOpQoJ6j6J8j7lONomkLLOoKLmMKkNK
$$ -9 -3 -7 -10 -5 0 0 -5 6 -8 0 3 3 -2 0 5 11 12 16 3 3 5 2 -7 -1 2 5 1 -8 -2 -9 -1 -7 9 -7 11 -6 -9 -3 2 -4 -8 -10 -7 -4 2 -4 -2 1 -3 1 3 1 6 8
2360HnjRj1J6j2NMojjQnqKJj7J6Kj2OkKKj0J2j3J1j5KN%kRjkOkJ0j3j0OLMJ1n
$$ 8 3 2 11 0 16 4 9 13 7 6 5 13 8 0 2 3 -14 2 4 -8 -2 -4 -2 0 -10 2 -11 0 -15 -13 -8 -8 -10 -1 -2 -4 2 0 10 -3 -13 -7 -4 0 11 6
2406Fk%NPlKj1Oj1R%j2J1j3J2j2J1omMoJj%KkpMKRnqJ5%%K%Qj7J4rJ5nnRpMjl
$$ 6 4 4 9 16 13 15 4 10 -1 8 8 -4 7 -6 6 -6 5 -1 -5 -1 -7 -6 -7 -7 -5 -7 -14 -10 -8 1 -4 -12 3 3 3 5 5 13 -4 10 1 16 11 6 15 8 12 11 8
2455HorJ1nJljl%kJ1kMlrKqJOjmJ2j6J0NmJ1j0PL%Mj0NljRPkPj5nJ3lj1Om%j1
$$ 8 2 -7 4 -1 0 -3 -4 -7 -7 -9 2 0 4 1 -8 -6 -14 -13 -7 -8 -12 0 -16 -6 -1 -5 6 -4 3 6 6 10 0 5 2 1 10 17 15 22 7 2 15 12 1 7 3 3 -8
2504hlRklKMPrLnkLj0LqJ7oPkkN%MmoLLNJ2ojkkLj4J6Pj8%mRnkJ0oj5KJQMpJ3
$$ -8 -11 -2 -4 -7 -5 -1 6 -3 0 -5 -7 -4 -14 -11 -19 -2 -8 -1 -3 -5 0 0 4 0 -6 -3 0 5 17 11 10 8 6 9 -5 11 18 0 0 -4 5 0 -2 8 2 -13 -11 -10 -2 2 -5 8
2556Hj7lQmMmpON%J1j0J0pmNlJ2rmP%j2J5kJkLjmKLj3jRmmkJ0nmloLQ%olRkoP
$$ 8 -9 -12 -4 -8 -4 -8 -15 -9 -4 -4 7 -3 7 0 -4 1 -2 10 1 -3 4 4 -8 7 5 6 4 7 6 2 4 7 -6 -7 2 -2 -6 -8 2 -3 -7 -10 -16 -13 -5 -5 -11 -14 -5 -7 -13 -6
2608fJJ1j1OLm%mnJ1lnQlQoKj4J0kkPokKj0lNLlpNoPpRrJ9j3nJ6n%QpQpjP%Mj
$$ -6 -5 6 -5 1 4 0 0 -4 -9 2 -1 -6 2 -1 7 1 3 -11 -1 -3 -5 2 -4 -6 -4 -14 -17 -12 -9 -12 -19 -14 -20 -13 -20 -11 -20 -1 -14 -19 -3 -8 -8 0 -7 1 -6 -7 0 0 4 3
2660CkjJ1rNjNo%QqJJlrMmlJ0j1mJ3oJ1okmllLKnJ0LKj0kMpJ5%KNj2QKomJ4oj
$$ 3 1 0 11 2 7 6 11 5 5 13 5 6 7 4 -5 -1 -5 -8 2 -9 -13 0 -6 5 -1 -3 -7 -10 -13 -10 -8 -13 -3 0 2 -8 -10 -6 -13 2 2 4 9 -3 5 7 1 -3 11 5 4
2711DKlj2PJj0J6pn%OJKqkk%nMRmMqMoPLj%J5rNKNmrQjklmJ5j5J0mj0J1j0rPL
$$ 4 6 3 -9 -2 -1 -11 5 -2 -7 -7 -1 0 2 -6 -8 -10 -10 -15 -11 -2 -6 -2 -10 -6 -12 -5 -2 -3 -3 12 3 8 10 15 11 2 10 9 7 4 0 15 0 10 6 -4 7 -3 -12 -5 -2
2762bpj1K0l%mmnKNnJ4j0NnJ%PkNLkN%LmqJ1pnJ1nqPmj%J0omJmNKpKqMnJ4j2J0
$$ -2 -9 -20 0 -3 -3 -7 -11 -16 -14 -9 -14 0 -10 -5 -10 -9 -9 -2 -4 1 4 2 7 7 10 6 -2 9 2 -3 8 3 -5 2 -2 -3 -3 7 1 -3 -2 -6 -1 1 -6 -4 -12 -8 -13 1 -11 -1
2814aojPmN%pJ3rMNJJpJ1j1jJ0Kj4J2pNnNrkKjoRkJpj1PJpOJ1j5OPMj2LjNj1M
$$ -1 -7 -8 -1 -5 0 0 -7 6 -3 1 6 7 8 1 12 1 0 10 12 -2 10 3 8 3 8 -1 -3 -1 -2 -8 1 -1 0 -7 -18 -11 -10 -17 -11 0 -15 -9 -2 2 -10 -7 -8 -3 -14 -10
2864a0jJ4rPJ0j3RMj0J3j2RLqJ%LrNj3J1jkOpln%%%ojNJ2j2RMj6RlLLj5J4PJj
$$ -10 -11 3 -6 1 11 -2 7 11 1 14 2 11 14 6 7 7 10 1 6 -7 4 3 1 7 0 -3 -8 -8 -8 -8 -14 -15 -10 2 -10 -1 3 -13 -4 -7 -4 -1 -16 -2 5 6 5
2911E%NkjLJLpOj4J8rKj0QllOj3PjpKjJnLrJ7kklLkoNQpP%lOkJ%RJKqOlqkpJ3
$$ 5 5 10 8 7 10 11 14 7 13 -1 17 8 10 0 8 5 2 8 -5 2 1 -6 -4 -5 -4 -9 -6 -15 2 0 -2 -5 -2 -4 -10 -5 3 -4 3 3 0 6 4 5 5 14 15 17 9 15 12 4 2 -5 8
2966Hm%J1j8RKo%jJkrkNlJJ0pllMJ9j4Mjj1P%NJ0q%OknQNj1LjKJj1J0rJQnjJk
$$ 8 4 4 15 -3 6 8 2 2 1 2 0 -9 -11 -6 -9 -8 2 -5 -8 -11 -7 12 -2 2 1 -10 -3 -3 2 12 4 4 10 8 3 11 16 5 8 7 9 10 -1 9 0 1 9 4 3 4 2
3017BpLMk2J8oKjLpJ0mOrMlJ4%jNlm%QJqMOllPj2lPmmQpNj5%RoNoQj0joOkLKM
$$ 2 -5 -2 2 -20 -2 -8 -6 -7 -4 -11 -1 -5 1 -8 -4 -7 7 7 6 11 8 4 4 12 13 5 9 15 12 9 16 4 1 8 4 0 8 1 6 -9 -9 0 -6 -1 -7 1 -9 -10 -16 -10 -12 -9 -7 -3
3071cqJ0pPNj1J6j2OKlNpOlKJJjP%j0LjlKj2PkqQKlnLJkLj0MOj9J1MLJ2j2LLk
$$ -3 -11 -1 -8 -1 4 -7 9 -3 3 5 2 7 0 6 3 5 6 7 6 13 13 3 6 5 2 4 -8 -1 -3 -11 -3 -1 -4 -9 -6 -5 -7 -4 -14 -10 -4 -23 -12 -8 -5 7 -5 -2 1 -1
3121aNRnrNNJ0o%Mpll%OJj2Jn%jlJ2Kj1nQPj7PNk0PJJ2pL%OOpJNMp%oJ2L%mol
$$ -1 4 13 8 -1 4 9 19 13 13 17 10 7 4 4 10 11 -1 0 -5 -5 -6 -9 3 5 -6 -11 -3 4 -13 -6 -1 -21 -14 -13 -1 -8 -5 -5 1 7 0 1 6 10 3 3 -3 9 12 12 8 2 -1
3174aJ1LqOOj6Polmj1K1rNkonJJOlkoPkkJ0PJj2jJ6qJ1pkQj7NLOlOpkNJmj%rl
$$ -1 10 13 5 11 17 1 8 2 -1 -5 -16 5 -4 1 -1 -7 -12 -11 -10 -4 -7 -9 -15 -8 -10 -12 -2 5 6 -6 -7 9 1 12 5 3 11 -6 -1 2 8 5 11 4 2 7 8 4 3 3 -6 -9
3226iJkPrNJJ0pNpNpj%J3j3QrLPN%lKJ0pmKMlRMrlL%noKQrJj0MjNoPLj5OJmJj
$$ -9 -8 -10 -3 -12 -7 -6 4 -3 2 -5 0 -7 -8 -8 5 -8 0 -9 -6 1 6 6 3 5 15 8 4 6 10 7 16 20 11 8 11 11 6 0 2 10 1 2 -8 -4 -5 0 -6 1 4 -11 -5 -4 -8 -7 -8
3281hpJ1Pk1J0J3rRpK%oJ0oJRJJ0k1K5j6oJ4j2MNKlj1JOj1mMj0%PLj0JRljpOP
$$ -8 -15 -4 3 -18 -8 5 -4 5 -2 0 0 -6 4 -2 -1 8 9 19 -2 23 7 1 15 3 7 12 14 11 0 1 7 -4 -8 -4 -14 -14 -7 -4 -14 -13 -4 -7 -8 -15 -9 -2
3327bPj2Rm%PkJ%JNmrJ0j5J3%%JpOPj5J0L%j3mMkpM%MojKnkJ0nNJqJ6j0J0qJ0
$$ -2 5 -7 2 -2 -2 5 3 4 4 5 10 6 -3 7 -8 5 5 5 6 -1 5 12 -3 7 10 10 -3 -7 -3 -5 -12 -8 -8 -4 -10 -11 -9 -14 -16 -6 -11 -6 -5 -13 3 -7 3 -5 5
3376EpQJ2j5mjJ1j3QL%JnMqOlJpKPj2%pmLR%KnLkNpkmJJ1j2J1M%rNNQ%Qj8J6j0
$$ 5 -2 6 18 3 -1 -2 9 -4 4 7 7 8 3 7 -1 5 2 3 -4 -2 5 -7 -7 -14 -18 -15 -6 -6 -4 -9 -6 -8 -3 -10 -12 -16 -15 -4 -16 -5 -1 -1 -10 -5 0 8 8 16 -2 14 4
3427DoqJ7qjR%Mk3PQmj5J6j1%LpJ0nOJj1J7oMJ4k2J0j2jmKJ3KJ2j1jNjKlkqRJ2
$$ 4 -2 -10 7 -1 -2 7 7 11 -12 -5 3 -1 -16 0 -11 -11 -8 -15 -5 -10 -4 -3 -14 3 -3 1 15 -7 3 -9 -10 -14 -12 1 3 15 4 3 8 7 9 6 4 -4 5 17
3473A7j3jqL%JmlRj2MJj1Q%jJjkQOqQnmoMPlPkPpJ%PNj1J0mrjLmJ1omJ1j7LQK
$$ 17 4 3 -5 -2 -2 -1 -5 -8 1 -11 -7 -6 -17 -9 -9 -10 -9 -10 -12 -4 2 -6 2 -3 -7 -13 -9 -2 -5 2 0 7 0 1 1 8 13 2 12 8 -1 -2 1 -3 8 2 -2 9 -8 -5 3 5
3525Ej2j0J2rjPoKLRkQkJlj1LMmRLjrPJ0qKPmj0OlLnKoRojMo%LLmj4Pj4J3KKJ
$$ 5 -7 -17 -5 -14 -15 -8 -14 -12 -9 0 -2 6 4 5 2 -9 -6 -2 -6 3 6 5 -4 3 13 5 7 14 10 0 6 3 6 1 3 -3 6 0 -1 3 -3 -3 0 3 -1 -15 -8 -22 -9 -7 -5 -4
3577d%jjJPloJ1mqJ2Nj3J7j1%QLm%mQj3L%Nj4OlpPNmLpj2NJ1njmMJNnjPlnPRj1
$$ -4 -4 -5 -6 -5 2 -1 -7 4 0 -8 4 9 -4 13 2 2 10 13 9 9 5 13 0 3 3 8 -6 0 -3 -10 -3 2 -2 1 -6 -18 -13 -2 -7 -8 -12 -8 -7 -2 -7 -8 -1 -4 -9 -2 7 -4
3629dkJ6qnnJ0PkmjQ%rKj5ROjqKNNqllMnljLRoLMKnmNPj2mJ1LqPKJm%MLoRKMp
$$ -4 -6 10 2 -3 -8 2 9 7 3 2 10 10 1 3 -12 -3 3 2 -6 -4 1 6 -2 -5 -8 -4 -9 -12 -13 -10 -1 -7 -4 0 2 -3 -7 -2 5 -7 -11 0 3 -5 2 4 5 1 1 5 8 2 11 13 17 10
3685A0j3OmKJlMrOqMKkkj2kJ3oNljNJLoLJ2kj1LjMJ3pRqLnJ0kj5JJ0%j3LK%qP
$$ 10 -3 3 -1 1 2 -1 3 -6 0 -8 -4 -2 -4 -6 -18 -20 -7 -13 -8 -11 -12 -7 -6 -3 -9 -6 6 4 -7 -4 -5 -1 12 5 14 6 9 4 14 12 -3 -2 8 8 -5 -2 0 0 -8 -1
3735aMnJj2KQrjjJ0qLmNJLLoJ0Oj3MJLKPpLrPJ0j0%rJ3%pMqpNlNlNjj9J2MmnJ0
$$ -1 3 -2 -1 -13 -11 -3 -12 -13 -14 -4 -12 -9 -13 -8 -7 -4 -1 -7 3 9 -4 0 1 4 6 13 6 9 0 7 17 7 7 -2 11 11 4 8 0 -7 -2 -5 0 -3 2 1 -18 -6 -2 -6 -11 -1
3787aj1PrJJ3MrOnJ7qllnQPqjRpoJ4mmmKK%jjMnmlQj2J2nLj2OJpkJ2npKM%Rlj1
$$ -1 -12 -5 -14 -13 0 4 -5 1 -4 13 5 2 -1 -6 2 9 1 0 9 2 -4 10 6 2 -2 0 2 2 1 0 4 -1 -5 -8 0 -12 0 -5 -2 -14 -8 -7 -14 -16 -4 -9 -16 -14 -10 -10 -1 -4 -15
3840a5J6mMLj5J0LkjJ1mlrPJ0rkkK%QjrKj3MrPKoJ0mlKmQqKJPJ0%pRNj0MMpkk
$$ -15 1 -3 1 4 -11 -1 2 0 -1 10 6 3 -6 1 11 2 0 -2 0 0 8 7 -2 0 -13 -9 -18 -11 -9 -15 -5 -9 -12 -10 -14 -6 -14 -12 -11 -4 6 6 -1 8 13 3 7 11 4 2 0
3891@kONOpJpOMj3PLoj3NPk3J5q%MRpPj3K%JRmOJ1j0NKjrNJ0mnkKJpRoOKLjoK
$$ 0 -2 4 9 15 8 9 2 8 12 -1 6 9 3 -10 -5 2 -21 -6 -14 -14 -10 -1 -8 -1 -14 -12 -12 -11 -2 -6 0 11 1 6 8 7 -2 3 13 9 4 2 4 5 -2 7 1 7 9 12 11 5 7
3944Gj0jpPLoOQj3LP%nlmJ%jjnNNKLkPJpNjRj6PnJ0nLMJjpKpJPoj3MOjnn%QlM
$$ 7 -3 -4 -11 -4 -1 -7 -1 7 -6 -3 4 4 -1 -4 -8 -7 -7 -8 -9 -14 -9 -4 -2 1 -1 6 7 0 5 4 13 -3 4 -1 9 4 7 11 12 11 4 6 -1 0 7 1 -12 -8 -2 -3 -8 -13 -13 -5 -8 -4
4000dQ%rLlpRmJkNJ0oQLnLmJ0j3qR%J0%okkp%MloJpJ0j7NJ0llJ2nJj2J0kRjmJ2
$$ -4 4 4 -5 -2 -5 -12 -3 -7 -6 -8 -3 7 1 9 12 7 10 6 16 3 -5 4 4 14 14 8 6 4 -3 -3 1 -2 -8 -7 -14 -4 -21 -16 -6 -9 -12 0 -5 -4 -16 -6 -8 1 0 -4 8
4051HJnjkNjKQj0NNrjjkPnLj3J2Nj3jK%JoJPrj3RmOQj3LKJ5j6%J0%J2j2PqRn%
$$ 8 9 4 3 1 6 5 7 15 5 10 15 6 5 4 2 9 4 7 -6 6 11 -2 -3 -1 -1 0 -6 -5 2 -7 -20 -11 -15 -9 -1 -14 -11 -9 6 -10 -10 0 0 12 0 7 -1 8 3 3
4101CMmOMql%J1j4KjJ0Jj5JNMj2j3RlRmlQMj8J4jj7J2PnRmoJ0Nk%nPjLNnjoLm
$$ 3 7 3 9 13 5 2 2 13 -1 1 0 10 11 -4 -3 2 6 -6 -19 -10 -13 -4 -8 -11 -3 1 -17 -3 -4 -21 -9 -2 -7 2 -2 -8 2 7 5 5 0 7 6 9 14 9 8 2 5 1
4151AMoJlkJ3kq%lkJpKQj1OlQkpPOqrJ9KLj1jNPjj%kLlrQRpKj1QkkJ2qPpj2J%
$$ 1 5 -1 0 -3 -5 8 6 -2 -2 -5 -7 -6 -13 -11 -3 -14 -8 -11 -3 -5 -12 -5 1 -7 -16 3 5 8 -3 -4 1 8 7 6 6 4 7 4 -5 3 12 5 7 -4 4 2 0 12 4 11 4 -8 -7 -7
4205gnOKkkK%kJ1qMOpLj%%j3J4NKpMOlNnkrJ2Lj0oRLjqKpQj4J8oRj4kLjnlJ2J
$$ -7 -12 -6 -4 -6 -8 -6 -6 -8 3 -5 -1 5 -2 1 0 0 0 -13 1 6 8 1 5 11 8 13 8 6 -3 9 12 2 -4 5 8 7 -1 1 -6 2 -12 6 0 9 -5 -7 -4 -5 -10 -13 -1 0
4257@MnPkplJJ6p%njRj1J6kOj1j4J0NJPlj1Pj3KRomKQj4kjLN%%p%PKJlJ0j3Om
$$ 0 4 -1 6 4 -3 -6 -5 11 4 4 -1 -2 7 -4 12 10 16 5 -9 1 6 7 14 11 0 7 -6 -4 5 -1 -5 -3 5 -9 -11 -12 -9 -4 -4 -4 -11 -11 -4 -2 -1 -4 6 -7 -1 -5
4307eMMnJPj1J1lOOj0NoQoMj4PJjpKJ2j9RoJ2pqOpPQKj2JjjN%JoJ3j2lNLNJ4j1
$$ -5 -1 3 -2 -1 6 -5 6 3 9 15 5 10 4 12 6 10 -4 3 4 3 -4 -2 10 -9 0 -6 6 -1 -9 -3 -10 -3 5 7 -5 -4 -5 -6 -1 -1 0 -6 7 -5 -8 -3 0 5 19 8
4357HoJ1jj%Qrj6OmPLlj5PRolMLq%nLrK1j0pJ5pRmkRpLlLj4J2PkNKmLJj0qJ1O
$$ 8 2 13 12 11 11 19 10 -6 0 -4 3 6 3 -12 -5 4 -2 -5 -1 2 -6 -6 -11 -8 -17 4 -6 -13 2 -5 4 0 -2 7 0 3 0 3 -11 1 8 6 11 13 9 12 13 3 -5 6 12
4408A2j2klPj0J8j5MNj5QljPj0klRmMKMllJ2roJ1%lMOnQqJNNj4RKrj1LMpNj0R
$$ 12 0 -2 -5 2 -8 10 -5 -1 4 -11 -3 -6 -7 0 -10 -12 -15 -6 -10 -6 -4 0 -3 -6 6 -3 -9 2 2 -1 3 9 4 12 4 5 10 15 1 10 12 3 -8 -5 -1 -8 -3 -13 -4
4457dljL%MnpOMnJ1j1qJ4pJ3olJ8j0NKj3PP%qjNQrLjJj1J%PkKpmQMj1mkJ0Kj0
$$ -4 -7 -8 -5 -5 -1 -6 -13 -7 -3 -8 3 -8 -16 -2 -9 4 -2 -5 13 3 8 10 -3 4 11 11 3 2 7 15 6 9 8 9 -2 -1 -1 6 4 6 -1 -5 3 7 -4 -8 -10 0 2 -8
4507hmjJRjllOMpQ%JlJ2j1j%JJloK0mpkJ0rRrJlj5RMlMmNnkkJkjKPoLjNkjMP%
$$ -8 -12 -13 -12 -3 -4 -7 -10 -4 0 -7 1 1 2 -1 11 0 -1 -1 0 1 -2 -8 12 8 1 -1 9 0 9 0 1 -2 -17 -8 -4 -7 -3 -7 -2 -7 -9 -11 -10 -12 -13 -11 -4 -10 -7 -8 -3 -5 -6 -2 5 5
4563EJQj5Qj3RmJ1j3%kJ5koN%moJ%rRpmJ2nJ3j7QroJ6mkQpPMrmJ3mLj4J8mnJ7
$$ 5 6 14 -1 7 -6 3 -1 10 -3 -3 -5 10 8 2 7 7 3 -3 -2 -2 -11 -2 -9 -13 -1 -6 7 -10 -2 -11 -17 -1 -5 -7 1 -6 1 5 -4 -8 5 1 4 -10 8 4 -1 16
4611A6plLLpP%j0%kRj0LJj6J1j%NrQoJoNLl%%Ljj2RPNnlPjLjPj3OOkmJKjj3PJ
$$ 16 9 6 9 12 5 12 12 2 2 0 9 -1 2 3 -13 -2 -3 -3 2 -7 1 -5 -4 -10 -5 -2 -5 -5 -5 -2 -3 -15 -6 1 6 1 -2 5 4 7 6 13 0 6 12 10 6 7 9 8 -5 2 3
4664CPj7%JQlKj2RoMLNj0MrJ1Kj3KkJ1JkqnRJ6pM%j1J1kqPqQJ0oJJqj1NNnNrl
$$ 3 10 -7 -7 -6 2 -1 1 -11 -2 -8 -4 -1 4 -6 -2 -11 0 2 -11 -9 -11 0 1 -1 -9 -14 -5 11 4 8 8 -3 8 6 -2 5 -3 5 15 9 10 11 3 -8 -3 2 -3 2 -7 -10
4714a0jjOkMJjjNppJ0Oj7J5klJ3qjmNOkLOo%kMlJKLKj6J3qnQpoL%j3KMOmJjkO
$$ -10 -11 -12 -6 -8 -4 -3 -4 -5 0 -7 -14 -4 2 -15 0 -2 -5 8 0 -1 -5 0 6 4 7 13 7 7 5 9 6 7 9 12 14 -2 11 3 -2 6 -1 -7 -4 -4 -17 -15 -11 -5 -9 -8 -9 -11 -5
4767eLn%RPj6J0Mj0RPKj0LoMKnPljlJ1j9J3j4NKmKkpj1J2%NpNojNRj1NklLJ0l
$$ -5 -2 -7 -7 2 9 -7 3 7 -3 6 13 15 5 8 2 6 8 3 10 7 6 3 14 -5 8 -6 -1 1 -3 -1 -3 -10 -21 -9 -9 -4 -11 -6 -12 -13 -8 1 -10 -5 -7 -10 -7 3 0
4816@PjNj2lJ3Mj1nPLnKl%JqPrJ3lmKoj0K3j1onPlNPj1kKLOJnJLJ0j0mJ3mmJ6
$$ 0 7 6 11 -1 -4 9 13 2 -3 4 7 2 4 1 1 2 -6 1 -8 5 2 -2 0 -6 -16 7 -4 -10 -15 -8 -11 -6 1 -10 -12 -10 -7 -1 0 -5 -4 -1 9 -1 -5 8 4 0 16
4865A6rJ4kpMrlj%jjlKlQjkkmKmj2J6qQj0j%QNj7J5nQoQ%nNpJ3Pj0LqKKkk%J2
$$ 16 7 21 19 12 16 7 4 3 3 2 1 -2 0 -3 5 4 2 0 -4 -2 -6 -18 -2 -10 -2 -12 -13 -13 -5 0 -17 -2 -7 1 -5 3 3 -2 3 -4 9 16 6 9 1 3 5 3 1 1 13
4916A3j3Kj6J5pJ4qLoJ%jlMj3KPKLJnKKJJ3j4LMoNkMmJ3jrOKJlpMmj4PlM%JmJ0
$$ 13 0 2 -14 1 -6 8 0 3 -3 -2 -2 -3 -6 -2 -15 -13 -6 -4 -1 0 -5 -3 -1 0 13 -1 2 6 0 5 3 7 3 16 15 6 12 14 15 12 5 9 5 -9 -2 -5 -1 -1 0 -4 6
4967FonmLOj5PmoJ4NOlqK%%MlJPJpKOj%lnJ2oj0J1mrQ%lKJpjLLj%%rjPrJ9j0J0
$$ 6 0 -5 -9 -6 0 -15 -8 -12 -18 -4 1 7 4 -4 -2 -2 -2 2 -1 0 7 8 1 3 9 8 8 5 0 12 6 -4 7 3 -6 2 2 -1 1 2 -5 -6 -3 0 -1 -1 -1 -10 -11 -4 -13 6 -4 6
5021FrMqJ0kKmJ0rPKqJ0j6lJ8rJ4j3j2J4qQmRlj7jLJLJnLJMj3M%qJ2mJ3j5PON
$$ 6 -3 1 -7 3 1 3 -1 9 0 7 9 1 11 -5 -8 10 1 15 2 -10 4 -4 4 0 9 6 -11 -12 -9 -8 -5 -4 -9 -6 -5 -1 -14 -10 -10 -18 -6 -10 3 -12 -5 1 6
5068FmqJ8rnkkJ4oJ3j5KNoNj2J1Jk%j0Qm%Qrj4QOJj6PJ0j0lJ0nkPJ2j6J5%oOP
$$ 6 2 -6 12 3 -2 -4 -6 8 2 15 0 2 7 1 6 -6 5 6 4 4 -6 2 -2 -2 6 -3 -17 -9 -3 -2 -18 -11 -1 -11 -14 -4 -9 -11 -4 8 -8 7 7 1 7 14
5114A4j8PKOprJ0JJrJJ3qJ1j4KLompJ0mLnKlKNmlOj4RKjMlLNj3J4JjnmMMN%ln
$$ 14 -4 3 5 11 4 -5 5 6 7 -2 -1 12 4 15 1 3 6 0 -4 -11 -1 -5 -2 -7 -5 -8 -6 -1 -5 -8 -2 -16 -7 -5 -6 -2 -5 -2 3 -10 4 5 4 -1 -5 -1 3 8 8 5 0
5165@OjnKrJ2jnQjj9PMnJ1j4RlLrJ3%jj6J1j1KkMJ5mmMNkJ1njj0%MoRPj2KnPm
$$ 0 6 5 0 2 -7 5 4 -1 7 6 -13 -6 -2 -7 4 -10 -1 -4 -1 -10 3 3 2 -14 -3 -14 -12 -14 -10 5 1 -3 1 6 4 15 10 9 -1 -1 3 -3 6 13 1 3 -2 5 1
5214AmJkjLK%oJNqkJ0n%qPOom%JnKJ1mMPlllOlLlpJ4rJJ0rlJ5oj3NLRnnrJ1Kj3
$$ 1 -3 -2 -4 -5 -2 0 0 -6 -5 0 -8 -10 0 -5 -5 -13 -6 0 -6 -10 -10 -9 -14 -12 -1 -5 -1 6 3 0 -3 3 0 3 0 -7 7 -2 -1 9 0 -3 12 6 -7 -2 1 10 5 0 -9 2 4 -9
5268iQNkoKrNlMRrJJ2j6J4NLjmjlJPpkJ%pPJj0J5qPon%pOOj2JlJ2j2J6j4J2j1
$$ -9 -1 4 2 -4 -2 -11 -6 -9 -5 4 -5 -4 8 -8 6 11 14 13 9 8 5 6 13 6 4 5 5 -2 5 6 -4 11 3 10 4 -1 -1 -8 -2 4 -8 -7 -10 2 -10 6 -8 4 -7
5317gjNpRpPKM%jlK%QKkNj0qmLKJ1Nj9QkK%mMj6MjN%KLln%KPkOlj1R%jKLjPqM
$$ -7 -8 -3 -10 -1 -8 -1 1 5 5 4 1 3 3 11 13 11 16 6 -2 -6 -3 -1 10 15 -4 4 2 4 4 0 4 -12 -8 -9 -4 -4 -2 1 -2 -7 -7 -5 2 0 6 3 -8 1 1 0 2 5 4 11 3 7
5373GQrQpMj2OpLjNjlOkj0%J3j3NllLPKrRpMj3J8j6%P%K%JNJJ3rKj7K0jj3OmR
$$ 7 15 6 14 7 11 -1 5 -2 1 0 5 4 1 7 5 -5 -5 8 -5 0 -3 -6 -3 4 6 -3 6 -1 3 -10 8 -8 -8 -1 -1 1 1 2 7 8 21 12 14 -3 17 16 3 9 5 14
5423A4j8J2lmLlmNoNlrKMMnkJKnJjJ2oKkjMJKpJ0jpJ3pkKKJL%p%%O%qOopNkkp
$$ 14 -4 8 5 1 4 1 -3 2 -4 1 -2 -11 -9 -5 -1 -6 -8 -7 -5 -10 -9 -10 2 -4 -2 -4 -5 -1 0 2 -5 5 4 -3 10 3 1 3 5 6 9 9 2 2 2 8 8 0 6 0 -7 -2 -4 -6 -13
5478a3J4j0KlJMJoJ2j0OoJ8j0mN%MrJ6ojK%mQqKMpNMnkkljOnpPjj3mRjkJ5lNj2
$$ -13 1 -9 -7 -10 -9 -5 -4 -10 2 -8 -2 -8 10 0 -4 1 1 5 -4 12 6 5 7 7 3 11 3 5 9 2 7 11 6 4 2 -1 -2 4 -1 -8 -1 -2 -15 -19 -10 -11 -13 2 -1 4 -8
5529hJRmNnNKQj2%OnO%qLJNLjKoq%lJ6j5L%Kj0KJ4nqNonKLJ1k0NMkOmJ3j0jJ2
$$ -8 -7 2 -2 3 -2 3 5 13 1 1 7 2 8 8 0 3 4 9 12 11 13 7 -1 -1 -4 12 -3 0 0 2 -8 -6 8 3 -5 0 -6 -11 -9 -6 5 -15 -10 -6 -8 -2 -6 7 -3 -4 8
5580HrpJ3Nj2OlLNMkJ2k5%%PlmOl%omPjokPmLJJnrJ3lRqJ3j0NjK%kOoRknNrLL
$$ 8 -1 -8 5 10 -2 4 1 4 9 13 11 23 -2 -2 -2 5 2 -2 4 1 1 -5 -9 -2 -3 -9 -11 -4 -8 -5 -4 -3 -8 -17 -4 -7 2 -6 7 -3 2 1 3 3 1 7 1 10 8 3 8 -1 2 5
5634EjknKNkMrpL%Rj1NjkLmJN%nO%jjQJjkJ2nj0MjkNNpJ4Oj7oQoOlqljN%JkJq
$$ 5 4 2 -3 -1 4 2 6 -3 -10 -7 -7 2 -9 -4 -5 -7 -4 -8 -7 -2 -2 -7 -1 -1 -2 -3 5 6 5 3 15 10 0 4 3 1 6 11 4 18 24 7 1 9 3 9 6 -2 -5 -6 -1 -1 0 -2 -1 -9
5690iJ8k0NmPkKPj1QmQMj3LMjJ3onJQj5MPj%NlljlNqjJ5j7L%Lj3RqJ6oj2J4j0
$$ -9 9 -11 -6 -10 -3 -5 -3 4 -7 1 -3 5 9 -4 -1 3 2 15 9 4 5 13 -2 2 9 8 8 13 10 7 6 3 8 0 -1 14 -3 0 0 3 -10 -1 -9 7 1 -11 3 -7
5738gKJ1j2KJ2j4MNrJ5kj4J4j1J0jl%oJ4lJNkpJ%m%KnmJ0j2OLqPmj1J2%%l%j%
$$ -7 -5 6 -6 -4 8 -6 -2 3 -6 9 7 -7 7 -4 6 5 2 2 -4 10 7 8 13 11 4 5 5 1 1 3 -2 -6 4 -8 -2 1 -7 0 -4 -15 -3 -3 -3 -6 -6 -7 -7
5785gKkLjOjJ0pjpPlkLKlJ1%kKmNj0MKlj0QjmkRqKmLk%mLpJ1jLJ1rpRjjJ4j3P
$$ -7 -5 -7 -4 -5 1 0 10 3 2 -5 2 -1 -3 0 2 -1 10 10 8 10 6 11 1 5 7 4 -6 2 1 -3 -5 4 -4 -2 -6 -3 -5 -5 -9 -6 -13 -2 -3 0 11 2 -5 4 3 2 16 3 10
5838A0pOjLp%Oo%lJ1%mNoOj4nrJ4kpLMmLLjlJj0J4j0KR%JNKKjlmJ1omOj5J4j7
$$ 10 3 9 8 11 4 4 10 4 4 1 12 12 8 13 7 13 -1 -6 -15 -1 -3 -10 -7 -3 -7 -4 -1 -2 -5 -4 -14 0 -10 -8 1 1 2 7 9 11 10 7 3 14 8 4 10 -5 9 -8
5888hQOKj0RollNrJ6j5mJ2j%%%j3%J1KmMKlpMnJ1RrJNRj3P%Mj5ROj6Nj0J2qJ7
$$ -8 0 6 8 -2 7 1 -2 -5 0 -9 7 -8 -12 0 -1 -1 -1 -1 -14 -14 -3 -1 -5 -1 1 -2 -9 -5 -10 1 10 1 2 7 16 3 10 10 14 -1 8 14 -2 3 -7 5 -3 14
5936A4kk0O%Pj1LkJ1j0pRKLpJ0%mqJkK0kj8J3oPPj1LJmJ5j4J0%Mqj0MJ3p%pKn
$$ 14 12 -8 -2 -2 5 -6 -3 -5 6 -4 -11 -2 0 3 -4 6 6 2 -6 -5 -7 13 11 -7 6 0 7 14 3 6 7 3 18 4 14 14 18 10 0 4 17 10 10 3 5 0
5982@lOopNN%K%kJ1j7OOj0MMlj5J4qK9j2LnlLpKJjNkllMKM%lNkKj0j2NJ1k1OJ2
$$ 0 -3 3 -3 -10 -5 0 0 2 2 0 11 -6 0 6 -4 0 4 1 -14 0 -8 21 9 12 7 4 7 0 2 3 2 7 5 2 -1 3 5 9 9 6 11 9 11 1 -11 -6 5 -16 -10 2
6032BqmJ2jJkMj5MJ3ooJ0LkOMj0J0qKJ0mjpkKKklOjj3J2oj3J2j1OpNpMJmMMJ0
$$ 2 -6 -10 2 1 2 0 4 -11 -7 6 0 -6 4 7 5 11 15 5 15 7 9 19 15 14 7 5 7 9 7 4 10 9 -4 8 2 -11 1 -10 -4 -11 -6 -13 -9 -8 -12 -8 -4 6
6080FmrnJ4j8J4%mJ3j3RjOOLooJjmnJ6qkLrKKjLpRj5QJJnnJJ3pmMJ2lrNOj2QR
$$ 6 2 -7 -12 2 -16 -2 -2 -6 7 -6 3 2 8 14 17 11 5 6 5 1 -4 12 4 2 5 -4 -2 0 -1 2 -5 4 -11 -3 -2 -1 -6 -11 -10 3 -4 -8 -4 8 5 -4 1 7 -5 3 12
6131A2j3lJ5j1lJ9noJ1j4JMmjOpKMj5J2jjLmjrJOrnOjPJKmM%MpnMJjOj2J0KJQ
$$ 12 -1 -4 11 0 -3 16 11 5 16 2 3 7 3 2 8 1 3 7 -8 4 3 2 5 1 0 -9 -8 -2 -11 -16 -10 -11 -4 -3 -1 -5 -1 -1 3 -4 -9 -5 -4 -5 1 -11 -1 1 2 10
6181A0rMpJ0jpqJ0%oL%kpMlRrQlkpLmPNj3QJ1qKJmNoJQJlPlJPJj2J8k1J0Jj4P
$$ 10 1 5 -2 8 7 0 -8 2 2 -4 -1 -1 -3 -10 -6 -9 0 -9 -1 -4 -6 -13 -10 -14 -7 -2 -15 -7 4 -4 -2 -1 -5 0 -6 -5 3 4 1 8 5 6 13 14 2 20 -1 9 10 -4 3
6232CKNmpmOpNQj1J2j3oLn%nJ0L%%OOJmKj5J0LqJ1L%lLPrM%lj0LnRompJ3lqkJ1
$$ 3 5 10 6 -1 -5 1 -6 -1 7 -4 8 -5 -11 -8 -13 -13 -18 -8 -5 -5 -5 1 7 8 4 6 -9 1 4 -4 7 10 10 7 10 17 8 12 12 9 -1 2 -3 6 0 -4 -11 2 -1 -9 -11 0
6284@j1J9j2kkkNKJLj5J4KLKj2JKJ6pj4OJ7nMmLj0J2nnpJ2o%jj2J1koMJnkNj0
$$ 0 -11 8 -4 -6 -8 -10 -5 -3 -2 1 -14 0 2 5 7 -5 -4 -2 14 7 -7 -1 16 11 15 11 14 4 16 11 6 -1 11 5 5 4 -8 3 1 -5 -1 0 -5 -7 -2 -12
6330a2OJ2j2jmQk%QNkJpK%OPj3PkNj1J7orOjKj5J5oj0J1j0RJrKOjj8J8oMo%Kp
$$ -12 -6 6 -6 -7 -11 -3 -5 -5 3 8 6 7 0 2 2 8 15 2 9 7 12 1 18 12 3 9 8 10 -5 10 4 -6 5 -5 4 5 -4 -2 4 3 -15 3 -3 1 -5 -5 -3 -10
6378a0kNOJ8k1J0Qj4RnLK%kj3J4%lJ1no%nMQj4Qr%pQNmjmKJ1j1%Jj3OJ2lMqNM
$$ -10 -12 -7 -1 17 -4 6 14 0 9 4 7 9 9 7 -6 8 8 5 16 11 5 5 0 4 12 -2 6 -3 -3 -10 -2 3 -1 -2 -6 -4 7 -4 -4 -3 -16 -10 2 -1 3 -5 0 4
6426DRpJKPj3KMN%qlKKLnmRLpj0JQj5J2olkRnOKmrlJ3rjOLPrJ3kkjnmNKOqOq%
$$ 4 13 6 7 9 16 3 5 9 14 14 6 3 5 7 10 5 1 10 13 6 -4 -3 5 -10 2 -4 -7 -9 0 -5 1 3 -1 -10 -13 0 -9 -10 -4 -1 6 -3 10 8 6 5 0 -4 1 3 9 1 7 -1 -1
6481aOJ4nlqmLJ1lqjj3jJ1mNpqJ8j6K4k1%Rn%oJ6NoQjlNokoJ8j0mjOmMjMj0MK
$$ -1 5 19 14 11 3 -1 2 13 10 2 1 -12 -13 -2 -6 -1 -8 -16 2 -14 10 -11 -11 -2 -7 -7 -13 3 8 2 10 9 6 11 5 3 -3 15 5 1 0 6 2 6 5 9 -1 3 5
6530Elj1JnjJ7Kq%%jJ1j5mOLmJ2j0njPNOJplRlKqMmJ0rNrRMrMjmjJmJLkkJ1rL
$$ 5 2 -9 -8 -13 -14 3 5 -3 -3 -3 -4 7 -8 -12 -6 -3 -7 5 -5 -10 -11 -4 1 7 8 1 -2 7 4 6 -2 2 -2 8 -1 4 -5 4 8 -1 3 2 -2 -3 -2 -6 -5 -2 -4 -6 5 -4 -1
6583alOoPklmnKMPkMqNJ8k4J0Pj2JQkkmnJ1Lo%%jlplNkmmQnJ0%JRj2KNqqOO%j
$$ -1 -4 2 -4 3 1 -2 -6 -11 -9 -5 2 0 4 -4 1 19 -5 5 12 0 1 9 7 5 1 -4 7 10 4 4 4 3 0 -7 -10 -5 -7 -11 -15 -7 -12 -2 -2 -1 8 -4 -2 3 -5 -13 -7 -1 -1 -2
6637b%jPkPlj1OLkJ%jRj0J2jnrJ3PrpjQj0j4RLOLj3RmMoOkJqJOl%kKkPlPnQqN
$$ -2 -2 -3 4 2 9 6 -5 1 4 2 3 3 2 11 1 13 12 7 -2 11 18 9 2 1 9 -1 -15 -6 -3 3 6 -7 2 -2 2 -4 2 0 1 -7 -6 0 -3 -3 -5 -3 -5 2 -1 6 1 9 1 6
6691FMqJ1qLj0J4Jj1JrMLNolMqqNNjKj0J4qjJ2j0NJONnoJ6pPj5Q%j4J1lnJ4j0
$$ 6 10 2 13 5 8 -2 12 13 2 3 -6 -2 1 6 0 -3 1 -7 -15 -10 -5 -6 -4 -14 0 -8 -9 3 -7 -2 -1 5 10 5 -1 15 8 15 0 8 8 -6 5 2 -3 11 1
6738AOMj3K%mJoJ2pj1NKJ3j1j%JoPKkKlQmPj0MkRjJjJ1rRj0%J1rLqJjK%oNoJ5
$$ 1 7 11 -2 0 0 -4 -3 -9 3 -4 -15 -10 -8 5 -6 -7 -7 -6 -12 -5 -3 -5 -3 -6 2 -2 5 -5 -1 -3 6 5 6 5 16 7 16 6 6 17 8 11 3 4 3 5 5 -1 4 -2 13
6789A3k1KJ0j7kR%KKnNnLNrJ5opkJ0kmK%J0m%MKnQj2qNNjnkMjjlJ2j6J9j3MrL
$$ 13 -8 -6 4 -13 -15 -6 -6 -4 -2 -7 -2 -7 -4 1 -8 7 1 -6 -8 2 0 -4 -2 -2 8 4 4 8 10 5 13 1 -7 -2 3 2 -3 -5 -1 -2 -3 -6 6 -10 9 -4 0 -9 -6
6838fjjj0KKlJ7%j6J7j0J0rMNJllJ1Mj4J1pnJJ1j5%J6pLmoLmkkOqJjMqJ0Kjkq
$$ -6 -7 -8 -18 -16 -14 -17 0 0 -16 1 -9 1 -8 -4 1 2 -1 -4 7 11 -3 8 1 -4 -3 8 -7 -7 9 2 5 1 -5 -2 -6 -8 -10 -4 -12 -11 -12 -8 -16 -6 -4 -5 -7 -15
6886a5OL%nQjRjoKNJnkjJ1oPj3JjmLlNLLRljnlj1Q%Lj1KKKljmQMKjrJ6mLj0OO
$$ -15 -9 -6 -6 -11 -3 -4 5 4 -2 0 5 6 1 -1 -2 9 3 10 -3 -2 -3 -7 -4 -7 -2 1 4 13 10 9 4 1 -10 -2 -2 1 -10 -8 -6 -4 -7 -8 -12 -4 0 2 1 -8 8 4 7 -3 3 9
6940IlJMpJ5j1%KqOmnmLNoLmPjlOommK%kJ2j1NoJJJ2j1LJ4j3JNjKjMjLkkKOmm
$$ 9 6 7 11 4 19 8 8 10 2 8 4 -1 -5 -2 3 -3 0 -4 3 2 -1 5 -1 -5 -9 -7 -7 -9 3 -8 -3 -9 -8 -7 5 -6 -3 11 -2 -1 4 3 5 4 8 7 10 8 6 8 14 10 6
6993FkrJ2mj0nJ5nq%KQplJ1LpnRjlRj5J0nQLlPj0o%NQmMj0J6j0JKnJ2j1OrjmJ2
$$ 6 4 -5 7 3 -7 -12 3 -2 -10 -10 -8 0 -7 -10 1 4 -3 -8 1 0 -3 6 -9 1 -4 4 7 4 11 1 -5 -5 0 8 4 8 -2 14 4 5 7 2 14 3 9 0 -1 -5 7
7042GpnmJ0j0lON%mNrKMK%KKOj0OjpRkPqMJjnQ%KqjLj2J3oOpJ1j6OjjOj4lJ3n
$$ 7 0 -5 -9 1 -9 -12 -6 -1 -1 -5 0 -9 -7 -3 -1 -1 1 3 9 -1 5 4 -3 6 4 11 3 7 8 7 2 10 10 12 4 3 6 -6 7 1 7 0 11 -5 1 0 -1 5 -9 -12 1 -4
7094dJnJMJqOJmJ3kNj%Mj2LKKolJ6j4PMojKnMoJjKm%rOnR%OoJ1j8nJ8Jm%JKOM
$$ -4 -3 -8 -7 -3 -2 -10 -4 -3 -7 6 4 9 8 8 12 0 3 5 7 1 -2 14 0 7 11 5 4 6 1 5 -1 0 -1 1 -3 -3 -12 -6 -11 -2 -2 4 -2 9 -9 -14 4 5 1 1 2 4 10 14
7148A4prJ2o%NjpMNqK%KmJ3poOojpK%KJ%JNlJ%k%OpLJrOmOnOmJ0oJRj6RMqKOO
$$ 14 7 -2 10 4 4 9 8 1 5 10 2 4 4 6 2 15 8 2 8 2 1 -6 -4 -4 -2 -1 -1 0 5 2 3 3 1 1 7 0 3 4 -5 1 -3 3 -2 4 0 10 4 5 14 -2 7 11 3 5 11 17
7204A7J0j7Mk0J0lPJmqRqOj2NKlJNmnkJ1knOkJ0mlOJJnJJnpQ%RqNJLpPkj0Mj7
$$ 17 27 10 14 -6 4 1 8 9 5 -3 6 -2 4 -8 -3 -1 -4 -3 2 -2 -7 -9 2 0 -5 1 -1 9 5 2 8 9 10 5 6 7 2 -5 3 3 12 4 9 10 13 6 13 11 1 5 -12
7255a2J9j8NJ0j2OMrMjpJ6qmPjPpLJ1pLKJKlrJ3mLj9J9Jk2NJ9mkJj4lJ8qj4JK
$$ -12 7 -11 -6 4 -8 -2 2 -7 -3 -4 -11 5 -3 -7 0 -1 6 -1 2 13 6 9 11 12 14 11 2 15 11 14 -5 14 15 -7 -2 17 13 11 12 -2 -5 13 5 -9 -8 -6
7301fKmJ1pOlJMj3QoLkLNNkj5J7MLj4%Qj0j0J9LjkmoJ0njkJoMJMmpK%kJ1koKL
$$ -6 -4 -8 3 -4 2 -1 0 4 -9 -1 -7 -4 -6 -3 2 7 5 -10 7 11 14 0 0 8 -2 -12 7 10 9 7 3 -3 7 2 1 -1 0 -6 -2 -1 3 -1 -8 -6 -6 -8 3 1 -5 -3 0
7352@klNjoJ0mnJ0oJ1jkkJ5j1J1j0olpJ5J2k5PPjqPKj0qMLnQ%kj2RKjONj8PlR
$$ 0 -2 -5 0 -1 -7 3 -1 -6 4 -2 9 8 6 4 19 8 19 9 3 0 -7 8 20 -5 2 9 8 0 7 9 -1 -9 -5 -2 -7 1 1 -1 -13 -4 -2 -3 3 8 -10 -3 -6 3
7400CQj3J6j1KlJ3oPj6J1j2MKkkMNMopQpRj0Rj6Qj1nOOlj0J5%Oj1nJ0KLpJpJ1
$$ 3 11 -2 14 3 5 2 15 9 16 0 11 -1 3 5 3 1 5 10 14 8 1 9 2 11 1 10 -6 2 -9 -14 -8 -2 -5 -15 0 0 6 -5 -10 0 2 5 -2 -1 -8 3
7446CjNnJoJ1OjnrjmOlOPj4LKOlKj2J2jj2J0j0J2j2Rj8J9NrkmJ1lPnMpPJmk%j
$$ 3 2 7 2 3 -3 8 14 13 8 -1 -2 -6 0 -3 3 10 -4 -1 1 7 4 6 -6 6 5 -7 3 -7 5 -7 2 -16 3 8 -1 -3 -7 4 1 8 3 7 0 7 8 4 2 2 1
7495APPknLmpkNjLkknJ1prOnlkJ3mNlPlKk%LmPkoJmJ0mOj0J0oj0J0J1lj0KqNK
$$ 1 8 15 13 8 11 7 0 -2 3 2 5 3 1 -4 7 0 -9 -3 -8 -11 -13 0 -4 1 -2 5 2 4 2 2 5 1 8 6 0 1 -3 7 3 9 -1 9 3 -7 3 14 11 1 3 -5 0 2
7547BNJqNj4NlJokOJ%lQMj3J1%lMrOJNjKmjQJj3J6pMqLlnMOMj8RjKKokJ0nj2M
$$ 2 7 8 0 5 -9 -4 -7 -6 -12 -14 -8 -7 -7 -10 -2 2 -11 0 0 -3 1 -8 -2 -1 4 3 5 1 0 8 9 -4 12 5 9 1 4 1 -4 0 6 10 -8 1 0 2 4 -2 -4 6 1 -11 -7
7600gj1KJ1oJ4%njLLj2RkLlJ0rjjJ3Rj2%NmqJ0lQj0%ooMJ8jj7MmOj6POQqlLLj2
$$ -7 -18 -16 -5 -11 3 3 -2 -3 0 3 -9 0 -2 1 -2 8 -1 -2 -3 10 19 7 7 12 8 0 10 7 15 5 5 -1 -7 -3 15 14 -3 1 -3 3 -13 -6 0 8 0 -3 0 3 -9
7649iQJLlMOmRroQrJ8j2MmJ0j1KRqJMmpmnOJ1onkJ4qnJ0j1J2j3m%QJJkMJLJkk
$$ -9 -1 0 3 0 4 10 6 15 6 0 8 -1 17 5 9 5 15 4 6 15 7 8 12 8 1 -3 -8 -2 9 3 -2 -4 10 2 -3 7 -4 8 -5 -9 -9 -1 0 1 -1 3 4 7 8 6 4
7700DKnNMMpkJN%pMJ0j2%mQo%KlKrJjkPJj7J5j2J0lJmMj5K4pOOqMKmNkQoLlnM
$$ 4 6 1 6 10 14 7 5 6 11 11 4 8 18 6 6 2 10 4 4 6 3 5 -4 -3 -4 -6 1 2 -15 0 -12 -2 -5 -4 -8 -4 -19 5 -2 4 10 2 6 8 4 9 7 15 9 12 9 4 8
7753HNjnNkmjNpjnKO%j2JJ%kjqOmJ6Qj3oJ6qJPLKj2OrJ1%pLjjNrJ1mjMjj0qJ7
$$ 8 13 12 7 12 10 6 5 10 3 2 -3 -1 5 5 -7 -6 -5 -5 -7 -8 -16 -10 -14 2 10 -3 -9 7 -1 0 7 10 12 0 6 -3 8 8 1 4 3 2 7 -2 9 5 4 8 7 -3 -11 6
7805FnJJj1N%%JJm%Kj4J9qnQOKnl%NQqPj1%MnJ7j3mLPllLJ0j2jMj3jmJ3mLmOm
$$ 6 1 2 3 -8 -3 -3 -3 -2 -1 -5 -5 -3 -17 2 -6 -11 -3 3 5 0 -3 -3 2 10 2 9 -2 -2 2 -3 14 1 -3 0 7 4 1 4 14 2 1 5 -8 -9 -13 0 -4 -1 -5 1 -3
7856cjQoJJpRj0oJ7mnJ0%%nnJ1JrJ1j4kNJ0okJ3kj1NJrQqKj1OKQnrJ3kj5K2oo
$$ -3 -4 4 -2 -1 0 -7 2 -8 -14 3 -1 -6 4 4 4 -1 -6 5 6 -3 8 -6 -8 -3 7 1 -1 12 10 -1 4 5 -4 4 -4 -2 -13 -7 -5 3 -2 -11 2 0 -15 7 1 -5
7904ejoJ2JjpPMlOjPj5Pn%oNlNmL%kKoNpQqQ%qL%p%JOjNjlKMpPplJ2kOJpOlmo
$$ -5 -6 -12 0 1 0 -7 0 4 1 7 6 13 -2 5 0 0 -6 -1 -4 1 -3 0 0 -2 0 -6 -1 -8 0 -8 0 0 -8 -5 -5 -12 -12 -11 -5 -6 -1 -2 -5 -3 1 -6 1 -6 -9 3 1 7 8 1 7 4 0 -6
7962fJ4j0MOrNkm%J1j3RrNlkL%Oj1J0n%NKOk2jOjJ1qJ4lj2RkJ1lpJ2j8J6j3NQ
$$ -6 8 -2 2 8 -1 4 2 -2 -2 9 -4 5 -4 1 -2 -4 -1 -1 5 -6 4 -1 -1 4 6 12 -10 -11 -5 -6 5 -3 11 8 -4 5 3 14 11 4 16 -2 14 1 6 14
8008A4j4kJ0mjOpLj3KJ3j4OkPj6%J4lmlNmj%%LNrJ0RJqqJ3mJ6qo%%joNmKlOJl
$$ 14 0 -2 8 4 3 9 2 5 -8 -6 7 -7 -1 -3 4 -12 -12 2 -1 -5 -8 -3 -7 -8 -8 -8 -5 0 -9 1 10 11 3 -5 8 4 20 12 6 6 6 5 -1 4 0 2 -1 5 6 3
8058CkpQ%j4%O%JnJ1rPNNqjjlOkKpjJ5rJ4qKkkmJ4mmqQmM%mQmoNj1rJ2Jj4J8J
$$ 3 1 -6 2 2 -12 -12 -6 -6 -5 -10 1 -8 -1 4 9 1 0 -1 -4 2 0 2 -5 -6 9 0 14 6 8 6 4 0 14 10 6 -2 6 2 6 6 2 10 6 0 5 -6 -15 -3 -2 -16 2 3
8110CkoMJJjj1J6Nj4J7j1mMkl%J4Jj3PMqQNkmLrJ1nKoOk%nknqQJ1j0JoLQpJ5j6
$$ 3 1 -5 -1 0 1 0 -11 5 10 -4 13 2 -2 2 0 -3 -3 11 12 -1 6 10 2 10 15 13 9 12 3 14 9 11 5 11 9 9 4 2 -3 -11 -3 8 -2 -1 -7 -4 4 -3 12 -4
8160djPMmRoLj2J5nO%pMolJ7rkpMJLlpkPqPlJ4
$$ -4 -5 2 6 2 11 5 8 -4 11 6 12 12 5 9 3 0 17 8 6 -1 3 4 7 4 -3 -5 2 -6 1 -2 12
8191A2
$$ Imaginary data points
##PAGE= N=2
##DATA TABLE= (X++(I..I)), XYDATA
0@%%%%%%%%%%%%%%%%%%%%%jNqJ2j6J6j6J8k2K8l2L5m1M8n4O2p0P7q6R6j07J19
$$ 0 0 0 0 0 0 0 0 0 0 0 0 0 0 0 0 0 0 0 0 0 0 -1 4 -4 8 -8 8 -8 10 -12 16 -16 19 -22 26 -28 34 -36 41 -45 51 -56 63
43F3j34J50j66J83k02K23k45K71k99L28l62L98m36M80n30N86o45P10p88Q77r73
$$ 63 -71 79 -87 96 -106 117 -128 143 -156 172 -190 208 -228 252 -278 308 -337 373 -415 462 -511
64e11J074j165J198r61o57J9140K07039l9292k14948p1989J5728N5435Q8237O6990
$$ -511 563 -602 596 -365 -1022 18118 225157 185865 -29083 -101072 -85344 -29909 58328 125318
78A25318j812q2627j46918l6613J36304J10403j5804m8636q9132r2514N5564J36670
$$ 125318 123506 40879 -106039 -142652 -6348 104055 88251 39615 -49517 -142031 -86467 50203
90E0203K3737m5849l0150n4872m0756M8454Q2715N5982p863r8495p6071N8212
$$ 50203 73940 28091 -2059 -56931 -97687 -49233 33482 89464 81601 -16894 -92965 -34753
102c4753Q0372N207k337o591n4983l8552J1466L0360O2728M0270q0743j07866
$$ -34753 45619 50826 48489 41898 -13085 -51637 -40171 -9811 52917 93187 12444 -95422
114i5422J0605P7111M6119P024l5481n0474q478J8250K4430M7956J8219n2166
$$ -95422 -84817 -7706 38413 45437 9956 -40518 -48996 -30746 -6316 41640 59859 7693
126G693m2886N607J1780L4050N2240j6990p5253k6797L3869L7346J5680j4614
$$ 7693 -35193 -29586 -17806 16244 68484 51494 -23759 -50556 -16687 20659 36339 21725
138B1725k8466j4918j3034n96M8083M0332m1434o0611M294M0843K7762M503k1571
$$ 21725 -6741 -21659 -34693 -35289 12794 53126 11692 -48919 -44625 -3782 23980 28483 6912
151F912k5141q06J1682J5479K3405J188l4235k5986P613K6005K8921K376m3170
$$ 6912 -18229 -19035 -7353 8126 31531 32719 -1516 -27502 -19889 6116 35037 37413 -5757
164e757m1225J2157M3667K6579j0913l7185k4494J1651K3101J3921J1277l790
$$ -5757 -46982 -34825 8842 35421 24508 -12677 -37171 -25520 -2419 11502 22779 18989
176A8989l1112k5503J4183L9138K5484j1782l6065k0693J0511J9758J4157Q233
$$ 18989 -12123 -37626 -23443 15695 41179 29397 -6668 -27361 -16850 2908 17065 25298
188B5298p848k5372k0617L036K4569K7186L044k7571l0030m913J8890K5228J4688
$$ 25298 17450 -7922 -28539 -25503 -934 26252 29296 1725 -28305 -33218 -14328 10900 25588
201B5588n347k0628k2426q805J8240L7605K1480k0446m3737k4483J6864M0639
$$ 25588 20241 -387 -22813 -31618 -13378 24227 45707 25261 -18476 -42959 -26095 14544
213A4544K6972p670l2023l1727j0233K1343M0206K4155j8164m6727l1901J3136
$$ 14544 41516 33846 1823 -29904 -40137 -18794 21412 45567 27403 -19324 -51225 -38089
225c8089M5190L5596l377l5950l7577r407K6903M2228K1969j8230m3029k9655
$$ -38089 7101 42697 39320 3370 -34207 -43614 -16711 25517 47486 29256 -13773 -43428
237d3428J0356M0630L3985k312l4710l5947p772K4551L4834J6351j5136l3465
$$ -43428 -33072 7558 41543 39231 4521 -31426 -39198 -14647 20187 36538 21402 -12063
249a2063k3732N954L0131K8012K063k4213k8274q497J7019K6951J4874p783k2572
$$ -12063 -35795 -29841 290 28302 30365 6152 -22122 -30619 -13600 13351 28225 20442 -2130
262b130j8886n55J7513K0933P437j1875k1209j3323M859J8331J6664J568j4656
$$ -2130 -21016 -21571 -4058 16875 24312 12437 -8772 -22095 -17236 1095 17759 19327 4671
275D671j8775p725R335J8681J3044l485j7213j6119j202J4845J8399O303j1077
$$ 4671 -14104 -21829 -12494 6187 19231 15746 -1467 -17586 -18788 -3943 14456 20759 9682
288I682j8371r885O658J7265J3030k826j5917j4695j094J2933J5213L726j0867
$$ 9682 -8689 -18574 -11916 5349 18379 15553 -364 -15059 -16153 -3220 11993 15719 4852
301D852j4850n793P653J3843P569n376j2330p571L535J0999Q254k201r720p307
$$ 4852 -9998 -15791 -8138 5705 13274 7898 -4432 -12003 -8468 2531 10785 8584 -1136 -8443
315h443J505Q262P183q59p966o841P34P031O477n36p454o864N71O978O781L86
$$ -8443 -6938 1324 8507 7648 -318 -7159 -6425 606 7083 6547 -907 -7771 -7200 -222 6559 6945
331F945o667p538r59O427P939K531n353q546l569M713Q426M865k803q004o211
$$ 6945 278 -7260 -8219 -1792 6147 8678 3325 -5221 -8790 -4077 4349 9214 6411 -1593 -7804
346g804Q11O696O918J601n284p964l869L435P579N527q95o540o906j808M603P688
$$ -7804 -6993 -297 6621 8222 2938 -5026 -8895 -5460 2119 7646 6751 211 -6695 -8503 -3900 3788
362C788N110j760p889p762q01P285R571L941n447j0583o919K578J0087R861J244
$$ 3788 8898 7138 -751 -8513 -9314 -2029 7542 11483 6036 -4547 -11466 -8888 1199 11060 12304
377A2304r571j2725m668P879J4003Q118n628j4557j0265K575J2788J2790K038
$$ 12304 2733 -9992 -14660 -6781 7222 15340 9712 -4845 -15110 -12535 253 13043 15081
390A5081j1145j4665n433Q452J5606R312o068j5765j0845K818J3346J2773R00
$$ 15081 3936 -10729 -16162 -7710 7896 17208 11140 -4625 -15470 -12652 694 13467 14367
403A4367j1628j3088l885P449J2878P746m495j2262r419O94J0663J1683J320r363
$$ 14367 2739 -10349 -14234 -6785 6093 13839 9344 -2918 -12337 -11643 -980 10703 12023 2660
417B660r828k907M623Q534N924j287o752p535k783N754R217L153m366o581m605
$$ 2660 -7168 -10075 -5452 3082 9006 7719 967 -6568 -9351 -3597 5620 8773 4407 -2174 -6779
432f779L64N479N605J695k367n953n659R52P064O389Q24n735p933j809N713N998
$$ -6779 -6415 -936 4669 6364 3997 -1956 -7615 -6663 401 6790 7614 1879 -6054 -7863 -2150 3848
448C848K102j216m688n637j219M652P326L683n336r671k349O431O274J180k520
$$ 3848 5950 4734 46 -5591 -6810 -2158 5168 8851 3515 -6156 -8505 -2074 4200 5380 2860
463B860m174k987J59K972M695K312m129o216l78M390L516O35k398l707n52K955
$$ 2860 -1314 -4301 -4142 -1170 3525 5837 1708 -4508 -4886 -496 3020 3655 1257 -2450 -3002 -47
479d7J960o19j298p70K78L25l24R38J506k063l329J990M872m3m692k749K255M085
$$ -47 1913 1294 -4 -774 -496 -171 -495 443 1949 -114 -3443 -1453 3419 3376 -1316 -4065 -1810 2275
497B275Q18k700j588M67m40k46K356K182j123l108k282P16L676K697j284l241
$$ 2275 3093 393 -1195 -728 -1168 -1414 942 3124 2001 -1107 -3389 -2673 1003 3700 2416 -825
513h25k020M54K463J877n25q95j02j372k016J072L916J995k474m015n57K840J323
$$ -825 -2845 -2391 72 1949 1424 529 427 -945 -2961 -1889 2027 4022 1548 -2467 -3024 -184 1139
530A139j110P11K098j666m664j068M420M599l32m163l270MJ822K629K408k13l484
$$ 1139 29 740 2838 1172 -3492 -4560 -140 4459 4127 -36 -3306 -3302 -1480 1149 3557 3344 -140
547a40l501n26K648M452K804k456o483l722L500O955K634l633m602j382N68J356
$$ -140 -3641 -4167 -1519 2933 5737 3281 -3202 -6924 -3424 3531 6165 2532 -2070 -3452 -2884 -1528
563a528L390L503j490o566m253L390O901K348l560m118j002R02J261K048J968
$$ -1528 1862 5365 3875 -2691 -6944 -3554 3347 5695 2135 -1983 -2985 -2083 -822 1226 3194
578C194n35l368k975N34L522L023k87l029k607J88K051J275j14J24L82j378k794
$$ 3194 2659 -709 -3684 -3150 372 3395 3108 79 -2528 -2340 -289 986 872 996 1378 0 -2794
595b794k72L747L320j518m042j349J849J439o5O25J289j071l547j426L152L996
$$ -2794 -3066 681 4001 2483 -1559 -2908 -1059 380 315 940 2229 1158 -2389 -3815 -663 3333
611C333R3l309k623J49J716J624Q59j65j463j900o91J387K492J345j418l063j376
$$ 3333 3426 117 -2506 -2357 -641 983 1842 1677 214 -1686 -2377 -990 1502 2847 1429 -1634 -3010
628c010J946K843M06j886j322L99M48l63K85J370L33j713j456Q86J807J40j439
$$ -3010 -1064 1779 2185 299 -1023 -624 -176 -539 -254 1116 1449 -264 -1720 -834 973 1113 -326
645c26n62J073P21r41j067L83J247N98n56r81m11K76M43M91M88p6r01j060k20
$$ -326 -888 185 906 -35 -1102 -719 528 1126 570 -411 -822 -546 -103 388 876 800 -101 -1161 -1381
664a381J265J799J73j974j734L93J679J008l26p44m01m00m70O52J624M47j445
$$ -1381 -116 1683 1856 -118 -1852 -1459 220 1228 902 158 -243 -643 -1113 -461 1163 1610 165
681A65j475P9J189R08j85o60j41M0l07j28M83N71J91m58q57k79O62N60N1O2q0
$$ 165 -1310 -1231 -42 866 681 21 -120 -80 -387 -515 -32 539 730 272 -585 -864 -202 358 409 471 391
702C91n98o49p4Q73J307J79j441j357J32J094J084L64o86j129o95K8J026J533
$$ 391 -207 -856 -930 -57 1250 1429 -12 -1369 -1237 -143 941 1305 619 -510 -1205 -1177 -151 1382
720A382L44j491j638k27J147J554M94r73j271n11K41R43J106J11r75j045l80N99
$$ 1382 1726 235 -1403 -1630 -483 1071 1565 592 -679 -1190 -949 -6 1100 1211 236 -809 -1189 -590
738e90J226N07o71p85l06N2M30N30J58j47l35n67j93N03N40J61m4l63n82j86L09
$$ -590 636 1143 472 -313 -619 -567 -137 393 551 404 69 -498 -691 -188 352 513 469 106 -476 -662 -353
759c53N20O03M4q53q64j8O84R26M32n88j088n22K87Q95R40K7j006j020j71P20
$$ -353 167 770 814 -39 -903 -921 -237 689 1121 533 -555 -1077 -790 105 1045 1072 66 -954 -1125 -405
779d05J114N18o42j101n27K93Q73Q12m4q04p51j79M92P89L97l85o56l89N4M57
$$ -405 709 1227 585 -516 -1043 -750 123 935 891 87 -664 -843 -351 438 835 450 -206 -595 -541 -84
799h4N12Q3k83l43k82mK99L60J42j05l26l75p8L00M36K74r1n24m98j5M90N94K38
$$ -84 428 511 228 -115 -397 -401 -102 258 400 295 -31 -406 -484 -184 252 526 435 -89 -587 -602 -112 482 720
822G20l78p28m02L02P09N46r8o83o68n8N71P05K67m32p61l90L27O91M46j55o07
$$ 720 342 -386 -788 -486 223 769 671 -12 -680 -738 -167 538 805 373 -388 -778 -451 240 686 531 -76
843g6n00N2M70M30J07k73m33k11J58L68K44o9l09j78N9J36N6RK3K6l1j25j35O3
$$ -76 -576 -524 -54 376 483 210 -223 -434 -276 92 336 267 -42 -220 -161 -25 31 40 63 89 58 -67 -202 -139
867a39J93J35Kj00j99j59O6K44K94M9l51m34m3M02M00O0k93l61j43J63K63K49
$$ -139 54 189 191 91 -108 -267 -201 43 337 386 35 -399 -442 -40 360 420 127 -234 -377 -214 49 298
889B98N4k87m17q7L38L82Q8k70l10m5J51J12P0P4j2j41j67n4J40K39P5j28j27
$$ 298 352 65 -352 -439 -101 281 369 99 -211 -256 -105 7 77 151 139 -2 -169 -223 -83 156 231 103 -24
912b4q5p7J4J85K69J16l04m97j22M32N13P8l26m12k07J14L64L96J40l91o58k46
$$ -24 -109 -186 -172 13 282 398 94 -403 -525 -93 420 498 172 -240 -447 -333 31 427 567 176 -482 -728
934g28M69P02K68l92o68l12K73N19L73l4l96m45j97K62N71L92k20o60m16K36N79
$$ -728 -259 443 711 319 -349 -661 -388 131 504 470 74 -371 -568 -306 265 657 437 -223 -639 -403 176
955A76K72j45k59j84j53k1K83M35P2m22m42l0L49K99M5j02j57j97j43J14L08L06
$$ 176 448 303 44 -140 -293 -314 -31 404 476 54 -388 -418 -69 230 275 173 16 -181 -324 -210 98 404
977D04m6m13m11K6M41M00j1l53k83n3P7J96L38J77l36n95j60N17N78J9m56l52
$$ 404 358 -55 -466 -440 1 401 390 37 -246 -299 -222 -26 312 489 153 -442 -602 -85 493 512 56 -296
999b96QJ44J79K33R3k56m11j22L20M14Q7k98l32n8K02K48M1j51j09J3ql9P1J74
$$ -296 -288 -144 35 268 361 105 -306 -428 -108 306 393 95 -237 -295 -93 155 196 45 -64 -51 -59 -98 -27 147
1023A47J4k31j42J60K28q5k44K3K62M9k24j58J34J91k1j03NK6o6p9R2J50M2j34
$$ 147 161 -70 -212 -52 176 91 -153 -130 132 181 -43 -201 -67 124 103 0 5 31 -35 -114 -22 128 170 36
1047C6j71k4J24J84M2j68j63K9J34Mn7N3J07p1k43l3K38J78j08j64J5P8p5q9J41
$$ 36 -135 -159 -35 149 191 23 -140 -111 23 27 -30 23 130 59 -184 -217 21 199 91 -73 -58 20 -55 -144 -3
1072cK29%k81k32R1K52J74k1j46j99j00R4K21J76Mj95l17j23K85M14J48l43m32
$$ -3 226 226 -55 -287 -196 56 230 209 63 -136 -236 -142 79 255 259 64 -253 -376 -91 323 471 128 -304
1095c04p3K68K66R0j6j65l19j59K38M56K00l24m60j14K61K86J38n0k06k33q0J51
$$ -304 -377 -109 157 247 231 66 -253 -412 -174 282 482 158 -302 -416 -155 131 269 219 13 -220 -300 -149
1117a49K98J89j15l11k20O5K87K30k3k26j58l8N0J14J90R8j77k91j38K18K95Q9
$$ -149 149 338 223 -88 -308 -243 44 274 251 25 -133 -171 -121 -7 183 281 104 -187 -325 -107 188 277
1139B77j71j71r3k7R0K13J45q2k81k26R1L04K02n9k22k04k6J67K01R1q2j96j76
$$ 277 106 -65 -158 -185 -95 118 263 181 -100 -326 -235 69 271 212 -10 -214 -240 -73 128 219 137 -59 -235
1162b35K2K19K27K5k32k28LK00J40%p7r0r3RJ15J13K8j37j40NJ22J00l3p3l6J0
$$ -235 -213 6 233 258 26 -202 -199 1 141 141 64 -26 -119 -110 5 118 146 9 -131 -126 -4 96 63 -10 -46 -36
1188c6K9J1mJ1jm4J0L0J0j0m1MM8M9n0o6j7O7N5j2k4m3LJJ0M9M3k7p3m8K3Q0M2
$$ -36 -7 4 0 11 10 -34 -24 6 16 6 -35 -31 17 66 16 -50 -67 0 55 43 19 -24 -21 -20 -10 39 82 55 -18 -66 -43 37 79
1221G9l6m2k8j3kL2O1M0o3r1n2M8J16N3k5r5p3j8O6J09O9l1j48j26K7J66J42j
$$ 79 43 1 -27 -40 -42 -10 51 91 28 -63 -115 -67 49 102 77 -18 -91 -109 -43 66 135 104 -44 -170 -143 23 165 164
1249A64j38j60m7R9J78R7n4j76j54K3J81J83J6j53j97n6J10J80J03o6j82j50O
$$ 164 26 -134 -181 -82 96 193 139 -37 -191 -168 13 196 212 59 -138 -194 -84 96 199 133 -49 -199 -193
1272a93J60J90L8j36j89p5J07J58J17m2j50j28j5J07J47P5p2j49j04K0J43J24
$$ -193 -33 157 195 59 -130 -205 -98 60 177 135 -15 -143 -158 -51 96 171 99 -50 -154 -134 9 133
1294A33K0j10j17o5O4J15R7mj14j31l2R3J43N5m9j38r7K5J07J21J5r1j29p3Q0
$$ 133 153 43 -74 -139 -75 40 137 133 19 -112 -144 -51 92 147 98 -40 -137 -112 -5 116 131 40 -89 -162 -82
1319h2J26Q8l7j20j06MJ14J03K1q3r0n3O1R2P7k5r8p6NR5O5%o1o3j0M2L9K0j2
$$ -82 44 132 95 -25 -131 -127 -13 90 111 28 -62 -115 -54 38 115 90 -8 -84 -79 16 81 81 20 -43 -53 -11 28 48 36
1348C6m0m7J8L1L2j1k0k2NJ7LKj8JJ9l%jqk3J4J5J4nj6k8K6K1J9j0j3k1MKK3J2
$$ 36 -4 -51 -33 -2 30 19 -1 -23 -18 -1 2 4 -14 -13 6 3 3 2 -6 -29 -15 0 14 9 -7 -35 -9 12 31 21 8 -13 -9 -7 16 28
1384B8Nk5l1k4M8L9Pl0l5k2nM2K1K9k2o7k3J3O7N6j5o8o6PN5O2J5k2o8o5J9Q4
$$ 28 33 8 -23 -47 1 40 47 17 -18 -40 -45 -3 18 47 25 -42 -65 -52 15 71 56 -12 -78 -71 -16 46 61 39 -29 -94 -75 9
1416IQ3Lq4q6j0P5Q3K1m8o6n0J2N9R4K1q8j17%O3Q8L8m4q5o2J3P2O9J3n8q3l3
$$ 9 92 95 11 -75 -85 -10 73 94 46 -20 -70 -58 1 95 116 28 -89 -89 -26 62 100 56 -29 -91 -78 -6 63 76 18 -65 -98
1447i8L6Q8O7l4q6l7qO6M3K9j3n4o4pP5P7Mo2o3j5L0N6K8Lm1o7j2L2P3M4m4q1
$$ -98 -62 26 93 59 -27 -64 -72 -6 37 66 53 -1 -65 -72 3 80 84 22 -41 -56 -26 30 58 61 20 -47 -59 -27 46 90 46 -35
1479c5l8J6P4M6j2m5n2j0J3N1M4mq0n0L0P0L1j0m3k6%J6L6K7j3m0l0J5K6M1lm5
$$ -35 -73 -57 17 63 51 6 -46 -56 -43 8 52 48 -32 -82 -52 18 49 39 -4 -30 -30 -14 22 49 36 -4 -34 -19 7 48 45 0
1511@j8KK2J4Lj0pprKK2J0k2j2qK8Pk2oKJ6j4qROnnkJ4Pj4pMJ6QJmj4LQKJ3%j5
$$ 0 -18 -16 6 20 23 13 6 -1 -10 -8 14 24 2 -10 -18 10 17 -5 -11 -9 7 -7 -15 -6 0 -5 -10 -12 2 9 -5 -12 -8 8 16 17 13 -1 2 10 12 25 25 10
1555A0oroL4J2k6k6%PlK2J6j7j8l2K0M0K9k7k6l4J0K3K2J8k3k8k4RK8M4j0l4k5
$$ 10 4 -5 -11 23 35 9 -17 -17 -10 -13 9 25 8 -10 -42 -22 18 47 20 -6 -40 -30 -7 15 33 10 -18 -42 -33 -5 39 29 -5 -30
1589c0qL4M1Nk5k3k4RK9J6J1qn1j1K4L6J2k4l2j6JK2K3Mj2k5j9J1K5K4Mk6k5p
$$ -30 -38 -4 37 42 17 -6 -30 -21 8 24 35 27 -24 -35 -11 25 37 13 -19 -35 -34 -12 11 15 3 -22 -41 -30 -5 19 23 -3 -28 -35
1623c5K0K9J0j4j1k9RJ3L9Lj9k5j1J1K5J7lj6k2j0J6K4J2j3l7nmL6NQj8k8pJ2
$$ -35 -15 14 24 10 -1 -30 -21 -8 31 34 15 -10 -21 -10 15 32 29 13 -9 -19 -3 21 33 20 -17 -22 -26 10 15 23 5 -23 -30 -18
1657a8K0J2nj6k9J1J4K4Lqj9%QJ6J5qqj2oJ5PJ%j2j0NLLnmQj0mPpJ7qkkjlNQj3
$$ -18 2 14 9 -7 -36 -25 -11 13 16 8 -11 -11 -3 13 28 20 12 0 -6 9 16 17 17 5 -5 0 3 6 1 -3 5 -5 -9 -2 -9 8 0 -2 -4 -5 -8 -3 5 -8
1701hKp%OOKjpkJNmNRkjllK2plrJ3jj8RKNnj6j1J6Rmp%%j1OQJ0Jj5lmJ3J0nLj5
$$ -8 -6 -13 -13 -7 -1 1 0 -7 -9 -8 -3 -7 -2 7 5 4 1 -2 20 13 10 1 14 13 -5 4 6 11 6 -10 -21 -5 4 0 -7 -7 -7 -18 -12 -4 6 7 -8 -11 -15 -2 8 3 6 -9
1751iklJ4J5qJk7LJ0K1Qnj5lQpJ7p%r%pJ5Qj0j5j1PMMj%j4JNJ2OrokMNLJOrlL
$$ -9 -11 -14 0 15 7 8 -19 -16 -6 15 23 18 3 0 8 1 18 11 11 2 2 -5 10 18 8 -7 -18 -11 -7 -3 -4 -4 -18 -17 -12 0 6 -3 -9 -11 -7 -2 1 2 8 -1 -4 -1
1799aLPNkj8%%J0J1%pmpRjjmLrj0KNJ3j7Pj2PjmJ1%rmMQKL%PJlJrJ7oj3O%LqO
$$ -1 2 9 14 12 -6 -6 -6 4 15 15 8 4 -3 6 5 4 0 3 -6 -16 -14 -9 4 -13 -6 -18 -11 -12 -16 -5 -5 -14 -18 -14 -6 -4 -1 -1 6 7 4 5 -4 13 7 -6 0 0 3 -5 1
1850AJ4pmLj3Rjj0J1rLLmpLLrJ8j6O%pKj1ORmOmkJ4plJ0OjJlmQOqMrLLjJ0j6P
$$ 1 15 8 4 7 -6 3 2 -8 3 -6 -3 0 -4 -11 -8 -5 -14 4 -12 -6 -6 -13 -11 -22 -16 -7 -11 -5 -9 -11 3 -4 -7 3 9 8 9 6 2 10 16 8 12 3 6 9 8 18 2 9
1900Ij2QmJLj2MnKKNjk%LpJ3jlmj2J2mkK2j2Qj3J2KRnj2OJ4Nj5klj0Pj2J3nLr
$$ 9 -3 5 1 2 5 -7 -3 -8 -6 -4 1 0 -2 -2 1 -6 7 6 3 -1 -13 -1 -5 -7 15 3 11 -2 10 12 21 16 4 10 24 29 14 12 9 -1 6 -6 7 2 5 -4
1946dlkj%L%PqljJ1Lj2J1j2J1MoKo%jJ2jJ0%qKKPJ%j7OKNoNqMjj8OkKoj1J6jl
$$ -4 -7 -9 -10 -10 -7 -7 0 -8 -11 -12 -1 2 -10 1 -11 0 4 -2 0 -6 -6 -7 5 4 14 14 6 8 10 17 18 18 1 7 9 14 8 13 5 9 8 -10 -4 -6 -4 -10 -21 -5 -6 -9
1996iRNrjjpNNJ2JrRnOlOkoj6J8oRlkKj6RKlQopJOnjMnmM%pj1QMNqMKKlkJ1p%
$$ -9 0 5 -4 -5 -6 -13 -8 -3 9 10 1 10 5 11 8 14 12 6 -10 8 2 11 8 6 8 -8 1 3 0 8 2 -5 -4 2 -3 -4 0 -5 -9 -5 -5 -12 -23 -15 -11 -6 -14 -10 -8 -6 -9 -11 0 -7 -7
2051gJ2O%%PklonJ0j4J0MoPqjkLj0QjmrJ1Lo%Oj6jJPRnpJkPNmPokmQPj2J3Kqj
$$ -7 5 11 11 11 18 16 13 7 2 12 -2 8 12 6 13 5 4 2 5 -5 3 2 -2 -11 0 3 -3 -3 3 -13 -14 -13 -6 3 -2 -9 -8 -10 -3 2 -2 5 -1 -3 -7 1 8 -4 9 11 3 2
2103BO%Qnkj0PK%JrKj3jJ3j2J4j4j4J5kJ8pjkkJlPM%kMpPmM%Qj1OMj2OnJ5j7J4
$$ 2 8 8 16 11 9 -1 6 8 8 9 0 2 -11 -12 1 -11 3 -11 -25 -10 -12 6 -1 -2 -4 -6 -5 -8 -1 3 3 1 5 -2 5 1 5 5 13 2 8 12 0 6 1 16 -1 13
2151A3J%rj2K2rKj2Lj4lLJ0%nnJ3kj0ROl%LL%JlRj1LMKlOnlMqkMPjKrRj0ONj8
$$ 13 14 14 5 -7 15 6 8 -4 -1 -15 -18 -15 -5 -5 -10 -15 -2 -4 -14 -5 1 -2 -2 1 4 4 5 2 11 0 3 7 9 6 12 7 4 8 0 -2 2 9 8 10 1 10 0 6 11 -7
2201gJ6mj5LmMLj1J0ooJ%J6ojPkKLljJ0%mJ0mJPnj1J1plJ0j6MJqMJlKMNj7QQj0
$$ -7 9 5 -10 -7 -11 -7 -4 -15 -5 -11 -17 -16 -16 0 -6 -7 0 -2 0 3 0 -1 9 9 5 15 11 12 19 14 3 14 7 4 14 -2 2 3 -5 -1 0 -3 -1 3 8 -9 -1 7 -3
2250cj0Pj1JJ1MmKjpJ3MlnOnJ0QPj2Nj0MNqKQKj7%Lj1MPjjmLj4J1lmJKmOkK%m
$$ -3 -13 -6 -17 -16 -5 -1 -5 -3 -4 -11 2 6 3 -2 4 -1 9 17 24 12 17 7 11 16 8 10 18 20 3 3 6 -5 -1 6 5 4 0 3 -11 0 -3 -7 -6 -4 -8 -2 -4 -2 -2 -6
2300fN%J1mnLQr%J5Lj6nJ4LlOpPmpmLjRj4rjJ0%JJj9J8j3KRlmJMMk%NnklK1rN
$$ -6 -1 -1 10 6 1 4 12 3 3 18 21 5 0 14 17 14 20 13 20 16 9 5 8 7 16 2 -7 -8 2 2 3 4 -15 3 -10 -8 1 -2 -6 -5 -1 3 1 1 6 1 -1 -4 17 8 13
2351A3pNmmJ4j3J0rJLOPj3j1J1kJ0j2pJ3j2mJ3j4mJ4j1NqJJOKrJ1OOlrjN%%J2
$$ 13 6 11 7 3 17 4 14 5 6 9 15 22 9 -2 9 7 17 5 -2 11 -1 -5 8 -6 -10 4 -7 -2 -10 -9 -8 -2 0 -9 2 8 14 11 2 1 6 6 6 18
2395A8nKmoQmkmR%j4j3K2lkLjnNpMmK%oJ0j0O%oOkLjkMJJjQmNlpJ6nLlj3J3nL
$$ 18 13 15 11 5 13 9 7 3 12 12 -2 -15 7 4 2 5 4 -1 4 -3 1 -3 -1 -1 -7 3 -7 -1 -1 -7 -1 -3 0 -1 -3 1 2 3 2 10 6 11 8 1 17 12 15 12 -1 12 7 10
2447A0ooJPJnnj1%mPKJPMnljkNlQrNlNQlkJrJ0J2j6QrJ1PkrL%nJ4rPj4qOlnJl
$$ 10 4 -2 -1 6 7 2 -3 -14 -14 -18 -11 -9 -8 -1 3 -2 -5 -6 -8 -3 -6 2 -7 -2 -5 0 8 5 3 4 -5 5 17 1 9 0 11 18 16 7 10 10 5 19 10 17 3 -5 1 -2 -7 -6 -9
2500iLljnRjMljLkOlKlnNJ2mJJ0kj0j%J6j0o%RmMkjRkj3Nj1%NJ%Joj0QMrmJRO
$$ -9 -6 -9 -10 -15 -6 -7 -3 -6 -7 -4 -6 0 -3 -1 -4 -9 -4 8 4 5 15 13 3 2 2 18 8 2 2 11 7 11 9 8 17 15 2 7 -4 -4 1 2 2 3 -3 -13 -5 -1 -10 -14 -13 -4 2
2553BrLpJQ%%J5j4NJ3j9J9j1RMj8J1kpJjllMLj5%J9j4moJ0kL%njjrJ5mJkKmJ6
$$ 2 -7 -4 -11 -10 -2 -2 -2 13 -1 4 17 -2 17 6 15 19 1 12 10 3 4 3 0 -3 1 4 -11 -11 8 -6 -10 -16 -6 -8 -5 -5 -10 -11 -12 -21 -6 -10 -9 -11 -9 -13 3
2600Cj3J2Oj6J2LLrMNmNmmQmjkj4RPnrjNjlMpj1jJ8mKlNkkKKOKj3kJ0KrQmJ2J
$$ 3 -10 2 8 -8 4 7 10 1 5 10 6 11 7 3 11 7 6 4 -10 -1 6 1 -8 -9 -4 -5 -8 -4 -11 -22 -23 -5 -9 -7 -10 -5 -7 -9 -7 -5 1 3 -10 -12 -2 0 -9 -1 -5 7 8
2651HkOnNoJ2oj0mJ1kJ3j9Oj6KljNJ1j0j5RRpn%J2j2J2oLQLj1J2Oo%nNpK3l1J5
$$ 8 6 12 7 12 6 18 12 2 -2 9 7 20 1 7 -9 -7 -10 -11 -6 5 -5 -20 -11 -2 -9 -14 -14 -2 -14 -2 -8 -5 3 6 -5 7 13 7 7 2 7 0 23 -8 7
2696GLmLnNnJ6rjpmjlMkjkK%oLjoQj1J3qMoJ0rLPMKnNOKqLlKkj0J4mJnjMrJ3%
$$ 7 10 6 9 4 9 4 20 11 10 3 -1 -2 -5 -1 -3 -4 -6 -4 -4 -10 -7 -8 -14 -6 -17 -4 -12 -8 -14 -4 -13 -10 -3 1 3 -2 3 9 11 3 6 3 5 3 -7 7 3 4 -1 -2 2 -7 6 6
2750FjOk3RRj1mRoOqk%L%KjKoLJ0mNjJ1JLj0MjJNonNlOrOp%pKJmjLnKJKokMMK
$$ 6 5 11 -12 -3 6 -5 -9 0 -6 0 -8 -10 -10 -7 -7 -5 -6 -4 -10 -7 3 -1 4 3 14 15 18 8 12 11 12 17 11 6 11 8 14 5 11 4 4 -3 -1 0 -4 -5 -2 -7 -5 -4 -2 -8 -10 -6 -2 0
2806@Rlj3%J1j1%%J1mJ1mNJj1mPRkmRj2OmJkMj4P%j0Lj0oNoJ2rJ3Nj0PJ0j1J0
$$ 0 9 6 -7 -7 4 -7 -7 -7 4 0 11 7 12 13 2 -2 5 14 12 8 17 5 11 7 8 6 10 -4 3 3 -7 -4 -14 -20 -15 -21 -9 -18 -5 0 -10 -3 7 -4 6
2851Fn%jKRnj1J4j1QjoJ5nQnnkPJj0MrjNLjj0Qj1NKj5J2pQooPrJ6Mjj2J2OknR
$$ 6 1 1 0 2 11 6 -5 9 -2 6 5 -1 14 9 17 12 7 5 12 13 3 7 -2 -3 2 5 4 -6 2 -9 -4 -2 -17 -5 -12 -4 -10 -16 -9 -18 -2 2 1 -11 1 7 5 0 9
2900Ij3J6rNJkklOnrJ0%JPKj2Nj2OmNpPopJ6qMoMKlpJNnKJRj4J2%Pm%OoqQJPJ3
$$ 9 -4 12 3 8 9 7 5 2 8 3 -6 4 4 5 12 14 2 7 -5 1 -3 2 -5 2 -4 -11 5 -3 1 -5 -1 1 -2 -9 -8 -3 -8 -6 -5 4 -10 2 2 9 5 5 11 5 -3 5 6 13 26
2953B6rpmjQrLlj1Rm%mMmPoLJMpljNj0OPRnj4J1qPMLMpk%MRoj2J0MjlqJ4nj0L
$$ 26 17 10 6 5 13 4 7 4 -7 2 -2 -2 -6 -2 -6 1 -5 -2 -1 3 -4 -7 -8 -3 -13 -7 0 9 4 -10 1 -7 0 4 7 11 4 2 2 6 15 9 -3 7 11 10 7 -1 13 8 -2 1
3005Aqlj%KnN%jmOpJ3nJKjJ2lj5RMkMqKKN%JkLj6J6jmkoR%mlKokj1J4lKmmLqj
$$ 1 -7 -10 -11 -11 -9 -14 -9 -9 -10 -14 -8 -15 -2 -7 -6 -4 -5 7 4 -11 -2 2 0 4 -4 -2 0 5 5 6 4 7 -9 7 6 2 0 -6 3 3 -1 -4 -2 -8 -10 -21 -7 -10 -8 -12 -16 -13 -21 -22
3059b2MRJOMomJJNmOLmQoOLpj2J1J3j1rK3j6nR%rmkmklJ5LnrpJ1noKNnROJnJ5
$$ -22 -18 -9 -8 -2 2 -4 -8 -7 -6 -1 -5 1 4 0 8 2 8 11 4 -8 3 16 5 -4 19 3 -2 7 7 -2 -6 -8 -12 -14 -17 -2 1 -4 -13 -20 -9 -14 -20 -18 -13 -18 -9 -3 -2 -7 8
3110Hk2K0j%lJ0kK%j0KOMj4MkJjjMmqnJ5ppjNkMpKmNJkJJM%lpOmQLOqORNnMpM
$$ 8 -14 6 5 5 2 12 10 12 12 2 4 10 14 0 4 2 3 2 1 5 1 -7 -12 3 -4 -11 -12 -7 -9 -5 -12 -10 -14 -9 -8 -10 -9 -8 -4 -4 -7 -14 -8 -12 -4 -1 5 -3 3 12 17 12 16 9 13
3165A3kkJ0lj3j2J7j8J1Kkj1Np%QlmPjkLqKKjoRJ4qMRk%j4PJLKj2NjKJ4j0LKj8
$$ 13 11 9 19 16 3 -9 8 -10 1 3 1 -10 -5 -12 -12 -4 -7 -11 -4 -5 -7 -4 -12 -10 -8 -9 -15 -6 8 0 4 13 11 11 -3 4 5 8 10 -2 3 2 4 18 8 11 13 -5
3213eRJ0j1jj4RlmRmknNrOjPmOkmOpRLmJ0nNoQoKRrpLMqNkJ5j0OprJ2j6MkpJ1
$$ -5 4 14 3 2 -12 -3 -6 -10 -1 -5 -7 -12 -7 -16 -10 -11 -4 -8 -2 -4 -8 -2 -9 0 3 -1 9 4 9 3 11 5 7 16 7 0 3 7 -1 4 2 17 7 13 6 -3 9 -7 -3 -5 -12 -1
3265aj8OO%LloLOj3J5j%J3j2J2oJLLoNJ4j4Pkj1MooJ3j1%Rj1MOq%MmLjjj0J2j2
$$ -1 -19 -13 -7 -7 -4 -7 -13 -10 -4 -17 -2 -3 -3 10 -2 10 4 5 8 11 5 10 24 10 17 15 4 8 2 -4 9 -2 -2 7 -4 0 6 -2 -2 2 -2 1 0 -1 -11 1 -11
3312a1J0rnJ4pOjjJ%P%RmPj3PjQlqJ0j3OlOj3nJ1qjRj3JRmqKNj0oJ4lOMOpmnJ
$$ -11 -1 -10 -15 -1 -8 -2 -3 -4 -3 -3 4 4 13 9 16 3 10 9 17 14 6 16 3 9 6 12 -1 -6 5 -3 -4 5 -8 -7 2 -2 -10 -8 -3 -13 -19 -5 -8 -2 2 8 1 -3 -8 -7
3362gJ3j1OoJ4rmJ4m%JNj6J1J0j1J0j5jJ1kMorOpPmpJr%J2j0J0%K%jkqQKONnN
$$ -7 6 -5 1 -5 9 0 -4 10 6 6 7 12 -4 7 17 6 16 1 0 11 9 13 7 -2 4 -3 4 0 -7 -6 -15 -15 -3 -13 -3 -3 -1 -1 -2 -4 -12 -4 -2 4 9 4 9
3409IkOj8J3mNnKOmkMKj4MkJ2rlj0J1P%j7LMpj0J0%mJ4rMoJJ7j9KkRKOJQj3JJ0
$$ 9 7 13 -5 8 4 9 4 6 12 8 6 10 12 -2 2 0 12 3 0 -10 1 8 8 -9 -6 -2 -9 -19 -9 -9 -13 1 -8 -4 -10 -9 8 -11 -9 -11 -2 0 6 7 15 2 3 13
3457A3rOk%%nmk%RKj0pN%JnOj1J1rJ0j0mJ2o%J0lJ%pjkJ2NkQqKMkkJ0j6KJ6rp
$$ 13 4 10 8 8 8 3 -1 -3 -3 6 8 -2 -9 -4 -4 -3 -8 -2 -13 -2 -11 -1 -11 -15 -3 -9 -9 1 -2 -1 -1 -8 -9 -11 1 6 4 12 4 6 10 8 6 16 0 2 18 9 2
3506BPj4Qkjnj4ROmp%Nn%KJ0oOlLJmJ1j8OOJ0j2NkLLKLll%nK1j4J1lj0oPJqK%
$$ 2 9 -5 3 1 0 -5 -19 -10 -4 -8 -15 -15 -10 -15 -15 -13 -3 -9 -3 -6 -3 -2 -6 5 -13 -7 -1 9 -3 2 0 3 6 8 11 8 5 5 0 21 7 18 15 5 -1 6 7 -1 1 1
3556Aj3J8j3J2j7JMrONpjJ3nlJ2qJ0lkPnLj%LmKJ2j1lJ0%j0kP%LjomOj0KOjom
$$ 1 -12 6 -7 5 -12 -11 -7 -16 -10 -5 -12 -13 0 -5 -8 4 -4 6 3 1 8 3 6 5 5 8 4 6 18 7 4 14 14 4 2 9 9 12 11 5 1 7 -3 -1 5 4 -2 -6
3604fk%%jQ%noLNJ5j7O%N%MJJ6j9KkQqJLnOj1PmjKrJJ6j3Pj2%%KKqJ3qkkmNJr
$$ -6 -8 -8 -8 -9 -1 -1 -6 -12 -9 -4 11 -6 0 0 5 5 9 10 26 7 9 7 15 7 8 11 6 12 1 8 4 3 5 -4 -3 13 0 7 -5 -5 -5 -3 -1 -9 4 -4 -6 -8 -12 -7 -6 -15
3656a5J6rlJ6mkJ3Pj0KKjoJ3rRj1MRj0KmpjnNj0QjqM%nLKJ1j9J0LoJLMKJKlml
$$ -15 1 -8 -11 5 1 -1 12 19 9 11 13 12 6 19 10 19 8 12 21 11 13 9 2 1 -4 1 -9 -1 -2 -10 -6 -6 -11 -8 -6 5 -14 -4 -1 -7 -6 -3 1 3 4 6 3 -1 -4
3705dKJ2oPpOJpJ3lmJmmK%J%mmoJklJQj4PkOK%OmJpQMrRLpQQojk%kLmoJ6krLK
$$ -4 -2 10 4 11 4 10 11 4 17 14 10 11 7 3 5 5 6 6 2 -2 -8 -7 -9 -12 -11 -3 -17 -10 -12 -6 -4 -4 2 -2 -1 -8 0 4 -5 4 7 0 8 16 10 9 7 7 5 8 4 -2 14 12 3 6 8
3762HjNj5Nj2NJ1r%JlmjJ0j1pJ9j3J3j1pJ4MMJnLjjMJ0rPpRj8MJ0mmKOMj1lNp
$$ 8 7 12 -3 2 -10 -5 6 -3 -3 -2 -5 -9 -10 0 -11 -18 1 -12 1 -10 -17 -3 1 5 6 1 4 3 2 6 16 7 14 7 16 -2 2 12 8 4 6 12 16 5 2 7 0
3809@KoJ9j6nQr%%NKj2K%J1j0JOP%nMkJ4pJ3rNoNqj1RLPj4Oj3J1o%K%pRj0ljJ2
$$ 0 2 -4 15 -1 -6 2 -7 -7 -7 -2 0 -12 -10 -10 1 -9 -8 -2 5 5 0 4 2 16 9 22 13 18 12 17 9 -2 7 10 17 3 9 -4 7 1 1 3 3 -4 5 -5 -8 -9 3
3858CmMqmPpjJMRj2J0oMJ%RlNMj1MOJJnj1J6l%pnjJ0j5kMj0PlkQj3J0KkKmPJj
$$ 3 -1 3 -5 -9 -2 -9 -10 -9 -5 4 -8 2 -4 0 1 1 10 7 12 16 5 9 15 16 17 12 1 17 14 14 7 2 1 11 -4 -6 -2 -12 -5 -8 -10 -2 -15 -5 -3 -5 -3 -7 0 1 0
3909@JnQj0PqJJ2lRjlOrj2RPLj8J1LMj0Qpj1J3mKjmnRqkjJq%NoNrJ3JPqJ9j5J1
$$ 0 1 -4 4 -6 1 -7 -6 6 3 12 11 8 14 5 -7 2 9 12 -6 5 8 12 2 10 3 -8 5 1 3 2 -2 -7 2 -6 -8 -9 -8 -16 -16 -11 -17 -12 -21 -8 -7 0 -8 11 -4 7
3959GOjknJ2%j6J4j3JNLj0%JLnMkJpjMjNnpK%jJ3j6Pj5MoJ2JMqJ4OQj6PMkJ%l
$$ 7 13 12 10 5 17 17 1 15 2 3 8 11 1 1 2 5 0 4 2 3 -4 -5 -1 -2 3 -2 -9 -7 -7 -8 5 -11 -4 -19 -15 -21 -9 -8 -4 -12 2 8 16 0 7 11 9 10 10 7
4009GKqLKMk0J2lrKRl%j5J1NrqkMJ7lj4J3qnK0j1j3J4kQkJMKOpMj3QJ2j4PKjM
$$ 7 9 1 4 6 10 -10 2 -1 -10 -8 1 -2 -2 -17 -6 -1 -10 -18 -20 -16 1 -2 -16 -3 -11 -16 4 -7 -20 -6 -8 0 -2 -1 3 5 11 4 8 -5 3 15 1 8 10 9 13
4056A3lno%Ojj0NqjL%oMlOnONKojlrJ4L%KjJ3plLkKOqjLLpPoPoMqnLOoJJqPjl
$$ 13 10 5 -1 -1 5 4 -6 -1 -9 -10 -7 -7 -13 -9 -12 -6 -11 -5 0 2 -4 -5 -8 -17 -3 0 0 2 1 14 7 4 7 5 7 13 5 4 7 10 3 10 4 11 5 9 1 -4 -1 5 -1 0 1 -7 0 -1 -4
4113dMj0kPmlNnJ3Oj0lJ4rJ3qLPRj3NqpP%PpJrOmjNnlLjj3PKJLj8K0j1PRj2Lp
$$ -4 0 -10 -12 -5 -9 -12 -7 -12 1 7 -3 -6 8 -1 12 4 7 14 23 10 15 7 0 7 7 14 7 8 -1 5 1 0 5 0 -3 0 -1 -14 -7 -5 -4 -1 -19 1 -10 -3 6 -6 -3 -10
4163a0J3k2K0%nPj1J1RpRPrQojKJj0Oj2LNmkLlKlnnJJ0jljooJ2joOmqJ7Lkj3J9
$$ -10 3 -19 1 1 -4 3 -8 3 12 5 14 21 12 20 14 13 15 16 6 12 0 3 8 4 2 5 2 4 1 -4 -9 -8 2 1 -2 -3 -9 -15 -3 -4 -10 -4 -8 -16 1 4 2 -11 8
4212H%n%%J5k0RKjMPknpKljnQqPpJ1j3kpJ0Nj6qJ5kJ1jqj6J4QJ6j1lPpPj2J0%
$$ 8 8 3 3 3 18 -2 7 9 8 12 19 17 12 5 7 4 3 -2 6 -2 5 -2 9 -4 -6 -13 -3 2 -14 -22 -7 -9 2 1 -7 -23 -9 -1 15 4 1 8 1 8 -4 6 6
4259FJkMpJ3klJ5pj3PlpOj8J6nLmlKopOqMM%lJ3%MkkK%RolKQk%Oj0KlJMqKJJ0
$$ 6 7 5 9 2 15 13 10 25 18 5 12 9 2 8 -10 6 1 4 0 -3 -1 -7 -14 -8 -16 -12 -8 -8 -11 2 2 6 4 2 4 4 13 7 4 6 14 12 12 18 8 10 7 8 12 4 6 7 17
4312A7j1pmJ1%qMmkPKKon%j1QmKjLNnMjJ2mJJkKJ0qoJ1LoRj9POqK%j6OMj0J0q
$$ 17 6 -1 -5 6 6 -2 2 -2 -4 3 5 7 1 -4 -4 -15 -7 -11 -9 -10 -7 -2 -7 -3 -4 8 4 5 6 4 6 16 8 2 13 16 10 19 0 7 13 5 7 7 -9 -3 1 -9 1 -7
4362gJJPPj5rK1k0MRrPqMMpQkqJ9j0MLL%Mj0J8nJ%j1MkpkQ%lj8J1%Mk0J1JMLj
$$ -7 -6 -5 2 9 -6 -15 6 -14 -10 -1 -10 -3 -11 -7 -3 -10 -2 -4 -12 7 -3 1 4 7 7 11 1 19 14 15 15 4 8 6 -1 -3 5 5 2 -16 -5 -5 -1 -21 -10 -9 -5 -2 -3
4411coJ0j1lJ1j4QkNLK%j0J5mpJ2%Mj1MPj5J6lkKmOj4RJrqKKjmRmlq%jJ4%j2O
$$ -3 -9 1 -10 -13 -2 -16 -8 -10 -5 -2 0 0 -10 5 1 -6 6 6 10 -1 3 10 -5 11 8 6 8 4 10 -4 5 6 -3 -11 -9 -7 -8 -12 -3 -7 -10 -18 -18 -19 -5 -5 -17 -11
4459a1NpMmJ6ljRj1J1pJ2j0Jj2LJ4nJ2j6NRk2J2plQpMjOKj5JJ1j5llLlLpJ8o%
$$ -11 -6 -13 -9 -13 3 0 -1 8 -3 8 1 13 3 4 -8 -5 9 4 16 0 5 14 -8 4 -3 -6 2 -5 -1 -2 4 6 -9 -8 3 -12 -15 -18 -15 -18 -15 -22 -4 -10 -10
4504a0J2kkOmNJNkjrKMKKLnJrJ2j8KoNROj6KnmJ1mnn%QjOj3MJMlJNJmOKNLJ5j3
$$ -10 2 0 -2 4 0 5 6 11 9 8 -1 1 5 7 9 12 7 8 -1 11 -7 -5 -11 -6 3 9 -7 -5 -10 -14 -3 -7 -12 -17 -17 -9 -10 -4 -17 -13 -12 -8 -11 -10 -5 -4 -8 -2 0 5 8 23 10
4557A0k%jo%J1%Rj2j3J1nrKokNmRppLKJ0qJPpKlPKKj%jjMKPrlRJpjJ1kKnrJ6k0
$$ 10 8 8 7 1 1 12 12 21 9 -4 7 2 -7 -5 -11 -13 -8 -12 -3 -10 -17 -14 -12 -2 -10 -9 -2 -9 -7 -10 -3 -1 1 0 0 -1 -2 2 4 11 2 -1 8 9 2 1 12 10 12 7 -2 14 -6
4610fPK%jqlRrJkNoqPQj7K1j0JQkmlPKQJjrRNpoQokJ7j4KKrJ1j4QNlJnn%OrmQ
$$ -6 1 3 3 2 -6 -9 0 -9 -8 -10 -5 -11 -19 -12 -4 -21 0 -10 -9 -1 -3 -7 -10 -3 -1 7 8 7 -2 7 12 5 -1 7 1 -1 16 2 4 6 -3 8 -6 2 7 4 5 0 -5 -5 1 -8 -12 -4
4664dppMQj2J1OnKLOj5OPqJ1JjJJJ%mOr%mLKJqKpQMqOj2J5j2KNljJj0J9j0j0R
$$ -4 -11 -18 -14 -6 -18 -7 -1 -6 -4 -1 5 -10 -4 3 -5 6 7 6 7 8 9 9 5 11 2 2 -2 1 3 4 -4 -2 -9 -1 3 -5 1 -11 4 -8 -6 -1 -4 -5 -4 -14 5 -5 -15 -6
4714f%KJJMpmJ6o%MRm%Nj7J0nPpOKokmMpKPk2J8pmMmmOOJno%J2kj4J3NljLNm%
$$ -6 -6 -4 -3 -2 2 -5 -9 7 1 1 5 14 10 10 15 -2 8 3 10 3 9 11 5 3 -1 3 -4 -2 5 -17 1 -6 -10 -6 -10 -14 -8 -2 -1 -6 -12 -12 0 -2 -16 -3 2 -1 -2 1 6 2 2
4767BkNJ2nqQNj1RJmLoj1J3qLnj4O%%kLj2J4lrNm%OPKJnLOJJoNOj0lJ0KqKPj1
$$ 2 0 5 17 12 4 12 17 6 15 16 12 15 9 -2 11 3 6 1 -13 -7 -7 -7 -9 -6 -18 -4 -7 -16 -11 -15 -15 -9 -2 0 1 -4 -1 5 6 7 1 6 12 2 -1 9 11 3 5 12 1
4818AJPppNNrQKjpMj2lJ1j2rQPokKJ1l%%LLOQk2QKJllJ4%KkoMJ%pjMlMpJ1j5J
$$ 1 2 9 2 -5 0 5 -4 4 6 5 -2 2 -10 -13 -2 -14 -23 -15 -8 -14 -16 -14 -3 -6 -6 -6 -3 0 6 14 -8 0 2 3 0 -3 11 11 13 11 5 9 10 10 3 2 6 3 7 0 11 -4 -3
4871c%l%lKJ0%llpNoJMQj3J1oOMNKoJ0%NlrRmMnjNj5%%oR%nPj7J0nKMj2LJPpP
$$ -3 -3 -6 -6 -9 -7 3 3 0 -3 -10 -5 -11 -10 -6 2 -11 0 -6 0 4 9 11 5 15 15 20 17 8 17 13 17 12 11 16 1 1 1 -5 4 4 -1 6 -11 -1 -6 -4 0 -12 -9 -8 -1 -8 -1
4924appJ1nKNMkkOJ0j3KMJ1Oj2jPqlKkkJQj3JlRj5qJ0Kjj4J8j0Lm%LKjJ0oJ1R
$$ -1 -8 -15 -4 -9 -7 -2 2 0 -2 4 14 1 3 7 18 24 12 11 18 10 7 9 7 5 6 14 1 2 -1 8 -7 -15 -5 -3 -4 -18 0 -10 -7 -11 -11 -8 -6 -7 3 -3 8 17
4972A7j9KOl%KJ3j0NoJQj4Qq%J7j7RjrjpLjpJ2ojNpLmpN%QlmJ3nNJrJ4KkjRKj2
$$ 17 -2 0 6 3 3 5 18 8 13 7 8 16 2 10 2 2 19 2 11 10 1 0 -7 -4 -5 -12 0 -6 -7 -2 -9 -6 -10 -17 -12 -12 -4 -7 -11 2 -3 2 3 -6 8 10 8 7 16 18 6
5023FQJJj7J4mnLJ3k3NNj3KJ4j1NpnJ0pLMlqOmnPj0R%kMOMKMNplnJ3kJjj3NKq
$$ 6 14 15 16 -1 13 9 4 7 20 -3 2 7 -6 -4 10 -1 4 -3 -8 2 -5 -2 2 -1 -9 -3 -7 -12 -5 -15 -6 -6 -8 -4 2 6 8 12 17 10 7 2 15 13 14 13 0 5 7 -1
5073aNkPqkkJojoKoJ6kqJ5j5jQ%qJ6j0QlPNj5Rj1mJ4LNqJ2j1J4%j5KLNj3J0jM
$$ -1 4 2 9 1 -1 -3 -2 -8 -9 -15 -13 -19 -3 -5 -13 2 -13 -14 -6 -6 -14 2 -8 0 -3 4 9 -6 3 -8 -12 2 5 10 2 14 3 17 17 2 4 7 12 -1 9 8 12
5120A2j2Oj6kKPr%KQj2N%lPp%%LMMR%j0PKnjJ4rKoJ0pjJ6j0JMqnQrkLmOj2Rj3
$$ 12 0 6 -10 -12 -10 -3 -12 -12 -10 -2 -14 -9 -9 -12 -5 -12 -12 -12 -9 -5 -1 8 8 -2 5 7 2 1 15 6 8 2 12 5 4 20 10 11 15 7 2 10 1 -1 2 -2 4 -8 1 -12
5170a2J%%lPj1J1pnQJJ1pNJMJpLJ2%qkR%j0J1o%qLMJkrQj2J5mpLj2J0j0NNj4L
$$ -12 -11 -11 -11 -14 -7 -18 -7 -14 -19 -11 -10 1 -6 -1 0 4 5 -2 1 13 13 5 3 12 12 2 13 7 7 -1 2 6 7 5 -4 4 -8 7 3 -4 -1 -13 -3 -13 -8 -3 -17 -14
5218a4J3mollRMjj0J1J4mKlJ5pMnMKKmnkmKNrKnMnmNrLKLoqnJ9j2RnRj5J1lLk
$$ -14 -1 -5 -11 -14 -17 -8 -4 -5 -15 -4 10 6 8 5 20 13 17 12 16 18 20 16 11 9 5 7 12 3 5 0 4 -1 -5 0 -9 -6 -4 -1 -7 -15 -20 -1 -13 -4 -9 0 -15 -4 -7 -4 -6
5269fKPMpLNqJ2mnJ4jkmk%Pj0qJ0qJj1PjJlmnk%RnJ0mkJ0lo%J1kKj9J9%krLJ9
$$ -6 -4 3 7 0 3 8 0 12 8 3 17 16 14 10 8 8 15 5 -3 7 -1 0 -11 -4 -5 -4 -7 -11 -16 -18 -18 -9 -14 -4 -8 -10 0 -3 -9 -9 2 0 2 -17 2 2 0 -9 -6 13
5319A3rj2J4NnOnJJKLr%oRmroJJ2j1mOqP%j0PpJ4klJ2npJ4kLkLjoJ0j6K4j3Lm
$$ 13 4 -8 6 11 6 12 7 8 9 11 14 5 5 -1 8 4 -5 -11 -10 2 -9 -13 -7 -15 -8 -8 -18 -11 -18 -4 -6 -9 3 -2 -9 5 3 6 4 7 6 0 10 -6 18 5 8 4
5367DoOm%njKPkJjklpJ0%l%j0j1J4KpPMloPQq%J1jjlQMKj2J3MqqMnQqkKmnmlP
$$ 4 -2 4 0 0 -5 -6 -4 3 1 2 1 -1 -4 -11 -1 -1 -4 -4 -14 -25 -11 -9 -16 -9 -5 -8 -14 -7 1 -7 -7 4 3 2 -1 7 11 13 1 14 18 10 2 6 1 9 1 -1 1 -3 -8 -12 -15 -8
5421hLpLokJJPqOMlLnqQJOPj4LJNJ0kLk%KkKlOmpKJppJmnJ2nkjQ%Mj3OoQJNmj
$$ -8 -5 -12 -9 -15 -17 -16 -15 -8 -16 -10 -6 -9 -6 -11 -19 -11 -10 -4 3 -11 -8 -7 -2 8 6 9 7 7 9 7 9 6 12 8 1 3 4 -3 -10 -9 -13 -18 -6 -11 -13 -14 -6 -6 -2 -15 -9 -15 -7 -6 -1 -5 -6
5478fNQj4JMQj8NQj6K7j1pJ4%oKPj7J0NplJ1j3olRkNj2%KJojRJ%JoMJ0oOqJkK
$$ -6 -1 7 -7 -6 -2 6 -12 -7 1 -15 12 1 -6 8 8 2 4 11 -6 4 9 2 -1 10 -3 -9 -12 -3 -5 0 -12 -12 -10 -9 -15 -16 -7 -6 -6 -5 -11 -7 3 -3 3 -5 -4 -6 -4
5527dkRJ0j0Rqm%Qj2J0KmNjlLpR%k1NRk1J6j7J4j0JOj4QLRloPjNJPj3PJ7j1JJ
$$ -4 -6 3 13 3 12 4 0 0 8 -4 6 8 4 9 8 5 8 1 10 10 -11 -6 3 -18 -2 -19 -5 -15 -14 -8 -22 -14 -11 -2 -5 -11 -4 -5 0 1 8 -5 2 19 8 9 10
5574A0Mj1J3lmjoJ7pj0pOKlnrJ7k7K8j2Rpp%Oj0QMpPoNkmRpOMLNmKjKlJ2j2J5
$$ 10 14 3 16 13 9 8 2 19 12 2 -5 1 3 0 -5 -14 3 -24 4 -8 1 -6 -13 -13 -7 -17 -9 -5 -12 -5 -11 -6 -8 -12 -3 -10 -4 0 3 8 4 6 5 7 4 16 4 19
5622A9j4OjnKj2RrJnLKkNLk3J4lJ3klmNoLnMLmNj0J6j5J4NjjnJ5j0J0Kj1MJj4
$$ 19 5 11 10 5 7 -5 4 -5 -4 -9 -6 -4 -6 -1 2 -21 -7 -10 3 1 -2 -6 -1 -7 -4 -9 -5 -2 -6 -1 -11 5 -10 4 9 8 7 2 17 7 17 19 8 12 13 -1
5668aPmLmnMrmmJ6j0OrJ0qmNmOJjOjPpRjpNRoRj7PpJ7rjOj4J2Pqj%lllQoj0mJ0
$$ -1 6 2 5 1 -4 0 -9 -13 -17 -1 -11 -5 -14 -4 -12 -16 -11 -15 -9 -8 -9 -3 -4 3 -4 5 4 -3 2 11 5 14 -3 4 -3 14 5 4 10 -4 8 15 7 6 6 3 0 -3 5 -1 -11 -15 -5
5721eKnNj5Q%NNj8J5mJjkJ0lOmoJ7lMJ5j1j0jMMo%mJnkOppKJ3j5PmkLrJ5nj2O
$$ -5 -3 -8 -3 -18 -10 -10 -5 0 -18 -3 -7 -6 -7 -9 1 -2 4 0 -6 11 8 12 27 16 6 5 9 13 7 7 3 4 -1 -3 3 -4 -11 -9 4 -11 -4 -8 -10 -7 -16 -1 -6 -18 -12
5770a2jPj0nJ2MQqOrOrJ1QJMlmJ5oj3J0mnKllmJkmJJ1lpMpLjpOLlkjJ2rMnOJ3
$$ -12 -13 -6 -16 -21 -9 -5 3 -5 1 -8 -2 -11 0 8 9 13 10 6 21 15 2 12 8 3 5 2 -1 -5 -4 -6 -10 -9 2 -1 -8 -4 -11 -8 -9 -16 -10 -7 -10 -12 -13 -1 -10 -6 -11 -5 8
5821Hj2J0qNKoQKJMrQoRjnPpJj0jPj1jLp%JKlpJ3rMJ2Kjj4OmJNMoJQrPQmNKjj3
$$ 8 -4 6 -2 3 5 -1 7 9 10 14 5 13 7 16 15 10 17 10 11 1 0 7 -4 -5 -2 -9 -9 -8 -6 -9 -16 -3 -12 -8 4 6 5 -9 -3 -7 -6 -1 3 -3 -2 6 -3 4 12 8 13 15 14 1
5875AOj2J1mjoJ7jj2r%J0NqplOo%Kj1LQLnJ0j2RJLoJ5k%j0J1Rj5QLkpLpQoRjk
$$ 1 7 -5 6 2 1 -5 12 11 -1 -10 -10 0 5 -3 -10 -13 -7 -13 -13 -11 -22 -19 -11 -8 -13 -3 -15 -6 -5 -2 -8 7 5 5 -5 6 15 0 8 11 9 2 5 -2 6 0 9 8 6
5924F%mnNKpLrLnLKJmJjj2J5PPj4%PjOj0KJ6j1M%RmkmJJ2j4Pjqj1RlJ0nj3Kj3
$$ 6 6 2 -3 2 4 -3 0 -9 -6 -11 -8 -6 -5 -9 -8 -9 -21 -6 1 8 -6 -6 1 0 6 -4 -2 14 3 7 7 16 12 10 6 7 19 5 12 11 3 -8 1 -2 8 3 -10 -8 -21
5973b1J1JpKQjKomRklJ1Lj0J9k6J3lQk%OoKM%PLqrJ6j1%PqjkmJ2k0LjKOj5J3j2
$$ -21 -10 -9 -16 -14 -6 -7 -5 -11 -15 -6 -8 -11 0 3 -7 12 -14 -1 -4 4 2 2 8 2 4 8 8 15 18 10 1 17 6 6 13 5 4 2 -2 10 -10 -7 -8 -6 0 -15 -2 -14
6021a4kJ0l%Rj6J8ooKPQoOnJ0j2J7j2JjLQkqjJ2plkJ%knQMj8NpPnkmLj6K1njQ
$$ -14 -16 -6 -9 -9 0 -16 2 -4 -10 -8 -1 7 1 7 2 12 0 17 5 6 5 8 16 14 6 5 17 10 7 5 6 6 4 -1 7 11 -7 -2 -9 -2 -7 -9 -13 -10 -26 -5 -10 -11 -3
6070cLRj8J1nPJPmJ0rkkOkkJ0KnpkKkrOKlmrRj0J2j2MPmNj%jnrJ5lj0J0LnJ1J
$$ -3 0 9 -9 2 -3 4 5 12 8 18 9 7 5 11 9 7 17 19 14 7 5 7 5 -4 2 4 1 -3 -12 -3 -13 -1 -13 -9 -2 -6 -1 -2 -2 -3 -8 -17 -2 -5 -15 -5 -2 -7 4 5
6120EjLoJ7joNjnkJ3onKpnj3J0NrKjOj2nLNNnlNjmJOJ6j5%JkRkjPnMPkLjL%qk
$$ 5 4 7 1 18 17 11 16 15 10 8 21 15 10 12 5 0 -13 -3 2 -7 -5 -6 0 -12 -17 -14 -9 -4 -9 -12 -7 -8 -12 -11 -5 11 -4 -4 -3 -5 4 2 1 8 3 7 14 12 15 14 17 17 9 7
6174GRj1kkKpNKj1OKj0NKj2JOoJ0JpRNnmmR%%LrMJ0KpPOnmoJ3LrNj3QqPlj1On
$$ 7 16 5 3 1 3 -4 1 3 -8 -2 0 -10 -5 -3 -15 -14 -8 -14 -4 -3 -10 -1 4 -1 -5 -9 0 0 0 3 -6 -2 8 10 3 10 16 11 7 1 14 17 8 13 0 8 0 7 4 -7 -1 -6
6226fLom%RrkKjLMj0J2QomOOLqLM%J1j5LJrPlMKNj0LqjJ0pl%jmRLrjm%Qj2PkK
$$ -6 -3 -9 -13 -13 -4 -13 -15 -13 -14 -11 -7 -17 -5 3 -3 -7 -1 5 8 0 3 7 7 18 3 6 7 -2 5 2 6 8 13 3 6 -2 -3 7 0 -3 -3 -4 -8 1 4 -5 -6 -10 -10 -2 -14 -7 -9 -7
6280gmjOKMnOnR%PmMpJ1rJ1llqLRj7Pkj1JJLpOqj0LJ3j0nPNmJRJoLllJ1nPljK
$$ -7 -11 -12 -6 -4 0 -5 1 -4 5 5 12 8 12 5 16 7 18 15 12 4 7 16 -1 6 4 -7 -6 -5 -2 -9 -3 -11 -21 -18 -5 -15 -20 -13 -8 -12 -11 -2 -1 -7 -4 -7 -10 1 -4 3 0 -1 1
6333AKoJ3KlnQnnJ6j5Pkj1J6j6rJ2pj3RlJ9j2nnJ3%mmLjjNj%%MLNnpNOJ0j2oJ3
$$ 1 3 -3 10 12 9 4 12 7 2 18 3 10 8 -3 13 -3 -12 0 -7 -20 -11 -14 5 -7 -12 -17 -4 -4 -8 -12 -9 -10 -11 -6 -7 -7 -7 -3 0 5 0 -7 -2 4 14 2 -4 9
6381IlMoNlkNkOj4LjNpmJrJ3j7MMlmJ1pJ1ljKMj0LRnQmQnLoRm%Lkmj0NjLmJLJ1
$$ 9 6 10 4 9 6 4 9 7 13 -1 2 1 6 -1 -5 -4 -13 0 -17 -13 -9 -12 -16 -5 -12 -1 -4 -5 -3 1 -9 -6 3 -2 6 2 10 5 8 2 11 7 7 10 8 4 -6 -1 -2 1 -3 -2 1 12
6435A2j5oKMOoJqjPKopJ0oRmOkKpPJPL%LKm%pJ3lJj0J%JMKj3n%kQrPkLqRj2lJ0
$$ 12 -3 -9 -7 -3 3 -3 -2 -10 -11 -4 -2 -8 -15 -5 -11 -2 -6 0 -2 0 -7 0 1 8 11 11 14 16 12 12 5 18 15 16 6 7 7 8 12 14 1 -4 -4 -6 2 -7 0 -2 1 -7 2 -10 -13 -3
6489coMLmkOlqJ3%joNlQnJ0%mLLkmRj2LJQj0lolj0jMRlj2J7j4KR%%Jj0NNkQMo
$$ -3 -9 -5 -2 -6 -8 -2 -5 -13 0 0 -1 -7 -2 -5 3 -2 8 8 4 7 10 8 4 13 1 4 5 13 3 0 -6 -9 -19 -20 -16 -7 -10 -22 -5 -19 -17 -8 -8 -8 -7 -17 -12 -7 -9 -1 3 -3
6541cjN%jKmjQMJrJ2kj2QjJLKknlmjj3J0jo%Rj7N%LKJMLJ2mj0J6JjjJnJMj1MJ3
$$ -3 -4 1 1 0 2 -2 -3 5 9 10 1 13 11 -1 7 6 7 10 12 10 5 2 -2 -3 -16 -6 -7 -13 -13 -4 -21 -16 -16 -13 -11 -10 -6 -3 9 5 -5 11 12 11 10 11 6 7 11 0 4 17
6593A7nmoLjlmJ8j8MKj1J1Mj3KKjkJonNlOpLkQOPj1JOlJ1j2RoP%%%KmKqnmQKN
$$ 17 12 8 2 5 4 1 -3 15 -3 1 3 -8 3 7 -6 -4 -2 -3 -5 -4 -10 -15 -10 -13 -7 -14 -11 -13 -5 1 8 -3 -2 4 1 12 0 9 3 10 10 10 10 12 8 10 2 -3 -7 1 3 8
6645HrpLLMoMnj2J1NJmmM%KomJ1lJ0Lj9J7%lJpK1j1Qj0J0lkjMJolmKrJ2qq%Qj1
$$ 8 -1 -8 -5 -2 2 -4 0 -5 -17 -6 -1 0 -4 -8 -4 -4 -2 -8 -12 -1 -4 6 9 -10 7 7 4 5 -2 19 8 16 6 16 13 11 10 14 15 9 6 2 4 -5 7 -1 -9 -9 -1 -12
6695a2jPKKorJ3joLMmQl%J0kkkKjkj%NOJ0j3Mq%Kj0O%JmJ%Pk1J5kn%rJLMnPkn
$$ -12 -13 -6 -4 -2 -8 -17 -4 -5 -11 -8 -4 -8 0 -3 -3 7 5 3 1 3 2 0 -1 -1 4 10 20 7 11 3 3 5 -5 1 1 2 -2 -1 -1 6 -15 0 -2 -7 -7 -16 -15 -12 -8 -13 -6 -8 -13
6748a3MKJ3rNnPPj7J4jkQj0MJ%nKjJj%kkpJKMMloNj1jJ0opmPLmPpJ3LnLMj3J9
$$ -13 -9 -7 6 -3 2 -3 4 11 -6 8 7 5 13 3 7 8 8 3 5 4 5 4 4 2 0 -7 -6 -4 0 4 1 -5 0 -11 -12 -2 -8 -15 -19 -12 -9 -13 -6 -13 0 3 -2 1 5 -8 11
6799A1%LklN%mrK0j4MKqjNorJ1j2RlLnn%lQrLO%nnL%J0JnkJJ2kQjmRj1jPjLJq
$$ 11 11 14 12 9 14 14 10 1 21 7 11 13 5 4 9 3 -6 5 -7 2 -1 2 -3 -8 -8 -11 -3 -12 -9 -3 -3 -8 -13 -10 -10 0 1 -4 -6 -5 7 5 13 12 8 17 6 5 12 11 14 15 7
6852GRj8KjlL%J0j3j2ONNokJj0J1lJ%O%MkQj0jNJjMoQMk%%lkKNqOpN%njmJKj4
$$ 7 16 -2 0 -1 -4 -1 -1 9 -4 -16 -10 -5 0 -6 -8 -7 -17 -6 -9 -8 -8 -2 -2 2 0 8 -2 -3 2 3 2 6 0 8 12 10 10 10 7 5 7 12 4 10 3 8 8 3 2 -2 -1 1 -13
6905a3nPLroRlOmkNRkJnR%kQlRLj2K%kQkjKpNlLNpkmqpJ4Jj2J0nj2J2mJ0jj2l
$$ -13 -18 -11 -8 -17 -23 -14 -17 -11 -15 -17 -12 -3 -5 -4 -9 0 0 -2 6 3 12 15 3 5 5 3 11 9 8 10 3 8 5 8 13 6 4 0 -8 -15 -1 0 -12 -2 -7 -19 -7 -11 -1 -2 -14 -17
6957a7LPJ5j0j1PnPJ8LkjnMqRknJ2j7O%pOq%NjlJLKpqjPOonOJmKj4J1mkJ6rNk
$$ -17 -14 -7 8 -2 -13 -6 -11 -4 14 17 15 14 9 13 5 14 12 7 19 2 8 8 1 7 -1 -1 4 3 0 1 4 6 -1 -9 -10 -3 3 -3 -8 -2 -1 -5 -3 -17 -6 -10 -12 4 -5 0 -2
7008bnJOJ3lMlQnKlLj0Nmj%k%o%pnJ2kLknLkRpmjKLkNNj1JJ0jMlrRJQj0J5j0K
$$ -2 -7 -6 0 13 10 14 11 19 14 16 13 16 6 11 7 6 6 4 4 -2 -2 -9 -14 -2 -4 -1 -3 -8 -5 -7 2 -5 -9 -10 -8 -5 -7 -2 3 -8 -7 3 2 6 3 -6 3 4 12 2 17 7 9
7061ImLRoKpPnnj3JONj1%jkkJQjJomQMJj0kK1j1J0LpLpJ0KJjj%moLlJ6j1J0pj
$$ 9 5 8 17 11 13 6 13 8 3 -10 -9 -3 2 -9 -9 -10 -12 -14 -13 -5 -6 -5 -11 -15 -7 -3 -2 -12 -14 7 -4 6 9 2 5 -2 8 10 11 10 9 9 5 -1 2 -1 15 4 14 7 6
7112Fj2QpK%nkJQpmmJ4opQkJqQJ4j0Rj3K0j2%J2kJ2j0MrMKmPj9PpjLJmJ3rm%j5
$$ 6 -6 2 -5 -3 -3 -8 -10 -9 -1 -8 -12 -16 -2 -8 -15 -7 -9 -8 -16 -8 6 -4 5 -8 12 0 0 12 10 22 12 16 7 11 13 9 16 -3 4 -3 -4 -1 0 -4 9 0 -4 -4 -19
7161a9LJ2onNk%kJNJkMjPjqJ0O%kKRk%jmNj0lM%%pLLjqMlkL%Qr%%JL%oKmMJPn
$$ -19 -16 -4 -10 -15 -10 -12 -12 -14 -13 -8 -7 -9 -5 -6 1 0 -8 2 8 8 6 8 17 15 15 14 10 15 5 2 6 6 6 -1 2 5 4 -4 0 -3 -5 -2 -2 6 -3 -3 -3 -2 1 1 -5 -3 -7 -3 -2 5 0
7218@Qj3J0%JL%jkPooJ1NJomnKlpPmkKrjqOJ2j2Mj1PjMLNlPoJ2Pj0lJOrNKNqP
$$ 0 8 -5 5 5 6 9 9 8 6 13 7 1 12 17 18 12 8 3 5 2 -5 2 -2 -4 -2 -11 -12 -20 -14 -2 -14 -10 -21 -14 -15 -11 -8 -3 -6 1 -5 7 14 4 1 2 8 -1 4 6 11 3 10
7271A0kQj3mRkmmOkRjj5Rj3kJ5j4OJ0j8KqkJ9j0J3pklJ7j2RLopJ6moPj6J1JMl
$$ 10 8 16 3 -1 8 6 2 -2 4 2 11 10 -5 4 -9 -11 4 -10 -4 6 -12 -10 -18 -20 -1 -11 2 -5 -7 -10 7 -5 4 7 1 -6 10 6 0 7 -9 2 3 7 4
7316Dj1JQNlnQj4mQRkmjpJPrkpLkNOqO%JMJMKmPLKkKloJ5m%qNjJlpkJ2j0ppJ3
$$ 4 -7 -6 2 7 4 -1 7 -7 -11 -3 6 4 0 -1 -8 -7 0 -9 -11 -18 -15 -17 -12 -6 -14 -8 -8 -7 -3 -2 2 4 0 7 10 12 10 12 9 3 18 14 14 6 11 10 11 8 1 -1 11 1 -6 -13 0
7371@Jolkj0J2LrLlQnjOKJ0j8NJ3omPmJ5pmQLkRj6%%oJ4rrPqJN%rJnJ0j0pRj1
$$ 0 1 -5 -8 -10 -20 -8 -5 -14 -11 -14 -6 -11 -12 -6 -4 6 -12 -7 6 0 -4 3 -1 14 7 3 11 14 12 21 5 5 5 -1 13 4 -5 2 -6 -5 0 0 -9 -8 -13 -3 -13 -20 -11 -22
7421b2Q%LQpLLnKQk%kRPj0kRjq%%JNOlj0KOj0OJNpojOj1LqNjnMoJ5mNnoJ2MkK
$$ -22 -14 -14 -11 -3 -10 -7 -4 -9 -7 1 -1 -1 -3 6 13 3 1 10 9 1 1 1 2 7 13 10 0 2 8 -2 4 5 10 3 -3 -4 2 -9 -6 -14 -9 -10 -15 -11 -17 -2 -6 -1 -6 -12 0 4 2 4
7475DmJkmQMLj1J5j3K%mkj0OJ5orjNjnJ1mpJ1kj2N%jKOmQj6Q%LPlLMkLnMj0J5
$$ 4 0 1 -1 -5 3 7 10 -1 14 1 3 3 -1 -3 -13 -7 8 2 -7 -8 -3 -4 -9 2 -2 -9 2 0 -12 -7 -7 -8 -6 0 -4 4 -12 -4 -4 -1 6 3 6 10 8 11 6 10 0 15
7525A5ppLO%lkpJ2j4Oj%j2J6qnJ0nmMkmJ2pnNnmJ0J4qqOLllPNj2J3OnOj7%J0K
$$ 15 8 1 4 10 10 7 5 -2 10 -4 2 1 1 -11 5 -3 -8 2 -3 -7 -3 -5 -9 3 -4 -9 -4 -9 -13 -3 11 3 -5 1 4 1 -2 5 10 -2 11 17 12 18 1 1 11 13
7573A3qlmL%lmkLjoLpJ4KqJlLmkn%K1j2J3Ok1POj%NkPj2LMN%oLMn%koNNk0L%P
$$ 13 5 2 -2 1 1 -2 -6 -8 -5 -6 -12 -9 -16 -2 0 -8 -7 -10 -7 -11 -13 -18 -18 3 -9 4 10 -11 -4 2 1 1 6 4 11 -1 2 6 11 11 5 8 12 7 7 5 -1 4 9 -11 -8 -8 -1
7626a%pm%j2J5Oj1OkoNQjQj3J2Pj5J7j6J1%j2J1j1MLPlLrKjKQroNj2NoOKj0kJ
$$ -1 -1 -8 -12 -12 -24 -9 -3 -14 -8 -10 -16 -11 -3 -4 4 -9 3 10 -5 12 -4 7 7 -5 6 -5 -1 2 9 6 9 0 2 1 3 11 2 -4 1 -11 -6 -12 -6 -4 -14 -16 -15
7673a5loJ5pJKJjKOj1J6j0J6j2KJ8j7kJ2mLLpRpoQOj4JmnjJ2j0%%MmJ0rJr%J5
$$ -15 -18 -24 -9 -16 -15 -13 -12 -13 -11 -5 -16 0 -10 6 -6 -4 14 -3 -5 7 3 6 9 2 11 4 -2 6 12 -2 -1 -5 -10 -11 1 -9 -9 -9 -5 -9 1 -8 -7 -16 -16 -1
7719aj4J0%kLjM%JMlJ3MpkJ1klmLLj6kQJ2j5Noj3RjmjqJ0kpMKpOrJ0J0j0RlJm
$$ -1 -15 -5 -5 -7 -4 -5 -1 -1 0 4 1 14 18 11 9 20 18 15 11 14 17 1 -1 7 19 4 9 3 -10 -1 -2 -6 -7 -15 -5 -7 -14 -10 -8 -15 -9 -18 -8 2 -8 1 -2 -1 -5
7768eJ4pJj9K0MNqkQkK%j3KPR%r%nrK2j1mlojjkJKpnJ5l%%LnJJ1jj0J0MqQnJ1
$$ -5 9 2 3 -16 4 8 13 5 3 11 9 11 11 -2 0 7 16 16 7 7 2 -7 15 4 0 -3 -9 -10 -11 -13 -12 -10 -17 -22 -7 -10 -10 -10 -7 -12 -11 0 -1 -11 -1 3 -5 3 -2 9
7818Innj0J3%NqJ2onlN%pJPj0%OpKkkkMk0J3MnOmNKokOJ1j1R%KKlP%lK%l%MMo
$$ 9 4 -1 -11 2 2 7 -1 11 5 0 -3 2 2 -5 -4 3 -7 -7 -1 -8 -6 -8 -10 -12 -8 -28 -15 -11 -16 -10 -14 -9 -7 -13 -15 -9 2 -9 0 0 2 4 1 8 8 5 7 7 4 4 8 12 6
7871Fj0PnJlKkjNnonJKMpKJjnMMNj1JJ1lK%KQPrLO%JnNkJ%nj4LJMj4OlqOQkmJ
$$ 6 -4 3 -2 -1 -4 -2 -4 -5 0 -5 -11 -16 -15 -13 -9 -16 -14 -13 -14 -19 -15 -11 -6 -17 -16 -5 -8 -6 -6 -4 4 11 2 5 11 11 12 7 12 10 11 11 6 -8 -5 -4 0 -14 -8 -11 -19 -13 -5 -7 -11 -10
7927a0j2J8PolmjJ1nLLNj3O%KkJ1Nj5KkJ8j5pmQmMJoJ0j5nKjRPk2J1j2PlRlj0
$$ -10 -22 -4 3 -3 -6 -10 -11 0 -5 -2 1 6 -7 -1 -1 1 -1 10 15 0 2 0 18 3 -4 -8 0 -4 0 1 -5 5 -10 -15 -13 -14 -5 2 -20 -9 -21 -14 -17 -8 -11 -21
7973b1QlOmRLqnJ9qPmLj0QlRJjMolmJ1mPj2mRj6J3q%lkPj1mjPjLmOPj2Lj%J3%
$$ -21 -13 -16 -10 -14 -5 -2 -10 -15 4 -4 3 -1 2 -8 0 -3 6 7 6 10 4 1 -3 8 4 11 -1 -5 4 -12 1 -7 -7 -10 -12 -5 -16 -20 -21 -14 -15 -12 -16 -10 -3 -15 -12 -13 -13 0 0
8024@J1%j0PmOj0J4mJj5PJ0rkKklnOQk2Ol%NlkpRmPj5QPlmKOj1KLNJ1pPj1J1k
$$ 0 11 11 1 8 4 10 0 14 10 11 -4 3 13 4 2 4 2 -1 -6 0 8 -14 -8 -11 -11 -6 -9 -11 -18 -9 -13 -6 -21 -13 -6 -9 -13 -11 -5 -16 -14 -11 -6 5 -2 5 -6 5 3
8073CpRqJ9Lokp%jlm%Nj3OkJj1Pj2RMMkjRpOlpJj4J7MqRjNOj3RJNkrJ1J%j1J3
$$ 3 -4 5 -3 16 19 13 11 4 4 3 0 -4 -4 1 -12 -6 -8 -7 -18 -11 -23 -14 -10 -6 -8 -9 0 -7 -1 -4 -11 -10 -24 -7 -3 -11 -2 -3 2 8 -5 4 5 10 8 -1 10 11 11 0 13
8124A3mKLj2pRj0Nj2J0NqonJ1jOqj0J8Nj0KlJ3lj0PJ0qMokRkOkLpNjolkNqJ3r
$$ 13 9 11 14 2 -5 4 -6 -1 -13 -3 2 -6 -12 -17 -6 -7 -1 -9 -19 -1 4 -6 -4 -7 6 3 -7 0 10 2 6 0 -2 7 5 11 9 12 5 10 9 3 0 -2 3 -5 8 -1
8172aOqnOoKpNjKj0%kmJ0lJKN
$$ -1 5 -3 -8 -2 -8 -6 -13 -8 -9 -7 -17 -17 -19 -23 -13 -16 -15 -13 -8
8191h
##END NTUPLES=NMR FID
##END=
