##TITLE=1H_ES-NC-MeOH
 
 8 sc, 
 25.11.2022
##JCAMPDX= 6.0         $$ Bruker NMR JCAMP-DX V2.0
##DATA TYPE= NMR FID
##DATA CLASS= NTUPLES
##ORIGIN= UXNMR, Bruker Analytische Messtechnik GmbH
##OWNER= root
$$ XWIN-NMR		Version 3.5
$$ Fri Nov 25 14:09:45 2022 Russian Standard Time (UT+4h)  she@DPX200
##.OBSERVE FREQUENCY= 200.1325
##.OBSERVE NUCLEUS= ^1H
##.DELAY= (6, 6)
##.ACQUISITION MODE= SIMULTANEOUS
##.ACQUISITION SCHEME= undefined
##.AVERAGES= 8
##.DIGITISER RES= 18
##SPECTROMETER/DATA SYSTEM= spect
##.PULSE SEQUENCE= zg30
##.SOLVENT NAME= DMSO
##.SHIFT REFERENCE= (INTERNAL, DMSO, 0, 15.7039)
##AUDIT TRAIL= $$ (NUMBER, WHEN, WHO, WHERE, WHAT)
$$ ##TITLE= Audit trail, XWIN-NMR		Version 3.5
$$ ##JCAMPDX= 5.01
$$ ##ORIGIN= Bruker BioSpin GmbH
$$ ##OWNER= she
$$ F:/spectra/data/she/nmr/H-F/1/audita.txt
$$ ##AUDIT TRAIL=  $$ (NUMBER, WHEN, WHO, WHERE, WHAT)
(   1,<2022-11-25 14:08:50.12 +0400>,<she>,<DPX200>,
      <created by zg, POWCHK disabled, PULCHK disabled
       configuration hash MD5:
       00 E9 B6 7A A2 85 ED C7 34 08 36 98 17 FE 4E 26
       data hash MD5: 16K
       A3 7C C5 60 75 61 61 A3 25 1E D0 41 69 FE D5 42>)
$$ ##END=
$$ 
$$ hash MD5
$$ F3 76 DE F0 8A 04 72 91 3C 74 5C A3 01 CB 60 BF
##$RELAX= 
##$RELAX= 
##$RELAX= 
##$RELAX= 
##$RELAX= 
##$RELAX= 
$$ Bruker specific parameters
$$ --------------------------
##$DU= <F:/spectra>
##$EXPNO= 1
##$NAME= <H-F>
##$PROCNO= 1
##$TYPE= <nmr>
##$USER= <she>
##$AMP= (0..31)
100 100 100 100 100 100 100 100 100 100 100 100 100 100 100 100 100 100 
100 100 100 100 100 100 100 100 100 100 100 100 100 100 
##$AQSEQ= 0
##$AQ_mod= 1
##$AUNM= <au_zg>
##$AUTOPOS= <>
##$BF1= 200.13
##$BF2= 200.13
##$BF3= 200.13
##$BF4= 200.13
##$BF5= 200.13
##$BF6= 200.13
##$BF7= 200.13
##$BF8= 200.13
##$BYTORDA= 1
##$CFDGTYP= 0
##$CFRGTYP= 5
##$CHEMSTR= <none>
##$CNST= (0..31)
1 1 145 1 1 1 1 1 1 1 1 1 1 1 1 1 1 1 1 1 1 1 1 1 1 1 1 1 1 1 1 1 
##$CPDPRG= <>
##$CPDPRG1= <>
##$CPDPRG2= <>
##$CPDPRG3= <>
##$CPDPRG4= <mlev>
##$CPDPRG5= <mlev>
##$CPDPRG6= <mlev>
##$CPDPRG7= <mlev>
##$CPDPRG8= <mlev>
##$CPDPRGB= <>
##$CPDPRGT= <>
##$D= (0..31)
0 1.2 0 0 0 0 0 0 0 0.06 0 0.03 0 0 0 0 0.0002 0 0 0 0 0 0 0 0 0 0 0 0 
0 0 0 
##$DATE= 1669370929
##$DBL= (0..7)
120 120 120 120 120 120 120 120 
##$DBP= (0..7)
150 150 150 150 150 150 150 150 
##$DBP07= 0
##$DBPNAM0= <>
##$DBPNAM1= <>
##$DBPNAM2= <>
##$DBPNAM3= <>
##$DBPNAM4= <>
##$DBPNAM5= <>
##$DBPNAM6= <>
##$DBPNAM7= <>
##$DBPOAL= (0..7)
0.5 0.5 0.5 0.5 0.5 0.5 0.5 0.5 
##$DBPOFFS= (0..7)
0 0 0 0 0 0 0 0 
##$DE= 6
##$DECBNUC= <off>
##$DECIM= 24
##$DECNUC= <off>
##$DECSTAT= 4
##$DIGMOD= 1
##$DIGTYP= 9
##$DL= (0..7)
0 120 120 120 120 120 120 120 
##$DP= (0..7)
150 150 150 150 150 150 150 150 
##$DP07= 0
##$DPNAME0= <>
##$DPNAME1= <>
##$DPNAME2= <>
##$DPNAME3= <>
##$DPNAME4= <>
##$DPNAME5= <>
##$DPNAME6= <>
##$DPNAME7= <>
##$DPOAL= (0..7)
0.5 0.5 0.5 0.5 0.5 0.5 0.5 0.5 
##$DPOFFS= (0..7)
0 0 0 0 0 0 0 0 
##$DQDMODE= 0
##$DR= 18
##$DS= 0
##$DSLIST= <SSSSSSSSSSSSSSS>
##$DSPFIRM= 0
$$ [...]
##$SUBNAM2= <"">
##$SUBNAM3= <"">
##$SUBNAM4= <"">
##$SUBNAM5= <"">
##$SUBNAM6= <"">
##$SUBNAM7= <"">
##$SUBNAM8= <"">
##$SUBNAM9= <"">
##$SW= 24.9335813027861
##$SWIBOX= (0..15)
0 0 2 0 0 0 0 0 0 0 0 0 0 0 0 0 
##$SW_h= 4990.01996007984
##$TD= 16384
##$TD0= 1
##$TE= 0
##$TE2= 300
##$TE3= 300
##$TEG= 300
##$TL= (0..7)
0 120 120 120 120 120 120 120 
##$TP= (0..7)
150 150 150 150 150 150 150 150 
##$TP07= 0
##$TPNAME0= <>
##$TPNAME1= <>
##$TPNAME2= <>
##$TPNAME3= <>
##$TPNAME4= <>
##$TPNAME5= <>
##$TPNAME6= <>
##$TPNAME7= <>
##$TPOAL= (0..7)
0.5 0.5 0.5 0.5 0.5 0.5 0.5 0.5 
##$TPOFFS= (0..7)
0 0 0 0 0 0 0 0 
##$TUNHIN= 0
##$TUNHOUT= 0
##$TUNXOUT= 0
##$USERA1= <user>
##$USERA2= <user>
##$USERA3= <user>
##$USERA4= <user>
##$USERA5= <user>
##$V9= 5
##$VALIST= <valist>
##$VCLIST= <CCCCCCCCCCCCCCC>
##$VD= 0
##$VDLIST= <DDDDDDDDDDDDDDD>
##$VPLIST= <PPPPPPPPPPPPPPP>
##$VTLIST= <TTTTTTTTTTTTTTT>
##$WBST= 1024
##$WBSW= 4
##$XGAIN= (0..3)
0 0 0 0 
##$XL= 0
##$YL= 0
##$YMAX_a= 876048
##$YMIN_a= -795054
##$ZGOPTNS= <>
##$ZL1= 120
##$ZL2= 120
##$ZL3= 120
##$ZL4= 120
##$ABSF1= 10
##$ABSF2= 0
##$ABSG= 5
##$ABSL= 3
##$ALPHA= 0
##$AQORDER= 0
##$ASSFAC= 0
##$ASSFACI= 0
##$ASSFACX= 0
##$ASSWID= 0
##$AUNMP= <proc_1d>
##$AZFE= 0.1
##$AZFW= 0.1
##$BCFW= 1
##$BC_mod= 2
##$BYTORDP= 1
##$COROFFS= 0
##$CY= 11.3945322036743
##$DATMOD= 1
##$DC= 2
##$DFILT= <>
##$DTYPP= 0
##$F1P= 2.36226072786647
##$F2P= -0.459571619588291
##$FCOR= 0.5
##$FTSIZE= 0
##$FT_mod= 4
##$GAMMA= 1
##$GB= 0.15
##$INTBC= 1
##$INTSCL= 1
##$ISEN= 128
##$LB= 0.24
##$LEV0= 0
##$LPBIN= 0
##$MAXI= 10000
##$MC2= 0
##$MEAN= 0
##$ME_mod= 0
##$MI= 1.114404
##$NCOEF= 0
##$NC_proc= 0
##$NLEV= 6
##$NOISF1= 3.799351
##$NOISF2= 2.8
##$NSP= 1
##$NTH_PI= 0
##$NZP= 0
##$OFFSET= 15.70392
##$PC= 1
##$PHC0= -18488.92
##$PHC1= 14.60072
##$PH_mod= 1
##$PKNL= yes
##$PPARMOD= 0
##$PSCAL= 0
##$PSIGN= 0
##$REVERSE= no
##$SF= 200.130013532006
##$SI= 16384
##$SIGF1= 3
##$SIGF2= 2
##$SINO= 400
##$SIOLD= 16384
##$SREGLST= <1H.CDCl3>
##$SSB= 0
##$STSI= 0
##$STSR= 0
##$SW_p= 3612.71676300578
##$SYMM= 0
##$S_DEV= 0
##$TDeff= 0
##$TDoff= 0
##$TI= <>
##$TILT= no
##$TM1= 0
##$TM2= 0
##$TOPLEV= 0
##$USERP1= <user>
##$USERP2= <user>
##$USERP3= <user>
##$USERP4= <user>
##$USERP5= <user>
##$WDW= 1
##$XDIM= 8192
##$YMAX_p= 0
##$YMIN_p= 0
$$ End of Bruker specific parameters
$$ ---------------------------------
##NTUPLES= NMR FID
##VAR_NAME=  TIME,          FID/REAL,        FID/IMAG
##SYMBOL=    X,             R,               I
##VAR_TYPE=  INDEPENDENT,   DEPENDENT,       DEPENDENT
##VAR_FORM=  AFFN,          ASDF,            ASDF
##VAR_DIM=   8192,          8192,            8192
##UNITS=     SECONDS,       ARBITRARY UNITS, ARBITRARY UNITS
##FACTOR=    0.0002004,     1,               1
##FIRST=     0,             0,               0
##LAST=      1.6414764,     0,               0
##MIN=       0,             -795054,         0
##MAX=       1.6414764,     876048,          0
$$ Real data points
##PAGE= N=1
##DATA TABLE= (X++(R..R)), XYDATA
0@%%%%Qj6QqK4l2M0n3O1p6R9j19J43j71K03k43K88l36L91m55N24o02O92p90Q98
$$ 0 0 0 0 0 8 -8 0 -8 16 -16 24 -29 32 -44 55 -64 79 -92 111 -132 156 -180 211 -244 280 -322 370 -420 478
29D78j019J152j300J460j635J830k044K278k536K819l127L467l841M251m705N211
$$ 478 -541 611 -689 771 -864 966 -1078 1200 -1336 1483 -1644 1823 -2018 2233 -2472 2739
45B739n776O404p111P919q846R918j1178J2690j4539J6857j9872K3974k9917L9400
$$ 2739 -3037 3367 -3744 4175 -4671 5247 -5931 6759 -7780 9077 -10795 13179 -16738 22662
59B2662n7419J42988o70438k32847P48627M12265q0043l40662j09117O6044J37674
$$ 22662 -34757 108231 -562207 -795054 -46427 365838 285795 -54867 -163984 -97940 39734
70C9734K5378k5705n9308p510P050L0890L528k223k0030NL157J2001l883j660
$$ 39734 65112 39407 -19901 -27411 -20361 10529 14057 11834 -8196 -8191 -5034 6967 3084 1424
84A424n334L486m96L355k408P2j842K621r30L57j025J291j028M77m3N89r77L59
$$ 1424 -3910 -424 -920 2435 27 99 -1743 878 -52 305 -720 571 -457 20 -23 566 -411 -52
102e2J17J05m51O23j12m39j24O11n9k74P7R6l39R3M32j43m06J28K66j99p4K61
$$ -52 65 170 -281 342 230 -209 -333 278 219 -55 22 118 -221 -128 304 161 -245 -117 149 -50 -124 137
124A37m3k49J21J54j52j06K91kk72j2K00l2j01J94p8k18P2K49q2j89P1R7j27M
$$ 137 94 -155 -34 120 -32 -138 153 151 -121 -133 67 35 -66 128 50 -168 -96 153 71 -118 -47 50 -77 -73
148g3J80q6j31J29P2j47PJ20J8j43MQ0m7PJ35o9j64O8J14j6o0P9p9o1Q1P4n8p4
$$ -73 107 21 -110 19 91 -56 -49 71 89 -54 -50 30 -17 -10 125 56 -108 -40 74 58 -2 77 -2 -63 18 92 34 -40
176d0P3Qq7K6Q3l9j8K8J1o3K0O8k8n1J1K6n3J8M5m3m5K3M1l9l8P3J0o2J3P5n3
$$ -40 33 41 -46 -20 63 24 6 34 45 -18 2 70 42 -9 2 28 -25 -7 38 -5 -50 -27 14 -25 -63 10 20 -42 -29 46 -7
207gkK2pk0%L6J8n4L3rq%M0k2l9K2J4loJ2j0QJ3l1mK6L6o8j6O1oPk7Ok1j8N4p
$$ -7 -9 13 6 -14 -14 22 40 -14 19 10 2 2 42 20 -19 3 17 14 8 20 10 18 31 0 -4 22 58 -10 -26 35 29 36 9 15 -6 -24 30 23
245B3Nn4N8m2j3N3non3N7j4k5RK6j9j9j8J6QK2j2l4K9J2%m0J8K0ln6M6LKOMJ4
$$ 23 28 -26 32 -10 -23 30 25 19 -34 23 9 -16 -7 19 0 -19 -37 -21 -13 9 -3 -37 -8 4 4 -36 -18 2 -1 -57 -11 -8 -6 0 4 18
281A8mJ5k3K2l3K7m3K4L%j3jJ2K3nJ3j3l6j2L6L4m9J5J0k5PJ3qm0K7nk5L5k5M2
$$ 18 14 29 6 28 -5 22 -21 3 6 6 -7 -8 4 27 22 35 22 -14 -26 10 44 -5 10 20 -5 2 15 7 -33 -6 -11 -36 -1 -26 16
316A6j1Nl4lRK9k6k5K9J4k1j9K8J5opK1rLk7J1K9Rk0J3l2M5k1k3N2qn5L9j1J5
$$ 16 5 10 -24 -27 -18 11 -15 -40 -11 3 -18 -37 -9 6 0 -7 14 5 8 -19 -8 21 30 10 23 -9 36 15 -8 44 36 -19 20 9 24
351B4k8J5L5m7qMJ0L1n2L2k0K4m5P0o5J7k4NK2Qpk3J8K8l1Pj2J1oj3%K3Mk0%L
$$ 24 -4 11 46 -1 -9 -5 5 36 -16 16 -4 20 -25 45 -20 -3 -27 -22 0 8 1 -22 -4 24 -7 0 -12 -1 -7 -20 -20 3 7 -13 -13 -10
387a0OJ5j5qM4k8nPNLj2K5oj1J0J1mj8PlJ7j5k7K8Qk1J9r%KJ9ok7mK4km6M7k4
$$ -10 -4 11 -4 -12 32 4 -1 6 11 14 2 27 21 10 20 31 27 9 16 13 30 15 -12 16 24 3 22 13 13 15 34 28 1 -3 21 19 -27 20 -4
426dJ2KooK5m6K0Rjk1L4j6Lj4j3jmJ5J4Pk4K8l1K4Jjj0J1k8J5J5kQQk0j0QLJ0
$$ -4 8 10 4 -2 23 -23 -3 6 5 -16 18 2 5 -9 -22 -23 -27 -12 2 9 -15 13 -18 6 7 6 -4 7 -21 -6 9 7 15 23 3 -7 1 4 14
465A4mj9QMQJLRj9J6Jl7K6l5J3J7nK1l0J9ql3M1k0j6llL1MJ2l9K6j2j2J8k5j6
$$ 14 10 -9 -1 3 11 12 15 24 5 21 22 -15 11 -24 -11 6 1 22 -8 11 3 -30 11 -9 -25 -28 -31 0 4 16 -23 3 -9 -21 -3 -28 -44
502d4JL2j6L0J0j8j6NkK2J2RK0n4J1K0Ql6PPjK9k6PQk6QK0k3kJ9nqnJ1m1Q2k8
$$ -44 -43 -11 -27 3 13 -5 -21 -16 -18 4 16 25 45 -9 2 22 30 -6 1 8 7 36 10 17 25 -1 7 27 4 2 21 16 8 3 14 -27 55 27
540B7j5k4lPM4m4L3k8nRQk0Rqk8J8NJ2Mnj9j3L9k1Rj1KRpJ2Nj4NJ6RJ8l3Rj7k
$$ 27 12 -12 -15 -8 36 -8 25 -3 -8 1 9 -11 -2 -10 -38 -20 -15 -3 1 -4 -23 -36 3 -18 -9 -20 -18 -9 -16 -4 1 -13 -8 8 17 35 2 11 -6 -8
580hL3j9Jk3L3j0RK0Nm8J1L1k7lQlj5K3N2n8PlKk4PJ0j5k4J7J5j8L5o9O8nk4N4
$$ -8 25 6 7 -16 17 7 16 36 41 -7 4 35 8 5 13 10 -5 18 70 12 19 16 18 -6 1 11 -4 -28 -11 4 -14 21 -48 20 15 -9 45
617D5n1j7qjmML0ol7N6j2k7K7j4LK3J2k3L4k2l1O0o1J6mLOJj0J3J2K2m4K3k2L2
$$ 45 -6 -23 -31 -32 -36 -32 -2 -8 -45 11 -1 -28 -1 -15 -12 11 23 0 34 12 -19 41 -20 -4 -8 -5 1 2 -8 5 17 39 -5 18 -4 28
653B8j3Jj3jJ1kK1m8L7J6l1K8n8Lk6O0k5jrL1j6K2k7k1L2QLk3J9l0j7RNJ9MJ2
$$ 28 15 16 3 2 13 11 32 -16 21 37 6 34 -24 -21 -47 13 -12 -13 -22 9 -7 15 -12 -33 -1 7 10 -13 6 -24 -41 -32 -27 -8 -4 8
689Hk0jL3j5nK5kJ0Nk7%m4K3OJ7j4L%j9J5K9m7J4jL7k7nNJ5j9pJ8kkk5j7L3nQ
$$ 8 -12 -13 20 5 0 25 23 33 38 11 11 -33 -10 -4 13 -1 2 2 -17 -2 27 -20 -6 -7 30 3 -2 3 18 -1 -8 10 8 6 -19 -36 -3 -8 0
728@q%K8m4J0K6j7j5Okj2M6n1pK2Qkk9L8j8l%pL4j9OQk0K3j2JJ0J6j9Nj4loL3
$$ 0 -8 -8 20 -24 -14 12 -5 -20 -14 -16 -28 18 -33 -40 -18 -10 -12 -41 -3 -21 -24 -24 -31 3 -16 -10 -2 -22 1 -11 -10 0 16 -3 2 -12 -15 -21 12
767A2k3J5OJ0k2K6J5j1k4j4M1m0K5jnJ5k9J1J4j2k1j7K8MmJ3qoj2J4Ro0M6k8L5
$$ 12 -11 4 10 20 -2 24 39 28 4 -10 31 -9 16 15 10 25 -4 7 21 9 -12 -29 -1 3 -1 12 4 -2 -14 0 9 -51 -5 -33 2
802Bql%krRpML1J4nm5K0K2Om0J0pJj2J0J3K3pJ3J4m7K0L0o7M3QK0k4j1ol4J3K9
$$ 2 -6 -9 -9 -11 -20 -11 -18 -14 17 31 26 -19 1 23 29 -11 -1 -8 -7 -19 -9 4 27 20 33 47 0 20 50 -17 26 34 54 30 19 13 -21 -8 21
841B1k0k8L5j8J1j3K2k1MK2j9j5oOJ2J5j3k3Jj3PK7K0m7L2j3j2K8%mJ4j9k6N0
$$ 21 1 -27 8 -10 1 -12 10 -11 -7 15 -4 -19 -25 -19 -7 8 -5 -28 -27 -40 -33 -6 14 -33 -1 -14 -26 2 2 -2 12 -7 -33 17
875A7j6J9k6J1KJ0k5L1k3jJ7NLj5KJ6Jj5J0Lk1KK0l9jPJ6j6K3Qk2l5NM7k1M2n7
$$ 17 1 20 -6 5 7 17 -8 23 0 -1 16 21 24 9 11 27 28 13 23 26 5 7 27 -12 -13 -6 10 -6 17 25 3 -32 -27 20 -1 41 -16
912a6J8l6M0j8J4J0l1j3prM6Ll6L3Kj0j4L1J5%k6%J4jooK6j5L6k1J1l9K8Lk8K0
$$ -16 2 -34 6 -12 2 12 -19 -32 -39 -48 -2 1 -35 -2 0 -10 -24 7 22 22 -4 -4 10 9 3 -3 23 8 44 23 34 -5 23 26 -2 18
948A8l2JL3%oj5qpj5M2kJL7n0rK8Omm0JJ1PnJ7K1m8K6pl3L9k1J1L0k7l0J0M1l6
$$ 18 -14 -13 20 20 14 -1 -9 -16 -31 11 9 10 47 -3 -12 16 22 18 -22 -21 -10 -3 -8 9 30 -18 8 1 -32 7 -14 -3 27 0 -30 -20 21 -15
986a5J4j6LJ1mmmK3k8N0nm4K5K0j2Mj0L4qj8qj2j2L7kJooO3m1j7Lj2Pk3RJ7j3
$$ -15 -1 -17 -14 -3 -7 -11 -15 8 -20 30 25 -19 6 26 14 18 8 42 34 16 8 -4 -16 21 19 20 14 8 71 30 13 16 4 11 -12 -3 14 1
1024AQj4L1k7lj7J9oQJ0k2nPj7J6J6l0M1m7L3qM4o9J9J4k4N1n3K4L9j3l3K7k7
$$ 1 9 -5 26 -1 -4 -21 -2 -8 0 10 -12 -17 -10 -27 -11 5 -25 16 -31 2 -6 38 -31 -12 2 -22 29 -24 0 39 26 -7 20 -7
1058gL6j4QJ7k4l0K0K0Ll9J2L3k1qJ4j2jPj7J2J7j5k8K5l2M4k9Qk6K7Oj7qj1M1
$$ -7 29 15 23 40 16 -14 6 26 29 -10 2 35 14 6 20 8 7 14 -3 9 26 11 -17 8 -24 20 -9 -1 -27 0 6 -11 -19 -30 11
1093A1j6J8qLmJk3J8j1LOj6lJ5kk%NJQkRm0K6lNL9l9J2k6K4J7j4nK4j4j2QL0j8
$$ 11 -5 13 5 8 4 5 -18 0 -11 -8 -2 -18 -21 -6 -8 -10 -10 -5 -4 4 2 11 -29 -3 -6 -1 38 -1 11 -15 9 26 12 7 31 17 5 13 43 25
1133B5k2k0Jj0K5oL6n0N6m3Oj3j7M9n1K0J0K9l6kJ1kK6k8rJ1j6K1k6k3K3K0Lo
$$ 25 3 -17 -16 -26 -1 -7 29 -21 35 -8 -2 -15 -32 17 -34 -14 -4 25 -11 -13 -2 -4 22 -6 -15 -4 -20 1 -25 -48 -25 -5 -2 -8
1167hjj1J8K1j0J7rqj2nj1LJ4J3OJ3j8k3L7l6J9j2MoLj5M2qj4K3l8L5k1LrJ9k7
$$ -8 -9 -20 -2 19 9 26 17 9 -3 -8 -19 -16 -2 11 17 30 12 -11 26 -10 9 -3 1 -5 -2 -17 25 17 3 26 -12 23 2 5 -4 15 -12
1204a2J9k9M3l4LJ7j4j0KJ2J4l9L7Pm9L0k4KK6poJ4j6jLj1K2oPK5k5Njl0O7ll4
$$ -12 7 -22 21 -13 -10 7 -7 -17 -15 -3 11 -28 9 16 -33 -3 -27 -25 1 -6 -12 2 -14 -15 -12 -23 -1 -7 0 25 0 5 4 -26 41 38 4
1241Dj2K8m0L2Mk0M7j4l5J2J2Mj8rJ2J3m7M6l4K3j6J5%l0J9Lk7J4L0k6K4k5J2
$$ 4 -8 20 -20 12 16 -4 43 29 -6 6 18 22 4 -5 7 20 -27 19 -15 8 -8 7 7 -23 -4 -1 -28 -14 16 -10 14 -11 1
1274Aj1K5l4j5M8m8NK4K1j1jJ0jpNk7Nj2J5J4K2qj%J1k3rL4Rk6mk8J1J6J1rk1
$$ 1 -10 15 -19 -34 14 -34 -29 -5 16 5 4 14 13 6 11 -16 -11 -23 -8 6 28 20 19 19 30 7 -2 32 41 15 11 -17 -6 10 21 12 -9
1311iP4m5Rl8%J4K8m9M2Lk8oj1J5j7J0j4MrK5j0k4L7J5n3K2K9m4K6J3m2K7k4L6
$$ -9 65 20 29 -9 -9 5 33 -16 26 29 1 -5 -16 -1 -18 -8 -22 -18 -27 -2 -12 -36 1 16 -37 -15 14 -30 -4 9 -33 -6 -30 6
1345Fl7M2j7J3%rPJj5L7l8K8p%k2K7nj0NoQKj0K3J7o0L6%Jk1K1k5M4k9nj2j9J6
$$ 6 -31 11 -6 7 7 -2 5 6 -9 28 -10 18 11 11 -11 16 11 1 6 0 8 10 0 23 40 -20 16 16 17 -4 17 -8 36 7 2 -10 -29 -13
1383a3j0LL0k8kJ6m7N0pjRloJ1j2j2MJ2J7m9M0Rk2K2j6nmK0Pk9K4LoK0%k0J4j5
$$ -13 -23 -20 10 -18 -20 -4 -51 -1 -8 -9 0 -3 -9 2 -10 -22 -18 -6 11 -38 2 11 -11 11 -5 -10 -14 6 13 -16 8 11 5 25 25 5 19 4
1421D%K2nj2jj5J8j7L3k1j8K1pnJM0l1J4m0jPNj0L0j0l4J9k6Oj5N8j6nNJ3k1Q
$$ 4 4 26 21 9 8 -7 11 -6 27 6 -12 9 2 -3 -2 38 7 21 -19 -20 -13 -8 -18 12 2 -32 -13 -39 -33 -48 10 -6 -11 -6 7 -14 -6
1458fNj8J3N4n6nj3RNK3j4j0Rj4K5j6L0Ml0K5Pk3j6J8K0j1j3%O0n3L8l5J2L4m5
$$ -6 -1 -19 -6 48 -8 -13 -26 -17 -12 11 -3 -13 -4 -18 7 -9 21 25 -5 20 27 4 -12 6 26 15 2 2 62 9 47 12 24 58 13
1493A3pM3k5j7Ok%J0k5j2K3k3kk1L6j1J7k0NK8l1J3mpJ1Pj6PQk3M5l0PrM%J1J7
$$ 13 6 49 24 7 13 11 11 21 -4 -16 7 -16 -18 -39 -3 -14 3 -17 -12 16 -15 -2 -6 -13 -2 5 -11 -4 4 -19 26 -4 3 -6 -2 -2 9 26
1531B6l1j1M2pJ9l2kK2k5mK4mkqJ1Qk4K8k3L2l1jj7K5K1k5KMpK1l4kMRl7QJ5p
$$ 26 -5 -16 26 19 38 6 4 26 1 -3 21 17 15 7 18 26 2 30 7 39 8 7 -10 15 36 11 13 17 10 31 -3 -5 -1 8 -29 -21 -6 -13
1569a3k9N1Mk5j8K0J1k0KJ0mJ0k7J3Lk1K2KPPk7mM3J8j0j0k1L2r%K5k9KL1k7M
$$ -13 -42 9 13 -12 -30 -10 1 -19 -17 -7 -11 -1 -28 -15 -12 -33 -11 -9 -2 5 -22 -26 17 35 25 15 -6 26 17 17 42 13 15 46 19 23
1605B3LJol7L6k2RKmj0Pkj6PmOJ6rrOrK9oj7m2L8nL5k0j4LjJ8k9J8opj0%L0k5
$$ 23 26 27 21 -16 20 -2 7 9 5 -5 2 0 -16 -9 -13 -7 9 0 -9 -3 -12 17 11 -6 -48 -10 -15 20 0 -14 -11 -12 6 -23 -5 -11 -18 -28 -28 2 -23
1646b3J6QLk8K0j3K9k1J4oJ2J2k9K0Lj6mqnM3k6j0J7j9j9N0Mn0O3l3j8J3l6K7
$$ -23 -7 1 4 -24 -4 -17 12 -9 5 -1 11 23 -6 14 17 1 -3 -11 -16 27 1 -9 8 -11 -30 20 24 -26 37 4 -14 -1 -37 -10
1680a0M0j3k0j4K4J4k9Qj7J0K3nl2L0l7J9M5o6M7l2K2j0K2m5J7J1OMopJ5j4nM
$$ -10 30 17 -3 -17 7 21 -8 0 -17 -7 16 11 -21 9 -28 -9 36 -30 17 -15 7 -3 19 -26 -9 2 8 12 6 -1 14 0 -5 -1
1714al2K4L3k6LmL0l9J1M4l3pJJ2Npk5L3J6l0j7K8k0k3J6K3o5L7Qlj0j8J8K3l5
$$ -1 -33 -9 24 -2 1 -3 27 -12 -1 43 10 3 4 16 21 14 -11 22 38 8 -9 19 -1 -24 -8 15 -50 -13 -5 -8 -18 -36 -18 5 -30
1749c0L5n4L7RrL1nm0j2L2Mj7nJ1RJ7k1Pj6j0K6LQPj0j1%J0K2k5jL2l0LL2l1J3
$$ -30 5 -49 -12 -3 -12 19 14 -26 -38 -6 -2 -19 -24 -13 -4 13 -8 -1 -17 -27 -1 2 10 17 7 -4 -4 6 28 3 2 34 4 7 39 8 21
1786B1J0p0N4mj5L8j7LkjJ5k6kj4j2K4j5L4n1j4M2m1KJ6J0L1k9Kj1j3J9j9J3R
$$ 21 31 -39 15 11 -4 34 17 20 18 17 32 6 4 -10 -22 2 -13 21 -30 -44 -2 -43 -41 -25 -15 16 -13 -11 -22 -35 -16 -35 -22 -13
1820a3pN2l0k5K2k9M7Kk5K2rnJ3J4k7J1RkmK2l6MoK8m3L5k1jJRj5Mj8N9j8km5
$$ -13 -20 32 2 -23 -1 -30 17 19 -6 16 7 2 15 29 2 13 22 20 16 38 2 6 0 28 -15 20 -1 -2 -1 8 -7 -3 -21 38 20 18 -27
1857b7L6lnk1J6k7K2J4k7RQPm5M2%k5Pk0K5j1NJ1j8K2j2PL8m5L8m1%PkJ5K0j3
$$ -27 9 6 1 -20 -4 -31 -9 5 -22 -13 -5 2 -43 -1 -1 -26 -19 -39 -14 -25 -20 -9 -27 -5 -17 -10 28 -17 21 -20 -20 -13 -15 0 20 7
1893Gj1K8m6M9nj1K6p5P1k9RpJ4j2%j7M6noj9j9J4KM2m5M9o2LPlj5J6MJ9l3L0
$$ 7 -4 24 -22 27 22 11 37 -38 33 4 13 6 20 8 8 -9 37 32 26 7 -12 2 4 46 1 50 -12 -9 -2 -5 -20 -4 0 19 -14 16
1929A6j6pl8O2Jm0J4J2k1J3j9K7j5pJ2K5j8j0K1rLNk1J5J0J1l9J5K6l3J3%L5m0
$$ 16 0 -7 -45 17 18 -22 -8 4 -17 -4 -23 4 -11 -18 -6 19 1 -9 12 3 6 11 -10 5 15 26 -13 2 28 -5 8 8 43 3
1963CJ3pMl8K4J1j3o%L4j0Nl4L1j9qK0l3K7j6L2l0L2n7L2K5l2j5K3J0qPj9J9j0
$$ 3 16 9 13 -25 -1 10 -3 -9 -9 25 15 20 -14 17 -2 -10 10 -23 4 -12 20 -10 22 -35 -3 22 -10 -25 -2 8 0 7 -12 7 -3
1998cnoK9nLK3k1p%k4J9Jj4J7LKpj3NoJ3MORmPjrj5qL5%k8%Oj2J3j5QMql5L6q
$$ -3 -8 -14 15 10 13 36 15 8 8 -16 3 4 -10 7 10 12 5 -8 -3 -9 4 8 14 23 19 26 25 16 1 -7 28 28 0 0 6 -6 7 -8 0 4 -4 -39 -3 -11
2042a1%lj1J5j0mM%J2LJ3j0oj1pm%nJ8LPrj2J9J9kk4Pj5K2k8N8j2j4rL5rnj0j5
$$ -11 -11 -14 -25 -10 -20 -24 -20 -20 -8 -5 8 -2 -8 -19 -26 -30 -30 -35 -17 -14 -7 -16 -28 -9 10 8 -16 -9 -24 -2 -30 28 16 2 -7 28 19 14 4 -11
2082a1L4J4n4K5Rj7JK2jj4lk5K7j8NkK8k1KoK3n1K9qm8N7m1M2j0LJ1j1Oj6kNK3
$$ -11 23 37 -17 8 17 0 1 23 22 8 5 -20 7 -11 -6 -8 20 -1 1 -5 18 -33 -4 -12 -60 -3 -44 -2 -12 -9 2 -9 -3 -19 -21 -16 7
2119Gj6qk4K6NM7l3k2K5j4MpM4m3J6kLj3KJ2K2k3rK1roJ4J9j4j6j2K8j1j0MJ6
$$ 7 -9 -17 -41 -15 -10 37 4 -18 7 -7 -3 -10 34 -9 7 5 8 -5 -3 9 31 8 -1 20 11 5 19 38 24 8 -4 24 13 3 7 23
2155B3k3J1J4qj5K%pj3%L8j0rMj7J6l2L8J6k3jrj3J0kK9l8JJ4L0J1m1K1k9J7j0
$$ 23 0 11 25 17 2 4 4 -3 -16 -16 22 12 3 7 -10 6 -26 12 28 5 4 -5 -18 -8 -10 19 -19 -18 -4 26 37 -4 17 -12 5 -5
2191eMJ8k9K6m7L5J7pRk8K1j4kL0Kk3j2J8J6j0j2nnL2k6k0Rj0J7LoRj0J4k7K0
$$ -5 -1 17 -12 14 -33 2 19 12 21 -7 14 0 -2 28 30 7 -5 13 29 19 7 2 -3 29 3 -17 -8 -18 -1 2 -4 5 -5 9 -18 2
2227Bj6Oj4J2j9J3kK3J4j6j0LKlROk2J1j6PJ9J6k6J4rJ1j3qM8j7k1NK9Nk0j7k1
$$ 2 -14 -8 -22 -10 -29 -16 -18 5 19 3 -7 -4 -2 -5 4 10 -12 -1 -17 -10 9 25 -1 13 4 15 2 -6 42 25 4 9 38 43 23 6 -15
2264a5L9lrK3n9J5J8pL5k8j5k5L0j1K7Qm0M1m7jJ4j7N4m6Lj2J0lk2J8J6j5M3l5
$$ -15 24 21 12 35 -24 -9 9 2 37 9 -6 -31 -1 -12 15 23 -17 24 -23 -24 -10 -27 27 -19 -16 -28 -18 -21 -43 -25 -9 -24 19 -16
2298a6j3M4J5l7MKpRMj6K6qj4QNOj9M0m2J9j1PJ4J0j7j9K2nqJ1k6M2Lm2J1j6J8
$$ -16 -29 15 30 -7 -3 -1 -8 1 5 -11 15 7 -7 1 6 12 -7 33 -9 10 -1 6 20 30 13 -6 16 11 3 14 -12 30 33 -9 2 -14 4
2335Dj0KK1Jnl3PRK8m2K0m4K3j8J6QMnk4L0J5m3K3l7L5J6j2J2Oj2KrML5j6m8L7
$$ 4 -6 -4 17 18 13 -20 -13 -4 24 -18 2 -42 -19 -37 -21 -13 -9 -14 -38 -8 7 -36 -13 -50 -15 1 -11 1 7 -5 -3 -12 -8 27 11 -37 0
2372@j5L6JPn1M8kl8K5Mj8J1J1Rkk4K9l7K0J7k4j0J7m1Lj0L5k4kK0kk0MKQj4K1
$$ 0 -15 21 22 29 -22 26 24 -14 11 15 -3 8 19 28 26 2 31 -6 14 31 7 -3 14 -27 -24 -34 1 -23 -25 -5 -7 -27 -23 -21 -13 -27 -6
2409fJ3m0K1KK1Qmj3Pl4L3l9L7Jj2PPlJ2K4%Jo3L5j9NQNj5JK0j8ONJ8mj2K9m6
$$ -6 7 -33 -12 -10 11 19 15 2 9 -25 8 -31 6 7 -5 2 9 6 18 42 42 43 -20 15 -4 1 9 14 -1 0 20 2 8 13 31 27 15 44 -2
2448bkJ3j3K4l5j0j3RP0n7JJ9k9K0rK8Krm9M2j2JnMnK6ol5L3j6j2J2J5k1%NJ1
$$ -2 -4 9 -4 20 -15 -25 -38 -29 41 -16 -15 4 -25 -5 -14 14 16 7 -42 0 -12 -11 -16 -12 -17 9 3 -32 1 -15 -27 -15 0 -21 -21 -16 -5
2485ekK7j1JQk8K0J3Nj4k8L2J9l9j2L0PoKnOj8L0k9L0k1MJ4qJJ1k0k4ok2K3rm
$$ -5 -7 20 9 10 18 -10 10 23 28 14 -14 18 37 -2 -14 16 23 17 19 14 20 2 32 3 33 12 16 30 22 23 34 14 -10 -16 -38 -15 -24 -28
2523b8J2J0jj1K2j1jqJL5j3k7jj0K2Pk5L6k5MlqJL6J7k8RJ3kk2J3RJj9J0j1K3
$$ -28 -16 -6 -7 -18 4 -7 -8 -16 -15 20 7 -20 -21 -31 -9 -2 -27 9 -16 -12 -15 -23 -22 14 31 3 12 25 23 1 14 23 24 5 15 4 27
2560B7K5k6j7JnrJ7k8J8Rj6%J7pNlPjpMj2J3rj5J5jk1J5pj6K4k0mJ4k5kK5M7k7
$$ 27 52 26 9 10 5 -4 13 -15 3 12 -4 -4 13 6 11 8 15 14 7 11 -1 12 3 -12 3 2 -19 -4 -11 -27 -3 -23 -27 -13 -38 -40 -15 32 5
2599E%Pk8MQM1ml6J9J5k1K1kl6K6j7J1l3J0K7oRPk4J3lk3L1j0j3K5k8O2q0J3j5
$$ 5 5 12 -16 -12 -4 37 33 -3 16 31 10 31 29 -7 19 2 13 -20 -10 17 11 20 27 3 16 13 -10 21 11 -2 23 -5 57 -23 -10 -25
2635b5J4Mj3MkL5l8J4lOl9N4l5RJ1j0K0NMrnj9J7l6M3j6K7jk5JJ7K0m2K9k1L4
$$ -25 -11 -7 -20 -16 -18 17 -21 -7 -10 -4 -43 11 -24 -15 -4 -14 6 11 15 6 1 -18 -1 -37 6 -10 17 16 -9 -8 9 29 -13 16 -5 29
2671B9j8OK3Qn9J5j1K5K1l1k2L2mJ0ok6K1rlJ6j5Pk0J3Jk2J5pRk9J9J2Nj2J9k1
$$ 29 11 17 40 48 -11 4 -7 18 39 8 -14 18 14 24 18 -8 13 4 1 17 2 9 -11 2 3 -19 -4 -11 -2 -31 -12 0 5 -7 12 -9
2707iJ1rKKj6RMmK0m0mJ6J9Nj3QljlJ8Kk9J4K4jm5K9l7L3j8J3K2J2j4j5OJ0j7
$$ -9 2 -7 -5 -3 -19 -10 -6 -10 10 -30 -34 -18 1 6 -7 1 -2 -3 -6 12 14 -15 -1 23 22 -23 6 -31 2 -16 -3 19 31 17 2 8 18 1
2745AjK6k6L2j4%pJpL9m0nm8L5J5k1%KJ5l5J8KKl4L2ML2m5K3KPprJ2j1mK0oK9
$$ 1 0 26 0 32 18 18 11 12 5 44 4 -1 -49 -14 1 -20 -20 -18 -3 -38 -20 -18 -16 -50 -18 -14 18 -27 -4 -2 5 -2 -11 1 -10 -14 6 0 29
2784B9l6oJ5J8j5%J0j2j3LM6n3J6nJ5j4LJoJ2J9qj7nQlOj2KJ5J5l5l1K3nJ2j7
$$ 29 -7 -13 2 20 5 5 15 3 -10 -7 39 -14 2 -3 12 -2 1 2 -4 8 27 19 2 -3 5 2 8 -4 -2 13 28 -7 -38 -15 -20 -8 -25
2821b5L4m0QJ1Rollj2J4j1QL7n3J1J5q%qK9j9KrL2mk1L8nj0%pJ2mJ1k5qK0ll1
$$ -25 9 -31 -23 -12 -3 -9 -12 -15 -27 -13 -24 -16 21 -32 -21 -6 -14 -14 -22 7 -12 -10 -19 13 9 -12 26 21 11 11 4 16 12 23 -2 -10 10 7 -24
2860b4M8oj9K1j7lk5M4l0j1ML1pNj2J9l8J6Jk0L5nk3JLRLl7M5oKk1L3k0olPLl
$$ -24 24 18 -1 20 3 0 -25 19 -11 -22 -18 13 6 11 -1 18 -20 -4 -3 -23 12 7 -16 -15 -12 -3 0 -37 8 2 4 -17 16 -4 -10 -13 -6 -3 -6
2899fKl7L4J6L8n5J5MK5roOl1j1LL1j1LKl6N1m3K3JL0l1oJ8jkJk7Kj0j4K3qJ6
$$ -6 -4 -41 -7 9 47 -8 7 11 36 27 21 27 -4 -15 -12 19 8 11 13 -23 28 -15 8 9 39 8 2 20 19 17 18 -9 -7 -17 -31 -8 -16 0
2937@qj2LM0m3J8l0jK5l1PM3n8K8J4oK0pl1PL8l9K2JPQrJk1M2k7RL7J0o2L0j9
$$ 0 -8 -20 -17 23 -20 -2 -32 -33 -8 -39 -32 11 -47 -19 -5 -11 9 2 -29 -22 16 -23 -1 0 7 15 6 7 -14 28 1 10 47 57 -5 25 6
2974FJ6K2m6K7j2RlJ6qj9j0J2Rk3MM8n4Nj8L9j3k2J6j5K2k2M3m9rLL9l0%j3Ok
$$ 6 22 44 -2 25 13 22 19 35 27 8 -2 10 19 -4 0 48 -6 -1 -19 20 7 -15 1 -14 8 -14 29 -20 -29 -26 13 -17 -17 -30 -24 -26
3010b6O3l6k7j6J3L1j4joJ2K2l6NoM2l5L5k0J8k0nL0l4L3j2J8Ml1k8L2nJ4j0%
$$ -26 37 1 -26 -42 -29 2 -12 -13 -19 -7 15 -21 -16 -22 20 -15 20 0 18 -2 -7 23 -11 22 10 28 32 1 -27 5 0 14 4 4
3044Dm0N0J5j1Kk0qJ6pL2l7j8JJj2J5Pj6jK0rM6l8l8L7j3L2j2J2J7m9N%j2J8m
$$ 4 -36 14 29 18 20 0 -8 8 1 33 -4 -22 -21 -20 -32 -17 -10 -26 -27 -7 -16 30 -8 -46 -9 -22 10 -2 10 27 -22 -17 -17 -29 -11 -15
3080a5K7qj0K7l3k0N3k3PJ7m2N1j9J3k0L0l5JK9Ok3MQJ3l7oJ8Po7L6J2pPl2M7
$$ -15 12 4 -6 21 -12 -32 21 -2 5 22 -20 31 12 25 5 35 0 1 30 36 13 17 25 38 1 -5 13 20 -47 -11 1 -6 1 -31 16
3115A6j3Mj1m3M5l9L3rK2j4k0M5l2Kj4L0l1K6nJ4j4k4M2ok0L4Jk2J0%omJ2mNJ5
$$ 16 3 7 -4 -47 -2 -41 -8 -17 5 -9 -29 16 -16 -14 -28 2 -29 -3 -8 6 -8 -32 10 4 -16 18 19 -3 7 7 1 -3 9 5 10 25
3151B5j9j6K1k0JOOj6MOJ3j8MJ9j2J0j2k8N9j4j2J8j3k6K9j6lJ3J6m2rK8%m8M5
$$ 25 6 -10 11 -9 -8 -2 4 -12 -8 -2 11 -7 -3 16 4 14 2 -26 33 19 7 25 12 -14 15 -1 -4 9 25 -17 -26 2 2 -46 -1
3186aKpL7j0m5j5pM9j6rK2J9j9j4oL2Kk1kJ5Jj5K3rK0m1K6QpkonJ6ok6J7K4l2
$$ -1 1 -6 31 21 -24 -39 -46 3 -13 -22 0 19 0 -14 -20 12 14 -7 -9 6 7 -8 15 6 26 -15 11 19 12 10 4 -1 15 9 -17 0 24 -8
3224hL0lk1l1K7K7rNj0j7LnJ7l5L1mj3OMJj1j2J4K1J6k7J0qk9J7K2l0J1QPJ1l2
$$ -8 22 19 -2 -33 -6 21 12 17 7 -10 -7 -12 5 -30 1 -3 -16 -10 -6 -5 -16 -28 -14 7 23 -4 6 -2 -31 -14 8 -22 -11 -3 4 15 -17
3261a7K5l0J9K2j5k2K6J3Kl2N1n8L8mjjk5K4L3n3lL0l3J5j3K1l1K4j0%JnmL5k7
$$ -17 8 -22 -3 19 4 -18 8 21 23 -9 42 -16 22 18 17 16 -9 15 48 -5 -8 22 -11 4 -9 12 -19 5 -5 -5 -4 -9 -13 22 -5
3296eOk3jj4M1j8j3M3k2jKLJ8j4lj2J0nJ1jJ2j5k0K8k6K0j3L8l8QL4j4koJ7l0
$$ -5 1 -22 -23 -37 4 -14 -27 16 -6 -7 -5 -2 16 2 -1 -13 -3 -8 3 2 14 -1 -21 7 -19 1 -12 26 -12 -4 30 16 14 8 25 -5
3332eL0l3K6lRJ0m1J3l2M2J1m4nL2j9QJ9nk5K3lj3K0j8l2LK6K4n2O1m9QjK3j7
$$ -5 25 -8 18 15 24 34 -7 6 -26 16 27 -17 -22 10 -9 -1 18 13 -12 11 8 -5 15 -3 -35 -32 -6 18 -34 27 -22 -14 -15 8 -9
3367iQmK1m6K4k3K2k0L5Nm3L0j4L1l2OKK3klK9j0m1K9RJ7l6j4N0k5J4j2k3mJ3
$$ -9 -1 -5 16 -30 -6 -29 -7 -27 8 13 -30 0 -14 17 -15 -9 -7 16 14 11 40 30 -11 18 27 44 8 -6 44 19 33 21 -2 -6 7
3402GJ4%L3k9nk9L9n1J2J2j4qL7k3lL1k7oj5RqJ2KJJ0k8M6qJk7J4K8l9Lj1M0m4
$$ 7 21 21 54 25 20 -9 30 -21 -9 3 -11 -19 18 -5 -8 23 -4 -10 -25 -16 -24 -12 -10 -9 1 -27 19 11 12 -15 -1 27 -12 -9 -20 20 -24
3439b4lRK8j1mRj4ML2m0%L1lqL2o5L1jJk4K1K4pn3L5j0k9J4nMK9j5nJ7l6J9L1
$$ -24 -27 -18 10 -1 -5 4 -10 -6 26 -14 -14 17 14 6 38 -27 4 3 4 -20 1 25 18 -35 0 -10 -39 -25 -30 -26 3 -12 -17 0 -36 -17 14
3476A4Pn5K2j4K5k0j6J6J3j6J3l1K7J0j5K3k2RM2k6l4L3j7K5k8qL6j4J1K0l4K4
$$ 14 21 -34 -12 -26 -1 -21 -37 -21 -8 -24 -11 -42 -15 -5 -20 3 -19 -10 32 6 -28 5 -12 13 -15 -23 13 -1 10 30 -4 20
3508B0Kj0J3mLJ5k0j8J7j6qMj2K7NMj2J1Jpl9J2J3j4NkJ7k8K9k1m%nlK2l6J8O
$$ 20 22 12 25 21 24 39 19 1 18 2 -6 -2 -14 13 18 22 10 21 22 15 -24 -12 1 -13 -8 -10 7 -21 8 -13 -17 -17 -22 -25 -3 -39 -21 -15
3546a5lK3j5K6k6l9O8k0j0K0%j5%OnL2j8J2m4QJ3J6k2L6pkj8K1k8K8l1J0k6L3
$$ -15 -18 5 -10 16 -10 -49 19 -1 -11 9 9 -6 -6 0 -5 27 9 21 -23 -15 -2 14 -8 28 21 19 1 22 -6 22 -9 1 -25 8
3580HJ2k2M7Lk3j9k3j1L9Qk5Pjk8L8ql3M5k9jrj1LL3qK0k4K9j1k6K3k3ROj3RJ9
$$ 8 20 -2 45 48 25 6 -17 -28 11 19 -6 1 0 -28 10 2 -31 14 -15 -16 -25 -36 -33 0 -8 12 -12 17 6 -20 3 -20 -11 -5 -18 -9 10
3617A0l9K5j0K4j5K5k5L0j2Rj5J3j0K2rk5K8Lj5j5J7lJJ7j9oJroj2oL7ok1Kj2
$$ 10 -29 -4 -14 10 -5 20 -5 25 13 22 7 20 10 32 23 -2 26 29 14 -1 16 13 14 31 12 6 7 -2 -8 -20 -26 11 5 -16 -14 -26
3653b6K0l7RK5j8J2%OJ5j3j6Jk2M7l3J3J3J1Lm6M4j4j4lL1L%j1Rj8j5K9jrK1K5
$$ -26 -6 -43 -34 -9 -27 -15 -15 -9 6 -7 -23 -22 -44 3 -30 -17 -4 7 10 -36 8 -6 -20 -23 8 11 11 0 9 -9 -24 5 4 -5 16 41
3689D1Pm7J3JK1m9j1M6k0j9JJ4k3N6m5K5nj6qK1OQJ0k1m0K2J8m3K4j1lN2j1m5
$$ 41 48 1 14 15 36 -13 -24 22 2 -17 -16 -2 -25 31 -14 11 6 -10 -18 3 9 17 27 6 -34 -12 6 -37 -13 -24 -27 25 14 -31
3723c1N1k5k9K7J4j3Mm9M9J6Nj4j8ll0M1rR%pJ6k3K7k%J1J6k0nk3K9qLk2L4j7
$$ -31 20 -5 -34 -7 7 -6 -2 -51 -2 14 19 5 -13 -16 -46 -5 -14 -5 -5 -12 4 -19 8 6 6 17 33 13 8 -15 14 6 9 -13 21 4
3759Dj4J9l2L0Ml1K6J6l3L0j9j3K1k0J2j6j6K4MMk3MRqK2J7k8j1K1rmJ7rj4Pk
$$ 4 -10 9 -23 7 11 -20 6 22 -11 19 0 -13 8 -12 0 -16 -32 -8 -4 0 -23 -19 -10 -18 4 21 -7 -18 3 -6 -10 7 -2 -16 -9 -11
3795a1L9n0k3P1k3J8j7nPJK7jm3Qj3J4L1k2j6M3k5j9J8klk4J3kK4l1J0jQnJ6k7
$$ -11 28 -22 -45 26 3 21 4 -1 6 7 34 33 -10 -2 -15 -1 30 8 -8 35 10 -9 9 7 4 -20 -7 -9 15 -16 -6 -7 1 -4 12 -15
3831a5oK3Nj3j8j9J8%PK4rJ8k8nJ1J3l0J4Q%%l3M3MJ7k5j8K1Ol2lL8QRlj5k5L3
$$ -15 -21 2 7 -6 -24 -43 -25 -25 -18 6 -3 15 -13 -18 -7 6 -24 -10 -2 -2 -2 -35 8 12 29 4 -14 7 13 -19 -22 16 24 33 30 15 -10 23
3869B3rK7l2pK8k8K4mj2OKk8K4ooqnM4l3PJ2J3m7K3k6J5j8J8n3L2oJ7L0l5JLl
$$ 23 14 41 9 2 30 2 26 22 10 16 18 -10 14 8 2 -6 -11 33 0 7 19 32 -15 8 -18 -3 -21 -3 -56 -24 -30 -13 17 -18 -17 -14 -17
3906a7J9%Qk6nqK5joKJ4j2J3JJ4Oj0%Ll5K0K6Om5K5J7j7j1j4L6J2l5Oj2j6J5J7
$$ -17 2 2 10 -16 -21 -29 -4 -5 -11 -9 5 -7 6 7 21 27 17 17 20 -15 5 31 37 -8 17 34 17 6 -8 28 40 5 11 -1 -17 -2 15
3943A5J2k2K5o3KK9jjj4oL2j6J7k7K1k2J7ql3Nj1O8m8J6J3k3J5ONj1j8L9j2op
$$ 15 27 5 30 -33 -31 -2 -3 -4 -18 -24 8 -8 9 -18 3 -19 -2 -10 -43 -38 -49 19 -29 -13 0 -23 -8 -2 3 -8 -26 13 1 -5 -12
3978a2J9kqj0j5L2J1JNj2kJ7j0Pj6J0nqpqJ3j2mK3Jnk6K2JK2j9j2rJ9Jl6K8Jk4
$$ -12 7 5 -3 -13 -28 4 15 16 21 9 7 24 14 21 5 15 10 2 -5 -13 0 -12 -16 7 8 3 -23 -1 0 22 3 -9 -18 1 2 -34 -6 -5 -29
4017b9j0K9j3kj2J6mqK8oK3Jj8J7j2Kl1NK3j7j6J5lJ7k1J1j8N8l7L5k9K5l7J7
$$ -29 -39 -10 -23 -25 -37 -21 -25 -33 -5 -11 12 13 -5 12 0 2 -29 -24 -1 -18 -34 -19 -22 -5 -26 -15 -33 25 -12 23 -6 19 -18 -1
4051aJ5j3PJ2Pj2l6K6j7J0J8m8N4j6Nk9J6KOk4K7qQk5J6Lj8pK6kn6Q2k1lPl3K1
$$ -1 14 1 8 20 27 15 -21 5 -12 -2 16 -32 22 6 11 -18 -2 0 6 -18 9 1 9 -16 0 3 -15 -22 4 2 -54 28 7 4 11 -22 -1
4088ak1Qj5L4J5l4L1j5MMj0MJ2qrOj1M0m8K7lnk2N5j7qN3o4KnJ2l9J6jJ2NJ5n
$$ -1 -22 -14 -29 5 20 -14 17 2 6 10 0 4 16 8 -1 5 -6 34 -14 13 10 5 -17 38 21 13 66 2 4 -1 11 -28 -12 -13 -1 4 19 14
4126A4nnk3mJ1J7k2J4pk4PL6m0MNj1mK0J5l5K2JK3l0lJ6K8l6J5mK2m4N8l5j6L2
$$ 14 9 4 -19 -23 -12 5 -17 -3 -10 -34 -27 9 -31 -27 -22 -33 -37 -17 -2 -37 -15 -14 9 -21 -24 -8 20 -16 -1 -5 17 -27 31 -4 -20 12
4162A2k9K9j0mPK4j1J3j4Kj8kK6Pk4K1m2M2l3Ll3L2j2J4N%JnJ1k8OJ3k4M0l9j1
$$ 12 -17 12 2 -2 5 29 18 31 17 19 1 -1 25 32 8 29 -13 29 -4 -1 -34 -2 -14 0 5 5 6 1 12 -16 -10 3 -21 19 -20 -31
4198c1K1ok1L5Nk6QoJ1j2L3k3PLl3K1pL6j5pJ4l8M0l0K5pkK8l0N4n7J1jRJ6k9
$$ -31 -10 -16 -37 -2 3 -23 -15 -21 -10 -22 11 -12 -5 -2 -35 -14 -21 15 0 -7 7 -31 9 -21 4 -3 -5 23 -7 47 -10 1 0 9 25 -4
4234dOQkj0l5L6O2m8j8J0j9PpJ9Jj7K4j8j5L1j2l9J0L8k0J5Kl9mM3j3j8K6j9L
$$ -4 2 10 8 -2 -37 -1 61 13 -5 5 -14 -7 -14 5 6 -11 13 -5 -20 11 -1 -40 -30 8 -12 3 5 -34 -38 5 -8 -26 0 -19 -16
4269a6RpK8kk3MRQQm3L7Pmj7K1j2Rl3K6JnJ3j2j7jKL3mn0K5K1k8KkK9l4J4Jj2
$$ -16 -7 -14 14 12 -11 -7 2 10 18 -25 12 19 15 -2 19 7 16 -17 9 10 5 18 6 -11 -12 -10 23 19 -31 -6 15 -13 -11 -13 16 -18 -4 -3 -15
4308a5NMRk3J0oJ1Nk6OkqnL3K3l2k3N0n7J6J3mK6pj2K1k9K4Kj9JklK5J7n7J0R
$$ -15 -10 -6 3 -20 -10 -16 -5 0 -26 -20 -22 -30 -35 -2 21 -11 -34 16 -41 -25 -12 -16 10 3 -9 12 -17 7 9 -10 -9 -11 -14 11 28 -29 -19 -10
4346a0J6m1M6k5M9o4M5jMNk8Mk4N0l0j3K1mRk1J1J2lj9J6oj5L0qk1kK8k9NLk1
$$ -10 6 -35 11 -14 35 -29 16 15 19 24 -4 0 -24 26 -4 -17 4 0 9 -12 -1 11 8 -11 5 -1 -16 14 6 -15 -17 11 -18 -13 -10 -31
4382c1K5l5J8%L3j3J5j5L2j3j4Pjk3M0Mll3N8l4K5rj2J5l2L1j0k9M3JMl8L3jl8
$$ -31 -6 -41 -23 -23 10 -3 12 -3 29 16 2 9 8 -15 25 29 26 -7 51 17 42 33 21 36 4 35 25 -4 39 40 44 6 39 38 0
4417@rJ5ll0J0K8j9k6K7j1J6K3j4j8pL6ll7RL7l7rk1J1L5k8KK2j0J5k8J9J1J3
$$ 0 -9 6 3 -27 -17 11 -8 -34 -7 -18 -2 21 7 -11 -18 18 15 -22 -13 24 -13 -22 -43 -32 3 -25 -23 -1 -11 4 -24 -5 6 19
4451A9k9K2qPLl9J7lmK0MJ4j2J8k2j2L6J1l6J9l0LL3m2M9k4j4OK5j6nLj2k8M2
$$ 19 -10 12 4 11 14 -25 -8 -11 -15 5 9 23 11 29 7 -5 31 42 6 25 -5 -2 31 -11 38 14 0 6 31 15 10 13 1 -27 15
4486A5nkl5K9lj4J7lj8l1K5oj7M1l0L4JqJ7pk3J4J4k8K4k5j5K2LL8Rk0Nrj5K9
$$ 15 10 8 -27 2 -1 -15 2 -1 -19 -50 -25 -31 -48 -7 -37 -3 -2 -10 7 0 -23 -9 5 -23 1 -24 -39 -17 -14 24 33 13 18 9 -6 23
4522B3k9PJ6OpJ3m%oJ9j8k7L1nK9j0k5ook1J7J0Mn3JK9PJj5J9qJ6n6L4Rl0M5j5
$$ 23 -6 1 17 23 16 29 25 25 19 38 20 -7 24 19 48 38 13 7 1 -20 -3 7 11 -42 -41 -12 -5 -4 -19 0 -8 8 -48 -14 -5 -35 10 -5
4560ej1J1LPj8JM4l1j5K8JJ5l3K5K4p0J5L1j2jJK6l3K7l0L0ROkk0Pk6K0K3k5j1
$$ -5 -16 -5 -2 5 -13 -12 32 1 -14 14 15 30 -3 22 46 -24 -9 22 10 9 10 36 3 30 0 30 39 45 43 23 30 4 24 47 22 11
4596A1oj7J5JKMJjj5k2JK8l1N7m2K9l1RqnLj2L8j8nmJ6j9K4K2j4m7J9J6jl9M4
$$ 11 5 -12 3 4 6 10 11 10 -5 -27 -26 2 -29 28 -14 15 -16 -7 -15 -20 -17 -29 9 -9 -14 -18 -2 -21 3 25 11 -36 -17 -1 -2 -41 3
4633CJ7rK4l4j3J5K5k0J0oqj5M9J7m0k3J9J1jj0LjQj2%Qk8qM0J4j5k2K4l9J4O
$$ 3 20 11 35 1 -12 3 28 8 18 12 4 -11 38 55 15 -8 11 22 21 11 14 13 21 9 9 17 -11 -19 21 35 20 -2 22 -17 -3 3
4669CjJ2J6k1qk9L9k2J9k3rM%K2l8M8j4K6j8k7L3l6J1NOJ7j2j2OL4m1K9j5J8j9
$$ 3 2 14 30 9 1 -28 11 -11 8 -15 -24 -20 -20 2 -36 12 -2 24 6 -21 12 -24 -13 -8 -2 15 3 -9 -3 31 -10 19 4 22 3
4704CJNKnonj3M2Ml3PJ6j3J7m0L3k6J8kl4J4K0j5lqM1m9K8m0MJ5%K3k4K9j9j0
$$ 3 4 9 11 6 0 -5 -18 24 28 -5 2 18 5 22 -18 15 -11 7 5 -29 -15 5 -10 -13 -21 20 -29 -1 -41 -37 -22 -22 1 -23 6 -13 -23
4741b3J8j2LL8j8k1oJ4j8L3Ql2MRMK2j3Qk2J3k5L1J4qnk2J3nkJ6m5K4pqJ8rJ9
$$ -23 -5 -17 -14 24 6 -15 -21 -7 -25 8 16 -16 -12 -3 1 23 10 18 -4 9 -16 15 29 21 16 -6 7 2 0 16 -29 -5 -12 -20 -2 -11 8
4778Hm8M8j4M2l8K8p2O5m3L0o%l2OJ1J2k5m0L3K9j1qK0j7L1k5j2J0mK1nmK0j7
$$ 8 -40 8 -6 36 -2 26 -46 19 -24 6 0 0 -32 -26 -15 -3 -28 -68 -35 -6 -17 -25 -5 -22 9 -16 -28 -18 -22 -1 -6 -10 10 -7
4812gl6K8L9k5j2K4j8J9rJLJ0j3MJ6J2rm4NL6k2%kK5rk3rK5oj5Pj5J7K4k9j2M0
$$ -7 -43 -15 24 -1 -13 11 -7 12 3 4 7 17 4 8 24 36 27 -17 -12 24 2 2 0 25 16 -7 -16 9 3 -12 -5 -20 -3 21 -8 -20 20
4849B0m4POLlMNj7nmOK1j2Rj9qN6l3qLK8rm2j1L5J5nK3l7RlK7%mLml7K0J2j9J1
$$ 20 -24 -17 -11 -8 -11 -7 -2 -19 -24 -28 -22 -1 -13 -4 -23 -31 25 -8 -16 -13 15 6 -36 -47 -12 3 -2 21 -16 -7 -10 17 17 13 16 12 -25 -5 7 -12 -1
4890aL0rk3J6j8M2l0mj6qj6M8k4k1J6J9l7K7K0k7J3qL5k7K8l1K0k8KKPj1LL4k8
$$ -1 29 20 -3 13 -5 37 7 3 -13 -21 -37 11 -13 -34 -18 1 -36 -9 11 -16 -3 -11 24 -3 25 -6 14 -14 -12 -10 -3 -14 -11 23 -5
4925ej8M7n1N2j6rOpJ0oqKK4mJ5Mj6Jl8L4j8J4J5LpJ5k7m2M3pmK0l4Pk7M8j0m1
$$ -5 -23 24 -27 25 9 0 6 -1 9 3 -5 -3 21 17 32 36 20 21 -17 17 -1 13 28 31 24 39 12 -30 13 6 2 22 -12 -5 -32 16 6 -35
4963c5L7lj0nK4k8noL3k2L5l8KmL6k0pJ4k8K9pL2m7M0j1k2L9jm4M4K0n7L5k1K
$$ -35 2 -1 -11 -16 8 -20 -25 -31 2 -20 15 -23 -21 -25 11 -9 -16 -2 -30 -1 -8 24 -23 17 6 -16 23 22 -22 22 42 -15 20 -1 1
4998AJ4Kk9K1k9rN4k6J6JJ6nm0qN8m4K1oK4k2J6m9K4mj3K9l2JjJ2j0J3kmQmmK4
$$ 1 15 17 -12 9 -20 -29 25 -1 15 16 32 27 -13 -21 37 -7 14 8 32 10 26 -23 1 -3 -16 13 -19 -18 -19 -7 -17 -4 -6 -10 -2 -6 -10 14
5036A4l1RLj2MK8l7NllKNKL5oL4n2j5J1MJ6l1L6ok1K3k0J6M0k8j2J7Mjm7K0PK
$$ 14 -17 -8 -5 -17 -13 15 -22 -17 -20 -23 -21 -16 -14 21 15 49 -3 -18 -7 -3 13 -18 18 12 -9 14 -6 10 50 22 10 27 31 30 -17 3 10 12
5074A2KJ4k5j6K6j7L5o0K0K9j7j4K8k8PmQOk6L1l4J5J3Pl5lNNr%J0J7L5p4L9J5
$$ 12 14 28 3 -13 13 -4 31 -29 -9 20 3 -11 17 -11 -4 -8 0 6 -20 11 -23 -8 5 12 -23 -26 -21 -16 -25 -25 -15 2 37 -37 2 17
5110A7jl7kK3k2J7OL3k7Nj6J1pK7Kj2pJ0Jk1Jj1J9j4NQl3L8l9J6oKJ1kLPl5L4
$$ 17 16 -21 -23 0 -22 -5 1 34 7 12 -4 7 0 27 29 17 10 20 21 0 1 -10 9 -5 0 8 -25 13 -26 -10 -16 -14 -3 -5 -2 5 -30 4
5148Dk8K4Nrk3L0k7L4j6K3l9KK2rQl4L2%%kL0l9K1Nj8Q%mK4oOJkK5Lj9m3N0j6
$$ 4 -24 0 5 -4 -27 3 -24 10 -6 17 -22 -20 2 -7 1 -33 -1 -1 -1 -3 27 -12 9 14 -4 4 4 0 24 18 24 25 23 48 51 32 -11 39 23
5187B3k5M8l4J0k4M2m8mJ0PJ4j1Nl4RK9j4pl8K4k7J1N0l7J5Rk6M0k9K2j0j1kl0
$$ 23 -2 46 12 22 -2 40 -8 -12 -2 5 19 8 13 -21 -12 17 3 -4 -42 -18 -45 -34 16 -21 -6 3 -23 17 -12 10 0 -11 -13 -43
5221d3L1J0pkK4j1j4j2J5nM1j2j3K1k4K7l7J9J0npK6Nj0j4jM3m2k9MJ1K8j1l6
$$ -43 -12 -2 -9 -11 13 2 -12 -24 -9 -14 27 15 2 23 -1 26 -11 8 18 13 6 32 37 27 13 12 55 13 -16 -12 -1 27 16 -20
5255b0M6m2J7K3o2M5J4j6j4J9k5K0pk0J8qj2M0j9l2J2jj8L8j1j2N3o7K6jM1m5
$$ -20 26 -16 1 24 -38 7 21 5 -9 10 -15 5 -2 -22 -4 -12 -24 16 -3 -35 -23 -24 -42 -4 -15 -27 26 -41 -15 -16 25 -20
5287b0J5KrK6l6K4rK6j2k5L0j1j1K4mLJ2k3K7k8J3j0NJ6l9J5rJ3kK3k5Nj3mQN
$$ -20 -5 -3 -12 14 -22 2 -7 19 7 -18 12 1 -10 14 10 13 25 2 29 1 14 4 9 25 -14 1 -8 5 3 26 1 6 -7 -11 -3 2
5323BqjLk6pM4k5K0k6rJ8lJ1llj2k5M3j4J1l4K7K7j7RKj5mK7k4N9l1%k4kL7lj2
$$ 2 -6 -7 -4 -30 -37 7 -18 2 -24 -33 -15 -18 -7 -10 -13 -25 -50 -7 -21 -10 -44 -17 10 -7 2 4 -11 -15 12 -12 47 16 16 -8 -10 27 24 12
5361A2JlJ9k3lnK2nj2j7K1npJ7rJ2k0Rl7K1K2j9k4K5koj4M1Jj4K8o0K0j6MpL9
$$ 12 13 10 29 6 3 -2 20 15 3 -14 7 2 -5 12 3 15 -5 4 -33 -12 10 -9 -33 -8 -10 -16 -30 11 12 -2 26 -34 -14 -30 -26 -33 6
5398Fk1j7OJ7Lk7M9J8m4jL0j8NJ0k4K6k7KK5j5%nJ3j5OJ0j1KRJ5kj1jj5RnQKJ
$$ 6 -15 -32 -26 -9 -6 -33 16 34 -10 -11 19 1 6 16 -8 18 -9 -7 18 3 3 -2 11 -4 2 12 1 3 12 27 25 14 13 -2 7 2 10 12 13
5437A3OLk1l3K8K3k8olqkoJ5k9L4j2OK8m1O3n3K3l1J0M0k3K0rj3Mj5K7%nj8kK6
$$ 13 19 22 1 -32 -4 19 -9 -15 -18 -26 -28 -34 -19 -48 -14 -26 -20 8 -33 30 -23 0 -31 -21 19 -4 16 7 -6 -2 -17 10 10 5 -13 -15 11
5474A1j5j3M4l1K0j1PmPRK3j3j3J0j9Rj2j0J2K2k2k5%j8M3kl3M1l6J0rlJ2o%L0
$$ 11 -4 -17 27 -4 16 5 12 8 15 24 47 34 21 31 12 21 9 -1 11 33 11 -14 -14 -32 11 9 -24 17 -19 -9 -18 -21 -9 -15 -15 15
5510A5m7L2j7rL3j0j8PLj1L0%j9L7m5L3k8J3J2J1Mj5j4J1oqK5k4K3k2J4K0k2L3
$$ 15 -32 0 -17 -26 7 -3 -21 -14 -11 -22 8 8 -11 26 -19 14 -14 -1 11 22 26 11 -3 8 2 -6 19 -5 18 -4 10 30 8 41
5544D1j9j3nM0k8Ml4J4J8j9j4K5rk5M9n5MN2j5k1j9J8L5m3J3J1j3j8K0j6J3L6
$$ 41 22 9 4 44 16 20 -14 0 18 -1 -15 10 1 -24 25 -30 -26 26 11 -10 -29 -11 24 -19 -6 5 -8 -26 -6 -22 -9 27
5576B7k3j4j6J1L1k6j0L3j2jOL0l0J0J4l6M7m4K7j2M4n6Mj8L0KpPoKk3K8k2M3
$$ 27 4 -10 -26 -15 16 -10 -20 13 1 0 6 36 6 16 30 -6 41 -3 24 12 56 0 4 -14 16 18 11 18 12 14 -9 19 -3 40
5610D0l5mJ6oj7%K6j3j1NL3n0k1N2k8RJ6j9j3k2PK5qK5k1J0l2L8Nj4k0J9j7J4
$$ 40 5 1 17 11 -6 -6 20 7 -4 1 34 -16 -37 15 -13 -4 12 -7 -20 -42 -35 -10 -18 7 -14 -4 -36 2 7 -7 -27 -8 -25 -11
5644a1j3M3JJQl6M2n8K9Npj2L8j6qnJ8l8M8ol8J0K6k2rK2l1PNPK4jk1j3J2j1j
$$ -11 -24 19 20 21 29 -7 35 -23 6 11 4 -8 30 14 6 1 19 -19 29 23 -15 -5 21 -1 -10 12 -19 -12 -7 0 24 23 2 -11 1 -10 -11
5681a1K5qk4K4Pj3jk4K0K2qk5J8k9NpmJ8K0Pl0K1k8J6jrJ7j8RK0qjrmOJ8lJ1P
$$ -11 14 6 -18 6 13 0 -1 -25 -5 17 9 -16 2 -27 -22 -29 -33 -15 5 12 -18 3 -25 -9 -10 -19 -2 -20 -11 9 1 0 -9 -13 -7 11 8 19 26
5720B6k2k5M7j2m3KOL4kj4J0m1K0L0jlm0J2L2k5pj1L2k6K0m7K6PqKK1Kk9J1oj0
$$ 26 4 -21 26 14 -29 -27 -21 13 11 -3 7 -34 -14 16 15 12 -28 -16 16 -9 -16 -27 5 -21 -1 -48 -22 -15 -23 -21 0 2 -27 -16 -22 -32
5756c2M1j2j2j4l%J4J4mML9o1N6l4nK5k1J7k3K5K1l1mJ4qnK5j7OnJ8l8J4J1Ql6
$$ -32 9 -3 -15 -29 -32 -32 -18 -4 -8 -4 35 -26 30 -4 -9 16 -5 12 -11 14 35 4 0 14 6 1 26 9 15 10 28 -10 4 15 23 -13
5792a3K2J4J2l7j9K0MRok7mJ1L8l6J3%J3j3Kl2J8K7l6qL6j1rJ6k8J7Qk7K8k1J9
$$ -13 9 23 35 -2 -21 -1 3 12 6 -21 -25 -14 24 -12 1 1 14 1 3 -29 -11 16 -20 -28 8 -3 -12 4 -24 -7 1 -26 2 -19 0
5827@K5l3K5J0j7nnK1oj1K0Oj0j4Qk0j5L9j8M0l4J2K0k9l2J6K9j6rj1NJ3Nj4j5
$$ 0 25 -8 17 27 10 5 0 21 15 4 24 30 20 6 14 -6 -21 18 0 40 6 18 38 9 -23 -7 22 6 -3 -14 -9 4 9 -5 -20
5862b0J3LJ3k1j4%J1K8ll4K0j6k4J3N2n0L1QmnKOMjNLMOml9J9pK1LJ0l5NRJ8k4
$$ -20 -7 -4 9 -12 -26 -26 -15 13 10 -24 -4 -20 -44 -31 21 -29 2 10 6 1 3 9 13 12 17 20 24 30 26 -13 6 -1 20 23 33 -2 3 12 30 6
5902FPk0J8j1Qj1JMjJ4j4j9M1n5M5kj2Pk0M4l1orqK4nj2MkMj1j2J7Rj8LK5jj5
$$ 6 13 -7 11 0 8 -3 -2 2 1 15 1 -18 23 -32 13 11 -1 6 -14 30 -1 -7 -16 -24 0 -5 -17 -13 -15 -11 -22 -34 -17 -8 -26 -23 2 1 -14
5941a4%QJ4J9l4rK6J0k5M2k2J4k5J6l1PkK3Mk0K0Nl5K8Qj8l6J3M3n0M6Pk6QJr
$$ -14 -14 -6 8 27 -7 -16 10 20 -5 37 15 29 4 20 -11 -4 -6 17 21 1 21 26 -9 19 27 9 -27 -14 29 -21 25 32 6 14 15 6
5977Frj9M3oKl4L5k8k2J7L8l1QnRnJJ1k3pnmK3J9l1J8j5KN0l6MK0rj3j7L0%k4
$$ 6 -3 -22 21 15 17 -17 18 -10 -32 -15 23 -8 0 -5 4 -1 0 11 -12 -19 -24 -28 -5 14 -17 1 -14 -12 38 2 6 26 17 4 -13 17 17 -7
6015gJJ5K9l5PJ9J3k8J8j8nQk%Ql0J9l0M1qKl4J6kj3kj4jK3oJ5J2l3NLOrL2k4
$$ -7 -6 9 38 3 10 29 42 14 32 14 9 17 15 15 23 -7 12 -18 23 15 17 -17 -1 -3 -16 -18 -32 -33 -10 -16 -1 11 -22 -17 -14 -8 -17 15 -9
6054iPjk7N%pL2k2J6Qk9L1J0l5L9J6rJOl0NjJ4j1L2m3K4%jk0QqLRl6J6J9j4K0
$$ -9 -2 -3 -30 -25 -25 -32 0 -22 -6 2 -27 4 14 -21 18 34 25 26 32 2 7 6 20 9 41 -2 22 22 21 1 9 1 4 13 -23 -7 12 -2 18
6093A8j1nLpJ3qrj0K5mqOk0k7M5j1rK1k1Qk%j0L1jloJ4l5L0ooML7k5J1qj2J0l
$$ 18 7 2 5 -2 11 3 -6 -16 9 5 -3 3 -17 -44 1 -10 -19 2 -19 -11 -13 -13 -23 8 7 4 -2 12 -23 7 1 -5 -1 36 11 22 14 2 12 9
6133Ij0K7rjK4l0pj6K1J6J3nl4J7oJ2qjk9KlOM6m1%J6k2M3l2j3K8j5nR%j4k0M0
$$ 9 -1 26 17 16 40 10 3 -13 8 24 37 32 -2 15 9 21 13 12 -17 -15 -18 -12 34 -7 -7 9 -13 30 -2 -15 13 -2 -7 2 2 -12 -32 8
6171Hj3RKJJl2K8Qj7qjK1K6j4J3l5M9o2J8k1K8k0K4ljJ4l2J5J9j3k2K9lMj2oj4
$$ 8 -5 4 6 7 8 -24 4 12 -5 -13 -14 7 33 19 32 -3 46 -16 2 -19 9 -11 13 10 9 23 -9 6 25 12 -10 19 16 20 8 2 -12
6208a2M2j6rKj4J1l1J3J7kj5oJ3j9K9nk0j1J3J3qJ3KJ5qnj8j0K8pJ7jj9M3l1j1
$$ -12 30 14 5 7 -7 4 -27 -14 3 1 -14 -20 -7 -26 3 -2 -22 -33 -20 -7 -15 -2 0 15 7 2 -16 -26 2 -5 12 11 -8 35 4 -7
6244gj3K3J0pK6j7J1qrLj8M5km9K8kJ9k6L1k2J0l2J1J5jm0L7j1J1Ql4K5%m3N6
$$ -7 -20 3 13 6 32 15 26 18 9 12 -6 39 37 -12 16 14 33 7 38 16 26 -6 5 20 19 -21 16 5 16 24 -10 15 15 -28 28
6279B8n0L4kl1K4K9l5J3k2m3K0N0olk2J6J3l1L1j3j0j0K1J9rj7L4j8lJ6rj6K6
$$ 28 -22 12 10 -21 3 32 -3 10 -12 -55 -35 15 9 6 -16 0 13 -18 13 0 -10 -20 1 20 11 -6 28 10 7 23 14 -2 24
6312B4m5J1K5oJ3j6kQk8J4pKK6j8PLk4oL1k4L1k1L4k4k9K2Pl0NK3l9K5j2M6n5
$$ 24 -21 -10 15 9 22 6 4 12 -16 -2 -9 -7 19 1 8 11 -13 -19 12 -12 19 -2 32 8 -21 1 8 -22 -17 6 -33 -8 -20 26 -29
6347b9NK5k2K8k3MK5j1k7K9k8J8l0L0MK6kk9OmK3l4L1j0K9m2K1J7j1k3J1k6M8
$$ -29 -24 1 -21 7 -16 -12 13 2 -25 4 -24 -6 -36 -6 -2 24 22 -7 -1 -5 18 -16 15 5 34 -8 13 30 19 -4 7 -19 29
6380B9kk3J8j2N0l1j7j1QNj3j1M0k1k9K3J3j1k0nj0N2k9J3oj1j1K5j3J9j9pJ2
$$ 29 27 4 22 10 60 29 12 1 9 14 1 -10 30 9 -20 3 16 5 -15 -20 -30 22 -7 6 0 -11 -22 3 -10 9 -10 -17 -5
6413ej6J7jJ1j0j5L9m1ML1k6L0%J2m2J5K2m0J3JOMmJ6kj1qj3K4l7J0jM7l3J8k8
$$ -5 -21 -4 -5 6 -4 -19 20 -21 -17 14 -12 18 18 30 -12 3 25 -15 -2 -1 5 9 5 21 19 8 0 -13 11 -26 -16 -17 30 -3 15 -13
6449a3J8k4L7l4Kj2K3Nk3L9k7mpRK4m6L6m9L2M4m3j0J9N%k4J2mNL4k7oL3j8K3
$$ -13 5 -19 18 -16 -14 -26 -3 2 -21 18 -9 -13 -20 -11 13 -33 3 -46 -14 30 -13 -23 -4 1 1 -23 -11 -15 -10 24 -3 -9 24 6 29
6484B9m3J9K1llJ3Rm1J4j0mL9l9LL8l1k5K%J2J4NJm2J6llL2n7N6l0OJ0rJ6k9J1
$$ 29 -14 5 26 23 20 33 42 1 15 5 1 40 1 4 42 11 -14 -12 -12 0 14 19 20 -22 -6 -9 -12 20 -37 19 -11 -5 5 -4 12 -17 -6
6521fmOlrj6K6k5J1L4l3K2L1o5L0l9L1kjOJ8K1j2n3M3pj1L2j7K4k6qK0Lmj6j3
$$ -6 -10 -4 -7 -16 -32 -6 -31 -20 14 -19 3 34 -31 -1 -40 -9 -11 -12 -6 12 33 21 -32 11 4 -7 25 8 32 6 -2 18 21 17 1 -12
6557a2L3Nll8M3pJ1l2rKJ6k5L0Rl6jK1n1L1Rk2LL7m3K2J9l1K6k3K9k3Qkoj5J2
$$ -12 21 26 23 -15 28 21 32 0 -9 -7 9 -16 14 23 -13 -14 7 -44 -13 -4 -26 -23 14 -29 -7 12 -19 7 -16 13 -10 -2 -4 -10 -25 -13
6593a3K1llj3Rj7JK7l3J8k1QOL7on4L6OqL3k5j4K0Rj7OjKOj9K3qk3L1k3ROj9L
$$ -13 8 5 2 -11 -2 -19 -18 9 -24 -6 -27 -19 -13 24 18 -36 0 6 -2 31 6 -8 12 21 4 10 9 11 17 -2 21 13 -10 21 -2 7 13 -6 -3
6632cj9L9j2j4J3Jj7j1%mQK8k6j6ML8l7Qj0M9m0OJ3rOL7j8j5K4j1j2j2Rj0M9j9
$$ -3 -22 17 5 -9 4 5 -12 -23 -23 -27 -19 9 -17 -33 -29 9 -28 -20 -30 19 -21 -15 -2 -11 -5 32 14 -1 23 12 0 -12 -3 -13 36 17
6668A7J9j9j4Qj2qJJ0J2J7ql1J6k5M4l6L1j2jj8K5j0j5mmJ3ok4OmPjK1J5mok9
$$ 17 36 17 3 11 -1 -9 -8 2 14 31 23 -8 8 -17 27 -9 22 10 9 -9 16 6 -9 -13 -17 -4 -10 -34 -28 -32 -25 -26 -5 10 6 0 -29
6705b9J8lmk5L8m0M1olK6l1L1oj4M1l9%K8j4nL2k2Lk8j9N6l0J1KlRLj8qJ2K3m0
$$ -29 -11 -14 -18 -43 -5 -45 -4 -10 -13 13 -18 13 7 -7 34 -5 -5 23 9 4 36 14 17 -11 -30 26 -4 7 9 6 15 18 0 -8 4 27 -13
6742a3J8kj8M7l1RjNk1j9J7J8pk2K3Pk1J2J4j5K2k0jj6K2k5Rj2K9l0K0Nj1j0L2
$$ -13 5 3 -15 32 1 10 9 14 -7 -26 -9 9 2 -20 3 10 -11 1 15 0 22 2 1 -15 7 -18 -9 -21 8 -22 -2 3 -8 -18 14
6777A4J7m5QL3J9l1rk%K0K5l6Kk8K4k0M3qjj5K4j2j6QJ7J1m2j5jJ8Ol2JJ2k0J9
$$ 14 31 -14 -6 27 46 15 6 4 4 24 49 13 15 -13 11 -9 34 26 25 10 34 22 6 14 31 42 0 -15 -16 2 8 -24 -23 -11 -31 -12
6813a2K6j1K1k8Qlj6J1j0KjJ9j4k8N0k6jRjJ1Ok6%oJ4K4l8J9M0m1J7%j6j2K2K
$$ -12 14 3 24 -4 4 1 -15 -4 -14 -12 -13 6 -8 -36 14 -12 -13 -4 -5 6 12 -14 -14 -20 -6 18 -20 -1 39 -2 15 15 -1 -13 9 11
6849A1j9K4rJ5rJ1m2K9N%NQJ3rk0oJ0j8L4k3qj0J1k2J2j1RJ0K1k4pJ9j4Pj7J0
$$ 11 -8 16 7 22 13 24 -18 11 16 16 21 29 42 33 13 7 17 -1 33 10 2 -8 3 -19 -7 -18 -9 1 22 -2 -9 10 -4 3 -14 -4
6885dmj5J6Ll1K4Oj4J7J1jj2lj6K1jrK6k1M1j5LOm1L6pJ8k1L1l7jQj8J7Qj2j2
$$ -4 -8 -23 -7 -4 -35 -11 -5 -19 -2 9 8 -4 -7 -23 -2 -3 -12 14 -7 34 19 22 28 -13 23 16 34 13 44 7 6 14 -4 13 21 9 -3
6922cL0k8J7j1j8K2Mm5J1K5j3k1M2j1Mj8RjorM4nm0jK4j0jQ%j4jL6l2N4k4j8j
$$ -3 27 -1 16 5 -13 9 13 -32 -21 4 -9 -30 12 1 5 -13 -4 -5 -11 -20 24 19 -21 -22 2 -8 -9 -1 -1 -15 -16 20 -12 42 18 0 -1
6959aJ9J1j2pk2K7J1ol9L4J3k3J5Rol2K7J5l3JLj5K0k3L6k6L6m0L2m3%M3j2k3
$$ -1 18 29 17 10 -12 15 26 20 -19 15 28 5 20 29 23 -9 18 33 0 1 4 -11 9 -14 22 -4 32 -8 24 -19 -19 24 12 -11
6993a1M5m3Ll2J4jJ0K2l4Nk0K4MrJPj4K8k7K3jJ1j5K6j2pjJ1m3O6k1Qj5J9pm4
$$ -11 34 -9 -6 -38 -24 -25 -15 7 -27 -22 -42 -18 -14 -23 -22 -15 -29 -1 -28 -5 -6 5 -10 16 4 -3 -4 7 -36 30 9 17 2 21 14 -30
7029c0N0kj0PJk8J8j9L6j6RoLPk3MlNm5K4J5j4PmK0NJ1m1K3j2J5nQk1L0J1k1l4
$$ -30 20 18 8 15 16 -12 6 -13 23 7 16 10 13 20 -3 1 -2 3 -42 -18 -3 -17 -10 -14 6 11 22 -19 4 -8 7 2 10 -11 19 30 9 -25
7067b5K5mJ6k9J7j9K7k1NJ8j9J4J7Mk0K1K3n7Qj0L0k5K6j1J6JqKj7J7k0j8J2L
$$ -25 0 -4 12 -17 0 -19 8 -13 -8 10 -9 5 22 26 6 27 50 -7 1 -9 21 -4 22 11 27 28 20 22 5 22 2 -16 -4 -1
7101aK5l6LkL1j4j3J0k0K0k2J0lrJ6J2JJ2k8K2j6J3k2j0PJ2K4k4K0mj3l4J1K9
$$ -1 24 -12 -9 -11 20 6 -7 3 -17 3 -19 -9 -12 -21 -5 7 8 20 -8 14 -2 11 -11 -21 -14 -2 22 -2 18 14 1 -33 -22 7
7135GqmK7Kn2M3j7L3j2kKmJ1l1J7qKj5M5m7K1j0OJ9j7nj5K5j1mKK1j1K7k4j4j7
$$ 7 -1 -5 22 24 -28 15 -2 31 19 17 19 15 26 -5 12 4 6 -9 36 -11 10 0 6 25 8 3 -12 13 2 -2 0 21 10 37 13 -1 -18
7172a8PlJ3j4J7m4N1j7L4j6jj3J0K3k7k1PJ4jL%j7L0k8k1N1M6p1JJ2L7rj6J5l0
$$ -18 -11 -14 -1 -15 2 -42 9 -8 26 10 9 -4 6 29 2 -19 -12 2 1 4 4 -13 17 -11 -32 19 65 -6 -5 7 44 35 19 34 4
7207DJ5%JJl4L5J9rk2l3N5Lml1LQKK6m6j0%N9l5kkMqRk6rJ9J3l0K4l3K0Mj7J2
$$ 4 19 19 20 21 -13 22 41 32 10 -23 32 35 31 0 3 11 13 39 -7 -17 -17 42 7 5 3 7 -1 8 -18 -27 -8 5 -25 -1 -34 -14 -10 -27 -15
7246a5LJ8l6J8lK6k8J6j8J5J6n1L7K0J0n2L9nK0k5M1k9KmJ2Jl2K4k1K7l1M1jl8
$$ -15 -12 6 -30 -12 -15 11 -17 -1 -19 -4 12 -39 -2 18 28 -24 15 10 30 5 46 17 19 15 27 28 -4 20 -1 26 -5 36 35 -3
7280cK3j7J5Rk0Nk3J1j5K3k5rL4l4qM0j7NJ3j1J5Pj5l2j2L7k5L0j8j5L5J5j3l1
$$ -3 20 3 18 27 7 12 -11 0 -15 8 -17 -26 8 -26 -34 6 -11 -6 7 -4 11 18 3 -29 -41 -4 -29 1 -17 -32 3 18 5 -26
7314b6L8njOLmoNK5k1Pj1j4OJ0L0k3J3rOj1j3J3QJ1m6J0J4l8K5lJ3n8K9J3mK5
$$ -26 12 7 6 12 15 11 5 10 35 14 21 10 -4 2 12 42 19 32 23 29 18 5 18 26 37 -9 1 15 -23 2 -1 12 -46 -17 -4 -8 17
7351A7l0kNK6ql2J1rPJ4kk7J8K0k6rK0K1NqKl1M2Om1Qj1nL6Pl2K6J1j7njj1J2
$$ 17 -13 -15 -10 16 8 -24 -13 -22 -15 -1 -3 -30 -12 8 -18 -27 -7 14 19 11 13 -18 24 30 -11 -3 -14 -19 17 24 -8 18 29 12 7 6 -5 7
7389Gl0L3J1j0J6j7K7k2lNk%J0l5K6K3o3J2K5l3L3j4lkk0L1j8oPj3M3l1J1rj8
$$ 7 -23 10 21 11 27 10 37 15 12 17 15 15 25 -10 16 39 -24 -12 13 -20 13 -1 -4 -6 -26 5 -13 -19 -12 -25 18 -13 -2 -11 -29
7424b9OK4j4L7l6mK2k1K6l0K9l0K4J6j7j9L9qk5M3L3n5J8j5pJ6j9K8k7rNMokJ1
$$ -29 -23 1 -13 24 -12 -16 6 -15 11 -19 10 -20 4 20 3 -16 23 15 -10 33 66 11 29 14 7 23 4 32 5 -4 1 5 -1 -3 8
7459HqL3k9k0J1L3mj2pJ1l2KL9n3J8KL0l2LqkJ8Rm1PJ3opRK0RJ0m8J9J5M5m7o
$$ 8 0 33 4 -16 -5 28 24 12 5 16 -16 -14 25 -28 -10 -8 22 -10 -7 -15 -17 1 10 -31 -24 -11 -17 -24 -15 5 14 24 -24 -5 10 55 8 2
7497Bk7K8M6o0O9n6K0j5L1k4%k5L2j1lJ4Ql9J2KnL5m1JJ3klK4k7J1j3qmL2j9j9
$$ 2 -25 3 49 -11 58 2 22 7 38 14 14 -11 21 10 7 21 29 -10 2 4 -1 34 -7 -6 7 5 2 26 -1 10 -3 -11 -15 17 -2 -21
7533b1oL0m9L1%NK7l0j4J6j4K4J0J2k0lqJ8j1K2k0l6K7M8j1n3L8J7k2ljJ4j9J9
$$ -21 -27 3 -46 -15 -15 -10 17 -13 -27 -11 -25 -1 9 21 1 -2 -10 8 -3 19 -1 -37 -10 38 27 -26 12 29 7 4 3 17 -2 17
7567A7j4PJj0K1k4QJ2rK1k3j5K6pj5J4nJ3J8Kl6n0N7l2J0oJ9kJ5j6k2K1j8%j4
$$ 17 3 10 11 1 22 -2 6 18 9 30 7 -8 18 11 -4 10 5 18 36 38 2 -48 9 -23 -13 -19 0 -2 13 -3 -25 -4 -22 -22 -36
7602c6L4k2K4LJ8J3n3L0mn3K9j9K4L2k1k2L5j0kpL3rnJ1%jK0l7J6k9MM3k3Kj3
$$ -36 -2 -24 0 3 21 34 -19 11 7 -46 -17 -36 -12 20 -1 -23 12 2 0 -7 26 17 12 23 23 22 42 5 21 -8 -4 39 16 18 5
7637EkpL5k8qjJ6JQk0lLj2K0pLj4J1pOj7L1j7K1nk7M5j2k5K7kJ7l9j2L5Jj9j5
$$ 5 3 -4 31 3 -5 -6 10 11 19 -1 -4 -1 -13 7 0 3 -11 0 -7 -1 -18 13 -4 17 12 -15 30 18 -7 20 18 35 -4 -16 19 20 1 -14
7675a4K2j5J0J3%RonRj1mkj1JPK4k9Lj1K8J2l5j4QJ0K8k6J2L1m5J9l6K2l2K5K0
$$ -14 8 -7 3 16 16 25 19 14 23 12 8 6 -5 -4 3 27 -2 1 -10 18 30 -5 -19 -11 -1 27 1 13 44 -1 18 -18 4 -28 -3 17
7711A7l1J2K2k4M%l8J6J4%jNj3K7k6jMpJ8Mj0J2K2k0lLl5M8K2m2J1j3K4J1j0j5
$$ 17 -14 -2 20 -4 0 0 -38 -22 -8 -8 -9 -4 -17 10 -16 -17 -13 -20 -2 2 -8 4 26 6 3 6 -29 19 41 -1 10 -3 21 32 22 7
7747GK0l3LmM7l2K8j8m2L0k1L2l0OJ0MJk5K2J4l8J5j7qJ1K1k0J5pj8K7%j1j0J2
$$ 7 27 -6 -3 -7 40 8 36 18 -24 6 -15 17 -13 -7 3 7 8 -17 5 19 -19 -4 -21 -29 -18 3 -17 -2 -9 -27 0 0 -11 -21 -9
7782iJ5J4n5K6Jk2J5L4m4K3Pj8K0Qk3K3k6LK0MJj0Mj6mL2j1Rj0J0n5P0l9oK8j0
$$ -9 6 20 -35 -9 -8 -30 -15 19 -25 -2 5 -13 7 15 -8 15 -11 -8 12 16 17 7 11 -5 -9 23 12 21 11 21 -34 36 -3 -9 19 9
7818Ij2J3oK3m5J0K6l7L2k6K8l4J5n1L2J5J3K1n1N2m8K3l1%RK3J3ol3k8N7J0M
$$ 9 -3 10 4 27 -18 -8 18 -19 13 -13 15 -19 -4 -55 -23 -8 5 26 -25 27 -21 2 -29 -29 -20 3 16 10 -23 -51 6 16 20
7851B0ll5J0J8K8j5m6K0K1j8J2Jnlj7M9k1j0L8j2k1k1j3L7J0JjlNm5K1kJ2k1J5
$$ 20 17 -18 -8 10 38 23 -23 -3 18 0 12 13 8 5 -12 37 16 6 44 32 11 -10 -23 14 24 25 24 21 26 -19 2 0 12 -9 6
7886FmKK2l2qJpj0K5K1l9NJ6oLJJ2mJj0nj3K5k5K8mqrJ2M4l2J2j5MK6j8m2K1J6
$$ 6 2 4 26 -6 -14 -13 -20 -30 -5 16 -23 -18 -2 -8 -5 -4 8 4 5 -5 -10 -23 2 -23 5 1 -7 -16 -4 40 8 20 5 9 35 17 -25 -4 12
7925A2jJm2M3pJ0ok2M4j8l0L0qk5L7j8J2J4m2K7k9pJ7j2LL4m7K0K4k8K1pk1qJ5
$$ 12 11 12 -30 13 6 16 10 -12 32 14 -16 14 6 -19 18 0 12 26 -16 11 -18 -25 -8 -20 -17 17 -30 -10 14 -14 7 0 -21 -29 -14
7960a4J8j0L4m6J7K1k8Oo%MmnoJ5LlJ5mK5j6NoNjjjQk0l3L1k2K0L0l4J9qJ4j4
$$ -14 4 -6 28 -18 -1 20 -8 -2 -8 -8 -4 -8 -13 -19 -4 -1 -4 11 7 32 16 21 15 20 19 18 17 25 5 -28 3 -19 1 31 -3 16 8 22 8
7999Hj0K9j6k2J5nkj6j9L2jk3J8L1l3J9k5OJJ3k8MmK1jk7J0J2J1j1J0J0rPJ1L
$$ 8 -2 27 11 -11 4 -1 -3 -19 -38 -6 -7 -30 -12 19 -14 5 -20 -14 -13 0 -28 -24 -28 -7 -8 -35 -25 -13 -2 -13 -3 7 -2 5 16 19
8035A9l6K6pK1J0j7M1m4jj0L8m6jL0jOj7RqJ3n5K1K6j6J4Lk3J7l5K3j1J9l0K1
$$ 19 -17 9 2 23 33 16 57 13 12 2 40 -6 -7 23 22 28 11 20 12 25 -30 -9 17 1 15 18 -5 12 -23 0 -11 8 -22 -1
8069ajk2J7Nj6jMJ4Om2K7k6K1K0m8N6om0N1j8j5J3k8N6j7k6nK8pPjK5kJj6j2N
$$ -1 -2 -24 -7 -2 -18 -19 -15 -1 5 -37 -10 -36 -15 5 -43 13 7 -33 18 0 -15 -2 -30 26 9 -17 -22 6 -1 6 5 30 28 29 13 1 6
8106FOqk0J6MRJ6m7M2j3l2L5J5k6J4k8j4J8jJ5k4K8m3K3Pk1j9K7J3oJ1qL1l0J3
$$ 6 12 4 -16 0 4 13 29 -18 24 11 -21 14 29 3 17 -11 -25 -7 -8 7 -17 11 -32 -9 -2 -23 -42 -15 -2 -8 3 -5 26 -4 9
8141In0L0J0Jj2K9j7j5J8J1k2j8L3jk7pN2oKL2m6j4j5K5J6j5JjK5lj9J5j0J3M
$$ 9 -41 -11 -1 0 -12 17 0 -15 3 14 -8 -26 7 6 -21 -28 24 18 20 52 6 -8 -23 2 18 3 4 3 28 25 6 21 11 24 28
8176B8l3J5Jk7O2o8J3LMKj5Mj4oJ0
$$ 28 -5 10 11 -16 46 -22 -9 -6 -2 0 -15 -11 -25 -31 -21
8191b1
$$ Imaginary data points
##PAGE= N=2
##DATA TABLE= (X++(I..I)), XYDATA
0@%%%qK4k4K4m0N4p0Q8j10J34j68K08k48L00l56M23n03N88o84P96r20J058j212
$$ 0 0 0 0 -8 16 -8 16 -24 30 -40 48 -62 72 -96 112 -136 164 -192 231 -272 316 -368 428 -492 566 -646
26f46J385j578J789k024K284k568K880l224L601m015M467m964N512o112O771p497
$$ -646 739 -839 950 -1074 1210 -1358 1522 -1702 1899 -2116 2351 -2613 2899 -3213 3558 -3939
42c939Q300r190J0179j1285J2533j3949J5570j7447J9646k2271K5469k9464L4623
$$ -3939 4361 -4829 5350 -5935 6598 -7351 8219 -9228 10418 -11853 13616 -15848 18775
55A8775m1574N1510o6986R4636j59000N65760M12927j143007k88828L02070M66529
$$ 18775 -22799 28711 -38275 56361 -102639 463121 876048 -266959 -555787 -253717 212812
66B12812J0847j59531j74726L0166N8757P2951k0680j8243l8446J2134N765K4615
$$ 212812 223659 64128 -110598 -80432 -21675 51276 30596 12353 -26093 -13959 -8194 16421
78A6421r528l582j4905J0102R54O971p521J898m346M682j498K764l934J785r92
$$ 16421 6893 3311 -11594 -1492 -538 6433 -1088 810 -3536 1146 -352 2412 -1522 263 -729
93g29J964k101J412q56N64j024J377o41N6l98P51o66J82K81K51p60J29L23K3k42
$$ -729 1235 -866 546 -310 254 -770 607 -34 22 -376 375 -291 -109 172 423 -337 -208 115 138 -104
113a04K66p3l26J10M32j50l44J62J80k47m0K70r5k27J66J63k88j9K87K6k57L5
$$ -104 162 89 -237 -127 305 155 -189 -27 153 -94 -134 136 41 -186 -20 143 -145 -164 123 149 -108 -73
135g3R6p2j3K10l3k99R2K30o1j35R2L3j44N7J28j19r8J44L3j44JJ55j1j28Q0J8
$$ -73 23 -49 -62 148 115 -184 -92 138 77 -58 34 67 -77 -20 108 -11 -109 35 68 -76 -75 80 69 -59 21 39
161C9j16M5J41p2j30L2J13n1nQ0o8q1N8P0p1m6O5J8p9K6N4m4k8O1Rq6K6J05m4
$$ 39 -77 -32 109 37 -93 -61 52 1 -4 76 8 -73 -15 55 -16 -62 3 21 -58 -32 22 -22 -50 11 20 -66 -40 65 21
190B1m2L1PlL3j1n6j1J5N3o2rM8po4L9M7n1K0L8l0l0J3M3ln3L6j8k9M0K5l4lk0
$$ 21 -21 10 17 14 47 36 -20 -31 -16 37 -25 -34 14 7 -57 -18 29 -22 -2 36 6 -24 -11 32 29 -24 12 -6 -35 5 30 -4 -7 -27
224b7O5l2mK7k3rnkqL3J5Po2M9m6K6lj4j3%N8j0k1k1K1j3j5K3rP%KjPRrpK4l%
$$ -27 38 6 2 29 6 -3 -8 -10 -18 15 30 37 -25 24 -22 4 1 -13 -26 -26 32 22 1 -20 1 -12 -27 -4 -13 -6 -6 -4 -5 2 11 2 -5 19 16 16
264A6Rm6L4rJ1J1K1m5K0k9RpOK3k7kJ2k2J4J7j5j4j0M0l5K3k1L3j4mkj9RJ5J1
$$ 16 25 -21 13 4 15 26 47 2 22 -7 2 -5 1 24 -3 -5 7 -15 -1 16 1 -13 -23 17 -18 5 -16 17 3 -1 -3 -22 -13 2 13
299A3l0J5kj7k3J9L2j9K9nm6j3P1mj9k2M5LJ6l0kk5J1L4l6J4k5K6MLk1L0j2j1
$$ 13 -17 -2 -4 -21 -44 -25 7 -12 17 12 -34 -47 24 20 1 -21 24 27 43 13 11 -14 -3 31 -5 9 -16 10 14 17 -4 26 14 3
333CJ9J1m7OJ0K2k6L7l4oNM5p0M0Qmk4Qk9J7mPJ9k9K9n7M5J5k5qNQk0L4j0j9j0
$$ 3 22 33 -14 -8 2 24 -2 35 1 -5 0 45 -25 15 23 19 -5 3 -26 -9 -13 -6 13 -16 13 -44 1 16 -9 -17 -12 -4 -24 10 0 -19 -29
370b9J1J5J3j9j3J3k1J4K2k1JK7oOjpm0K1K9l1MJoL9k6L3k1J6l1L2j1oLnj6PN
$$ -29 -18 -3 10 -9 -22 -9 -30 -16 6 -15 -14 13 7 13 12 5 -35 -14 15 -16 -12 -11 -17 22 -4 29 8 24 -7 25 14 8 11 6 -10 -3 2
407BqML8l2kkj3l9M1L0k7J3j5Rkj3K3jj8J7m0M8j8K4k5j4RKj4N1m3J0%J1J5k0
$$ 2 -6 -2 36 4 2 0 -13 -52 -11 19 -8 5 -10 -1 -3 -16 7 6 -12 5 -35 13 -5 19 -6 -20 -11 -9 -23 28 -15 -5 -5 6 21 1
443AMK1l0J%K1l4L3pk2KRnJ4j1m3K9KK0k3NrM8k8qK6j8lMJ6j1j5LK6k8PJll4L2
$$ 1 5 26 -4 -3 -3 18 -16 17 10 -12 -10 -1 -6 8 -3 -46 -17 -15 5 -18 -13 -22 26 -2 -10 16 -2 -5 -1 15 4 -11 -8 18 -10 -3 -2 -5 -39 -7
483gQpK2k5j3K4k2K1NNj2qJ3lRpmK6j9qJ9J6m2K3qlMj4L3qj1%K3k2j2J4k9L7k0
$$ -7 1 -6 16 -9 -22 2 -20 1 6 11 -1 -9 4 1 10 3 -1 25 6 -2 17 33 -9 14 6 3 7 -7 26 18 7 7 30 8 -4 10 -19 18 -2
522bK5nj6j5OPj6k8L2j4J5Rj3J9Nj6Pkj%Jmj0L1l3RLj9L0k0jMJ8l2L4j7K3J4k7
$$ -2 23 18 2 -13 -7 0 -16 -44 -12 -26 -11 -2 -15 4 9 -7 0 -2 -3 -3 -2 -6 -16 15 -18 -9 -6 -25 5 -15 -16 -12 6 -26 8 -9 14 28 1
561AqNK6lj4lj6L1K4m6lJ7krL5j8K1j1l2J5J9m3K1%J8qj5jmnJ2J1kk2J5J5k6O
$$ 1 -7 -2 24 21 7 4 -12 19 43 -3 -6 11 9 0 35 17 38 27 -5 10 29 -14 7 7 25 17 2 1 -3 -8 4 15 13 -9 6 21 -5 1
599ANmOl6M9j7RpOj9K1Ll4K1k1PQj0K5j4QRJ4j9J9rjj3mj8K8J6j7j8J5K0j9K4
$$ 1 6 2 8 -28 21 4 13 6 12 -7 14 17 -17 4 -17 -10 -2 -12 13 -1 7 16 30 11 30 21 20 7 3 -15 13 29 12 -6 9 29 10 34
637C4km7K0J1J%l0Pnj2K8J2Mj4j5J4J4Mmk5J3k1J3k7K3K0m3L1j2j9L3j1J0mK5
$$ 34 32 -15 5 16 17 17 -13 -6 -11 -23 5 17 21 7 -8 6 20 24 20 -5 8 -13 0 -27 -4 16 -27 4 -8 -27 6 -5 5 1 26
672B6j6nk6K9J0m5L6K6l3NqRK7m0J4rMrJ9%j0%J0j8QQnJ0ok1J1rLpK8rl4L7j2
$$ 26 10 5 -21 8 18 -27 9 35 2 7 -1 8 35 -5 9 0 4 -5 14 14 4 4 14 -4 4 12 7 17 11 -10 1 -8 -5 -12 16 7 -27 10 -2
711bJJOJ6j7l3O0n4J7J6m2LL0k5rM1j4J4k0qL1l1J2Qk1M1oj5NKQnm2L6Kj1J6J4
$$ -2 -1 0 6 22 5 -28 32 -22 -5 11 -31 -28 2 -23 -32 9 -5 9 -11 -19 12 -19 -7 1 -20 21 15 0 5 7 15 10 -32 4 6 -5 11 25
749B5k9rJ0mM1j9K4rk8j4J7KJ2mk5pPJ2LJKj8j9L7k0j7J0J6nJ8ol3N0j5J5m3R
$$ 25 -4 -13 -3 -7 34 15 39 30 2 -12 5 7 19 15 -10 -17 -10 2 5 6 8 -10 -29 8 -12 -29 -19 -3 -8 10 4 -29 21 6 21 -22 -13
786a3NK4m5L0Pj2K8j9Jj1J7qjJ5nrOOk3OJ8j2J5k0M3m4rJ5jjQK7o8L9Jj9Rk9J8
$$ -13 -8 16 -29 1 8 -4 24 5 6 -5 12 4 3 18 13 4 10 16 -7 -1 17 5 20 0 43 -1 -10 5 4 3 11 38 -30 9 10 -9 0 -29 -11
825a1K9Kk6mK0j4k7K0j7J6MK4mk7QJ0kmMj7K9J8l2kl3M9K0n2QpJK4j3jOj2J1L2
$$ -11 18 20 -6 -10 10 -4 -31 -11 -28 -12 -8 16 12 -15 -7 3 1 -3 1 -16 13 31 -1 -3 -36 13 33 -19 -11 -18 -17 7 -6 -7 -1 -13 -2 30
863C0m5K6K3j8k9N2l7j4RpMK4j3Lk3K3L2l3l1L4lk2M3m2PJ5prJ7l7K2Nj9RJ6l8
$$ 30 -15 11 34 16 -13 39 2 -12 -3 -10 -6 18 5 8 -15 8 40 7 -24 10 7 -15 28 -14 -7 8 1 -8 9 -28 -6 -1 -20 -11 5 -33
899c3N5j8%j3pL9j2mJoLk4J6J1J5k3j2OkL4m7J1L4Pj9Lm3K7j1K9j6qM8n6M0k1
$$ -33 22 4 4 -9 -16 23 11 7 8 2 5 -19 -3 8 23 0 -12 -6 -8 26 -21 -10 24 31 12 15 -28 -1 -12 17 1 -7 41 -15 25 4
935Dj5M9m2K3k4KNl6J9J8QkqNPl7L4k3K1j0k6J2mNj3L9m9K2J6Qk6M4n0M9k7J2
$$ 4 -11 38 -4 19 -5 -3 2 -34 -15 3 11 9 1 6 13 -24 10 -13 8 -2 -28 -16 -20 -15 -28 11 -38 -16 0 8 -18 26 -24 25 -2 10
971A0j2RL0m9K6k4J9n4L4J1qj6L6k6L8k4rlL2j3j4M2j3l4L3Lk7oLK6m0lK7k3J6
$$ 10 -2 7 37 -12 14 -10 9 -45 -11 0 -8 -24 12 -14 24 0 -9 -12 20 7 -7 35 22 -12 21 24 -3 -9 -6 20 -20 -23 4 -19 -3
1006coJ7m1L1Kj0J6Pj9n%K7l2L4k1nmJ6nl0M9n9K6j2NK5J2k6rj2M0k7L1j2J4j8
$$ -3 -9 8 -33 -2 0 -10 6 13 -6 -11 -11 16 -16 18 -3 -8 -12 4 -1 -31 18 -41 -15 -27 -22 3 15 -11 -20 -32 8 -19 12 0 14 -4
1042dK8k6K9j2l0oJ5rQ%K3J5o4L7lj2qJ1kj0K2j8J8k8M7j2j7J5rj4koKJ2OrKK1
$$ -4 24 -2 27 15 -15 -21 -6 -15 -7 -7 16 31 -33 4 1 -11 -19 -8 -10 -20 2 -16 2 -26 21 9 -8 7 -2 -16 -18 -24 -22 -10 -4 -13 -11 10
1080A0M%k1pk1J8NJ7m8L9j2KQJ4ll1K7L1l0kmj0J5j0K9lJ1rNj7OKl8K5K0jk3J7
$$ 10 14 14 -7 -14 -35 -17 -12 5 -43 -4 -16 -14 -6 8 5 -26 1 32 2 0 -4 -14 1 -9 20 17 28 19 24 7 13 15 -23 2 22 21 -2 15
1118A5Njnn4M1jKOm2JL3J0j5MRk4K0j9J9k6K5j4jKj7J6K5Nqj0J5l5L3l8lK5mK8
$$ 15 20 19 14 -40 1 0 2 8 -34 -33 0 10 -5 -1 8 -16 4 -15 4 -22 3 -11 -12 -10 -27 -11 14 19 11 1 16 -19 14 -24 -27 -2 -6 22
1156B2Jl4K7l0L5rj1oJ8K5j5j3Ook3Nj7lJ0MJ6j0K8Rj8qjPl2K9oJ8k3KmrjK2L
$$ 22 23 -11 16 -14 21 12 1 -5 13 38 23 10 16 10 -13 -8 -25 -28 -18 -14 2 -8 20 29 11 3 2 9 -23 6 0 18 -5 -3 -7 -16 -17 5 8
1195Hk5J6%k6mN3j9pnj0K9J3l7J3lj7ML1Qj2J2k1nJ9j9K0k8L2k4J9J5j4j9nK2
$$ 8 -17 -1 -1 -27 -31 22 3 -4 -9 -19 10 23 -14 -1 -4 -21 -17 14 22 10 22 1 -4 15 -4 16 -12 20 -4 15 30 16 -3 -8 14
1230A4j7%RLloLk6M7k3j2PM1j3k8J6pj6k4L7MOk7J3k8j0L3k1lL5j3J5kj8J7kj9
$$ 14 -3 -3 6 9 6 0 3 -23 24 1 -11 -4 37 24 -4 12 5 -11 -35 2 6 12 -15 -2 -30 -40 -7 -28 -31 4 -9 6 4 -14 3 1 -18
1267a8L3l8jJ1rpL5J8Mk0j3J3k2M2J4k5J4Km2K3j1J3pL0k8PK2m3K3j7Kk0LnmK9
$$ -18 15 -23 -24 -13 -22 -29 6 24 28 8 -5 8 -14 28 42 17 31 33 -9 14 3 16 9 39 11 18 40 -3 20 3 5 -15 -12 -17 -21 8
1303HMpqrJ1nkj3L7l7%M9l2k7L4Mk1J7Olpqk8O2j1l1K9j3k2JL6j1J1mj1J5NNm3
$$ 8 12 5 -3 -12 -1 -6 -8 -21 16 -21 -21 28 -4 -31 3 7 -14 3 9 6 -1 -9 -37 25 14 -17 12 -1 -23 -22 14 3 14 10 -1 14 19 24 -19
1342a9O3m9Pq%j1J9nJ7j8Rkj7J9K3pm0J7j8N2k3j2J1Mk0rL9m4PLL4n0J5oJ6jK1
$$ -19 44 -5 2 -6 -6 -17 2 -3 14 -4 5 3 -14 5 28 21 -19 -2 -20 32 9 -3 8 12 -8 -17 22 -22 -15 -12 22 -28 -13 -19 -3 -4 17
1379A7j9k0KlK8oJ1rok9L9J1Mm%k4K1Mpk2M2kj6Oj4K4K5l8Oj3K6%m5L3Lk7k9L7
$$ 17 -2 -22 -20 -23 5 -1 10 1 -5 -34 5 16 20 16 16 -8 13 17 10 -12 30 28 12 18 4 28 53 15 21 8 34 34 -11 22 25 -2 -31 6
1417FK0l7PqL6lj3jk0K3l1K5j9RK9Kj0l3J5J9k8K2j3L0m5NJ8K0k5mj5M3j7j9N
$$ 6 26 -11 -4 -12 24 21 8 7 -13 10 -21 4 -15 -6 23 25 15 -18 -3 16 -12 10 -3 27 -18 -13 5 25 0 -4 -19 24 7 -12 -7
1452gJ2nK1k0qQQk5J0KJ9mnKLj5J3l3M4k6Oj0J4JKj0Rmj7L3k2M2l3l1L5j9J0l3
$$ -7 5 0 21 1 -7 1 9 -16 -6 -4 15 11 6 8 11 -4 9 -24 20 -6 0 -10 4 5 7 -3 6 2 -15 18 -4 38 5 -26 9 -10 0 -33
1490c3K9%J1j6J1j7K2k7K2%l1M9j1j5RLl2JL8rJj8N2n1K9j2pL8m7M6k0J3k3K7
$$ -33 -4 -4 7 -9 2 -15 7 -20 2 2 -29 20 9 -6 3 6 -26 -25 13 4 5 -13 39 -12 17 5 -2 36 -11 35 15 28 5 32
1524C2n1J6J2l1J7J1K3jk1J4l1L8J0k5Poj1lqL0l4k7M5j4rOj5L0jjm2M5k8PJ2
$$ 32 -19 -3 9 -22 -5 6 29 28 7 21 -10 28 38 13 20 14 3 0 -8 22 -12 -39 6 -8 -17 -11 -26 4 3 2 -40 5 -23 -16 -4
1559dpM%LK0NklrjK4l5RK3l6J5nJrKk3RL6k3LK7j1LJ8nj7k3J0Lk2M0qmj6L4l6
$$ -4 -11 -7 -7 -4 16 21 19 16 7 6 30 -5 4 27 -9 6 1 2 -7 -5 -28 -19 17 -6 -3 24 13 16 34 29 12 -11 -1 2 -20 20 12 8 -8 26 -10
1600a0K5nj8J6j3J1K1j6mK5l4k4RNRK0k4Km%LRK3j7%MK4n0Qj6J4N3qj6k2N1n9
$$ -10 15 10 -8 8 -5 6 27 11 7 32 -2 -26 -17 -12 -3 17 -7 -5 -9 -9 -6 3 26 9 9 13 37 -13 -5 -21 -7 46 38 22 0 51 -8
1637hK2MJ8qJ5k2J6k1j9K1K2j9j5k3J8JK4l9J2M4k2qOj5l5K2K0MrJ5l5J3l7N8
$$ -8 14 18 36 28 43 21 37 16 -3 18 40 21 6 -17 1 2 26 -13 -1 43 21 13 19 4 -31 -9 11 15 6 21 -14 -1 -38 20
1671B0l6J0Ql6L4J2Lj0l5M1j1M5m1jk0K8Jj7J1pJ0k4M4l8L6Rk7J5j1j5KJ0J0k9
$$ 20 -16 -6 2 -34 0 12 15 5 -30 11 0 45 4 3 -17 11 12 -5 6 -1 9 -15 29 -9 27 36 9 24 13 -2 0 10 20 -9
1705iM3n3K9kL9k8l1PL4Om1J4l2QnK8K3j3plk0K6K5m2j1M8n2L2j7pMK8l2Lj5j4
$$ -9 34 -19 10 8 47 19 -12 -5 29 35 -6 8 -24 -16 -21 7 30 17 10 7 -13 13 38 -4 -15 33 -19 13 -4 -11 -7 21 -11 -8 -23 -37
1741c7L9j3K9j7k1L0k8L3m2M9o2P3k1PRl8kJ6j1JJ5L0m2%K4j7J2j6Pj0mmj1J3
$$ -37 2 -11 18 1 -20 10 -18 15 -27 22 -40 33 12 19 28 -10 -12 4 -7 -6 9 39 -3 -3 21 4 16 0 7 -3 -7 -11 -22 -9
1775iJ4j2K7n1O2k5L0n8J7lPn%J3j6J0k7N8m1j3J7Mjj5J5%nK7k2%MNNRj7OOj8
$$ -9 5 -7 20 -31 31 6 36 -22 -5 -8 -1 -6 -6 7 -9 1 -26 32 -9 -22 -5 -1 -2 -17 -2 -2 -7 20 -2 -2 2 7 12 21 4 10 16 -2
1813bJ4k3j6K9nK5l9J7qK7k3K7l1lPNK1rj6J2K4l4J5qLk2j6N7o1M3k4K0l9L4j0
$$ -2 12 -11 -27 2 -3 22 -17 0 -8 19 -4 23 -8 -11 -4 1 22 13 -3 9 33 -1 14 6 9 -13 -29 28 -33 10 -14 6 -33 1 -9
1848iMm7N4%J8m5J0kqL8j7k3RPJ5j8Qj0pnPK7l0QK0Pj1K7l6N3l0lk1L0j2J1J4
$$ -9 -5 -52 2 2 20 -25 -15 -17 -25 13 -4 -27 -18 -11 4 -14 -6 -16 -23 -28 -21 6 -24 -16 4 11 0 27 -9 44 14 11 -10 20 8 19 33
1885C3j7L6m1Lk4K3Oj9Qj4K1k8K7mj2pMJ0k9K7lqJ4Nj4QJKJ4o5K6LL5j4oJ2k8
$$ 33 16 52 11 14 -10 13 19 0 8 -6 15 -13 14 10 -2 -9 -5 5 -24 3 0 -8 6 11 -3 5 6 8 22 -43 -17 -14 21 7 1 13 -15
1922a5OqoL3k2L2j7k1M4lj4J4k4J0J8l6J0mK3k0Lk8K2OQk0%J5J2K1l4J3J0m1n
$$ -15 -9 -17 -23 10 -12 20 3 -18 26 23 9 23 -1 9 27 -9 1 -3 20 0 3 -25 -3 3 11 -9 -9 6 18 39 5 18 28 -13 -18
1957a8j9M0Km9N7k7J4j2PpJ5mRJ5k2J5jj9J0ml0%K5J2jk2J0M2l2Oj6%L2oj0N0
$$ -18 -37 3 5 -44 13 -14 0 -12 -5 -12 3 -1 8 23 1 16 15 -4 6 2 -28 -28 -3 9 8 -14 -4 38 6 12 -4 -4 28 22 12 62
1993F2q3K3JrL5qmJMj2k0kL0Rk2K2K0m0nJ2J4Ql0O4m9k3K4l8K0j6KOkj2K4J2k4
$$ 62 -21 2 3 -6 29 21 17 18 22 10 -10 -12 18 27 5 27 47 7 2 14 28 36 6 70 21 -2 22 -16 4 -12 -10 -4 -6 -18 6 18 -6
2030fJoL7J1l1Qn3L6kl0N4m1L4j9J7j7j2J7QRjj6rJ7k2K3K0l5JJ5J4Qk6nj0K1
$$ -6 -5 -11 26 37 6 14 -39 -3 -5 -35 19 -22 12 -7 10 -7 -19 -2 6 15 14 -2 -11 6 -16 7 27 -8 -7 8 22 30 4 -1 -11 10
2066A0l0J7Pj9M4j8j2K5Mm2J4QnJ4l3J4j2lJ3%j5pJ3K3j3j2J4j4j1j3K9K1ml6
$$ 10 -20 -3 4 -15 29 11 -1 24 28 -14 0 8 3 17 -16 -2 -14 -17 -4 -4 -19 -26 -13 10 -3 -15 -1 -15 -26 -39 -10 11 7 -29
2100b9K9RQl6L0kpJ5MqL0m1J2kJ4l9L1l1J1K7lql2J3K4K1l9L3m1M7k6pJ6j6Qo
$$ -29 0 9 17 -19 11 9 2 17 21 13 43 2 14 12 26 -13 18 -13 -2 25 22 14 -18 -5 19 40 1 34 -7 40 14 7 23 7 15 9
2136IJ8l1j9L0J6Mk5K3k9k7L0K2l4J0nlJ8j0J0j2J1j4J2J2rj2lJK2k0K3j1Jk2
$$ 9 27 -4 -23 7 23 27 2 25 -4 -31 -1 21 -13 -3 -8 -11 7 -3 7 -5 6 -8 4 16 7 -5 -8 -7 15 -5 18 7 8 -14
2170a4J8j0K1j3K0j4j2J1rM5n5K3oJ5j2kqK6l6J0J6L1k5j3kj9K9k4j3J3K5nJ7
$$ -14 4 -6 15 2 22 8 -4 7 -2 43 -12 11 5 20 8 6 -2 24 -12 -2 14 45 20 7 5 -14 15 -9 -22 -9 16 11 28
2203B8k4l6MM3k5J9j3J5j2j9J5K1j9l2M6K6n9KL3oj6L6j2k2j1J7K6l5PK7K1j9
$$ 28 4 -32 -28 15 -10 9 -4 11 -1 -20 -5 16 -3 -35 11 37 -22 -20 13 7 -9 27 15 -7 -18 -1 25 -10 -3 24 45 26
2235B6l4K4k2J1K2l3J0NlJ6ql7L8l9L9Kj2k6J4lK6l5N2j8k5J9Mj4j3MJ4KLl0M
$$ 26 -8 16 -6 5 27 -6 4 9 6 22 14 -23 15 -24 15 17 5 -21 -7 -10 16 -19 33 15 -10 9 13 -1 -14 -10 4 6 9 -21 -17
2270a7Mj2PL0m5L9j9Rj9NPnKNK2pk8L3nmL2J8l7j6mk8M4qlK0j2oj6OJJ8kj6%m
$$ -17 -13 -25 -18 12 -33 6 -13 -4 -23 -18 -11 -16 -14 -9 13 6 -22 11 6 2 34 52 15 -1 -5 -33 11 3 0 20 8 2 -14 -8 -7 11 9 -7 -7 -11
2310a1L4l8K9k6J0RJ2jj6K0Jl0rkM4jk6JK2j3J0o6N5J4j4Lmj8K8j7nJ1j2k0K4
$$ -11 23 -15 14 -12 -2 7 19 18 2 22 23 -7 -16 -18 26 25 -1 0 22 9 19 -47 8 22 8 11 7 -11 17 0 -5 6 -6 -26 -2
2345bqK8j9J4j8J8Mklj6kmqM9j9rjL5j7j7J5j4PNj3J5l7J7J2j7Jlj2k0RM1l5k
$$ -2 -10 18 -1 13 -5 13 17 15 12 -4 -6 -10 -18 31 12 3 2 37 20 3 18 4 11 16 3 18 -19 -2 10 -7 -6 -9 -21 -41 -32 9 -26 -28
2383b8j9M7J2j6K1m0kRK2j0k1K4pqK9j1k7L6k0L9k3k1M4j8j5lL1k8L5k4k3M3k3
$$ -28 -47 0 12 -4 17 -23 -25 -16 6 -4 -25 -1 -8 -16 13 2 -25 11 -9 30 7 -14 30 12 -3 -6 25 -3 32 8 -15 28 5
2416EJ7kL0n3Qj8RK5j1j5J1j0mJJolK8j8k8K6L4m7K1j3KKOoMl1N3l1j6L4j4PL
$$ 5 22 20 50 -3 5 -13 -4 21 10 -5 6 -4 -8 -7 -6 -12 -15 13 -5 -33 -7 27 -20 1 -12 -10 -8 -2 -8 -4 -35 18 -13 -29 5 -9 -2 1
2454AJ6k6lj4K8k3K7j8RL7l2l4N9l5K7nJ6n9L0j1J6nj1M3k3J9k2oK1J3k5%Lk2
$$ 1 17 -9 -12 -26 2 -21 6 -12 -3 34 2 -32 27 -8 19 14 30 -29 1 -10 6 1 -10 33 10 29 7 1 22 35 10 10 13 -9
2488ijKJ2l2K3Kj2J0K1Pj2jJ2j3k1%mJ8l1N0j9Rmk2J7J3j3j8J3J2l5N1k1J0l4
$$ -9 -10 -8 4 -28 -5 -3 -15 -5 16 23 11 10 22 9 -12 -12 -16 2 -29 21 2 11 7 -15 2 15 2 -16 -3 9 -26 25 4 14 -20
2523b0L7k7L5Jl9J4qj4M3l1J3Qk2L5j1ooK0l0QJJ0j4J4rK4Mpm8M4rl0RL4nl1j0
$$ -20 17 -10 25 26 -13 1 -7 -21 22 -9 4 12 -10 25 14 8 2 22 -8 0 1 11 -3 11 2 26 30 23 -25 19 10 -20 -11 23 18 -13 -23
2560b3JRlnM0lm3K0Pk3PNlj4J8MJ3j1mJ9j9kK6kj5j7L9k4J6l1L8j8%KKJ1mNl3
$$ -23 -22 -13 -16 -21 19 16 -27 -7 0 -23 -16 -11 -14 -28 -10 -6 7 -4 -8 11 -8 -10 16 14 -1 -18 21 -3 13 -18 20 2 2 4 6 17 13 18 -15
2599a5J5K8j9%J1j7JrkmK9j7Oj4k7K7J7L0n3K5j5MJ5Mm0K2nj1j6LK7pLKJ1j9M5
$$ -15 0 28 9 9 20 3 4 -5 -7 -11 18 1 7 -7 -34 -7 10 40 -13 12 -3 1 16 20 -20 2 -3 -14 -30 -27 0 -7 -4 -2 9 -10 35
2636C5k7j5L7k8K1l1J2PK2k2k3J3J5k9L7ml0K6k9OkK4j0K6o9M3Lj8K0j8nL1k4
$$ 35 8 -7 30 2 23 -8 4 11 33 11 -12 1 16 -13 24 20 -10 16 -13 -7 -9 15 5 31 -38 5 8 -10 10 -8 -13 18 -6
2669fJ5j0qj1lL6j2jNl4J9lL0j4k6J9%J1J6k0Ql1L8j8j2Lj1M4k0Nl2M3Pk6qJ2
$$ -6 9 -1 -9 -20 -23 13 1 0 5 -29 -10 -13 17 3 -23 -4 -4 7 23 3 11 -20 18 0 -12 -9 -20 24 4 9 -23 20 27 1 -7 5
2705Ej0M0k0j0j0kMmlK3j9L1j9pJ7%j2%nj3K8oJ9k6K2m4L3k0j1K2mnqNj0J9j6
$$ 5 -5 35 15 5 -5 -7 -3 -7 -10 13 -6 25 6 -1 16 16 4 4 -1 -14 14 8 27 1 23 -21 12 -8 -19 3 -1 -6 -14 -9 -19 0 -16
2742a6j2J7J4j8JK9rKj0j1j9J9J5Nomk0J3KpQrKK3J1j2k5K2Qpj2L5k4l0M4j9K2
$$ -16 -28 -11 3 -15 -14 15 6 8 -2 -13 -32 -13 2 7 1 -3 -23 -10 -8 -15 -7 -16 -14 9 20 8 -17 5 13 6 -6 29 5 -25 19 0 22
2779B2l4J3L5l8K7j1k6M9m4J3k2L1J2m3M4rl8P%oL3l3J8j2MJ7rPoj9K0lK2om0
$$ 22 -12 1 36 -2 25 14 -12 37 -7 6 -16 15 27 -16 28 19 -19 -12 -12 -18 15 -18 0 -12 -8 9 0 7 1 -18 2 -1 21 15 -25
2814b5N3l2K2lj1KRk6RMj6k1K8%L8k9m6N1mnj7K4L3pj6J7j6%l4LJ1J1JrK3j4R
$$ -25 28 -4 18 15 4 6 15 -11 -2 2 -14 -35 -7 -7 31 2 -44 7 3 -2 -19 5 38 31 15 32 16 16 -18 -15 -4 7 8 -1 22 8 17
2851A7j0k5K2j5Pj3RQj7J7kpjMLJ8k3L4pj6pJ2kl0J9J3Lj9J8J3mk3J6Mk4J4M3
$$ 17 7 -18 4 -11 -4 -17 -8 0 -17 0 -2 -9 -10 -6 -3 15 -8 26 19 3 -4 8 6 -24 -5 8 11 -8 10 23 19 -4 12 16 -8 6 49
2888D9o6L9j8K3j5K8j5lm2P0m3J5k0Pj7J2L1k2Mj2nnL8l4J9kk8J1rpM0l7jJ8k2
$$ 49 -17 22 4 27 12 40 25 22 -20 50 7 22 2 9 -8 4 35 13 17 5 0 -5 33 -1 18 16 -12 -1 -10 -17 23 -14 -15 3 -19
2923a9J8qmK6j3j6L8rj0j2J4K4j9j6J6nrL1l3QopJ2j6L6Ll2k3K3K2nk0L2Kl8P
$$ -19 -1 -9 -13 13 0 -16 22 13 3 -9 5 29 10 -6 10 5 -4 27 -6 2 -4 -11 1 -15 21 24 -8 -31 -8 14 9 -11 21 23 -15 -8
2959hJ0j6J3mJ9k8K0J3l0rj2J9K3j2J4K4m0J8j9lJ9j2Ro%Rl3L9%rLj6k3K7kK8
$$ -8 2 -14 -1 -5 14 -14 6 19 -11 -20 -32 -13 10 -2 12 36 -4 14 -5 -8 11 -1 8 2 2 11 -22 17 17 8 11 -5 -28 -1 -3 25
2995B5Mk9L0l9PQj0L5k3K3l0Kmk9L5J9m1K7nNmkJ6pj7J3K2ml0Qm4L8O8p9K3mJ5
$$ 25 29 0 30 -9 -2 6 -4 31 8 31 1 3 -1 -30 5 24 -17 10 5 10 6 4 20 13 -4 9 31 27 -3 5 -39 -1 67 -12 11 7 22
3032B2m5PK3Ql5kM3k0k5nK5k3L0j6M8m1mRJ6Qn4M9j6l5PL9K6l6Rm0J6K5k9J0J3
$$ 22 -23 -16 7 15 -20 -22 21 1 -24 -29 -4 -27 3 -13 35 -6 -10 -1 15 23 -31 18 2 -33 -26 13 39 3 12 -28 -12 13 -16 -6 7
3067GPk3nJ4Om0K9K1l7N2m3NQlJ3jj7kK1J5k5j4M1j2l5jJ5l0L2Mpnj6J5J5j1j3
$$ 7 14 -9 -14 0 6 -34 -5 16 -21 31 -12 -7 1 -2 11 10 -7 -9 12 27 2 -12 29 17 -18 -19 -4 -34 -2 2 -5 -10 -26 -11 4 -7 -20
3104b0J6l8M6kl2K9lj5J1J5lk5N1j1Nqpj2J0Rj2j2J0K2klk6J9l6L6PJ5j2m8L3
$$ -20 -4 -42 4 2 -30 -1 -4 -19 -8 7 4 -21 30 19 24 16 9 -3 7 16 4 -8 2 24 22 19 -7 12 -24 12 19 34 22 -26 7
3139GlK0k7J6l0K1MRj9jPk1j2L8%Oj2Nm6O2k6J6l9M4k9lJ7j7K3j2k9JK8j2K8k
$$ 7 4 24 -3 13 -17 4 8 17 -2 -3 4 -17 -29 9 9 15 3 8 -38 24 -2 14 -25 19 -10 -13 4 -13 10 -2 -31 -30 -2 -14 14 12
3175A2k9N1j0l6J2LkK2K2k8l5K4JJ9j5%j9KK1Nk7QQ%%Jj9J8k5jJKL0j7KpL8k2
$$ 12 -17 34 24 -12 0 3 1 23 45 17 -18 6 7 26 11 11 -8 -6 15 20 -7 1 9 9 9 10 -9 9 -16 -17 -16 -14 16 -1 1 -6 32 10
3213A0j6j2JnK2L0m4J5orM1l6%K9l9nK0pK0j7Jj1MM0j2k2PJ4k0J5k9L5k4QML5
$$ 10 -6 -18 -17 -22 0 30 -14 1 -5 -14 27 -9 -9 20 -19 -24 -4 -11 9 -8 -7 -18 -14 26 14 -8 -1 13 -7 8 -21 14 -10 -2 2 37
3249C7j3m7L7l1M2j1k4NK5rj5nJ1Pk7K8jOrkrjqN%mj0J5J7Rk4j9J5MqROj7%J2
$$ 37 24 -23 14 -17 25 14 -10 -5 20 11 -4 -9 2 9 -18 10 9 15 6 4 -5 -6 -14 -9 -9 -13 -23 -8 9 18 -6 -25 -10 -6 -14 -5 1 -16 -16 -4
3289dLMj1MJ3rmJk7K2K1R%n5O8k1K1l4Kj7J7JK2k6oL8n4N1k6L8k9Pl9L0k7K9l0
$$ -4 -1 3 -8 -4 9 0 -4 -3 -30 -8 13 22 22 -33 35 14 35 1 3 -14 3 4 26 0 -6 32 -22 29 3 41 12 19 -20 10 -17 12 -18
3326a8J3j2rN9n4K1oJ9J0k7J7Ok9RL1m3L2j8KJ7k1J2Jk1oL4l3K9mQJj4Pj9j6J9
$$ -18 -5 -17 -26 33 -21 0 -6 13 23 -4 13 19 -10 -1 30 -13 19 1 3 20 -1 11 12 -9 -15 19 -14 15 11 19 20 6 13 -6 -22 -3
3362cJjL5l2QpK3k6J4k8L8K1k7L0l8%j0kK1oJ6oj2rL8r1M7PoJ4k9J6j0J9l4M1
$$ -3 -2 -3 32 0 8 1 24 -2 12 -16 22 43 16 46 8 8 -2 -4 17 11 27 21 9 0 38 -53 -6 1 -5 9 -20 -4 -14 5 -29 12
3398A2l8J8j1J7j9kN2k8j2J4k7K0JK1Lk5lL2k6LJ1jl0N5o6K1j2L9j7Pk5L2Nk2
$$ 12 -26 -8 -19 -2 -21 -23 29 1 -11 3 -24 -4 -3 18 21 -4 -7 25 -1 2 13 12 -18 37 -29 -8 -20 19 2 9 -16 16 21 -1
3432a%L2j3l0M8l0pJ3k6K9J1j7J0j8k2MKj2M2Pk6OL4k3j0k1L3rk3J7j7OJ8nnr
$$ -1 -1 31 18 -12 36 6 -1 12 -14 15 26 9 19 1 -21 -17 -15 -27 15 22 -4 2 36 13 3 -18 15 6 -17 0 -17 -11 7 2 -3 -12
3468a2KK9k3NJ1m7L4K4j7J6k8KJ6j9j0J4Pj0jJ1J3j4J0k4J8j3J7j2K2K4m9MJ7
$$ -12 -10 19 -4 1 12 -35 -1 23 6 22 -6 -4 12 -7 -17 -3 4 -6 -7 4 17 3 13 -11 7 -6 11 -1 21 45 -4 0 17
3501A7k8qJ2J3RJ3l1J4nmPomqmL8j4oj6J6n5O6k3nlPk3J2L3l2L1l1L7j0jpK8J
$$ 17 -11 -19 -7 6 15 28 -3 11 6 2 9 3 -1 -9 -13 25 11 5 -11 5 -50 16 -7 -12 -15 -8 -31 -19 14 -18 13 -18 19 9 8 1 29 30
3539C0k7%K1K5n1Ok1RPK4k4J6ml2L0Ql0LJ5RkQkl9K4j8RK6k8KQj1LNk4K8m4K3
$$ 30 3 3 24 49 -2 4 -17 -8 -1 23 -1 15 11 -21 9 17 -13 -10 5 14 12 20 18 -21 3 -15 -6 20 -8 -6 2 -9 -6 -1 -25 3 -41 -18
3577a8J6O%l4L0m1K1%%J0NJLQj2qJ7k3Kj5j3O5l3K9lrj0RL%Rj5K0Jk8K2pK6k3
$$ -18 -2 4 4 -30 0 -41 -20 -20 -20 -10 -5 -4 -1 7 -5 -13 4 -19 -17 -32 -45 20 -13 16 13 4 -6 3 6 6 15 0 20 21 -7 15 8 34 11
3616A1k2RJ0j2KPl8L0j3N2l4Knk2J8K4k9Nk2RJ3j1K8k0rL5k0KOj6K4l1lM0J6m3
$$ 11 -11 -2 8 -4 -2 5 -33 -3 -16 36 2 4 -1 -23 -5 19 -10 -5 -27 -18 -5 -16 12 -8 -17 18 -2 0 6 -10 14 -17 -20 20 36 -7
3652gQj5K5k3Lj1kROQJKlL8m9J6J1j2rK9n2QO7o6N0l8J3l2N5rl8NJ6KQn8O3pm3
$$ -7 1 -14 11 -12 -9 -20 -22 -13 -7 1 2 4 1 39 -10 6 17 5 -4 25 -27 -19 48 -18 32 -6 7 -25 30 21 -17 -12 4 6 14 -44 19 12 -31
3691c1K3j2L3rrj9K7%j4J8Nk8K9j2jnk2M0k2jk7J4M4mk6M1k7J5Ql8j1L1j0jJ2
$$ -31 -8 -20 13 4 -5 -24 3 3 -11 7 12 -16 13 1 0 -5 -27 13 -9 -10 -37 -23 21 17 -9 32 5 20 28 -10 -21 10 0 -1 11
3726A1KQj2J4l9N6Jk0j0pj6J6p%j5k3M4qkJ2jk6K0qj8RrKJ4QolL5l5LOj2L4k6
$$ 11 13 21 9 23 -16 40 41 21 11 4 -12 4 -3 -3 -18 -41 3 -5 -7 5 4 -22 -2 -10 -28 -19 -28 -26 -12 -4 -10 -13 22 -13 -10 -4 -16 18 -8
3765hj0K4ok9L1J9l6J5kJj5L3k4K7j2kl0L3Lj3ML3k0j6J7k5J6Rpj1Ll3M6j4jk2
$$ -8 -18 6 0 -29 2 21 -15 0 -2 -1 -16 17 -7 20 8 6 -24 9 12 -1 3 36 16 0 17 -8 8 17 10 -1 2 -31 15 1 0 -22
3801b2JL8ql7K5ONmQK0m1k0K6kj0QK5l2j2LKK1j6K3J5l7J4mqJ4j2nj3L5qJ1Om
$$ -22 -21 17 9 -28 -3 3 8 4 12 32 -9 -29 -3 -5 -15 -7 18 -14 -26 -23 -21 0 -16 7 22 -15 -1 -5 -13 1 -11 -16 -29 6 -2 9 15 11
3839A1k4J7J5j5j5RMk3J0J4j2K0qNJ6j7Lj2j3Rlk3J3M3k3Mj4k2L6j7J0K8k4j9
$$ 11 -13 4 19 4 -11 -2 2 -21 -11 3 -9 11 3 8 24 7 10 -2 -15 -6 -9 -32 -19 24 1 5 -9 -31 5 -12 -2 26 2 -17
3873a7K0j8K6%k9j0LJ2K7k0K3nk3J7j5nK6Kjpk2L6j8J0k8jN1l4rJ2J2l6K6plJ7
$$ -17 3 -15 11 11 -18 -28 -25 -13 14 -6 17 12 -11 6 -9 -14 12 14 13 6 -16 20 2 12 -16 -17 34 0 -9 3 15 -21 5 -2 -5 12
3909A2PjqJ7l6J8j8J6K1jk2rK3Lm3MjL0n4N9j2knK6l9mJ0K5k8rK3jNj5nJ5j2K7
$$ 12 19 18 10 27 -9 9 -9 7 28 27 5 -4 19 22 -21 -17 -18 12 -42 17 5 3 -2 24 -15 -19 -9 16 -12 -21 2 1 6 -9 -14 1 -11 16
3947A6l8M2j2l3J5J5k4O8n3l8M9j5J6j8L6kl3J2Ol2K7k1K0Nk8K4K5Kk8nOm7L4
$$ 16 -22 20 8 -25 -10 5 -19 49 -4 -42 7 -8 8 -10 26 24 -9 3 9 -23 4 -17 3 8 -20 4 29 31 3 -2 4 -43 -9
3980ij9L4pj2L0J0j8qLJ5j7k6K7Lk2J9Qj8PKj4J5k4L5nk8K8j8K1k8L5l7K6k7M
$$ -9 -28 6 -1 -13 17 27 9 1 4 19 2 -24 3 6 -16 3 11 -7 0 2 -12 3 -21 14 9 -19 9 -9 12 -16 19 -18 8 -19 -15
4015a5kJ6J9j2j0jj3JJ2pRK3LrJl7L5lj2Nj0M9l2JpPj3kK8k4j2Nkk9M5j1kp%l
$$ -15 -17 -1 18 6 -4 -5 -18 -17 -5 -12 -3 20 23 14 15 -22 13 10 -2 3 -7 42 10 11 4 11 -2 -4 24 0 -12 -7 -9 -38 7 -4 -6 -13 -13 -16
4055a6L4k6MRmk6J1ML1j8Kj6k1L1J1l0J9l8L0K4j5JrJ7j4K6m9K7Rj6QJ1NKJ5l1
$$ -16 18 -8 -4 5 1 -25 -14 -10 21 3 5 -11 -32 -1 10 -20 -1 -39 -9 15 0 1 -8 9 -5 21 -28 -1 8 -8 0 11 16 18 33 2
4091Bj7N6k2l2k1N3j5RJ1m4N1n1K1j9K7Ql8J6J3nj0oJ8o4O3%l2K0K0Oj4k7L5l0
$$ 2 -15 41 19 -13 -34 19 4 13 24 -20 31 -20 1 -18 9 17 -21 -5 8 3 -7 -13 5 -59 4 4 -28 -8 12 18 4 -23 12 -18
4125a8oK4l2N2k4MpPRj6jL0oj1k9M3j6J7J%j7jj7MPj6jK5MJ3j5kKlk2J9%nPl2
$$ -18 -24 0 -32 20 -4 0 -7 0 9 -7 -8 22 16 5 -24 19 3 20 21 21 4 3 -14 -10 -3 -19 -20 5 9 22 7 5 7 4 -18 1 1 -4 3 -29
4165b9qL9l0K8Ol4J6kJK0Kj3j3Ml7K9NnK1m7QM9Kk9pj4M2nJ2l0MJ5J0J5Ln5L2
$$ -29 -37 2 -28 0 6 -28 -12 -14 -13 7 9 -4 -17 -13 -50 -21 -16 -21 0 -47 -39 10 12 -17 -24 -38 4 -1 11 -19 -15 0 10 25 28 -27 5
4202Ej2K5j8ML9n3K4K3m1rqKL3j7NJJ0rJ3j6oJ3K0k4nK0k8j1j3K9Ml1L6l9L3q
$$ 5 -7 18 0 4 43 -10 14 37 -4 -13 -21 -19 14 -3 2 3 13 4 17 1 -5 8 28 4 -1 19 -9 -20 -33 -4 0 -31 5 -34 -1 -9
4238iL0m4O2o6L5opnojL0k1J7j7J7j0nJ1mMLqk3M1l1K3Lj6NJ0j3PKqK8j9j9J1
$$ -9 21 -23 39 -27 8 2 -5 -10 -16 -17 13 -8 9 -8 9 -1 -6 5 1 5 8 0 -23 18 -13 10 13 -3 2 12 -1 6 8 0 28 9 -10 1
4276ApmJ8k4J1J6rKn3J8M2k4K9j8j3MpQj7L3m2K2Rj0QQqpJ6mJ7Ok0jj8%L7ok1
$$ 1 -6 -10 8 -16 -5 11 2 4 -49 -31 11 -13 16 -2 -15 -11 -18 -10 -27 6 -36 -14 -5 -15 -7 1 -7 -14 2 -2 15 21 1 0 -18 -18 19 13 -8
4315hPJ1j8RNmJ4mk5L2k2Pj4K5ll5K7J4l8J2NPk1J8J7ol8L3J2k9K7j6mnJ1l3M2
$$ -8 -1 10 -8 1 6 2 16 12 -13 19 -3 4 -10 15 12 -23 4 18 -20 -8 -3 4 -17 1 18 12 -26 7 19 -10 17 1 -3 -8 3 -30 12
4352A2l6J4K7kj3j6K1j2J4njJ3k5k4L9j0qj5K6Lk5L6NLk4lPlk4L1K0m5L2j7J1
$$ 12 -24 -10 17 15 2 -14 7 -5 9 4 3 16 -9 -33 6 -4 -12 -27 -1 2 -23 13 18 21 -3 -6 1 -2 -26 5 25 -20 12 -5 6
4387Fj8L5j8Nk1J3jl1L8pJj2K3q%j3oK0m3L4k0L0Kk1j4L8j3Ok2J4PljNm2J0J4
$$ 6 -12 23 5 10 -11 2 1 -30 8 1 2 -10 13 5 5 -8 -14 6 -37 -3 -23 7 9 -12 -26 12 -1 5 -17 -3 4 1 0 5 -37 -27 -13
4424a3L1k6J2Ok7lRM0m5pL7Rk6J2Lk2K5j8OKK0J3l7jk3J5J1MKPl0KPj5L4j7o0
$$ -13 18 -8 4 10 -17 -20 -11 29 -16 -23 14 23 -3 9 12 -10 15 -3 3 5 25 38 1 0 -23 -8 3 7 9 16 -14 -12 -5 -20 14 -3 -63
4461f3N5k2J6%j2%K5jk0L7l4J8mjj7J4J3J7n2j2RMJ8JOK3l6kL3j5rQNk%oj2L1
$$ -63 -8 -30 -14 -14 -26 -26 -1 -2 -22 15 -19 -1 -5 -6 -23 -9 4 21 -31 -43 -34 -30 -12 -11 -5 18 -18 -20 13 -2 -11 -3 2 0 0 -6 -18 13
4499A3j7llj3K8%pJ1ml1L3m7N9nRk4Rrj7ONJ7j4rnJ3j2J0K3k9K1j0L0j9k3L3l4
$$ 13 -4 -7 -10 -23 5 5 -2 9 5 -26 7 -40 19 14 23 -1 8 -1 -18 -12 -7 10 -4 -13 -18 -5 -17 -7 16 -13 8 -2 28 9 -14 19 -15
4536a5oK7Onk2J2N0m4mk1K6j2J7nk6N0o5N1lJ0k8KJ3J8j4kjNk8K2rM2o3L8j0k
$$ -15 -21 6 12 7 -15 -3 47 3 -1 -22 4 -8 9 4 -22 28 -37 14 11 21 -7 -5 8 26 12 10 9 14 -14 8 -1 41 -22 16 6 4
4572DoL0k9J9kk6j5J0QK7lRk9Mk1K2Njk9NK0%j0J2k3J0J7mJ1m4K2j2jO3m9K6m5
$$ 4 -2 28 -1 18 16 -10 -25 -15 -7 20 17 26 -3 1 -20 2 7 6 -23 -18 2 2 -8 4 -19 -9 8 4 15 -29 -7 -19 -20 43 -6 20 -25
4609b5RL7m0nK2j4qK5l6K5J1j8J3nQJ4rQm3O3l3jRkj6L7k7Lmj3J5Rj8nrJK6Lk0
$$ -25 -16 21 -19 -24 -2 -16 -24 1 -35 -10 1 -17 -4 -9 -1 13 4 12 -31 32 -1 -2 7 5 -11 26 -1 2 -2 -15 0 9 -9 -14 -23 -22 4 7 -13
4648a3k8K8j0K2j5J9l5M3l2OrK9oj1j3kL8m3J8K3nlK3k3J6l0K2k8L2j2J5Qk7J0
$$ -13 -41 -13 -23 -1 -16 3 -32 11 -21 -15 -24 5 -1 -12 -25 -27 11 -32 -14 9 4 1 24 1 17 -13 9 -19 13 1 16 24 -3 7
4682Gj5J0J5Jlj8K6l0j9RJ2J7l1K6j9K9%l4K2j7J2rOomJ7Ol9J7jJ3Ol3N2n0PK0
$$ 7 -8 2 17 18 15 -3 23 -7 -26 -17 -5 12 -19 7 -12 17 17 -17 5 -12 0 -9 -3 -9 -13 4 10 -29 -12 -13 0 6 -27 25 -25 -18 2
4719Bm0K1K5QLQj8j0qj7%N2k4J0Krj2PKL6j8Jj3j3OMJ4j9jj2L8j8J5m6M1l9RK3
$$ 2 -38 -17 8 16 19 27 9 -1 -9 -26 -26 26 2 12 14 5 -7 0 2 38 20 21 8 -5 1 5 19 0 -1 -13 25 7 22 -24 17 -22 -13 10
4757A0j5j0R%OJMj2OrK0m4M2pj8nPJ4JNl5J3mK9Lj6l3K7K3m1N2l4j2J3K3l6J5
$$ 10 -5 -15 -6 -6 0 1 5 -7 -1 -10 10 -34 8 1 -17 -22 -15 -1 0 5 -30 -17 -21 8 11 -5 -38 -11 12 -29 23 -11 -23 -10 13 -23 -8
4794hJ5pNNk6RJ5J2l7JL5k0Ppj0l2N8j5j5K9k4J2K4k4j5qK3L0l4m2O5m6K0k5m
$$ -8 7 0 5 10 -16 -7 8 20 -17 -16 19 -1 6 -1 -11 -43 15 0 -15 14 -10 2 26 2 -13 -21 2 32 -2 -44 21 -25 -5 -30 -34
4829c4L3L8k1kj2pnJ2k1K6j1poj2K2JJ2r%pM3k9J6m0L6nJJ0j2Jj6%J8k8K5onl
$$ -34 -1 37 16 14 2 -5 -10 2 -19 7 -4 -11 -17 -29 -7 -6 6 -3 -3 -10 33 4 20 -20 16 11 12 22 10 11 -5 -5 13 -15 10 4 -1 -4
4867dkK3l1mL3mk6k8L3k7RJ6oL7j8k9L3j8K6k2PRJ8l0j7j1K1Mj0K2Loj6M6l9N
$$ -4 -6 17 -14 -18 15 11 -15 -43 -10 -37 -28 -12 -18 19 1 -28 5 -13 13 -9 -2 7 25 -5 -22 -33 -12 -8 -18 4 7 1 -15 31 -8 -3
4903ck1J8K6j5k0M5k4J6l8L8j6pj2J8j6Qk5M6LpQk0%%J0l5L6j4k1K1L1l7K1ol0
$$ -3 -24 -6 20 5 -15 30 6 22 -16 22 6 -1 -13 5 -11 -3 -28 18 21 14 22 2 2 2 12 -23 13 -1 -22 -1 30 -7 14 8 -22
4938b2j8M3l2L8j4j0J8L0l2k1QJ2m2K2J0oK8qk9kJ9K5k7j4K7j0Ll6K3PNJ7j4P
$$ -22 -40 3 -29 9 -5 -15 3 33 1 -20 -12 0 -42 -20 -10 -16 12 4 -25 -27 -8 17 -10 -24 3 -7 -4 -40 -17 -10 -5 12 -2 5
4972ENj3qRnoL1K1qk5nJ6J3l9K5j0j2KJ4j7M0l8jK1%j5Ok0K5l9J3K5J5j3K5l7
$$ 5 10 -3 -11 -2 -7 -13 18 39 31 6 1 17 30 -9 16 6 -6 -4 10 -7 33 -5 -6 15 15 0 6 -14 11 -28 -15 10 25 12 37 0
5008@k9J0JJRJj7L1k0RJ2j0k1K5j9MrL9k0K0opk7J1L8j5qlJ7Nk9oL6k6j2K%qJ5
$$ 0 -29 -19 -18 -17 -8 -7 -24 7 -13 -4 8 -2 -23 2 -17 -13 -22 17 -3 17 11 4 -23 -12 26 11 3 0 17 22 -7 -13 23 -3 -15 -13 -13 -21 -6
5047fk5M2Lk9J9Nk2j4K7Ol4J0L6j0j3J1n4K1J5nJ9k7K0K9l6RQopJ0j1k7L0pJ1
$$ -6 -31 11 14 -15 4 9 -13 -27 0 6 -28 -18 18 8 -5 6 -48 -27 -12 -17 2 -25 -5 24 -12 -3 5 -1 -8 2 -9 -36 -6 -13 -2
5082bj7Oj0L7j8k5K2Jj2K3K6qj7J7Jqk6J7KJ2l7J8J8k4J5j0JK7n0M6pn5M4rrJ0
$$ -2 -19 -13 -23 14 -4 -29 -7 -6 -18 5 31 23 6 23 24 16 -10 7 9 21 -16 2 20 -4 11 1 2 29 -21 25 18 -37 7 -2 -11 -1
5118ajj8K4onL1m7J0LqK6k2J6J2j4lOLlK0l8J6Kqj2K3k9K6K2l0J2j8M1l5rJ1K1
$$ -1 -2 -20 4 -2 -7 24 -23 -13 -10 -18 8 -14 2 14 0 -3 3 6 3 23 -15 1 3 -5 -17 6 -23 3 25 -5 7 -11 30 -5 -14 -3 18
5155A8lqLjmjnKK2k4nQJ8k0PpQnj2oNj4K4j8%RnL0l5J8LPj4lK2j7k7K8mNl2K8
$$ 18 15 7 10 9 5 4 -1 1 23 -1 -6 2 20 0 7 0 8 3 -9 -15 -10 -24 0 -18 -18 -9 -14 16 -19 -1 2 9 -5 -8 14 -3 -30 -2 -6 -1 -33 -5
5197ePJl2M9j2k5K3k9L6k3K4j5Pk0jL8k8L8k9nJ5K8k0m4jK5rJ0J6l2NnJ9lk9K0
$$ -5 2 3 -29 20 8 -17 6 -23 13 -10 14 -1 6 -14 -15 23 -5 33 4 -1 14 42 22 -22 -23 2 -7 3 19 -13 -8 -13 6 3 -26 -6
5233fJ9k6oM5m4K6jo1M0j0K7KQLk1NqkJj3K7l8K0j4K7j9M1k3nK5k0oJ5Nk6lNO
$$ -6 13 -13 -19 26 -18 8 7 -54 -14 -24 3 5 13 16 -5 0 -8 -10 -9 -22 5 -33 -13 -27 0 -19 22 -1 -6 19 -1 -7 8 13 -13 -16 -11 -5
5271ej9M0k4qLK7k0J5Lk5qK1KLMj9K0J1k4j0Rj4K3l0K1j8LK9j9K5l3LM4m7LoK1
$$ -5 -24 16 -8 -16 -13 14 -6 9 12 -13 -21 0 2 5 9 -10 10 21 -3 -13 -4 -18 5 -25 -4 -22 -19 10 -9 16 -17 -14 30 -17 -14 -20 1
5308AL%Lk9PJ2mRpmNMpOrK6k3j0K8Lk3j9N0Nj9j0K7l5K4k1j0%PNK4k1N6j1j9l7
$$ 1 4 4 7 -22 -15 -3 -7 2 -5 -9 -4 0 -7 -1 -10 16 -7 -17 11 14 -9 -28 22 27 8 -2 25 -10 14 -7 -17 -17 -10 -5 19 -2 54 43 24 -13
5348a3RJ3m4M5k2LPNJ5k6JK8j9omk4L7j0j9K1l4N1l2OL3j7Pk7L5j9k9L6k4J4p
$$ -13 -4 9 -35 10 -12 -9 -2 3 18 -8 -7 21 2 -4 -8 -32 5 -5 -24 -3 -37 14 -18 -12 21 4 11 -16 19 0 -29 7 -17 -3 -10
5383a0lJ3j2K0k5M3l5L5k2j6ROJ2k1K0Mk3K3k1oJ1n4M8J9J4j5j4oL2m2L8J5n4
$$ -10 -13 0 -12 8 -17 26 -9 26 4 -12 -3 3 15 -6 14 18 -5 18 -3 -9 2 -52 -4 15 29 14 0 -6 26 -16 22 37 -17
5416a7K1J6k6J6%l9J9J5k2L0j9Ok1%KOJ5l1K1k2N4k9jL0k2%L8o5M2j8K2lm0RK9
$$ -17 4 20 -6 10 10 -29 -10 5 -17 13 -6 0 -21 -21 -19 -13 2 -29 -8 -30 24 -5 -6 24 2 2 40 -25 17 -1 21 18 -22 -13 16
5451A6k1MOqPJ1j4k3J7Rk0L0j4NK9m1LK5jj4NKj8Kp%mJ6NJ9o0M3k6K5l5L3nK8
$$ 16 -5 -1 5 -3 4 15 1 -22 -5 4 -16 14 0 5 34 -7 -4 21 20 6 11 13 -5 -3 -10 -10 -14 2 7 26 -34 9 -17 8 -27 6 1 29
5489B9l8J1J7l9L1J%ojj9PJ0NJ7m7K6j6QJ2j3J2j0J7JMK9o5jL8Lj8l8M5k1j8J
$$ 29 -9 2 19 -20 11 12 12 6 5 -14 -7 3 8 25 -22 4 -12 -4 8 -5 7 -3 14 15 19 48 -17 -18 20 23 5 -33 12 -9 -27 -26
5525b6K6J1KOOk6RRk7jj2K0k3OqM3ml5L8j6MJ9m5L1mRlJ4l0K2Nj8lPK4n3L9l5
$$ -26 0 11 13 19 25 -1 8 17 -10 -11 -23 -3 -26 -20 -28 15 11 -24 14 -2 2 21 -24 7 3 12 9 23 -7 15 20 2 -1 6 30 -23 16 -19
5563a9J6L5l2nJ4j1mJ6mrJ0j1K1k2qLJ0rkMJ8k2J0nQl1nK0K8J1j2m8M8j6j5J9
$$ -19 -3 32 0 -5 9 -2 -6 10 6 -3 7 -4 17 -5 -13 -10 0 -9 -11 -7 11 -11 -1 -6 2 -29 -34 -14 14 25 13 -35 13 -3 -18 1
5599Ark5KM2J7j8k6L4j6%j1J8j8j3J9j5K0j4K6Nj0k6PK2K6n1K5pL3k9l8N0m1M2
$$ 1 -8 -33 -31 11 28 10 -16 18 2 2 -9 9 -9 -22 -3 -18 2 -12 14 19 9 -17 -10 12 38 -13 12 5 38 9 -29 21 -20 22
5633B2m3J3L1j8k5K8J3l7RK5k8JJ1j0j2OK6k5J6npK3k2J6oQnlOookJ4Rj9K3k7
$$ 22 -21 -8 23 5 -20 8 21 -16 -7 18 -10 -9 2 -8 -20 -14 12 -13 3 -2 -9 14 -8 8 2 10 5 2 8 2 -4 -6 8 17 -2 21 -6
5670fj7L7k5K4Ok2j1NJ3Nl8L9Qj8k8M4oK6j7k5K1rj2N7k5l1j6L0kk1K8nRk4PN
$$ -6 -23 14 -11 13 19 -3 -14 -9 4 9 -29 10 18 0 -28 16 10 36 19 -6 15 6 -6 51 26 -5 -21 9 7 -14 14 9 18 -6 1 6
5706FMJk1oK3klk7K1k0M0j7j9MKK8j6J6pj8J2J3l5kOJ6J4Kk2J9l0L3j7KrJ6Lj
$$ 6 10 11 -10 -16 7 5 2 -25 -4 -24 16 -1 -20 -16 -14 14 -2 14 7 -11 1 14 -21 -23 -17 -1 13 15 -7 12 -18 15 -2 0 -9 7 10 9
5744I%j3K7k0pL9ok5K0oqMJ%J7n8N1k3k0K6lj1QJ0rnJ4j5J7Lk1%K1kk4lJ6kJ0
$$ 9 9 -4 23 3 -4 35 29 4 24 18 10 14 15 15 32 -26 25 2 -18 8 5 -6 2 12 3 -2 12 -3 14 17 -4 -4 17 15 -9 -12 4 2 12
5783A2k4nJ6PoL4j2k1Lj8J3kNl0K6k2N5j0j5K0Lpmj7J9mMj3j5J3j5L9j6k6L0Q
$$ 12 -12 -17 -1 6 0 34 22 1 4 -14 -1 -3 2 -28 -2 -24 31 21 6 26 29 22 18 1 20 16 20 7 -8 5 -10 29 13 -13 17 25
5819B5k1QJk0J0j3lN2n5OK4k0J2k0RjJ6l6kJ5%J%Qj0J0oj7J6J4rJK2j3k5J0K0
$$ 25 4 12 13 -7 3 -10 -13 39 -16 -10 14 -6 6 -14 -5 -6 10 -26 -28 -13 -13 -12 -12 -4 -14 -4 -10 -27 -11 3 -6 -5 17 4 -21 -11 9
5856IJ3l2rM4m5L3j9PR%k4K7pJ5Nn1%M7m4K3j6K1j0MPj3j7K1nkoj2J8K1qpRmj0
$$ 9 22 -10 -19 25 -20 13 -6 1 10 10 -14 13 6 21 26 -25 -25 22 -22 1 -15 6 -4 0 7 -6 -23 -2 -7 -9 -15 -27 -9 12 4 -3 6 2 -8
5895hK3j6mPj%mpoJ3pk1J8j2J2K2qLqmMNJj8K8m5N2rj6K3m8M0J1k7OoJ1rQJrq
$$ -8 15 -1 -5 2 1 1 -3 -10 -16 -3 -10 -31 -13 -25 -13 9 1 4 -4 -8 -4 1 2 -16 12 -33 19 10 -6 17 -31 9 20 -7 -1 -7 4 -5 3 4 -5 -13
5937a3L6k5L8rk5k2L9l5J3%K6o3L4qK4pLJ1l2NJ7j0Qnnnj8J9k8L3j4j3K4j8M9
$$ -13 23 -2 36 27 2 -20 19 -16 -3 -3 23 -40 -6 -14 10 3 6 17 -15 -10 7 -3 5 0 -5 -10 -28 -9 -37 -4 -18 -31 -7 -25 24
5972B4l7PK2j6j1L3k0J4j0qK3Kj7j1%oJPM0l1k3J1l2L5j4L2j2L4n8N3k8J6oK0
$$ 24 -13 -6 16 0 -11 22 2 16 6 -2 21 23 6 -5 -5 -11 -10 -3 37 6 -17 -6 -38 -3 -17 15 3 37 -21 32 4 20 14 34
6006C4kk3j4K1J5k7J7k3rNk1O2l7%Pk0J7J2j0l6L3RJJPl2K2Jj3J0lj2KL0l2K9
$$ 34 32 9 -5 16 31 4 21 -2 -11 -6 -27 35 -2 -2 5 -15 2 14 4 -32 1 10 11 12 19 -13 9 10 -3 7 4 -8 -6 24 -8 21
6042B1j3LK1l3K4k7j4K6k2ML5j5%Oj2Rj0kK7m4J1K3k4J6Pj8J5nJOk8mL7l3L9m4
$$ 21 8 11 32 -1 23 -4 -18 8 -14 -10 25 10 10 16 4 13 3 1 28 -16 -5 18 -6 10 17 -1 14 9 10 16 -12 -16 21 -12 27 -17
6078a7Rj7J4j2L4qKJ5m6L6ok5K1j1LK2loj3jJ1J9j4pnK8l4K7J6m6K8j7rRL5l3
$$ -17 -8 -25 -11 -23 11 3 5 20 -26 10 4 -21 0 -11 -8 14 11 5 -8 -9 2 21 7 0 -5 23 -11 16 32 -14 14 -3 -12 -3 32 -1
6114anK3nK2n5M1k0nPNk9K6J8rmk0K9prj6J8k8j8J9J0j4LJ5oK7j8OK6n7M7j4J
$$ -1 -6 17 12 34 -21 20 0 -5 2 7 -22 4 22 13 9 -11 18 11 2 -14 4 -24 -42 -23 -13 -27 -24 -9 -15 12 -6 0 26 -31 16 2 3
6151Cj4K4n0L3J6J9k7j0j6M8n3J3J5K1ll1L1k4L0J7k9j5L6n1MJ7kJ0l6OK5%j3
$$ 3 -11 13 -37 -4 12 31 4 -6 -22 26 -27 -14 1 22 19 -12 19 -5 25 42 13 -2 34 -17 -13 4 2 12 -24 -18 7 7 -6
6184fj6nM5j9J1J1l7MK5j4oL6k8k8K2%nJ7l1L6l1L4nj9k0J1M2j3l3K4k4M2lml7
$$ -6 -22 -27 18 -1 10 21 -16 -12 13 -1 -7 29 1 -27 -5 -5 -10 7 -24 12 -19 15 10 -9 -29 -18 24 11 -22 2 -22 20 17 13 -24
6219b4K6RK1n1K2PJ9j2j5j1L4j8J5l9K1k2K8K0j2nk4k6K4L0l3J4Ql9O1n0ML1j6
$$ -24 2 11 32 -19 3 10 29 17 2 -9 25 7 22 -17 4 -18 10 30 18 13 -11 -37 -13 17 -16 -2 6 -33 28 -22 -18 13 -3
6252cL2m1o%L4k2j2j9K0K0j6J8k4J8J3j8L6k5Mk0J4m0M1KJ4j9j1K5MNm0J5%oL
$$ -3 29 -12 -18 -18 16 -6 -18 -37 -17 3 -13 5 -19 -1 12 -6 30 5 9 -11 3 -37 4 6 20 1 -10 15 19 24 -16 -1 -1 -7 -4
6287dJ5k8J9J4J6k2j0Opk0L1K0k4j5K0k3NK5k6K5l1Lj0rK7Qj7RNK0o4O6l8RJ4
$$ -4 11 -17 2 16 32 10 0 6 -1 -21 10 30 6 -9 11 -12 -7 18 -8 17 -14 -11 -21 -30 -3 5 -12 -3 2 22 -42 24 -14 -5 9
6322ILMl9M7nj3%k0RLJ7l6L3qK3k3MJ1Mk4J3j8Rk6RJ9k2J0K7l1qK2J3j5rlNj6
$$ 9 12 16 -23 24 19 6 6 -14 -5 -2 15 -21 12 4 27 4 8 19 23 -1 12 -6 3 -23 -14 5 -17 -7 20 -11 -19 3 16 1 -8 -11 -6 -22
6360b2k5M4J5mmnj4jL2kj8L0j4J1Po7M7n5M6Pj6%Rj1j7M7k6K2k6PJ4j0JK1rl7
$$ -22 -47 -3 12 8 4 -1 -15 -16 16 14 -4 26 12 23 30 -37 10 -45 1 8 -8 -8 1 -10 -27 20 -6 16 -10 -3 11 1 2 23 14 -23
6396b3L8j6K7m4L5j6QKpRRk8MLPj1J8jpj1j2j5J9K7l4J2J5j3%J5mmK0k3K5Kl0
$$ -23 15 -1 26 -18 17 1 9 11 4 13 22 -6 -2 1 8 -3 15 14 7 -4 -16 -31 -12 15 -19 -7 8 -5 -5 10 6 2 22 -1 24 26 -4
6433dK3l0j6K6Mm1J9K3l0ML0Nl2nkJ7LRKj5J6J1j5j3NJ5j8J1j4L0j3kOJ1j7kM
$$ -4 19 -11 -27 -1 3 -38 -19 4 -26 -22 8 13 -19 -24 -26 -9 -6 3 5 -10 6 17 2 -11 -6 9 -9 2 -12 18 5 3 9 20 3 1 5
6470EkoL8l1J4kj0J4l8N2l6%Jj2K1RoPn6N7k8jrJ4j4PQJ0j4jj1K5J3k9K8l8j0
$$ 5 3 -3 35 4 18 16 6 20 -18 34 -2 -2 -1 -13 8 17 11 18 -38 19 -9 -10 -19 -5 -19 -12 -4 6 -8 -9 -20 5 18 -11 17 -21 -31
6507c1L3J6lj7QqL3k9%K7j1J7l7j4jL5qoj9J3K7k8MlK3pJ5m3QPJ6Qj5k4J9Rl4
$$ -31 2 18 15 -2 6 -2 31 2 2 29 18 35 -2 -16 -17 18 10 4 -15 -2 25 -3 1 -2 21 14 29 -14 -6 1 17 25 10 -14 5 14 -20
6544b0K0J9kKrk3J1lJ1pJ8l1%K9m2K2J5j0pJ0J1k7nKK3j4K0k4jnj1L1%j4J8k4
$$ -20 0 19 17 19 10 -13 -2 -5 6 -1 17 -14 -14 15 -27 -5 10 0 -7 3 14 -13 -18 -16 7 -7 13 -11 -12 -17 -28 3 3 -11 7 -17
6580a7PJ2j0J8k3Qj2Nj1K7l7M1J0Lm2QNnJ4m1M4J8k7POk9K5J9j9m2M4j7j3K4l4
$$ -17 -10 2 -8 10 -13 -5 -17 -12 -23 4 -33 8 18 21 -21 -13 -8 -13 1 -40 4 22 -5 2 8 -21 4 23 4 -38 6 -11 -24 0 -34
6615c4M4k5j2K0J0pj4j7K4K1Kl7M7l1Qmk4L3kj7K7mOk7M5j7m2L6j9JKMRrj8L7
$$ -34 10 -15 -27 -7 3 -4 -18 -35 -11 10 12 -25 22 -9 -1 -5 -29 4 2 -15 12 8 14 -13 32 15 -27 9 -10 -9 -7 -3 6 -3 -21 16
6651A6j0j6jK2Rk1j2K7j8k4J6l1M3jmQjj1j6K6nM4n3%K7qk5pK7k3J5ROl1PJ8j1
$$ 16 6 -10 -11 11 20 -1 -13 14 -4 -28 -12 -43 0 -1 -5 3 2 -9 -25 1 -4 40 -13 -13 14 6 -19 -26 1 -22 -7 2 8 -23 -16 2 -9
6688iK0n3M2j6K8l4M2m5JJ6J4k1oJ6j2J7JK0k1k0L4Ok7oL6j6J1l5RRnn2K9N7l2
$$ -9 11 -42 0 -16 12 -22 20 -25 -24 -8 6 -15 -21 -5 -17 0 1 21 0 -20 14 20 -7 -13 23 7 18 -17 -8 1 -4 -56 -27 30 -2
6723bj6K5k3L5l9J0K5k3j3J5j9J7RL8l3j1J0j3J3k8mK6mlJ8l3j6L7kj8K3%JK5
$$ -2 -18 7 -16 19 -20 -10 15 -8 -21 -6 -25 -8 1 39 6 -5 5 -8 5 -23 -27 -1 -5 -8 10 -23 -39 -2 -4 -22 1 1 2 27
6757B7n2L3mk0L4Kk0omj7L2ql4M9j9K9j1m8M2Rm7K9Oj2J1J3j9m3O0nk0j9N8l0
$$ 27 -25 8 4 -16 18 20 0 -6 -10 -27 5 -3 -37 12 -7 22 11 -37 5 14 -33 -4 2 -10 1 14 -5 -48 12 7 -13 -32 26 -4
6791dnoN0l8%j8K6K9l7mJj2J9K8m8K5Kj6K3Ll3K6j6QJ1poMj7%J8k8K2j7M1j0q
$$ -4 -9 -15 35 -3 -3 -21 5 34 -3 -7 -6 -18 1 29 -19 6 8 -8 15 18 -15 11 -5 3 14 7 1 5 -12 -12 6 -22 0 -17 24 14 6
6828FK3nj0q%j1M2m1K9k2Jk2L6l5J2KMK0k9J9OOn0K8j3%l1M4moL6k3k0j1K1qQ
$$ 6 29 24 14 6 6 -5 37 -4 25 3 4 -18 18 -17 -5 -3 1 21 -8 11 17 23 -27 1 -12 -12 -43 1 -3 -9 27 4 -16 -27 -6 -14 -6
6865fj2J9k2J4nL1j7J0Mk2J9qrL8o9M5%l3J7M7m0j8K8joM0k1qpMj4K4k6k4M6p
$$ -6 -18 1 -21 -7 -12 19 2 12 16 -6 13 5 -4 34 -35 10 10 -23 -6 41 1 -17 11 10 4 44 23 15 8 12 -2 22 -4 -28 18 11
6901A1rjj2J5m0K9J5k6L5k1jj3KK9k3klRm8P4l2j4L0k4L2j9NpJ6l0M4j6M4o0m
$$ 11 2 1 -11 4 -36 -7 8 -18 17 -4 -5 -18 -16 13 -10 -12 -15 -6 -54 20 -12 -26 4 -20 12 -7 -2 -9 7 -23 21 5 49 -11 -15
6936a5L4l2K1j3J5j0nK3k1K3j1J7j9RKk4K0Ml1K4qj2K1k4kj0M6j7J4l1J5j7K9
$$ -15 19 -13 8 -5 10 0 -5 18 -3 20 9 26 7 16 18 -6 14 18 -13 11 3 -9 12 -12 -14 -24 22 5 19 -12 3 -14 15
6969A5k6k1M9n5J1K5J3j7Kj5K7k1lJ7nJ4rJ7j0j0Rl2J5K0rJ0Jl0j1L7m0J4J4%
$$ 15 -11 -32 17 -38 -27 -2 11 -6 -4 -19 8 -13 -16 1 -4 10 1 18 8 -2 7 -25 -10 10 1 11 12 -18 -29 8 -32 -18 -4 -4
7003dK9j9k6L5jrk4oK7lJ8rj2k2NRoJ3J1k4PpL0oNl5JK7Mkj4J0j6J8k2J7J4j8
$$ -4 25 6 -20 15 14 5 -19 -25 2 -1 17 8 -4 -26 -21 -12 -18 -5 6 -18 -11 -18 12 6 11 -24 -23 4 8 6 -8 2 -14 4 -18 -1 13 -5
7041ej9K8PnJ6j5%Lk3J6j0KL5m8K2Qm5K3oOM1l5k1L2m0L5J7m6J5L9j5k2jL0k4
$$ -5 -24 4 11 6 22 7 7 10 -13 3 -7 -5 30 -18 4 12 -33 -10 -16 -10 31 -4 -25 7 -33 2 19 -27 -12 27 12 -10 -11 19 -5
7076ej1QLJ7j0Jpk8L1j7l5N5j4Rj4K9j0Ok5OJ7kLJ4l4j6N8k0k4J1JjK1J0l7J2
$$ -5 -16 -8 -5 12 2 3 -4 -32 -1 -18 -53 2 -12 -3 -17 12 2 8 -17 -11 6 4 7 21 -13 -29 29 9 -15 -4 -3 -4 17 27 -10 2
7112Bk3L2Ok6NJ5Qj4K1l0J9m6K4j6L3j2rMpK4rmK4k3jk%qL1k0lmK1k2J3ml5L7
$$ 2 -21 11 17 -9 -4 11 19 5 26 -4 15 -31 -7 -23 10 -2 -11 -7 -14 10 1 -3 21 -2 -3 -5 -5 -13 18 -2 -5 -9 12 -10 3 -1 -36 1
7150Aj4j5K8j5Kkk7L7L1j7j3On4N1M2l5k2k7K2K6n3P7l7pLkJ8J7l9L4j4ORJl8
$$ 1 -13 -28 0 -15 -13 -15 -42 -5 26 9 -4 2 -52 -1 41 6 -16 -43 -21 5 -48 29 -8 -15 -12 -14 4 21 -18 16 2 8 17 18 -20
7185b0oN4qrOk2NJ8j5J6kj1K2j5l1J3%Pk5K7Nrj3K4m9L0j7M0k5J1k9M2k0oJ6j0
$$ -20 -26 28 20 11 17 -5 0 18 3 19 17 6 28 13 -18 -5 -5 2 -23 4 9 0 -13 11 -38 -8 -25 15 -10 1 -28 14 -6 -12 4 -6
7221fJ7k8%Qj1K2Lj5J9j0JK6k4J9k8J6l9JM8j8LJ2k0K3mNol7K6Jj7MmPK6k0Nj9
$$ -6 11 -17 -17 -9 -20 2 5 -10 9 -1 0 26 2 21 -7 9 -30 -29 19 1 4 16 -4 19 15 20 14 -23 3 4 -13 -9 -13 -6 20 0 5 -14
7259a4MJ5jk5K8j2KL2l6QL1m5J9l7L1n3O5l8J6K0k7L5k9j3L2j2K0j8qJ5k4L5l3
$$ -14 -10 5 4 -21 7 -5 -3 29 -7 1 32 -13 6 -31 0 -53 12 -26 -10 10 -17 18 -11 -24 8 -4 16 -2 -10 5 -19 16 -17
7292a7Lj5O5k8k5M9m9PK6l8M0J0j6nqL6no3L1J1Nj9l0M0oQmj5J5k0j1K3J6j3M1
$$ -17 -14 -29 36 8 -17 32 -17 -10 16 -22 18 28 12 7 -1 35 30 -33 -2 9 14 -5 -35 5 -1 7 3 -12 3 -17 -28 -5 11 -2 39
7327C9k7l5N5m3JlK2pj3j6J3J5Lj7MJ3k4nK3l0M5lJ9k3PJ4j3Nk3nM0l8J0K0k5
$$ 39 12 -23 32 -11 -10 -13 9 2 -11 -27 -14 1 4 -13 -9 4 -20 -25 -2 -32 13 10 29 6 13 27 14 19 -4 -9 31 -7 3 23 -2
7362b%J7%mnkJ7Qk7Jk2NK1lk5L2j4J0oojj2J1NLj4J6kK9l8Rknj7QRJ1k1K2j0j1
$$ -2 -2 15 15 11 6 4 21 29 2 3 -19 -14 7 4 -21 11 -3 7 1 -5 -6 -18 -7 -2 1 -13 3 1 30 -8 1 -1 -6 -23 -15 -6 5 -16 6 -4 -15
7403a5K7lQLnj0j1J4ll0M8%m9M4orJ0l3J2j3L3jk3NkK3k5QJ1m9O3k4KpmJ2rj4
$$ -15 12 9 17 20 15 5 -6 8 5 -25 23 23 -26 18 12 3 13 -20 -8 -21 12 11 -12 -7 -9 14 -11 -3 8 -41 22 -2 0 -7 -11 1 -8 -22
7441b2K4Nn6J1J3L7j2k4L3k4KJ8j3nLJ4k1j8L2J1j5k2J6pQRj5LqL3L1m0l4L1j3
$$ -22 2 7 -49 -38 -25 12 0 -24 9 -15 -13 5 -8 -13 -10 4 -17 -35 -3 8 -7 -29 -13 -20 -12 -3 -18 -15 -23 10 41 1 -33 -2 -15
7476a5L3m1L7pj4LOKoK5m4M2qLk6%L3pm7O9k6j3l3K3Mj7J2K8m0L6j8K2m3j6M1
$$ -15 18 -23 14 7 -7 -4 2 4 -2 23 -21 21 13 16 -10 -10 23 16 -31 38 12 -1 -34 -11 -7 -24 -12 16 -24 12 -6 16 -27 -43 -2
7511bj6K7n4L6J6ml4%J2K9J3l6OMnK7k6Ll0K9oJJ6NJ4nj3K8k1Kl3L4l0MJ9j7k5
$$ -2 -18 9 -45 -9 7 3 -31 -31 -19 10 23 -13 -7 -3 -8 19 -7 -4 -34 -5 -11 -10 6 11 25 20 7 35 14 16 -17 17 -13 -9 10 -7 -32
7548c2K6L9n4RK9l2OK3k5J6j4qj8M8m7L1oK5j8nJ4qpJ8k5K6Oj2Pk9J4NjqpK0n
$$ -32 -6 33 -21 -12 17 -15 -9 14 -11 5 -9 -17 -35 13 -34 -3 -9 16 -2 -7 7 -1 -8 10 -15 11 17 5 12 -17 -3 2 1 -7 -14 6 1
7585ALMoKm1J2M9k6k7J1PL4m6PK3j7JKJ5k0J8K6l3jJ8lj5K0k2j9L5J1m5K5kJk
$$ 1 4 8 2 4 -37 -25 24 -2 -29 -18 -11 23 -23 -16 7 -10 -9 -7 8 -12 6 32 -1 -2 16 13 -2 18 -4 -23 12 23 -22 3 1 2 0
7622@Kj4%J3Kl0L1nK3n2L4Ok8MJ7K8m4RQJJ0rMk3K3pJ3j7J4k3K3pJ3k1j6PNrK5
$$ 0 2 -12 -12 1 3 -27 4 -1 22 -30 4 10 -18 -14 3 31 -13 -4 4 5 15 6 10 -13 10 3 16 -1 13 -10 13 6 19 -2 -18 -11 -6 -15 10
7661A0j2j1oK0Rk0K4MJ2l5mpJ9j2k9K3K1m%j9Kk7L6J2k0K9k0j6L4k9KK2j8mr%
$$ 10 -2 -13 -19 1 10 -10 14 18 30 -5 -9 -16 3 -9 -38 -15 6 2 2 -17 -15 -42 -6 6 -14 15 -5 -21 13 -16 -14 8 -10 -14 -23 -23
7697b3J7J8k0mpK2K2l1K2l9K0k4K3K2poj0KkKL8l2j4PPK2l4J3j4J2kK5nk0OLk5
$$ -23 -6 12 -8 -12 -19 3 25 -6 16 -23 -3 -27 -4 18 11 5 -5 -3 -5 -3 35 3 -11 -4 3 25 -9 4 -10 2 0 25 20 0 6 9 -16
7734a6%k8M4MKK9m7K0m2L1%j9L4m1MK6qNJ2k0J7nmRj5Qj2NJ7k0NJ2M1m4jj3J4
$$ -16 -16 -44 0 4 6 35 -12 8 -34 -3 -3 -22 12 -29 -25 1 -7 -2 10 -10 7 2 -2 7 -8 0 -12 -7 10 -10 -5 7 48 4 3 -10 4
7771Dj8lK8l3K6rK3Ll4K9k1kJ4Ook0J5K2j7j5K1j0k4M1k3k7NJ4K2Ok4jJ7rJj7
$$ 4 -14 -17 11 -22 4 -5 18 21 -13 16 -5 -7 7 13 7 -13 2 24 7 -8 13 3 -21 20 -3 -30 -25 -11 11 17 -7 -8 9 0 1 -16
7807a6OL5Kj8J6k9j7OJ4k0nqJ9J7LmJ3l3kK8nmoJ0K0nqj9J7j0K0l9J3j9M0j3J
$$ -16 -10 25 27 9 25 -4 -21 -15 -1 -21 -26 -34 -15 2 5 1 14 -19 -21 7 2 -2 -8 2 22 17 9 -10 7 -3 17 -22 -9 -28 12 -1 0
7844@OJ5k5k7J6J0k9L6Kn6L1K6rNk2QMJ8m9N8j4m4N1J0m8M7k2K0l7rK1pK7j9J9
$$ 0 6 21 -4 -31 -15 -5 -34 2 4 -52 -21 5 -4 1 -21 -13 -9 9 -40 18 4 -40 11 21 -27 20 -2 18 -19 -28 -7 -14 13 -6 13
7879A3j8NJ5k5k0K6J1k4J9Kpj6K7kj8MK4Mk1J2lLJ7k1LJ6j9j6J2j5L%j0PLkJ0
$$ 13 -5 0 15 -10 -30 -4 7 -17 2 4 -3 -19 8 6 -12 -8 16 20 -1 11 8 11 28 7 10 26 7 -9 3 -12 -9 -9 -19 -12 -9 -11 -1
7916anL7l6K8k8nRmj1PNk6K3jK4j1k3qL3j7j0L8Mm8QJ1J4l3nL9Oj7J0j2%L0j3
$$ -1 -6 31 -5 23 -5 -10 -1 -5 -16 -9 -4 -30 -7 -8 16 5 -18 -26 7 -10 -20 18 22 -26 -18 -7 7 -26 -31 8 14 -3 7 -5 -5 25 12
7953A2k5OJ6j8K6Kk8K5k2J4j0k2pJ3K1oJ1j4KqJ3j1lK5j7j0PoM2l1j1K1j3L1j6
$$ 12 -13 -7 9 -9 17 19 -9 16 -6 8 -2 -24 -31 -18 3 -3 8 -6 -4 -12 1 -10 -13 12 -5 -15 -8 -14 28 -3 -14 7 -6 25 9
7988Ij3kRj4K9j0k8j4O0m1LQkLj4kL2l2L4l4K3Mj0lJ7jl5J4L4m3L4j5J4Jj2mK6
$$ 9 -4 -6 3 -11 18 8 -20 -34 26 -15 -12 -4 -6 -3 -17 -19 13 -19 15 -19 4 8 -2 -5 12 11 -24 -10 24 -19 15 0 14 15 3 -1 25
8025B5Pk7J3J4pm1JK8j8J9k9J4J1j9J0j9LQRk1J9k1K2pJ0Nlj5K4K0n7J8Oj9K2
$$ 25 32 5 18 32 25 -16 -15 13 -5 14 -15 -1 10 -9 1 -18 -15 -7 2 -19 0 -21 1 -6 4 9 6 -9 15 35 -22 -4 2 -17 5
8060Ej6k6L9Jl8L8j7J9k8jM6j1PJ3j3l8mL3nj1K2l0NN4l0pj2J9kLj0J5j9k4K9
$$ 5 -11 -37 2 3 -35 3 -14 5 -23 -24 22 11 18 31 18 -20 -24 9 4 -7 15 -15 -10 44 14 7 -5 14 12 15 5 20 1 -23 6
8095Fpkk1QK7Kj0J4qj5%K8j7j2j9K1J2j6J5l1kRK8J7j6j8J9j3OmQJ9j8k0J9k3
$$ 6 -1 -3 -24 -16 11 13 3 17 9 -6 -6 22 5 -7 -26 -5 7 -9 6 -25 -27 -18 10 27 11 -7 12 -1 5 1 9 28 10 -10 9 -14
8131a4J0nM4m6RM1k0pJ5j4j2NNK9l5k2PJj9O0m7K6Rk7K7m2L5j7J0l1J1J6MQk6
$$ -14 -4 -9 35 -11 -2 39 19 12 27 13 1 6 11 40 5 -17 -10 -9 -28 32 -15 11 20 -7 20 -22 13 -4 6 -25 -14 2 6 14 -12
8166a2k4L8j6J7j5rK1J0l9OL4l9K2LkK1rk7J9JL3n8RNJ3
$$ -12 -36 2 -14 3 -12 -21 0 10 -29 -23 11 -28 -6 -3 -5 16 7 -20 -1 0 33 -25 -16 -11 2
8191B
##END NTUPLES=NMR FID
##END=
