##TITLE=1H_ES-NC-MeCel
 
 8 sc, 
 25.11.2022
##JCAMPDX= 6.0         $$ Bruker NMR JCAMP-DX V2.0
##DATA TYPE= NMR FID
##DATA CLASS= NTUPLES
##ORIGIN= UXNMR, Bruker Analytische Messtechnik GmbH
##OWNER= root
$$ XWIN-NMR		Version 3.5
$$ Fri Nov 25 14:14:36 2022 Russian Standard Time (UT+4h)  she@DPX200
##.OBSERVE FREQUENCY= 200.1325
##.OBSERVE NUCLEUS= ^1H
##.DELAY= (6, 6)
##.ACQUISITION MODE= SIMULTANEOUS
##.ACQUISITION SCHEME= undefined
##.AVERAGES= 8
##.DIGITISER RES= 18
##SPECTROMETER/DATA SYSTEM= spect
##.PULSE SEQUENCE= zg30
##.SOLVENT NAME= DMSO
##.SHIFT REFERENCE= (INTERNAL, DMSO, 0, 15.7039)
##AUDIT TRAIL= $$ (NUMBER, WHEN, WHO, WHERE, WHAT)
$$ ##TITLE= Audit trail, XWIN-NMR		Version 3.5
$$ ##JCAMPDX= 5.01
$$ ##ORIGIN= Bruker BioSpin GmbH
$$ ##OWNER= she
$$ F:/spectra/data/she/nmr/H-F/1/audita.txt
$$ ##AUDIT TRAIL=  $$ (NUMBER, WHEN, WHO, WHERE, WHAT)
(   1,<2022-11-25 14:13:32.85 +0400>,<she>,<DPX200>,
      <created by zg, POWCHK disabled, PULCHK disabled
       configuration hash MD5:
       00 E9 B6 7A A2 85 ED C7 34 08 36 98 17 FE 4E 26
       data hash MD5: 16K
       7D 8A EB A8 8B F0 2C C8 96 5D F2 F4 88 32 10 D8>)
$$ ##END=
$$ 
$$ hash MD5
$$ 19 D5 9B 7F 8F 55 59 99 FF 51 35 D5 89 0D C1 38
##$RELAX= 
##$RELAX= 
##$RELAX= 
##$RELAX= 
##$RELAX= 
##$RELAX= 
$$ Bruker specific parameters
$$ --------------------------
##$DU= <F:/spectra>
##$EXPNO= 1
##$NAME= <H-F>
##$PROCNO= 1
##$TYPE= <nmr>
##$USER= <she>
##$AMP= (0..31)
100 100 100 100 100 100 100 100 100 100 100 100 100 100 100 100 100 100 
100 100 100 100 100 100 100 100 100 100 100 100 100 100 
##$AQSEQ= 0
##$AQ_mod= 1
##$AUNM= <au_zg>
##$AUTOPOS= <>
##$BF1= 200.13
##$BF2= 200.13
##$BF3= 200.13
##$BF4= 200.13
##$BF5= 200.13
##$BF6= 200.13
##$BF7= 200.13
##$BF8= 200.13
##$BYTORDA= 1
##$CFDGTYP= 0
##$CFRGTYP= 5
##$CHEMSTR= <none>
##$CNST= (0..31)
1 1 145 1 1 1 1 1 1 1 1 1 1 1 1 1 1 1 1 1 1 1 1 1 1 1 1 1 1 1 1 1 
##$CPDPRG= <>
##$CPDPRG1= <>
##$CPDPRG2= <>
##$CPDPRG3= <>
##$CPDPRG4= <mlev>
##$CPDPRG5= <mlev>
##$CPDPRG6= <mlev>
##$CPDPRG7= <mlev>
##$CPDPRG8= <mlev>
##$CPDPRGB= <>
##$CPDPRGT= <>
##$D= (0..31)
0 1.2 0 0 0 0 0 0 0 0.06 0 0.03 0 0 0 0 0.0002 0 0 0 0 0 0 0 0 0 0 0 0 
0 0 0 
##$DATE= 1669371212
##$DBL= (0..7)
120 120 120 120 120 120 120 120 
##$DBP= (0..7)
150 150 150 150 150 150 150 150 
##$DBP07= 0
##$DBPNAM0= <>
##$DBPNAM1= <>
##$DBPNAM2= <>
##$DBPNAM3= <>
##$DBPNAM4= <>
##$DBPNAM5= <>
##$DBPNAM6= <>
##$DBPNAM7= <>
##$DBPOAL= (0..7)
0.5 0.5 0.5 0.5 0.5 0.5 0.5 0.5 
##$DBPOFFS= (0..7)
0 0 0 0 0 0 0 0 
##$DE= 6
##$DECBNUC= <off>
##$DECIM= 24
##$DECNUC= <off>
##$DECSTAT= 4
##$DIGMOD= 1
##$DIGTYP= 9
##$DL= (0..7)
0 120 120 120 120 120 120 120 
##$DP= (0..7)
150 150 150 150 150 150 150 150 
##$DP07= 0
##$DPNAME0= <>
##$DPNAME1= <>
##$DPNAME2= <>
##$DPNAME3= <>
##$DPNAME4= <>
##$DPNAME5= <>
##$DPNAME6= <>
##$DPNAME7= <>
##$DPOAL= (0..7)
0.5 0.5 0.5 0.5 0.5 0.5 0.5 0.5 
##$DPOFFS= (0..7)
0 0 0 0 0 0 0 0 
##$DQDMODE= 0
##$DR= 18
##$DS= 0
##$DSLIST= <SSSSSSSSSSSSSSS>
$$ [...]
##$SUBNAM2= <"">
##$SUBNAM3= <"">
##$SUBNAM4= <"">
##$SUBNAM5= <"">
##$SUBNAM6= <"">
##$SUBNAM7= <"">
##$SUBNAM8= <"">
##$SUBNAM9= <"">
##$SW= 24.9335813027861
##$SWIBOX= (0..15)
0 0 2 0 0 0 0 0 0 0 0 0 0 0 0 0 
##$SW_h= 4990.01996007984
##$TD= 16384
##$TD0= 1
##$TE= 0
##$TE2= 300
##$TE3= 300
##$TEG= 300
##$TL= (0..7)
0 120 120 120 120 120 120 120 
##$TP= (0..7)
150 150 150 150 150 150 150 150 
##$TP07= 0
##$TPNAME0= <>
##$TPNAME1= <>
##$TPNAME2= <>
##$TPNAME3= <>
##$TPNAME4= <>
##$TPNAME5= <>
##$TPNAME6= <>
##$TPNAME7= <>
##$TPOAL= (0..7)
0.5 0.5 0.5 0.5 0.5 0.5 0.5 0.5 
##$TPOFFS= (0..7)
0 0 0 0 0 0 0 0 
##$TUNHIN= 0
##$TUNHOUT= 0
##$TUNXOUT= 0
##$USERA1= <user>
##$USERA2= <user>
##$USERA3= <user>
##$USERA4= <user>
##$USERA5= <user>
##$V9= 5
##$VALIST= <valist>
##$VCLIST= <CCCCCCCCCCCCCCC>
##$VD= 0
##$VDLIST= <DDDDDDDDDDDDDDD>
##$VPLIST= <PPPPPPPPPPPPPPP>
##$VTLIST= <TTTTTTTTTTTTTTT>
##$WBST= 1024
##$WBSW= 4
##$XGAIN= (0..3)
0 0 0 0 
##$XL= 0
##$YL= 0
##$YMAX_a= 1107459
##$YMIN_a= -253845
##$ZGOPTNS= <>
##$ZL1= 120
##$ZL2= 120
##$ZL3= 120
##$ZL4= 120
##$ABSF1= 10
##$ABSF2= 0
##$ABSG= 5
##$ABSL= 3
##$ALPHA= 0
##$AQORDER= 0
##$ASSFAC= 0
##$ASSFACI= 0
##$ASSFACX= 0
##$ASSWID= 0
##$AUNMP= <proc_1d>
##$AZFE= 0.1
##$AZFW= 0.1
##$BCFW= 1
##$BC_mod= 2
##$BYTORDP= 1
##$COROFFS= 0
##$CY= 11.3945322036743
##$DATMOD= 1
##$DC= 2
##$DFILT= <>
##$DTYPP= 0
##$F1P= 2.36226072786647
##$F2P= -0.459571619588291
##$FCOR= 0.5
##$FTSIZE= 0
##$FT_mod= 4
##$GAMMA= 1
##$GB= 0.15
##$INTBC= 1
##$INTSCL= 1
##$ISEN= 128
##$LB= 0.24
##$LEV0= 0
##$LPBIN= 0
##$MAXI= 10000
##$MC2= 0
##$MEAN= 0
##$ME_mod= 0
##$MI= 1.114404
##$NCOEF= 0
##$NC_proc= 0
##$NLEV= 6
##$NOISF1= 3.799351
##$NOISF2= 2.8
##$NSP= 1
##$NTH_PI= 0
##$NZP= 0
##$OFFSET= 15.70392
##$PC= 1
##$PHC0= -18493.17
##$PHC1= 14.60072
##$PH_mod= 1
##$PKNL= yes
##$PPARMOD= 0
##$PSCAL= 0
##$PSIGN= 0
##$REVERSE= no
##$SF= 200.130013532006
##$SI= 16384
##$SIGF1= 3
##$SIGF2= 2
##$SINO= 400
##$SIOLD= 16384
##$SREGLST= <1H.CDCl3>
##$SSB= 0
##$STSI= 0
##$STSR= 0
##$SW_p= 3612.71676300578
##$SYMM= 0
##$S_DEV= 0
##$TDeff= 0
##$TDoff= 0
##$TI= <>
##$TILT= no
##$TM1= 0
##$TM2= 0
##$TOPLEV= 0
##$USERP1= <user>
##$USERP2= <user>
##$USERP3= <user>
##$USERP4= <user>
##$USERP5= <user>
##$WDW= 1
##$XDIM= 8192
##$YMAX_p= 0
##$YMIN_p= 0
$$ End of Bruker specific parameters
$$ ---------------------------------
##NTUPLES= NMR FID
##VAR_NAME=  TIME,          FID/REAL,        FID/IMAG
##SYMBOL=    X,             R,               I
##VAR_TYPE=  INDEPENDENT,   DEPENDENT,       DEPENDENT
##VAR_FORM=  AFFN,          ASDF,            ASDF
##VAR_DIM=   8192,          8192,            8192
##UNITS=     SECONDS,       ARBITRARY UNITS, ARBITRARY UNITS
##FACTOR=    0.0002004,     1,               1
##FIRST=     0,             0,               0
##LAST=      1.6414764,     0,               0
##MIN=       0,             -253845,         0
##MAX=       1.6414764,     1107459,         0
$$ Real data points
##PAGE= N=1
##DATA TABLE= (X++(R..R)), XYDATA
0@%%%%Qj6J6j6K4l2M0n6O5p7R6j16J40j68K00k38K79l25L81m42N08n82O65p56
28d02Q60r76J101j238J391j560J741j942K164k406K673k965L285l637M027m460
44b344M939n475O078o759P539q437R486j0736J2250j4127J6533j9743K4274l1221
58a7743M3376p0906K47420Q964l44411n9444o1101M3661J2462N4290J7592M0115
70h5725J0017K6418L288J6877k11J1889r43R138j467O450k061M875j652M169j458
85c96K779j994J688j637J593j176J017j390M99j045Q00m82N86o72J23n36K91r2
103d4K72k68n8k62J59O5K81Jo2j47rQ8J87O9j13j60r5J9J65L3j8j62q8K3J53Q5
129A14N7j09j34n5Q6J04qn7j06p0J44J10N7l1k1r8KJ01J0l1m9r6k2Q9P0L8k2o7
$$ y = [0, 0, 0, 0, 0, 8, -8, 8, -8, 16, -16, 24, -32, 33, -44, 52, -64, 76, -92, 108, -130, 149, -176, 205, -237, 271, -311, 354, -402, 458, -518, 583, -655, 736, -824, 917, -1025, 1139, -1267, 1406, -1559, 1726, -1911, 2116, -2344, 2595, -2880, 3198, -3561, 3978, -4459, 5027, -5709, 6541, -7586, 8947, -10796, 13478, -17743, 25633, -45273, 202147, 211111, -133300, -192744, -253845, -210184, -197722, -143432, -125840, -85725, -75708, -49290, -46002, -29125, -29336, -17447, -18390, -9252, -10719, -4269, -6330, -1455, -3107, 1062, -396, 2383, 389, 2077, 440, 2033, 857, 1874, 484, 983, -62, 738, 256, 842, 170, 293, -243, 48, -44, 228, -40, -98, -360, -201, -136, 145, 146, 84, -63, -72, 16, 203, 272, 159, -1, -96, -77, 88, 121, 103, -59, -147, -124, 29, 114, 171, 62, -72, -127, -41, 63, 55, -2, -108, -178, -34, 76, 133, 102, 81, -17, -15, 86, 96, 65, 16, -80, -102, -13, 57, 95, 73, 6]
157Fm9L5N3Rl9o4o2M1Q2K5kJ3r6K7N8L8O2j02l3k4NO7rJ2n8k6QM0N8k4l9n4j7
190e9L7N1k0m6L9p1P2N2kLm9j7J4K9rl3j4j2J1K3OK6k0k9nKL3J6k0l2l3K5L6L
224Gj1Rj8J2nK4j4K8j9l1j5N1Pj3j9j7J6K0J3j6l2K8K9n7K9Pk0k0lL6J7J8m5L4
258C0n6K0nM1J6j1m0j2O3l9j0MJ9n0M2Ll5J5pjqPJ9j5qMj0j9Q9m1j9QJ3j3Pon
295a0LJ0%J3j0K5k9J7l7K0M0l5kPk2qONK5n6M0J2m9L8J6k8Mj3K6JJ0j0pk4L4M
331A6j9N%pj2J9oj6J2M5l8j3L6Ll0L2k7K2k1K8jm1L5l6M4l2KK4Ll0L3j8J7lMj3
367A7NPo1K9Qkj8J1mJ5j0K7l1j1Oj1K9k9K4j0K3k6K0pPMk4k3M2l2J0K5j3J2k1
402a2K7k7jK0%j7rL0qJ7Ml5L7j7%J7k5mJ6rJLqJJ0Jk1K5j0km%lLOk2L9m1K9Jk6
$$ y = [6, -43, -8, 45, 54, 15, -49, -111, -70, 12, 37, 35, 48, -48, -21, 37, 75, 137, 35, 2, -22, -17, 50, 41, 53, -5, -31, -23, 17, 75, 51, 12, -42, -59, -22, 29, 9, -37, 2, -69, 3, 55, 53, 56, 7, -10, 4, 33, 24, -9, -23, -35, -24, -1, 5, 31, 11, -18, -23, -21, 12, 28, 8, -24, -57, -32, 4, 7, -4, 5, -13, -1, -6, 18, 4, 32, 13, -18, -33, 18, 25, 12, -7, -24, -8, 12, 25, 9, -23, 5, 34, -23, 6, 13, -7, -27, -30, 6, 23, 41, -4, 30, -26, -6, -11, 30, 46, 35, -5, -17, 46, 7, -3, 1, 20, -30, 12, 15, -20, -5, -12, -13, -21, -14, 5, -10, -18, -14, -24, -43, 46, 5, -14, -6, 7, -6, 1, -5, -10, -7, 3, 3, 16, 6, 31, 2, 19, -18, 2, 42, 7, 5, 12, -10, -18, -12, -7, 18, -38, 2, 14, -35, 3, 19, -9, -5, -18, 8, 9, 19, 9, 2, -22, 12, 16, -3, 2, 2, -5, -17, 2, -4, -20, -8, 37, -1, -14, 22, 25, -5, 27, 0, 22, 1, 29, 28, -13, 22, -14, 30, -2, 0, 24, 27, -3, 30, 12, 29, 26, 30, 17, 22, 29, -32, -3, 5, 3, -15, -4, -8, 7, -3, 24, -7, -18, -12, -23, 6, -23, 1, -9, 14, -12, 8, 1, 8, 12, -12, -35, 7, -25, -15, 10, -3, 9, -12, 15, -12, -13, 7, 7, -10, -19, 11, 3, 20, 24, -11, 26, 9, 9, 26, 1, -3, 13, 4, 5, 8, 0, 1, 11, 12, -9, 16, 6, 4, 0, 0, -3, 0, 6, -16, 23, -18, 11, 12, -14]
443a4K7k9L3l9%J7nj0NKM3k4Lj0l8M3Jj8lrL6j5J2J5k1pM5n4LoK0Rk1rJ5L3k6
480Dj0nP%J5k7M2m2%J6j3L2l7J1mK8k4j3LK3J2k5j4PK5j6j2j7K0J2k5J6K0l0P5
515E4o7mK5j7k6OK5J9k3J1m1K2K4j0lL1m4j0M1K2m8L8l6K3l2M8l3LM8m1k5lK8
548EJ2oj7QPNl6L2l4J2K7k2K2k6nK0nJ1k3j2K7j2J9J2Km0L1m2K9k3L3k4L5J6l2
583Fnm5Q3n6K3j2j5J4M1rl9K5NLk2QJ1j9L3J2lo6K8Kj1K7rMqlOQj9oj7J8Oj0J3
622BljOnk5J5J9Qj6j5OL1k6KmL6m2J1J0omkorrk5M2J7j8j1mO2m4J8J1l0K2k5M5
661C3m1K3Ql8J1J3lj7K0k0MKj3L3j2Lj5nJRk3K4Kjk0J0qL1j4K2l5LJ4qK4k1J6
698A2k4Jk0M4l1J1NmJ3L4j9j8j2J3J1j5lL6m2l5K9NK8l5K7rj5L6l0QlL9j6k0m
$$ y = [-14, 13, -16, 17, -22, -22, -5, -10, -20, -15, -13, 30, 6, 9, -1, -39, 4, 5, -13, -16, -25, 11, -4, 8, 23, 2, -5, 40, -14, -11, -17, 3, 12, -9, -18, -3, 30, 4, -6, -11, -4, -4, 11, -16, 26, -16, -16, 0, -13, 19, -18, -7, -11, 17, -7, -20, -17, 6, 18, -7, -21, -14, 11, -5, -17, -34, -14, -2, -27, -11, 9, -21, 54, -13, -17, 8, -9, -35, -29, -4, 15, -8, 3, -38, -16, 8, -2, -5, 26, -18, -28, 13, 35, -13, 25, -11, 12, -20, 28, -5, -2, 46, 5, -20, -23, 5, 17, 11, -6, 2, 9, 14, -22, 10, -24, -12, 15, -7, 15, -11, -16, 4, -1, 10, -13, -25, 2, -10, 9, 21, 23, -17, 14, -28, 1, -22, 11, -13, 22, 38, 6, 1, -44, 39, -17, 6, -6, -21, -7, 34, 25, -14, 11, 16, 19, -3, 5, 16, -3, 30, 42, 39, -27, 1, 3, -8, 19, 10, 14, 6, 3, 9, 17, -2, -8, -25, -7, -1, -11, 2, -1, -2, 4, -1, -26, -11, 8, 16, 0, -15, -9, 22, -4, -2, -6, 30, -12, -1, 9, 3, -1, -3, -9, -18, -27, -52, -10, 7, -11, -22, -26, 36, -8, 10, 21, -9, 13, -12, 33, -8, 15, 23, -15, -4, 9, 6, -11, 9, -11, -7, -5, -18, 15, 3, 6, -9, -14, -13, -4, -27, -3, -1, -2, -22, -12, -20, 11, -3, 19, -16, -13, 1, -7, 17, -4, 12, -12, -11, -31, 13, -18, -7, -2, -6, 7, 41, 22, 4, -8, 5, 16, 1, -2, 34, -8, -43, -14, -9, 19, -16, 11, 2, -13, 23, -7, 1, -2, 37, 21, 1, -3]
733cLjRRoLj7J0qoKK0k3%J1j4Rnk1K0j3J8k8L7n7L7j1RmJ5Ok8N1k4J6l7J5M0l7
772cj3L1%J3j1j2j5P%J2j1Rj8lK1j0KL3l8LQJ2j3j2K6j9qJ2l6K5lK4qj0%Oj3j0
810b2J6JJ2J4j7Pj8jJ0Pl3J2rJ2LNK7j1kl0J6J2nL0k8rJ5l1K6j6%L1j7k3K0J7
846B1j3NnJ5k0lrK0Mjj2k8K7j5J9%J7n8L8JpPJ0m8L7J2k0j6J1K2k1j2J1M7m7M0
882B9k1j7j3K9lMJ3k9L3Nk0J0k6J4J0k6jkK5J4j8Oj5Kj4nrK6J2l8K8K8k1k4J3
917ajJ2j9kj5J8NJ8L1n4MOj9K7J6mk4Qj4J0jj1RJ1j5J0l6PL6k3J0J4l9K8k8J7
953i%J6j5J1k0L0l7L7K3rpK7n6J5Pj4KJ3rJ6m4L2j5%J3k1nJ9jk7pM5Ll2M3j4J5
990B5k5k8j1N8l0qO1l4k9J2K6%j7jj2K2L6j4l2QJ0k5j1K4JkJ3jj0jK7j1k6M2n2
$$ y = [-3, 0, -1, 8, 17, 11, 14, -3, 7, -1, -7, -5, 15, -8, -8, 3, -11, -2, -7, -28, -8, -21, -3, -31, 6, -51, -14, -25, -16, -20, -5, 1, -27, 24, 0, 16, -21, -6, 34, -3, -16, 15, 15, 28, 17, 5, -10, -3, -3, 9, -2, 7, -11, -14, 7, -3, -1, 32, -6, -3, 5, 17, 4, -8, 18, -1, -9, 3, -33, -8, -11, 13, 5, -5, -5, 1, -12, -22, -6, -5, 7, 21, 4, 11, -7, -8, 2, 9, -24, -12, -21, -9, -6, -1, 26, 15, 13, -17, -1, 11, 6, 36, 8, -1, 14, -17, 9, -7, -7, 24, 7, -16, 4, 21, 8, 13, 8, 23, 3, 0, -9, 11, 15, 14, 2, -26, 1, -14, 5, 5, 22, -36, 2, 3, -4, 3, 13, -35, 2, 14, -6, -22, -11, 11, -10, -22, -11, 36, -11, 29, 8, -9, -22, 7, 4, 8, 21, -8, 25, 30, 10, 20, -6, 8, 18, -8, -9, -11, 14, 28, 10, 16, 1, 3, -11, -16, -25, 1, 13, -25, 3, 31, 10, -14, -1, -2, 10, -9, -11, -26, -8, -3, 15, 46, -8, -4, 2, -17, 10, 26, 22, -2, 6, -8, 2, 1, -10, -1, 10, -5, 5, -31, -24, 12, -11, -1, 13, -26, 2, -26, -9, -9, 7, -8, 3, -17, 13, -24, 13, 36, 27, 20, 47, -9, 6, 13, -1, 1, 14, 5, 21, -23, 9, -6, -6, 7, -14, -19, 0, -1, -28, -35, 10, 13, -19, 24, 10, 25, 0, -28, -39, 19, -11, -19, 42, 8, -21, -9, 17, 17, 0, -1, -13, 9, 45, 31, -1, 7, 17, -8, -19, 5, 6, 4, 17, 16, 6, 5, 32, 21, -5, 37, -15]
1025a5K7pj6j0J7J6J5k8K3Nl3pK2J3k6J5l7O3l3K0l6K1%m2K8LL7k7oM3m5k7L7
1058A0%Kl2J7MK5k2N5m5j4%M4p0N1Mk7j2qnL4l5jL3J5l7J1jLk0OK5k2JNJRj1K0
1096A3k1lJ4MpQoRJ7j8Mk1lJj2K3prj7K0J4j9j0J1NRKk0nJ8lQJ3k1M3k9k0K3j2
1135dlmJkjkN3l9Rk1K2kl1J9Pl2L5J3l7lLJ6j7OJ3J8lm%J0Lk8nj5PJ3k6M3Jk4
1175a1ORm2L8j4K6j2Nj7Pk5K8lNJ9k3L2m9K0QJ4j7j0K0KMnj3j5L9j2K0j8kJ8m6
1211a4kJ1j4J6j7L6j9l2M9j3MKj7oK8k5J3j7L1k1JRrPj6L1j0j4nJ6J9k2j2j1L3
1246A0JKl7PRk0J9mMK1%rJ3KlPj3j6J2KmpRJ1m2QM6l8K9rl4L0j6NJ7k8j7LL8k
1286Fj0Ok0K0k2M5k5pK8k9kL0k0J7J6nk0NJ0j5K0Ol6J3Lk3L9m2M7n2PLLJ6lJ0
$$ y = [-15, 12, 5, -11, -21, -4, 12, 27, -1, 22, 27, -6, -13, 9, 22, -4, 11, -26, 37, 4, 24, -12, 9, 9, -33, -5, -2, 35, 8, 2, 45, 0, -27, 10, 10, 12, -20, -3, 1, 26, 4, 59, 14, 0, 0, 44, -26, 25, 29, 2, -10, -18, -23, 11, -24, -25, 8, 23, -14, -3, -4, -1, -21, -15, 10, -12, -11, -6, -5, 4, -7, 13, -8, -11, 3, 7, 0, 8, 2, 11, 28, 10, 14, -7, -10, -9, -21, 2, -5, -14, -31, -11, 3, -16, -26, -15, -10, -1, 1, -19, -24, -6, -9, -1, 12, -9, 34, 5, -15, 8, -4, -7, -11, -10, -12, -13, -15, 38, -1, 8, -13, 9, 7, -24, -5, 2, -30, 5, 18, -19, -22, -19, -3, -20, -14, -1, 17, 14, 10, 10, 20, 23, -5, -10, -25, -18, -5, -31, 12, 13, -11, -5, 4, -38, 0, -14, 12, 0, 5, -12, -5, -30, -2, -5, 0, 19, -4, 28, -21, -1, 7, 21, 4, -6, 14, 16, 20, 15, 2, -13, 26, 14, 34, 16, 14, 32, -14, -16, -5, -19, -3, -20, 16, -3, -35, 14, 1, 5, 7, -10, -16, 12, -13, 0, -17, 14, -7, -6, 3, -6, 1, -15, 16, 6, -8, -13, 3, 22, 0, -12, -23, 10, 11, 13, -24, -17, -8, -28, -9, -13, -9, 12, 12, 3, 16, 18, 15, 22, 9, -7, 5, 7, 3, -4, 5, 16, -26, -18, 28, -10, 19, 10, -24, 6, -10, -5, 12, -16, -33, -30, 8, 6, -4, 2, -18, 2, -20, 25, 0, -7, 21, -8, -10, 20, 0, 17, 33, 28, 8, 13, 23, 8, 28, 34, -2, 11, 14, -9, 30, -12, 35, -17, -10, -7, -4, 12, 9, 19]
1322A9jl2L2rj7L3l3J7JMppL7m1J1l5J8JJ7rJ2k0mK2%jJ6m3J1j0J8nJ3k7QqK6
1359Gl7M3J8k6J0k3LK9k8nOL0k5PJ7njk3J5Lj6KkkJ3jl4K7mMm3L7%j1Mk2K6NJ8
1398A6j3Mjl0KL9j6k3JM1k0j6K0Kk0k4K2K2J0l3K1k4pL8J0ok0j5J8j0PL1l6J9
1432Ij2J1kLk4lK6J4j1J1m3K7J4m2O1n1K2k3M9l0mj3Ok0mK5J5l6L1jpJ5k1Rm0
1467c9L6Lj8K6k8K7K8k8J3n8OM9l1K4mK5l2Qj4L6n3k1N1%%KOQoL0m4mJ4rL5l4
1503DkK8j0l1J0K2l3j7M6k4nK2j6j8K6J4j0k0L2j5kJ7j1k7J5J3k6J1rJ4j1J6O
1536IJ4m9K5K6j9Mk%j5K5j2k3OlJ1j5J3K7l3lJ2Kl0L8LrJ1k3K9j9J7m1J9lJ7j
1572HMQj8oJ7k5k1L7l8RK1j1Pj2J4lj5mRK2J3k1Rjj8J6oJ0j6J2RmQj0Qom4L8L
$$ y = [19, 18, -14, 18, 9, -8, 25, -8, 9, 10, 14, 7, 0, 37, -4, 7, -28, -10, -9, 8, -1, 11, -9, -13, 9, 9, 8, 24, -19, -8, -18, 0, -5, 8, -19, -11, -19, 7, -30, 13, 31, 5, 15, -8, -5, 24, -4, -9, -3, 27, 2, 9, 26, 21, 20, -3, 12, 15, -1, 1, -1, -3, 10, 9, -25, 2, -2, 2, -41, -4, -4, -15, -11, -33, -7, -2, 16, 3, 7, 6, -24, -22, 17, 1, -22, -21, 20, 0, -16, 4, 6, -14, -38, -16, 6, 16, -17, 4, -20, -27, 11, 21, 15, -5, -20, -2, -12, -5, 26, -10, 9, -3, 8, 6, 9, -15, -18, 8, 22, 11, 22, -21, 6, 20, -22, 39, -12, 10, -13, 36, 6, 2, -11, -5, -25, -29, -4, 11, -25, 6, 5, -2, 13, -8, 1, -39, -3, 0, -18, 8, -20, 7, 35, 7, 20, -38, -32, 17, -14, 10, 6, 31, -1, 7, -7, 29, -24, -45, 6, 6, 6, 8, 14, 22, 16, 46, 2, -2, 12, 3, 38, 4, 2, 30, 20, -11, -1, 21, -12, -29, 17, -7, -12, 10, -6, -24, 2, 16, 6, -14, 18, 3, 1, 18, 7, -20, -5, 8, -18, -7, -16, -2, -13, 3, 9, 23, -26, -1, 25, 6, 10, 8, 8, -7, 18, 6, -17, -11, -14, -3, -18, -5, 22, -11, -14, -2, 0, -30, 8, 11, 2, 13, -10, 19, 0, 17, -24, -5, -8, 9, 8, 12, 20, 2, -4, 13, -12, -33, 4, -34, -25, -4, -15, -8, -20, -6, -9, -24, -28, -19, 3, 16, -5, 4, 3, -15, 1, -5, 5, -11, 1, 10, 6, 14, 4, 12, 6, -38, 0, 3]
1611CNJ3j8oNkJ9jm2M0k0K7n7J2M2J3m0K6qk2J6j3KJ5j4pnlQK5j7Olj2L1k7jj7
1649b7M2j5ql1L5OL6n1J5k4L7k3K1K4l1K2kk7k6N7n8kL8MMl4pL8ok6PQlJ5qPL
1686A0K5k3K7j4l5PL5k3Oj5QK1m4K5n5M8kj5K5l1K8j0oNJ8j7j9K4k3NQL6n1J3
1720ipJ6J0pk4K6Kl2J6K1koL5l3j4J5l1M3j7K2j5J1m5N4j6Pk2RmlNJ7j2qj6QK2
1757A6m0K5j7K3Ll9M0oJ4pk8J8J3k3j0k4M4j5PMk7M2Plj2nPJ5qnk9J5kpK6lK2
1794C1k3pK6jk0k2J8KJ1klQqPNj4k4J1lk0K1PQl2J6kJ8k8NM2l2RMK2k9j4J0k0
1832b3L7j1J4k2jK8J2j5l7pK3K0j8oK5rMJ9k7K3ol9J4K4Pm7L5k1L2j7j1K6m6K3
1866CLj7K0k6mJ9qlL3j1jRn1M6k0k9K6J2j2L%qJ0kL6m3K4Ql5L9qj%k0jK2kK1m1
$$ y = [3, 8, 21, 3, -3, 2, 0, 19, 18, -24, 16, -4, 23, -34, -22, 20, 33, -7, 19, 11, -11, 5, -8, -6, 9, -5, -12, -17, -20, -12, 13, -4, 2, -1, -13, 18, -9, -10, -27, 15, 0, -8, -39, -4, 2, 38, -13, 2, -22, 15, -8, 13, 37, 6, 28, 26, -1, -27, 30, -28, -30, 8, 12, 16, -18, -25, 13, 7, -19, -12, -4, -7, 8, 0, 7, 10, 35, 12, 39, 25, -10, -3, 32, 9, 15, 0, 8, 29, -15, 10, -45, 3, 1, -14, 11, -20, 8, -2, -8, -3, 15, -2, -21, 3, -20, -15, -7, 29, -22, -9, -16, 0, 10, 3, -21, 5, 7, -25, -9, 12, 10, 4, 39, 6, -8, 7, -24, 19, 2, 24, 9, 20, -25, 29, 13, 20, -2, 7, 3, 0, 5, 22, 10, 2, -14, -6, 16, -24, 1, -16, 7, 10, -29, 11, 5, 19, 12, -16, 2, 15, -8, -18, -42, 2, -13, -6, -2, -29, 13, 20, 17, 5, 0, 7, 22, 14, 9, -20, -5, -7, -14, 12, 9, 31, 8, 1, 27, 26, 6, -16, 2, 4, 15, 13, 10, 18, 10, 17, 22, 8, -16, -5, -8, -28, -7, 0, 8, -24, -8, -10, 8, -20, -15, 27, -5, 4, 8, 30, 1, -13, -3, -23, 14, 3, 17, -5, -6, 22, 34, 19, -18, -25, -2, 18, 0, -6, 19, 10, 14, 33, 6, 29, 23, -16, -2, 22, 29, -18, 17, -4, 28, 11, 0, 26, -20, 3, 6, -11, 9, -17, -21, -2, -10, -13, 20, 9, 8, 17, -34, 12, -8, -37, -11, 1, -11, -8, -8, -16, -6, -8, 28, -15, 9, 17, -18, 21, 13, 12, 12, -8, -9, 13, 11, 32, -9]
1905iJ1jJ4n1K1JL3m0K0J7krj0RJ8k6lK9j6J2Jl5N4l5Mj5Rj5J4Mj8K1KJ1j0pj9
1942a6J1j4J0j5K4k8K9j0J1l0K7jJ2j3l1L4k6L2L7o7N5k3mK7l1NoNpL1k1oJ8k9
1976a0JK1mNk5ML9l4Pl1K7Jp%Rl2QL7k6K9k0JJ1k1K5l2PJ5j2%koL3Pk3J2m2J0
2014a8NQKpJj1j6L5K8k7rPJM4p2M2k9LK6l1J1PjlK4j6%K4l7M0l0J5l3K6J9l4p
2051a3L3J1o5N1Ml0k2J2kJ5rL1oj6j0j1K5rnOJ0LPk2K0j2l4M4JPj8kK0nOj1lj3
2089a2J1jJ2k4J7j3j8L2jMLk0NknK8j7l7N0jm3K7J6m8LK3lqO3n6J1l8O5rm3L4
2125Ekl3jJ7KK5pjk0K2Mm2K7Rk5L2Qj7j6JL1j3lJ6k6K3k6J8Jl1M9km0R%kOL5l5
2164bM2l6PRk1k2K1L6k5j3jJ9m6N2lj8k0oN4l5J7j7k6K1J0j4K7j6J1j8QqK9l2
$$ y = [-9, 2, 1, 15, -36, -15, -14, 19, -21, -1, 16, 14, 5, -5, 4, 22, -4, -7, 22, 6, 18, 19, -16, 38, 3, 7, -8, 1, -14, 0, 4, -14, 7, 9, 20, 10, 3, -16, -5, -19, -9, -24, 0, -28, 1, -9, 2, -28, -1, -2, 10, -3, -34, 0, -26, 6, 43, -24, 31, 8, 4, 31, 0, 5, -1, 4, -3, 28, 7, 1, 19, -10, -9, 12, 8, 13, -12, -8, 31, -3, 4, -27, 0, 1, -6, -6, 3, -29, -21, 16, -10, 19, -1, 0, 11, -10, 15, -17, -10, 5, -7, -7, -9, -15, 18, 25, 2, 14, -28, -18, -13, -5, -3, -10, -9, -20, -36, -1, 27, 0, -9, -2, -1, 43, -29, 13, -16, -13, 13, -18, -7, 0, -1, -4, 20, 4, 4, 28, -9, 31, 1, 16, -17, 9, 28, -6, -13, 20, 31, -34, 17, 21, -9, -31, -19, -21, -6, -15, 16, 10, -6, -16, -27, -2, -11, -16, -10, 0, 3, 10, -12, 8, -4, -38, 6, 7, 14, -4, -6, 14, 9, 15, 4, 1, -12, -1, -2, 10, -14, 3, -10, -28, 4, 3, 7, 10, -10, -5, -7, -12, 16, -1, -38, 12, 11, -32, -5, 11, -37, -34, -11, -14, -22, 41, -15, -4, -42, 23, 14, -29, 5, 3, -30, -31, -14, -12, 13, 6, 5, -15, 7, 11, -31, -4, 5, -20, 12, 20, 3, -13, -12, 19, 6, 3, 19, -7, 16, -10, 8, 9, -22, 27, 25, -15, -6, -6, -8, -2, 33, -2, 40, 4, 11, 20, -1, -23, -2, 34, 9, -4, -5, 14, -32, 20, 17, -1, -21, -27, 27, -8, 9, -8, -34, -13, -3, -17, 10, -6, 5, -13, -5, -13, 16, -16]
2198a6K9Kj8LpJ0Oj5JpJ9k5lK0RjJ6n9M8oj8L4n2M0k8K1NjJnj2K2j5J8rj7J4J0
2236A4k4QjjLMk0jL4k2k2J9l0K2J8Lj4l1NL0kj2L3J5k8Rk1j5O1m9L3Pplj6Qk3
2273a6j4L2J0j4j5L3j2l3J4K7j6rjmlK2lj2J5J5j1J0l5l5M0J5j3ll8M3J5J4j7
2306AKRrj8K7l3Oj5J8K1k2L9m8J5K9k2j2J9k9M6m5J4K0NJ6k8j5QkK2ol3J9knk4
2342c2J2J6mj1J9k6K0L6o8K7pJ5rK0mok5J7k1K0Pj5K0Rj7J9Mkl0%J6o%j6J2lk
2379a5L7l2j1K8K1pnlnJ2lk2J1QNj7K4ml2jK2jmj1mL4j3k4K1qj1ojJ2nlJ8k0K6
2418A1l6N1o9L5J8k1K5k5LJK2j9j6JK4L6m5%qJ5%J2Mm0M3noj2j3L3Mm2J9rM2k6
2454Gj3mOL7j1l1j7N4oj9K1k9LK0k5j9QJ4J3j1j1J4j9j0K6J2j5Kok5J3K9Ok4J7
$$ y = [-16, 13, 15, -3, 0, -7, 3, 9, -6, -5, -12, 7, -18, -21, -1, 8, 7, 23, -36, 12, 6, -12, 22, -30, 10, -18, 3, 8, 7, 8, 3, -9, 13, -2, 16, 7, -10, 4, 14, -10, -2, -3, -4, -1, 3, -17, -18, 16, -6, -28, -9, -39, -17, 1, 4, -10, -41, -36, -6, -8, -20, 13, 28, 0, 9, -12, -27, 34, -15, 18, 25, 18, 15, -1, 7, -16, -30, 2, 12, -2, -17, 16, 4, -29, -15, 12, -4, -13, -14, -18, -21, 1, -2, -14, 1, 16, 5, 15, -20, -55, -15, 0, -13, -16, -54, -11, 4, 18, 1, 3, 12, 3, -15, 12, -21, -15, -30, -12, 9, -13, 26, -22, -7, 22, 0, -12, 7, -22, 24, -21, -7, 13, 18, 34, 6, -9, -1, -3, 19, 13, -20, -1, -3, -8, -32, -20, -4, -8, -19, 0, -26, -6, 30, -38, -11, -18, -3, -12, 8, 4, -2, -27, -10, -31, -11, -4, -19, 1, 10, -7, 12, 16, 14, -16, -16, 0, -6, -6, -22, -10, -13, -15, 22, -10, -21, 7, 28, 21, 16, 13, 8, 20, 17, -5, 6, 14, 19, 2, 26, 22, -10, -11, 11, 10, 6, -5, -9, 25, 12, -12, 9, 1, -10, -16, -17, -5, -10, -13, 5, -15, 11, -25, 26, -43, -8, 10, -11, 14, -11, -8, -7, 15, -4, -20, -19, 5, 41, -4, -4, -12, 3, 3, 15, 19, -21, 22, 17, 11, -1, -14, 19, 23, -19, 0, -9, 33, 7, -6, -10, -4, 33, 22, -9, -26, 28, 22, 3, 24, -5, -2, 18, -7, -26, -18, -4, 9, -2, -13, 1, -18, -28, -2, 10, -5, -3, -9, -34, -21, 8, 14, -10, 7]
2489GKmpOK4n0L5L0o2L1qj0K1LnlokLj3moJ0M0m2k4K8L3l7NONl2N4j4k3PJ7j1
2528DPj4K7m3LkL0lj0K1m4K3lk9L3l3J1%M1J3k0k1NjJJj3RJj0J7KrK2n1L3M4o0
2566a8L3j9J2Ll1L3j7K3k8jJ9k5Rj6J2PK7n1J7KJ4nOj9ML8j9k1K3l7%J4j1N%M2
2602B5j4Ok5K2Qm0J6KPj8%JJ2jk6K4lNk1J9K3J4l6lj7PJ5J3J3j1L0n8oMkMkmN9
2641D2p9LK8J4j5RK0rRj8J6k8J4k5K4m0J8J1K7l3ML8n5J6nj2NL0mj5j1J5oROq
2677e%Rj3J3LkJ0k9K0kJJ7l5L2j7qK4k0Kj1K8jj6J8J0j4rJ4m0K2j5Pk3M5k2l0
2713c7O3k4oj7M9k0j8J7k0JJ3LJ1k1kj0N6m9mJ8nj3K4j2J8rk5K4J3l2L7l2K7j5
2747ClK0popK4k5J3L0n4L4k0J2K3l1j5koK8m1M1k4L4Nj7l1J7R%j5J5J4k6j0kj4
$$ y = [7, 9, 5, -2, 4, 28, -22, 13, 43, -19, 12, 4, -6, 15, 18, 13, 10, 4, 2, 5, -8, -12, -18, -8, 32, -10, -34, -6, 27, -10, -5, 1, 6, -26, 28, 14, -9, -2, 15, 4, 11, -3, 24, -19, -16, -18, 12, 9, -1, 20, -24, -1, -4, -33, 0, -33, -22, -22, 19, 32, 12, -9, -4, -5, -4, -3, -16, -7, -6, -16, 1, 3, -6, 16, -35, -2, 42, -18, 15, -4, 8, 11, -20, 13, -4, 19, -9, -10, 9, -16, -7, -23, -11, -4, 23, -28, -11, -9, 5, 0, 6, -13, -9, 29, 10, -11, 12, -25, -25, -11, -22, -17, -17, 25, 11, 17, -8, 14, 22, -18, -2, 0, 7, -11, -11, -10, 2, 1, -25, -1, -4, 1, -20, -1, 22, 36, 0, -3, -20, -13, 2, 15, 28, 17, 47, -11, -17, -13, -15, -11, -13, -17, 42, -37, -34, -6, 8, -7, 2, 22, 13, 22, 4, 20, -8, 6, -19, 5, -35, -17, -6, 21, -12, -8, 30, -25, -9, -14, -26, -21, 9, 5, -10, -21, -6, -12, -3, 3, -5, -5, 4, -9, 4, 7, 5, 15, -14, 6, 4, 5, 22, -13, 19, 2, -6, 18, -2, 0, -11, 17, 16, 0, 18, 28, 14, 5, 19, -21, 1, -14, -7, -30, 15, -7, -37, 26, 2, -4, -21, 28, 8, -10, 7, -13, -12, 1, 4, 15, -6, -8, -18, 38, -11, -15, 3, -2, -15, 9, -3, 15, 6, -19, 5, 18, -14, 23, -9, 18, 3, 0, 20, 13, 7, 0, 24, -1, 12, 42, -12, 22, 2, 14, 37, 6, -9, -11, -17, 11, -30, 11, -13, 21, 26, 9, -22, -5, 4, 4, -11, 4, 18, -8, -18, -20, -34]
2783c4J6L2j9j1K0Kl5K8%MNk2K4rolL3l5RK2NJl5j7K5Ol0K1LJ2l1N2nk4Lj8J8
2820Gj5K2k4K4lk2L1k5KJ9l7pJ0Jj7M1k4L6k9K3l3J3KOJ3k1J9k8Kk8L2kJ6Pl1
2855b0Oj2N1j8j9J2M1j8k5J2Rm1L0ll3M9opk3jJ2PRl6K2j6JK8k0j5K4J4j1j6M
2890iJ1Pll6K2m2N7q%J1k9J4L9o7J4RJ8J5k1j4k3j2J8RML6j0j9k5K5J2NJ5l1m
2925a2J2J8k2K2k5K4K3n6K7j6J0m5L6K9k9Qk0j0K0nOl0J7NJ0j0J8k1L8j2mK0k5
2958Aj0Rj9KJj7RJ5k4N7j9pkJ4j5mJ7OlJ0Kl5J6NK4j6Qj0nKNj8k1L0mKKj0MPj
2999HplKlpL4m4J4pNl8K3j7J8MM3m3M5o8N5l2K3J6m7L6k9K7m9N6k1j0J5j1Rk3
3034b6L4Ml9L6j8J2J8l8K1J2J5l0Pj4K8mJ5j4k7L7m1K0Nk6K6J8l0j6L1nm2O3j0
$$ y = [-34, -18, 14, -5, -16, 4, 6, -29, -1, -1, 3, 8, -14, 10, 1, -5, -8, 25, -10, -1, 21, 26, 27, -8, -25, 0, 6, -24, -3, 0, 12, -19, 33, 28, 4, 7, -11, 7, -8, 14, -10, 14, 11, -11, 20, -5, -3, 16, -21, -28, -18, -17, -34, 7, -17, 19, -10, 13, -20, -7, -5, 1, 14, -7, 12, -16, -14, -42, -10, -12, 4, 11, -20, -14, -26, 25, 7, -12, 0, 41, 23, -2, 10, 19, -22, 8, 5, -28, 21, 15, 8, -15, -16, -4, 3, 12, -24, -2, -18, -17, 11, -9, -24, 0, 14, 3, -13, -9, 2, 9, 6, -30, -8, -50, 7, -1, -1, 10, -19, -5, 34, -33, -19, -10, 8, 23, 2, -12, -35, -47, -29, -20, -16, 20, 10, -9, -34, -9, 3, 8, 23, -8, -12, 0, 18, -4, 18, -7, 17, 40, -16, 11, -5, 5, -40, -4, 25, -4, 4, -16, -26, -6, -11, -5, -35, -18, -13, -3, -13, 5, -16, 22, 10, 6, 26, 1, -9, 0, -19, -17, -16, -33, -24, -9, -33, 24, 5, -2, -4, 10, -5, -9, 8, 14, 11, 21, 23, -12, 4, 9, 33, 17, 25, 15, 10, 12, 17, -1, -22, 8, 4, 6, 8, -2, 2, 9, 8, 1, -2, 0, -3, -10, 24, -20, -6, -13, -8, -46, -23, -40, -22, -18, 25, -18, 27, -41, 14, -18, 5, 21, -26, 10, -19, 8, -41, 15, -6, -16, -1, -12, -3, -26, 8, 12, -27, 9, -9, 3, 21, -17, 4, 16, 31, 1, 8, -6, 22, 18, 33, 19, -8, 29, -12, 8, 13, -13, 13, 31, 1, -15, 16, 11, -31, 32, 22]
3067B2m3J8rJ9j5lK5Jj0k4K6j7rL0l8N5k5l4M3k5NRnk3J3J5j6K2j6moK1OK0Pj0
3103B5KRj4l8j0J2rL3O%j4j6JOL3k7j6K4j9J0j0j2K9j6oK4j3K2k3MNj%j6qK9J6
3140B2l7POqJ5j5l1O1jl3J9l6M3m0M2K3l4Qj1J2kj9K3j3Lj5K6jj6KJ9k2J3lm1
3175c4M6oJk6L7l9K4K5j8qJK2k9j7L5rPk9M0k1qNkMj7kqNL6%k9Qj3L4roLOk1K0
3215Hj3j6K2nj9K1RJ2k4mJ1Rj8K9j0j2J8mK6m9JpJ8J1KPn0K9K9j9lk0j3J5mj6
3251b9K0L4j9l3K8k2j6J1J8J6Mnj1Qo%Oj1MmPmmL2k3K5l4k2J0L4j4oK6k5j7Rj2
3288b5K1Mj4kJ8Pml5L0m%j6K5K8k2k2qL1j8nk5L7Lj9mK3K5k8l2L5j3NK5j4k2j
3324a6K1l2J1RKL5k2Nj3nJ2JKPrOk3J5JJ7j%j1k0K7pqj2L%JJ2k5J8pRKmK2L2q3
$$ y = [22, -21, -3, -12, 7, -8, -11, 14, 15, 5, -19, 7, -10, -19, 11, -27, 28, 3, -31, 12, -13, -8, 1, -4, -27, -14, 1, -15, 7, -9, -13, -19, 2, 8, 28, 35, 25, 27, 36, 22, -16, -26, -14, -23, 10, 16, 16, 2, -14, -13, -7, 26, -1, -17, 7, -12, -2, -12, -24, 5, -11, -17, 7, -6, 16, -7, -3, 2, 1, 1, -15, -23, 6, 22, -15, -8, -2, -10, 5, -10, -41, 20, 19, -14, 5, -31, 12, -28, 14, 37, 3, 11, 0, 12, 10, -9, 14, 1, 4, -11, 15, 14, -2, 0, 19, -3, 10, 7, -34, 12, 6, 7, -19, 18, -21, 3, 28, 10, 2, 3, 25, -4, -21, 14, 5, 12, -17, 23, 2, -6, -1, -3, 1, -16, -18, -26, -21, 15, 15, -14, -6, -19, 15, 6, 0, 3, 9, -12, 8, -5, -21, 1, -4, -23, -2, 7, 19, -5, -9, 2, 11, -7, 22, 12, 0, 18, 14, 40, -9, -8, -15, 3, 14, 16, 23, -27, 2, 31, 12, 9, -11, -24, -9, -13, -29, -9, 25, 6, -27, 1, -21, -37, -26, -8, 8, 12, 7, -4, 4, -2, -2, 4, -7, -3, -7, 0, -4, -8, 24, 1, 26, -8, -30, -20, 14, 0, -6, 20, -5, -22, -13, -25, -4, 0, -14, -16, 2, 9, 5, -30, 0, -4, -4, -20, 5, 33, 11, -11, -19, 12, -6, -11, -36, 1, 4, -15, -19, 4, 29, 1, -31, 4, -9, -4, 21, 7, -15, -16, 5, -27, -16, -7, -5, 30, 8, 13, 0, -5, 7, 8, 10, 17, 8, 14, -9, 6, 7, 24, 23, 23, 12, -8, 19, 12, 4, -8, -5, -5, -4, 8, -17, 1, -6, 3, 5, 1, 23, 55, -28]
3365b8K1J5Lj2Mj4J9j4k1J4J7k3L4l6KK9Qpj3j0J5j6J7%k7M6j4j1J7j8KJ1qJn
3400bK4m3J9L2l8J0l9L1JmK1k1j2K2J9roj0rJ3l8L0jJ2oK6k2K2Mk4lK0k5J5j6
3435gMpj6PJ0JKj5KOK5n8N1k0J6k6L4nJ5qpJ5m1L1mJ2K1pk5mj7L1j0K3kj8Mj3
3473@%Lk1K4Oj0j1K5l4jJ3K0j0l3M1Rj7j0K0k9L2k7k4J8J0rLOK7m8J4K9k5nK7
3508A3j5j2Rk1L6k9OL8l4lJ9P%j6K7Kn5L1k0mL0K5m7JJ6JlrJ5j4nNj3KK4J1mj3
3546AJj4j1L7l0PJ7jqMj2J9J2j1pj2M2n0J5J0knPk2JK4JJ2k7q%J9k2L2l6J3J5
3583A1kL0l0mpK0k3L0k1J9Jokk6K3l2L0m1K2J4pK0l9K2j0%lJ6Lj4j9L0j3J0nK0
3619A7k4J1j5L0k5KRJ0l8QK5lLrK4j5j3l0L8J2%kqRj7J0nJ0K0n0J9K4l2K4Rm2
$$ y = [-28, -7, 8, 11, -1, 3, -11, 8, -6, -27, -13, 4, -19, 15, -21, -19, 10, 18, 11, -2, -12, 3, -13, 4, 4, -23, 23, 9, -2, 15, -3, -1, 10, 2, 3, -2, 22, -21, -2, 30, -8, 2, -37, -6, -5, -9, 12, -9, -21, 1, 20, 11, 5, -5, -14, -1, -39, -9, -10, 2, -4, 22, 0, 22, 26, 2, -1, 19, -6, 9, -7, -3, -10, -26, -19, -9, -8, -6, -21, -19, -13, 12, -46, 5, -15, 1, -25, 9, 4, 19, 11, 4, 19, -22, 9, 5, 17, 38, 31, 6, 2, -15, 16, 6, 29, 27, 9, 13, 0, 0, 3, -18, 6, 12, 2, -9, 16, -18, -19, -6, 14, 4, -29, 12, 21, 4, -6, 14, -15, 17, -10, -34, -16, -6, -15, -12, -6, 21, -27, -13, 16, -9, -14, 13, -2, -14, -5, -26, 10, -19, -13, 25, -9, -12, 7, 14, 14, -2, 25, 27, -28, 3, -17, -21, 9, 34, -13, -12, 4, 5, 2, -7, 8, -6, -11, -6, -19, -17, 7, 18, 14, 1, 2, -12, -23, 14, -16, -9, 8, 7, -1, 3, -9, 10, 22, 11, 4, -8, 34, -16, -1, 9, 7, 2, 9, -13, -12, 12, 13, 25, -2, -10, -10, 9, -13, 19, -17, -4, 11, 9, 39, 9, 5, -2, 18, -5, 25, 4, 23, 24, 18, 16, -10, 13, -19, 11, -30, -8, 6, -1, 19, -20, 2, -8, -8, -11, 5, 8, -6, -25, 5, -8, 2, -3, 17, -7, 4, -11, 19, -6, -4, 5, 15, -23, -15, 10, 7, 10, 1, 25, 10, -3, -33, 5, 17, 17, 15, 7, 16, -1, 9, 4, 14, 34, -16, 3, 27, -5, 19, 28, -14]
3655a4OrL3L7rm9J4J5k1Pm1L5k8K0J5k7Q%KQJ0j7j4L3km6O4k2j6N1n5J4Ql9J4
3690a5J3J8k8K1K2qqrL7k6k6J5Qjqj0o%L7m1JQK6j6l3QK7Nk1k7L7JJ8Oqj7j2K2
3728A0J6k3k5K4k2K5j8J2pj2OJ8QLk6Nk1L0k8K6ml2K9NpNj0nL4Mj2k5J5j2M0l4
3764hJ6lk2QMqMlJ6J7Oj8j8J5j8j6N2l5qL3l7N5k9k4L3j9j8M3j1k4JK1j8K4Qn1
3800c2K0%KL7l4M8j8l0LpK1Lj1j9J9K0k7J0pK7j5j0jK5kjk7PJ8rJ7qk7PPnj7J4
3838bJ8j2l8K8J3j2k1J8J9j5lk0NJ2jJ0J2jo3M2k5J1J9L6m9M1k4lj3nK0pM8k8
3872A0k3M0J5m5j6j6J1K9poJ5Jl2J7qM8m8K5j6J5j5J1j6Rj6J8J8k5K6onj5K0j6
3906ck3j3K3L5l0lPj1JM1j1rJ7k8LkJ5Lj7OJ0Pk2L3n0J7Rj9K5Ok2nLKmJ5JLJ7
$$ y = [-14, -8, -17, 16, 53, 44, -5, 9, 24, 3, 10, -31, 4, -24, -4, 11, -16, -8, -8, -6, 2, 12, -5, -19, 14, 12, -34, 30, 8, -8, 43, -12, 2, 10, -29, -15, -2, 16, -12, 9, 31, 23, 15, 6, 43, 17, -9, 6, 14, 13, 5, -5, -11, -11, 26, -15, -14, -6, 20, 4, -29, -21, 6, 11, -10, -37, 0, 1, 19, 25, 17, 0, -12, 10, 26, 3, -22, 2, -20, 5, -13, -1, -8, -20, -14, 4, 12, 15, -11, -6, -27, 3, -25, 1, -3, -35, -6, -1, -8, -3, -13, -18, 16, 20, 8, -17, -2, -14, 26, -8, 8, 5, -17, -9, -5, -13, -9, -12, 4, 21, 27, 9, -9, 6, -12, -28, 24, -11, -19, 14, -23, 32, 3, -21, 12, -7, -25, 18, 7, -17, -16, 5, -13, 11, 19, -32, -12, -12, -10, 27, -7, 41, 23, -7, -4, -11, 10, 13, 2, -17, 2, 22, -5, 5, -2, 25, 10, 0, -1, 24, 22, 21, -6, 1, 19, 10, 27, 19, -8, -1, 6, 1, -16, -2, 16, 4, -34, -6, 7, -5, -26, -8, 11, -4, -7, -27, -22, -10, -11, -1, 11, 10, -53, -11, -36, -25, -6, 30, -19, 22, -2, -5, -18, -23, -3, -10, 38, 10, -13, 27, 42, -3, -19, -35, -24, 5, -2, -8, 7, 8, -24, -7, -15, 33, -15, 10, -6, 9, -6, 5, -11, -2, -18, 0, 18, -7, 19, 13, 8, -7, 13, -3, -26, -39, -16, 19, -11, -14, -7, -18, -17, 24, 13, 4, 21, -7, -4, -6, 9, 12, -5, 1, 11, 18, -4, 29, -21, -4, 5, -14, 11, 17, -5, -10, -7, -5, -9, 6, 7, 10, 27]
3945B7j8%J5l2RmJ7j2l%nLj9RJ2J4mk3qNJ2J4j9K2k9J2KmK1lj6l1K5k4M0j6K6
3982A5OL1o4OOk4L4Jk2L4nNk8KK3Rp%k2J4lJ1J1k9j3mJ7j1j4rK5jOk6J7PL%j2
4021a1okpL7J9j6LMrml9M9k9K1J1j6m5N1Lj6KJ9j6j6PK7k6R%QL6l4Mk7K7j9JM
4059DJ0qJ0Kk9K8m0K1K3Rj6oj0k4L5NmkQk2J0Mj5J2k9K9j4J8NrPk2K5oJ6l4L0
4096B1k1J7k1J5kk7J3RrJK9p5P3k8pJ6J4lmk5KL0oOj6K0j9kj8L1k9J4nj2K6j1
4132ck1J8PoJ0j3kpJ8Qk7J4ONk4K8j8L4j6k7L2%j9lK1%Ok0kj9M9ll7QJ1Kk0K5
4170A5kkl0L4JnKj2j2J4KMrj9J0J0moJ2J9j8k6J5lOK7k7J8l6M7l6MJ7j3pJ7J5
4207B2k0k3k4J5M4j9KMJ0J2KPl5plJ4%kL6k3k2L6kl7rK8OnKk1K0K1n2kK3J2om
$$ y = [27, 9, 9, 24, -8, 1, -3, 14, 2, -1, -1, -6, -3, -22, -13, -1, 13, 9, -14, -22, -17, -5, 9, -10, 12, -17, -5, -3, -7, 14, 11, -5, -36, -11, -35, 5, -11, 15, 21, 52, -12, -6, 0, -24, 10, 11, -11, 23, 18, 23, -5, -3, 20, 29, 22, 22, 0, 14, 11, 22, 33, 4, -9, -13, 4, -7, -21, -30, -5, -6, 0, -26, -9, -2, 1, 1, -11, -17, -19, -26, 11, 30, 14, 17, 21, 12, 8, -31, 18, -11, 10, 21, 5, -40, 11, 14, -2, 0, 19, 3, -13, -6, 21, -5, 4, 4, 12, 48, 14, 18, -9, 18, -1, 0, 4, 14, 6, 16, 18, -11, 17, -23, -2, 21, 30, 14, 8, -2, -26, 9, 14, 10, 8, 16, -6, 4, 8, -7, 5, -24, 5, -9, 9, 14, 5, 12, -10, 15, 9, 25, -9, 21, 0, 17, -4, 11, 9, -18, -5, 4, -5, -4, 25, -50, 23, -5, -12, 4, 18, 15, 11, -14, -12, 18, 12, 18, 2, 22, 3, 1, -17, 14, -15, -1, -6, -18, 8, -3, -24, -6, 1, -5, 5, -8, -10, -17, 1, 9, -18, -4, 2, 7, -17, 11, -7, 27, 11, -16, 16, 16, -3, -6, 15, 15, 21, 1, -1, -20, 29, 26, -11, -3, 8, 10, -10, 15, 13, 11, -19, 15, 16, 11, 13, 1, -11, 3, 5, 9, 0, -19, -9, 1, -3, -9, 3, 22, 4, -22, -7, -10, -4, 23, -4, 14, -22, 25, -11, -7, 10, -3, -10, 7, 22, 2, -21, -45, -30, 14, -5, -3, 1, 11, 23, 25, 32, -3, -10, -13, 1, 1, -1, 35, 12, -10, 26, 24, -13, -22, 6, 12, 7, 9, -12, 8, 29, -23, -25, -2, 10, 4, 0]
4245@lNrOj6J8j3lM0j3lj3ok0N0K3k6j8lpL0L3l5k1mkJ6k9J0J9j7J5j8j2L7l1
4281b0K4k0KnN6k1j8J3j4NK1Ml1NmlJ3Jk8L9nk1K1oKOj5KRLK6n3K0j6L3j6j0q
4319il4O0ok8N3k5J7n1L6nOj3j0J8l7K8NjQk1j0K4jj3J2mj4PP%POLl2J9J4j1J6
4357B1J2m7j4M4l1QLk3M0qkLQl8L5Rk0l3ROKK1J1k1L3l4RrJ9k1j0J5nM0l4J6n5
4394d1M5oJ1Rj7oJ0J7j6j2%K4l1OjJ8l2M4j7rJ7j5J8j8RKJ5k2oK3k6JJ2J0K1m1
4430dK3Lqj9k4M2l6K8j4NJ7m0oRJ1J1J3J0k0j8MRl3M1l3K8JJ3m4M9rk4K4Olon
4467Aj2K5Jj3qK2j6%pK0NMj3k5K6nMJ4j4oKpK6k7Rj4K8l7K9j3K9J4j1j5mlk2J6
4505Ck0K2Qk2rM0l7K2O%j7J8k5J9k2k2L7j6J2L1kl2K2k5J1J0Pk3K2%j0J4m2L8
$$ y = [0, -3, 2, -7, -1, -17, 1, -12, -15, 25, 12, 9, -4, -10, -30, 20, 43, 17, -1, -4, -11, 19, 52, 17, -4, -8, -10, 6, -23, -13, 6, -11, 4, -14, -26, 11, -20, 4, -16, -14, -19, 37, 16, -2, 11, -3, 2, 23, 27, -4, 1, -3, -6, 7, 8, -20, 19, 14, -7, 14, 8, 10, 16, 1, 3, 12, 15, 41, -12, 8, -8, 25, 9, -1, -9, -43, 17, 11, -17, 36, 11, 28, -23, 13, 8, 14, 1, -9, 9, -28, 0, 5, 4, 12, -9, -19, 5, 4, -9, 3, -1, -15, -8, -1, -1, 6, 12, 15, -17, 2, 16, 5, 21, 33, -14, -28, 16, -15, -7, -4, -27, 13, 5, 3, 6, 14, -24, 11, 20, 0, -33, -24, -18, -16, 5, 16, -5, 28, -6, 3, -6, 13, -8, -18, -3, -8, 32, -2, 14, -41, 4, -2, 9, 18, 1, -5, 5, 22, 6, -6, -6, 18, -13, -7, -8, 10, -22, 22, 5, -4, 13, -2, 16, -2, 7, 9, 24, 2, -4, 19, -7, -6, 6, 16, 37, -4, 19, 22, 14, -5, -29, 13, -23, 5, -9, -4, 13, -27, -33, -24, -13, -2, 11, 21, 1, -17, -13, -4, -37, 4, -29, -1, 0, 13, -31, 18, 9, -15, 9, 15, 12, 6, 1, -11, 14, 15, 2, -6, 16, 0, 0, -7, 13, 18, 22, 9, -16, 10, 5, 9, 23, 9, 3, 5, -2, 24, -3, 6, -8, 20, -17, 12, -1, 28, 42, 31, 16, 12, 9, -13, 3, -17, 5, 13, -9, -18, 22, -15, 7, 13, 13, -4, 14, -11, 8, -14, -36, 1, -15, -3, 28, 26, -6, 16, -9, 2, 12, 19, -4, 18, 18, 8, 22, -20, 18]
4539A8pJj2kLj2Rj2KLLRJ3j0l0L4Ql2KL8pk0L1j6J5l7olJ6qpNl7N3j8M4l6qL1
4578A8k3Qj4K2k0K3K4l3k0RJ7j5MPJ6om0K0OQj9J8J7j7k2jJ6Jj6Rj1LOJ3j2K1
4614A7k3PPj9mM4j4k7J0j7J9j2J2j8L0rk2J5j8J2J3K3j6JrKjk1K6J4l7K0J9l0
4648fNLK0l6K5KK8k7k6K2rK8k8j1OJ3J9j7K2o6K7rMkJ0jqMpK9M%l3K5k5K2k5O6
4686D8n0J0k8M9j4j3kj8K8OMl4J4k%l5J9j3K1oQL1j7Qk3J9J6k1OlJ1j2j7pL3J3
4722B9mj9J0J4j7J5k8j7J2LK0m4L8j3jj6J7qJ2j2J4k2K1K3l8nJ7mL9j5k6OJ0l5
4756b4L4LnkJlk1K0j9J6K5l4J6Nk9K6lJ4k1J2l4J9k2N1l2K9mm9K9K5j2jlPK4r
4792B9Nl3KK5l8J2nL8k5Mk9j4J1K8j1Jj1k2J7J3nj2NJ8j1k2LN1j5j6Ql8K9J3j6
$$ y = [18, 11, 12, 0, -2, 1, -11, -2, -14, -12, -9, -6, 3, 16, 6, -24, 10, 18, -14, -12, 26, 19, -1, 30, 14, 29, -8, -14, -17, -1, -9, -16, -11, -48, 5, -13, 31, -5, -13, 18, -5, 3, -11, 11, -9, 14, 38, 5, -15, -6, 11, -4, 0, 7, 23, 17, -23, -3, 3, 11, -8, 10, 27, 10, -12, -13, 3, 4, -12, -3, -14, -11, -5, 8, -4, 17, -6, 1, 8, -11, -15, 29, 15, -12, -2, -19, 0, -12, 0, -18, 12, 3, -19, -4, -22, -10, 3, 26, 10, 11, 2, 4, 3, -18, 8, 22, -15, 5, 24, -6, -1, 2, 22, -14, 11, 13, 41, 14, -12, 10, 1, 29, 1, -10, -4, 9, 28, 11, 33, -33, -6, -15, -11, -13, -3, -4, -12, -8, -15, 14, 18, 18, -15, 10, -15, 7, -18, 48, -2, 8, -20, 29, 15, 2, 0, -18, 10, 16, 20, -14, 0, -2, -2, -37, -18, -31, -10, -16, -8, 23, 6, 14, -9, 10, 26, 5, 11, 8, 19, 7, -10, -17, 16, 29, 25, 6, 16, 30, 13, 28, 0, -17, -5, -2, 18, -26, 12, -1, -2, -18, -1, -9, 3, -9, 5, -17, 4, 27, -11, -16, 1, -3, 36, 21, -5, 1, 11, -24, 10, 13, 8, 6, 7, 4, -17, 3, -16, 0, 25, -9, 7, 12, -17, 9, 6, 20, -1, 11, -23, -4, -26, 25, -7, 22, 18, -31, -2, 23, 11, 10, 7, 14, 38, 29, 34, 1, 3, 28, -10, 2, -3, 35, 10, 14, -15, -29, -18, 10, -1, 0, -11, -33, -16, -3, -8, -20, -15, 3, -8, -30, -27, 24, 9, -7, 1, -37, -8, 5, -11]
4827a1L1j3pmK6k1MJ7j9k9K3%K2j5kqJ4kJmJJ2nJ1l8M3j0Jmj5K4m6K9k5ML9ml
4865A7J3j0rj8ORk4ROK8k5NqKJ1koM9p9K2J4J5Ol8%Kj7J5OnJ3Nk0K6jl0M6k6%
4904Gkqj7J3j5M5j4j4K4k3J0J5l%pJ2k3J1oj6MRrJ1ql1L0oK1j8m4O0nj3K9j1K7
4941C5o1L3Prj6J4KMnJ3j2rJ4mk4PQj8M8m8J7Nk7L4J5mk2K2j5J7k4pLlJ1NPl3
4979b0K1J8oj9K4l3J5pk4K6l3L3OJ6j0k9KJ7J9j2j1nJ1MKjl%j6L0qk3J9k2L0j7
5015fMj9L4j3K4j4l7L1L0j7l5L2m0K7J4k8J2j2L4n6K7k6qM8k7J9Nl6L1j4Jj7J0
5048b2L9m0NJ0K1j6K2l5mM8jl7KL6l4pmK1j0J2k2J5JJL4m4KJ2J3Ll0NLj8L5l2
5084a6K3k1J4j6L6nl7K8Nj7rJ7k6M5o2L6m4K5JK7orK7mm%mj3OQqj4J5JJ2j6Kj3
$$ y = [-11, 20, 7, 0, -4, 22, 1, 5, 22, 3, -26, -3, -3, 19, 4, 2, -6, 8, 6, 7, 3, 4, 16, 11, 22, -16, 27, 17, 18, 14, -1, 23, -23, 6, -19, -15, 24, 20, 17, 30, 20, 11, -7, -1, 8, -16, -7, -1, 27, 2, 7, -1, 1, 12, 10, 4, 53, -26, -4, 10, 25, 31, -7, -7, -5, -22, -7, -1, -6, 7, 12, -8, 18, 17, -13, 33, 7, 7, 5, -3, -20, -7, -22, 23, 9, -5, 19, -4, 6, 21, 18, 18, 11, 23, 0, 11, 5, -11, -7, 2, -7, 4, -4, -35, -5, -11, 10, -8, -52, 8, 3, -10, 19, 8, 35, -26, 7, 14, 5, -11, 3, 5, 9, 4, 17, 5, -4, 10, 6, -18, -11, -3, -21, 27, -21, -4, 1, -26, 8, 23, 19, -3, 19, 4, 21, -3, -10, -7, -10, 1, 6, 13, -20, 1, 19, 13, -6, 18, -15, 0, -7, -31, -5, -38, -5, 1, 17, 7, -22, -20, -3, 16, 4, -7, -12, -1, 3, 5, 4, 1, 1, -15, 15, 7, -16, 3, -19, 11, -6, -2, -21, 13, 0, 24, 10, -27, 4, 34, 17, -18, 14, -26, 1, 15, -13, -1, -13, 21, -35, -8, -34, -42, 6, -21, -2, 3, -33, -2, -16, -15, -32, -22, 17, -23, -18, -8, 13, -3, 19, -16, -20, 28, 27, -10, -8, 28, -6, -13, -17, 4, -6, 6, -16, -1, 0, 1, 35, -9, -7, 5, 18, 21, -9, -4, -1, -19, 16, -16, 7, -14, 0, -16, 20, 15, -22, 6, 11, -6, -15, 2, -24, 21, -41, -5, -49, -24, -23, 4, -2, -11, 16, 12, 8, 8, 4, -9, -3, 5, -3, -17, -2, -1, 11, -5, -3, -16]
5122a6L0nRjm4K3K1l1J0RLJ6k9J1J0k3RkJ1k3L5l0J0j0j1L4l4NJ5j0jJ2%mJ3p
5158EKn0N1k3kKK3j7K6n9J8L2pk6K6oK1ql0J3JJK7l0k9L3J3j8MK0K5m5K0Kk1M
5194bJ8K0l8J5l4J8MJ2j0QK2m0J5j6KKrJ0J0j0j4L1l9J4MK8j6k6M3oQj2m4L1Q
5229GJ3m5K3lj7%oJ7J7k4KKL8ok6J7j9k3M6kj9J5K8m6M1Lm8J5l6L6J5rJ9m8J5
5264hK0j5kMj0J0K9l6J0r%k8J1J1J0rj0K6mj9L4%j6Ok1J5Qj1J1oj9%J9L7n1Pl
5301inll4K2K9J2l3K6rk5L2QJrj8L5l0K1J0j9Oj3QJ6j8J1M0j5m6JLJ4k3J0qRJ9
5338A6qk6Oj6K0%J5jj3J0k3pM6j6j8K1k6Pj6M0k6L4k1mpL1K2l1pkmOnL2j0k2j8
5375b1L3j4J1%J8Nk4poJ7j2kJ2Qk5%j0nK7J2j9K7j2j6rM1j9k7RjQRm3K2J7Mk2
$$ y = [-16, 14, 9, 18, 17, -27, -4, 17, -14, -4, 5, 8, 24, -5, 6, 16, -7, 2, 0, 11, -12, 23, -7, 3, -7, -18, 16, -18, -13, 2, -8, -9, 3, 3, -1, 12, 5, 7, -43, 8, -15, -17, -15, 8, -9, 17, -42, -24, 8, 1, -25, 1, -5, 16, 8, -22, -9, -8, -7, 20, -10, -39, -6, 7, -11, -7, 13, 38, -7, 13, 15, -6, -2, 16, 36, -2, 13, -21, -3, 1, 13, 3, 11, 33, -7, 8, -8, -6, -4, -13, -3, 7, -3, -17, 14, -25, -11, -7, 21, 5, -21, 22, 16, 24, 12, -32, -1, 7, 20, -25, -2, -5, -22, -22, -28, -11, 6, -18, -16, -14, 24, 18, -8, 9, -10, -33, 13, 11, -8, 7, 35, -11, 30, 33, -15, 0, -36, 0, 15, 6, 25, -23, -8, 12, -3, -5, -1, -11, -1, 28, -8, 2, -7, -7, -35, -24, -13, -3, -12, -22, 4, 0, -19, 15, 15, -1, 5, -16, -1, 7, -4, 7, 1, -18, -18, 1, 38, -13, -6, -9, -14, -17, -51, -29, 0, 12, -21, 5, -4, -29, 3, 11, 12, 3, -15, 20, -10, 11, 21, 2, 8, -5, 3, 19, 1, 12, 52, 37, -9, -8, -5, 9, -14, -4, -12, -3, 16, 8, -18, -12, -28, -8, -8, 7, 6, -7, 3, -20, -27, 19, 3, -15, 6, -20, -13, -29, 11, -15, 19, -2, -6, -13, 18, 40, 9, 2, 0, -4, 2, -3, 29, 19, -3, -21, 12, -2, 9, 9, 27, 32, 8, 1, -5, 12, 0, -2, 10, 18, -7, -7, -17, -22, 5, 17, -2, 25, 13, -3, -12, 29, 10, -17, -8, -9, -1, 8, -35, -13, 4, 8, -14]
5412a4J2K8k7j7L2nk6J1l2K7J4j8M6j4m1J2RJ1K4m2M8m8J2qqj1K6l2QJ1rN2l5
5445dJ5qkNJj2J1Lk4Kk1K8LloJ8jJ8mMl0j0j%K1j8QK4oQm2M2k1j3KRl0M5K7k5
5485A3j2K6Jk1J9k6J5lrK6l4N%j9J0J5KoK9l4J7k1J3k8J6L0j3Kj2J2k1J7pk3J7
5520dpK4l5%K8%j5K3nrJ0k0K4k2mJJ0j5MJ1L2ok0Ok2nL3mm7P5m2rJ0mK1k5j0J9
5558ApnPJ5j1K0k7J6Mk0o%nL0k1%J0rjK0j8MJ8j0J2j9j9K5lj0K0m9M5j3L6l2R
5595GnojnJ3Om1K7Rl0L5l4J4L8k3Rj8M1j9l3J7JJ5k9J6J3k1Rk6J6K2qr%l0lM6
5632A3j3J0L1m3rJ1k3K1j8J7J1k3L6jo5R3l0j6Rkrk5L4l8K2K2j8JJ1K2n8J9J6
5665HJ2j8j8J6MJ2k1L0l4Pj2J5k3L7k8J5JnJ8k1jJ1j0K8pl6M9n8ROK2J4j9k9K9
$$ y = [-14, -2, 26, -1, -18, 14, 9, -17, -6, -38, -11, 3, -15, 31, 17, -24, -12, -3, 8, 32, -10, 38, -10, 2, -6, -14, -25, 1, -31, -23, -12, -21, 31, -4, 11, 3, 1, 6, 7, -5, 6, 9, -15, -13, -34, -6, -3, -6, -12, 6, 5, 23, 19, 23, -7, -17, -18, -18, 3, -15, -7, 17, 11, 19, -23, 19, -2, -15, -13, -4, -34, 11, 38, 13, 1, 27, 28, 7, 26, 0, 15, 12, 3, 29, -5, 0, 0, -19, -9, 6, 8, 2, 31, -3, 14, -7, 6, -22, -6, 24, 11, 13, 1, 13, -8, 9, 2, -21, -4, -11, 13, -22, -22, 6, 6, -9, 14, 9, 0, 10, -10, 14, -8, -12, -11, -1, -16, -12, -1, 31, 25, 5, 11, -11, -16, 17, 13, -34, 41, -1, -10, 0, -4, 17, -8, -18, 1, -6, -11, -4, 11, 0, 20, -7, 9, 13, -7, -13, -13, -18, 12, -9, -9, 1, -8, -9, 11, -7, -3, 15, 5, 17, -2, -21, 4, 1, -9, 11, -38, 7, -6, 30, -2, 7, 2, -4, -5, -10, 3, 9, -32, -5, 4, -26, 9, -25, -11, 27, 4, 13, -5, 36, 17, -16, 1, 2, 17, -12, 4, 17, -4, 5, -21, -5, 17, 9, 0, 0, -30, -33, 13, 0, 10, 41, -2, -11, 0, -23, -2, -20, -3, 8, -15, 21, 20, -45, 48, 18, 2, 11, 9, 0, -25, 9, -29, -7, 15, -3, -2, 9, 31, -27, -8, 8, 20, 2, -16, 0, 4, 16, -5, 25, -9, -2, -14, 1, -22, 15, -13, 2, 3, -2, 16, -5, -6, 5, -5, 23, 16, -20, 29, -29, -20, -14, 8, 22, 3, -26, 3]
5700CJ5k8Nj5J0J5kJ1k4M3m4oJ2J8m%j0OJ5j9j1L2m0J5QrJ5MKj1J8k8mrL4J4n0
5737a9j8M4J2j4%J0J9l0NlPj2J0J4l8MK0l6M4olK3l8K2j2j0kQJj3QJ2j7J0k0O
5773a2rJ0NL1l1Mj6K6l7K9j7K4k0K2KJpMK4j9lJ8j4jJqOk6J1mJ4j6mL1j5k7pL8
5811Hj9J4%j7J9k7L2J4k3Lpmk1K4J3rj5J5l1M9Jm2M4Lj7k0QQnQkk4lK4j7M8m1
5848ij0K6j9J5pj1KJ4j5K0jj5L1NpNl1MNLQj3j3J5jm%K7%k0J5l9NL0l5J4PL0n8
5887b7M8l2QPLK5pMj4Kj1k5K2Nk1OpqK0kP%k6K3J9kn0L1l2J1M2m1L7j0j6mJM5
5925C1k5j1K1j9j6L8Kk6%lNj2M4l1j2J7kJ8j0qj4j0NJ7RJ1Kj0k9K7J%j3nQk0Q
5962a2K6Lj9K6k7Pj7J0%Jj0L9j4JOj1J8m5J4J1j3L3l0J9j6OnjPk4L8l0mK4rM3
$$ y = [3, 18, -10, -5, -20, -10, 5, 3, 14, -10, 33, -11, -17, -5, 13, 9, 9, -1, 5, 20, 1, -10, 22, -18, -3, 5, -4, 11, 15, 17, 6, 24, -4, -8, -17, 17, 31, -19, -37, 7, 19, 5, 5, 15, 34, 4, 9, 6, 13, 1, 11, 25, -13, -9, 11, -25, 19, 13, 10, 33, -5, 17, 5, -5, -7, 1, 2, -11, -3, 9, -8, 2, -18, -12, -21, -11, -6, 25, -6, -2, -18, 8, -29, 0, -17, 7, -13, 9, 11, 12, 5, 9, 33, 14, 11, 29, 15, 14, 15, 7, 13, -13, -2, -6, 8, -8, -12, 19, 4, -23, -30, 8, -11, 3, 3, -14, 5, -22, 10, 24, 1, 4, -3, -7, -28, -4, 9, 0, -15, 0, -31, 18, 19, -23, 21, 24, 7, -13, -5, 3, -2, 6, 4, -20, -23, 1, -16, 32, -9, -19, 7, -12, 3, -4, -15, -13, 1, -14, 6, 5, -10, 21, 26, 19, 24, -7, -3, 2, 5, 13, 0, -13, 2, 1, -3, -3, 24, 24, 4, 19, -20, -15, 15, -20, -6, 1, 31, -27, 21, -11, -3, 4, 7, 32, 25, 29, 15, 17, 6, -19, 3, 8, -13, -7, -14, -22, -2, -4, 3, 3, -23, 0, 19, 17, -33, -2, -34, -23, 19, -22, 15, 5, -11, -15, -14, 31, 6, -5, 16, -3, -19, 19, 21, -5, -5, -8, -3, -15, 29, -2, -14, 3, 1, 19, 9, 1, -13, -23, -18, -1, 8, 19, 21, 11, -18, 9, 10, 10, -3, -8, 0, -20, -12, 14, 17, -2, 24, -3, 4, -13, -3, -3, -2, -12, 27, 13, 14, 20, 9, 27, -18, -4, 7, -6, 27, -3, 16, 0, 6, 1, 0, 7, -17, 21, -9, -13, 11, 2, 45]
5998D5m0J3k2J3Jl4j5P3o6J6J8%k1M6l2J4j6K3k4RrJ3Qj2JJ7j2k0K1j3L6k2l0
6031b1L6j5j5K2RJ3j7On1qK9J0K5Om1L6j9j8pK1L1k9pnK1noj3L2k9j8K4j5M4m3
6066a7j4M4Jk7NL5j8m0J7j0L4kk0NJ2Kj8JK5k3RJ8l8K4K0qmJRj6J5k8MJ7jj8o
6103a0oL4Lj5j7K2j5M6k7OJ3nk3%J6l3K0rJk6K3j8K1j9J1KOqOj5J3K4J6n3L2j9
6139ck2K6K7j8K6k5j4J0j5l0N2njkkkm0O4j0J3l9Qj7K5Pk9pK6%%L6n2J5%j7K2
6175Gk4j2M6j2Jj2J7j2Mj8L8k6L%K7q%Jk6jM3nm6N0m4OJ9mk2JJ0KnJ1K9m4KOK5
6214B7j0j4Kk2L4JpMl7J9QJ6KqNj4J4j7JJK5m8m9L6J4K8l5J1L2k3oJ1j7K4J1k
6250A7Mj8l0K7K2j0k2QNj5L0mrK5k5kj3J1KJ3Kl9N4l4K1jm0jK2J2Kj8K2Mm2M7
$$ y = [45, 5, 18, -4, 9, 10, -24, -39, 34, -32, -16, 2, 2, -19, 27, -5, 9, -7, 16, -8, 1, -8, 5, 13, 1, 2, 19, 7, -13, 8, -5, 31, 9, -21, 15, 0, -15, 7, 16, 29, 12, 18, -33, -41, -12, -2, 23, 29, -12, 24, 5, -13, -20, 1, 32, 3, -4, -9, 12, 7, 1, -12, 20, -9, -27, -3, -18, 26, -17, -31, 13, 14, -13, -8, 27, 9, -31, -14, -24, 10, 8, -12, -7, 5, 7, -11, -10, 15, -8, 1, 19, -19, 5, 25, 17, 13, 14, 23, 7, 22, -6, -2, 15, 14, -4, -10, -16, 18, 21, 6, -11, 11, -4, 42, 15, 21, 34, 29, 6, 6, 22, -11, 9, 0, 1, -25, -2, -20, 1, -18, -7, -5, 1, -7, -1, -16, -3, 21, 37, -16, 16, -3, -25, 1, 28, 10, 36, 11, -3, 7, -8, -38, 14, 9, 8, 6, 4, 2, -38, 26, 16, 29, -10, -2, -19, 6, 13, -16, -23, 3, 3, 3, 39, -13, 2, 2, -15, 7, -17, -29, 17, 5, 6, -6, 11, -1, 3, -15, 23, -3, 0, 0, 27, 19, 19, 20, -6, -7, 36, 31, -15, 35, -9, -3, 16, 12, -10, -9, 1, 3, -2, 9, 38, -6, -4, 2, 27, 17, 3, 5, -17, 17, 18, 11, 15, -22, -3, 5, 21, 23, 15, 20, 6, 20, 3, 4, 5, 30, -18, -67, -31, -17, 11, -24, -13, 19, -4, -10, 1, -16, 8, 19, 17, 21, 3, -27, 0, 22, 12, -10, -2, 3, -12, 18, 14, 5, 30, 5, 3, -10, 1, 3, 16, 18, -21, 33, -1, 20, 19, -21, -22, 0, 12, 14, -4, 18, 22, -20, 27]
6286B7j9m6K9J3Kk6L0Oj5k2L0n1L7K8k7Mj4KLM4j4k7j3QkPJ2l0OJ4j4K1j1j1J9
6321@mK7k4j6J1J6mj5mJJ5rjj6M2j8Rk6QJ0J1k1%qRK4%qK7l6J3Pk4jmJ6l4M7J2
6360C2J0l6Jk6L0l7M0qlJ8j9k2K4J6Lrl1J6J7kJ6k3k6J0K0k0L0j7mL1l2OJ4J9
6394C8n4L3j5Rl5M6n8M1pK7k7K0pj4J2l5P2o3J1l1P2n1K5lJ9j6mMjk1qJ1pL4j9
6429bJ8lj7J5j2J5m7P8j1k9mmK0J2j0m0K7K7Qk9kmpj3L4J8k0j6Kl7K5%KJ1l0J0
6465a5K1nMrkk7J5J8mJ5Qn3L7J7j5m0L9kPk3LK2J4On4K7lj4K6Nm3L4nlpj0J5J7
6503A6n0J3QJrjK3oK1l6L1j4PNJMJ2m6L8lKJ3j5m2M3l3K9kj3j6J8Lj8L3o0P9n0
6540a4L5l4J3j6QOK1l4J9Lj6K5j7j8oK5oJ4mPk9L8j0j0J0k3K2k7K5Pj2l1J7J0
$$ y = [27, 8, -38, -9, 4, 6, -20, 10, 16, 1, -21, 9, -42, -5, 23, -4, 0, -14, -12, -9, 35, 21, -6, -19, -11, -13, -6, 6, -24, -18, -4, -18, 3, -8, -19, 0, -4, 23, -1, -17, -6, 10, 6, -9, -13, -12, 3, -6, -7, -23, 19, 1, 10, -16, -8, 2, 13, -8, -8, -16, -7, 17, 17, 9, 36, 0, 13, 20, -4, -5, -9, 7, -27, 20, 32, 42, 6, 7, -19, 11, -26, 14, 6, 3, 21, 2, -20, 4, 20, 23, 14, -17, -1, 16, 14, 30, 7, -19, -9, 11, -9, 21, 4, 0, 31, -1, 5, 19, 38, -16, 17, 2, 11, -24, 22, -36, 5, -2, 25, -2, 18, 11, -3, 9, -26, 46, -17, -6, -37, 35, -16, 9, 6, 25, 9, 5, 9, 8, -13, -21, -10, -17, 17, -2, 16, 13, -4, 11, -1, 14, -33, 45, 34, 5, 1, -3, 17, 29, 19, -21, 6, 33, 41, 12, 10, 6, -1, -14, 20, 38, 18, 2, 4, -33, -8, -8, -6, 5, -25, -15, 6, 1, 5, -4, -6, -33, -18, 0, -4, 11, 19, -34, 3, 20, 5, -35, 4, 2, 9, -14, -11, 11, 25, 31, -23, 4, 1, -13, 13, 18, -25, 9, 4, 1, -6, -16, -1, 16, -34, -21, -13, -12, -21, -22, 1, -5, 16, -20, 11, -3, 4, 9, 10, 14, 26, -20, 18, 15, 17, 30, 15, -27, 16, -17, 12, 10, -3, -19, -1, 2, -16, 17, -43, 36, -14, 21, -13, 0, -16, -8, -2, 19, -15, 4, 7, -9, 16, -1, -19, -25, 0, -6, 8, 4, 11, -18, 20, 10, 0, 10, -13, 9, -18, 7, 14, 2, -29, -12, -2]
6574bK0rl1L2j0K0k0J3j0J2l8L6j1pJ8k2j2K2jJ5j2pLPrlJ3qj0K6l6j9K2M2m0
6609a6M3j4l0O6j1m9K3l4N8k9L1l2K9k7k5J0J6K1l3PL4l2Nk0MK5k7K3K3k6mJ3
6641B2j8jQJ8J4m2nJmJJ3J8m6N1rj9j2K1J1n8K2L9j4Mk6K8o4L3K4J1Lm8K3Kll
6677eL0j0oLj5j1mJ4k0L8Ll4M7J8m6k3J2mK4k9M0l7J4Pj9K4%Nj4Mj6K3k9lL8j6
6713Ck3J2qQJ0J8J2l3RRjj9QrK2j1mojjj4LK3lj3K3K3n0K0k3jM8mk8Kj8L8Mk1
6752DK3l5mK4Ljk3JJ0m6J9L4oOl7M1JKj8Mj0J6M1m2j8JpJ8Lj2rnJ9J2j8J8KKj6
6791cpRrJ7lml1M9k7j3MJ9j4N1n7j5N3jjm7K5jK7m0J6J0RNj3K4l4NOj1M2l5j1
6828frRJj4Pj8L9k1K0j5J8lk2K8qK0pJj6qq%K0j9K4J4j8oj2K9k3J7rk7K4rk0K8
$$ y = [-2, 18, 9, -22, 10, 0, 20, 0, 13, 3, 15, -23, 13, 2, -5, 13, -9, -21, 1, 0, 15, 3, -4, -1, 6, -3, -6, 7, -1, -11, 15, -21, -40, -18, 24, -16, 27, 13, -17, 49, 38, -11, 12, -22, 36, 7, 38, 6, 35, 8, -17, -7, 9, 30, -3, 4, 38, 6, 11, -9, -5, 20, -7, 16, 39, 13, 9, 22, 4, 3, 11, 29, 43, 1, -4, -3, -7, -6, 7, 25, -21, 30, 21, 2, -10, 11, 22, -36, -14, 25, 11, 15, -11, 17, -47, -14, 10, 21, 24, -24, -1, 1, -2, -5, 25, 15, 9, 12, -3, -14, -18, -4, -24, 14, 17, -17, 30, 48, 2, -21, -9, -13, 11, -18, 22, -15, -1, 6, -13, 11, 11, 16, 2, 6, -10, 13, -16, -19, 19, 3, -20, -8, -16, -8, 2, 20, 32, -1, 8, 17, 16, -3, 5, -4, 18, 7, 3, -3, -4, -5, -19, -16, 7, 4, -9, 14, 37, -13, 7, -16, -17, 31, 27, -1, 1, -17, 21, 25, 4, 27, -8, -12, 12, 15, 14, -9, -8, 2, -44, -25, 9, 3, 9, -28, 13, 14, 16, -2, 2, -8, 8, 49, 7, -11, -10, -17, 1, 4, -8, -17, -22, -3, 9, -9, 9, 11, 13, -3, -10, -1, -10, 7, 4, 0, -31, 18, -9, -22, -18, 1, -13, 38, -19, -34, 19, 18, 17, -30, -5, -6, 21, -19, -3, 7, 16, 21, 8, 32, -2, 3, 9, -2, 40, 5, -6, -15, -6, -5, -19, -12, -30, 9, -12, 8, -7, 11, 8, -14, 14, 6, 26, 19, 20, 4, -4, -12, -12, 8, -11, 13, 27, 9, 3, -9, 20, -3, 14, 5, -22, 2, -7, -27, 1]
6866AJJ2J3rm8K7PK3l2J0JqpK2k3L2Ok0OJ4j7j7J4Nqj7L%J3J1jj7L1k5mK6j6m
6904Ej1k6Pj2L9j8J1J3j5RRJ0j0%l5N4m2jJ7LmkL3ok3mJpK7k4K2k5J3OlPl3NL8
6943B8l2pJ7nk1J1K0j5J7jNqKl2J6j1J4K6l4Mj6J4K6j5j0l1N7l1J6plj1J6L3k3
6978Il9K3J3Rj6L6m7K7j8jL0l1J4%PJ1j6Lj7J6%Km0N3m0j6M0PJ0j7j9nK8l6L7
7013A7j9K5m4L1Pl8L0j7MKJ5k6L2J0n1J6K1J4n3K4J2l0JL1l0J7q%Qj2jJ8Pl2K8
7048ImlJ1NJ6k7rjkRk7J6lk0K1OJ3k0rK8rrlJ0J0kj2qOJ0j5K2Nk6J4qoQNJ2qo
7090aLl2O8l1M1j8n4L5jj0OL3n0%J8mj7J4J4m9L5J4j4J6qJ3j5k3J0j3L9k7L6l9
7124a1Pj9L3l2K9NRkm%k5J4l9N5m2J2J3oMj1JRqNJ4J1J4k8ONrPlQk1Knj3L0J0
$$ y = [1, 2, 14, 27, 18, -30, -3, 4, 27, -5, 5, 6, -2, -9, 13, -10, 22, 28, 8, 14, 28, 11, -6, 8, 13, 5, -12, -9, -9, 4, 15, 14, -3, 28, 3, -1, 25, 9, 5, -6, -32, -25, -37, 2, -16, -5, 8, -7, 2, 11, 21, 11, 11, -24, 30, -12, -13, 4, 7, 3, 1, 34, 28, 5, 1, 2, -5, 22, -2, 20, -5, 8, 14, 11, 18, -15, -10, 28, -4, -11, 6, 1, -20, -9, 11, -4, 13, 12, 17, 9, 11, -21, -5, -16, -2, 24, -10, -6, -22, -8, 18, 3, -7, -38, 19, -12, 4, -3, -6, -17, -1, 32, 9, -30, -7, 6, 15, -1, 35, -12, 15, -3, -4, 26, -5, 9, 9, 16, 27, 11, 14, -3, 13, 13, 15, -25, 28, -12, -28, 12, 19, 29, 12, -7, -12, 16, -20, 17, -2, 23, -21, 10, 17, -21, 9, -8, -4, -2, 13, -13, 19, 29, -22, -6, 15, 29, -24, 0, 12, -18, -17, 14, -16, 1, -7, -7, 1, -11, -12, 6, 13, -19, 9, 5, 2, 13, 18, 34, 7, -2, -3, -5, 4, -23, -7, -10, -30, -9, -3, 10, -10, -19, 9, 0, -9, -12, -2, 8, 6, -6, -14, -8, 2, -13, 9, 14, -12, 2, -6, -12, -4, 1, 13, 5, -1, 2, -30, 38, 7, 48, 30, -24, 11, 10, 0, 6, 39, -11, -11, 7, 3, -14, 0, 14, -35, 0, 14, 0, 16, 8, 21, 6, -17, -7, -20, 19, -8, 28, -11, -4, -23, 10, -22, 7, 12, 21, 19, 15, 15, -10, 4, -35, 20, -22, -10, 3, -3, 1, -10, -9, 0, -8, -3, 11, 22, 36, 8, 14, 19, 10, 17, 14, 22, 1, 3, -2, -15, 15, 25]
7164B5kj1j3J7mMj5Kj0J3p%K6Lk2Nj2K1k9oK3loMnMPK0k4j1Mj5J5K5om2J7nJ1
7203bqL1k6J2l4L8oJ5j3k4K9j4k1LK2lK4Nj5j5kK0m2PlJ1J0J6j5oOrL6l0k0J9
7239doPJJ1qoKJ1l8OL4JrJ3JqQk9J4Pj5oL8n1MJ1J1kJ1l5K9J3j4Mk4L1l3K8jn
7279Bj7LJ0Mm%kK6j4j9JN5n4oK5j9L8l2KKMJ0j7jJ2J0k5qL1l0j8L4k5K4k5J5K
7316fk8M1j3J1j1J5l%m4L1K0k1QrJ2K9j5qJ6ok8L3l2Pj9oM3j7rqL2j6nJ2jl2N0
7353B3j6J4lqj3qQJ0K0k9L8k1j8pL1k5mj6K4OMJkRl3K1qJ7m3N7j3k6K3Pk3kPL2
7391C4l1j0OJ6oj6nK8k2Nl4N2l8J6Kk2J8J9%j1KMrJ4k4K7j2%k2KJ9Mk3L7k4K1
7427A7k4LK9m5OK0k4J6K7k6K0l1L7k2K0m5LRLK3j9qK3k2mML3J0k2K6o1N0j3Ll1
$$ y = [25, 23, 12, -1, 16, 12, 16, 1, 3, -7, 6, -1, -1, 25, 28, 6, 11, -1, 20, -9, -15, 8, 5, -1, 3, -2, 2, 9, 29, 5, -6, -2, -17, -2, 23, 17, -25, -8, -13, -2, -10, 21, -5, 7, -27, 11, 5, 20, 7, -17, 12, -2, -23, -20, 2, -1, 23, 28, 13, -2, -4, 16, -26, -19, -22, -11, -1, 15, 0, -6, 0, -9, 27, -3, -23, -4, -10, -3, -2, 9, 1, -5, -3, 8, -30, -24, 10, 11, 2, 15, 16, 8, 16, -13, 1, 8, -7, -13, 25, -26, -22, -11, 0, -2, 9, -26, 3, 16, 2, 6, -18, 13, -20, 8, 7, 2, -15, -12, -2, 2, -2, -2, -4, 22, 8, -11, -10, 45, -9, -15, 10, -9, 29, -3, -1, 1, 5, 15, -2, -3, 9, 19, -6, -14, 17, -13, -31, 3, -22, 2, -23, -8, -6, -34, 7, -6, 5, -6, 9, 6, 6, -38, -7, 13, -8, 0, -9, 3, 32, 17, 9, 25, 19, -9, 24, -8, -1, -20, -26, 17, 0, -9, -17, 15, -1, -6, 6, 5, -27, 23, 7, 21, 18, 10, -3, -11, -3, 7, 27, -2, 36, 15, -3, -10, 21, -4, -8, -24, 0, 6, 10, 11, 9, 18, -15, 6, -2, 15, -28, 29, 16, -10, 13, 20, -3, -5, 2, 34, 3, -7, -1, 15, 9, -7, -12, 16, -6, -1, -35, 17, -21, -5, -3, -25, -7, 12, 12, 1, 3, 7, -2, 12, -12, 15, 3, 3, -19, -17, 2, 6, -17, 20, -4, 17, -7, -4, 25, -20, -14, 6, -18, -2, 25, -1, 19, -12, 25, 3, 23, -22, -19, -10, -7, 16, -3, -11, 12, -10, -14, -10, 23, 33, 11, 37, -24, 26, 13, 16, -15]
7462a5J0MJ7Qk0J2K2n1K2m4L0NK3j0l1K1rlJ7rL0rpj9j6J6Qj4J4j8L9o2P7l8l
7497cMj0jJJJ0j6K2Kk3NK3lmj8J4j7LJ9j2k0K3J2%j4mO%Jj6M5j8j0j5K1r%J4k7
7536a4K7pj0K8j8qK0m7RK8MoK1o6M8k7KL8qmj8K5k5M4m1N5p2K4J0Mm3K4M7m0K1
7571B5om3O0l9%j2MpL0%k3J2J7LJm4K3%J3Qj5k6j6M1rk7N1k3rPJJk2nJ8K3j7j2
7609a7L4k5J5nj2K0oj6PQJJJ8J7m6L5m1nj4M0l4K1KK3k1J1Nj7J1j0j2pJ1L3l1
7644fJ2J1j6l4M8nK2l7JL1Ml3pJ9rj2J4qj2L3l4K2komPKnK3qqqRl4M6j6j1j1K8
7683FppK3l9L3P%l3M9m5L1k8j1J2J6k1l0M5J9l0j1O7n9M1k9L1l6J1jljmJ2jj0
7718cOLPnOqqj6OL6m9L1j1J2J5m9J9J8k3J6jj0J1k1Mj9K4J9k2J7l2K7joRM8p3
$$ y = [-15, -5, -1, 16, 24, 4, 16, 38, -13, 9, -35, -5, 0, 23, 13, -18, 3, -6, -9, 8, -1, 29, 20, 13, -6, -22, -6, 2, -12, 2, -16, 23, -39, 38, 0, -3, 1, -9, -10, -9, -8, 2, -14, 8, 10, -13, -8, 15, 12, 8, -10, 4, -13, -10, 9, -3, -23, 0, 12, 12, -2, -6, 0, 0, 1, -15, 30, 12, 2, -13, 8, -1, -1, 13, -14, 13, 6, -4, 24, 6, -2, 18, -29, -20, 8, 12, 6, 27, -39, 9, -18, -16, 22, 14, 10, -8, 17, -8, 36, -5, 50, -22, 2, 12, 16, -27, -3, 44, 4, 25, 19, -24, 36, -3, -3, -15, -11, -18, 12, 12, -11, 1, 18, 21, 22, -22, 1, 1, 14, 22, 7, -19, -35, 6, -3, -30, 21, -2, -11, -4, -3, -2, -24, -29, -11, 12, -5, -17, 17, -8, 7, 2, -10, 10, 4, -12, -5, 3, 4, 5, 23, 40, -6, 29, -12, -17, -31, 9, -25, -4, -2, 21, 0, 11, 16, -1, 10, 0, -12, -19, -8, 25, -6, 6, 17, 1, -33, 15, 10, 32, -5, -4, 27, 31, -2, -9, 10, 1, -11, 3, -5, -17, 16, -18, 4, 2, -4, -8, -1, 1, -4, 19, 11, 3, -5, 4, -30, 16, 0, -11, -22, 6, -1, -8, 15, -24, 9, 16, 16, -17, 32, -13, 18, -10, -21, -9, 7, -14, -44, 1, 20, -10, -21, 46, -13, 28, -1, 30, -6, 5, 4, 1, 0, -4, 8, 7, -3, 3, 6, 13, 8, 14, 6, -2, -18, -12, 24, -25, 6, -5, 7, 22, -27, -8, 10, -13, 3, 2, -8, 3, -18, -14, -33, -9, 10, -12, 5, -27, 0, -1, -7, 2, 50, -23]
7755b3K8J0j8L2j0j3k5PK3Lj8PJl1k8L0K7LJNpj4J4J1k1kM4l2L%j2kjK6j3rj0
7792a4kJ5j5lL5j8%kj6L3k9L2k1oRJ4Mj8J8j0pK6m2kK1K1l6K3ok1L9m5M0Llj8
7828aMjj8mK6MrlNqJ9KPm1J7L3k7Ok6J9k2K6j1M%J3l4NJ8l9NL0oj0K4j0j3kK6
7867Hmj1J7k0kJ7J4noNl0M2k9l6M1nL2rkl4M8m0j1K7qNJj3pL1l8J4%J1Mj5j9K3
7905dJ8l4J4J7Mrkm2K2L5k5NRJ0qql2J3Nj3J9QpJ5Kj8Lk6J6nJ5J2k4L1l4K3k5
7942b0K0mNj1N7q3N2m4N3n4L4K8o0K5rRK2l0J2Rpj4J1Ok2M5m3K3j7K7k5K0ql4
7976b7KmM0mrPQk3J1m5O2j6j9L9j7K0j6l8K7k3J6K5m0J9mk0L7kkL4l7jJ8lmk4
8012a3RJ5j4PRKm0L7jnK4ol1kK4m8M1k4j5K5nJ6Oj1k2M9k0j2OQoK7k4lJ8p%j8
$$ y = [-23, 5, 15, -3, 29, 19, 6, -19, -12, 11, 14, -4, 3, 4, -27, -55, -25, 2, 5, 6, 11, 4, -10, 4, 15, -6, -8, 36, 4, 7, 7, -5, -7, -8, 18, 5, -4, -14, -16, -1, -16, -19, 16, -2, -2, -4, -20, 13, -16, 16, -5, -11, -2, 12, 16, -2, 16, 6, -1, 25, -17, -19, 2, 23, -13, 10, 4, -17, 22, -23, 17, 20, 17, -1, 3, 2, -16, -20, 6, 10, 1, -2, 3, -5, 14, 16, 23, -18, -1, 32, 5, 11, -15, 4, -18, 8, -3, 1, 1, 14, -20, -15, 3, -36, -31, -1, -7, -17, 7, -3, -16, -18, 8, 4, -7, 10, -10, -12, 5, 19, 14, 8, 13, -17, 25, -4, -40, 1, -4, 28, 19, 17, -17, 31, -9, -20, 7, -1, 4, 5, -8, -15, 16, -22, -8, -8, 3, 7, -8, -27, -4, 14, -20, -6, 11, 15, 6, 4, -38, -16, 19, -6, -1, 8, 18, 10, 2, -30, -17, -12, -25, -6, 2, -5, 10, 12, -6, -3, -29, -13, -18, -3, 9, -15, 16, -18, 5, -20, 0, -4, 1, -10, 47, -36, 16, -28, 25, -29, 5, 33, -27, -2, -11, -2, 20, -10, 2, 11, 4, -10, 1, 7, -15, 30, -13, 10, -7, 20, -5, 15, 7, -27, -25, -29, 11, 7, -2, 5, 13, -10, 1, -44, 18, 2, -17, 22, 5, 25, 9, -29, -2, -25, -9, 16, -24, -5, -9, -29, 8, 6, 4, 38, 1, 0, 18, 15, 11, -13, -4, 11, -3, 4, 13, 15, -25, 12, 11, 6, 30, 24, -7, -9, 15, -33, 8, -16, -31, -6, -11, 5, 11, 0, -22, 27, 7, -5, 1, 9, 3, 30, 6, 3, 21, 14, 14, -4]
8050dL6J5o0J3nJ6l4L3pk2kM3l1K6l2K1j8L0Pl5JK4k3k3K6rJ5krLqj6L3j7KL8
8086B5m0J8lRj7K1k5M1m3K7rj7J2ROj1LJ1kJ6l4KQkj3K6J1m9L3k2LoMMj6M0k1
8123aj4Oj0M4ll0J8j5j1J8j9N1m2j4LL6k1QJ2J2l3%krJ6Lk0oJ4J7j9k4M4Kk4K4
8159A1Jn2L8kJNMjok7M4M0n0pJ6Mj5j0K8l2K4k9Nj3L1J5k6K3p0N8On
$$ y = [-4, 32, 47, -13, 0, -5, 11, -23, 10, 3, -19, -21, 22, -9, 17, -15, 6, -12, 18, 25, -10, -9, 15, -8, -31, -5, -14, 1, -1, -10, -7, -15, -31, 2, -15, -13, 25, -15, 3, 0, 9, -8, 13, -12, 29, -14, 13, 4, -13, -1, 8, 14, 3, 6, 17, 15, 31, -3, -1, 7, 5, -8, 18, 29, -20, 13, -9, -6, -12, -8, -4, -20, 20, -1, -15, -9, -19, 25, 22, -8, 10, -5, -16, 2, -17, 34, -8, -22, -19, 17, -4, 4, 16, 28, -5, -5, -7, -16, 0, 3, -17, -23, -9, 8, -11, -35, 9, 11, -13, 11, 12, -40, -2, -4, -3, 2, 6, 5, -1, -28, 16, 56, 6, -1, 15, 19, 4, -6, 22, -10, 14, -15, -10, -23, 8, 23, -3, 20, -50, 8, 14, 9]
8191I
$$ Imaginary data points
##PAGE= N=2
##DATA TABLE= (X++(I..I)), XYDATA
0@%%%qJ6j6K4l2M0n6P2r3J17j44J76k16K64l12L68m36N11n95O92q01R21j056J208
27F44j376J560j762J987k236K509k811L141l502L897m332M811n333N907o543P244
43C805q018Q883r852J0939j2172J3586j5222J7141j9429K2216k5698L0192l6251
56a9880M4927n8483Q2876j40712N29471O69260l82938j63671k42144q8644j23069
67A06993k5836n8901K073l0397J0935j8101J1693j3150J0007j0072R106p142Q142
80d650n706O425m701N533l276M892k569L545k432K835j670K554j335J657j508
95d06J050j045J085o24O73p73L24m81M59o2K88l63j12k80J46K3J98j08r4j15R9
116a18J85J74J8j32j60p5R9R7K3o1j66nR2J27O6m5j39j26M6Q1N6k6p1j20NO5J15
$$ y = [0, 0, 0, 0, -8, 8, -8, 16, -16, 24, -32, 40, -53, 64, -80, 96, -120, 144, -168, 200, -236, 275, -320, 372, -429, 492, -564, 644, -732, 828, -934, 1053, -1183, 1326, -1485, 1656, -1846, 2051, -2281, 2530, -2803, 3104, -3439, 3805, -4213, 4670, -5182, 5757, -6415, 7171, -8051, 9090, -10339, 11877, -13821, 16371, -19880, 25047, -33436, 49440, -91272, 438199, 1107459, 724521, 560850, 318706, 230062, 106993, 81157, 22256, 24329, -6068, 4867, -13234, -1541, -14691, -4684, -14756, -5650, -12792, -4650, -10356, -3931, -8632, -3099, -6375, -1483, -4052, -507, -2939, -104, -1774, 780, -555, 1102, -406, 644, -401, 684, 60, 733, -40, 284, -197, 262, 200, 488, 125, 13, -267, -121, -98, 100, -8, -102, -217, -118, 67, 241, 259, 127, -33, -108, -9, 88, 111, 50, -116, -121, -29, 98, 164, 119, -20, -146, -100, -19, 37, 11, -60, -180, -175, -110, 5]
143EP8j02o5K7M6N1P7o7l7q9RP5J9R0j28l4J3L1R2kn7n7o7ML7M7k7j9o4P5LR8
175F2k1n2l1nK6M9%j4n1mL3L8K2j1m0l5J5K4L5n8j0l2kL5K9K4k4o2M5k7N7lrk6
209b3k9M0LL2Nk2k7L1j0K3j3j4qRnj6Qnj5ppK8K6J7jl2j9M4nkql4L2KL1Kok2j4
248a1M4j5j0ojqk0j3K6LRK7k5J0Nj5pK6kl0Kj8N6m0J6nqJ4j1oJJ4k3L7Nl7J5J3
286A2k4J8J7j2Jkk5L9k8j0K2j7RJ8K1j3m0L2j3lj8j6K0rK6k9L6%oK4j7J3k3o%
321cj9L8k9J9K7qJm8J5J0Qj2Pnm0O0k5KK0J1m5J9Pk1J1J5ok2R%J4k2J7lj3J0o
358gKK1J6rl0J8MJ1k8J7%K5k0j8l2Pk1M7j3qJ5pKmK2k7K4pJ3Ml7QmK8j9K1l8M6
396B2k6K8l4L2j2K8jn6L4Lok1ljK2J5j0k7j2J6K2k8M0j2oJ7nm7M4j9LoK6oJ0m
$$ y = [5, 83, -19, -84, -57, -11, 40, 117, 50, 13, -76, -67, 8, 27, 117, -11, -45, -32, -1, 91, 89, 32, -25, -92, -88, -51, -4, -31, -50, -114, -39, -36, 62, 41, -11, -42, -47, -21, 28, 28, 14, -37, -41, -8, 30, 52, 41, 1, -34, -19, 5, 40, -18, -28, -60, -62, -27, 2, 26, 2, -60, -15, -42, 15, 12, 3, -23, -52, -12, -9, 23, 28, 6, -21, 10, 0, 23, 10, -4, -12, -3, -8, -24, -16, -21, -36, -43, -50, -22, 4, 21, 20, -12, -31, 13, 8, 6, -2, -36, -4, -2, 29, 31, 25, 3, -11, 33, 18, 8, 2, 1, -7, -27, -40, -14, -11, -2, 25, 0, 10, 15, 0, -7, 19, 17, -13, -11, -29, 27, -13, 3, -2, -10, 4, -7, -13, -12, 2, -21, 16, 21, -16, -1, 12, -12, 6, 23, 11, 12, 10, -15, 24, -4, -14, 8, -9, 0, 18, 39, 26, -14, 18, 5, 2, -16, -32, -12, -21, 5, -24, 12, 12, 6, 30, 13, 26, 3, -3, -3, -22, 16, -13, 6, 33, 25, 26, -22, -7, 3, 11, -1, 6, 1, -39, 21, -4, -2, 18, 29, -16, 3, 10, -11, 0, 15, 9, -13, -4, -4, 10, -12, 5, 2, -11, -1, -7, -5, 16, 32, 23, -7, 11, 15, 26, -2, 15, 15, 40, 20, 2, -30, -23, -44, 3, -10, -18, -3, -10, -8, -12, 10, -17, 7, 0, 13, 17, -20, -12, -16, 12, -7, 14, -24, 22, -4, 24, -10, 22, 10, 38, 37, -19, 15, 18, 12, -9, -12, -13, 9, 24, 14, -13, -25, -9, 13, -15, 25, 13, 7, 24, 19, -28, 16, -3, 0, -6, 20, 14, 24, 20]
432B0j4J9k1Nk3mKNJ1kRk9M2nkml1lK4Lj9K3oj0J6J1j2J2k4J8j7PrM2n1K6K6k2
470A3j5k8K8j8OJ9J4l4L1k1OK8l3k4N3k1j2KJ3J6l1J3j3J1RKJj9J2k1MLJ4Rl0
505a3RJ7j7M2m8K7Qm0J7K1k6j3M3m8M4l8L1k9K5k8K5J9j6Mjk1Rj6K1j5OKj9QL4
540B4j9J7J2k0KorQj7K5oj0Qm0L5J5j0j1JrK2k7J4m9K9NK4k0j2LMJ2n%rJ7NJ3
578A6J9j5j8J4lj3j3J5mJ9j8K1m7L4KJ5j0j4k3J9k3K9Nj9RJ1k5L4k2j0RlK7Jk2
613cKPj9NK5k8j0OK6lj6pQj8L7l4M2k0j7K6pL3l3j0PK9l3K1nJ9l5k2O2l0rK7k0
650Ck3L5rJk0K6j0qj7K0oLJ1J0ppQQnJ0k4NL2j1l9NM0k5J5l5kJ5j8J3M4j7nl3
688a7PK6rLk0k8K7L9j9rlj8M6k7J8k5K8l7K7j2nNj9Q1p2K8KqK3o5M1nK2jl9M3
$$ y = [20, 6, 25, 4, 9, -14, -18, -16, -11, 0, -2, 7, -22, 20, 15, 13, 9, -22, -25, -1, 2, -17, 6, 0, -10, 6, 17, 5, 17, -7, 11, -6, 1, -8, 34, -17, 9, 35, 13, -2, -30, -2, -20, -14, 5, 19, -15, 16, -5, 1, 29, -4, -28, 25, 4, -8, -6, 7, 23, -8, 5, -8, 3, 12, 14, 15, -4, 8, -13, -9, -6, 8, 17, -13, -4, 13, -4, 38, -10, 17, 25, -15, 2, 23, -3, -16, 27, -21, 23, -15, 16, -13, 12, -16, 9, 28, 12, 16, 15, -6, 3, -13, 8, -7, -1, 1, -18, -10, 24, 5, 22, 34, 14, 16, 10, 1, 9, -8, 17, 11, 1, 9, -31, 4, 19, 9, -2, -1, -10, 12, -15, -1, -50, -21, -16, 8, -12, -24, -21, -17, -5, -10, -10, -19, -2, 3, 16, 35, 20, 2, 16, 13, 0, -13, 2, -2, 17, -1, 20, -27, 7, 9, 24, 14, 0, -23, -4, -27, 2, 7, -12, -3, 8, -17, 17, -5, -15, -6, -9, 18, 19, -3, -1, 6, -13, -8, 17, -11, -21, -15, 11, 8, -8, -15, -7, -25, 12, -22, 20, 0, -17, 9, 2, 35, 2, -8, -1, 28, -5, 16, 11, 30, -5, -27, 35, 5, -4, 23, 3, -20, 15, 6, 7, -13, 13, 3, -5, -22, -2, -8, -5, 6, 16, 9, 2, 10, 18, 13, 23, -1, 4, 36, 25, -14, -9, 31, 6, 21, -14, -16, -1, -19, -6, 38, 21, 16, -17, -10, 16, 7, 10, -10, -38, -11, 28, 9, 0, -3, -21, 25, -2, 16, -9, 19, -18, 9, -3, -8, -3, -22, 59, -13, 15, 17, 9, 32, -33, 8, 3, 25, 24, -15, 28]
724B8j5NK1j9l6j2L8qMQJj7qlK0Rk5MJ2nj5J1J0oJ4m3J3J9%jL3l2J0j7J2Ll4M2
762B1l8M9m8K6ql9O7j5k6K2j5oJ1nJ7k4J8j5J9k2j0JJ8J0LrkNk5M9k7j1J0lqJ2
798Bj0J4k0j8K2J7j3J9mk2lK7qJ7j2Mk3oNJ1Pj2L1j6%mMkmok1M7j1j1j1nj2L7
836A0j6Mj5L7nl4L6k1qJ1JjK0k2L3l7L8j6l0K7k5LK5n2M3j0Qnj1L7l3l2M9j1L1
871B9n8J2K7K8o1k1M4k6L2Pj0K9j2k4L6l0J6lk3Pj8J2J2J9k5K8k2K0k2nJ2lNj
905A1l1j3K4K1J0j6J8l9NLoJ3qJ6J0l2QJ2lnqPj0kK2LNj3k2J8M1o5L1K8k6j9j1
942b3L6j4j7K4j3%Lk7M5K1m6J9Jlj1Oj0j4L5k2J7j9NJ2%J4l0K3mnKmqJ9Nj1J0
979A6m1PK6%j7J7j7J3j8K1k1oJ5L9k2l7L8lLRk5j1N2j6l8QJ0l4M6pJrl3L6lL1
$$ y = [28, 13, 18, 39, 20, -16, -28, 10, 2, 6, 14, 15, -2, -10, -13, 7, 16, -9, -5, 7, 2, -13, -2, 8, 2, 16, -27, -14, 5, 5, 4, 37, 5, 15, -2, 10, 13, -21, 21, -17, 32, -16, 10, 2, -37, 30, 15, -11, 11, -4, -10, 1, -4, 13, -11, 7, -8, 11, -11, -21, -20, -2, 8, 11, 2, 0, 5, -20, 29, 2, -9, 1, -2, -10, 2, -8, 6, -14, -32, -10, 7, -6, 13, 9, -13, -16, 11, 3, 20, 8, 12, -11, -17, -12, -1, 6, -6, 25, 9, 9, 5, 9, 7, 3, -3, -24, 23, 12, 1, -10, -15, -27, 10, -6, -2, -17, 20, 15, -19, 17, -4, -12, -1, 0, -1, 19, -3, 30, -7, 31, 15, -15, 12, -13, -10, 15, -37, 6, -4, 4, -1, -12, 25, -8, -40, 9, -2, 29, -29, -17, 10, 38, -23, -44, 0, -26, 6, 13, 3, 32, 20, -4, 32, 2, 18, 15, -8, -1, -19, -7, 5, 24, -1, 27, 5, 25, 3, -2, 10, 7, 12, 11, -20, -33, -9, 12, 22, 6, 24, -15, -10, -7, -13, 0, -8, 8, 18, -14, -6, 6, 3, -2, -10, -3, -13, -15, 7, 10, 15, 2, -20, -2, 39, -26, 5, 33, 7, -12, -23, 13, -1, -18, 6, -7, -7, -4, -31, 14, 35, -11, 8, 9, 6, -5, 1, -9, -23, 12, -10, 7, -12, -7, 5, 5, 19, -11, 12, 8, 3, 5, 1, -7, 12, 17, 6, 16, -25, -18, 8, 8, -9, 8, -9, 4, -14, 7, -14, -20, -5, 34, 12, -25, 13, 10, 13, 22, -3, -14, 38, 22, -16, -8, 2, -32, 14, 7, 8, -1, -34, 2, -1, 30]
1015C0k6m5M2J1J1Nl2J1k5K1M4l3k7N0l4mj0L3k2j0%LJ4j2J4mj3M3l9L9n2K9l1
1048a9KJ4J5j7PJ8rJj8J3OrrJ6k7J0oJ2j9K0J3k8L1l0L4Jk3JKjnQK3j2Qj2K0l9
1086hOK0j6%NJ0J0k7LMJ0k2rNL9j7qk5M3qj5k1pL0PoK1j9Nj0mrJ9Lj4J7J5l4L2
1125B5mk0Ml0K4J7j2Mj2Omj9N2j4%L5l3m6N0k6RLPl3N1Jl6J1j7Nk2J6j2L7K0l8
1161aJ8oK2k5j3j1qL1k7N4k6nj0J1Rl6J2M5k9moLJ6j6oPL2k3Lj0mJ6nL2m4J7j0
1198CRmk0K1k1L7j5k4kN1k1pk3j1j4N5pK9l2j3K1rK3m2j1K0K4j9j1K6Oj7k2Rp
1233a8PK1j1Nk1L4kJ7k1J5J0m1O5m1rlQk8M2j5l0L5K2k8j3Ol3M3J4ql6N1m1KK8
1268B6m2PJ6ol2N9j4K8j5k6K4k9Rjj8NJ2qJ3k7L8j2j0Lkm2L4LMpJ0j0L6j8QRj7
$$ y = [30, 4, -41, 1, 12, 23, 28, -4, 7, -18, 3, 47, 14, -13, 37, 3, -1, -11, 22, 0, -10, -10, -7, 7, -5, 9, 5, -8, 35, -4, 35, -17, 12, -19, -17, -3, 12, -5, 2, 20, 11, 12, -6, 7, 13, 4, -5, 11, -16, -6, -12, 0, -19, 1, 14, -14, 17, -13, 21, 22, -1, 0, 2, 1, -4, 4, 27, 15, 23, 11, 31, -8, -2, 18, 2, 2, 7, 17, 27, 0, 3, 7, 17, -5, -14, -9, 30, 13, 5, -20, 23, 15, 0, -21, -28, 2, 9, 3, 24, 5, 10, 0, -4, -13, 6, 9, -5, 12, 27, -7, 25, 21, 1, 5, -25, -1, 16, 4, 8, -4, 2, -2, -21, 31, 17, 17, 52, 19, -27, 23, -3, 6, 9, 16, -17, 34, 35, -1, 10, -7, -2, -24, -8, -20, 17, 37, -1, 17, 11, 33, 8, -5, -16, -24, 7, -20, 34, 8, 3, -7, 4, 13, -23, -11, 34, 5, 1, -5, -2, 14, -2, -8, -1, 31, 8, 11, 1, -3, 13, 8, 40, -4, 13, 3, 12, 8, -12, 9, -12, 25, 10, -14, -16, 35, 14, 7, -16, -27, -41, 14, 7, 36, 4, -9, 12, 3, 26, -16, -27, -7, 17, -2, -13, 13, 19, 2, -20, -11, -18, -11, 10, -1, 4, -17, 17, 15, 32, 11, 26, 36, -5, 60, 19, 10, 7, 15, -13, 29, 14, -16, 19, 41, 13, 0, 6, -27, 16, 30, 22, -14, 37, -4, -2, 26, -16, -9, 7, 1, -31, 28, 14, 42, 27, 1, 25, -4, 5, 4, -14, -9, 3, -5, 8, -19, 19, 7, -3, 0, -2, -44, -10, -7, -3, -10, 0, -10, 26, 8, 16, 25, 8]
1305Hl6J1K3o%%L2j1k4j1rL2k0J4j7L2p%J2l0LlOL1J5n5K5rK3K1m7j3QJJQRl5
1343a8PRoK1Pnjl7K1J5l0J0j1jK9J1j4L1k5j3pJ3JmnJ%%NJj5mN5l2%Qk1J2j2k5
1383b9L3RJ0Lk3qr%L3j4%PMm8N6l6K1MpPj7j1jK0Pk8K4J4k5l0O0k1k4L6j7J1N
1420A6l6K2qJ3oJ4%m0MK4nj1J0JJ3k3K7qj5j2J7K1j2k2PlrK3J6k8M5j9l2N5j2
1455B7k6j2M4j6k8j7L6k0lLK9m0J1kQK2l2J9jQj6K1l4L0j8j5qLK0J1K1k2%j7L8
1490B4Ml4M%MrL5Ol6l1L3rJoNPJ0k2LqM5k8J5kPl4OJ0L6n3K4j7rL4j2j3kQOl1
1530b9M3pmJ6j0OMoml4J9Rj3J6m5M0kpoJ6KJ3K0l4k4M3k4j3Pn%OMklj2J3J6j9
1569a0pK0j1L8l7kpKJ7k6M4l2J0J0k5RJ3%k9J6Lk2mM0K2n0PJ0qPj0K1j4K2k2K
$$ y = [8, -28, -17, 6, 0, 0, 0, 32, 21, -3, -14, -23, 9, -11, 3, -14, 18, 11, 11, 23, -7, -4, -7, -1, 30, 45, -10, 15, 6, 29, 50, 3, -10, -2, -1, 0, 8, 17, -18, -11, -2, -8, 13, 20, 15, 14, -23, -2, 13, -17, -7, -18, -19, 10, 21, 7, 38, 13, 0, -7, 6, 7, 3, -2, -1, -1, -1, 4, 5, -10, -14, 41, 9, 9, 17, -4, 8, -4, -29, 4, 13, 23, 26, 3, -5, -14, -14, 19, 5, 5, 12, 16, -32, 24, -12, 9, 13, 6, 13, -4, -15, -16, 4, 11, -17, 7, 21, -4, -34, 26, 5, -19, 17, 0, 11, 16, -20, 2, -6, 7, 1, 15, 15, -25, -21, 3, -2, -13, -3, -2, 11, -12, 15, 7, -8, -20, -3, 18, 6, -16, -9, -12, -21, 2, 18, -10, 35, 16, -16, 39, 27, 1, -11, 33, 17, -11, -28, 8, -12, -15, -12, 17, -23, -12, -14, -6, 16, -16, 3, 2, 10, -6, 15, -19, 11, -7, -22, -30, -27, -7, 4, 25, 3, 3, -14, 24, 28, -6, -2, -2, 2, -7, 28, 34, -2, -33, 0, -9, -8, -14, -9, -2, 8, -14, -11, -19, 26, -2, 13, 11, 18, -16, -10, 0, 36, -17, 7, -10, -19, 15, 3, -10, -12, -4, 2, -29, 14, 7, 3, 19, 9, 15, 19, 13, 9, -25, -6, 3, -10, 6, -39, 1, -1, -8, -14, 2, 4, 17, 37, 3, -21, 22, -2, -15, -8, -13, -13, -7, -3, -5, -8, -20, -7, 9, -10, -17, 3, -8, 30, -7, -9, -16, -14, 3, -23, 21, -11, -1, 9, -16, -7, 6, 6, -23, -7, -4, -26, -30, 10, 32, -18, -11, -1, -9, -2, -12, 9, -5, 17, -5, -3]
1605cL6Ok9l3M8Ol3Kk2LK5K6l1j7N7l9J2J0k1j4J3kMRpRk0pJ9K1j0On1K7J8k5
1641glJ6lr%pjJ6MMj1j5K3m3L3kJ1k1K5jj9K1l7RPK5MRk2J4l2J1oPJ0l1L4k9r
1680b5L9pOj3PmomKL4k0Jj5K6m0K1m0M0qJ4Mm2N0m8J9k9M8m3L6j5O%J0PJ1j6M
1717A0l4PK9KJ7l9L8rk9K9j3%k5J7L3j4jLj4j8J4J0k0J0lJ2mJ4j8k1L5j3j0j8
1751b3JK9kk8QJ9j5joM1qm8L5k2M6%l3j7PK4l4L1k8L9m9L6k1RkJ5Mj3J6j6K5l3
1787a4J8PJ1qkj6L1Mmk3k1M2jj7Mpk1L8l3K2k3K5k3K2k8rK5J0kk4M8l8L5k9Ok7
1823b2K9j3%J1k4J3J8k9L1pJ0n1J2M4l1qL7j7Nl4j0M2PJ5rk6L8ok0LPJkJ1j7M
1859A2j0Nk1M4l7j2M5j6Pk2K0l2J0kJ1Ok2LJ5pPK2l4L2l2K2nj0nNkm1M7lJ2mm0
$$ y = [-3, 33, 39, 10, -23, 25, 31, -2, 0, -22, -19, 6, 32, 1, -16, 41, 2, 14, 24, 3, -11, 2, 0, 4, 13, 6, 15, -5, -12, 7, 28, 18, 24, -27, 0, 18, -7, -10, 6, 3, -6, -6, -13, -14, 2, 6, 10, -1, -16, 7, -36, -3, -5, 6, -15, 10, 9, -10, 11, -26, -17, -10, 15, 19, 28, 6, 20, -12, -1, -7, 0, 10, -21, 13, -16, -25, 14, 7, 13, 0, 7, 3, -3, -7, -5, 29, 9, 10, -5, 21, -19, 2, -38, 2, -6, 8, 12, -30, 20, -28, -9, -38, 10, -33, 3, -12, -6, -6, 4, 11, 22, 6, 10, -24, -17, 12, 14, 31, -8, 30, 21, -8, 21, 8, 8, -17, 0, 33, 19, 18, 21, 7, -11, 3, 13, -7, 3, 0, 12, 8, 22, 4, -17, 18, 5, -5, -23, -22, 7, 5, -23, -15, 4, -11, -12, -18, 23, 15, -33, 2, -20, 26, 26, -7, -24, -17, 7, -27, 4, -24, 15, -34, 2, -19, -10, -12, 3, 7, -6, 10, -6, 19, -14, 4, 11, 22, 14, 12, -4, 27, 31, 27, 4, -17, 25, 24, 7, 11, 4, -17, 21, -12, 10, -13, 12, -11, 11, -17, -26, -1, 9, 7, -17, 31, -7, 28, -1, 5, -22, 7, -6, -6, 5, -19, -6, 12, -17, 14, 7, 17, -34, -22, 22, -9, -17, 20, 3, 8, -26, -36, 6, 13, 28, 19, -7, 31, 25, 5, 8, 15, 16, 14, 25, 8, 12, 2, 7, -14, 30, -7, -19, 26, 10, 17, -5, 15, -17, -7, -9, 2, 8, -14, -11, 4, -3, 4, 26, -8, 24, -8, 14, 9, -1, -6, -1, -3, -44, 3, 0, 12, 8, -32]
1896c2J8M4m8L0rj3K4k7L1k0J5J6m5J0Qj9L5k6L6k8K0j0k3L7Jkk8J9K1Ml3j6L4
1929B4m6K5NJ0k9JkQl0J4K4Qk6J9k7K3j8J8K2l6K5k2K1j4j9K3lj1L1l4qK5J6k9
1963a2%K3J2j3j9J8L6k6l4L0kl6KM6j1mj8L8l2j3K7j1J2J2k7L6o6K2J9mJj4L5
1996B7l4OK6m5KK5j6j6K9j9J8l4K1J8qk1J1J5K5k3qoL2j3m6L0J8Rj0k0N2l4JJ0
2030B2k2MPKjj6K9j9j0J1j8J3Jl4OJ2rN6l0l4L9k7j7M3j5K1kJ7l3Kk2L4K5j8K
2065A9Mj6k7K8l3M4K1k4l3K7qJ0mj3kj0M4j8J3l0J3J5%l0RK5k1j6mK5l9M5j5m
2099eJ0oJ7qj%Mj4RJ0l5K6J2pk7NJ2NMj7K4l1QLMj8jKL2Oj5k9J9Lpjj7JJ5J4k0
2140a4J7J0k6K2k1J3JK4l0J7j5L3k2kj7J7Jk0%K8rj5j5QJ3k1K1j0K8k0J2j8j5
$$ y = [-32, -14, 30, -18, 12, 3, -10, 14, -13, 18, -2, 13, 29, -16, -6, 2, -17, 18, -8, 28, 0, 20, 10, -13, 24, 25, 23, -5, 14, 35, 39, 6, -10, 24, -22, 3, 8, 18, -11, -10, -12, -4, -34, -20, 4, 12, -14, 5, -22, 1, -17, 1, 23, -13, 12, -10, 11, -3, -22, 1, -2, -13, 18, -16, -24, 1, 17, -12, -12, 11, 23, 10, -9, 9, 45, 19, -15, 15, 13, -23, -21, 25, 14, 10, -8, 30, -2, -15, 12, 1, 13, 25, -2, 34, -32, -10, 9, 5, 6, -8, 27, -7, -1, 25, -20, -18, 7, -9, -25, 4, -15, 3, -31, -10, 8, 0, -21, -10, 5, 30, 7, -1, -7, 25, 12, -34, -4, 14, 23, 13, -7, 45, 11, 12, 22, 0, 4, 11, 13, 12, -4, 25, 6, -4, 7, -11, 2, 3, -31, -25, -13, -22, 34, 4, -30, 9, -18, -35, 8, -7, 14, 12, 29, -4, -2, -24, 10, 35, 17, 19, 23, 7, -20, 8, -25, 19, 40, 16, -17, 10, 2, 12, 8, -5, -7, -17, 27, 9, 22, -8, 5, 20, 20, -10, -1, 24, 3, -13, -17, 8, -31, 14, -1, -5, 5, -1, 16, 8, 7, 7, 11, -3, 6, 16, -19, 7, 19, 12, -15, -10, 2, 7, 11, -6, 18, -13, -5, -2, 2, -16, -17, -15, 17, 23, 8, -21, -2, 1, -6, -7, -24, -23, -8, 6, -14, 3, 13, -13, 9, -12, 1, 2, 26, -4, 13, -2, 31, 9, 7, -10, 7, 8, -12, -12, 16, 7, -8, -23, -15, -2, -23, -2, -12, 16, -4, 8, -10, -25]
2173b5k4M7l7L4k7M5Lk8J4kL8l9J1m%k3nM7K2k5n0NK8Ol6%K5k1L3Kj6mLJ3Oj6
2209@k4L3j2kPj9OpM7k0j9M1qj0oJ6l2M0n1L7j6l2NJ8QNmj2L2l0j4J0J1j0j9L8
2245GJ3j9Jjj0j8L4j7J9k1J9j3K4j5j6J8jrrQrK2rpJ3kqJ0J2rMl4L0Qj2nj0oJ3
2284eJ1k9MLqK1L3k3J0Kjl0K5k1j8L2l1M5qk9%J6J3j4j2J7J4l3QRrkK1l8K1J6
2320A0kLj5qj0J0K0k2J3K4ql3J4Nlmk4J4lJ1J9k8L3l3Pl6N2j3mL1j7j0mK5l2j0
2356b8L2moM0l0Rm3J6MJ5qk5L9l0K5%j2Lj6L3j5j8MQK0rmmjJ2L2n4qJ7J2J7k1
2393BJ9j3Lj6J7Q%Lk3%k7J9J8L1o7L7k6M5l8J0kl0J8L2m0J8pPPJ9l5OL2k3rnJ7
2430Gk0KK4j8lM3j7k7J8Pkjk0OqLLPQK8l0k3KLJ4J5j3lMjk7L1Ok2kJ4J6l2K5j6
$$ y = [-25, -49, -2, -39, -5, -32, 13, 16, -12, 2, 0, 38, -1, 10, 6, 6, -17, -22, 25, 47, 22, -28, -23, 5, 11, -25, -25, 0, -21, 12, 14, -2, -6, -3, 10, 16, 0, -24, 9, -3, -5, 2, -17, -11, -18, 29, 9, -10, 31, 23, 13, 7, 23, -9, 31, -20, 17, 1, -31, -26, -8, 0, 5, 1, -11, 21, -9, -23, -13, -2, -12, -31, 7, 20, 1, 2, 1, -9, -27, 7, -10, 9, -12, 7, -6, 18, 3, -13, 5, 4, -5, -14, -6, -15, 7, -2, -9, 4, 2, -6, 4, 16, 7, 11, -23, 7, 15, 3, -2, -12, -18, -5, 6, -23, -19, -16, -24, -3, 30, 7, 17, 19, 18, -12, 13, -8, -26, 6, -25, 20, 12, -17, -17, -1, 12, -2, -14, 3, 17, -16, -8, 1, -8, -10, 11, -27, -6, 10, 8, 11, -4, -12, -22, -12, 8, -14, -1, 23, 15, -18, -4, 1, -2, -6, -30, -16, -19, -8, 11, -17, 16, -17, -10, -46, 6, -7, -11, 20, 3, -7, -11, 14, -18, -28, 4, 0, -6, 34, 4, 13, -30, -14, -10, 5, -3, -28, 11, -19, 6, 6, -6, -3, -19, 14, -1, -19, -15, -7, 13, 4, 0, -4, -5, 7, 39, -15, -23, -6, 6, 23, 2, 21, 8, 11, -5, 12, 20, 20, 23, 0, 0, -27, -8, 10, 41, -26, 11, -15, 30, -8, 2, 0, -30, -12, 20, -20, -2, -9, -2, 5, 24, -11, -5, 27, 4, -5, -10, 7, -13, -11, 13, -5, -8, 35, 18, -9, 9, 16, 14, 13, -7, -1, -9, -6, -3, 4, 12, 40, 10, -13, -11, -8, 6, 21, 8, 5, 9, 8, -19, 12, 18, -4, -6, 8, 24, -8, 17, 1]
2470AJ6k7rL1m6J1K5K2m5QK3k1J5l0nL1JjJj1L7k4j0M3m4j6K9j3K3j7L2n5K6O
2504G%j6PLqk9L5lPOj0%KM1o2L9J7kk7J2l9%K9mK6j4J6m1K2jj9j3J0nK9nJ6k5
2542ALLKJ4l8mL7rk3L9j8j6J2J3k5L1k1mmK8n5L0jL9jm1pJ0L6ql4OKMl5L1MRj0
2581@J4MJ4k4K0l8PL7l1Rj1K3j0Jk1j6JJ8Mjj8N7l8j8L1rk1K9j3%J4kj9J9j9L0
2617B3j0j2jqM8l2m%llJ4J7j0k5NK6j4k3J0J1npNJ3rqkJ1j%l5L6k6J1KK4m7j3
2655d2M6kk1J5K%k9MO8k8j4j0L8k8K4l2nL1j0j5J0lOJ3k4Mj0KJ9pljK7m9M4j7
2691CM0l1j8L4j5mk6K3qJ%k8K0J1J4Pl4K9%m8N3m3KJ1kK2j3K1n4K3PM6o3K6ok9
2727b9OK2J0j0Rk9j5K0kM7j5mk6J5k4J4J5j5RJ9m0ON0Kk4J3Kj1Oj1j5k1J4K6l6
$$ y = [1, 17, -10, -19, 12, -34, -23, 2, 24, -21, -13, 10, -11, 4, -26, -31, 0, 1, 0, 1, -10, 27, 3, -7, 36, -8, -24, 5, -8, 15, -2, 30, -25, 1, 7, 7, -9, -2, 1, -7, -36, -1, -4, 3, 9, -1, -1, 1, 42, -20, 19, 36, 34, 7, 19, -20, -20, 9, 5, 31, 17, 33, -8, 14, 13, -6, -19, -9, -14, 15, 10, 26, 1, 4, 7, 9, 23, -15, -19, 18, 9, -14, 25, 7, -9, 3, 16, -9, 22, 1, -3, -7, 21, -34, -4, -5, 34, 33, -8, -15, -5, 31, 23, -11, -5, -3, 1, -34, -3, 1, 10, 0, 14, 18, 32, 8, 28, -10, -3, 34, 3, 12, 1, 24, 14, 15, -6, -22, -21, -3, 1, 0, -18, 39, 1, -17, 14, 5, -16, 13, 0, 0, 14, 12, -7, 12, -7, 23, 13, 1, 0, -8, 40, 8, 4, 4, 1, -2, 12, 29, 19, -6, -1, 25, 11, -12, -2, 9, 4, -3, 2, 15, 6, -2, -4, 7, 6, 6, -29, 7, -19, -8, -6, 18, -29, -42, 4, 2, -19, -4, -2, -2, -31, -27, 41, 13, -1, -11, 27, -1, 23, -9, -14, 17, 7, -8, 2, -1, 5, 18, -6, -2, -12, -10, 9, 2, -1, -2, 25, -24, 20, 3, 43, 12, -6, 28, 13, 9, -17, 6, -2, -1, -1, -29, -9, 2, 16, 23, -11, 18, 18, -30, 23, -20, -18, -7, -9, 13, 0, 21, -33, -10, -3, 43, -20, 6, 0, -29, -23, -1, 9, -1, 8, -21, -36, -16, -18, 29, 14, 10, -16, -1, -25, -11, 4, -11, -2, 17, -23, -17, 33, 35, 11, 24, 26, 15, 21, 10, -5, -26, -12, 14, -22]
2762b2OK6kJk7RL7j7k5Mj5K5%j2j5K3k6M1K4m2OK4Lk4J3pOMqPk3r%j0j8M2J4K3
2800C6l5Rl7K2qK4j4K5k3j5pL2rKK3m4NJ2KnkK7k4j0K5J6k8J4k6k1N2k8k0J9J8
2835GNn4L5PJ3oJ8j9L0j5j1K4k5j6NPlMmJlQj1j2%K8kj6J8k9J7j2j1L5l4oJ1Q
2873hrLNj5K7j2J6l4K8j4OL8j2j4J4k4QkRlJ2l8L8j2Ml0L4j5oLjj2J3RJ3l3L1
2910A7l4j8L4L3k4l9N5k7K0Mok8L0Poj1pqj1M4n2L9k2oJ3j2K5nL3n6J9J6k8PQ
2945DJj1J3j8J0l2K5nnJ6j0oJK3j9K1Ojj2Jj7J9j8J3j9J0M2j4l2rK3qqL3Mrn6
2982d4M5MJ1k6K6Jqk7JL5j8m0J1M6j3J5m9K0J4Qn1L5KRj9N4p2M7rl5Mj5M7kj9
3017a2JK7k5K2l9L4k6K9l6J6K5%j4pJ7k6J3Kqj3L6j1k1QK9l6L4J9n9K5J4j4k8
$$ y = [-22, -16, 10, 8, 9, -18, -9, 28, 11, -14, -10, -25, 0, 0, -12, -27, -4, -30, 11, 35, -7, -1, 23, 26, 2, 15, 8, 14, 18, 10, 17, -6, -15, -15, -25, -43, -1, 13, 36, 1, 10, -27, -5, -13, 11, -3, 22, -1, -16, -23, 9, 0, 2, 25, -19, -14, -2, 0, -5, -7, 20, -4, -14, 11, 27, -1, 13, -13, -34, 18, -10, -30, -11, 7, 12, -42, -7, 0, 13, 7, 25, 6, 36, 21, 10, 34, 9, -7, -2, 5, 2, 6, 2, 3, 0, 8, -3, -15, -15, 13, 11, -5, 13, -16, 1, -11, -22, 13, -21, -27, -16, -8, -17, -14, -9, -24, 3, -9, 7, -27, 1, -13, -7, 31, 19, 5, 19, -5, 3, 1, 10, 7, 19, -19, 19, 7, 11, -19, 15, 0, -6, -3, -4, -16, -3, 6, 19, -14, 17, -17, -35, -1, 32, 8, -31, 24, -3, 17, 21, 15, -13, 17, 24, 18, 7, 0, -8, -19, 25, -27, 12, -10, -16, -3, -15, 10, 5, 38, -18, 1, 17, -11, -4, 4, 5, -6, 7, -11, -1, -33, -8, -13, -18, -2, -12, -18, -17, 6, -13, 8, 14, 13, 1, 2, -15, 4, -14, -1, -20, -10, 32, 18, -14, -23, 0, -8, -16, 17, 21, 12, -44, 1, 5, 16, -10, 16, 17, 9, -18, -17, 18, 0, -40, -29, 17, 4, 19, -30, -10, 4, 12, -39, -4, -2, 7, -12, 42, -30, 17, 8, -27, -23, -38, 9, 7, -12, -11, 16, -9, 13, -26, 8, -18, 11, -25, -9, 16, 16, 2, -5, 12, -14, -1, 1, -7, -20, 16, 5, -16, -8, 21, -15, 19, 38, -21, 4, 18, 4, -24]
3050b4K9lM1j8pl7L4k2L0l8LJ0J6l6K4j6PKlL3l1J0j2l1L2L3k8mJ9k3K0jj0nQ
3085Bj5LJ9j0L1o4L6j6K2Oj0J7l3OK9l3Pmk3L7%jnLK6l3%jmJ2Jj5J7%Njk3K8k2
3124f%J7j0Kj4Ok0M8m6M3j0j5%J4j1K5j7k2M1j1pmJ1m3L5j3J6k4L3qJ0J9nj3j5
3159Fj6jJ9j6J9nj5J6j5J1j5J8nN%l7K9L1l6K6j0Mkj1Joj5J9qK5k1K5lj4K1l2
3195hj0NJ0k1LJ4oL2k8K6k5LL9l6K1j3l5J4J8K9l8LK2k0L8k6Kk6OLL4k0j0K7m
3230B3j5k5LN5l7nJJ8lk2K9k0m%j9M9m2K2l1L0j2pnM1j9l9N3k0MJ7j6jj3MJ5m
3266EokJ6j0j1L7k2P%j2k0M3lk5K2j1j2K4l2L9J8l7MRK3l1Ml2K0LJ3Pl1pj3J7
3302fRMj5K1kJ7k6j4J2JnOL2j8m1J4lJ6j9J8rk5M9l4J1J4j5K4%l8J9%jJ3j0J8
$$ y = [-24, 5, 2, 43, 25, 18, -19, 15, -7, 23, -15, -12, -2, 14, -22, 2, -14, -7, -5, -8, 25, -6, 4, -8, -39, -7, 26, -2, -6, 13, -10, 10, 9, -1, -6, 2, -13, -10, 9, -1, 30, -34, 2, -14, 8, 14, 4, 21, -12, -6, 23, -10, -3, -7, -30, 7, 7, 6, 1, 4, 30, -3, -3, -4, -8, 4, 5, -10, 7, 7, 12, 11, -12, 16, -6, -6, 11, 1, 3, -11, -5, -25, 23, -23, 20, 10, -5, -5, 9, -2, 23, 6, -16, 25, 14, 7, 3, 14, -29, 6, -7, 9, -15, 18, 10, 20, 39, 34, 21, 6, -10, -11, 8, -8, 11, 6, -9, 7, -8, 3, -12, 6, 1, 6, 6, -31, -2, 29, -7, 19, 9, 13, 11, 0, 1, -5, -20, -1, -9, 16, -5, 20, 17, 3, 24, -8, -18, -13, -3, -24, -21, -7, -13, 19, -9, 17, -8, -5, 34, -2, 19, 6, -29, -15, 3, 32, -6, -3, 19, -1, 37, 11, 13, -13, -7, -4, 30, 10, 0, 27, 23, 8, -17, -14, 41, 4, -1, 0, 18, 15, -7, 22, 2, -2, -2, -21, 28, -14, 8, -23, 7, -5, -12, -17, 24, 5, -34, 19, -1, 3, 20, 4, 3, -10, -6, 9, 5, -1, -3, 13, 3, -8, 29, 7, 14, 14, 2, -18, 25, 22, -3, 19, 8, -4, 20, -12, 27, 45, 8, 12, 21, 44, 13, 17, -15, 5, 8, 21, 28, -3, -10, -23, -6, 3, 7, -8, 13, 11, 28, 2, -12, 0, 1, -4, 2, 34, 16, -25, -11, -14, 2, -17, 1, -8, -33, 16, -18, -7, 7, -8, 16, 16, -22, -3, -3, -4, 9, -1, 17]
3338A7m4L6j9J2Orj1koJ2J5JkqkRKJ6J8n5K0mJ2k7J4j1J0J3r%J6pj6K2l4L5j9
3375Ak2K6J0k2K6m2kL4Kllj8kJ3J3pRj9J2k5M5m5L5l3JJpmL1rlK6Rm3K8rJ7j5
3413Fk3K5OJ0j4K2j9k5JK0n%j3K7l0QOJ1Oj2j4j9RJ9OLk3J3j0K5k0J0J9oJ4k4
3449Ij7J7K2l0J5k8pK9k3OK2OpmL8l8k5K4j6kL3j1k3L8k1j6lJ2K0k0Rj8OJ8Qj4
3485Ik6L5qPj3j8K9j8Kk1J6kJ6l0K8jn1N5RMlj5K1j9L9k1k8PlM3k3mmjJ6m7N9
3522C9k5nj4jJ7Ll7J8QJ7l1lK9k9K2k2L3j0moj8J3pJ3l3L1k4N5j4Nj3j2J2J7j7
3557Gk4K4k2L2j9pj6M0J5k1qmK9qmjj4K0j7J3K3k5RK3Po2J7KNnK6mk5j5j9M6l5
3594a7K4K3Jk6M%m2L1J7rok2K6k%K2j5LoJ1m4J7K7k1m8M0J4j8M5q%j1OLj5LJp
$$ y = [17, -27, 9, -10, 2, 8, -1, -12, -14, -20, -8, 7, 8, 6, -2, -4, 5, 7, 23, 41, -14, 6, 2, 14, -13, 1, -10, 0, 13, 4, 4, 20, 13, -3, 19, -15, 20, 1, -21, 5, 15, -7, 19, -23, -25, 9, 11, 8, 5, -13, -15, -2, 11, 4, 13, -6, 6, -19, 26, -19, 16, -17, -16, -15, -22, -26, 5, -4, -7, 19, 28, -15, 13, 4, 21, 6, -17, 8, 14, 24, 10, 32, 13, -12, -11, 9, 4, 4, -9, 18, -12, -4, 2, 13, 19, 7, -7, -26, -17, 2, 8, 11, -12, 1, -9, 16, -4, 6, 25, 19, 33, 9, -8, 9, 31, 1, 16, -12, -19, 10, -13, -7, 15, 21, 14, 10, 48, 10, -15, 9, -7, -9, 24, 13, -10, 28, 7, -9, -12, 0, 20, 0, 9, -9, -3, 15, 23, 9, -17, 18, 10, 17, 4, -14, 15, -3, -1, -22, -6, -8, 8, -22, 6, 5, -46, 9, 18, 22, 19, 4, 25, 6, 45, 24, -4, 3, 0, 43, 20, 16, 12, 11, 27, -20, 39, 14, 9, -5, -6, 11, 14, -23, -5, 3, 20, -11, -14, 15, -14, 8, -14, 19, 9, 5, -1, -19, -6, -13, 0, -33, -2, -26, 29, 15, 20, 7, -5, 7, 24, 7, -17, 7, -15, 17, -2, -9, -25, 15, 30, 9, 1, -3, 26, 18, 14, 13, -1, 19, 2, 15, 38, 13, 22, 45, 52, -10, 7, 9, 14, 9, 35, 31, 6, -9, -28, 18, -17, 7, 30, 31, 5, 9, 9, -33, -2, 15, 6, 0, -22, 4, 2, 2, 24, 9, 12, 6, 17, -27, -10, 17, -4, -52, -12, 2, -16, 29, 21, 21, 10, 16, 19, 4, 7, 8, 1]
3632AJ7j8NJOj5NJ6k3L0K4m6Mpk3L2nl1K2jL7j4j7K2mJol9K3K1j7J7k1lK7m5J4
3669a0Rj2M3k8kJ1Jok5MK0j4j0K8j6J7k2L3J1l6L0Ro5K6l2L6J2k1L0lk0OKnKn
3705bJ1j8MK2pRk9QlJ4k6M0k2J9l0RKnJ4k3rJ4M1m6jj4L2K3l8KOJ9k5QJM%J9J2
3744C5n8K4lMpJ8m9M5kNJ2k3KjK1k4qJ4KRk1j1RpL4oj7nLk1L3j0K2j9k0K8%k0
3782a2J3k9QL2j6pl7O0j7MpM1l2nJLLj0j3J2mj1J1JK7k4JjJ4M6o6L3j8PJ0joq
3820CkoQnL6pk0j2oRj8L0mk6J3J1J6j0j2j6M%prJ9jNk7M5jok2LJ7PrL4k4l5%J2
3861a3RPJ8m1J4K7j7ok4J0J3L3k8l0J4J8qk0K1oRNRl2J5J9l4K2k2Q%K0OPmj0k3
3898a4Pj3J5pRRpj0LJ7PrpKPoj8K8poj5K5k6ML2omLj5J6j3oN6l1j1j7j4K3kkJ4
$$ y = [1, 18, 0, 5, 6, 12, -3, 2, 18, -5, 25, 49, 3, 7, 0, -23, 9, 4, -27, -5, -6, 31, 17, 0, 22, 18, 19, 13, -26, -3, 18, 1, 18, -3, -6, 21, -24, -10, -1, -13, 30, 2, 0, 11, 12, 6, -19, -15, 5, -9, -19, 9, -7, 10, -12, 21, 32, -4, 26, 35, -30, -4, -36, 0, 12, -9, 21, 18, -2, 4, 6, 1, 3, -2, 9, -9, -5, 17, 10, 19, -10, -2, -5, 9, -17, 23, 1, 20, -10, -1, 1, -4, 10, -13, -22, -8, 33, -13, -14, -28, 4, 27, -11, -9, -3, 16, -9, -1, 0, 4, 4, 23, 35, -23, 1, -2, 2, -5, 13, -36, 9, 7, 12, 24, 1, 3, 2, 23, -1, -9, 5, 7, 16, -5, -16, -7, -14, 20, 14, -3, -8, -5, -26, 7, -3, 19, 0, -20, 8, 8, -12, 1, -28, -20, 12, -4, -11, -48, 12, -5, -1, -8, 33, 1, -4, -3, 0, 3, -7, -20, -8, -12, -23, -12, -11, 16, -8, -7, -8, 6, 52, -14, 19, 1, 8, 18, 17, 11, 3, 1, -5, 3, -2, 34, 27, 7, -5, -11, -2, -20, 10, 6, -20, -7, 4, 20, 10, -2, -18, -14, -14, -21, -30, -11, -12, -7, -34, 11, 10, 4, -18, -15, 2, 9, 0, 34, 10, -25, -25, -13, -4, 3, 21, -20, -6, 21, 4, -2, -26, -16, -3, 30, 2, -28, -14, 4, -4, -24, -3, -9, 0, 5, 14, -18, -3, 16, -18, 4, -18, -10, -10, 10, 16, 23, 19, 9, -14, -7, -20, -5, -12, -3, 6, -1, -11, -8, 9, 16, 7, 0, 2, 9, 3, -15, 13, 6, 0, -15, 10, -16, -12, 20, 14, 10, 13, -2, 14, 1, -5, 51, 20, 9, -8, -22, 1, -1, -3, 11]
3939A1nk5K8K4k1j5%jJ6Mj7J7J2j0Lqk2LK6j4J4k4Oj6rOM0k8J9Jk0%j1Pk1K1K8
3976A9j9rJm0P0j8KJ1l3j0K5K0kk4QkMJ6j9Q%jj0J1k3j8O4k0j0K0jLj7J0j6K3
4012B3k7j4M2Ll8K4K5k6j9J2j6J0K8o4M1j3MM8n3J1j5J5j5J4k1M6j3j7RJ3rk3
4044a5M2j1j5%Pjj5J7kj3RJ0Lj0j7J4MK3m5QnRRlK1l3jk8M9j7K8l9J6pj3J7k4
4081b8L7OjqqJ6NRj6l5J3jj2L6j2j5pRMnL7j7l1L2j4JPj7kJ0RQKk6K2k1J0j0J4
4120AmMJ5l5L5kLPl9rL1k9L4oj0oK6j2pM2l6jJ1J2rqrlK1k8L3k1Ok6%M3l2PJ0
4159Ik9K4KMk1nK5Nj5K5j4KR%J2k3njlmk9M3j7L6Kl8J0kJ8j8J2k6j2J7OL2Mn8
4197b3M5l2oK4rJ0k3K3j6K8j2Rj4M0l5RNl7PK8L0n5JopK5j9L3l8Oj9M0j1nk0J1
$$ y = [11, 6, -19, 9, 33, 12, -3, -3, -4, 12, 16, -1, 16, 28, 18, 21, 13, -9, -6, 20, 6, 20, -4, 2, -14, -23, -17, 23, -5, 14, 15, -5, -5, -16, -9, -30, -9, 19, 0, -9, -8, -48, 22, 4, 6, 17, -16, -26, -1, 19, 17, -7, 1, -1, 3, 19, 0, 8, 8, 7, -3, 8, -15, -33, 31, 11, 1, 21, 20, 23, 6, 16, 0, 23, -4, -18, 24, 27, -11, 13, 38, 12, -7, 5, -11, -1, 27, -37, 4, -9, -5, 43, -10, 1, -14, 1, -14, 0, -21, 25, 12, -5, 4, 17, 8, -15, 27, 16, 1, 1, 8, 7, -8, 9, 7, -6, 3, 13, 16, 6, -11, 3, 7, 30, -15, -7, -12, -3, 6, 3, 24, -9, -10, -38, 11, -6, 22, -17, -1, -8, -21, -4, -28, 9, 15, 14, 6, -2, 14, 19, 28, 12, -23, -10, -11, -23, 13, 1, -14, -21, -12, -8, -13, 24, 7, -24, 8, -6, -5, 2, -15, -17, -7, 2, 10, 12, -14, 8, -13, -3, -13, 1, -3, 1, 16, -19, 16, 14, 17, 24, -15, -24, 7, -22, 12, 6, -4, -10, 16, 4, -3, 39, 3, 2, 13, 25, 16, 8, -1, -4, 17, -11, 22, 1, 7, -19, -19, 24, -8, -1, 9, -20, 4, 6, 10, -11, -16, 9, 14, -1, 24, 10, 12, 21, 21, 33, 10, 5, 4, 1, -3, -32, 11, -6, 30, 32, -6, 4, 2, 20, 2, 14, -12, -24, -7, -1, 31, 35, -23, 22, -10, -16, 8, -1, 9, -14, 9, -7, 21, 9, 18, 4, 44, 9, 18, 23, -14, -7, 21, 51, -4, -3, -9, -16, 9, -10, 23, -15, -9, -28, 12, 1, -4, -24, -13]
4233a3J6kPk6L6k4J5J6j0qoMJ2j2k6N3l3M4l3J2nk8J3J0k7RNj4K1Rmk0j2J7Qj6
4269a2K4l7M9m7M1j5J5k1Jj5L5j5Mk8RLJ3k0OJ7ljM0l4pJ2j5nM6m5jLlK3j6RK4
4306C4m4M3k7oJ0j2k1J2%JJ9J1Jm3NK0j5L7j3j1oJ4nK4j1k3J3mNl4K1K2j4pM0
4341C6l1roJ5j3J4j5%M1m0KJ6J6k6j6M1j6KkL1j1l2J3J7J4J3o4L0k2oK9n2M4o
4375GJ1j0j0L5qj0j1rqJL2l8NJ6j7kpJ1RqK9rj3LJ3J9m6K1jl6N1kk3J7J5k0Pk4
4413a0j1L2RJ8j3k1jj2J2Mmj3nJ9J0k5J8J0j1%KJ7j3j3L6ln1M8n3J4Mj0J0LJ3
4448A0rL5l7J2k4K0J6n1L8km1O0j7l3J5mM5k7OQk2K%j5J0K1%j9J4j1RK9k7Jj3
4483aOJ6qjJ4kJ5k5nj2K8m2K2pK6m4jJ9J0J8J5k2J5m3Kk5NK5J0n2K1L2J5rj7K5
$$ y = [-13, 3, 1, 8, -18, 18, -6, 9, 25, 15, 7, 1, 5, 17, 5, -21, 32, -1, 43, 10, 22, 17, -11, 2, 12, -15, -6, -1, -15, 6, 15, 11, -9, -21, -4, 4, -12, 12, -25, 24, -23, 18, 3, 18, -3, -2, -17, 18, 3, 7, -21, -12, -9, 4, -16, -10, 7, 4, 3, 43, 9, 2, 14, -1, -6, 40, -5, -6, -3, -6, 17, 1, 10, 34, -10, 33, 6, 0, 10, -2, -23, -11, -11, -10, 9, 20, 21, -22, -17, 3, -12, 25, 12, 1, -5, 9, 4, 28, 17, -6, 7, 3, 8, -26, -5, 17, 3, -4, 36, 5, -4, -10, 5, -8, 6, -9, -9, 32, -8, -6, 10, 26, 0, -16, 25, 9, 11, 9, 40, 29, -3, 10, 27, 41, 54, -10, 20, -2, -8, 21, -31, 13, 7, 18, 8, -2, 33, 25, 15, 4, -5, -13, -12, 20, -18, -13, 3, -14, -16, -23, -12, -3, -11, 18, 9, -4, -1, 12, 31, -15, 6, 5, -31, 20, 18, -5, 12, 27, 7, 14, -10, -21, 11, 20, 38, 25, 4, 3, -9, 3, 7, 3, -10, -15, 4, 14, -11, 7, 17, 6, 6, 8, 25, 12, -1, 35, 32, -19, 29, -24, -10, -6, -16, -6, -3, 10, 1, 36, -1, 11, -13, 7, 23, -28, 10, 8, -33, 27, 10, -23, -8, -12, 33, 6, 12, 20, -2, 0, 0, -15, -5, 16, 16, -3, 11, 0, 9, 38, 11, 12, -1, 5, 21, 13, 12, 26, 24, 39, 14, 9, -3, 25, -17, 5, -2, 24, -20, -21, -2, 8, 26, 41, 19, 34, -9, -7, -32, -27, -2, 8, -44, -23, 9, 24, 15, -2, 23]
4519B3qj5pKJ3j5J6j1K4j5LJ5l3j0L8mkj3J1rL4k1j6nj0K2lL1l4lL%J5j5J3Jj2
4556Ck1J6K0j8j4L4o1P0m3J5J3kj0mnJ0rJ0Qmj5RJKJ3k7J4J8onj0QrmJ6j0Oml
4595Bmk2L9j1J6k1Onj6K6j9L4l8K6kj0oL3pl1JlJ2%rJ9k5QK2l6K6j9nROJ2j9o
4633a7K5l8J4J2JK3OJj1k6K9n2L4k6J3LL0rj5mOqMkL1J1j0j9rK2l0lJ1K1j7j4
4669a3jJ6knj4M4qk7J5K7n2K5Lk4JlL6l1MNLk6L4Ml2J1kKPL8l8j3jjK9k6K8J0
4707B3j1j8J0J2j0MMj3J7Rk1K5k9O%lk3L3mljk6K3m0L6l1K2J9k9L1Rl5K7j7nJ7
4743Hj9K1J0k5j6J9K7k7J4j3K0j7NK6o4L9LPm4O0l7L4%k2KJ4k1qJ6j0MLpJ2Ql6
4779a4J1J6jJ6p2O3rj4K0j9n%J1Pj3K3okj2J6j2j9J8J4j6mJ9m4N3K0o6J0KJ3j0
$$ y = [23, 15, 0, -7, -5, 8, -7, 9, -2, 22, 7, 10, 25, -8, -18, 20, 16, 14, 1, 12, 3, 37, 16, 0, -5, -15, 7, 4, 35, 1, -2, 1, 1, 16, 1, 14, 15, 3, -18, -2, 18, 0, -14, 20, -41, 29, -14, 1, 14, 12, 2, -2, -7, 3, -6, 4, 12, 8, -7, 2, 3, 5, 18, -9, 5, 23, 17, 12, 2, 10, 1, -3, 13, 3, 9, 5, 2, -2, -24, 15, 4, 20, -1, 5, 0, -16, 10, -9, 25, -13, 13, 11, 1, -5, 28, 21, -10, -9, -12, 0, 0, -9, 10, -15, -7, 15, -21, 5, -14, -19, -10, -4, 8, -11, -17, 8, -30, -16, -4, -3, 20, 26, 27, 16, -10, 19, -33, 1, -25, -12, -9, 21, 12, -3, -7, -1, -9, -5, -7, 24, 35, 25, 6, -3, 19, -11, -14, -3, 18, 1, -13, -14, 2, 0, -5, -19, 25, 17, -10, 5, 32, -20, 5, 8, -16, -15, -18, 18, -13, -9, -4, -1, -27, 7, 11, -21, -10, -12, -10, -3, 35, -3, -16, -17, -18, 11, -15, 13, 23, 12, -6, 4, 16, 6, 10, 14, 1, 18, 27, 6, 31, 2, 8, 8, 5, -18, 15, 11, 8, 7, -19, 4, -36, 0, -31, -9, 10, -19, 12, 21, -14, 13, -4, -9, 8, -11, 10, 20, -5, -21, -2, 25, -2, 12, -1, 19, 2, 7, 33, -31, 8, 11, 18, -26, 34, -3, 31, 31, 9, 11, 25, 4, -4, 12, 2, 6, 9, 2, 14, 22, -14, -3, 13, 12, 28, -44, 19, 10, -4, 16, -3, -8, -8, 3, 10, -3, 20, 14, 12, 0, 16, 4, -15, 3, 17, 1, -3, 16, -28, 25, 45, -21, -11, -9, 4, -6]
4814fMJ6k3Nj5J2%Jj2K8j1J1k9J5k6K8NQj9K3j7p%L1k6oK4l4L9qj5j3J6J9qkn
4851CK3mNk5KPm4P0l8j4L6l7kL9j6J1k1LK9l0J3m3K2j1L2j7RJ7k3LMk1K5k3K0
4886Dk7M6j4j2K9k9kJ1LJ4l3J2j3k1J9kK5olj5L8j0k7J1%k3PJ6J0j5J0K7l3j7
4920b0L6lJ5k7K2j4j6nnJ3kK3j2Qnj5J1l0J8OJ5pk3L4jj6MM9n7lqJ9K0l6JJ0j5
4957a6LmK4JKjPk7K5Ok7J0k0K4n2K9j3K8Oon1N1j1j0K8k3K4J1l6K4k9K1J8lk1
4992hRJ6k9j9M0k3J4mk9K5jJ8k5RK2k2j7J6L2Lk8MJjNj2J1k2K2Oj2L7j4Kk1oo
5029goOK1jl5J8J7J1k9Qk1j8L3mMPQk0Qj2K9olqmpk0M2l6K4l8J5J7K8j7kj4Rl
5068fL3k9pLKJ4lJ5Nk1J0Ok5J2nJj7J3Rj7j0K6Ol3L1j0j4LK5Pl3k3J3J3oK9l5
$$ y = [-6, -2, 14, -9, -4, -19, -7, -7, -6, -18, 10, -1, 10, -19, -4, -30, -2, 3, 11, -8, 15, -2, -9, -9, 22, -4, -10, 14, -20, 19, 11, -4, -17, -1, 18, 10, 8, 3, 26, 22, 27, 2, 4, 11, -33, 37, -1, -15, 21, -16, -18, 21, 5, 16, -5, -2, 27, -3, 10, -33, -11, -22, 10, -7, 2, 19, -4, -1, 3, -18, 7, -16, 4, -23, 23, 9, -3, 26, -3, -5, 6, 9, 23, -10, 2, -11, -32, -13, -15, 10, 4, 1, -14, 24, 14, -13, -2, -2, -25, -18, -2, 8, -7, 3, 30, -3, -20, 16, 13, 28, 1, 23, 9, -7, -12, -17, -4, -6, 17, 5, 13, 8, -7, 4, -26, -8, -2, 13, 6, -17, 17, 16, 0, 4, 53, -4, -7, -15, 4, 24, -12, -11, -1, -16, -13, -17, 7, 8, 10, 9, 16, -11, 14, 20, -7, 3, -17, 7, -45, -16, -29, -1, 5, -1, -52, -1, -12, -22, 6, -17, 7, 18, -18, 6, -23, -2, 16, 13, -8, 1, 17, -12, -31, 9, -14, 0, -4, -33, -8, -9, 9, -16, -7, 15, -7, -24, -8, 24, 27, -1, 3, 4, 3, 8, -4, 7, -15, 7, 13, 1, 38, 24, 26, 5, -1, -7, -13, -7, 14, 13, -22, -4, 13, 24, -5, 3, -18, -36, -3, -7, -3, 4, 12, -8, 0, -12, 17, 11, 8, 0, -4, -11, -31, 11, -25, -1, -39, -24, -7, 21, 4, 2, -12, -3, -6, 27, -2, -9, -6, -4, 10, 7, 22, 27, 6, 16, 22, -3, 9, 4, 5, -12, 1, 10, -7, -17, 9, 15, -18, 13, 3, -11, -8, 17, 24, -9, -32, -19, -6, -12, 17, -18]
5105a8K5j3lpqL4pRrK5j0j1j8kK1J1l4K0l4K6KK3m6J7J4%j4j1mK4J4j4k2L1k3
5140a2J4j3NmkRJ9l2j4L2pmK6l7M5l4j5J6KK8k8L9l4l0K1J0J7k7QNl7JK7kRJ3
5176A4Om4K5m%j2L2pJk7K4j9k9M1J9k0K0pj2j2J0j6jN5n3J9kJ2m1K2K2m7L8l1
5210b4PJ1qjRN%okOQK3n0J4l4L8J0kJ5m7K0j1J2k5L8j8k1L2K8m7K9k3QM4k7oJ9
5247B4%k4J6k6J7K3Nl9L8l3J4Jl6K3j2K3oJn1O9j4k1Lj9KK2MK1j5k0j3%J9j3J1
5282fK0mnL1m0lj1J2RK6l0J2O%j3J0kk6mK7mk7PL2j5Lj9J5j8L8k1l0M2pLmQrM
5321GK2o4K2K3l8M0l5M3k2j3j9L1j5J6NJ0k0%J8J8l8j0J6qLjJ8K8l5j2KJ1qLK3
5356B1k8L5j8J3m4J0%J4j3K3J%qqOJjPl0L3j7J1Rjj7%L2l9J5J0j2q%j0j9M4%j
$$ y = [-18, 7, -6, -9, -16, -24, 10, 3, 12, 3, 28, 18, 7, -11, -13, 8, 19, -15, 5, -29, -3, -1, 22, -24, -7, 7, 7, -7, -18, -22, 2, 16, 2, -20, 11, -12, 2, -11, -6, -10, -12, -3, 16, -16, -30, 2, -5, -9, 17, -20, 25, -9, -24, -8, -6, 22, -6, 33, -1, -31, -10, 0, 17, -10, -2, 3, -34, -33, -6, -8, 1, 14, 20, -24, 1, -3, -3, -15, 17, 10, 11, -16, 8, -11, -40, 1, 20, 0, 20, 13, 1, -11, -1, -17, -18, 37, -16, 3, 1, 13, -28, -6, 16, -31, 7, -24, -17, -6, -14, -15, -6, -1, -1, -7, -9, -3, 5, 28, -22, -8, -42, -4, 6, 4, 19, -28, -8, -19, -7, -32, 6, -12, -33, -1, 27, -20, 9, -14, -6, 38, 11, 5, 24, 24, 0, 16, -10, 7, 30, 35, -4, 34, 1, 15, 16, -20, 3, -9, 14, 8, 9, -42, 27, 13, -8, -5, -24, -22, 0, 4, 25, 10, -10, -23, -23, -4, -17, -6, 14, 10, 5, 36, -4, -7, -18, -6, 3, 29, -1, 11, 17, 17, 4, 14, 12, -14, -18, 9, 5, -22, -15, 17, 2, 5, -14, 1, -17, 21, 0, -30, 12, 5, 8, 4, 12, 3, 7, 29, -35, -13, 10, -28, 12, -23, 20, -2, -15, -34, -3, -18, -2, 3, 13, -7, -7, 11, 29, -9, -19, -3, -11, -8, -9, 9, 37, 2, -10, -8, 3, -5, -2, 21, -7, 28, 10, 23, -21, -11, -11, 3, -10, 13, 14, 14, 6, -2, 4, 5, 4, 11, -19, 14, -3, 8, 17, 16, -1, -1, 31, -8, 7, 17, 5, -3, -3, -13, -32, 12, 12, 11]
5394A1L7m6RkJ8m6J2J6jmj9L3l2J8j9m%L6j6%Jnk3L6K2m2J8J5j2J1k9j0K0jLJ1
5430A6MJ8nrm7oL0PmK0j1j1j7K2J1j5J5j6J4k6J6lPJqk5L6pJ8l3nPKJ2k8K0pm3
5468e0Q0l3mj0M1l8lK1J2loPk2NJ1JoJ3l6L2j1k2L1j8J9lj3%K0l4K3pK0k4M3p
5504B9l8j0j3M5Lm9L5J1k2jK3Lk9K3Rk6RRk8J2J2k3j4L9k9K0LoJ0j1K5k4nJ1N
5539HK9k2J5j3j4Jk5L4j8JJ4PJ4l1j3L0rNRn8O1j2K6n3jnK4j5j1K8qkPl2M2Nn
5576A3rk1K6%j8Q%J5k3J7j2J9mk0jK9j9nj0LOQj8J5jj2j2M7k0OJ4l1PK7ll8L0
5613A3j7L5k9Mj9K5j5J6l2mJ5Jj7kN5k7j2K3k7K1j5rnK2LNrK7j1k5QJ2rnK2j3
5649Ek6J1oL2l9M1j7%k6N0J1l6J0KkRk3j3OJ4J8j3MqOLj4k3K3KK4l5K0nrj2K8
$$ y = [11, 48, 2, 11, 9, 27, -19, -7, 9, 8, 4, -15, 18, -14, 4, -15, -19, -19, 17, 1, 1, 2, -3, -26, 10, 32, -10, 8, 23, 11, 22, -7, -17, 3, 2, 5, 16, 20, 38, 33, 24, -23, -29, 1, 8, 4, 24, 13, 2, -15, 7, 18, 3, 18, 2, 16, -10, 6, 3, 10, 11, 3, -22, 14, 7, 25, -8, -13, -6, -4, 8, -20, 0, -7, -50, 30, -3, -7, -17, 24, -14, -17, 4, 16, 13, 7, 14, -8, -3, 8, 9, 3, 16, -20, 12, 1, -21, 10, -8, 11, 8, -5, -5, 15, -19, 4, -3, 17, -7, 36, 29, -9, -19, -32, 13, 16, -33, 2, 13, -9, -10, 13, 16, -13, 10, 19, -7, 2, 11, -17, -5, 7, -16, -30, 9, -20, 0, 3, -3, 7, -4, 21, -3, -8, 3, 8, 37, 15, 30, 17, 3, 4, -21, 13, -5, -4, 10, 17, 31, 0, -13, 17, 8, 13, 22, -36, 25, 13, 39, -14, -15, -20, 4, -11, -22, 6, -2, -4, 3, -29, 13, 18, 13, 4, -17, 9, 9, -9, -1, -1, 14, -9, 8, -4, 15, 11, -9, -10, 19, 0, -5, -15, -12, -6, 2, -16, -1, -2, -14, -26, 21, 1, 7, 21, -10, -3, 24, 21, -17, 13, -4, 31, 2, 6, -13, 12, -3, 13, -19, -23, -8, -7, -24, -26, 29, 2, -10, 13, -14, 7, -8, -17, -22, 0, 3, 8, -1, 26, 15, -10, -2, 10, 1, -4, 18, 5, -21, -10, -16, 16, -23, 18, 1, 1, -25, 25, 36, 0, 10, 12, 10, 19, -4, -17, -11, 3, 21, 8, 12, 4, 10, 13, -1, -24, -1, 1, 25, -10, 10, 5, -4, -16, 12]
5686A2j3K3l0J5k2J5j9L1Lnj3j3K7n0K7QRjmj0J0pJ0K3m7L1k0J9lj3L9j8mjKL
5722A4k2J5j4Nj4MnL4Qk1M0l7J5l5K0m9O3k9MMj2J1K5lk3NklJ7%k3L1k9Qkj3K5
5759A2Kk6KloL9m1l0M8KnL2m5J2L%Nj7K7l9M3j2mPJ0on0L9J3j9J6k1L5k2%mmL
5797dLKNrmLJK1k0k3J4J1J2J0j2qj0j0rP%J8j0J1J7m4J5Qj5Rkj3L9m1K2j1L3l0
5835a4rL3j0qK0J0jm1J6JN4l2Rj1j5j9J4J3Lj0J0%nkj3K8m8L0qqj2K7Oj9J7j8
5871a2J6j1j1L2l7KJ3NrKj7M9j6k6nK1j0L1k8PpqJ4JKpJ9Nj0qJ6j5J2l2J0J3j1
5908a0K8k9L0l8MK1K2l0rj0K1K3j3K%j1pL3ll6J1KPk3K9j2L3l0nnmJ5Kj4JK8j3
5945A0K1j1m4jN0l3l5N3j3pQJ4j1K2j8j7lJ0J1ooJ7j5NK8l5QknJjJ5l0L8k6J4
$$ y = [12, -1, 22, -8, 7, -15, 0, -19, 12, 15, 10, -3, -16, 11, -39, -12, -4, 5, 4, 0, -10, 0, -7, 3, 26, -21, 10, -10, 9, 6, -7, 32, 14, 10, 9, 11, 14, -8, 7, -7, -2, -16, -12, -17, 17, 25, 4, 44, 7, 22, -13, 7, -42, 21, -8, -4, 0, -12, -1, 24, 21, -2, 3, 1, -2, 15, 15, -8, 23, -6, 2, 0, -13, 12, 14, -12, -10, -13, -19, 20, -21, -51, -3, -1, -6, 26, -19, -7, -4, -4, 1, -16, 11, -28, 15, 3, -1, 6, 16, 10, -40, -1, 12, -7, 9, -12, 23, 1, 1, -3, -7, -4, -1, 1, 6, -3, -7, -4, -3, 18, -2, -25, -11, 0, 12, 22, 10, 2, -8, -18, -27, -20, -20, -2, -12, -1, 16, -28, -13, -5, -20, -11, -13, -26, 13, -28, -6, -17, 16, -14, -23, 10, 0, -8, 12, 22, 21, -20, -4, -3, 51, 19, 28, 17, 2, -17, -3, 10, 13, 3, 13, 13, 8, 6, -7, 21, -27, 3, -5, -13, -25, 2, 8, -11, 6, -12, 4, -7, -18, 14, -23, -21, -8, -3, -12, -10, -27, 22, 6, -20, -25, -4, -14, 17, -11, -4, -11, -19, -5, -4, -2, -9, 10, 15, 5, -3, 13, -2, 10, -22, -12, 1, -10, 18, -11, 19, -19, -15, 6, 28, -2, -11, -21, 0, 23, 10, 12, 12, 1, -6, 27, 24, -12, -1, 1, 8, -15, 14, 2, 35, 5, 0, -5, -9, 6, 8, -6, -5, 23, 10, 31, 20, -24, -25, 25, -8, -43, 10, -3, -10, -2, 12, 1, 23, 5, -12, -15, -5, 6, 0, -6, 11, -4, 1, 29, -6, 2, 0, -5, -4, -5, 10, -20, 18, -8, 6]
5981Frk8K5J3J1k9Nj5L5j7LJ7Ok6%J2Lo3M4rj0J0L3k0k9M0j2rOk1RJ7Lk1Rj8K6
6018cJ8j5K8j9k0LQj4L2rrj2L8l7n%L0J4l8L7l1PJ3lpJ6n2N0K4k7l7mJ0L9l2K5
6054A8l0j9K8lJ5k8J7j9M3k6k1NK0k4JK0j4K6rj1nL5j7Mj4J6m2L7joJ7lJ8k8k0
6089b0K4J3k8M9l2J7l0J9j1J4k0%pj4M2l5J1L2k5j7K0j9J3j2Lk%LJKJ6m7OJ0L2
6124Hj1J5j8qj5J9j2RJ5j7QJ5l6M0qk2M3k3NjJ1j9J0J4pj6Qj6J8l4jK5J4k6M4
6159C1k0m0LMJ8j2J8j6L7k4J7rj5j8L5k2KOJl2K8K0J4k2J8lj3j4k6L6M1l0m9O3
6193B7m3KK9k4pK0JpPlK0k5K9j7J1jk5K9l%j1Ol2NJ3J8j4Ll7M2jj8j0J5Jk2K3
6230Aj6J5K6k4k8j5N7j1Pk1j0PqL3Oj6rJll5L1L3J3l6J6JPl3L5j1k3K2k4J7Oj2
$$ y = [6, -3, -31, -6, 7, 18, -11, -6, -21, 14, -3, 0, 17, 23, -3, -3, 9, 12, -51, -7, -16, -26, -16, 17, -3, -32, 8, -4, -13, -7, -28, -19, -2, 1, -20, -11, -29, -3, 15, 0, 28, 9, -11, -8, 0, -14, 18, 9, 0, -12, 26, -11, -16, -16, 14, 28, -10, 27, -4, 3, 16, 13, 6, 22, -30, 20, 44, 17, -20, -24, -14, 25, -7, 18, -12, -31, -3, -6, 9, -19, -2, -21, 22, -4, -25, -20, 0, -24, -23, -3, -17, 9, 0, -11, -16, 19, 2, 6, -8, 8, -34, 3, 2, -4, 13, 10, 28, 0, -20, 4, 17, -11, 38, 6, 23, -7, 12, 1, 15, -5, -5, -12, -26, 16, -19, -8, 24, -1, -18, 2, -17, -4, -16, -13, -15, -15, -12, -11, -9, 7, -40, -34, -24, 8, -3, 12, -6, -14, -29, -10, -22, -13, 2, -15, -7, 8, -28, 12, 4, -18, 25, 2, 7, 6, 17, -2, 8, 22, 15, -1, 7, -9, 9, -25, -26, -1, 13, -13, 31, 11, -29, -26, -22, -4, -16, 2, -14, 23, -1, 16, 7, -8, -26, 9, -13, -11, -5, -4, -36, -8, 12, 26, 4, 22, 19, 6, -8, -34, 2, 43, 13, -36, 27, -16, -14, 15, -9, -16, 4, 5, -2, 5, 2, 22, -3, 26, 9, 20, 19, -6, 23, 20, 20, 9, 15, -17, -12, 1, 19, 5, 8, -29, 13, 12, -6, -16, -1, 0, -22, 1, -15, 0, 26, 2, -26, -41, 16, 5, 12, -9, -19, -12, -20, 13, 19, 3, -6, -5, -8, -43, -12, 21, 34, -2, 14, 15, 22, -11, 24, 13, -10, 12, -12, 5, 11, -1]
6266aRJ4j4J5j5j8Nj0K1j8jK6k3j9L7l1L5j0qj5L2j1j1j5QJKLJ9k2J5qJ9j9j8
6301b6N4k5k4J7J6l9j5M2j9J4JKJ6J4l0K1LMj9Nkl4L4j1QLrpL1m2kM8m9N0j5M
6337A9lpQk6lNK6l1j2K4pJ0j4J6K4j9j4LPj1%L9p1L3Rj4K4j7mNj8N2m3J4Qj6J
6374cJ6J5j8rjojJ7Kj1qRmK1k0K2l8L2j1j3J7pL1j1l3LqRpLM4l5KJJ7Ql1KMJ6
6414A6QJl2J8j8j3M5m1MK0j3L1m1oK3J2L0m0k0qK3KK1l4nL5oK0k3LPj4k1RJ3J3
6450A9mnm3L1J4J4rk0J1j1j5mL1j6L5qk4mJ6Ok2Mk1j2K7Oj7K7j3kJ1Qj4jj8J1
6486a2K2J4j0l8J5PNJ0k4J5lNNl0P%J5J5mj0Nj7j1K9QmJl0M6n1M5j9RPppK7j5
6524B0opOk6J8J3k0j6K0rmPl0O7kl4kJ3%j3NqL1k8J0j1J4Ll3qM3j4J5j1k1M1j5
$$ y = [-1, 8, 22, 8, 23, 8, -10, -5, -15, 6, -12, -13, 13, -10, -29, 8, -23, 12, 2, -6, -21, 11, 0, -11, -26, -18, -17, -15, -12, 7, -15, 0, -8, 11, -8, -26, 28, 3, -21, -4, 12, -27, -42, 0, -19, -5, -4, -2, 14, 28, -2, 19, 22, 26, 7, 12, 10, -24, 10, -1, 7, 10, 1, -6, 25, -17, -19, 29, -20, 30, 15, 19, 16, 9, 17, -9, -12, -7, 19, -12, -24, 0, -7, 3, -11, 5, 29, 10, -4, -1, 6, -5, -5, 34, -37, -4, 5, -9, 15, -2, -6, -1, -19, 33, -10, 4, 12, -4, -3, 13, 28, 10, 1, 0, -6, -7, 10, 12, 1, -7, 2, -2, 19, -1, 21, -17, 15, 4, -9, 8, 1, 32, 21, -12, -9, -17, -8, -15, -12, 32, -3, -1, 0, 17, 25, -6, -4, 0, 16, 24, 25, -7, 11, -7, -20, 25, -16, -12, 8, -5, 26, -15, -21, 2, 14, 44, 4, -16, -24, -1, 1, 22, -12, -17, 18, 12, 32, 9, 12, 19, 5, -16, -7, 6, 19, 15, 10, -33, -2, 12, 26, 17, -3, 8, -3, -18, -22, 9, -7, 28, 20, -4, -8, 8, 14, -8, -4, -25, -37, -10, -4, -21, 6, -7, -9, 2, 10, -4, -5, -23, -12, 10, 24, 14, -24, -9, -2, 3, 13, -11, 4, 1, 6, 11, -19, -12, -12, 3, 18, 14, 4, 9, -8, -19, 10, 18, 14, 15, -15, 31, -20, 25, 6, 15, 22, 15, 8, 35, 20, 14, 7, 13, -13, 5, 18, -2, -18, 2, -7, -11, -4, -34, 33, 31, -3, -5, 8, 8, -5, 0, -8, 23, -5, 5, -6, 8, 11, -22, -30, 13, -1, 14, 3, -18, 23, 8]
6561Hk2L1JJRk9K1m8L1m2M8j9rL7k5KK2j1j7K0J4Pn7L0J6m7M5l7J6mj2J0OJ3j2
6596cOrPmJK0pk2j9kQL0oL5j4k4k0K3k2K2MRl1qM0k3LOmJ8l7O7m1j8QnK1k4J2
6635cNj1L0J3k0J3k2k3K4j9K3lqOjl5O5k2nlN%l3L1j9j6J8K3OMk4k5K4k1K8j5
6671a0RNJ3k3QL6m3K0K7%%l1nj0J8qRRkJ3j4m4M0%Jl0J9mJ1Olk6J1K1j8j4K1j9
6709gQJ4j7jj1K7K2j3k3J0noK6kk7%J9nK0m5L2J2l6K2K1l4J5pJ0LJ9j8k9K0k1
6744gK7lJ5k8j1K1Lk8K4l9K3J1K5qm1PJ9k8J5MLk4k7M9j5L0j7j6R%J6j9J3j5J3
6779Aj2J4oK7l9k3M0J2k6KqL7j8oJ7k6M1j9k5L0k1OjK1j5rK7k8qK8lRjj0Komo
6817fJ1PmJ3k1N1n7Pj3J0K3k2KLj6J3k7J1K8j0j5K7l0j8K5nNK3j3j9KPKk1L9j4
$$ y = [8, -14, 17, 18, 19, 28, -1, 20, -28, 3, -39, 9, -10, -19, 18, -7, -5, 17, 6, -11, 9, 23, 30, -27, 3, 19, -28, 17, -20, -4, -8, -20, -10, -4, 9, -3, 3, -6, 1, -3, -2, 18, 11, -11, -30, -32, -24, 6, 0, 35, 21, -3, -23, 0, -22, 0, 4, 13, -18, -26, 14, -9, -6, 0, -4, 14, -23, 44, 3, -15, -7, -12, 9, -15, -3, 2, -9, 21, 34, 14, 27, 5, -18, 6, -13, 10, 7, -1, 5, 4, -31, 34, 12, 7, 4, 9, 9, -24, 7, -12, -28, -10, 13, 19, 23, -1, -26, -2, -23, 5, -10, -1, 4, 17, -6, 2, 38, -5, 15, 42, 42, 42, 11, 6, -4, 14, 6, 15, 24, 22, 35, 21, -23, 17, 17, 18, -12, 7, 3, 14, 20, 17, -9, 2, 23, 5, -9, 12, -7, 1, 15, -2, -3, -14, 13, 35, 22, -1, 9, 4, -2, 24, 22, -5, -5, 14, 9, 29, -16, 16, 28, -8, 14, 35, 1, 16, 9, 19, 22, 41, 23, -6, 14, -7, 20, 17, 32, 4, -7, 14, 17, -11, 13, -26, -3, 8, 33, 25, -16, -9, 10, -18, -3, 1, 4, -20, -47, 2, -13, 17, 0, -16, -7, -7, 9, -10, 3, -12, 1, -11, 3, -3, 24, -15, -38, 2, 14, -12, -10, -18, 19, 1, -5, 12, -14, 27, 8, -17, 13, -8, -2, -3, 18, 3, -6, 21, -7, -15, 13, 10, 19, 18, 8, 10, 4, 0, -6, 5, 12, 8, 21, 0, 51, -6, 1, -12, -2, 21, -1, 1, 4, -12, 1, -26, -15, 13, 3, -12, 15, -15, -33, -8, -13, -8, 15, 2, -17, -15, -8, -6, -27, 12, -2]
6853bmJ5lj8J3J2l3K4oJ0PrJ4m3L0rk5M1NqqRmkJ6Rm2K6k6RKj6qlM4j1j0j2k1
6892c7J9j0J7lJ6Mj2j3L5Mk1MJ8l1K4RK6k4j9j4PMK3m0L1Lk7K1oOj9Nj8K0K0k2
6928@L1j1j5Qk5K8J4k6j8K0Oj3QrqK0j4NJJ1%j1j1K3k3mK3l7L8Ml5jOL3j1l5K1
6965gJ1K2Lk6J9j0J0lk6K3mj9K0oKj0M2m9J5Nj1OpJ3k2PJ6Pj4kj6j2J7qJ8J0l5
7002b1J4L5l8%M6k3Qk3rLOJ8pk7PrK7Roj4%J4m7N4j4k4PM0j7J6l2J5L1l1KmL2
7039C8k9qj5N1k8qk0N5j0k8RJ1k5NnKj8M3k9K1k1RJ3l4L7K2o5L8k0OJ3j9j2K2
7073AP%pj1L8j9l2L9k9%K9jJ1l9J7Mj0K4n3N1L9m2J7l6j9K5J5j8lK2nJ4npl3L9
7109B3j9j4J4k3J0J9J8kk6J3rKk0PqL5l9L8j3m2M1l8K1%J0J8j6j1LOJ0Lkj7J7
$$ y = [-2, -6, 9, 6, -12, 1, 13, -20, 4, -2, 8, 15, 6, 20, -23, 7, -2, -27, 14, 19, 11, 3, 12, 8, 6, 22, 31, -11, 15, -11, -2, 0, -16, -24, -27, 17, 6, -4, -16, -37, -18, -28, -11, -14, 2, 6, -6, -19, 16, 20, -1, 3, 21, -10, 14, 23, 49, 25, 6, -8, -1, 3, 26, -14, 17, 20, -7, 14, 8, 14, -5, 0, -18, 2, 22, 0, 31, 20, 5, 13, -12, 16, 30, 4, -14, 6, 12, -1, 7, -2, -10, 10, -4, 1, 2, 13, 13, 2, -9, 14, -9, -13, 10, -27, 11, 15, -20, -21, -15, 18, 7, -28, -7, 4, 26, 29, 3, 22, 12, 22, 19, -7, 16, 12, -7, 13, 7, 9, -1, 41, -8, 7, 12, 1, 7, 0, 13, -9, -2, 14, 21, 7, 5, -11, -23, -6, -14, 4, 14, -21, -7, 28, -10, -10, 36, 13, 21, -2, -11, -8, -2, 16, 9, -18, -11, -20, 7, 16, 10, -4, -4, 10, -37, 17, 3, -21, -14, 26, 9, 25, -7, 8, 39, 8, 10, 6, 38, 9, 1, -14, 37, 9, 1, -19, 36, 26, -2, 7, 18, -7, -2, -7, -5, -23, 20, -9, 12, -9, 0, 13, -21, 16, 38, -27, 11, -9, -3, 10, -9, -21, 1, 8, 8, 1, -10, 28, 9, -23, 16, -13, -13, 16, 15, 26, -13, 4, 8, -2, 22, -31, 20, 59, 17, 34, -2, -21, 4, 19, 1, -2, 20, 15, 29, 24, 17, -16, 23, 4, -10, 4, -19, -9, 10, 28, 26, 0, 13, 4, 6, -14, -7, -15, 20, -19, 19, 6, -36, 5, -33, -12, -12, -2, 16, 0, -11, -8, -2, 8, 11, 9, -8, 9]
7144Il2J5K9Kk1lJ7j8LJj0PpPL9j5kl5K4PK4k3J0j7Mj2kQk3K5LJ4n1JK3kj0%K9
7183A8j7l3M9j8j3Rj1j1K2mmJ6J5Mj8J7m4qM5J4m8L1rMkpk5L9J2k4K1m2L8Nm5
7218b4L7k0K2KnQnj7j7L0j8KQj1K0Nk4PjQj8K5%ml8K7j4L1Mnj2Lk2J3j6K9Rm4
7256b5kJ2j2KM9qkk4RqL0L9p8j0K0j1K9k0jL7j6qpK3j5RMJ9m0KPNj4K0mnj8L0
7294A8j8K7kl5PJ6l1J9j7K4j6Lk6M2j2j4N5m2jk7KM3l1rN1jk7j5L3l8J8Npj2M5
7329B7j4lk1K8K1l4OMLKj7l6K9J3NmQqqJ9m1J5K4pnMOk0J8LpJj3J4Jlk9N0j9j5
7369cL1k4qJ7j9j3L4Oj4LKlRMj7Qj4l5K9kk3N1j7j5L8m3L1k1J6j5qM9k6k3j1M9
7405B3k4NJ7pkqj0J8j7oJ2k7kJ8PrK0k2%M6m0j2J8J3j8j1K0QQpn5N3rJ1qJj0J2
$$ y = [9, -23, -8, 21, 23, 2, -1, 16, -2, 1, 2, -8, -1, -8, -1, 38, 23, 21, -14, 10, 17, 41, 18, 28, 11, 15, 3, 1, 9, -14, 11, 14, 28, -23, -22, 1, -1, -11, -11, 18, 1, -32, 17, -1, -14, -5, -16, -27, -5, -9, -13, 3, 18, 22, 4, 21, -23, -31, 14, 28, -20, 11, 2, 6, 4, -3, -28, 11, 23, -1, 20, -22, 16, 21, -24, 13, -7, 15, 17, 12, 20, 15, -2, -19, 11, -7, -5, 3, -8, 12, 17, -7, 0, -1, 7, -11, 14, 14, 10, -28, -1, -15, 16, 20, 15, 3, 6, -16, -3, -19, 10, 19, -25, -27, -15, -27, -25, 24, 16, 14, -10, -1, -9, 21, 60, -18, -28, -8, -19, 10, -10, -11, 26, 10, 2, -5, 18, 3, 12, 16, 35, -5, -3, 4, 9, -5, 15, 11, 6, -12, 18, 0, 27, 25, -10, -3, 13, -18, 1, -16, 8, -8, -5, -31, 11, -1, -15, 40, -2, -3, -30, -28, 15, -16, -25, 26, 25, -2, -17, 16, -22, -4, 1, -6, -18, 27, 13, 10, -11, 17, 38, 4, 10, 14, 17, 19, 2, -34, -5, 8, 13, 9, 17, 9, 1, 20, -21, -6, 18, 11, 6, 10, 16, -4, 14, 17, 10, 11, -2, 12, 13, 10, -19, 31, 12, -3, 28, 4, -4, 13, -6, -19, 15, 21, 7, 10, 12, 9, 18, 22, 5, 13, -1, -36, -7, -9, -32, 19, 2, -13, 25, -18, 13, -8, 8, -7, -15, 34, 8, -15, -26, 23, -1, 4, 21, 14, 12, 4, -6, 12, -5, -11, 1, -26, -28, -10, -3, -12, 8, -14, -14, 32, -8, -20, -2, 11, -7, -18, 2, 10, 18, 11, -44, 9, 0, 11, 3, 4, -6, 6]
7443Fj3K4jj4mK4j8J8l1PjNrK6qKpJ9k1K6l0J0k5mM0j4J1k5J8J6l6M2j3k3KqK
7480gj0J0j0J3l8K3K2qJ2j1KkNMKK2k2Mpk5L9j8KrJ8j8K1nPk6lL2l4K3m0LJ4K5
7518A0J4k5K4m4L2mJ5k0K3k2j0J6OMk7Qj5K6JRk7LJ6qk6L2pj7jK5mj5J2l7KK3
7554hj4L3l2K7kJJ0jM1m3lj4QLLjpK9j8lNrK3rl6K9JrLj0OJ2j8j4kK9K0m1PK3
7594A9k8qNkqK3j2J3RNk4oJ5j3K5j4%J4k6K6Kk4L6m8L1j3j6JPJ7l0M8n3K7NJ2
7630A5%j5%oLlNM0k6j8J3J2LK4l3%mK2k2qm2M8nk0K8Kk0l2N2l7MK0J2J1j5k5N
7667a2j0j5K1rL8J6m0j5J5j1M3j3k0j3M1l6L6j4p%pJ5L3l6Lj3OJ3J4j2K0j3Nk3
7701@K4k4PknQk1M6j2m9J6MPJ2J5m6K3l2K4l4L4K9j2K3l2K2qKNj7MJ6k8p%Lm3
$$ y = [6, -7, 17, 16, 2, -2, 22, 4, 22, -9, -2, -3, 2, -7, 19, 11, 13, 6, 25, 4, 30, 0, 10, -15, -19, 21, 7, 18, -7, 11, 27, -9, 33, 20, -3, -1, -9, -7, -17, -7, -17, -4, -42, -19, 3, -5, 7, -4, -2, -4, 1, 5, 7, 29, 7, 11, 4, -21, 18, 0, 2, -7, 11, -7, 14, 9, 16, -10, -13, 19, -15, 8, -32, -29, -15, 10, 24, -1, 23, -21, 11, 7, 22, 2, 25, 3, -7, 9, 15, 19, -8, 0, -15, 11, 12, 21, -6, -3, 13, 5, -21, 11, 4, -13, -14, 11, 7, -8, 4, -33, -31, -8, -22, 11, -21, 6, 4, 5, 15, 14, 55, 12, 9, -5, 3, 6, 9, 8, 1, 30, 12, 9, 14, 5, 28, 19, -17, 12, 13, 4, 7, -3, 3, 15, -3, -17, -19, 10, 30, -11, -4, 19, -9, -17, -12, -14, -22, 1, -11, 2, 11, 16, -8, -14, 1, -12, 13, -1, -1, 13, -13, 13, 15, -9, 27, -21, 10, -3, -19, -18, -11, 6, -24, 24, -29, -2, 3, 15, 15, 0, 0, -6, -3, -6, -1, 39, 13, -5, 8, 20, 23, 47, 14, 14, 10, 32, 10, 2, -40, 8, 3, -17, 11, 13, -7, -39, 13, -24, -20, 0, 12, 23, 8, -17, -12, -22, -37, -16, -25, 13, 29, -11, -26, -11, -22, 21, 8, -12, -25, 16, -20, 16, 2, -5, -5, -12, 3, 36, 0, 3, -10, -4, 9, 23, 11, 31, 18, 23, 0, 24, 0, 7, 5, 0, 8, -13, 33, 21, -28, -12, -8, -1, 11, 26, -20, 3, -29, -5, -39, -5, 24, 12, 35, 3, 25, 17, 19, 24, 7, 11, 27, -1, -8, -8, -5, -48]
7738d8M8J2k0n%J0LkkLMk4lJ5OK0mo%Pk5K3K0m0J9%J3j7k2K0J1j5j9rL1oJ7l0
7776a5OJ5jl2M1J4k7k2Pj7J7L7l2K4lk7nK7j2lK8n1L8k2K4nPj4nKPnj6L3k8L4
7812A9l1K0j3J8J4l5J2L1k1j5%L6l6k7J4NK3Jm5K1L6k8mnJ4k4J2nK6j5J3Kl7K3
7846aj2NJ6j2kJ2k0K5ppkJ8kk5M2k9J0%mJ8k1j8N1k5qRlprjNoJ9j3J3k1J1J1l0
7885b0PK1k9J8L8l0j5NK5k8kJ1J3j2m9L5l3O1m4L6ml4K5KOnk3M0rKQk6K5m0J9
7920fJ2n2K6kJ6qj7J8J5Rk8L9j2k0pO0l4mK2k5K6m9L9k9J3rK4k4NM7j9m6K1j5
7954a4mL2j4%nL1j9pj3J0QLl4J8l0k5P0rJ4k6RJ4j3MK3k9QPJ4l6L2l4J7j8j2L7
7990IJ4l4J5k2J1J5k0M3Om9P%J5K3l1MqJ3J0l3J9l2K5j5J5K%om0J1M5j0OmRJ9
$$ y = [-48, 0, 12, -8, -13, -13, -3, 0, -2, -4, -1, 3, -21, -24, -9, -3, 17, 13, 7, 7, 14, -11, 12, 32, -8, 11, 11, 24, 7, -15, 5, 16, 1, -18, -27, 4, -2, 15, -15, -9, 6, 5, -27, 14, 28, 1, -21, -14, -31, -14, 23, -9, 15, 12, -15, -20, 7, -5, -8, 20, -31, 7, -15, 9, 4, 11, -3, -8, -6, 1, -4, -20, 13, -15, 19, -12, 8, -5, 13, 27, -8, 4, 35, 14, -1, -1, 35, -1, -28, -14, -9, 14, 15, -30, -9, 27, -1, -5, -10, 4, -20, -8, -13, 13, -2, 11, 13, -24, -1, -13, -8, 8, -4, -6, 6, -14, 11, 4, -3, -5, 13, 11, -14, 28, -1, 9, 9, 5, 23, 2, -16, 35, 10, 2, 11, 8, 1, -8, -9, -4, -10, 9, -4, 9, -12, -1, 10, -20, -13, 8, -21, -3, 35, 5, -10, -5, 20, -8, -10, 1, 14, 2, -47, -12, -45, 16, -28, 8, 4, -30, -5, -3, 3, -2, -25, 15, 6, 8, 16, -10, 15, -25, -6, 6, -46, -20, -22, -6, -14, -31, -13, 2, 11, -17, 22, 10, -10, -17, 43, 9, 5, 27, 2, 28, -21, 18, -11, 2, -7, 17, -7, -2, 45, 26, -20, 1, -14, -18, 14, 0, 0, -5, 26, 7, 0, -13, -3, 5, 8, -26, -8, -38, -63, 7, -2, 12, -14, -5, 9, -4, 0, 23, -6, 2, 9, 23, -13, 19, -15, 2, -16, -28, 9, 23, -11, 4, -18, -7, 8, -12, 31, 37, -12, -5, -5, 10, 33, 2, 6, -2, 11, 21, -12, 7, -25, 0, -15, 0, 2, 2, -4, -44, -33, 12, 2, 8, 4, 13, 32]
8026C2m0pK8J1k9l2L3j2M5k7kl7M0JMKk6K2KJOJl0j4L8kLkK3k3k2J9Qj5nJ4j0
8063bj5oL0pRl3L0J8ok4J2pOJ7kj5PnnOk3LK5m5K2j1LM6j9j0ML8l5l3J4OnJ0O
8102DK4k4j6L2j7j9K2L1l8lOl4M8Kj8Qm2L5M0n4K1k7L9j5j9J3J3Jj8%J1k2j1M9
8136B2m0PL3qOn1J8qMOQk2oM9Mm3L2m6L7J2m2K5K6k9L3k2J6j3J9m7K8l8J6L6l5
8171a3J1J1j5qj1O1k8lj0L0j9pK5k9jJ4Kl8K8j6
$$ y = [32, -8, -15, 13, 24, -5, -37, -4, -16, 29, 2, 0, -37, 3, 4, 8, 10, -16, 6, 8, 9, 15, 16, -14, -28, 10, 8, 11, 9, 32, 9, -13, 6, 14, -1, -6, 8, -2, -17, -23, 7, 0, 9, -24, 6, 24, 18, -6, 6, -1, 5, 22, 20, 5, 12, 7, 2, 8, -15, -12, 13, -32, -10, -21, -18, 28, 9, -1, 3, 41, 6, -27, -13, -7, -12, -2, 4, 28, 4, -12, 20, 3, -16, 6, 37, -1, -4, 2, -32, 16, 18, 0, 8, -34, 1, 41, -13, 8, -19, 20, 5, -14, -1, 12, 13, -5, -5, 6, -16, -27, 22, -18, -11, 22, 14, 20, -31, -13, -21, -17, -11, -3, -25, -31, 18, 22, -21, 11, -35, 2, 14, -28, -3, 23, -6, 27, 5, 21, 8, 27, -20, 8, -30, -14, 22, -13, -2, 9, -6, -14, -25, 36, 8, 5, -5, 25, 6, -1, 24, -5, -6, 8, 10, -28, 0, -16]
8191a6
##END NTUPLES=NMR FID
##END=
