##TITLE=1H_ES-NC-EG
 
 8 sc, 
 25.11.2022
##JCAMPDX= 6.0         $$ Bruker NMR JCAMP-DX V2.0
##DATA TYPE= NMR FID
##DATA CLASS= NTUPLES
##ORIGIN= UXNMR, Bruker Analytische Messtechnik GmbH
##OWNER= root
$$ XWIN-NMR		Version 3.5
$$ Fri Nov 25 13:58:32 2022 Russian Standard Time (UT+4h)  she@DPX200
##.OBSERVE FREQUENCY= 200.1313499994
##.OBSERVE NUCLEUS= ^1H
##.DELAY= (6, 6)
##.ACQUISITION MODE= SIMULTANEOUS
##.ACQUISITION SCHEME= undefined
##.AVERAGES= 8
##.DIGITISER RES= 18
##SPECTROMETER/DATA SYSTEM= spect
##.PULSE SEQUENCE= zg30
##.SOLVENT NAME= DMSO
##.SHIFT REFERENCE= (INTERNAL, DMSO, 0, 15.7039)
##AUDIT TRAIL= $$ (NUMBER, WHEN, WHO, WHERE, WHAT)
$$ ##TITLE= Audit trail, XWIN-NMR		Version 3.5
$$ ##JCAMPDX= 5.01
$$ ##ORIGIN= Bruker BioSpin GmbH
$$ ##OWNER= she
$$ F:/spectra/data/she/nmr/H-F/1/audita.txt
$$ ##AUDIT TRAIL=  $$ (NUMBER, WHEN, WHO, WHERE, WHAT)
(   1,<2022-11-25 13:56:49.85 +0400>,<she>,<DPX200>,
      <created by zg, POWCHK disabled, PULCHK disabled
       configuration hash MD5:
       00 E9 B6 7A A2 85 ED C7 34 08 36 98 17 FE 4E 26
       data hash MD5: 16K
       6D 79 3F F3 F7 7E 7E AE 68 76 D0 36 EB 2E 25 A4>)
$$ ##END=
$$ 
$$ hash MD5
$$ E3 43 18 EB 6A 59 37 80 E9 2A 49 25 4C 16 09 3F
##$RELAX= 
##$RELAX= 
##$RELAX= 
##$RELAX= 
##$RELAX= 
##$RELAX= 
$$ Bruker specific parameters
$$ --------------------------
##$DU= <F:/spectra>
##$EXPNO= 1
##$NAME= <H-F>
##$PROCNO= 1
##$TYPE= <nmr>
##$USER= <she>
##$AMP= (0..31)
100 100 100 100 100 100 100 100 100 100 100 100 100 100 100 100 100 100 
100 100 100 100 100 100 100 100 100 100 100 100 100 100 
##$AQSEQ= 0
##$AQ_mod= 1
##$AUNM= <au_zg>
##$AUTOPOS= <>
##$BF1= 200.13
##$BF2= 200.13
##$BF3= 200.13
##$BF4= 200.13
##$BF5= 200.13
##$BF6= 200.13
##$BF7= 200.13
##$BF8= 200.13
##$BYTORDA= 1
##$CFDGTYP= 0
##$CFRGTYP= 5
##$CHEMSTR= <none>
##$CNST= (0..31)
1 1 145 1 1 1 1 1 1 1 1 1 1 1 1 1 1 1 1 1 1 1 1 1 1 1 1 1 1 1 1 1 
##$CPDPRG= <>
##$CPDPRG1= <>
##$CPDPRG2= <>
##$CPDPRG3= <>
##$CPDPRG4= <mlev>
##$CPDPRG5= <mlev>
##$CPDPRG6= <mlev>
##$CPDPRG7= <mlev>
##$CPDPRG8= <mlev>
##$CPDPRGB= <>
##$CPDPRGT= <>
##$D= (0..31)
0 1.2 0 0 0 0 0 0 0 0.06 0 0.03 0 0 0 0 0.0002 0 0 0 0 0 0 0 0 0 0 0 0 
0 0 0 
##$DATE= 1669370209
##$DBL= (0..7)
120 120 120 120 120 120 120 120 
##$DBP= (0..7)
150 150 150 150 150 150 150 150 
##$DBP07= 0
##$DBPNAM0= <>
##$DBPNAM1= <>
##$DBPNAM2= <>
##$DBPNAM3= <>
##$DBPNAM4= <>
##$DBPNAM5= <>
##$DBPNAM6= <>
##$DBPNAM7= <>
##$DBPOAL= (0..7)
0.5 0.5 0.5 0.5 0.5 0.5 0.5 0.5 
##$DBPOFFS= (0..7)
0 0 0 0 0 0 0 0 
##$DE= 6
##$DECBNUC= <off>
##$DECIM= 32
##$DECNUC= <off>
##$DECSTAT= 4
##$DIGMOD= 1
##$DIGTYP= 9
##$DL= (0..7)
0 120 120 120 120 120 120 120 
##$DP= (0..7)
150 150 150 150 150 150 150 150 
##$DP07= 0
##$DPNAME0= <>
##$DPNAME1= <>
##$DPNAME2= <>
##$DPNAME3= <>
##$DPNAME4= <>
##$DPNAME5= <>
##$DPNAME6= <>
##$DPNAME7= <>
##$DPOAL= (0..7)
0.5 0.5 0.5 0.5 0.5 0.5 0.5 0.5 
##$DPOFFS= (0..7)
0 0 0 0 0 0 0 0 
##$DQDMODE= 0
##$DR= 18
##$DS= 0
##$DSLIST= <SSSSSSSSSSSSSSS>
$$ [...]
##$SUBNAM2= <"">
##$SUBNAM3= <"">
##$SUBNAM4= <"">
##$SUBNAM5= <"">
##$SUBNAM6= <"">
##$SUBNAM7= <"">
##$SUBNAM8= <"">
##$SUBNAM9= <"">
##$SW= 18.0517283424941
##$SWIBOX= (0..15)
0 0 2 0 0 0 0 0 0 0 0 0 0 0 0 0 
##$SW_h= 3612.71676300578
##$TD= 16384
##$TD0= 1
##$TE= 0
##$TE2= 300
##$TE3= 300
##$TEG= 300
##$TL= (0..7)
0 120 120 120 120 120 120 120 
##$TP= (0..7)
150 150 150 150 150 150 150 150 
##$TP07= 0
##$TPNAME0= <>
##$TPNAME1= <>
##$TPNAME2= <>
##$TPNAME3= <>
##$TPNAME4= <>
##$TPNAME5= <>
##$TPNAME6= <>
##$TPNAME7= <>
##$TPOAL= (0..7)
0.5 0.5 0.5 0.5 0.5 0.5 0.5 0.5 
##$TPOFFS= (0..7)
0 0 0 0 0 0 0 0 
##$TUNHIN= 0
##$TUNHOUT= 0
##$TUNXOUT= 0
##$USERA1= <user>
##$USERA2= <user>
##$USERA3= <user>
##$USERA4= <user>
##$USERA5= <user>
##$V9= 5
##$VALIST= <valist>
##$VCLIST= <CCCCCCCCCCCCCCC>
##$VD= 0
##$VDLIST= <DDDDDDDDDDDDDDD>
##$VPLIST= <PPPPPPPPPPPPPPP>
##$VTLIST= <TTTTTTTTTTTTTTT>
##$WBST= 1024
##$WBSW= 4
##$XGAIN= (0..3)
0 0 0 0 
##$XL= 0
##$YL= 0
##$YMAX_a= 647386
##$YMIN_a= -1019859
##$ZGOPTNS= <>
##$ZL1= 120
##$ZL2= 120
##$ZL3= 120
##$ZL4= 120
##$ABSF1= 10
##$ABSF2= 0
##$ABSG= 5
##$ABSL= 3
##$ALPHA= 0
##$AQORDER= 0
##$ASSFAC= 0
##$ASSFACI= 0
##$ASSFACX= 0
##$ASSWID= 0
##$AUNMP= <proc_1d>
##$AZFE= 0.1
##$AZFW= 0.1
##$BCFW= 1
##$BC_mod= 2
##$BYTORDP= 1
##$COROFFS= 0
##$CY= 11.3945322036743
##$DATMOD= 1
##$DC= 2
##$DFILT= <>
##$DTYPP= 0
##$F1P= 2.36226072786647
##$F2P= -0.459571619588291
##$FCOR= 0.5
##$FTSIZE= 0
##$FT_mod= 4
##$GAMMA= 1
##$GB= 0.15
##$INTBC= 1
##$INTSCL= 1
##$ISEN= 128
##$LB= 0.24
##$LEV0= 0
##$LPBIN= 0
##$MAXI= 10000
##$MC2= 0
##$MEAN= 0
##$ME_mod= 0
##$MI= 1.114404
##$NCOEF= 0
##$NC_proc= 0
##$NLEV= 6
##$NOISF1= 3.799351
##$NOISF2= 2.8
##$NSP= 1
##$NTH_PI= 0
##$NZP= 0
##$OFFSET= 15.70392
##$PC= 1
##$PHC0= -18306.12
##$PHC1= 14.60072
##$PH_mod= 1
##$PKNL= yes
##$PPARMOD= 0
##$PSCAL= 0
##$PSIGN= 0
##$REVERSE= no
##$SF= 200.130013532006
##$SI= 16384
##$SIGF1= 3
##$SIGF2= 2
##$SINO= 400
##$SIOLD= 16384
##$SREGLST= <1H.CDCl3>
##$SSB= 0
##$STSI= 0
##$STSR= 0
##$SW_p= 3612.71676300578
##$SYMM= 0
##$S_DEV= 0
##$TDeff= 0
##$TDoff= 0
##$TI= <>
##$TILT= no
##$TM1= 0
##$TM2= 0
##$TOPLEV= 0
##$USERP1= <user>
##$USERP2= <user>
##$USERP3= <user>
##$USERP4= <user>
##$USERP5= <user>
##$WDW= 1
##$XDIM= 8192
##$YMAX_p= 0
##$YMIN_p= 0
$$ End of Bruker specific parameters
$$ ---------------------------------
##NTUPLES= NMR FID
##VAR_NAME=  TIME,          FID/REAL,        FID/IMAG
##SYMBOL=    X,             R,               I
##VAR_TYPE=  INDEPENDENT,   DEPENDENT,       DEPENDENT
##VAR_FORM=  AFFN,          ASDF,            ASDF
##VAR_DIM=   8192,          8192,            8192
##UNITS=     SECONDS,       ARBITRARY UNITS, ARBITRARY UNITS
##FACTOR=    0.0002768,     1,               1
##FIRST=     0,             0,               0
##LAST=      2.2672688,     0,               0
##MIN=       0,             -1019859,        0
##MAX=       2.2672688,     647386,          0
$$ Real data points
##PAGE= N=1
##DATA TABLE= (X++(R..R)), XYDATA
$$ plain form
0 0 0 0 0 0 0 0 0 0 0 0 -4 8 -8 12 -16 18 -24 32 -40 48 -60 72 -85 101 -124 145 -172 198 -232 267 -307 354
32 354 -404 462 -523 594 -671 753 -845 948 -1058 1181 -1313 1460 -1620 1792 -1983 2189
48 2189 -2415 2662 -2933 3228 -3555 3914 -4314 4756 -5251 5809 -6440 7162 -7996 8975
62 8975 -10133 11525 -13229 15343 -17950 20894 -21972 13214 -1019859 137624 647386
73 647386 -367215 -142893 66744 223971 -98596 -250285 248113 98269 -283234 105249
83 105249 119777 -109330 -25179 54910 14053 -29392 -33133 59957 -4261 -49762 30486 21756
95 21756 -33848 5252 12666 -1654 -9526 1418 9081 -3435 -9318 10024 657 -6777 2250 3585
109 3585 -2857 -831 918 1630 -1826 -704 1940 -245 -1597 1133 400 -756 -45 440 23 -395 4
$$ packed form
0@%%%%%%%%%%mJ2j6K0k8L4m2N6p2Q8j08J32j57J86k25K69l17L70m30M99n74O61
32C54p58Q66r85J117j265J424j598J793k006K239k494K773l080L412l775M172
48B189m604N077n595O161o783P469q228R070j0007J1060j2249J3602j5158J6971
62H975j9108K1658k4754K8572l3293L8844m2866L5186j033073J157483N09762
73F47386j014601K24322K09637J57227l22567j51689M98398j49844l81503L88483
83A05249J4528k29107Q4151Q0089m0857m3445l741R3090o4218m5501Q0248q730
95B1756n5604L9100P414j4320p872J0944P663j2516n883J9342r367p434R027J335
109C585o442K026J749P12l456J122K644k185j352K730p33j156P11M85m17m18L99
$$ plain form
126 4 378 -221 -241 269 30 -220 43 104 -60 -60 44 41 -72 -11 105 -29 -18 17 43 -9 -16 41 1 -1 11 -1 12 -10
154 -10 5 -3 -15 -6 5 -8 -13 6 -10 9 -19 -1 12 12 -25 1 -26 4 22 2 -8 2 -5 14 -2 -9 0 18 -8 -2 24 -6 5 11 16 1
190 1 12 -6 24 2 -1 -17 -17 -16 27 -23 3 -9 -4 -15 -10 11 -31 -32 -11 3 -17 -5 -15 -10 9 -12 5 -4 -26 7 -1 -24 0 6 13 -23 6
227 6 20 -8 -11 17 30 0 14 3 -21 1 -17 21 -3 6 16 -2 -10 -6 -29 4 -15 1 -2 -19 0 -22 2 -5 1 -3 0 -22 12 -2 -1 -4 -18
264 -18 16 -4 13 25 -13 -6 15 -5 35 14 7 13 -10 14 5 -25 1 3 16 16 7 16 8 -27 -8 11 -3 -24 -39 -3 -28 -15 37 -23 23
299 23 16 2 8 3 -31 -6 -4 -8 -6 -19 4 10 -3 16 -19 12 14 -4 26 -25 29 -11 11 28 3 5 22 19 -6 13 8 -28 -11 1 -53 -10
335 -10 -16 -37 -15 -7 3 -7 8 -5 -8 -3 24 6 -14 8 5 12 18 -2 15 4 3 1 -27 9 -3 13 -22 18 -5 25 -2 -5 -1 -7 1 1 31 -18
373 -18 -22 -8 -12 -13 10 -25 12 -20 -12 -19 10 -25 4 -13 2 9 8 -1 -18 15 11 -19 -25 29 12 -15 -5 22 29 -8 9 -21 -21 23 13 9 3 -3
$$ packed form
126DL74n99k0N10k39k50K63O1j64%J04lj13O1J16j34J1L5K6n2pN7m0kJ2j2J3k2
154a0J5qj2RJ1j3nJ9j6J9k8J8J3%l7K6k7L0J8k0j0J0pJ9j6pRJ8k6OK6l0J1ONj5
190AJ1j8L0k2lj6%JM3n0K6j2Nj1NK1m2jK1J4k0J2j0NJ9k1J7rk2L3qk3K4OPl6K9
227FJ4k8lK8J3l0J4j1k4K2j8L8k4RJ0j8qMk3L3j9J6lj7J9k2K4pOmLk2L4j4Jlj4
264a8L4k0J7J2l8PK1k0M0k1pOk3K4rl0K6KJ3%rRql5J9J9j4k1j5L6k5J3N2o0M6
299B3pj4Onl4K5KmKj3K3Oj3J9l5L1Kj8L0n1N4m0K2J7k5KJ7lk5J9nl6J7J2n4M3
335a0ok1K2QJ0j0J5j3lNK7j8k0K2lPOk0J7j1jkk8L6j2J6l5M0k3L0k7lMoQ%L0m9
373a8mJ4mjK3l5L7l2QpK9l5K9j7J5Pjrj7L3ml0oN4j7k7J0K7Pl7J7l0%M4j0moo
$$ plain form
411 -3 11 -24 6 3 -17 6 -2 20 13 -17 -30 0 22 -8 -9 -14 17 -28 -11 -22 -17 15 -10 -9 9 10 11 1 28 0 -6 9 2 -10 -9 13 21 10
449 10 -2 -12 4 -28 -26 6 -6 0 -29 8 19 -6 -8 0 -1 -13 7 -21 -20 -15 -31 -9 -5 -2 21 -3 -13 22 5 0 7 17 4 1 13 6 12 -18
487 -18 5 6 23 18 20 10 37 9 0 40 9 -6 14 7 -20 -4 -15 15 -6 -17 -9 15 -12 -12 -27 -25 -22 -2 -7 -11 -16 -16 -22 10 20 -1 12 -6
525 -6 23 37 2 16 24 7 12 17 12 7 -10 6 -8 -10 -14 6 18 -22 -7 -4 -1 0 -11 -8 -13 -3 1 16 -6 -3 -24 -6 5 10 -8 -7 -15 -8 35 -11
565 -11 4 -5 4 10 10 0 15 -1 7 21 1 7 8 6 -5 10 16 10 -2 4 -7 1 -11 -2 -9 -1 -13 16 10 -22 -15 -16 -6 -7 -10 -3 -5 -11 -5 -5 -14 -8 22 14 7
610 7 -14 7 3 8 22 0 28 22 4 16 -25 15 2 7 6 6 0 4 -34 -17 7 -14 24 28 2 -21 8 22 1 -1 -7 4 8 11 15 -7 14 6 25
649 25 1 -6 9 -4 3 2 -9 -15 21 8 16 16 0 -17 14 -7 -1 0 6 8 -29 2 10 14 -5 -19 -29 21 -34 -24 14 -27 -6 -37 -5 -8 -10 -9
687 -9 4 -25 -23 -13 -5 -7 -28 10 10 12 -5 28 31 -17 14 9 -4 -7 -6 15 22 -8 -5 2 -5 1 -29 3 -5 12 34 -14 -9 -25 -8 6 -8 8 -8
$$ packed form
411cJ4l5L0lk0K3qK2pl0j3L0K2l0jnL1m5J7j1NL2k5JJ8JJj0K7k8oJ5pj2JK2Qj1
449A0j2j0J6l2KL2j2Ok9L7J1k5kQjj2K0k8JNj6K2MLK3k4j0L5j7nPJ0j3lJ2pOl0
487a8K3JJ7nKj0K7k8rM0l1j5K0pk7J6j1L0k1j1QK4k7%j5KLK0nmn%oL2J0k1J3j8
525fK9J4l5J4Qj7NNnnj7J6j4kmK0J2m0J5LLJj1LnJ0MJ5k2Lk1J8J1Nj8JqPM3m6
565a1J5rRO%j0J5j6QJ4k0OJkj1J5Ooj2Oj1Qj2RpQj2K9ol2PjJ0jlPkoO%rOL0qp
610Gk1K1mNJ4k2K8oj8J2m1M0j3Nj%oMl8J7K4k1L8Mk6k3K9J4k1koJ1MLMk2K1qJ9
649B5k4pJ5j3Pjj1oL6j3Q%j6j7L1k1OJOKl7L1QMj9j4j0N0n5J0L8m1K1l1L2lkJ
687iJ3k9KJ0Qkk1L8%Kj7L3Lm8L1nj3lJK1Pl0LPpOl0L2qJ7K2m8Nj6J7J4j4J6j6
$$ plain form
726 -8 5 -24 0 -4 -9 -6 -12 -18 22 15 -1 -2 -7 -3 14 25 -12 16 2 8 1 16 8 -6 -15 -1 -20 25 27 -23 -3 -16 -12 -13 3 -3 -42 -2 -38 -14
766 -14 -2 0 -3 10 -27 -7 -13 -34 -10 -5 -11 15 -12 -4 -5 5 15 23 8 14 18 2 22 9 6 18 27 12 -1 17 29 -4 -1 12 -14 1 4 9
804 9 10 8 4 8 -11 -10 -21 4 -25 -13 -25 -9 8 7 16 -3 0 2 7 4 -3 8 19 -7 -4 7 -4 19 12 -25 10 2 6 11 -9 13 5 20 3 10 7
845 7 7 -23 -11 -28 -15 19 -10 -8 -29 -27 -19 -3 -12 -24 -23 0 -20 9 13 -2 11 10 -17 9 22 -22 14 5 -1 31 -14 -8 2 -10 7 -2 -1 -2
883 -2 -14 14 6 -9 0 -5 12 14 21 -9 -13 -19 -15 4 9 -10 -8 4 -25 13 -24 4 -2 -4 -8 14 8 9 14 0 24 5 -23 10 -7 21 19 5 -5 23
923 23 23 -14 22 -12 0 5 -14 -15 -9 9 1 -5 28 -27 -6 3 -24 -5 -11 17 -17 -14 2 -2 -8 -1 -20 -7 -2 -2 -11 22 -4 -14 19 0 14 26
961 26 -8 1 5 9 7 -1 4 44 9 1 19 -5 21 9 -20 8 10 -17 6 -11 -12 2 -33 -1 2 -11 -14 -8 4 -4 -7 4 -39 3 0 -7 3 -23 2
1000 2 -8 23 10 22 -12 18 3 8 14 0 4 3 -5 -5 40 2 16 -5 -16 26 -12 5 -12 -33 -1 1 1 -30 -17 19 -7 1 -12 5 8 0
$$ packed form
726hJ3k9K4mnLooM0pj6jnMJ7J1l7K8j4OpJ5qj4rJ4j9M5Kn0K0j3MjJ6ol9M0l6K4
766a4J2KlJ3l7K0ok1K4NoK6k7QjJ0J0Qj5OMj6K0j3lJ2Rj5j3J8J2l3LJ3k6J5LN
804IJkmMj9Jj1K5k9J2j2J6J7jRj9LKNlpJ1J1k6LJ1j1K3pl7L5qMNk0K2qJ5j7Pl
845G%l0J2j7J3L4k9Kk1KQJ6rj2JK3k0K9Mj5J3jk7K6J3m4L6roL2m5OJ0j2J7rJj
883bj2K8qj5RnJ7KPl0moMJ9Nj9KJ2k9L8l7K8okmK2oJNj4K4j9k8L3j7K8kj4j0K8
923B3%l7L6l4J2Nj9jOJ8qoL3n5K1Rk7J9oK8l4LJ6moPj9J3N%rL3k6j0L3j9J4J2
961B6l4RMMkqNM0l5qJ8k4K6j2k9K8Kk7K3j7jJ4l5L2Lj3lOJ2qlJ1m3M2lpJ0k6K5
1000Bj0L1j3J2l4L0j5NOj4Mjq%M5l8J4k1j1M2l8J7j7k1L2K%l1J3L6k6Qj3J7Lq
$$ plain form
1036 0 -24 -1 -15 6 -4 -5 14 36 -7 28 -7 -10 26 7 5 2 -17 -3 -29 -5 -7 14 -4 -9 6 -11 -12 -7 1 -6 -13 -14 -11 -23 10 -3 -15
1073 -15 -21 -27 -4 -3 -23 -14 1 18 20 2 -10 9 -6 -1 1 -11 7 19 1 18 21 -3 9 -14 4 -14 -8 -18 -14 -37 -5 18 25 -1 -14 1
1109 1 -21 -12 -8 -22 -6 -13 -25 -15 2 19 -29 7 0 -26 8 12 5 3 10 9 0 -3 2 8 19 -7 -1 19 -3 20 7 -14 10 -15 -12 -17 -1 3 1 -2
1149 -2 -6 16 2 21 -21 -3 -13 -22 4 19 -17 -14 -2 -25 -34 -3 0 -27 3 -17 8 -5 -16 8 5 0 10 7 -12 12 -35 -1 -10 7 -8
1184 -8 -9 -17 6 -4 9 14 -3 13 17 2 -10 -13 -4 -2 -17 -25 -3 0 6 -15 -8 -3 -31 -35 -15 9 -8 -24 10 12 -11 5 6 18 -2 9 -9 17
1222 17 -13 -10 0 -10 -6 33 -12 -17 8 -2 0 19 -5 -13 -17 0 16 -19 11 -3 -34 -7 4 -8 -26 2 -9 35 -5 -8 -22 2 -6 3 15
1257 15 -6 -19 10 40 5 -5 1 25 2 21 6 12 -14 -13 -1 -7 -8 -6 7 3 -3 11 -1 -12 -16 3 -31 6 -1 5 -15 -1 10 -9 -2 -34
1293 -34 -2 -13 26 -5 -14 -12 14 3 -1 6 -9 -5 13 -7 -14 11 -5 7 -5 -8 -10 -1 15 -10 -3 -12 17 7 -12 -32 -6 -6 -29 -12 -18 -16 -12 -34
$$ packed form
1036@k4K3j4K1j0jJ9K2m3L5l5lL6j9klj9J4k6K4kK1j8nJ5j7jNQppjLj2L3j3j2
1073a5ooK3Jk0RJ5J7Kj8j2J9j5NKj2J8J2j8J7Lk4J2k3J8j8Oj0Mk3L2K3Pk6j3J5
1109Ak2RMj4J6pj2J0J7J7m8L6pk6L4MpkPjrlNOJ1k6OK0k2K3j3k1K4k5LnJ6Mkl
1149bmK2j4J9m2J8j0rK6J5l6LJ2k3rL1Lk7L0k0K5j3j1K4lnJ0lj9K4m7L4rJ7j5
1184hjqK3j0J3Nj7J6Mj5j2lRKj5qK2LOk1PNk8mK0K4j7j6L4Kk3J6JJ2k0J1j8K6
1222A7l0LJ0j0ML9m5nK5j0KJ9k4qmJ7J6l5L0j4l1K7J1j2j8K8j1M4m0lj4K4qRJ2
1257A5k1j3K9L0l5j0OK4k3J9j5Ok6JJ2ojKJ3moJ4j2j1mJ9l4L7pOk0J4J1j9Pl2
1293c4L2j1L9l1rKK6j1mPj5MJ8k0pK5j6J2j2lkRJ6k5PrK9j0j9k0K6%k3J7oKMk2
$$ plain form
1331 -34 -16 -17 -18 1 -22 -14 -2 4 -6 8 1 22 15 -21 -18 -11 -21 -7 -6 -19 4 -11 15 -14 -11 19 -11 -16 5 -10 -6 -3 -16 -5 -7 15 -14
1368 -14 -25 -20 -14 -5 2 -13 -12 -24 -10 -1 -12 -23 -28 -10 21 -21 5 -30 -23 0 -13 6 -2 -14 -30 15 -5 14 8 17 1 3 -5 11 8 6 -5 -26
1406 -26 5 4 -15 -17 -31 1 -9 -3 17 0 -13 -23 0 19 -24 -7 -5 -31 11 14 -14 1 -21 3 -8 -3 3 -4 -6 -4 2 -7 27 12 -6 25
1442 25 -14 -10 9 14 -40 -14 2 7 -9 4 7 -2 -3 -40 -18 -16 -38 0 -8 14 -10 -18 -8 6 -14 -25 27 -4 -7 -1 5 29 30 8 -10 -7 6
1479 6 -22 -4 14 -6 5 12 0 -4 27 23 25 1 -24 -23 -19 8 -5 -15 18 9 -2 6 -22 -15 -1 9 10 -18 9 -1 -13 -15 -13 -3 -1 -18 4
1516 4 -2 -9 -5 -4 -14 26 0 -18 16 20 22 3 -1 34 4 44 9 -10 16 -23 -12 -21 5 -1 -6 4 0 -4 -1 -10 1 -13 -35 -6 -9 11 -26 8
1554 8 26 -26 25 -2 5 -15 6 11 19 -9 1 -10 -1 2 15 -5 3 8 -28 -9 17 -13 8 -12 -6 4 15 -15 30 -18 4 15 -7 4 -14
1589 -14 11 0 2 -6 13 -1 -10 11 -10 -2 9 7 -9 9 29 2 19 24 1 14 7 11 -14 22 -7 8 27 19 10 9 -4 0 25 3 4 14 -1
$$ packed form
1331c4J8jjJ9k3QJ2Oj0J4pK1pl6LPj0J4Jj3K3j5K6k9LL0l0nK1j5MLj3J1kK2k9
1368a4j1NORPj5Jj2J4Rj1j1nJ8L1m2K6l5PK3j3J9qj2j6M5k0J9oRj6KqJ6lkj1k1
1406b6L1jj9kj4L2j0OK0j7j3j0K3J9m3J7Kk6M2Lk8J5k2K4j1NOpkKOrL4j5j8L1
1442B5l9MJ9Nn4K6J6Nj6J3Lrjl7K2Kk2L8qK2k4qJ0J4k0j1N2l1lOOK4Jk2j8LJ3
1479Fk8J8J8k0J1Pj2mL1mKk4k5JMK7j3j0L3rj1Qk8PJ4J0Jk8K7j0j2kKJ0Kj7K2
1516DopMJj0M0k6j8L4MKj9mL5l0M0l5j9K6l9J1rK6onJ0mmLrJ1j4k2K9lK0l7L4
1554HJ8n2N1k7Pk0K1NQk8J0j1RLJ3k0QNl6J9K6l0K1k0OJ0J1l0M5m8K2J1k2J1j8
1589a4K5j1KqJ9j4rK1k1QJ1kj6J8K0k7J7Nk3J3pMk5L6k9J5J9qrjj3MK5k2JJ0j5
$$ plain form
1626 -1 -8 -3 -16 -19 -20 -18 -19 -8 8 -11 16 -9 1 17 -8 -36 -1 1 -13 6 25 -8 1 18 11 10 12 11 9 -9 3 -17 -29 0 1 -4 13 11 -11
1665 -11 -4 6 -3 -6 -2 12 -5 -2 -1 41 -18 -8 10 -3 -23 -15 -16 -3 -3 0 3 -2 18 -5 -11 -9 -8 -21 -2 -13 5 -5 -12 21 8 -10 10 -5
1703 -5 -13 -4 -1 2 9 12 -7 -10 -32 -17 9 -11 -16 13 -1 -13 -19 -13 14 5 -5 -1 -12 -26 -4 -3 17 -23 26 29 -8 -14 30 4 -8 -13 -3 16 -8
1742 -8 -12 7 10 6 2 -15 4 -7 22 -21 -7 -5 -11 1 -4 -6 9 18 -15 11 -23 -15 16 -10 -5 -13 -10 9 -7 1 -21 0 -23 -15 5 7 -14 -4 6
1781 6 9 -11 -16 -3 -11 -15 -13 22 17 13 -6 3 -14 1 4 -9 4 -28 -5 -4 -32 5 -21 -15 -1 -27 -28 -19 24 -12 -4 -1 1 -2 -17 20 7 -20 10
1820 10 -28 12 -19 -17 13 22 16 10 9 -2 -3 -13 4 -10 16 2 5 12 -3 -6 -9 -2 -5 -10 -4 4 -12 -7 -22 -15 11 -4 0 -4 13 -1 -13 -3 -7 -35
1860 -35 3 0 -3 14 27 14 -8 7 32 12 15 6 9 15 17 -2 -4 5 6 12 -4 -13 9 -36 -5 -15 -16 4 26 -4 -13 -24 -17 17 16 7 -15 2 7
1899 7 0 -30 -16 34 24 17 -13 -7 -16 13 10 7 -22 10 -19 -2 7 13 34 -4 7 15 15 -10 -2 -25 1 10 -3 -25 19 -15 4 -26 -15 -15 -6 -6
$$ packed form
1626apNj3ljKjJ1J6j9K7k5J0J6k5k8L5Kj4J9J9l3RJ7pjKjkj8J2k0j2K9JnJ7kk2
1665a1PJ0rlMJ4j7LJM2n9J0J8j3k0QjJ3%LLnK0k3oKJj3J9j1J8j0pL3j3j8K0j5
1703eqRLLPLj9lk2J5K6k0nK9j4j2oOK7rj0Mj1j4K2JK0m0M9Ll7oM4k6j2nJ0J9k4
1742hmJ9Lmmj7J9j1K9m3J4KoJ2nkJ5Rl3K6l4QL1k6NqLJ9j6Qk2K1k3QK0Kk1J0J0
1781FLk0nJ3qmKL5nmj9Rj7J5Lj3J3l2K3Jk8L7k6OJ4k6jRM3l6QLKlj5L7j3k7L0
1820A0l8M0l1KL0Roojj1jj0J7j4K6j4LPj5llPlnOQj6Nj5PK6j5MmJ7j4j2J0mk8
1860c5L8llJ7J3j3k2J5K5k0LrLOKj9kRJOj6rK2m5L1j0jK0K2l0rj1PL4jrk2J7N
1899Gpl0J4N0j0pl0OrK9llk9L2k9J7ROK1l8J1Q%k5Qk3K6Rj3k2M4l4J9l0J1%R%
$$ plain form
1937 -6 -18 -6 -12 0 -28 -41 -1 23 -4 -31 1 13 2 17 7 23 11 14 -9 1 2 -3 16 -1 1 4 -8 52 -8 2 -26 4 -1 19
1971 19 -25 18 -8 -7 -4 -8 12 -8 -8 8 -8 3 -15 -5 4 -12 3 4 17 -7 0 -21 36 2 17 -3 28 14 -4 -1 6 10 31 -10 -10 23
2007 23 -4 -20 10 -8 2 28 -4 -13 -19 -9 -19 -13 -9 -8 -10 22 -1 -31 -24 -37 -6 1 1 -18 -5 -12 -15 5 5 0 -5 36 29 -9 -9 8 -12 4
2045 4 28 22 14 -16 -12 3 8 -5 8 -11 11 -27 -1 -12 -14 1 0 5 -28 3 0 -32 -13 -36 -8 -25 -9 14 15 22 9 -14 -16 21 7 2 11
2082 11 10 7 -15 -22 -29 -1 23 -8 -10 -10 15 7 5 -9 -11 4 -13 -3 -20 -12 -16 5 -38 -17 17 0 3 -7 -15 -33 6 -40 -1 -4 2 13 -6 -8
2120 -8 -25 -3 3 14 0 21 -19 -23 -16 26 6 -6 -3 -6 -5 -12 11 -8 3 11 -3 -13 9 -7 4 -21 -17 4 -6 -21 -22 10 -25 -23 -19 -17 -16 -19
2158 -19 7 -4 -28 0 -10 -29 2 8 3 24 6 -8 -1 15 15 13 32 38 30 24 -7 -11 -3 22 -12 -15 2 18 -22 -8 4 4 -13 -12 -27 -6 11
2195 11 1 -10 -18 26 -40 0 7 0 -1 -4 -15 5 -10 -5 18 28 18 -16 -8 2 7 12 16 -12 9 4 13 -4 26 -16 12 3 -10 -7 5 -23 4
$$ packed form
1937fj2J2oJ2k8j3M0K4k7k7L2J2j1J5j0J6j2Lk3J0JnJ9j7KLj2O0o0J0k8L0nK0
1971A9m4M3k6JLmK0k0%J6j6J1j8J0Rj6J5JJ3k4Pk1N7l4J5k0L1j4j8LPMK1m1%L3
2007B3k7j6L0j8J0K6l2roJ0j0OMJkL2k3l0Pj3L1P%j9J3plK0%nnM1pl8%J7k0J6
2045DK4oql0MJ5Nj3J3j9K2l8K6j1kJ5jNl3L1ll2J9k3K8j7J6K3JPj3k3kL7j4nR
2082A1jlk2ppK8K4l1k%K5qkj4kJ5j7J0j7QmK1m3K1L4j7Lj0qj8L9m6L9lOJ1j9k
2120hj7K2OJ1j4K1m0mPM2k0j2LlJpK3j9J1Qj4j0K2j6J1k5MK1j0j5jL2l5KMKJl
2158a9K6j1k4K8j0j9L1OnK1j8j4PJ6%kJ9Oqol1mQK5l4lJ7J6m0J4J2%j7Jj5K1J7
2195A1j0j1qM4o6M0Ppjlj1K0j5NK3J0j0l4QJ0NNMk8K1nRj7L0m2K8rj3LJ2k8K7
$$ plain form
2232 4 -4 -16 2 -19 6 -15 -23 -6 25 -32 16 9 10 23 -11 -5 0 22 -14 10 -20 25 -11 -7 15 0 3 25 24 17 -6 -3 -4 -2 -1 -21 9 3
2270 3 6 4 -4 -26 -1 -8 -1 12 13 4 -4 1 0 23 10 11 -17 -16 8 2 -8 -7 -5 3 15 -13 -2 2 20 22 18 -3 15 10 12 -2 8 -5 15 -9 -27
2311 -27 -13 15 -35 -8 -26 -19 9 -7 -3 -7 20 -16 3 0 -12 -8 1 -2 0 -13 -11 -19 27 -9 37 2 16 -7 -23 -1 17 -7 9 4 13 -20
2347 -20 3 13 -3 -8 -13 18 -1 1 14 17 9 18 -7 16 8 -9 3 -6 15 -14 2 -13 -11 2 14 -20 8 2 -16 12 25 2 10 22 -5 2
2383 2 22 8 -14 8 1 0 21 4 33 -14 -17 15 -9 -5 9 22 22 -5 -15 -17 -7 8 -6 6 -4 -9 27 -4 16 -9 2 -5 -4 -3 -33 -5
2419 -5 5 -2 10 8 19 -3 4 5 -11 12 -4 -2 0 2 31 19 12 -40 -8 3 -24 4 4 8 6 -14 -21 -5 2 5 -7 -33 -11 -20 -15 -25 10 -21 -12
2458 -12 13 -16 -2 10 12 -26 19 13 -9 -11 10 2 -4 -7 4 9 -18 19 12 -10 -7 -32 6 6 -11 -9 -20 1 -4 -12 -4 -20 -21 -19 20 -19 -17 8 -25
2497 -25 -5 8 0 -8 -1 -28 -8 -7 9 8 11 12 1 13 9 11 -23 -15 4 -12 20 0 -3 7 18 -21 12 22 3 -17 -16 -2 -8 10 -28 -2 -7
$$ packed form
2232Dqj2J8k1K5k1qJ7L1n7M8pJJ3l4ONK2l6K4l0M5l6MK2j5LK2jpk3LjKJk0L0o
2270CLkqk2K5pPJ3JrqNjK3j3Jk8JK4oj0JKQJ2k8J1MJ8Kmk1J8nKj4J0j3K0k4j8
2311b7J4K8n0K7j8PK8j6MmK7l6J9lj2MRlKj3KqM6l6M6l5J4k3j6K2J8k4J6nRl3
2347b0K3J0j6nnL1j9KJ3LqRk5K3qj7J2rK1k9J6j5KJ3J2l4K8oj8K8J3k3QJ2k7P
2383BK0j4k2K2pjK1j7K9m7lL2k4MJ4J3%k7j0kJ0J5j4J2j0nL6l1K0k5J1pJJl0K8
2419eJ0pJ2kJ1k2PJj6K3j6KKKK9j2pn2L2J1k7K8%Mkk0pJ6PLj2k6K2rNj0L5l1R
2458a2K5k9J4J2Kl8M5ok2kK1qolJ1Nk7L7pk2Lk5L8%j7Kj1K1nqQj6jKL9l9KK5l3
2497b5K0J3qqPk7K0JJ6jLJj1J2mKl4QJ9j6L2k0lJ0J1l9L3J0j9k0JJ4oJ8l8K6n
$$ plain form
2534 -7 -7 1 -10 -18 -18 2 -11 5 -19 -11 -18 -6 7 18 30 11 2 3 -30 5 13 23 -13 -7 9 -15 2 8 -11 3 -7 -15 -7 -12 -9 3 -19 5
2572 5 3 4 2 -5 -21 -1 -24 -20 -17 -18 7 -23 3 -30 1 -5 18 15 -20 9 -8 -33 0 13 18 12 12 -5 25 -23 -10 6 -9 3 -2 35 -5
2609 -5 14 5 10 18 -15 16 14 5 -10 21 13 -8 6 4 29 -19 -20 1 10 17 -11 0 0 3 4 12 3 18 1 8 8 29 0 2 23 -3 -11 -1 3 9 -10
2650 -10 23 -4 -6 0 20 10 12 -22 31 -22 7 -2 -24 -13 -8 4 -11 -8 19 -18 -12 -15 5 -4 0 -2 19 -8 6 1 -12 -16 -11 26 19 17 30 9
2688 9 -10 18 4 7 21 9 6 18 -8 -11 -2 0 1 26 -1 6 -4 20 -12 -1 -9 -3 -20 -4 37 22 5 17 4 33 5 -6 -2 -2 0 -8 -1 -2
2726 -2 8 -16 12 -27 -4 11 10 6 5 -12 -2 -4 -9 19 -21 -4 -4 -22 24 1 -20 35 8 1 3 3 7 -21 -1 7 4 -26 -17 -5 -10 -32 -4 9
2764 9 15 -18 16 -23 5 25 20 4 20 19 33 2 -9 -6 28 -8 -10 1 -10 -4 13 7 20 -21 -4 2 -7 25 -2 -3 0 25 14 -9 -11 -16 0
2801 0 34 35 -5 -5 -4 -6 -9 -15 -9 -2 -20 -8 21 3 13 26 3 4 28 2 2 22 -3 7 -2 19 6 11 12 -6 -6 23 -6 -5 -12 -37 7 -27 6
$$ packed form
2534g%Qj1q%K0j3J6k4QpJ2J3J1J2j9rJl3L5QJ0l6OJ6k4J7Oj9J4j0qQnLJ2k2K4
2572EkJkpj6K0k3MLjK5l0K6l3L1oK3ll5K9j7k5L3J3No%j7L0m8J3J6j5J2nL7m0
2609eJ9rNQl3L1krj5L1qk1J4kK5m8jK1RPk8J1%LJQrJ5j7P%K1k9KK1k6qJ0MOj9
2650a0L3k7kOK0j0Kl4N3n3K9rk2J1NJ2j5LK7l7OlK0rMkK1k7J4nj3mNL7pkJ3k1
2688Ij9K8j4LJ4j2lJ2k6lRKJK5k7Pj0K4l2J1qOj7J6M1j5j7J2j3K9k8j1M%KqPj
2726bJ0k4K8l9K3J5jmjj7J0knK8m0J7%j8M6k3k1N5k7pK%Mk8K0Qll0RJ2nk2K8J3
2764IOl3L4l9K8K0nj6J6jJ4l1j1LL4l6kJ1j1OJ7oJ3m1J7OrL2k7jLK5j1k3knJ6
2801@L4Jm0%JkloOPj8J2K9j8J0J3k3JK4k6%K0k5J0rK1j3NJj8%K9k9Jpk5M4l4L3
$$ plain form
2840 6 -1 -25 -12 -3 10 -5 -11 -11 21 6 16 -10 9 -15 -2 40 -1 6 -19 -17 -1 4 -4 11 6 -8 18 10 -2 15 19 -2 17 1 5 -7 -2
2877 -2 -9 -14 3 2 -11 -8 -9 0 -6 -3 -13 3 2 -3 9 14 -23 13 6 -9 1 12 9 -1 22 24 -25 4 8 17 18 0 18 22 11 14 -28 2 12 4 24
2918 24 1 18 7 16 -8 -1 -9 -1 -7 -1 1 10 -14 1 -8 4 4 9 10 10 -12 0 -5 8 10 8 28 1 15 -5 -6 -5 -7 8 28 5 -2 14 9 -19 0
2959 0 -6 11 1 -6 -12 6 -9 12 5 -17 -20 -8 -23 8 0 7 17 -6 -1 -6 -19 17 -4 -12 14 -1 -2 17 -22 13 16 14 -13 6 12 -19 4 -19
2997 -19 7 -7 0 -2 -8 5 -6 -13 -13 -23 -19 -3 -8 -11 -12 -15 -30 -3 19 -29 15 2 -23 -5 0 -23 14 25 -16 4 8 21 6 14 -10 -11 12
3034 12 -3 9 36 -15 -2 -1 5 -16 -23 0 8 5 -2 -6 1 -6 4 -31 4 -19 -18 5 -30 -6 -18 -25 -20 3 -6 -13 12 -8 5 -12 -6 -11 -1 -4 21
3073 21 -12 -10 10 -1 -5 15 14 8 18 3 -28 34 -2 -6 -4 -15 -7 -11 -1 -13 9 -21 -21 -2 -5 -33 -35 -4 6 1 7 -8 13 -1 10 -33 11
3110 11 32 7 -12 7 -18 1 6 0 1 0 26 14 9 -4 -8 7 11 -6 -2 -11 -20 0 -11 -20 4 -8 -17 -27 -17 2 -38 19 14 -25 -7 -7 -13 -13
$$ packed form
2840Fpk4J3RJ3j5o%L2j5J0k6J9k4J3M2m1Pk5KJ6NqJ5nj4K6qj2J7Mk1J9j6Mj2N
2877bpnJ7jj3LjRoLj0J6jnJ2Nl7L6pj5J0J1lj0K3Km9K9MRJj8J8Mj1Lm2L0J0qK0
2918B4k3J7j1Rk4PqQoOKRk4J5rJ2%NJ%k2J2nJ3KkK0k7J4k0jJkJ5K0k3pJ6nk8J9
2959@oJ7j0poJ8j5K1pk2lJ2j5L1qPJ0k3Nnj3L6k1qK6j5jJ9l9L5Lkk7J9Ol1K3k3
2997a9K6j4PkoJ3j1p%j0MJ6nljlj5K7K2m8M4j3k5J8Nk3L7J1m1K0MJ3j5Qk4jK3
3034A2j5J2K7n1J3JOk1pK3QlpmPpJ0l5L5k3JK3l5K4j2pNK3rpK5k0J3j7OnJ0lK5
3073B1l3KK0j1mK0joJ0j5l1O2l6mKj1QmJ0j2K2l0%J9lk8kL1J0nOj5K1j4J1m3M4
3110A1K1k5j9J9k5J9NoJjK6j2nj3mJ5Mj7MrrK0j1rK4j2rj0J0J9m0N7nl9J8%o%
$$ plain form
3148 -13 7 5 -18 19 -28 -13 5 -2 24 -13 -1 10 -7 5 15 3 -18 19 12 -10 -9 -9 8 22 -26 -21 5 -23 -12 14 1 -29 -12
3181 -12 -26 17 -1 -14 -9 -10 2 -4 -5 21 -4 -18 -1 -25 -6 3 7 -9 -1 6 -13 -3 14 0 -3 -19 7 10 35 13 -4 -9 -1 -6 -11 -13 2 -16
3219 -16 -10 -18 -14 10 -13 -4 -30 -27 -19 -7 -23 -17 -26 -20 -15 16 2 2 7 -8 -13 -34 9 1 -27 25 -15 2 -6 -6 -10 -9 -2 -22 21 31 16 -12 3 -10
3259 -10 -3 16 2 -7 -20 0 6 -20 -6 -2 -3 16 -7 -1 -13 -7 9 19 13 -8 -23 0 22 -12 2 24 17 -14 22 -4 12 -4 6 16 -1
3294 -1 17 13 28 -1 26 -9 0 -3 2 -13 -3 -17 -3 6 1 -8 -16 -25 -8 -34 -10 1 -14 6 -20 -8 -10 -1 6 -16 7 2 -5 -10 11 -12 15 6 -7
3333 -7 -5 -11 16 22 29 10 9 -17 0 -23 -14 -8 -18 -13 -19 0 8 2 -23 34 -23 -2 -8 19 -17 -16 -9 3 -7 -33 -27 -13 -9 17 9 -3 -6 2 -7 -6 -38
3374 -38 1 14 20 25 -1 -3 -4 9 10 15 4 6 2 15 -5 5 11 -12 -35 4 1 0 2 -13 -23 -6 19 -10 -8 -20 -20 -1 -12 3 7 -5 13 -2
3412 -2 -7 12 15 -5 14 -22 -17 -11 0 15 -3 11 6 38 24 10 15 -1 -17 -9 8 -5 0 -10 17 -5 -4 -12 0 -15 -27 4 11 8 -2 14 -18
$$ packed form
3148a3K0kk3L7m7J5J8pK6l7J2J1j7J2J0j2k1L7pk2J%J7J4m8NK6k8J1K6j3l0J7
3181a2j4M3j8j3NjJ2ojK6k5j4J7k4J9RMj6QPj9J0J7j4lj6K6LK5k2j7nQnnkJ5j8
3219a6OqMK4k3Rk6LQJ2j6OrONL1j4%Nj5nk1M3qk8N2m0J7q%mJPk0M3J0j5k8J5j3
3259a0PJ9j4rj3K0Ok6J4MjJ9k3Oj2OJ6J0ok1j5K3K2l4J4K2pl1L6k6J6j6J0J0j7
3294aJ8mJ5k9K7l5RlNj5J0j4J4RnrqrJ7k6K4J1j5K0k6J2kRPk2K3npnK1k3K7rj3
3333gKoK7OPj9jk6J7k3ROj0NoJ9Qok5N7n7K1oK7l6JPJ2j0k6OJ4MK6qj2lQrJl2
3374c8L9J3ONk6kjJ3JNj1KmJ3k0J0Ok3k3L9ljKj5j0J7K5k9Kj2%J9j1J5Mj2J8j5
3412bnJ9Lk0J9l6NOJ1J5j8J4nL2j4j4Nj6j6QJ7j3Nj0K7k2JqJ2j5j2L1Plj0J6l2
$$ plain form
3449 -18 10 -37 -9 8 -6 -11 21 3 33 3 -2 6 -3 -9 -9 9 -4 1 -3 -22 15 -1 9 6 -13 21 4 -16 19 16 -14 -1 -9 8 -11 -18
3485 -18 1 -13 4 -17 7 -24 -6 -2 -9 9 -36 -27 10 -22 -2 3 -33 6 -3 7 39 36 37 -2 -3 -10 -4 -16 -37 -1 22 7 -12 -21 -13 2
3521 2 -3 31 -3 -8 -2 -7 -4 4 16 -6 -2 -5 -12 -28 -4 -15 24 -13 16 -21 -15 4 8 3 -10 -4 13 36 -1 4 1 15 30 16 -6 9 -12 17
3559 17 0 2 0 -11 -5 14 -14 -6 16 8 2 2 -26 -21 -9 9 19 -17 -33 -7 4 -20 -19 12 15 -26 19 -1 0 4 -6 34 1 -1 -8 -42 -6
3596 -6 22 11 18 9 1 3 -1 7 22 -7 10 17 -49 -34 -16 12 -13 -4 -3 12 5 -19 15 -4 -6 -15 -5 6 5 -12 5 17 2 -6 -27 -6 13 8
3634 8 -5 17 -12 0 -9 -14 15 24 7 30 -5 16 -11 -10 21 27 -2 -8 8 1 24 2 -1 -12 -18 23 -5 -2 32 -12 9 -37 -11 -6 -12 -25 21
3671 21 1 18 -12 2 -7 13 -15 9 -20 7 -32 -31 23 16 -13 -16 9 9 9 2 -15 -2 0 4 -34 -10 -1 0 -20 -6 -25 0 -11 -19 4 -12
3707 -12 -27 -13 -17 8 -18 -13 2 12 26 -11 13 -3 2 17 11 -17 -13 -6 7 10 -4 9 6 16 -1 15 -3 -23 5 10 10 2 6 31 -14 12
$$ packed form
3449a8K8m7K8J7j4nL2j8L0l0nQro%J8j3Nmj9L7j6J0lj9L4j7k0L5ll0J3qJ7j9p
3485a8J9j4J7k1K4l1J8MpJ8m5RL7l2K0Nl6L9rJ0L2lJl9jpOj2k1L6K3j5j9rQJ5
3521BnL4l4nOnLQJ2k2Mlpj6K4j1L9l7K9l7OJ9Mnj3OJ7K3l7NlJ4J5j4k2J5k1K9
3559A7j7Kkj1OJ9k8QK2qo%k8NJ2J8J0l6j6K6J1k4JL1Lm1M5k0JMj0M0l3kpl4L6
3596fK8j1PrqKmQJ5k9J7Po6J5J8K8k5RJJ5pk4L4j9krJ0J1jj7J7J2j5qk1K1J9n
3634Hj3K2k9J2rnK9Rj7K3l5K1k7JL1Ok9oJ6pK3k2lj1oM1k8LL4m4K1m6K6Noj3M6
3671B1k0J7l0J4rK0k8K4k9K7l9JN4pk9lK5%%pj7J3KMl8K4RJk0J4j9K5j1qK3j6
3707a2j5J4mK5k6NJ5J0J4l7K4j6NJ5ok8MPJ3Lj4J3lJ0j7J6j8k0K8N%qMK5m5K6
$$ plain form
3743 12 9 -11 -5 -10 8 -13 -9 -15 7 -12 -5 4 -1 16 5 -10 12 26 -17 4 -30 -12 -7 -26 -2 14 9 -11 7 -20 -38 -16 -3 25 -13
3778 -13 -25 -22 -7 -9 -11 -7 -28 -6 -22 -30 -15 -34 -8 0 11 2 -17 16 15 -7 -4 -5 -6 12 9 -5 1 -15 33 36 10 17 17 -2 3 3 -11 27 11
3817 11 2 9 18 -21 -14 -20 -6 -6 -21 2 -32 3 -26 -9 -21 -7 -12 16 19 -22 -5 -5 -15 18 -16 15 7 -3 1 -6 0 -1 -1 14 5 17 -10 17
3855 17 12 -20 7 1 -10 -30 22 6 -5 18 41 11 -13 -4 -21 -11 -13 -26 -25 -8 7 0 3 -11 -25 -10 -10 -11 2 -25 -11 19 2 -8 -2
3890 -2 20 1 22 -14 -6 -12 5 17 -21 -26 10 -11 15 -28 19 14 13 -11 -8 12 21 13 8 8 -17 -17 -31 -14 13 1 -15 -20 1 -9 5 15 5
3927 5 -13 -7 9 -3 -26 -7 16 0 -2 11 5 -6 8 7 7 24 -15 -1 -17 -5 -9 17 3 -10 8 -33 8 0 12 -10 4 -16 -18 -22 -13 0
3963 0 12 5 -31 -17 12 -8 10 -11 0 -8 -9 44 31 12 -6 27 13 18 2 -25 4 8 21 0 -9 10 -10 9 -2 10 -3 7 22 14
3997 14 0 -5 -4 10 19 -5 -23 -11 -21 -13 -13 -23 11 -19 1 -6 -3 1 8 -7 3 -18 -6 30 -3 5 1 4 10 7 -6 -30 -16 -10 4 10 -44 2
$$ packed form
3743A2lk0OnJ8k1MoK2j9PRnJ7j1j5K2J4m3K1l4J8Nj9K4J6nk0J8k7j8K2J3K8l8
3778a3j2LJ5kkMk1K2j6qJ5j9K6QJ1rj9L3jk2LjjJ8lj4Oj6M8Lk6P%j9N%j4L8j6
3817A1rPRl9PoJ4%j5K3l4L5k9J7j2J4nK8Lm1J7%j0L3l4L1qj0MpOj%J5rJ2k7K7
3855A7nl2K7oj1k0N2j6j1K3K3l0k4Rj7J0kj3JJ7J5pLj4j4J5%jJ3k7J4L0j7j0O
3890bK2j9K1l6QoJ7J2l8nL6k1K6m3M7njk4LK0Rqn%k5%j4J7K7j2j6nK1j0J4J0j0
3927Ej8OJ6j2k3J9K3j6kJ3oj1J4j%J7l9J4j6J2mK6j4j3J8m1M1qJ2k2J4k0kmRJ3
3963@J2pl6J4K9k0J8k1J1qjN3j3j9j8L3j4Nj6k7K9MJ3k1rJ9k0J9j1J2j3J0J5q
3997A4j4nJJ4Rk4j8J2j0Q%j0L4l0K0pLMPj5J0k1J2L6l3QmLOlj3k4J4OJ4On4M6
$$ plain form
4035 2 15 -9 -7 -11 -2 19 -3 -2 13 5 15 9 -1 -1 -16 -8 -2 7 -10 -9 4 -10 9 -4 18 -5 -3 29 26 17 11 2 8 11 3 9 -3 13 -21 5 14
4076 14 -12 13 -6 -1 39 -15 -8 -18 -16 9 -16 -5 -31 -19 -21 -31 -3 -16 -28 0 -4 12 3 -2 16 9 4 10 17 -4 4 7 -6 16 -7 25 3
4113 3 5 18 -19 -8 4 4 16 -7 0 -3 -13 2 -13 7 -20 -7 -24 -13 -17 -3 -7 -17 -30 27 -6 8 -22 9 4 1 12 4 -7 -5 -11 20
4149 20 -10 12 -3 13 -10 -2 -14 14 -26 -2 0 10 -1 -19 6 2 21 -13 -1 -4 -17 5 -13 -18 1 -8 -8 -31 -11 -4 -5 9 -11 -9 -16 -15
4185 -15 -16 -13 -4 -19 3 1 8 -7 -20 19 15 -8 -3 7 -5 -20 4 -5 -14 16 -34 -6 4 9 11 -9 -14 -17 -4 -1 -15 -15 -35 -14 10 -14 0 -10
4223 -10 -9 -14 -31 17 -5 -5 30 -33 -19 9 26 0 32 -5 6 -7 11 34 -14 -9 2 5 5 5 2 -7 -8 12 25 -4 2 5 -38 21 -4 -9 -11
4260 -11 -31 -13 -10 12 11 -21 -5 1 24 32 -1 7 3 -23 -9 -11 -11 9 -16 8 22 -17 6 -21 -6 8 17 -2 -13 -4 -10 -9 -20 3 3 -10 -7
4297 -7 -12 44 -1 11 5 2 -24 0 -1 -1 2 -42 2 9 -18 -20 -6 -35 5 -5 -1 13 1 11 -2 -15 -1 -6 9 6 27 4 0 -26 10 33 10
$$ packed form
4035BJ3k4KmRK1k2JJ5qJ0oj0%j5QORj7JJ3j4J9j3K2k3KL2lrorOLqOj2J6l4K6R
4076A4k6K5j9NM0n4Pj0KK5k5J1k6J2kj0K8j3j2K8mJ6rnJ8pnOPk1QLj3K2k3L2k2
4113CKJ3l7J1J2%J2k3Plj0J5j5K0k7J3j7J1mJ4mj0j3N7l3J4l0L1nlJ1qj1KoL1
4149B0l0K2j5J6k3Qj2K8m0K4KJ0j1j8K5mJ9l4J2lj3K2j8nJ9r%k3K0PjJ4k0KpJ
4185a5jLRj5K2kPj5j3L9mk3NJ0j2j5K4rrL0n0K8J0NKk0nlJ3Lj4%k0K1K4k4J4j0
4223a0Jnj7M8k2%L5o3J4K8J7k6L2l7J1j3J8K3m8NJ1L%%lrjK0J3k9OLm3N9k5nk
4260a1k0J8LK2jl2J6OK3Ql3Qmk6J4k%K0k5K4J4l9K3k7J5J4Rj9j1RoJj1K3%j3L
4297gnN6m5J2olk6K4j%Lm4M4Pk7kJ4k9M0j0MJ4j2J0j3j3J4nJ5lK1k3mk6L6K3k3
$$ plain form
4334 10 19 5 5 -8 -18 -7 15 3 -1 -3 -18 3 -10 -8 -4 28 -15 1 -21 -21 -1 -19 -11 -21 -8 -9 15 -7 15 4 1 1 -31 -6 8 3
4370 3 -8 -13 -29 15 -3 -6 36 -9 5 -18 -15 -1 16 -12 -28 -19 14 7 -17 0 -24 -5 -8 -34 -5 -12 -35 18 -7 0 -11 -17 -4 -12 14 -21
4406 -21 14 9 -12 -13 -31 9 -3 6 12 8 -14 12 7 -9 -7 4 23 -16 13 -13 -30 11 5 0 -3 3 14 -13 -30 -21 3 12 -33 -13 -32 -30 -11
4443 -11 -11 -13 -26 -5 -9 11 5 -8 21 9 -19 25 -2 1 -16 -7 3 1 19 -20 -13 7 -1 -26 3 -14 13 9 13 -10 5 1 -19 -18 2 -22 -32
4480 -32 17 -15 -32 -16 -24 -11 -15 -17 8 -17 5 8 -9 4 28 2 -1 -19 21 -11 16 7 8 3 6 6 -15 -6 -8 -2 -3 3 -11 -2 4 8 -32 -22 1
4519 1 12 2 -15 -15 -26 1 29 -12 -24 18 -22 -9 -18 -3 9 2 -2 27 8 -34 0 -11 23 8 -20 -8 28 8 -1 -8 -7 1 -3 -14 -11 -4
4555 -4 7 6 -5 -12 -5 -23 -16 17 -5 23 -7 -21 -10 -11 -22 4 3 4 10 -29 -15 -15 -14 -19 14 -5 16 17 -1 13 -3 -11 -5 -3 12 14 4 7 1 15
4595 15 -6 15 -19 24 -16 28 4 7 4 7 -7 -18 9 -9 -8 -29 -39 -14 2 7 -12 -27 10 -25 -22 -17 7 -14 -6 -22 -5 -3 -9 4 14
$$ packed form
4334A0Rj4%j3j0J1K2j2mkj5K1j3KML2m3J6k2%K0j8Qj0J3jK4k2K2j1l%l2K5J4n
4370Cj1nj6M4j8lM2m5J4k3LJ4J7k8j6RL3pk4J7k4J9lk6K9pk3N3k5Pj1oJ3qK6l5
4406b1L5nk1jj8M0j2ROmk2K6nj6KJ1J9l9K9k6j7M1onlOJ1k7j7RK4Rm5K0j9KJ9
4443a1%kj3K1mK0oj3K9j2k8M4k7Lj7RJ0kJ8l9PK0qk5K9j7K7mMk3J5mk0JK0k4j0
4480c2M9l2j7J6qJ3mkK5k5K2Lj7J3K4k6lj8M0l2K7rJnL%k1RkOjOj4ROMm0J0K3
4519AJ1j0j7%j1K7K8m1j2M2m0J3rJ5J2pmK9j9m2L4j1L4j5k8J2L6k0rpJQmj1LP
4555dJ1jj1pPj8PL3k2K8l0j4J1jj1K6jJOl9J4%JnL3j9K1Jj8J4j6qOKJ5Kj0LoJ4
4595A5k1K1l4M3m0M4k4LlLj4j1K7j8Jk1j0K5J6Nj9j5L7l5LNK4k1Qj6J7KoJ3J0
$$ plain form
4630 14 -18 6 10 28 16 -10 6 13 -11 7 -16 8 -9 7 -15 5 -18 -23 -2 -27 -2 9 3 -6 -11 -8 13 -3 -11 -8 -8 -7 -15 -8 -2 2 13 -17
4668 -17 10 -21 3 -8 5 7 11 -8 -5 7 11 3 2 3 -5 7 -3 -15 2 23 1 8 -3 -4 -15 19 -3 -18 8 -7 -9 27 -20 2 0 -11
4704 -11 -13 -17 14 -19 -4 0 19 -2 8 34 24 3 20 15 -5 -10 15 2 7 -8 2 11 2 9 14 -1 21 15 -8 18 -13 8 37 -30 22 17
4740 17 8 -10 6 11 -5 3 21 7 -15 -14 15 -2 34 -5 1 26 9 -10 -23 32 21 -2 11 19 0 2 13 -8 11 3 4 -5 -20 5 -1 -20
4776 -20 10 14 -15 -30 6 -2 -21 -16 -15 -6 -46 10 -1 -27 -1 10 -3 8 -6 -25 -27 -12 6 -5 16 14 -10 -13 7 6 -5 9 6 0 -10 21
4812 21 25 -13 -3 -7 -8 11 7 6 -9 -8 -7 4 -3 -15 -10 -24 -12 -20 3 -3 6 -7 -13 2 -8 -18 7 0 -6 3 10 6 -6 4 -27 5 21 -12 -9 -6
4852 -6 4 8 -17 8 -25 -3 -35 8 10 7 -10 -11 -23 -18 -12 -12 -28 -4 21 -32 -25 15 -1 -14 -10 -13 -21 -4 -16 -25 -12 27 11 2 -24 -4 -3 1
4890 1 16 -12 6 1 -20 -3 -7 -9 -6 -18 9 9 13 -16 14 -12 -2 9 -13 -7 -44 -28 -13 -6 -33 -18 -23 8 -22 13 -8 13 -3 -7 -14 0
$$ packed form
4630A4l2K4MJ8j2k6J6Pk4J8k3K4j7J6k2K0k3nK1k5K5J1ornLK1j6qL%JqPOMJ1l0
4668a7K7l1K4j1J3KMj9LJ2MqjJqJ2j0j2J7K1k2Pj1jj1L4k2j5K6j5kL6m7K2kj1
4704a1kmL1l3J5MJ9k1J0K6j0k1J7nk0nK5j3Nj5J0RrPNj5K2ok3K6l1K1K9o7N2n
4740A7rj8J6Nj6QJ8j4k2JK9j7L6l9OK5j7j9j3N5j1k3J3Qj9KJ1k1J9qJrj5K5oj9
4776b0L0Mk9j5L6qj9NJRm0N6j1k6K6J1j3J1j4j9kJ5J8j1K1kk4lK0jj1J4loj0L1
4812B1Ml8J0mjJ9mjj5JJJ1pj2Nj4J2qK3oRj3oJ5j0j0K5poRPmj2J0l1L2J6l3LL
4852fJ0Mk5K5l3K2l2M3Klj7jj2NO%j6K4K5n3PM0j6j3MlqJ7j2rJ3L9j6rk6K0JM
4890AJ5k8J8nk1J7mkLj2K7%Mk9L0k6J0J1k2Ol7J6J5Pk7J5nL1l0L5k1K1j6mpJ4
$$ plain form
4926 0 21 -3 12 2 3 14 0 -3 11 25 -5 17 -1 3 11 13 -17 1 17 -9 1 -5 17 -19 -2 -13 11 -6 -9 4 -6 13 -7 19
4960 19 5 -11 0 -22 -3 -7 -7 15 0 -10 -20 -13 18 -13 -6 20 -14 13 6 0 -17 -4 -22 10 -18 -6 -19 -2 1 18 -10 -5 -11 24 -9
4995 -9 0 -3 -17 -16 -4 -1 -17 -10 13 1 -4 -11 -17 1 19 -1 15 13 5 2 9 11 19 30 4 -25 -5 -4 4 -12 9 8 11 -3 -28 -16 8 5 -11 -15 -32
5036 -32 11 2 -20 -14 -17 19 -1 10 -12 -23 -12 -20 0 -1 -15 -5 8 2 5 -18 -1 -5 9 -26 24 -17 19 -14 3 -7 -15 4 -14 22 4
5071 4 5 -20 24 -8 12 -7 -19 -22 -24 -4 -8 -12 -13 -18 -4 -25 -11 13 -25 -12 -3 -21 12 -5 4 -22 -18 7 9 6 -3 -20 -3 23 8 -26 22
5108 22 -5 -6 12 -3 17 -2 -1 16 12 15 -21 15 2 -25 5 -24 0 5 29 -29 -19 1 -9 25 1 -2 32 4 9 -11 8 4 -10 30
5142 30 -4 1 -21 1 5 17 -4 8 6 -23 4 7 6 11 19 4 -10 -16 -18 21 12 15 2 -1 -21 -3 -12 -13 12 2 -10 -17 -17 -11 8 2 20 -25 -14
5181 -14 -19 1 -7 22 -13 -3 13 20 1 18 11 0 -15 7 -14 3 2 -13 -1 4 -11 -12 14 19 7 13 -2 -8 -2 -20 -22 -13 -20 6 -15 -21 7 -10
$$ packed form
4926@K1k4J5j0JJ1j4lJ4J4l0K2j8MQKl0J8J6k6J0oK2l6J7j1K4j7lJ3j0J9k0K6
4960A9j4j6J1k2J9m%K2j5j0j0PL1l1PK6l4K7poj7J3j8L2k8J2j3J7LJ7k8NoL5l3
4995iRlj4JJ2Lj6PK3j2npoJ8J8k0J6kqlPKQJ1k6k9K0JQj6K1jLj4k5J2K4lj6mj7
5036c2M3rk2OlL6k0J1k2j1J1qK0jj4J0J3oLk3J7mJ4l5N0m1L6l3J7j0qJ9j8L6j8
5071DJk5M4l2K0j9j2lkK0mmjnJ4k1J4K4l8J3Rj8L3j7Rk6MK5Klrj7J7K6j5l4M8
5108B2k7jJ8j5K0j9JJ7mLl6L6j3k7L0k9K4NK4n8J0K0j0L4k4lL4k8Nk0J9mj4M0
5142C0l4Nk2K2MJ2k1J2kk9K7LjNQj5j4okL9rLj3lk0J8rjK5j0j2p%OJ9oJ8m5J1
5181a4nK0qK9l5J0J6Pj9J7pj1j5K2k1J7jj5J2Nj5jK6Nj2Oj5oOj8kRpK6k1oK8j7
$$ plain form
5219 -10 -7 -21 2 -3 0 2 -14 -2 -6 -23 -7 6 20 2 -23 21 -9 -5 13 -18 -36 8 3 -15 -12 -17 9 2 -24 6 -16 -30 -23 -10 25 -22
5255 -22 5 3 -12 11 14 -29 -15 -22 -28 -38 -30 6 -8 -15 9 -1 -5 -8 2 -7 10 14 16 9 17 21 -8 17 -34 9 -13 -4 -11 -11 -14 -20 -11 -10 7 -9 3
5296 3 -1 -20 7 -1 -15 2 4 11 -11 -2 9 6 33 0 -8 6 -26 -15 -2 11 -10 -6 -14 4 -7 5 14 -13 -21 12 -10 9 -15 -16 -20 -2 0 -10
5334 -10 7 -1 18 -6 -23 -34 13 -24 -13 1 -25 5 6 -15 2 15 8 -15 9 -24 -3 19 -4 -4 -12 13 1 7 -8 -5 24 11 -11 11
5368 11 10 -9 4 2 -20 2 3 -15 15 -34 0 -16 -27 15 -25 9 -17 -15 -12 -11 -3 -13 0 2 2 0 -11 -12 -4 -19 9 -2 -23 -3 -10 13 1
5405 1 15 -5 -6 -3 15 18 -25 24 -10 -4 0 5 -10 1 5 31 -5 10 -12 16 -20 -12 8 14 -1 -7 18 -8 -6 -3 -16 23 19 -39 3 10 -8 -30
5443 -30 -11 6 5 -17 -15 14 -14 -11 36 10 5 17 6 18 1 -6 4 -5 8 2 7 -8 -18 -12 -6 11 1 -5 -16 -6 -28 -21 -27 -7 -30 -30 -23 3
5481 3 -4 23 -14 10 -8 2 -19 -29 8 -15 -4 2 8 -20 -6 2 17 33 1 9 -8 -9 38 -22 -10 -8 -3 20 -11 -7 -36 -13 -1 -4 3 -22
$$ packed form
5219a0Lj4K3nLKj6J2mj7J6J3J4j8k5M4l0MJ8l1j8M4nj8LnK6pk6L0k2j4PJ3L5m7
5255b2K7kj5K3Lm3J4poj0QL6j4pK4j0mlJ0rJ7MKpQMk9K5n1M3k2Rp%loRJJ7j6J2
5296Cmj9K7qj4J7KPk2RJ1lK7l3qJ4l2J1J3J3k1MqJ8j1J2Rk7qL3k2J9k4jmJ8Kj0
5334a0J7qJ9k4j7j1M7l7J1J4k6L0Jk1J7J3pk3K4l3K1K2k3%qK5j2Oj5LK9j3k2K2
5368A1jj9J3kk2K2Jj8L0m9L4j6j1M2m0L4k6KLJQj0J3K%kj1jQj5K8j1k1K0pK3j2
5405AJ4k0jLJ8Lm3M9l4OMNj5J1MK6l6J5k2K8l6QK0Oj5oK5k6KLj3L9mn8M2Pj8k2
5443c0J9J7jk2KK9k8LM7k6nJ2j1J2j7pJ0rJ3oNj5j0OOJ7j0oj1J0k2PoK0k3%PK6
5481CpK7l7K4j8J0k1j0L7k3J1OOk8J4QJ5J6l2Qj7jM7o0J2KNK3l1Mk9K3J2lPk5
$$ plain form
5517 -22 -17 -3 -22 -28 1 1 14 -6 -1 17 -10 10 -2 6 13 -2 5 7 14 -9 -4 2 -7 9 9 9 17 3 -7 7 14 -4 -12 4 10 -4 -19 -7 0 -16
5557 -16 -11 12 17 0 -15 18 -10 -4 -24 -8 18 14 -13 -9 -7 31 5 -8 -10 40 20 -4 -9 -31 -7 -10 23 15 -2 2 8 -1 -11 -10 -5 13 -13 -20
5595 -20 -29 -13 -7 -11 -9 -11 -9 -9 -5 -19 -25 2 4 -12 -17 -9 10 -11 4 13 -5 2 20 -4 1 8 4 14 -14 21 -4 0 -27 10 27 -20 -18 11 -15 -6
5635 -6 -2 -6 -18 5 8 -16 -6 -32 -10 0 -8 -12 -5 -10 -1 -27 -5 -18 -22 -6 6 -10 -12 0 13 -18 -7 -8 4 16 0 -10 -16 -17 -7 -4 20 -17
5673 -17 8 -3 -13 -32 20 -19 -21 -25 0 17 -1 9 -43 -5 0 12 14 17 -20 -2 -10 12 -5 -23 -7 -7 -2 26 -20 14 -7 6 22 -3
5707 -3 -19 11 -4 26 6 4 -20 11 -6 -14 13 26 6 -1 14 -2 6 -11 10 3 5 4 -5 -3 -11 -9 12 13 9 -14 -8 -5 10 3 -9 7 4 12 -3 11
5747 11 -12 -1 22 19 21 25 -7 -22 20 -4 13 14 1 -15 -22 1 7 -10 3 23 -3 6 -9 -15 -13 14 6 2 4 -19 20 -23 -15 -7 3 3 -6 -4 -4
5786 -4 -20 -6 18 17 2 2 17 12 -26 3 24 -16 -13 -18 18 -15 -6 15 -4 -6 17 23 -26 -6 7 8 -5 -13 6 10 -8 -3 -21 -5 -4 -8 1 -19
$$ packed form
5517b2NJ4j9oK9%J3k0NJ8k7K0j2QPj5PKPk3NOrJ6%%Qj4j0J4Pj8qJ6Oj4j5J2Pj6
5557a6NK3Nj7j5L3k8Ok0J6K6mk7MKL8k6j3kN0k0k4nk2K4lL3qj7MOrj0JNJ8k6p
5595b0rJ6OmKkK%Mj4oK7Kj6nQJ9k1J5Rj8PJ8k4NPmJ0k8L5k5Mk7L7J7m7KK9k6R
5635fMmj2K3Lk4J0k6K2J0qmPnRk6K2j3mJ6J2j6kJ2J3l1J1jJ2J2j6j0ojJ0LK4l7
5673a7K5j1j0j9N2l9kmK5J7j8J0n2L8NJ2KLl7J8qK2j7j8J6%NK8m6L4k1J3J6k5
5707cj6L0j5L0k0kk4L1j7qK7J3k0pJ5j6Qj7K1pKjrKqKK1Jmk3OLJ5pj2J6lQj5J4
5747A1k3J1K3lKMl2j5M2k4J7Jj3j6pK3Oj7J3K0k6Rj5oKK7qmKk3L9m3QQJ0%rK%
5786dj6J4K4jj5%J5nl8K9K1m0LnL6l3RK1j9kK3Om9K0J3Jj3qJ9Mj8Nj8J6JmRk0
$$ plain form
5824 -19 4 0 7 3 2 -8 -21 -8 3 -15 -2 0 8 6 21 -2 -12 -4 5 8 -2 5 -11 -21 4 -9 -16 -4 -17 -31 11 -33 -8 -23 -6 16
5860 16 -31 -10 -26 -6 -34 8 -10 -21 -1 -12 1 8 20 12 9 27 -7 -26 6 0 -23 -14 -8 30 14 1 -2 -16 26 -8 30 -3 18 -4
5894 -4 -6 10 -7 9 14 -7 -8 -34 -7 -30 -14 -9 19 -2 -29 -17 10 -14 -24 11 -24 -4 -5 -7 6 14 0 -10 -1 -6 12 -2 -33 4 7 -11
5930 -11 -4 22 -7 -3 26 -2 13 5 -5 -12 -20 11 -23 -6 -12 -12 1 14 -18 9 -2 -17 -39 -9 16 -16 -9 -15 4 -21 7 0 6 23 -16 -4
5966 -4 -2 21 -10 -6 5 -16 5 28 16 -10 -16 -28 3 6 0 -32 13 -14 2 -10 -24 5 -12 5 -21 -2 -1 -2 -12 -22 1 -9 17 -13
6000 -13 24 19 7 -13 -23 21 -6 29 -2 3 -7 14 -5 -4 11 19 9 -35 -1 -4 -38 29 -21 -26 -16 -21 -19 -11 -11 -39 11 -9 2 2 11 -24
6036 -24 -32 -19 -31 -26 0 21 -4 -4 4 13 8 24 -4 7 -1 -3 33 20 14 19 -9 4 1 19 21 -9 -16 3 5 12 -22 11 -19 6 -9 17 5 -31
6074 -31 4 -5 11 -13 -3 -23 -12 -14 -21 -2 -2 5 13 -21 7 -13 5 -4 3 -17 2 9 -8 -14 1 3 13 9 11 -15 -2 -35 -2 7 -8 9 21
$$ packed form
5824a9K3mPmjj0j3J3J1j8J3KQkJ5k3j0QRLj0Pj6j0K5j3pJ2j3j4M2m4K5j5J7K2
5860A6m7K1j6K0k8M2j8j1K0j1J3PJ2qlJ8l4j9L2ok3ROL8j6j3lj4M2l4L8l3K1k2
5894dkJ6j7J6Nk1jk6K7k3J6NK8k1k7J2K7k4j0L5l5K0jkJ3Qj4j0RnJ8j4l1L7Lj8
5930a1PK6k9MK9k8J5qj0pqL1l4J7o%J3J3l2K7j1j5k2L0K5l2PoJ9k5K8pOJ7l9J2
5966dKK3l1MJ1k1K1K3j2k6oj2L1Lol2M5k7J6j2j4K9j7J7k6J9Jjj0j0K3j0K6l0
6000a3L7nj2k0j0M4k7L5l1Nj0K1j9JJ5Qj0m4L4ll4O7n0nJ0nKQ%k8N0k0J1%Rl5
6036b4qJ3j2NK6K1k5%QRnJ6k8J1qkL6j3oNk8J3lJ8Kl0pJ9KPl4L3l0K5j5K6j2l6
6074c1L5rJ6k4J0k0J1kpJ9%PQl4K8k0J8rPk0J9Pj7oJ5KJ0mKk6J3l3L3Rj5J7J2
$$ plain form
6111 21 -7 -25 17 -21 -2 -26 -13 -10 -2 -29 23 -2 17 2 -5 -16 -5 -3 7 -19 1 -5 2 1 -32 -7 6 -9 4 -7 44 17 -5 7
6145 7 -17 -1 8 -14 -8 21 10 18 -2 10 -4 -11 -2 4 -16 -2 -11 3 -16 2 17 -4 -17 -14 -10 -6 -29 -25 8 26 -2 -1 16 29 6 -1 -13
6182 -13 -8 -4 2 1 3 4 -11 8 -10 -36 11 -4 11 15 7 3 -21 -7 -24 11 -19 -10 -12 -1 -34 4 -6 -7 0 1 15 9 -17 -23 8 0 14 -16 6
6221 6 -15 -36 1 -8 -38 -22 -2 15 13 13 -18 -6 16 9 1 9 -4 16 -10 3 23 23 7 -18 14 -8 -17 -3 -14 3 6 7 5 -1 -8 19 -7
6258 -7 -1 -2 15 -15 -10 10 -3 3 -16 8 -1 17 15 -6 8 15 31 -12 11 -5 5 -5 0 -17 -14 5 -8 -8 -7 4 -2 -8 7 0 30 2 -22 3
6296 3 9 -11 -6 -7 8 -6 7 -1 -16 13 6 1 16 28 12 11 21 -5 10 -6 -6 20 41 2 9 11 19 32 23 -1 -4 11 0 -19 13 15 -13 -2
6334 -2 11 -4 15 5 8 -14 -16 -8 5 -2 -8 7 5 -23 5 22 1 9 25 11 -18 3 25 -23 -8 -25 -5 9 -10 -9 -19 -22 16 -1 -24
6369 -24 -8 0 23 -14 -21 12 -8 -1 -13 2 -27 -18 18 -21 -31 19 11 3 -22 -21 0 11 10 7 -15 0 -6 -17 2 0 -12 9 -1 6 18 -15
$$ packed form
6111B1k8j8M2l8J9k4J3LQk7N2k5J9j5pj1J1KJ0k6K0oPjl3K5J3j5J3j1N1k7k2J2
6145Gk4J6Rk2OK9j1Qk0J2j4pROk0J4rJ4j9J8J5k1j3LMMk3ML3J8k8JJ7J3k3pj2
6182a3NMOjKJj5J9j8k6M7j5J5Mqmk4J4j7L5l0RkJ1l3L8j0jPJJ4ok6oL1qJ4l0K2
6221Fk1k1L7rl0J6K0J7k%l1J2K2pqQj3K0k6J3K0%j6k5L2k2rJ4j1J7LJkopK7k6
6258gOjJ7l0NK0j3Oj9K4rJ8kk1J4PJ6m3K3j6J0j0Nj7LJ9j3%JJ1ooJ5pL0k8k4K5
6296COk0NjJ5j4J3qj5K9pnJ5J2j6jJ0k6J5j6%K6K1l9PKQJ3rk4lJ5j1j9L2Kk8J1
6334bJ3j5J9j0Lk2kQJ3poJ5kk8K8J7k1QJ6j4k9K1K2m8J5j7K0J4j9Jj0lL8j7k3
6369b4J6QK3l7pL3k0Pj2J5k9RL6l9j0N0qqk5JK1J1jlk2J5oj1J9kj2K1j0PJ2l3
$$ plain form
6405 -15 7 -9 6 -8 -3 10 -19 -18 -8 6 -14 8 -35 15 -24 9 16 -14 -11 -1 -14 22 -3 24 1 16 18 26 -10 4 -11 2 -10
6438 -10 7 12 4 5 12 -13 -3 3 -1 5 32 -11 -17 0 -20 12 8 -7 -5 -2 13 -25 -18 -15 -10 -7 -39 6 -15 31 -17 1 7 8 21 -1 7 7 14 -13
6478 -13 41 19 33 -14 -1 11 -10 18 15 16 -26 11 -6 -3 6 16 11 -20 10 34 -12 -10 -17 10 -12 -3 -3 2 -34 -4 -21 -12 11 -9 10 -14
6514 -14 -38 13 -13 -9 7 22 12 -8 -9 -14 12 -19 17 4 16 -2 4 13 5 -19 11 -19 -1 -18 1 -12 -5 16 13 -36 -13 -3 -3 -5 -11 -18
6550 -18 -12 -14 -6 -20 -16 -5 -57 -10 11 -2 -2 6 24 -11 15 -14 6 -13 -27 1 1 -24 -29 29 -1 -25 -19 -6 20 12 0 -7 15 10 10 -2 12
6587 12 6 12 -31 2 -18 2 -1 -28 4 -8 24 -22 4 9 -4 10 -26 -14 -4 7 -10 -14 -18 6 -12 6 -2 17 21 19 20 0 12 21 29 -7
6623 -7 9 26 -18 14 -2 7 0 2 19 8 5 13 3 -14 -14 22 2 -12 -3 13 12 -1 5 18 22 -18 -1 37 17 10 25 -13 2 2 -22 13 2
6660 2 5 -30 5 14 10 6 -29 2 -5 -12 17 -6 9 5 11 -5 -13 -15 -5 -18 16 10 2 0 -11 -2 -21 20 -2 -15 22 6 -12 14 12 15 1 14 -6
$$ packed form
6405a5K2j6J5j4NJ3k9JJ0J4k0K2m3N0l9L3Pl0LJ0j3L6k5K7k3J5KQl6J4j5J3j2
6438a0J7NqJPk5J0OmOK7m3oJ7k0L2mj5KLJ5l8PLNLl2M5k1M6m8J8OJJ3k2Q%Pk7
6478a3N4k2J4m7J3J2k1K8lJm2L7j7LRJ0nl1L0K4m6KpK7k2R%Nl6L0j7RK3k0J9k4
6514a4k4N1k6MJ6J5j0k0jnK6l1L6j3J2j8ORqk4L0l0J8j7J9j3PK1lm9K3J0%kop
6550a8OkQj4MJ1n2M7K1j3%QJ8l5K6k9K0j9j4K8%k5nN8l0k4OJ3K6qj2pK2n%j2J4
6587A2oOm3L3k0K0lk7L2j2L2m6K6Nj3J4l6J2J0J1j7mmK4j8J8qJ9MkJk0J2RQl6
6623gJ6J7m4L2j6RpKJ7j1lQj0j7%L6k0j4RJ6jj3OJ3Mm0J7L8k0pJ5l8J5%k4L5j1
6660BLl5L5Rmml5L1ppK9k3J5mOj6qkJ0j3L4oqkj1Rj9M1k2j3L7j6j8K6kLj4J3k0
$$ plain form
6699 -6 7 7 2 -14 5 -1 8 12 -10 11 -14 -24 -6 -11 11 -1 -7 -11 15 11 -1 9 -10 -12 -36 -21 -13 -4 -8 5 -19 -4 -13 -3 -27 -9 -14 3
6737 3 16 2 3 6 -5 9 -23 -2 -16 -5 -11 -9 -2 -16 17 -21 -3 8 13 -19 -5 16 6 1 2 -17 -19 -4 -9 -22 2 9 6 -20 -5 -14 -6 -10
6775 -10 7 -8 -14 10 4 13 21 -24 -3 13 -1 -7 -16 7 18 13 -2 -4 23 21 11 6 18 20 -10 -12 -11 -34 -6 2 -4 -15 -16 -14 -2 0 14 -6 -4 -6
6815 -6 -9 -16 -12 -7 -34 2 2 7 0 2 7 -6 27 28 -12 -12 -15 -13 11 -9 -17 -3 10 20 -16 9 -20 -7 16 -15 24 -5 -8 7 -7 4 -1 -4 -9 -8
6855 -8 -8 -3 -38 -31 -9 2 -20 3 23 -1 -2 -5 -9 -10 11 19 -5 -12 10 -9 -12 17 8 -7 -2 15 13 19 -10 -4 7 9 -3 9 0 -15 -12 -3 -13 11
6895 11 -17 -12 -18 6 -7 -1 19 18 29 -9 12 -9 8 6 13 -2 1 0 39 24 -13 -1 -10 14 -8 2 -1 -8 -5 9 -15 0 -3 -1 -2 -11 5 25
6933 25 -3 -12 -11 17 -1 -1 -9 -5 -29 11 -5 -38 23 10 1 16 -17 5 -2 -10 7 -8 1 -13 -7 6 -3 2 4 -10 -9 -10 -8 -1 -1 -6 13 -3 -27 19
6973 19 -22 -1 22 -20 -7 -13 10 -10 -2 -6 6 7 3 23 12 -15 -9 -7 7 -6 -2 -23 7 -33 0 29 29 8 5 17 22 -4 3 -11 12 24
$$ packed form
6699fJ3%nj6J9oRMk2K1k5j0J8nK2j2omK6mj2J0j9kk4J5QRmJ3k4J5rJ0k4J8nJ7
6737CJ3j4JLj1J4l2K1j4J1oKPj4L3l8J8J1Nl2J4K1j0nJj9kJ5nj3K4Plk6J5rQm
6775a0J7j5oK4oRQm5K1J6j4orK3J1nj5kK7kj0nJ2Kl0kJk3K8Qoj1jKJ2KJ4k0Kk
6815flpMNk7L6%NpKNj3L3Jm0%lKK4k0qJ4J3J0l6K5k9J3K3l1L9k9lJ5j4J1nlnJ
6855h%Nl5PK2J1k2K3K0k4jlmjK1Qk4pK2j9lK9rj5NJ7kOk9OJ1Kj2J2rj5LRj0K4
6895A1k8NoK4j3OK0jJ1l8K1k1J7kPj5LjL9j5l7J2rK4k2J0lpLJ4k4J5lKjrJ6K0
6933B5k8rJK8j8%qMk4M0j6l3O1j3rJ5l3K2pqJ7j5Rj4OJ3rNKj4JjKP%nJ9j6k4M6
6973A9m1K1K3m2J3oK3k0QmJ2JmK0j1k7OKJ4j3Mk1L0m0L3K9%k1lJ2Nk6Pj4K3J2
$$ plain form
7009 24 -3 -15 12 -8 -4 6 -23 -3 -6 7 -7 -31 -12 4 -8 -24 -16 -23 4 -4 1 4 -23 -8 -30 8 -20 -10 2 0 -3 -3 -7 17 -8 22
7045 22 -22 15 -6 -8 2 -7 -1 -23 -4 -1 14 6 4 5 25 -11 3 -13 4 -24 0 -11 -20 -7 -29 5 -8 -9 -3 10 -23 -12 2 -14 -10 11
7081 11 -17 3 -28 27 26 10 1 0 14 -2 14 2 -5 -3 7 19 -6 8 2 3 4 12 10 -15 -11 12 1 -2 -17 0 6 23 12 -1 -4 3 -25 -16
7119 -16 1 -8 3 -9 10 9 8 7 23 7 -8 28 12 15 20 -4 29 6 19 2 -16 -4 17 9 -5 33 -9 2 5 -4 7 -23 -24 -1 -8 -33
7155 -33 10 -7 23 21 -6 -24 -14 22 9 -25 -7 16 -1 -9 5 -22 -6 -2 -3 1 -11 -1 -12 11 11 8 7 21 4 19 22 25 8 3 -6 -12 12
7192 12 -25 -28 -18 -13 4 -1 -19 15 20 -7 7 5 -22 -9 6 5 -7 -16 14 -3 -4 -16 -14 -11 -1 -5 8 8 -4 18 -12 14 10 -11 19 -15 -1
7229 -1 18 -7 4 14 -8 7 0 31 15 38 19 5 -14 -3 -13 1 -4 -6 16 -6 9 -9 1 -16 1 -11 15 -4 13 -10 3 -1 8
7262 8 -14 20 6 8 -1 11 23 2 27 17 -28 -6 12 18 27 2 17 17 -19 14 8 -16 -20 -6 4 3 11 15 1 6 9 3 10 0 20 0 8 -5
$$ packed form
7009B4k7j2K7k0MJ0k9K0lJ3j4k4J9J6j2j6QpK7qNLk7J5k2L8k8J0J2kl%mK4k5L0
7045B2m4L7k1kJ0rOk2J9LJ5qkJK0l6J4j6J7k8K4j1rJ3k2L4j3jOJ3l3J1J4j6MK1
7081A1k8K0l1N5jj6rjJ4j6J6j2pKJ0J2k5J4oJJQkk5MK3j1lj5J7OJ7j1j3lPk8R
7119a6J7rJ1j2J9jjjJ6j6j5L6j6LNk4L3k3J3j7j8J2K1qj4L8m2J1LrJ1l0jK3pk5
7155c3M3j7L0kk7j8J0L6j3l4J8K3j7qJ4k7J6MjMj2J0j1K3%ljJ4j7J5LLj7nroK4
7192A2l7lJ0NJ7nj8L4Nk7J4kk7J3J5jj2rL0j7jj2KLJ0mJ3%j2K2l0K6mk1L0l4J4
7229aJ9k5J1J0k2J5pL1j6K3j9j4j9J1j0J4nkK2k2J5j8J0j7J7j2K6j9J7k3J3mR
7262Hk2L4j4KrJ2J2k1K5j0m5K2J8ORk5J5%l6L3ok4mJ4J0jQMj4NLoPj0K0k0Qj3
$$ plain form
7300 -5 3 26 -20 -2 3 7 10 5 21 4 -16 21 13 -12 0 11 31 4 19 -9 5 -14 -9 -10 -10 6 -7 0 -12 -8 8 22 1 11 16 -36 -18
7337 -18 10 21 12 -12 1 11 -4 -3 16 35 -1 -8 26 10 13 14 -4 7 -18 18 15 -18 -3 -16 -20 -20 4 11 6 1 -3 9 -21 24 -14 3
7373 3 -1 3 13 20 -5 21 -24 23 -6 -11 -7 0 -8 -10 2 17 1 6 -9 -1 -12 8 10 40 14 -13 25 4 4 -1 10 28 10 -3 9 -15 -8 5
7411 5 17 -2 10 0 -15 -11 -4 2 -10 6 14 -20 -15 25 1 16 -6 7 2 24 -6 1 -22 7 0 -14 -16 1 27 -5 -7 10 21 11 14 28
7447 28 27 -18 -12 12 -1 -2 14 -23 -3 19 2 10 8 -5 -8 4 -5 -2 -19 5 -13 -8 -13 -1 -9 9 1 1 24 -1 1 2 17 18 12 3 6 -15 6 -4
7487 -4 10 -8 9 0 -21 18 5 -13 23 6 8 4 1 -3 13 -5 -21 8 -11 19 0 -14 -3 -36 -4 10 -18 15 0 -8 36 -7 7 -14
7521 -14 11 -12 2 -3 14 19 -6 5 -12 29 4 5 19 27 15 -15 10 -14 -7 -5 -11 -4 20 12 16 -1 5 -5 6 0 -18 4 16 26 -7 15
7557 15 4 13 2 6 22 12 18 7 0 11 -20 -5 16 -17 -12 0 21 28 -6 -11 1 6 12 4 1 0 -16 -6 0 6 -7 -10 -12 -20 -8 0 3 8 -7 0 33
$$ packed form
7300eQK3m6J8NMLnJ6j7k0L7qk5J2J1K0k7J5k8J4j9Nj%J6j3Pj2MJ6J4k1J0Nn2J8
7337a8K8J1rk4J3J0j5JJ9J9l6pL4j6LJj8J1k5L6ll3J5j3m%K4PnnmJ2l0M5l8J7
7373CmMJ0Pk5K6m5M7k9nMPqkJ2J5j6Nj5Qj1K0KL0k6k7L8k1%nJ1J8j8j3J2k4PJ3
7411EJ2j9J2j0j5MPOj2J6Ql4NM0k4J5k2J3nK2l0Pk3K9pj4kJ7K6l2kJ7J1j0LJ4
7447B8jm5OK4j3jJ6l7K0K2j7Qkj3lJ2rLj7K4j8NnJ2qJ8q%K3k5KJJ5JorLk1K1j0
7487dJ4j8J7rk1L9j3j8L6j7KmlmJ6j8j6K9j9L0j9j4J1l3L2J4k8L3j5qM4m3J4k1
7521a4K5k3J4nJ7Nk5J1j7M1k5JJ4Qj2l0K5k4PKoPK4qMj7Oj0J1oj8K2J2J0l3K2
7557A5j1Rj1MJ6j0Oj1pJ1l1J5K1l3NJ2K1Pl4nJ2NOqljj6J0OOj3lkqJ2QLNj5PL3
$$ plain form
7598 33 -16 12 3 15 -8 7 15 22 3 14 15 -5 -1 4 -1 -10 -3 -5 11 12 -10 -1 16 -24 0 -8 -5 -6 -9 -11 -10 -1 -11 -4 4 -15 -9 -4 -4 2 11 -13 4
7641 4 -2 11 -6 23 3 -9 -4 -7 -3 4 -14 17 -19 -4 -1 -13 -1 13 0 -17 -14 6 28 14 3 -5 -8 -1 16 -14 -8 3 -9 -16 13 19 18 -13
7679 -13 8 6 -14 6 19 -24 -9 9 12 9 35 26 3 9 1 -6 9 2 -11 -9 20 -3 5 10 -4 -8 19 10 1 25 1 -6 -6 -27 -13 -13 13 9 -7
7718 -7 13 -6 28 -12 10 -14 -4 2 -21 -1 9 -6 -3 19 1 -34 16 3 -4 9 -25 -9 19 20 -8 7 -19 24 3 39 -16 0 4
7751 4 49 11 19 -13 -9 10 -9 0 15 12 1 9 -15 9 -22 -22 16 -3 22 4 -9 -14 12 -22 29 -9 -7 -1 5 -8 16 34 -7 9 -19 -3
7787 -3 3 12 -16 -16 -15 16 7 8 -9 -12 -2 -3 -19 27 -14 -5 16 9 13 5 -5 -20 6 -5 16 26 -2 23 9 -12 1 -6 -14 21 24 -2 -12 9
7825 9 21 12 7 7 0 23 -21 11 -8 12 24 -18 2 -2 0 27 6 1 11 2 -7 1 -24 15 18 -11 8 -5 -6 4 13 9 -2 16 10 10 1 -6 10 0
7865 0 6 -16 20 4 6 -21 6 -5 26 -10 5 -6 6 13 23 11 18 -7 -20 30 9 14 -13 14 2 8 16 15 35 11 5 8 0 -15 11 -1
$$ packed form
7598C3m9K8rJ2k3J5QPj9J1Jk0MNnrPkJ6Jk2RJ7m0K4qLjlkJRj0PQj9ON%ORk4J7
7641DoJ3j7K9k0j2NlMPj8L1l6J5Lj2J2J4j3j7LK0K2j4j1qlPJ7l0OJ1j2pK9Ojl1
7679a3K1kk0K0J3m3J5J8LlK6rk3OqpJ5pj3KK9k3QNj4mK7rrK4k4p%k1J4%K6mj6
7718gK0j9L4m0K2k4J0Ok3K0J0j5LK2j8l5N0j3pJ3l4J6K8Jk8J5k6M3k1L6n5J6M
7751DM5l8Ql2MJ9j9RJ5lj1Qk4K4l1%L8j9K5j8j3nK6l4N1l8KOOj3K4J8m1J6k8J6
7787cORk8%JL1rJj7lJ0jj6M6m1RK1pMqj0j5K6j1K1J0k8K5j4k1J3pqL5Lk6j0K1
7825IJ2rn%pK3m4L2j9K0J2m2K0mKK7k1nJ0rrQk5L9Lk9J9j3jJ0Rmj1J8o%rpJ6j0
7865@Ok2L6j6Kk7K7j1L1l6J5j1J2PJ0j2Pk5j3N0k1Nk7K7j2OQjK0k4oLqj5K6j2
$$ plain form
7901 -1 2 25 0 -15 13 3 9 14 -22 4 -17 11 2 42 -9 6 -28 12 11 6 -12 11 1 -6 10 13 8 15 -8 -17 19 -25 7 -17 13 -9
7937 -9 14 -25 -18 -30 -31 17 -2 -1 -4 33 26 21 -22 -6 21 32 3 -14 10 7 -8 -8 1 8 17 -10 -1 28 -11 15 13 -7 -4 14 -28 28 -10 -16
7975 -16 12 1 11 -16 11 14 -19 0 2 11 -19 8 3 -2 8 0 8 5 -15 -10 9 -5 -11 -6 13 19 -5 -6 -7 11 8 9 -7 21 -23 -2 21 -2
8013 -2 -5 6 17 16 -4 -12 30 -14 -21 -3 6 27 11 -1 -7 -1 -7 -1 -12 16 2 -14 2 25 24 11 -6 -10 14 -12 8 6 12 30 4 14 3
8050 3 8 -1 -16 -6 5 28 4 -10 -12 -5 21 -11 -9 -3 13 -24 23 -14 -26 -17 -7 5 24 11 -2 5 1 -46 -23 18 -2 18 1 -16 0
8085 0 -7 19 3 13 38 -17 30 -9 3 -5 -8 -1 -15 -16 9 37 -30 11 -24 -13 -10 3 1 8 14 3 4 -6 8 17 17 10 -3 -17 12 17 9 -16
8123 -16 -6 14 7 -5 3 2 7 -3 5 -13 3 9 29 -18 0 21 4 -11 8 -7 -18 -22 6 1 24 11 -4 -24 -12 -20 -9 -21 -12 7 8 10
8159 10 5 20 -4 24 -5 -19 -3 19 -10 15 2 0 35 -2 1 9 -16 14 21 9 5 11 18 9 4 20 -27 6 1 0 -14 -25
$$ packed form
7901aLK3k5j5K8j0ONl6K6k1K8rM0n1J5l4M0jnj8K3j0pJ6LnPk3rL6m4L2k4L0k2
7937iK3l9Pj2jM8j9JlL7pnm3J6K7J1k9j7K4lj5%RPRk7RK9l9K6kk0LJ8m2N6l8o
7975a6K8j1J0k7K7Ll3J9KRl0K7nnJ0qQlk0NJ9j4oNJ9Ok4jjJ8lJj6K8m4K1K3k3
8013blJ1J1jk0qM2m4pJ8RK1j6j2oOoOj1K8j4j6J6K3jj3j7mK4k6K0kOJ8k6J0j1
8050CNrj5J0J1K3k4j4kPK6l2KOJ6l7M7l7j2RJ0J2J9j3j3Pmm7K3M1k0K0j7j7J6
8085@pK6j6J0K5n5M7l9J2qlPj4jK5K8o7M1l5J1LJ3kPOj1Jj0J4R%pj3j4K9Nqk5
8123a6J0K0pj2QjNj0Qj8J6OK0m7J8K1j7j5J9j5j1mK8nK3j3j5k0J2qJ1j2RJ9JK
8159A0nJ5k4K8k9j4J6K2k9K5j3kL5l7LQk5L0Pj2mOPrnJ6m7L3njj4j1
8191b5
$$ Imaginary data points
##PAGE= N=2
##DATA TABLE= (X++(I..I)), XYDATA
$$ plain form
0 0 0 0 0 0 0 0 -8 8 -8 8 -16 24 -32 40 -48 64 -80 96 -112 137 -168 200 -236 280 -328 380 -444 513 -588
29 -588 676 -772 881 -999 1132 -1277 1438 -1614 1808 -2020 2252 -2506 2783 -3086 3417 -3779
45 -3779 4173 -4604 5075 -5591 6160 -6782 7473 -8237 9088 -10043 11119 -12344 13753
58 13753 -15388 17322 -19640 22489 -26070 30743 -37105 46306 -60818 87110 -149309 569169
70 569169 265256 -1013912 417432 277381 -173357 -178742 67026 241089 -155789 -213011
80 -213011 311187 -33833 -196468 116566 67915 -90959 -2552 25604 35161 -50914 -12625
91 -12625 55070 -15914 -41184 40090 1534 -19923 2493 11769 -3006 -7157 -113 11755 -8758
104 -8758 -3889 8048 -509 -5915 3651 1195 -1185 -1643 1635 1003 -1710 -466 2122 -982 -797 917
$$ packed form
0@%%%%%%qJ6j6J6k4M0n6P2q8J12j44J76k08K49l05L68m36N16o08P08q24R57j101
29e88J264j448J653j880K131k409K715l052L422l828M272m758N289n869O503p196
45c779P952q777R679j0666J1751j2942J4255j5710J7325j9131K1162k3463K6097
58A3753k9141L2710l6962M2129m8559N6813o7848Q3411j07124J47928k36419P18478
70E69169l03913j279168J431344j40051m50738n385K45768J74063l96878n7222
80b13011N24198l45020j62635L13034m8651j58874Q8407K8156R557q6075L8289
91a2625O7695p0984k5270Q1274l8556k1457K2416R276j4775m151P044J1868k0513
104h758M869J1937q557n406R566k456k380m58L278o32k713J244K588l104J85J714
$$ plain form
120 917 213 -639 66 284 98 -435 150 309 -234 -150 285 -55 -110 34 90 -54 -48 19 69 -80 -9 52 3 -17
144 -17 33 -1 -21 -10 27 14 -12 16 -13 10 -22 37 -19 20 14 13 7 -13 3 -11 -35 9 -3 -26 -41 9 -4 21 7 -9 -23 -17 13
177 13 -19 -18 -32 -6 9 -16 -18 11 1 5 -2 3 -22 -2 11 -11 4 -35 15 17 19 2 -16 -12 12 -3 11 -3 -10 -9 -13 3 -3 13 15 -1 -9 10
215 10 -20 -9 -12 -13 -5 -12 4 8 -6 -5 0 11 15 -6 2 3 -3 25 -5 23 -1 -15 5 8 10 6 -22 -1 -19 17 -25 -17 13 10 28 -13 2 14 -13
254 -13 2 7 -4 4 -2 9 10 16 10 5 16 19 -4 -14 -4 12 -8 -1 -3 -2 -6 -43 -21 6 -40 2 7 11 -6 6 5 18 17 3 3 -24 -10 9 -1
293 -1 -11 -2 -14 0 1 -6 -15 -17 11 -1 31 -27 -15 29 12 0 -12 -13 -16 1 0 5 13 -2 7 -14 0 2 -9 -7 -11 0 10 -3 3 -25 17 32 17
332 17 15 -3 -7 -35 16 2 -7 -13 -4 -3 12 15 -15 22 -10 -4 -3 -2 -4 -4 18 -6 0 -9 -9 21 -16 -16 -8 -1 3 1 13 -37 14 -26 -26 15 19 -7 1 10 -3
375 -3 -12 8 -8 24 6 -14 -4 -34 4 -4 -25 2 -11 13 -24 30 5 -11 8 7 3 13 -7 -24 2 2 -9 -9 -12 -13 20 -16 7 -10 1
$$ packed form
120I17p04q52P05K18j86n33N85J59n43Q4M35l40n5J44N6j44OO7N0j49P1O1m9k0
144a7N0l4k0J1L7j3k6K8k9K3l2N9n6L9ojok0J6j4k4M4j2k3j5N0j3K5j4j6j4OL0
177A3l2Jj4K6J5k5kK9j0MpNk5K0J3k2J5l9N0KKj7j8MK4j5J4j4pJmJ6oJ6Kj6qJ9
215A0l0J1ljQpJ6Mj4JNJ1Mk1QJoK8l0K8k4j4K0LKmk8K1j8L6m2QL0lJ8m1J5J2k7
254a3J5Nj1QoJ1JOonJ1Lk3j0J0J6k0PkJml7K2K7m6M2NMj7J2jJ3jj4%k7J4J9j0
293aj0Rj2J4JprkK8j2L2n8J2M4j7j2j2jlJ7jNQj5Rk1J4Kj1KmJ1J0j3Ok8M2J5j5
332A7kj8mk8N1j4roRJJ5Ll0L7l2OJJk%K2k4Or%L0l7%QPMkJ2n0N1m0%M1Mk6QRj3
375crK0j6L2j8k0J0l0L8qk1K7j3K4l7N4k5j6J9jmJ0k0j7K6%j1%ljL3l6K3j7J1
$$ plain form
410 1 17 -6 -7 -6 29 10 8 -27 9 -1 1 15 20 -5 -4 0 18 17 -28 -34 -24 -11 -10 -18 -2 -4 -8 -2 11 2 -8 0 -18 -6 -7 22 8 -5 11 -20
450 -20 8 -1 -16 -11 -16 5 -4 10 -17 10 -8 -39 -9 6 10 -2 5 -16 11 -13 12 9 -20 -5 16 -20 9 3 8 12 -29 -11 13 4 -17 8
486 8 -7 7 -25 -2 17 -9 -7 2 2 1 -3 -12 12 -12 2 -15 -7 -26 -20 -10 1 -16 -22 -26 -5 3 -3 -4 -13 -6 5 -5 3 -15 -7 10 -6 -3 8 -3
526 -3 -6 -24 4 17 7 1 13 -25 -37 8 -6 4 2 -18 1 8 20 3 -10 -7 4 -27 16 -9 2 -24 0 -3 -4 3 -2 -1 -5 19 -13 -10 -6 -2
564 -2 -15 0 9 5 -19 -24 -12 -14 -15 -2 21 4 7 -7 20 -26 -10 6 -12 -9 1 24 10 3 10 13 -2 -25 -3 -10 6 -6 0 16 -9 -2 28 5
602 5 -14 -7 7 7 11 -6 7 14 -25 11 -15 24 1 14 -13 -16 12 -5 14 5 12 4 -19 -22 10 13 -17 11 11 3 8 0 4 5 -3 -27 -9 -23 9 -1
642 -1 -9 -9 -17 4 3 -33 -11 -12 -5 3 -17 -5 -7 1 5 -12 0 -1 -12 -3 5 -17 20 -2 -10 25 6 0 -20 12 0 -10 -8 -29 33 -9 14 -6 -13 23
682 23 -10 -3 -7 20 -31 -24 24 -10 -3 -17 -10 -7 -21 3 -7 0 20 -15 -31 -37 5 10 -1 -25 -11 -15 -4 -15 12 -8 18 -9 -12 -27 -1 -8 2
$$ packed form
410AJ6k3jJL5j9kl5L6j0KJ4Nk5JMJ8jm5oJ0J3JqJ6kmOJ3rj0Qj8J2jK9j4j3J6l1
450b0K8rj5NnK1rJ4k7K7j8l1L0J5Mj2Pk1K7k4K5lk9J5K1l6K9oNMm1J8K4rk1K5
486Hj5J4l2K3J9k6KR%jmrK4k4J4j7Qj9OJ0J1j7omK1QojrPJ1j0Qj8QJ7j6LJ1j1
526clj8K8J3j0oJ2l8j2M5j4J0kk0J9PJ2j7j3LJ1l1M3k5J1k6K4ljPnJmK4l2LMM
564bj3J5Rmk4nJ2kjJ3K3j7Lj4K7m6J6J6j8LJ0K3j4pPLj5k3K2pJ6j2OJ6k5PL0k3
602Ej9PJ4%Mj7J3Pl9L6k6L9k3J3k7lK8j7J9rPqk3lL2Ll0K8%qNqMJqk4J8j4L2j0
642aq%qK1jl6K2jPQk0J2kQMj7J2jj1RQk2L7k2qL5j9ok0L2j2j0Kk1O2m2K3k0pL6
682B3l3PmK7n1PM8l4Pj4PLj4K4j0PK0l5j6oM2Nj1k4J4mJ1j1K7k0K6k7lj5K6pJ0
$$ plain form
719 2 -4 -6 -14 -20 -12 11 -9 3 20 18 0 10 0 -2 5 27 -5 -4 -15 -16 -4 -12 4 12 -25 7 -21 12 6 3 -7 -12 8 11 30 5 11 1 -4 -17
759 -17 -7 2 13 4 -8 -4 -7 -8 -32 -24 -26 -22 5 -1 -3 21 -5 -1 8 -2 3 5 -20 -10 -5 20 -1 24 3 -4 20 -23 -11 1 -7 -14 -17 21 -18 -19 -4
800 -4 13 -3 -16 -6 -9 -5 10 -33 -5 5 -1 6 -4 -1 8 -28 -2 9 -9 6 14 -14 2 -22 13 -16 -4 14 6 -1 -14 8 -9 -1 -21 16
836 16 -18 -6 -5 14 -7 18 -2 6 -12 -8 -25 0 -14 -23 -12 4 4 2 -20 14 -19 10 3 7 -27 -3 -12 -5 -10 -22 11 -13 3 -10 -2 -5 1 6
874 6 -5 -8 -19 10 -13 -35 5 -19 -11 -23 -19 -25 11 7 -1 0 -12 4 -15 4 -11 -21 -34 -7 -8 -11 -19 -7 -5 -25 7 -14 0 -16 3 8 6 21
912 21 -22 -11 16 -2 1 4 -10 -16 7 -14 7 18 0 -19 -25 -20 -3 -13 -37 -24 -4 -20 -17 -25 -23 27 4 3 3 11 -4 -8 -5 -1 -13 -1 3 20
950 20 -1 -14 -17 -27 20 -9 14 -5 -19 -17 -20 15 7 -38 2 8 -10 -10 -31 -19 8 -5 -18 -19 2 11 25 -1 -9 -2 -26 -25 -7 23 -6 4
986 4 -16 -11 -6 14 -18 -10 12 -4 -8 -22 5 -21 -12 4 -2 2 -4 12 13 -15 0 -6 -11 -6 6 17 -2 -28 -7 27 5 1 -2 -12 -8 0 1 -9 -12 -10 25
$$ packed form
719BokqoQK3k0J2J7kj8J0j0kPK2l2Jj1jJ2qJ6Ql7L2k8L3olj0nK0LJ9k5Oj0nj3
759a7J0RJ1rj2Mljk4QkMK7okK4k6MRj0NKk5J0NK5k1K5k1pK4m3J2J2qplL8l9jJ5
800dJ7j6j3J0lMJ5m3K8J0oPj0LRl6K6J1j8J5Qk8J6k4L5k9J2J8qpj3K2j7Qk0L7
836A6l4J2JJ9k1K5k0Qj8Mj7K5j4rJ1J6%kk2L4l3K9pMl4K4rPnj2L3k4J6j3QlON
874Fj1lj1K9k3k2M0k4Qj2MoL6mqJj2J6j9J9j5j0j3K7jlqJ2Kk0L2k1J4j6J9NkJ5
912B1m3J1K7j8LLj4oK3k1K1J1j8j9oNJ7j0k4J3K0j6LqKN0k3j%Qj5mLMj2J2MJ7
950B0k1j3lj0M7k9K3j9j4KlL5qm5M0Oj8%k1J2K7j3j3jK1RJ4k6qPk4JJ8L0k9J0
986Dk0NNK0l2QK2j6mj4K7k6RJ6oMoJ6Jk8J5onNJ2J1j9k6K1L4k2mlj0MQJj0lKL5
$$ plain form
1027 25 -23 1 7 2 2 3 12 2 -23 13 14 -22 -2 3 -13 -28 -24 5 -16 8 -40 15 7 -27 2 -18 -21 -16 9 -2 5 -3 -3 -28 19 -3 -4 12
1065 12 -13 -12 -13 -10 9 -9 7 -21 -10 -13 5 -16 -15 5 3 2 1 -1 -17 6 -29 5 -15 -13 2 11 -2 -15 -9 1 2 1 -12 -15 -23 -11 8 -20
1103 -20 38 -18 0 -13 18 -11 0 14 -24 -13 -7 5 -25 7 -6 -13 -32 -4 -18 13 -3 -11 -6 -13 0 3 -1 -15 -8 -1 -24 -19 28 5 6 -19
1139 -19 -5 -25 -19 -31 8 -46 -10 20 -36 15 -16 18 -14 -15 1 -5 4 15 -25 -21 24 12 -7 -1 10 9 8 13 2 -6 7 -3 -10 -16 -20 11 -18
1176 -18 20 -10 8 10 -5 21 -7 6 4 10 27 -26 6 -16 11 -9 -14 19 -2 1 9 13 -5 -18 -1 1 -8 -35 -26 -24 -1 -29 -15 -12 -5 -2 5 9
1214 9 -15 -13 -17 -9 -9 -18 -1 1 11 18 1 5 -27 -13 3 0 0 3 -14 -28 -12 -5 23 -4 -23 -25 -15 44 2 -8 -1 -20 2 -24 -30 -6 -16 9
1252 9 10 -4 -15 4 -14 -1 -8 -6 -17 21 -8 -9 10 6 -7 -6 20 17 1 -7 0 -19 -11 -31 -19 27 -27 18 3 -13 -5 21 6 -6 17 4
1288 4 -2 11 -18 3 -11 3 -22 11 4 10 -4 -7 -13 6 -14 1 13 5 4 -15 -3 -25 -10 -13 -17 -28 1 2 -5 -13 -3 -10 18 -12 -4 -18 -27 -2
$$ packed form
1027B5m8K4On%JRj0k5L6Jl6K0Nj6j5MK9k1K4m8N5ql4K9k0lNK5j1Pq%k5M7k2jJ6
1065A2k5JjLJ9j8J6k8J1lJ8k1JK0kjjkj6K3l5L4k0KJ5Rj3j3OJ0Jjj3lqJ2J9k8
1103b0N8n6J8j3L1k9J1J4l8J1OJ2l0L2j3pj9K8j4L1j6qNpJ3Lmj4PPk3NM7k3Jk5
1139a9J4k0Oj2L9n4L6L0n6N1l1L4l2jJ6oRJ1m0MM5j2j9OJ1jjNj1qJ3j0pomL1k9
1176a8L8l0J8Kj5K6k8J3kOJ7n3L2k2K7k0nL3k1LQMj8j3J7Krk7RKK3k8J4LPLPM
1214Ik4KmQ%rJ7KJ0Pj7Ml2J4J6l%Lj7j4J6PK8k7j9kJ0N9m2j0Pj9K2k6oK4j0K5
1252IJj4j1J9j8J3pKj1L8k9jJ9mj3JK6lj6qPj9Qk0J2M6n4M5j5j6QK6j5j2K3j3
1288DoJ3k9K1j4J4k5L3pOj4loJ9k0J5J2qjj9J2k2J5lmj1K9JpqJ0pK8l0Qj4rK5
$$ plain form
1326 -2 7 15 -1 23 2 12 20 5 -16 -8 9 3 -7 8 7 6 -11 2 7 -13 -18 -31 18 -5 15 -9 -28 -5 18 0 3 -23 0 -5 14 -26
1362 -26 -1 1 -7 7 -2 -7 -18 -10 -3 7 1 -36 20 -17 0 -20 -16 -13 -31 -5 -2 5 -13 -12 -31 -28 -12 2 14 4 -2 2 -18 -26 -14 -13 -19 -17 -32 -18
1402 -18 16 -47 -16 -8 -20 18 -28 12 -10 -19 23 1 4 -18 2 0 14 -24 -5 0 -16 -12 0 -6 -13 -27 -5 -3 19 1 8 5 9 -6 -1 15 11
1439 11 -14 24 -10 9 -20 -4 10 6 -13 0 24 -22 11 -7 -11 11 -14 -11 -5 -16 7 16 24 22 -10 -18 6 -13 -22 -32 19 -14 -12 4 -22
1474 -22 -25 -20 -11 -10 12 -4 -2 -21 14 -26 -13 6 -21 7 -21 -10 -6 11 -4 -23 4 13 -17 -7 -16 -4 -6 14 -15 2 -17 -9 20 1 -19
1509 -19 29 -22 8 28 5 -1 9 8 5 -12 -11 14 4 6 -20 -11 -3 -18 8 -23 0 -28 5 3 -2 -19 -4 4 -8 -20 -22 -38 -8 -2 36 -11
1545 -11 -4 15 -18 -1 -2 -28 -7 -19 15 -19 4 -9 6 -28 6 -17 2 -19 -15 6 -25 -8 -8 -12 -12 -26 -13 -23 -18 -8 8 -9 -14 -35
1579 -35 -14 21 -15 7 -10 -8 -1 0 -28 -5 -8 18 8 13 -15 -26 -6 -23 -3 -8 -24 20 1 -5 -17 -10 5 13 -8 12 -23 7 -2 -4 -7 -3 -19
$$ packed form
1326bRQj6K4k1J0Qj5k1QJ7oj0J5jjj7J3Nk0nj3M9k3K0k4j9K3K3j8Lk6K3nJ9m0
1362b6K5KqJ4rnj1QPJ0ol7N6l7J7k0MLj8K6LPj8Jj9LJ6J4J2j0oMk0qJ2JoKj5J4
1402a8L4o3L1Qj2L8m6M0k2rM2k2Lk2K0kJ4l8J9Nj6MJ2opj4K2KK2j8PlMj5NJ6m
1439A1k5L8l4J9k9J6J4mj9J3K4m6L3j8mK2k5LOj1K3RQkl2qK4j9rj0N1l3KJ6k6
1474b2lNRJK2j6Kj9L5m0J3J9k7K8k8J1MJ7j5j9K7Rl0J0rJ2kK0k9J7j9QK9j9k0
1509a9M8n1L0K0k3oJ0jlj7JK5j0Kk6RQj5K6l1K3k8L3knj7J5Qj2j2kj6L0OL8m7
1545a1PJ9l3J7jk6K1j2L4l4K3j3J5l4L4k3J9k1MK1l1J7%m%j4J3j0NJ0J6j7nk1
1579c5K1L5l6K2j7KPJk8K3lK6j0Nk8j1K0j7K0nj6M4j9oj2PJ5Qk1K0l5L0rklMj6
$$ plain form
1616 -19 -13 -2 -4 -5 -22 -16 -6 -7 2 17 -26 7 -3 -4 -8 -5 -18 4 1 -10 -21 -3 -7 7 10 -5 -28 23 23 2 -17 -17 -14 -4 1 -8 -13 -22 -22 -26 -4
1657 -4 1 -1 1 21 -11 2 -32 -2 -26 4 -17 -2 -6 -9 -12 -27 -10 -5 10 -12 -21 6 1 7 8 18 1 -13 -6 -11 -31 -23 -6 -5 -11 23 -12 3 -11
1696 -11 2 14 -13 -12 -4 -6 31 -7 -6 -5 12 2 -13 1 -10 1 -22 -16 -10 0 14 20 1 -4 -12 6 -15 12 7 18 3 21 -6 33 8 7
1732 7 17 -8 -22 -6 14 28 9 -4 -8 -18 1 -1 -18 6 -16 -11 -11 -10 13 3 0 -18 -20 6 -5 20 6 -20 -2 -21 -10 -23 19 -17
1766 -17 -6 18 -5 -9 31 19 -1 -1 -9 5 18 7 -10 -4 5 6 0 3 -15 -30 -1 -12 -24 -9 8 -4 -25 -4 -9 -22 0 -4 -19 -27 -31 -15
1802 -15 -3 1 -6 33 0 -8 -4 -14 8 -1 13 8 -37 -4 -11 -16 4 -10 -4 -5 3 4 1 -4 -14 -8 -24 5 -32 -2 -17 1 10 9 19 5 7 20 -2
1841 -2 -19 -3 2 -16 -8 2 -4 1 -20 -4 5 -9 -7 10 0 16 10 -10 0 0 -14 -16 4 -3 -3 3 7 -29 -9 2 -26 -10 17 -5 -3 -6 -5 -9 -1 -3
1881 -3 -8 4 -7 17 21 -1 3 2 8 11 7 5 -14 3 27 -11 2 20 5 13 16 -3 -22 6 1 15 -10 7 2 15 -9 2 -9 7 -7 -6 0 11
$$ packed form
1616a9OJ1kjj7OJ0jRJ5m3L3j0jmLj3K2lj1j1J8mJ4Lj5k3N1%k1j9%LJ0Nrnr%mK2
1657dNkKK0l2J3l4L0k4L0k1J5mllj5J7NJ5k2rK7nOJJ0j7j4Pnk0QJ7JoL4l5J5j4
1696a1J3J2k7JQkL7l8JJJ7j0j5J4j1J1k3OOJ0J4Oj9nqJ8k1K7nJ1j5J8k7L9k5j
1732GJ0k5j4J6K0J4j9j3mj0J9kj7K4k2N%JK3j0lj8kK6j1K5j4k6J8j9J1j3M2l6
1766a7J1K4k3mM0j2k0%qJ4J3j1j7ORJoLj8j5K9j1j2J5J7j2k1K1nj3K2mj5qmJ6
1802a5J2MpL9l3qMj0K2rJ4nm5L3pnK0j4OjQJlnj0Oj6K9l7L0j5J8RjJ0j4KJ3k2
1841bj7J6Nj8QJ0oNk1J6Rj4KJ7j0J6ok0J0%j4kK0p%OMl6K0J1k8J6K7k2KlJmQk
1881cnJ2j1K4Mk2MjOLmkj9J7K4l8J3J8j5QLj9j9K8nJ4k5J7nJ3k4J1j1J6j4JOJ1
$$ plain form
1919 11 15 -5 -23 6 -13 13 8 20 13 -17 18 11 1 -3 16 14 14 15 -4 7 -9 -16 17 0 -3 0 16 -8 23 -17 -11 -21 -7 -9 9 -13 -28
1956 -28 8 2 -8 6 -21 -7 -2 -2 -6 1 -2 -15 -33 28 -9 -1 -21 -7 -5 10 -18 -9 -2 7 7 6 16 2 5 -18 -6 -25 -24 -15 -12 -13 -16 33 -23 -18
1996 -18 5 0 17 -6 -3 -10 23 14 -10 -10 10 3 -2 -2 30 8 -19 14 6 -12 -21 -3 -18 -2 -15 -38 -14 17 -3 -25 -23 2 6 -27 8 -4
2032 -4 -10 -2 -10 -10 -18 -2 -2 3 13 -14 -7 -9 -1 1 -11 -24 -13 4 -11 3 2 -13 -29 27 4 -13 -4 12 -4 1 -15 -5 0 -4 -8 -27 -5 -15 -2
2071 -2 -1 11 -2 -24 -14 -21 11 5 10 9 -15 -17 17 -23 -22 -3 -20 4 -7 -6 -4 2 -9 -2 8 -14 -9 -13 -5 -13 -9 4 5 11 -4 4 14 -3 -8 23 0
2112 0 -11 4 -9 -19 -20 11 -30 -8 -3 -5 7 2 13 6 1 9 -8 -11 -16 -6 -2 -3 -15 5 -3 -18 -7 25 -10 -3 -4 -12 -13 23 -11 -20 -21 -19 14 26
2152 26 10 2 -19 -16 -12 5 -5 -9 3 -8 4 -9 10 10 -5 10 15 -22 -12 0 -10 0 -9 -14 -2 -20 11 -8 -6 1 -29 6 -6 38 30 -11
2188 -11 -19 18 1 1 -7 -8 0 -14 -5 -1 -4 -12 -18 7 -9 8 1 16 13 -7 10 -4 -3 -6 -21 -10 -19 -3 -25 4 23 19 -15 6 2 21 -10 1 4
$$ packed form
1919A1Mk0j8K9j9K6nJ2pl0L5pj0mJ9k%Jj9J1j6pL3j7lLJ6k4L1m0Oj0J4kJ8k2j5
1956b8L6oj0J4k7J4N%mPlj3j8O1l7Qk0J4KJ5k8RPR%jJ0j4Lk3J2j9JRLjlM9n6N
1996a8K3nJ7k3LpL3rk4%K0pn%L2k2k7L3qj8rJ8j5J6j3k3K4L1k0k2KK5Ml3L5j2
2032doQq%qJ6%NJ0k7PkQKj2j3J1J7j5J4jj5j6N6k3j7RJ6j6Nj6J0Nmmj9K2j0J3
2071bJJ2j3k2J0pL2oNjk4kL4m0JJ9j7K4j1JKOj1PJ0k2NmQqMJ3JOj5QJ0j7nL1k3
2112@j1J5j3j0jL1m1K2NkJ2nJ1pnQj7lnJ0Mjj2K0qj5J1L2l5PjqjL6l4rjKL3J2
2152B6j6qk1LMJ7j0mJ2j1J2j3J9%j5J5Nl7J0J2j0J0rnJ2j8L1j9KPl0L5j2M4qm1
2188a1qL7j7%qjQj4RMlqoK5j6J7pJ5lk0J7j4Jlj5J1rJ6k2K9J9ml4K1mJ9l1J1L
$$ plain form
2227 4 -8 -22 6 -10 -1 20 -9 -1 -55 1 -19 3 -2 20 -2 -1 -2 31 -9 -4 -2 9 36 11 -37 6 -20 0 -28 -14 -14 -15 -18 -19 -20 -7 -24
2264 -24 -3 -19 4 -12 -1 -4 -25 -19 4 4 -11 -6 9 -3 -10 -1 -29 0 -22 -10 -39 6 9 15 18 14 17 -9 -7 -20 -42 -14 -9 -4 1 -27 -8 -14
2302 -14 -11 5 -4 -4 -5 -25 -34 -13 -2 -7 -12 -22 -25 -9 -16 -9 10 17 0 -24 -13 15 0 7 -28 -6 -4 0 -3 -22 -8 -15 -8 -2 -6 -12 -22 -17 -2 -9 -2 -12
2344 -12 -4 -7 2 -12 0 2 -25 2 -13 -9 -8 11 -14 -8 -18 -3 -16 -26 -22 -20 4 10 -37 -4 -7 23 10 5 -1 -17 -8 8 -9 -6 7 1 -13 -5 -1
2383 -1 -18 14 8 -7 -27 -21 -7 -13 5 1 -1 6 -7 -4 -30 7 -26 -10 -19 20 -16 3 16 -8 -8 -31 -14 13 -5 2 -18 -3 10 8 5 -8 -30
2420 -30 -1 19 -3 -14 4 -13 7 7 -12 -21 -28 -16 -20 -9 -24 -34 -16 -39 -16 0 3 4 18 -18 -27 -8 -15 15 -6 20 -3 -9 -4 7 11 -31
2456 -31 -1 -9 -4 0 -9 -8 -3 1 16 -9 5 2 -22 17 -17 -9 -2 30 10 12 -22 15 -19 4 -11 16 7 0 -4 -11 -24 -22 20 -29 -20 -21 -15 -6 2 -8 -12
2497 -12 -5 26 8 -25 11 -17 -12 0 -34 -14 2 -2 -3 -9 -20 15 0 9 -1 -7 19 0 10 -4 -11 4 6 -13 -2 -19 -14 27 -8 -29 -8
$$ packed form
2227Dj2j4K8j6RK1k9Qn4N6k0K2nK2k2JjL3m0NKJ1K7k5m8M3k6K0k8J4%jljjJ3j7
2264b4K1j6K3j6J1lk1OK3%j5NJ5j2pRk8K9k2J2k9M5LOLmLk6Kj3k2K8NNNk8J9o
2302a4LJ6r%jk0rK1J1nnj0lJ6pPJ9Pj7k4J1K8j5Pl5K2KMlj9J4pPOmoj0NJ5pPj0
2344a2QlRj4J2Kk7K7j5MJJ9k5Oj0J5j3j0MKK4Om7L3lL0j3noj6RJ6j7LJ3oj4QM
2383aj7L2oj5k0OJ4oJ8mkPj3Lk6L7l3J6rL9l6J9J3k4%k3J7K7j8Pk0J5J3klj3k2
2420c0K9K0k2j1J8j7K0%j9rpJ2mJ1j5j0J8k3K3J6LJJ4l6rJ9pL0k1K6k3oNJ1Mm2
2456c1L0qNMrJNMJ5k5J4lk4L9l4QPL2k0Kl4L7l4K3j5K7rpmpj3KM2m9RjORQj0m
2497a2PL1j8l3L6k8NJ2l4K0J6mjoj1L5j5Rj0oK6j9J0j4pJ5Kj9J1j7NM1l5k1K1
$$ plain form
2532 -8 -16 3 -29 -21 8 -17 -5 -22 4 11 -27 -21 2 -8 29 -18 1 26 -7 -7 4 -22 26 4 -27 -5 -20 3 -17 -22 14 -9 -19 19
2566 19 -30 2 -20 -28 -23 -12 -15 -14 1 -2 -17 13 -8 2 -18 -16 -10 -27 -2 -7 3 3 -7 -30 0 -6 -20 -12 5 -19 -25 -22 -3 11 -28 11 -10
2603 -10 -28 7 3 18 -9 -18 -28 -15 -11 -11 -16 -5 4 -14 -14 -9 6 -21 -19 7 1 6 -21 -8 6 12 1 -15 -15 10 -4 -9 5 -12 5 -40 13
2640 13 -12 -3 -11 -1 8 -5 -16 -11 1 -22 17 -17 16 -29 -3 -1 -17 0 4 -15 -9 1 17 -18 -4 3 22 11 3 2 -4 9 5 -19 -20 -7 4
2677 4 -21 -5 -6 5 -2 -26 0 -5 -3 -3 -2 -5 -4 -18 22 -10 -15 1 -2 -8 -11 -18 -14 12 -8 -4 17 -12 14 -14 -9 7 -1 -23 18 -11 -25 1 1 19
2717 19 4 -15 -7 1 -11 -10 -21 -3 -13 -25 -6 1 4 2 6 7 -18 -5 9 -12 -2 6 19 -5 1 5 -12 -4 -26 -15 1 8 13 -5 -5 -21 -7 4
2755 4 -2 17 -17 -22 9 9 -23 8 0 -38 -11 -30 12 0 -5 4 -7 9 -3 5 -17 10 -7 26 6 -6 -5 29 7 9 -11 -38 -13 7 1 -4
2791 -4 12 24 9 12 0 -9 -7 -14 -3 -35 -9 0 -12 2 -4 -24 -10 -5 10 15 -20 -3 0 -19 5 3 -8 -29 9 2 -2 -17 -40 0 -10 6 -2
$$ packed form
2532hqJ9l2QK9k5J2j7K6Pl8OK3j0L7m7J9K5l3%J1k6M8k2l1K2j5K3k0nL6k3j0L8
2566A9m9L2k2qNJ1lJJ5lj5L0k1J0k0KOj7K5nJ0%j0k3L0oj4QJ7k4oLJ9J4l9L9k1
2603a0j8L5mJ5k7rj0J3M%nJ1Rj8%NJ5k7KK6oNk7J3J4Oj1j6%K5j4nJ4j7J7m5N3
2640A3k5RqJ0Rj3j1NJ2k3L9l4L3m5K6Kj6J7Mj9OJ0J6l5J4PJ9j1qjoJ3mk4jJ3J1
2677Dk5J6jJ1pk4K6nK%JlJj4M0l2nJ6lolpMK6k0MK1k9K6k8NJ6qk2M1k9j4K6%J8
2717A9j5j9QQj2Jj1J8j0j2J9PLkMJk5J3J4k1J0QJ3k4OMj7Qk2J1J6PNj8%j6J4J1
2755DoJ9l4nL1%l2L1ql8K7j9M2j2nRj1J6j2Qk2K7j7L3k0j2JL4k2Kk0k7K5K0on
2791dJ6J2j5Lj2rKpJ1l2K6Rj2J4ok0J4NJ5Nl5J7Lj9K4kj1k1L8pmj5k3M0j0J6q
$$ plain form
2828 -2 -30 -21 -10 -10 -9 -4 -9 -28 -31 6 -4 -19 -10 -24 -12 3 9 -25 -7 -14 9 1 -9 -9 -2 -25 -2 -3 5 -18 -27 13 0 2 -22 4 -12 0 -9
2867 -9 -8 -7 -27 -16 -3 0 23 -14 15 20 -3 -18 -31 -10 2 10 -1 -22 -32 9 -23 3 -13 -14 6 -9 -8 -16 15 -6 -16 -14 -15 23 -2 -10
2903 -10 -8 -7 -3 -17 -4 4 -2 10 -23 -14 32 -3 -1 17 -10 -18 -14 -2 3 -20 -8 29 2 -25 -10 -3 10 -24 -20 14 26 -6 -11 -5 -17 -14 -10 -13 -3
2942 -3 18 11 15 -1 -23 -26 -16 -13 -7 -20 -13 -37 -7 -12 -14 2 0 10 32 6 -13 1 14 -45 0 5 15 -3 -1 4 3 -7 -18 -3 -9 -16 3 -16
2980 -16 12 11 10 4 -3 -4 -21 -17 -4 -11 -5 -12 -36 -3 -25 7 -4 -22 -5 18 0 -26 5 -3 -3 8 -3 5 -20 -8 10 -3 -13 13 -3 -13
3016 -13 14 -10 20 -4 8 -14 -10 -4 -9 8 18 -27 -19 2 3 -4 20 5 12 11 -15 -24 6 28 14 2 -1 -6 -26 -10 7 -18 1 -15 -11 13
3052 13 1 -20 -7 -1 -17 -23 -17 -2 9 -4 1 -21 -14 -11 19 -35 -10 3 -12 7 4 -2 -33 -1 -20 -17 -15 9 -5 -44 -8 -9 -15 3 0 -10 16
3089 16 -8 31 -11 -5 4 0 -4 -16 -13 -9 -19 -18 4 -8 -5 -4 -9 -7 -6 -4 13 12 10 -15 5 2 18 0 -17 -13 -11 -10 8 -22 -6 7 -31 -2 12 -5
$$ packed form
2828bk8RJ1%JNnj9lL7j0j5Rj4J2J5Ol4J8pK3qj0%Pk3K3jQk3rM0j3Kk4K6j6J2r
2867iJJk0J1J3LK3l7K9Nk3j5j3K1J2Qj1k1j0M1l2K6j6jK0j5JqL1k1j0KjL8k5q
2903a0KJMj4J3QoJ2l3RM6l5KJ8k7qMJ2Nk3J2L7k7k7J5PJ3l4ML4J2l2nOj2LMlJ0
2942cK1pMj6k2lJ0LOj3Pk4L0nkJ6kJ0K2k6j9J4J3n9M5NJ0j8KNjj0j1J5opJ9j9
2980a6K8jjopjj7MJ3pOpk4L3k2L2j1j8J7K3j8k6L1q%J1j1Qk5J2J8j3j0K6j6j0
3016a3K7k4L0k4J2k2MOnJ7J0m5QK1JpK4j5Pjk6rL0K2j4j2lnk0J6J7k5J9j6MK4
3052A3j2k1J3Oj6oOJ5J1j3Nk2PLL0n4K5J3j5J9lol1L2j9LKK4j4l9L6joJ8lj0K6
3089A6k4L9m2ORmmj2LMj0JK2j2LJnKJKJ7jkk5K0lJ6j8j7MKJJ8l0J6J3l8K9J4j7
$$ plain form
3129 -5 27 16 -4 -7 7 -18 7 -5 -20 -16 -20 -17 10 -39 -12 19 -7 -24 20 9 0 -18 -3 13 -11 3 36 15 -16 15 11 -1 10 4
3163 4 8 -16 14 -12 -8 0 -8 -6 10 -22 -15 -1 4 -12 -11 -14 -1 13 -9 -16 -11 19 10 19 1 7 0 17 25 15 12 18 -5 10 4 -3 23 -4 11 -20 16
3204 16 -9 -8 -10 -14 16 -42 10 0 -26 10 -2 4 -23 -33 -21 -9 -2 17 -2 15 -8 -15 -6 -24 -5 16 -11 -7 -6 21 -9 -10 17 5 -4 -10
3240 -10 15 -21 -7 -20 4 -9 1 7 1 1 -9 -9 5 15 -13 -28 18 3 -6 -25 2 -5 -1 -27 -14 -27 -14 1 -24 0 22 -3 -5 1 3
3275 3 -18 0 -2 10 4 11 -20 -13 8 23 -29 -12 10 -14 1 -1 -2 -20 9 3 -23 -12 2 -11 -4 -1 -8 2 -8 18 -14 -7 19 -16 3 -5 -16
3312 -16 3 24 -9 -13 13 -23 -15 -11 -3 5 6 -19 -31 2 29 17 31 5 1 18 8 -7 -42 -1 -25 -3 -23 -24 -3 -17 20 1 6 -22 9
3347 9 2 -40 -3 -22 24 -13 10 -11 1 -24 -12 3 -25 9 -22 -5 5 2 14 7 -4 6 -6 -12 -37 -17 -18 -8 -10 13 -7 1 -11 2
3381 2 15 -9 26 14 12 4 -14 -17 2 -31 -2 -18 -4 -6 -7 -4 -12 7 12 24 -15 0 -33 -12 -3 16 4 26 23 -15 14 -19 9 -21 -23 -26 -3
$$ packed form
3129eL2j1k0lJ4k5K5j2j5MmLK7m9K7L1k6j7M4j1rj8J5J6k4J4L3k1l1L1mj2J1o
3163DMk4L0k6MQqKJ6l2PJ4Nj6JlJ3J4k2pNL0rRj8OpJ7Qj0lOk3J5opK6k7J5l1L6
3204A6k5JkmL0n8N2j0k6L6j2Ok7j0J2J2PJ9j9J7k3pRj8J9K1k7MJK7l0jK7j2ro
3240a0K5l6J4j3K4j3J0Oo%j0%J4J0k8j5M6j5rj9K7pMk6J3j3J3J5k5K4K2k5kOK
3275Ck1J8kJ2oPl1PK1J5n2J7K2k4J5kjj8K9ok6J1J4j3PLpJ0j0K6l2PK6l5J9qj1
3312a6J9K1l3mK6l6QMQQJk5j2L3K7j2J4k6mJ7j0j5l5M1k4K2k0jK1j4L7j9Nk8L1
3347Ipm2L7j9M6l7K3k1J2k5J2J5k8L4l1J7J0lJ2pj1J0j2ok5K0jJ0kK3k0Qj2J3
3381BJ3k4L5j2kqj8lJ9l3K9j6J4kjLqJ9NJ2l9J5l3K1RJ9j2K2ll8K9l3K8l0klK3
$$ plain form
3418 -3 17 -4 6 -18 -15 0 27 -12 9 15 -13 16 -20 -3 8 28 -7 -4 -12 -4 -5 -2 21 -16 8 -39 -19 -23 -43 -5 -14 -16 -2 3 -3 -14 13
3455 13 -30 0 -15 -8 -1 -5 -8 -14 -9 5 -24 -20 -3 -22 -11 -8 12 -4 0 0 -6 -23 -10 0 10 -7 -21 -16 15 -5 24 -3 1 10 0 0 -5 5
3493 5 -16 8 0 -13 10 14 -29 14 -13 3 19 -1 10 15 -2 -9 7 6 -9 -12 -6 9 -15 -31 -5 -30 16 -16 -18 -28 3 -16 -8 4 -5 -13
3529 -13 -8 21 -32 -24 9 -9 3 9 -11 -10 0 19 -15 19 -14 3 3 7 5 -1 -11 14 -7 -12 14 -9 -20 -5 -11 -12 4 4 -4 -12 -32 -5 -3 -6
3567 -6 -10 7 -7 15 11 -17 21 8 5 -18 -1 1 8 -20 16 -3 -21 -6 12 10 8 -37 -27 4 6 -28 -24 -2 8 -15 -7 5 -8 0 14 18 -12
3604 -12 -30 9 -12 -18 -1 1 18 -11 12 -7 -5 13 -3 0 -9 6 -8 -9 -1 31 -1 -3 24 -7 -15 10 13 0 -6 -25 12 5 9 13 7 -28 -3 17
3642 17 -8 -5 10 6 0 -26 -16 11 11 -5 -1 -11 -22 -34 -5 -21 31 -7 -3 0 -1 -3 -20 17 6 12 -16 -5 -6 -11 1 18 -2 -23 -6 3 10
3679 10 8 -24 -10 14 -5 14 9 25 -3 -7 24 -28 -14 -6 -7 -12 -17 9 22 17 -20 7 0 -36 -14 22 -15 37 13 5 -19 2 7 9 2 -24 -12
$$ packed form
3418cK0k1J0k4LJ5K7l9K1Ok8K9l6J7J1K0l5LqQjLK3l7K4m7K0mk0L8rkJ4Noj1K7
3455A3m3L0j5PPmloNJ4k9MJ7j9J1LK0j6M%oj7J3J0J0j7j4NL1k0K9k7MRj0%nJ0
3493Ek1K4qj3K3Mm3M3k7J6J6k0J1Nj7pJ6jj5lOJ5k4j6K6k5M6l2kj0L1j9QJ2rq
3529a3NK9n3QL3j8J2Ok0JJ0J9l4L4l3J7%Mkoj0K5k1nK6k3j1J5ojJ6%qqk0K7Kl
3567fmJ7j4K2mk8L8j3lk3J7KPk8L6j9j8J5J8kkm5J0L1Kl4MK2J0k3QJ2j3QJ4Ml0
3604a2j8L9k1oJ7KJ7k9K3j9KJ8j6LrJ5j4jQL2l2kK7l1qK5Lj3oj9L7pMMol5K5K0
3642A7k5LJ5mok6J0K7%j6Mj0j1j2K9j6N2l8MLjkj7L7j1Ok8J1jnJ2J7k0k1J7RP
3679A0kl2J4K4j9J9nJ6k8mL1n2J4QjnnK6J3nl7K7pl6K2L6l7N2k4qk4K1NKpk6J2
$$ plain form
3716 -12 9 0 -41 6 -7 -31 -8 -3 -12 -1 0 -1 -6 -24 -15 -4 -21 -5 -7 18 6 -1 -12 -21 -11 -11 37 1 -1 -14 -23 7 -2 -19 -13 -7 -7 -12 6
3755 6 15 5 -13 -4 4 5 11 -20 -20 -9 -11 -11 -16 5 -30 -7 -28 10 -15 -6 9 -8 -11 -5 -5 -16 -3 -7 -8 -7 8 -26 -16 -2 -25 -22 4 4 -6 -19
3795 -19 26 1 38 -12 -7 21 1 -10 -3 9 -11 11 13 17 -9 -17 10 -24 -7 -28 4 -12 4 -20 0 -30 -12 4 -22 -1 0 -7 -11 -9 -11
3830 -11 -21 11 -25 -5 5 -13 1 -2 -15 -30 14 -13 9 1 -1 -35 1 12 8 -11 -19 -10 2 -4 12 18 -15 -1 -2 7 30 21 13 -6 -22 -17 -16
3867 -16 -38 -4 -11 -3 -6 -13 -15 -24 -28 -9 -3 24 -7 23 6 6 -8 4 -1 15 34 -5 1 4 4 28 15 -26 16 -19 -4 -2 10 10 2 -20 1 7 8
3906 8 -2 1 2 4 37 -30 -2 -4 -1 -14 -9 -22 6 -10 2 15 -12 -10 -15 22 15 -10 6 -30 -19 8 -12 -1 -19 6 -6 0 2 16 12 -13 1
3943 1 3 8 -3 -23 -28 -9 -4 -23 -1 -31 7 -19 -34 12 0 2 20 -9 0 10 15 5 -16 10 3 9 14 15 -20 3 7 -1 -3 6 31 10 -11 8
3981 8 15 -7 16 -5 15 4 14 -16 21 -14 -7 -15 -4 -6 -15 -4 -30 13 -7 24 14 3 -13 -6 5 -9 -9 12 -7 -15 -14 -15 -24 -4 18 -14
$$ packed form
3716a2K1rm1M7j3k4K3NrJ1Jjnj8RJ1j7J6kK5j2pj1rJ0%M8l6kj3rL0rj7OO%nJ8
3755FRj0j8RQJOl1%J1k%nK1l5K3k1L8k5RJ5j7lO%j1J3mjJJ5l4J0J4k3LK6%j0j3
3795a9M5k5L7n0NK8k0j1PJ2k0K2KMk6qK7l4J7k1L2j6J6k4K0l0J8J6k6K1JpmKk
3830a1j0L2l6K0J0j8J4lj3j5M4k7K2qkl4L6J1mj9qRJ2oJ6Ol3J4jRK3rqj9j6NJ
3867a6k2L4pQlpkrmJ9OK7l1L0j7%j4J2nJ6J9l9OL%K4j3m1M2l5J5KJ2%qk2K1OJ
3906Hj0LJKL3o7K8kLj3Nj3K8j6J2J3k7KnL7pk5J6l6J1K7k0J1j8K5j2OKJ4mk5J4
3943AKNj1k0nJ9Nj9K2l0L8k6j5M6j2KJ8k9RJ0Nj0k1K6pONJl5K3MqkRK5k1k1J9
3981HPk2K3k1K0j1J0l0L7l5PqJ1krJ1k6M3k0L1j0j1j6PJ1j4%K1j9qJjrK0K2l2
$$ plain form
4017 -14 -6 -2 -1 16 3 -2 -12 14 -10 22 -16 -17 -36 17 -7 14 -4 6 3 -4 -5 -6 -10 44 -25 -23 -34 15 6 18 -6 -10 -6 9 11 -8 -3 -6 3
4056 3 18 -7 -3 12 5 -24 -1 6 -20 20 9 -10 -16 -15 0 14 -4 1 -8 -2 0 11 -9 -16 17 18 -7 8 1 8 12 15 -14 13 -19 7 0 4 -14
4095 -14 1 -12 3 -3 -7 17 15 7 6 -7 1 -6 12 15 -1 6 -9 -6 5 -5 -19 -15 -12 5 -10 -2 -4 -13 0 7 -26 17 -2 -7 8 -7 21 5 -28
4134 -28 -1 6 -4 -6 -14 7 -7 10 -1 -7 -2 5 3 0 22 -1 -8 16 7 24 19 10 11 -2 -15 7 -10 12 21 0 -24 10 -45 -23 -31 -25 5 -4 -2
4173 -2 -21 -14 -21 12 16 -15 5 1 6 -11 -3 -5 0 -16 8 -4 -7 -13 4 4 0 14 -5 18 -11 13 -19 -4 11 6 -29 1 -18 -2 -6 -8 -13 0 -12
4212 -12 6 12 -12 -35 -11 -7 -12 9 -2 -1 6 -12 -44 -17 20 7 -22 -7 8 14 6 -23 12 15 8 -16 2 -2 -2 6 -2 11 -17 -4 -3 -8 2 32
4250 32 -10 -9 -22 -11 -13 10 9 -9 17 11 3 -18 -31 10 -12 -6 10 13 10 -4 15 21 6 13 36 -9 -29 12 -11 28 13 -8 -16 22 17 -14
4286 -14 -6 4 14 -7 -17 1 -14 -22 -11 -6 -12 12 -1 -16 -9 16 -3 -14 19 0 12 4 -15 1 -19 8 -12 0 8 23 4 0 0 8 2 7
$$ packed form
4017a4QMJJ7j3nj0K6k4L2l8jj9N3k4K1j8J0lpjjmN4o9Kj1M9rJ2k4mMJ5Kj9NlR
4056CJ5k5MJ5pk9K3Pk6M0j1j9oJJ5J4j8NrOKJ1k0pL3Jk5J5pPMLk9K7l2K6pMj8
4095a4J5j3J5omK4kqjj3QpJ8Lj6Pj5LJ1j0j4MLJ7j5QkrJ3Pl3M3j9nJ5j5K8j6l3
4134b8K7Pj0kqK1j4J7j1oNPklK2k3pK4rJ7nrJj3j3K2j7K2Rk1k4L4n5K2qOL0rK
4173bj9PpL3Ml1K0mNj7QkNj6K4j2loJ7%mJ4j9K3k9K4l2J5J5nl5L0j9J6mknJ3j2
4212a2J8Ok4k3K4MnK1j1JPj8l2K7L7j3k9J5J5Oqk9L5Lpk4J8m%QqJ3k8J3JnJ0L0
4250C2m2Jj3J1kK3jj8K6oqk1j3M1k2OJ6Llj4J9Oj5PK3m5k0M1k3L9j5k1qL8nl1
4286a4QJ0J0k1j0J8j5qJ1NoK4j3j5PK5j9j1L3j9J2qj9J6k0K7k0J2QJ5j9m%QoN
$$ plain form
4322 7 9 -26 17 -1 -4 2 10 -4 6 -17 -9 -9 2 11 -32 -18 -10 -7 8 4 9 -1 -15 -11 -34 -12 -6 11 -13 11 13 -12 11 19 7 -9 -10 -3 22
4361 22 15 20 5 -14 2 9 4 -1 -6 17 -14 -1 -18 23 -8 8 0 8 -10 -12 -11 -24 -15 -9 28 -2 -2 -5 -2 -18 9 -13 -8 -19 9 -21 -16 -6 -22
4400 -22 9 19 -7 14 12 -10 -4 -15 2 4 29 9 37 2 -3 38 -6 21 17 -16 -19 -7 -22 14 -8 6 -12 -20 -10 1 32 -19 15 -18
4434 -18 -21 -9 11 11 -18 10 -13 -14 1 26 15 1 -1 -15 13 8 35 11 3 17 2 -14 4 -9 -2 -12 -10 6 0 -13 -9 -3 -26 -2 -20 -10
4470 -10 -17 -12 -22 -13 0 -8 -5 8 -12 -15 -4 3 16 -40 9 0 12 2 -3 -26 -7 -3 8 31 8 -16 3 21 -16 -1 -11 20 -1 15 10 -17
4506 -17 7 -11 -7 -9 -8 -11 0 4 -1 2 -8 -23 -2 -20 2 4 -8 -15 7 -4 27 -11 6 9 -2 -2 2 10 9 0 7 2 -14 0 -21 12 -9 27 10
4545 10 -38 6 16 -21 4 -10 14 -17 -2 8 -14 -1 -2 -4 -24 -15 -2 -21 3 7 -22 2 -6 -7 10 7 3 -5 -8 7 -25 19 -12 30 23 -6
4581 -6 12 -10 1 2 -19 -8 -9 -22 -14 -6 -12 1 -2 -18 -2 -22 11 -31 0 -21 7 -9 -6 -26 -16 -15 -5 -15 6 -3 5 -8 14 -8 4 -1
$$ packed form
4322GKl5M3j8lOQj4J0k3Q%J1Rm3J4QLJ5mNj0j4Mk3K2OJ7k4K4Kk5K3Qj2j6jPK5
4361B2pNj5j9J6PnnnK3l1J3j7M1l1J6qQj8kJj3ROL7l0%lLj6K7k2Nj1K8l0NJ0j6
4400b2L1J0k6K1kk2Oj1J7KK5k0K8l5nM1m4K7ml3lJ2j5L6k2J4j8qJ0J1L1n1L4l3
4434a8lJ2K0%k9K8k3jJ5K5j1j4kj4K8nK7k4qJ4j5j6J8j3Pj0KJ6oj3MOk3K4j8J0
4470a0pNj0RJ3qLJ3k0lJ1PJ3n6M9rJ2j0nk3J9MJ1K3k3k4J9J8l7J5j0L1k1J6nk7
4506a7K4j8MkJlJ1MnLj0j5K1j8K2Kj2pK2j1L1l8J7Lj1%MQjrPnj6J4k1L3k1L6j7
4545A0m8M4J0l7K5j4K4l1J5J0k2J3jkk0RJ3j9K4Mk9K4qjJ7lmqlJ5l2M4l1M2pk9
4581fJ8k2J1Jk1J1jj3QQoJ3lj6J6k0L3m2L1k1K8j6Lk0J0JJ0j0K1rQj3K2k2J2n
$$ plain form
4617 -1 12 -24 3 -18 11 -12 5 -15 -21 -11 -32 -33 9 1 14 3 -29 -25 -25 7 -12 2 2 -5 -12 -6 -9 -16 12 9 -5 -9 14 4 6 -9 1 5
4655 5 5 -6 -7 21 -21 -2 27 26 -16 -3 -11 15 -11 18 -13 -2 -2 14 9 -30 1 -2 10 -5 -12 -16 -1 17 8 13 -4 -7 -23 32 19 -19 7
4692 7 11 5 13 -25 30 -6 -27 21 -4 1 2 -2 14 4 19 10 -26 21 11 8 -17 13 -7 -15 3 3 5 3 -7 7 1 -12 -14 9 -8 -3 -26 15
4730 15 -7 -8 -4 -2 8 12 2 -15 -8 -12 12 -7 -17 -14 -15 -2 14 11 20 -14 -11 -13 12 -10 -5 9 -5 -11 -7 2 -36 3 -2 -2 3 4 -12 -12 10 -33 -14
4771 -14 -1 3 -14 12 -13 1 6 -20 2 13 22 2 -16 7 -14 -11 -22 0 4 11 -7 -3 -2 13 14 2 6 2 12 7 -27 -15 -19 -4 6 -12 -14
4808 -14 -24 1 13 -4 -16 9 -10 2 14 -8 11 13 7 -23 19 8 10 14 -19 12 -6 -13 0 26 18 -9 -28 18 26 5 6 -11 -2 1 1 7
4844 7 -8 -29 -3 9 -13 4 -8 6 -19 -10 -1 8 -15 -16 -36 -24 -28 -16 3 -6 2 5 4 40 -1 2 -10 -15 13 -27 11 12 8 12 27 -3 -21 -12
4882 -12 -5 -16 6 26 21 -7 4 8 -9 13 -33 3 -23 -14 -11 12 -22 -21 3 0 -18 -8 -9 -3 -14 6 -1 -9 30 9 11 -19 -4 14 5 -9 20
$$ packed form
4617aJ3l6K7k1K9k3J7k0oJ0k1jM2qJ3j1l2M%L2j9J4%ppOlpK8lj4mK3j0Kj5J0M
4655E%j1jK8m2J9K9jm2J3qK6k6K9l1J1%J6nl9L1lJ2j5pmJ5J8rNj7lj6N5j3l8K6
4692GMoQl8N5l6k1M8k5NJmJ6j0J5rl6M7j0lk5L0k0qJ8%Kkj0J4oj3kK3j7Nk3M1
4730A5k2jMKJ0Mj0j7PmK4j9j0LjJ3J6lRl4LkK5k2NJ4j4oMRl8L9n%NJj6%K2m3J9
4771a4J3Mj7K6k5J4Nk6K2J1Rk0j8K3k1Lj1K2MPj8MJJ5Jj2MmJ0nl4J2mJ5J0j8k
4808a4j0K5J2j7j2K5j9J2J2k2J9Kol0M2j1KMl3L1j8pJ3K6qk7j9M6Qk1Jj7RL%O
4844Gj5k1K6J2k2J7j2J4k5RRRk3jk0J2mJ2J9rQLjL6m1Lj2nK8m0L8JmMJ5l0j8R
4882a2Pj1K2K0nk8J1Mj7K2m6L6k6RLK3l4JK4lj8J0jOj1K0pqL9k1Kl0J5J8rj4K9
$$ plain form
4919 20 9 7 -14 -16 4 18 4 -11 -10 -20 6 7 -2 -3 -1 -23 11 -30 3 8 -4 -19 3 -23 19 2 -28 -18 -10 6 -18 13 -16 -2 -10
4954 -10 1 -19 3 -26 3 3 -20 -11 -6 7 -10 -2 9 17 5 6 -20 -15 8 18 29 -14 -24 14 2 -10 -4 -11 -3 15 8 -4 -13 -23 -27 -10 -6
4991 -6 3 -2 -14 36 9 -15 10 7 -9 -6 10 4 10 1 -7 -12 6 -2 -4 1 -13 15 -5 8 -8 0 -9 4 -5 4 -10 4 6 -12 -11 -24 15 -6 -5 -4 -26
5032 -26 -2 18 -4 11 -4 1 9 -12 17 16 3 -28 -1 1 12 19 17 -7 12 -6 -1 14 -7 8 -20 -3 -5 -19 22 0 16 8 -6 8 -12
5067 -12 -10 8 1 27 -1 18 -21 5 -35 -1 -12 -17 -32 -17 -21 23 5 -11 8 15 -1 -9 3 10 -22 -2 11 -18 13 24 -17 -1 29 -5
5101 -5 -25 4 -7 -2 -15 -29 -12 -10 2 0 -35 -17 -31 -4 -9 -21 -36 -12 19 -2 -5 -2 3 1 0 -9 8 -13 -3 7 -13 -13 -4 -23 10 -14 -5
5138 -5 -9 23 -23 2 10 -1 -6 -31 -8 -21 -11 10 -23 15 -14 -26 3 3 9 -2 -34 -11 -2 5 -24 8 8 8 -20 19 13 -6 -19 -10 5 -3 1
5175 1 -6 -6 -10 12 -6 2 -6 10 -9 0 7 -16 -24 -14 -13 18 -23 16 -19 15 2 -12 -5 -6 -27 12 -13 -35 10 6 -6 -1 1 -32 -11 2 -11 -23
$$ packed form
4919B0j1kk1kK0J4j4j5Jj0K6JrjKk2L4m1L3Nj2j5K2k6M2j7l0J0QJ6k4L1k9J4q
4954a0J1k0K2k9K9%k3RNJ3j7QJ1Qj2Jk6NK3J0J1m3j0L8j2j2OpQJ8pj2rj0mJ7M
4991fRnj2N0k7k4K5lj6LJ6oOrqnJ8qkNj4K8k0J3j6QrJ3rRj4J4Kj8Jj3L9k1JJk2
5032b6K4K0k2J5j5NQk1K9jj3l1K7KJ1Pkk4J9j8NJ5k1J5k8J7kj4M1k2J6qj4J4k0
5067a2KJ8pK6k8J9l9K6m0L4j1nj5J5mM4j8j6J9Pj6qJ2Pl2K0J3k9L1J1m1J6L0l4
5101ek0K9j1Nj3j4J7KJ2kl5J8j4K7nj2j5K4L1k1lLNkjrJ7k1J0J0k0%Rj9L3k4R
5138emL2m6K5Qj1nk5K3j3J0K1l3L8k9j2K9%Oj1l2K3RPk9L2%%k8L9oj9j3RJ5qM
5175Ap%mK2j8QqJ6j9RPk3qJ0JL1m1L9l5L4j3j4Pjk1L9k5k2M5mj2NKl3K1J3j3j2
$$ plain form
5213 -23 -4 -12 1 -17 1 22 -2 2 1 -20 -23 22 6 -15 4 -30 -4 -9 -21 5 -27 -15 -11 23 -5 11 -1 -29 29 -19 -26 -4 -26 -11
5247 -11 -2 -14 -15 -27 -8 -9 0 12 -14 -6 -6 -7 6 8 -12 5 -15 11 -2 7 35 14 4 -13 -9 -13 -21 -10 26 -41 10 16 -9 -5 -7 -30 -7 -20
5285 -20 11 -20 -1 6 14 -8 16 2 -23 -3 -23 18 18 -23 -13 -3 -23 27 12 17 8 23 -5 -16 -10 -6 -16 -16 -4 32 15 -11 2 6 19
5320 19 -11 25 -7 5 -9 -33 -11 -18 25 17 23 20 -11 -9 -7 -10 -12 -13 -7 -19 -8 -8 -8 6 -9 -17 14 13 -7 1 -28 2 -15 7 18 -3 18 0
5358 0 3 -12 6 23 1 -9 -14 -9 25 7 17 9 3 -5 12 -2 -15 -44 -10 11 -63 2 -29 2 15 0 -13 2 -6 -4 -29 6 2 -5 1 9 9
5395 9 -5 15 6 -28 -3 6 6 -9 3 14 -17 -24 4 0 -1 -3 5 -13 -23 7 5 -9 -16 21 8 -1 -4 -10 -14 16 -4 13 -30 -1 9 7 20 -9
5433 -9 3 -1 2 -24 6 3 3 11 3 12 -2 -7 -13 1 0 2 -1 9 1 -13 22 -6 -1 -16 -8 -17 3 3 -7 1 -10 -25 -5 -36 -26 -15 -13 -21 10 -14 -2
5474 -2 -13 6 -9 -8 17 12 -19 2 -11 -13 3 11 -20 16 18 3 3 2 25 -23 -3 -9 -9 -3 -10 -13 14 -19 -4 -6 -12 -3 -23 23 -11 8 -6 1 -40
$$ packed form
5213b3J9qJ3j8J8K1k4Mjk1lM5j6k1J9l4K6nj2K6l2J2ML4k8J6j2k8N8m8pK2k2J5
5247a1Rj2jj2J9jRJ2k6Q%jJ3Kk0J7k0K6j3RK8k1j0j7MmqJ1L6o7N1Ok5Mkk3K3j3
5285b0L1l1J9PQk2K4j4k5K0k0M1%m1J0J0k0N0j5NrJ5k8j1OMj0%J2L6j7k6J3MJ3
5320A9l0L6l2J2j4k4K2pM3qOll1KKlkjOj2J1%%J4j5qL1jk0Qk9L0j7K2J1k1K1j8
5358@Lj5J8J7k2j0nNL4j8J0qoqJ7j4j3k9L4K1p4O5l1L1J3j5j3J5qKk5L5mpOQ%
5395Ij4K0rl4K5R%j5J2J1l1pK8mjkQj8j0L0kj4pL7j3rlomL0k0J7m3K9J0kJ3k9
5433iJ2mLk6L0l%QqRj4noJ4jKlJ0qj4L5k8Nj5QrK0%j0Qj1j5K0l1J0J1KqL1k4J2
5474bj1J9j5JK5nl1K1j3kJ6Ql1L6Kj5%jK3m8K0o%OplK7l3J5koRk0M6l4J9j4Pm1
$$ plain form
5513 -40 4 1 -4 -13 -14 -35 -6 -4 -10 8 -27 2 27 3 -2 18 -8 -18 23 -4 -30 -14 14 -9 7 14 9 -25 8 -6 11 -2 -7 -10 7 -19
5549 -19 -8 -28 -24 -18 -24 -5 6 -10 7 5 4 -2 4 -12 0 -28 -16 -15 -6 21 8 -22 -2 4 -15 14 -22 -25 0 14 -5 4 -12 -8 5 -10 -9
5586 -9 10 -8 -8 -3 -1 -10 -20 3 -5 -7 -13 -16 1 -12 2 11 0 4 3 -24 -21 10 -1 1 -28 -19 19 -19 11 -3 2 4 1 -9 2 0 -17 1 -10 -14
5626 -14 4 1 -35 6 -10 -23 10 2 -6 9 -6 -14 -9 4 -3 -20 2 -7 -1 35 -9 15 11 -5 8 9 -4 -3 -19 30 8 0 -34 -17 -8 -17 -20 2
5664 2 -21 -13 -4 -15 -9 12 4 -17 3 -34 -17 -13 -5 -8 -3 -10 -14 -30 -27 -24 -20 -3 -7 1 -16 17 24 -22 -9 -3 2 -13 12 10 -14 22 -4 13 13 -7 -7
5705 -7 -24 10 -27 18 -7 12 14 -12 -13 -9 -17 6 21 23 20 22 -15 -15 -4 -18 8 13 7 -15 -23 -18 22 -9 11 23 4 -18 16 5 9 -28 2
5742 2 11 -2 -6 2 7 -5 -5 7 4 20 29 1 -12 8 8 22 24 3 -2 -27 -15 8 -22 -1 10 23 3 8 -7 8 -4 -5 -4 -16 -6 -24 18
5779 18 0 2 7 -4 5 -6 12 -2 -11 12 -11 -19 30 3 13 17 1 16 10 12 11 9 11 -4 -24 -1 20 -4 5 4 -11 -36 -7 -2 -25 12 -5
$$ packed form
5513d0M4lnrjk1K9KoJ8l5K9K5k4nK0k6j0M1k7k6J6K8k3J6Pnl4L3j4J7j3nlJ7k6
5549a9J1k0MOoJ9J1j6J7kjoOj6J2k8J2JRK7j3l0K0Oj9K9l6lK5J4j9Rj6MJ3j5J
5586iJ9j8%NKrj0K3qkolJ7j3J4Rj1Mjk7LL1j1Kk9RL8l8L0j4NKlj0J1kj7J8j1m
5626a4J8ll6M1j6j3L3qqJ5j5qNJ3pj7K2rOL6m4K4mj6J3Jj3Jj6M9k2ql4J7RrlK2
5664Bk3QRj1OK1qk1K0l7J7MQlNpmj6LLMJ7mQj7L3Pm6J3ONj5K5kk4L6k6J7%k0%
5705gj7L4l7M5k5J9Kk6jMqK3J5KlKl7%J1j4K6Nok2qNM0l1K0J2j9k2L4j1Ml7L0
5742BRj3mQNj2%J2lJ6Rk8j3K0%J4Kk1nk5J2K3l0K1J1J3k0Nj5J5j2jJj2J0j8M2
5779A8j8KNj1Rj1J8j4rK3k3qM9k7J0Mj6J5oKjkKj5k0K3K1k4Rjj5k5K9Nk3L7j7
$$ plain form
5816 -5 15 10 4 -11 20 11 -11 5 16 -20 -5 7 10 12 11 -7 16 -15 -19 -5 -10 -4 10 -9 2 11 -5 0 -14 -2 10 -14 -10 4 -16 2 -10
5853 -10 25 -3 11 11 3 10 4 -12 -8 3 -1 12 7 5 16 -4 13 18 26 21 2 28 7 2 -2 6 0 -38 -1 5 -10 -10 -10 21 -13 6 1 9 22 -3
5893 -3 3 -15 5 -28 -24 9 -15 4 -13 13 -18 12 10 19 18 12 14 13 1 7 16 17 12 17 -2 11 7 6 7 15 3 -5 5 -1 -16 -20 14 1 -24 -19 3
5934 3 -12 -16 7 -19 7 -19 9 5 -14 13 -6 -6 -11 -9 -23 13 19 0 4 20 -19 12 25 5 13 1 5 8 5 39 11 -2 -14 -9 20 12 3 -12
5972 -12 13 -4 -26 19 -25 9 -25 -26 -1 7 1 -13 -5 5 -7 11 9 -10 14 -3 3 7 23 11 18 -24 1 6 -3 10 -5 6 7 -7 10 -11
6008 -11 -1 8 20 -6 -20 -1 -6 -6 -7 17 -9 4 12 0 -4 30 3 -7 -11 -2 8 19 20 -20 9 -5 4 23 4 6 -2 0 -16 20 10 5 4 -4
6046 -4 26 0 36 18 15 -3 2 16 1 18 17 7 24 -19 5 32 -3 -25 -24 3 -31 -3 9 -1 3 -28 -1 -2 -3 7 33 1 -7 4 -14
6081 -14 -7 -6 6 3 14 27 -8 -8 6 -5 5 20 1 20 -7 0 21 32 9 20 17 -18 -3 -12 -6 6 0 25 2 0 -13 9 9 -14 0 -35
$$ packed form
5816eK0noj5L1rk2J6J1l6J5J2LKjj8K3l1mJ4nOJ4j9J1Rj6Nj4J2J2k4MJ4k0J8j2
5853a0L5k8J4%qPoj6MJ1mJ3nkJ1k0J7NQnj9K6k1nmQol8L7Oj5%%L1l4J9nQJ3k5
5893cOj8K0l3ML3k4J9j7K6l1L0kRjoKjj2ORJnNj9J3mjJQj2qJ0oj5mL4j3k5NK2
5934Cj5mK3k6K6k6K8mj9K7j9%nKj4L6Oj9MJ6l9L1J3k0Qj2MLlL4k8j3j2NK9qrj5
5972a2K5j7k2M5m4L4l4jK5Qoj4QJ0j2J8kj9K4j7OMJ6j2Pm2K5NrJ3j5J1Jj4J7k1
6008a1J0RJ2k6j4J9n%jK4k6J3Qj2mL4k7j0mRJ0J1Jm0K9j4RJ9j9KqKj6L6j0njq
6046dL0k6L6j8lj8NJ4j5J7jj0J7m3K4K7l5k2JK7l4K8J2j0Ml1K7jjJ0K6l2qJ1j8
6081a4PJJ2lJ1J3l5%J4j1J0J5j9J9k7PK1J1k3J1ll5J5rOJ2oK5k3kj3K2%k3J4l5
$$ plain form
6117 -35 -2 20 -4 36 -13 0 -5 -2 2 -16 -16 -8 25 0 39 17 -20 26 34 -9 -7 -11 14 -15 -31 -7 7 -10 32 1 3 14 -49 -11 -23
6152 -23 0 -3 -27 6 -25 7 -17 -10 1 -33 -13 11 -17 0 5 -19 11 -2 -25 -9 -32 6 -13 36 10 -22 4 -3 -24 -6 -5 -15 -11
6185 -11 10 33 1 16 28 1 -43 -10 8 3 18 -12 12 -1 -4 -25 25 -12 -9 0 1 -12 -4 -8 15 6 7 10 6 1 1 -9 3 15 22 2 -9
6222 -9 -12 1 -12 -4 10 -26 -4 9 -16 -12 15 -7 -34 -14 2 -25 -1 3 -30 -3 -17 -1 -14 0 -3 -28 -11 28 2 6 9 21 13 -4 26
6257 26 14 -15 7 11 1 4 23 -2 -1 19 5 6 26 8 -19 -29 0 -14 -15 2 -2 23 -15 -24 -24 -11 -25 -25 -9 -31 -24 13 -26 -10 8
6292 8 -11 -17 -7 -12 -17 -23 -21 1 -1 3 2 7 -11 6 33 -8 -4 8 15 -26 1 -8 3 -4 -17 -7 10 -13 -19 -11 11 13 -2 -5 -24 8 -24 -12 0
6331 0 8 10 -8 -5 -15 -31 -10 3 -6 -3 13 19 7 -32 12 -11 12 -3 -17 -18 -32 0 4 -8 7 -13 3 -22 -24 -29 19 -1 -22 -11 -2 4 -2
6368 -2 -6 6 -27 -21 -3 -24 -12 7 -22 9 28 -12 4 14 -14 9 0 4 -14 2 2 1 4 10 11 -14 6 8 16 11 11 5 -7 -14 20 12 19 2 3 -17
$$ packed form
6117c5L3K2k4M0m9J3nLMj8%QL3k5L9k2l7M6Qm3KmK5k9j6K4J4j7M2l1KJ1o3L8j2
6152b3K3lk4L3l1L2k4PJ1l4K0K4k8J7Nk4L0j3k3J6k3L8j9M9k6l2K6pk1J8Jj0M
6185a1K1K3l2J5J2k7m4L3J8nJ5l0K4j3lk1N0l7LRJj3QmK3rJLmn%j0J2J2Pk0j1
6222ilJ3j3QJ4l6K2J3k5MK7k2k7K0J6k7K4Ml3K7j4J6j3J4lk5J7L9k6MLJ2qj7L0
6257B6j2k9K2Mj0LJ9k5JK0j4JK0j8k7j0K9j4jJ7mK5l8r%J3j4%J6k2PL7l9J6J8
6292Hj9oJ0nnoKK2kMjNj8J7K7m1MJ2Pm1K7rJ1pj3J0J7k3oQK2Kj5lj9L2l2J2J2
6331@QKj8Lj0j6K1J3rLJ6Oj2l9M4k3K3j5j4jj4L2Mj2J5k0J6k5knM8k0k1J1ROo
6368bmJ2l3OJ8k1J2J9k9L1J9m0J6J0k8K3rMj8J6%jLOJk5K0KQn%oj2pL4qPj7Jk0
$$ plain form
6408 -17 -19 -8 13 -14 -8 -26 11 -32 -1 -21 -28 -17 -5 6 -12 4 -20 2 3 -1 13 -4 11 6 -1 -7 1 -11 26 -13 17 0 11 4 9 2
6444 2 -20 -3 20 -31 -14 -30 -14 -9 10 -3 -15 -32 -21 -10 -26 -18 -23 -7 14 2 30 6 -5 8 -1 -9 -36 -6 12 0 12 -2 33
6477 33 9 -8 7 25 -30 -6 -4 -13 -5 -8 -14 -12 -17 -36 -5 1 19 1 -29 6 -17 9 1 -30 -28 28 -12 -19 18 -13 -21 -4 9 12 -15 -26 12
6514 12 8 -13 8 29 5 5 0 13 -24 -6 5 17 -16 9 -14 2 -13 -4 18 5 10 20 -12 -17 12 -15 14 -4 -3 -6 -10 6 -14 -5 0 5
6550 5 -18 -11 -16 -10 -4 8 -4 11 -18 0 11 0 -1 -6 -1 -5 5 11 -8 -2 -25 0 7 -10 18 7 -18 -10 10 -26 19 1 -7 -10 -9 2 -25 -2
6588 -2 -17 15 17 -2 -10 -22 -6 3 -20 -5 2 8 -8 -5 27 3 2 -9 2 5 -3 1 22 -24 -3 -2 -4 -18 -3 -5 -6 -4 -20 0 7 -10 -16 2 -31
6627 -31 -16 -4 -3 -16 1 -9 19 -16 -18 5 16 -28 2 10 9 16 6 10 5 -7 12 -7 11 16 0 26 -19 -1 7 -9 -29 -10 5 -16 -26
6662 -26 -3 -14 -11 12 -3 10 7 -30 -6 -17 5 -10 -2 -1 -4 -3 4 -11 -27 -26 -4 -2 -1 -9 -20 -3 19 -2 1 6 -15 15 24 -10 -3 -19 -5 13
$$ packed form
6408a7kJ1K1k7Oj8L7m3L1k0pJ1J2J1j8J6k4K2JmJ4j7J5npoQj2L7l9L0j7J1pNp
6444Bk2J7K3n1J7j6J6NJ9j3j2j7J1J1j6QnJ6K1j2K8k4j1J3rqk7L0J8j2J2j4L5
6477C3k4j7J5J8n5K4KrQloKnj9L1OJ8j8l0L5k3K6ql1KN6m0pL7l1qJ7J3Lk7j1L8
6514A2mk1K1K1k4%nJ3l7J8J1J2l3K5k3J6j5RK2j3NJ0l2nK9k7K9j8JlmJ6k0RNN
6550Ek3PnOOJ2j2J5k9J8J1j1jnNmJ0Oj9Ok3K5Pj7K8j1k5QK0l6M5j8qlJJ1k7K3
6588bj5L2Kj9qj2J6Rk3J5POj6LL2k4jj1J1LqMK1m6K1Jkj4J5kjKj6K0Pj7oJ8l3
6627c1J5J2Jj3J7j0K8l5kK3J1m4L0QjPj0Mnj2J9j9J8Nj6K6m5J8Qj6k0J9J5k1j0
6662b6K3j1LK3j5J3ll7K4j1K2j5QJlJPj5j6JK2KJqj1J7K2k1LNk1L0Rl4Pj6J4J8
$$ plain form
6700 13 -5 11 -1 -4 -3 28 -1 -23 17 -9 16 -11 5 -1 7 0 -3 -37 -24 10 -9 24 1 14 8 6 6 -3 0 -24 5 0 13 -5 5 14 13
6737 13 -1 -6 7 13 0 -12 13 14 21 15 -12 7 -7 -16 -6 27 -4 17 -28 -26 9 11 0 -13 -7 -10 -5 11 9 14 6 -23 -6 -4 15 13 -19 16
6775 16 11 37 17 13 18 -15 3 -19 -3 5 11 14 5 16 -5 33 0 2 9 -16 -2 -20 11 21 7 -8 -8 6 -23 -32 36 -19 -7 -16 22 -4
6811 -4 22 14 0 20 9 23 5 -26 -2 5 -9 14 -6 6 3 1 12 7 4 13 18 -18 -5 14 5 8 -22 16 -17 -18 -3 -4 -13 -2 -35 1 -2 -13
6849 -13 -11 -5 -1 -26 -13 19 -9 2 9 6 9 -2 0 10 19 -18 19 -28 0 9 -8 17 9 -11 -29 4 -11 4 30 -14 8 -7 19 -37 -29 -2
6885 -2 0 -42 6 -10 -2 -8 -25 7 -37 6 19 27 -17 -2 6 14 8 8 -1 -4 -33 -17 14 10 8 21 -14 -23 6 32 -16 -17 10 -23 -13 -18 2 -28
6923 -28 22 14 4 3 3 -5 7 -10 -7 -1 14 10 11 10 -24 15 17 -2 7 0 0 -9 11 21 -1 7 -17 9 6 13 8 -2 -4 -14 -17 16 1 8 16 0 -5 4
6965 4 -17 3 -5 12 4 -1 -15 1 -11 7 4 -29 7 -11 -8 -4 5 11 -5 -2 -3 -13 -13 -14 3 -3 15 8 -2 2 -16 -3 5 6 -8 -2 3 9 6 -9 17
$$ packed form
6700A3j8J6j2lJL1k9k2M0k6K5k7J6oQpll4J3L4j9L3k3J3ok%rLk4K9nJ3j8J0Rj
6737A3j4nJ3Oj3j2K5JPok7J9j4rJ0L3l1K1m5KL5Kj1j3OlNJ6kNqk9J7KJ9kl2L5
6775A6nK6k0mNl3J8k2J6QOLrJ1k1L8l3KPk5J4j8L1J0j4j5%J4k9rO8n5J2rL8k6
6811dK6qj4K0j1J4j8l1K4Pj4K3k0J2lkJ1nlRNl6J3J9rLl0L8l3jJ5jrJ1l3L6lj1
6849a3KOMk5J3L2k8J1PlLj1KJ0Rl7L7m7K8Rj7K5qk0j8L3j5J5K6m4K2j5K6n6QK7
6885bKm2M8j6Qoj7L2m4M3J3Qm4J5QQo%rlk9J6L1mkJ3l5rK9K6m8jK7l3J0nK0l0
6923b8N0qj0j%qJ2j7LOJ5mJjl4L9Kj9Rp%rK0J0k2Qk4K6lPnj0kj0lL3j5PQj6nR
6965Dk1K0qJ7qnj4J6j2J8ll3L6j8LMROj6Ljj0%jJ7oJ8pj0Mj8J3QJj4ONOlj5K6
$$ plain form
7006 17 0 -10 -14 18 4 4 -7 3 0 -32 -36 -32 -25 -1 -14 4 -28 -7 -5 3 -5 -2 26 12 10 5 -8 -4 15 -18 -29 21 11 2 2 -2 8 -2
7044 -2 8 26 1 -1 16 -12 -3 13 -2 -6 -4 17 -20 -15 4 -9 -16 -8 3 -17 1 -6 -20 -3 -3 -29 7 -17 -30 14 5 8 10 -12 7 27 20
7081 20 9 15 -7 10 -2 17 15 3 12 10 6 -7 -6 2 30 0 -4 -10 -20 -6 -19 -7 -13 -18 11 -9 -27 -12 6 6 -10 -7 30 -13 8 2 -7 4
7119 4 34 -8 -19 10 -6 -15 19 -14 -4 17 30 15 -11 -1 14 23 3 9 9 16 4 -37 -31 -1 12 4 2 -21 -7 -1 15 17 13 13 15 -12 39
7156 39 2 -2 -5 6 10 -12 4 6 5 3 16 -5 9 9 -15 -12 17 9 -13 -20 8 2 -7 -10 13 5 -12 -14 -23 -13 9 -24 -23 -7 -15 18 -5 2 -39 54
7196 54 -3 2 -14 -2 -1 -9 -5 -16 18 -18 -20 -6 -15 21 6 -7 9 -6 -36 -1 22 14 -21 -2 2 -3 5 11 -6 -13 7 -20 5 6 32 -10 14
7233 14 -2 -26 -15 11 8 6 -21 -13 10 -10 2 -4 -16 15 16 29 -3 2 -17 6 3 9 15 5 7 24 41 10 9 -2 -6 5 -32 -6 12 18 -24
7270 -24 -11 -18 -2 3 -14 11 3 -12 2 -3 2 -2 1 -3 -1 -6 2 -17 20 16 -11 17 3 12 5 -24 15 -7 17 2 11 -20 17 -1 -3 19 -2 -1 12
$$ packed form
7006A7j7j0mL2j4%j1J0ll2mMPK4j3J8l2K1KQqLK8j4knj3MJ9l3j1N0j0r%mJ0j0
7044bJ0J8k5kJ7k8RJ6j5mKK1l7NJ9j3pQJ1k0J8pj4J7%k6L6k4j3M4rLKk2J9K0p
7081B0j1Ok2J7j2J9kj2Rkmj3JQK8l0moj0J4j3J2onK9k0j8J5J8%j6LL7m3K1orJ1
7119DL0m2j1K9j6rL4l3J0K1J3j5k6J0J5Rk0O%Pj2m1OL0J3qkk3J4OJ6Km%Kk7N1
7156C9l7mlJ1Mk2J6KjkJ3k1J4%k4LK9qk2pK8orlK3qj7krJ0K2l3JJ6qL3k3Pm1R3
7196E4n7Nj6J2JqMj1L4l6kJ4rL6j5j3J6j5l0L5K3ql5J9MnQOj7pK0k7K5JK6m2K4
7233A4j6k4J1K6lkk7QK3k0J2oj2L1JJ3l2Nj9K3lOOj0KJ7J7l1jj1mJ1l7K6J8Om2
7270b4J3pJ6Nj7K5qj5J4nNmLmKnQj9L7mk7K8j4Rpk9L9k2K4j5Rl1L7j8kK2k1JJ3
$$ plain form
7309 12 3 28 -24 -8 -10 -12 -18 -36 -7 34 9 -9 -8 16 -15 -33 -25 14 2 -21 -20 -13 2 15 14 0 17 36 -11 14 22 6 -1 1 12 15 0
7346 0 -7 18 -4 4 19 3 -20 -7 18 27 7 -15 -5 -16 -20 -24 17 -16 -15 21 -8 -23 -3 -10 -4 7 7 31 -8 17 -6 -13 24 -22 17 -6
7382 -6 -1 1 10 10 11 8 11 -8 10 17 11 -17 -10 -3 7 -4 -2 -11 6 -10 25 -15 -31 -19 0 7 -26 -12 -19 -6 -15 -16 1 9 -8 14 -23 -1 11 -7
7422 -7 -1 -10 -4 11 2 4 -17 22 -3 13 -1 7 16 -15 13 -8 -17 -2 -7 -16 -29 -3 8 -5 -14 2 -3 8 -1 -3 -21 1 -1 4 -10 -25 -20 -29 5 -21
7462 -21 -16 28 3 2 20 -6 -9 11 -1 16 8 -4 18 3 30 -7 -18 -13 2 8 12 11 7 -26 -6 -13 -11 -24 -8 -3 -6 9 -13 -2 10 9 2 7
7500 7 12 28 -1 19 -5 -4 -3 -20 -29 2 9 7 -3 -13 3 18 -17 -6 4 7 38 13 12 1 -2 -9 4 16 6 18 -9 -8 -8 -1 -4 -25 -14 -16
7538 -16 -28 17 -1 -14 5 18 12 -8 11 -20 17 1 19 8 0 7 8 34 23 17 12 7 8 -2 21 27 2 9 -12 -1 3 -29 -4 9 0 -9 7
7575 7 -20 -2 0 -8 -3 5 10 -14 -7 7 -10 -5 24 -24 3 6 0 7 16 19 -3 12 40 31 -9 -7 4 28 -13 24 -10 25 6 -22 -20 4 25 12
$$ packed form
7309A2rK5n2J6kkoj8K9M1k5j8JK4l1j8QL9j2k3JPJ5J3jj4J7J9m7K5Qj6pKJ1Lj5
7346@pK5k2QJ5j6k3J3K5Rk0k2J0j1mmM1l3JL6k9j5K0pOJ1%K4l9K5k3pL7m6L9k3
7382fNKR%JlLj9J8Pok8PPJ0j1KrJ7j6L5m0j6J2J9Pl3J4pJ3rjJ7Qj7K2l7K2J2j8
7422gOrOJ5rKk1L9k5J6j4QRl1K8k1rJ5nrj3K6J1j3rJ6nJ1rkj8K2kNj4j5NrL4k6
7462b1NM4k5jJ8k6lK0j2J7qj2K2j5K7l7j1NJ5OMjml3K0pKj3J6NlJ5k2J1J2jpN
7500GNJ6k9K0k4JJj7rL1Pkj0j0J6J5l5J1J0LL1k5jj1lpJ3J2j0J2k7J%Plk1J1k
7538a6j2M5j8j3J9J3ok0J9l1L7j6J8j1qPJK6j1onnJj0K3Ok5Pk1J1Ml2K5J3rrJ6
7575Gk7J8KqNQNk4PJ4j7NK9m8K7LoPRLk2J5K8rm0KJ1K4m1L7l4L5j9k8KK4K1j3
$$ plain form
7613 12 20 -8 0 4 -2 -21 -13 -15 -13 -33 -21 -10 -3 -18 7 3 33 -47 13 -2 -8 1 -2 18 -9 -7 -2 -15 14 19 19 -7 10 -4 6 -7 -19 -13 0
7652 0 -8 -14 -1 -17 7 -7 7 1 -36 -11 -27 -11 1 1 -1 -6 -4 -10 15 -20 -15 -3 -18 14 -9 -6 -19 -11 3 18 -8 -4 6 1 19 10 24 -9
7690 -9 -6 -17 15 2 15 31 14 5 -3 -3 0 6 -18 -2 3 2 8 -5 -11 -15 11 -5 -20 0 -23 -9 5 -10 0 28 40 5 21 6 10 5 27
7727 27 19 15 9 24 19 5 9 4 5 -2 -4 16 -1 5 -1 -10 3 -1 1 39 -16 1 -9 -12 3 -1 20 -25 10 2 -15 -17 9 10 22 1 29 7 4 8 6
7768 6 21 -1 6 -14 12 27 -10 14 23 -20 -14 3 -6 -27 5 13 -23 -14 -1 31 17 -24 -9 5 -2 -21 14 -9 -17 -4 1 -24 22 1 -2 12
7804 12 -4 6 2 29 28 12 14 0 -2 21 12 -16 -8 8 13 -6 16 30 20 9 30 10 52 22 -2 15 6 -9 -41 -34 -28 10 29 -5 -21
7839 -21 22 32 6 11 -22 -9 -1 -9 5 -35 13 -14 -9 -13 12 8 7 -4 9 18 10 13 3 -6 -37 -13 -1 -3 13 1 -8 -35 21 -14 -3 -25 -16
7876 -16 6 -24 -1 16 -7 0 -7 -10 3 -1 8 15 9 13 21 8 -6 3 -13 11 0 -30 24 17 12 1 9 9 -2 -5 -5 25 -3 2 11 12 -11 -4 6 -13
$$ packed form
7613A2Qk8QMoj9QkKk0J2J1Pj5K5mL0q0O0j5oRlK0k7KNj3K9N%k6J7j4J0j3j2OJ3
7652@qoJ3j6K4j4J4ol7K5j6J6J2%knKoK5l5NJ2j5L2k3Lj3QJ4J5k6MJ0nJ8rJ4l3
7690iLj1L2j3J3J6j7rq%LOk4J6NjOj3omK6j6j5K0k3J4J4j5J0K8J2l5J6j5MnK2
7727B7qmoJ5nj4MnJpkK0j7OorJ3mKL8n5J7j0lJ5mK1m5L5qj7kK6JJ2k1K8k2lMk
7768FJ5k2Pk0K6J5l7K4Rm3OJ7rk1L2Ql6RJ3L2j4m1J5J4pj9L5k3qJ3Nk5M6k1lJ4
7804A2j6J0mK7jj6Kj4kK3rk8QJ6Nj9K2J4j0j1K1k0M2l0k4J7rj5l2POL8J9l4j6
7839b1M3J0k6Nl3J3QqJ4m0M8k7NmK5mjj1J3RqLj0rl1K4J2kJ6j2rk7N6l5J1k2R
7876a6K2l0K3J7k3PplJ3mRPoMQj3j4Rj6K4j1l0N4pnj1Q%j1l%L0k8NRJk3PJ0j9
$$ plain form
7916 -13 9 -21 -11 7 -7 2 -15 2 23 -4 0 -6 -20 -10 -22 19 4 -7 4 15 19 -17 -15 10 -10 -1 17 1 27 39 16 10 -6 19
7950 19 -10 -2 -1 19 3 6 39 -14 -25 -2 6 -3 -15 -6 2 -10 -2 -19 18 -21 -4 -12 -19 -13 18 -13 -5 20 -4 -7 11 1 -5 22 35 13 7 17
7988 17 -18 4 28 27 -9 20 2 2 3 3 -3 5 15 -3 -25 3 -16 -13 -22 21 -9 -3 -2 -4 4 -5 2 5 -18 0 6 5 15 -7 10 0 28 22 22 34
8028 34 -2 -4 4 8 8 6 -9 11 0 21 11 -9 1 13 -1 -24 14 5 13 9 -22 -7 25 -4 -4 0 -11 -1 5 4 -18 11 -8 -4 -8 4 9 18
8066 18 29 -10 12 26 -17 3 11 19 -17 -17 -8 18 10 -5 14 -11 -2 -10 -3 26 -16 0 7 10 -2 2 -12 -3 -9 -6 10 3 13 -36 1 -15 -4 -12
8104 -12 -32 -10 4 10 9 14 -5 44 -4 -14 14 35 -13 8 29 41 12 -5 12 -1 20 23 -29 14 3 37 21 -5 -19 -1 -10 33 -12
8137 -12 -9 5 0 -6 -5 -12 -31 -25 7 3 4 1 -15 47 -10 26 -4 0 18 -14 -3 30 4 10 23 4 16 1 2 20 -5 19 3 -4 -14 -11 5
8174 5 9 -10 15 10 -10 11 -20 19 -12 6 -1 0 5 13 9 -10 -24
$$ packed form
7916a3K2l0J0J8j4Rj7J7K1k7Moj4J0j2M1j5j1J1J1Ml6KK5k0RJ8j6K6J2k3oj6K5
7950A9k9QJK0j6LL3n3j1K3Qrj2RQj2Qj7L7l9J7qpOL1l1QK5k4lJ8j0oK7J3k2oJ0
7988A7l5K2K4jl6K9j8%J%oQJ0j8k2K8j9LrM3l0OJkQrPLk3J8OjJ0k2J7j0K8o%J2
8028C4l6kQM%kj5K0j1K1j0k0J0J2j4k3L8rQml1J5L2k9%Mj1J0Ojk2K9j9MmJ2NR
8066A8J1l9K2J4m3K0QQl6%RK6qj5J9k5RqPK9m2J6PLj2Mj4RoLJ6pJ0m9L7j6J1q
8104a2k0K2J4OjNj9M9m8j0K8K1m8K1K1J2k9j7J7j3K1Ln2M3j1L4j6k6j4J8rM3m5
8137a2LJ4noJpj9OL2mJlj6O2n7L6l0MJ8l2J1L3k6OJ3j9J2j5JJ8k5K4j6pj0LJ6
8174EMj9K5nk0K1l1L9l1J8pJNQmj9j4
8191b4
##END NTUPLES=NMR FID
##END=
