##TITLE=1H_ES-Me-valorete new
 CDCl3
 8 sc, 
 2.10.2024
##JCAMPDX= 6.0         $$ Bruker NMR JCAMP-DX V2.0
##DATA TYPE= NMR FID
##DATA CLASS= NTUPLES
##ORIGIN= UXNMR, Bruker Analytische Messtechnik GmbH
##OWNER= root
$$ XWIN-NMR		Version 3.5
$$ Wed Oct  2 14:20:52 2024 Russian Standard Time (UT+4h)  she@DPX200
##.OBSERVE FREQUENCY= 200.1318
##.OBSERVE NUCLEUS= ^1H
##.DELAY= (6, 6)
##.ACQUISITION MODE= SIMULTANEOUS
##.ACQUISITION SCHEME= undefined
##.AVERAGES= 8
##.DIGITISER RES= 18
##SPECTROMETER/DATA SYSTEM= spect
##.PULSE SEQUENCE= zg30
##.SOLVENT NAME= DMSO
##.SHIFT REFERENCE= (INTERNAL, DMSO, 0, 15.7039)
##AUDIT TRAIL= $$ (NUMBER, WHEN, WHO, WHERE, WHAT)
$$ ##TITLE= Audit trail, XWIN-NMR		Version 3.5
$$ ##JCAMPDX= 5.01
$$ ##ORIGIN= Bruker BioSpin GmbH
$$ ##OWNER= she
$$ F:/spectra/data/she/nmr/H-F/1/audita.txt
$$ ##AUDIT TRAIL=  $$ (NUMBER, WHEN, WHO, WHERE, WHAT)
(   1,<2024-10-02 14:19:42.48 +0400>,<she>,<DPX200>,
      <created by zg, POWCHK disabled, PULCHK disabled
       configuration hash MD5:
       00 E9 B6 7A A2 85 ED C7 34 08 36 98 17 FE 4E 26
       data hash MD5: 16K
       27 5A B9 EC A5 22 6E 16 4C A8 18 CC A1 7F CF A1>)
$$ ##END=
$$ 
$$ hash MD5
$$ 3E 4E F8 68 F7 6B 42 D7 64 71 78 4E 94 D0 7D 43
##$RELAX= 
##$RELAX= 
##$RELAX= 
##$RELAX= 
##$RELAX= 
##$RELAX= 
$$ Bruker specific parameters
$$ --------------------------
##$DU= <F:/spectra>
##$EXPNO= 1
##$NAME= <H-F>
##$PROCNO= 1
##$TYPE= <nmr>
##$USER= <she>
##$AMP= (0..31)
100 100 100 100 100 100 100 100 100 100 100 100 100 100 100 100 100 100 
100 100 100 100 100 100 100 100 100 100 100 100 100 100 
##$AQSEQ= 0
##$AQ_mod= 1
##$AUNM= <au_zg>
##$AUTOPOS= <>
##$BF1= 200.13
##$BF2= 200.13
##$BF3= 200.13
##$BF4= 200.13
##$BF5= 200.13
##$BF6= 200.13
##$BF7= 200.13
##$BF8= 200.13
##$BYTORDA= 1
##$CFDGTYP= 0
##$CFRGTYP= 5
##$CHEMSTR= <none>
##$CNST= (0..31)
1 1 145 1 1 1 1 1 1 1 1 1 1 1 1 1 1 1 1 1 1 1 1 1 1 1 1 1 1 1 1 1 
##$CPDPRG= <>
##$CPDPRG1= <>
##$CPDPRG2= <>
##$CPDPRG3= <>
##$CPDPRG4= <mlev>
##$CPDPRG5= <mlev>
##$CPDPRG6= <mlev>
##$CPDPRG7= <mlev>
##$CPDPRG8= <mlev>
##$CPDPRGB= <>
##$CPDPRGT= <>
##$D= (0..31)
0 1.2 0 0 0 0 0 0 0 0.06 0 0.03 0 0 0 0 0.0002 0 0 0 0 0 0 0 0 0 0 0 0 
0 0 0 
##$DATE= 1727864381
##$DBL= (0..7)
120 120 120 120 120 120 120 120 
##$DBP= (0..7)
150 150 150 150 150 150 150 150 
##$DBP07= 0
##$DBPNAM0= <>
##$DBPNAM1= <>
##$DBPNAM2= <>
##$DBPNAM3= <>
##$DBPNAM4= <>
##$DBPNAM5= <>
##$DBPNAM6= <>
##$DBPNAM7= <>
##$DBPOAL= (0..7)
0.5 0.5 0.5 0.5 0.5 0.5 0.5 0.5 
##$DBPOFFS= (0..7)
0 0 0 0 0 0 0 0 
##$DE= 6
##$DECBNUC= <off>
##$DECIM= 24
##$DECNUC= <off>
##$DECSTAT= 4
##$DIGMOD= 1
##$DIGTYP= 9
##$DL= (0..7)
0 120 120 120 120 120 120 120 
##$DP= (0..7)
150 150 150 150 150 150 150 150 
##$DP07= 0
##$DPNAME0= <>
##$DPNAME1= <>
##$DPNAME2= <>
##$DPNAME3= <>
##$DPNAME4= <>
##$DPNAME5= <>
##$DPNAME6= <>
##$DPNAME7= <>
##$DPOAL= (0..7)
0.5 0.5 0.5 0.5 0.5 0.5 0.5 0.5 
##$DPOFFS= (0..7)
0 0 0 0 0 0 0 0 
##$DQDMODE= 0
##$DR= 18
##$DS= 0
##$DSLIST= <SSSSSSSSSSSSSSS>
$$ [...]
##$SUBNAM2= <"">
##$SUBNAM3= <"">
##$SUBNAM4= <"">
##$SUBNAM5= <"">
##$SUBNAM6= <"">
##$SUBNAM7= <"">
##$SUBNAM8= <"">
##$SUBNAM9= <"">
##$SW= 24.0689170037331
##$SWIBOX= (0..15)
0 0 2 0 0 0 0 0 0 0 0 0 0 0 0 0 
##$SW_h= 4816.95568400771
##$TD= 16384
##$TD0= 1
##$TE= 0
##$TE2= 300
##$TE3= 300
##$TEG= 300
##$TL= (0..7)
0 120 120 120 120 120 120 120 
##$TP= (0..7)
150 150 150 150 150 150 150 150 
##$TP07= 0
##$TPNAME0= <>
##$TPNAME1= <>
##$TPNAME2= <>
##$TPNAME3= <>
##$TPNAME4= <>
##$TPNAME5= <>
##$TPNAME6= <>
##$TPNAME7= <>
##$TPOAL= (0..7)
0.5 0.5 0.5 0.5 0.5 0.5 0.5 0.5 
##$TPOFFS= (0..7)
0 0 0 0 0 0 0 0 
##$TUNHIN= 0
##$TUNHOUT= 0
##$TUNXOUT= 0
##$USERA1= <user>
##$USERA2= <user>
##$USERA3= <user>
##$USERA4= <user>
##$USERA5= <user>
##$V9= 5
##$VALIST= <valist>
##$VCLIST= <CCCCCCCCCCCCCCC>
##$VD= 0
##$VDLIST= <DDDDDDDDDDDDDDD>
##$VPLIST= <PPPPPPPPPPPPPPP>
##$VTLIST= <TTTTTTTTTTTTTTT>
##$WBST= 1024
##$WBSW= 4
##$XGAIN= (0..3)
0 0 0 0 
##$XL= 0
##$YL= 0
##$YMAX_a= 864978
##$YMIN_a= -720652
##$ZGOPTNS= <>
##$ZL1= 120
##$ZL2= 120
##$ZL3= 120
##$ZL4= 120
##$ABSF1= 10
##$ABSF2= 0
##$ABSG= 5
##$ABSL= 3
##$ALPHA= 0
##$AQORDER= 0
##$ASSFAC= 0
##$ASSFACI= 0
##$ASSFACX= 0
##$ASSWID= 0
##$AUNMP= <proc_1d>
##$AZFE= 0.1
##$AZFW= 0.1
##$BCFW= 1
##$BC_mod= 2
##$BYTORDP= 1
##$COROFFS= 0
##$CY= 11.3945322036743
##$DATMOD= 1
##$DC= 2
##$DFILT= <>
##$DTYPP= 0
##$F1P= 15.6554695791079
##$F2P= 12.8336369535428
##$FCOR= 0.5
##$FTSIZE= 0
##$FT_mod= 4
##$GAMMA= 1
##$GB= 0.15
##$INTBC= 1
##$INTSCL= 1
##$ISEN= 128
##$LB= 0.24
##$LEV0= 0
##$LPBIN= 0
##$MAXI= 10000
##$MC2= 0
##$MEAN= 0
##$ME_mod= 0
##$MI= 1.114404
##$NCOEF= 0
##$NC_proc= 0
##$NLEV= 6
##$NOISF1= 3.799351
##$NOISF2= 2.8
##$NSP= 1
##$NTH_PI= 0
##$NZP= 0
##$OFFSET= 15.70392
##$PC= 1
##$PHC0= -26164.44
##$PHC1= 21.78747
##$PH_mod= 1
##$PKNL= yes
##$PPARMOD= 0
##$PSCAL= 0
##$PSIGN= 0
##$REVERSE= no
##$SF= 200.130013532006
##$SI= 16384
##$SIGF1= 3
##$SIGF2= 2
##$SINO= 400
##$SIOLD= 16384
##$SREGLST= <1H.CDCl3>
##$SSB= 0
##$STSI= 0
##$STSR= 0
##$SW_p= 3612.71676300578
##$SYMM= 0
##$S_DEV= 0
##$TDeff= 0
##$TDoff= 0
##$TI= <>
##$TILT= no
##$TM1= 0
##$TM2= 0
##$TOPLEV= 0
##$USERP1= <user>
##$USERP2= <user>
##$USERP3= <user>
##$USERP4= <user>
##$USERP5= <user>
##$WDW= 1
##$XDIM= 8192
##$YMAX_p= 0
##$YMIN_p= 0
$$ End of Bruker specific parameters
$$ ---------------------------------
##NTUPLES= NMR FID
##VAR_NAME=  TIME,          FID/REAL,        FID/IMAG
##SYMBOL=    X,             R,               I
##VAR_TYPE=  INDEPENDENT,   DEPENDENT,       DEPENDENT
##VAR_FORM=  AFFN,          ASDF,            ASDF
##VAR_DIM=   8192,          8192,            8192
##UNITS=     SECONDS,       ARBITRARY UNITS, ARBITRARY UNITS
##FACTOR=    0.0002076,     1,               1
##FIRST=     0,             0,               0
##LAST=      1.7004516,     0,               0
##MIN=       0,             -720652,         0
##MAX=       1.7004516,     864978,          0
$$ Real data points
##PAGE= N=1
##DATA TABLE= (X++(R..R)), XYDATA
0@%%%%Qk4L2l2M0n6P3r7J26j51J82k27K77l30L94m70N51o41P49q74J009j156J325
$$ 0 0 0 0 0 8 -16 16 -16 24 -32 41 -56 70 -81 101 -126 151 -179 215 -255 296 -345 404 -470 539 -617 708
27G08j516J722j949K203k484K794l132L503l908M355m852N393n979O621p335Q125
$$ 708 -808 914 -1035 1168 -1316 1478 -1654 1849 -2059 2296 -2556 2837 -3142 3479 -3856 4269
43D269q994R955j1027J2228j3577J5114j6880J8921k1320K4190k7689L2070l7745
$$ 4269 -4725 5230 -5797 6431 -7146 7968 -8912 10009 -11311 12879 -14810 17260 -20485
56b0485M5415n6411P3665j05576K45435r02695M10138J044420j047909J79393
$$ -20485 24930 -31481 42184 -63392 182043 -720652 -310514 733906 -314003 -134610
66a34610M33917o01286L50575L92890q39944J80647N26960k66076m6675o8126
$$ -134610 299307 -301979 48596 441486 -398458 -217811 309149 43073 -3602 -71728
76g1728j51632N20279j15961o02790L43390M38863k96007k74850O9501L07481
$$ -71728 -223360 296919 180958 -421832 -78442 360421 64414 -210436 -140935 166546
86A66546m2905k93553J88723L0394j96670M10162j91437o06700P18364L37723
$$ 166546 123641 -169912 18811 49205 -147465 262697 71260 -535440 182924 520647
96E20647r15023J56934N77427l56883m5011P5903j91324L44636L380m08691K37585
$$ 520647 -394376 -237442 339985 -16898 -61909 13994 -177330 167306 170686 -238005 -420
107d20N4562j16075K88494l49986k07966P11223k00234o02107M50265J66879k32210
$$ -420 54142 -61933 226561 -123425 -331391 379832 179598 -422509 27756 194635 -37575
118c7575J01354k25321P1831M15874m19983j35980M36247k83525L8553L42647
$$ -37575 63779 -161542 -89711 326163 -93820 -229800 206447 -77078 -38525 304122
128C04122o18857P9260P88912n92696m46537P21474k2715l90200J87037m8775
$$ 304122 -314735 -235475 553437 -39259 -485796 235678 212963 -177237 9800 -38975
138c8975q036K32237k01307j52762J82296Q0631O70j86579j04340L49186M3763
$$ -38975 -47011 185226 -16081 -168843 13453 94084 94754 -91825 -196165 153021 196784
149A96784l54883J4335K00751R8949j09103k99854K24606L27965l91149p3443
$$ 196784 -158099 -143764 56987 155936 46833 -253021 -28415 299550 -91599 -165042
159a65042L08513k38916J01303K67467n54128O2593O74025m48600l92524N14889
$$ -165042 143471 -95445 5858 273325 -280803 -218210 455815 7215 -385309 129580
169A29580J9966k04234Q4143j72393J20413K80866l41673j06598K95803o9777
$$ 129580 149546 -54688 29455 -142938 -22525 258341 -83332 -189930 105873 36096
179C6096r540O882k40477K36254K51409l99604j01578L33266K5349j49829j20939
$$ 36096 26556 33438 -207039 29215 280624 -118980 -220558 112708 138057 -11772 -132711
190a32711O3243K48220j25070k19168J72416L5293m2999J09634k16587o0009L94583
$$ -132711 -69468 178752 53682 -165486 6930 42223 -776 108858 -107729 -167738 226845
201B26845j15469l52216K07015J77463j06155p4156p8052J24456J55213k09043
$$ 226845 111376 -240840 -33825 143638 37483 -36673 -114725 9731 164944 -44099
211d4099p6387J62581j9670K2963j4655j88992J59492J99901k53360r9210J88021
$$ -44099 -120486 42095 22425 45388 30733 -158259 1233 201134 -52226 -151436 36585
222C6585M6645l5702j25012m0455K40049j8900k34957J03253P8819o2539R3851
$$ 36585 83230 47528 -77484 -117939 122110 103210 -131747 -28494 50325 -12214 81637
233H1637j13969j33045K81632L5451l00324N8892J81474l0020o1881r4220M6070
$$ 81637 -32332 -165377 116255 151706 -148618 -89726 91748 61728 -153 -94373 -48303
244d8303J84021r7416j58240R9124O8103J810k5496j37665O8414K02507j25221
$$ -48303 135718 38302 -119938 -20814 47289 49099 23603 -114062 -45648 156859 31638
255C1638j73641J08872J26612j9187j34966o0720J82571O7309j88260l0902J06625
$$ 31638 -142003 -33131 93481 74294 -60672 -121392 61179 128488 -59772 -90674 15951
266A5951L3559J2738j08433q1188J98817O9881k20807l6002J58575N2361p6555
$$ 15951 49510 62248 -46185 -127373 71444 141325 -79482 -115484 43091 95452 18897
277A8897j23289M2427J82461n4598j72907N1188J09899J1639n8192j06715N7543
$$ 18897 -104392 -61965 120496 65898 -107009 -55821 54078 65717 7525 -99190 -41647
288d1647J68928q0303j67637P0664J33721j1906j18850n7547J33437R0525j39559
$$ -41647 127281 46978 -120659 -49995 83726 71820 -47030 -104577 28860 119385 -20174
299b0174q3333J01757P4815k8667r5965l5881J33468O1651j48025o2472J19227
$$ -20174 -103507 -1750 73065 44398 -51567 -87448 46020 107671 -40354 -102826 16401
310A6401P2471o7134j04378K7371J36559j0884j38834j908J07601L3719o8336
$$ 16401 88872 21738 -82640 -55269 81290 70406 -68428 -70336 37265 70984 2648
321B648q1849M4222J20235l4124j28516J8080J12494J6455r2038n9381P9537Q9980
$$ 2648 -79201 -34979 85256 51132 -77384 -59304 53190 69645 -22393 -81774 -2237 87743
333H7743o8086r9240M3182R5311l291r1733l8659R1219O8517q3669q3164O1072
$$ 87743 19657 -79583 -36401 58910 55619 -36114 -74773 16446 84963 1294 -81870 -20798
345b0798R0852k6277r8528r847J03151L8335r7320n9959P7795P9606m8997r7517
$$ -20798 70054 43777 -54751 -64598 38553 76888 -20432 -80391 -2596 77010 28013 -69504
357f9504J9202J09201Q211j09557l4151R7005N9948p5752q4676N0239J03838k2542
$$ -69504 -50302 58899 67110 -42447 -76598 20407 80355 4603 -80073 -29834 74004 51462
369E1462j13635o045J13250L5303j03335o3229Q5364Q6874o1373j04642L3185
$$ 51462 -62173 -68218 45032 80335 -23000 -86229 -865 86009 24636 -80006 -46821
380d6821J13805k522j13104k9049J03792O0140q7231q7696O6141J07509m1856
$$ -46821 66984 64462 -48642 -77691 26101 86241 -990 -88686 -22545 84964 43108
391D3108j16979J3610J15613J7785j05966m9592R1274P7123p1655r6007M6702
$$ 43108 -73871 -60261 55352 73137 -32829 -82421 8853 85976 14321 -81686 -34984
402c4984J05538j6434j08025j6402J04943M5903r5845o8021P8481Q2454n1702
$$ -34984 70554 54120 -53905 -70307 34636 80539 -15306 -83327 -4846 77608 25906
413B5906r1424J9250R7316J2541r8577l8490R0535N7890p1851p3750M5402Q7882
$$ 25906 -65518 -46268 51048 63589 -34988 -73478 17057 74947 3096 -70654 -25252 62630
425F2630j8093r6768m730R4823K4684p9547m6334N5879P0306l3242r0416J5618
$$ 62630 44537 -52231 -56961 37862 62546 -17001 -63335 -7456 62850 29608 -60808 -45190
437d5190R7039J423q7948k3893P0810N1734n5035p4385M1754Q1609k2850p5102
$$ -45190 51849 53272 -34676 -58569 12241 63975 8940 -65445 -23691 57918 35068 -40034
449d0034q710O6484M6380o4594p3929O4325Q1753n1266p5942J9615P2283J8770
$$ -40034 -48744 17740 64120 -474 -74403 -10078 71675 20409 -55533 -35918 36365 55135
461E5135p7162m5294P8162N3513n9260n7000K0688P2424J7946r7092l6167J09749
$$ 55135 -22027 -67321 10841 64354 5094 -51906 -31218 41206 59152 -37940 -74107 35642
473C5642L6280r3201l9831N4664O1205k0360q9594N699R8972J694p8631k5150
$$ 35642 71922 -21279 -61110 -6446 54759 34399 -55195 -49496 49476 51170 -27461 -52611
485e2611M7538O9975l3441j11426M0346J20368m3460r6812J7040P0224L2062o5484
$$ -52611 -5073 64902 31461 -79965 -39619 80749 37289 -59523 -42483 27741 59803 -5681
497e681o9876P3808P3510o1706n7712J3140N8723M6725r0129p6685J22753O4457
$$ -5681 -75557 -1749 71761 10055 -47657 -34517 24206 70931 -19198 -95883 26870 91327
509I1327j16215m1917O5798M8502r758q3356j2512J06084N569q3878j1741L2243
$$ 91327 -24888 -66805 -1007 47495 37737 -45619 -58131 47953 53522 -30356 -42097 -9854
521i854N6784N62j16122J0304J39269l5398j07878K6440N9330K5203m3078p5318
$$ -9854 46930 47492 -68630 -58326 80943 45545 -62333 -35893 23437 48640 5562 -69756
533f9756O1889P6029o7464l5096J8706R104O4710l8122j17551R6985J00499j19187
$$ -69756 -7867 68162 698 -34398 -15692 -6588 58122 20000 -97551 -566 99933 -19254
545a9254m4821P2112J6983M849m3931m5805Q3790L0914p6572o183J6594K5483
$$ -19254 -64075 8037 25020 29869 -14062 -59867 23923 54837 -21735 -27918 -11324 14159
557A4159M2455q4733m9324J25578J5889j06213p50N0933L4594k0667q0674L7290
$$ 14159 56614 -28119 -77443 48135 64024 -42189 -42939 7994 42588 21921 -58753 -21463
569b1463P8414n3033k0171R070l1471Q7563J3565j61013N9194J46669j04944o6590
$$ -21463 56951 3918 -16253 -7183 -38654 48909 62474 -98539 -39345 107324 2380 -64210
581f4210O4245Q260L1260k7120r0531Q4382O5746r2210n566J6852m084Q0860o0453
$$ -64210 35 8295 39555 12435 -78096 6286 72032 -20178 -25744 -8892 -12976 67884 7431
594G431j14449J31587P0913j30831k0808N9915L3318L080r1936J393J14743m2451
$$ 7431 -107018 24569 95482 -35349 -56157 3758 37076 40156 -51780 -50387 64356 21905
606B1905n6546L5900l3163N1598O3734j56090p795J85395o4905j21373O7251L8987
$$ 21905 -34641 1259 -31904 19694 83428 -72662 -80457 104938 40033 -81340 -14089 24898
618B4898O392j9102p8080N7348P8530p6509k6799K4559J930O1815m2191j02440
$$ 24898 31290 12188 -65892 -8544 69986 -6523 -33322 -8763 -6833 54982 12791 -89649
630h9649R8652P2292r6116l3298K9843N4542K3151j21625L196J44165p5218o2873
$$ -89649 9003 81295 -14821 -48119 -18276 36266 59417 -62208 -59012 85153 9935 -52938
642e2938Q9185o8300J0314J29304j56110o3343K18988n6125j45476J00291J5113
$$ -52938 36247 -32053 -21739 107565 -48545 -111888 107100 50975 -94501 5790 20903
653B0903k1708M4593r5317N410J32462q2490o2861Q0518k7902J1207M5540j06508
$$ 20903 -805 43788 -51529 -46119 86343 3853 -59008 21510 -6392 4815 50355 -56153
665e6153R593J26703n6821q5725M0347N9029P262q0360j4956R9555k8788n1999
$$ -56153 -46560 80143 23322 -62403 -22056 36973 44235 -36125 -51081 48474 19686 -32313
677c2313N4658m9320m32J16319j03375q6518J58130J940j07401L3868O559K5392
$$ -32313 22345 -26975 -27407 88912 -14463 -100981 57149 59089 -48312 -14444 -7885 17507
689A7507L7454j13232J1060J25188p6374m0252N9751n3590M4242O1511j39660
$$ 17507 54961 -58271 -47211 77977 1603 -38649 21102 -32488 11754 73265 -66395
700f6395J0617J38876o4353o2961K5742J3723O6214n2725j05209J26292M2834
$$ -66395 -55778 83098 18745 -44216 -18474 -4751 61463 8738 -96471 29821 72655
711G2655j26164N1677J8087o7735J15104k2470j60305J30789R5233j50517q179
$$ 72655 -53509 -1832 16255 -51480 63624 41154 -119151 11638 106871 -43646 -51825
722e1825P0343m709K2001n7798m1759J11514j116r0717K8409J9123P310K7590
$$ -51825 18518 13809 35810 -21988 -63747 47767 46651 -44066 -15657 3466 10776 38366
734C8366o9798j8483R1911j016o3725k3546M3099P8614p5785r2993J26826K9839
$$ 38366 -31432 -49915 41996 40980 -22745 -46291 -3192 75422 -363 -93356 33470 63309
746F3309j14423N4854J0559o6646J10916j8430j46149J17971P5038j27114J3738
$$ 63309 -51114 3740 14299 -52347 58569 40139 -106010 11961 86999 -40115 -26377
757b6377L4639j8794O4614o3088p4951J36649N44j14954O2959J4643l9332O9118
$$ -26377 8262 -10532 54082 -9006 -83957 52692 53236 -61718 1241 15884 -23448 45670
769D5670m6377p0284J04616J9332q5261K749K8407L6019q599q5378M2334P8865
$$ 45670 -707 -70991 33625 52957 -32304 -29555 -1148 34871 26272 -59106 -16772 62093
781F2093p1560j6073L8176l5965M3415K3814j01218K9550Q8722n3621l7510J3738
$$ 62093 -9467 -25540 12636 -23329 20086 43900 -57318 -27768 60954 7333 -30177 -16439
793a6439J7135M8062n1032o4480R0493K3236p3986J9638K652q049O0143m7691
$$ -16439 696 48758 -2274 -66754 23739 46975 -27011 -7373 -4721 -12770 47373 -318
805c18o2931Q2576K4983n4860j1207l655N2861K5691j06896J0443J07152n4794
$$ -318 -63249 19327 44310 -10550 -21757 -25412 27449 53140 -53756 -43313 63839 9045
817I045m1772M1752k9777L1229M2937j00090P01J04860l7103n4628J5130J3797
$$ 9045 -32727 9025 -20752 10477 53414 -46676 -45975 58885 21782 -32846 -17716 -3919
829c919M6553k6057q4128O6216O2845p4111j4973K6317j836L8205k7834o4605
$$ -3919 42634 16577 -67551 -1335 61510 -12601 -27574 -1257 -3093 35112 7278 -57327
841e7327O2337M5715n5387k5209J1083M1188K3098q0570j4562R5066j6037n9982
$$ -57327 5010 50725 -4662 -29871 -18788 22400 45498 -35072 -49634 45432 29395 -30587
853c0587K0967M370J7994K2407o6564p555P8924j4214m9480K735J6659L9653j6983
$$ -30587 -9620 -5250 12744 35151 -31413 -38968 39956 25742 -23738 -21003 -4344 35309 18326
866A8326p1377M2614O1423n2406k4176K1903J695K7777j4703n5009L9618M4502
$$ 18326 -53051 -10437 50986 -1420 -25596 -3693 -1998 25779 11076 -43933 -4315 40187
878D0187l8721k2809N544K4233K9382m9901l3967O7225J2256m9526J896P515J4091
$$ 40187 1466 -21343 -15799 8434 37816 -12085 -46052 21173 33429 -16097 -14201 -6686 7405
891G405K2772m5384k1550N7379O694l6696r521N583L7820M402o5450J0253O3160
$$ 7405 30177 -15207 -36757 20622 27316 -9380 -18901 -13318 24502 28904 -36546 -26293 36867
904C6867k2274l3119O682M993L0170k001n8021J7076N5849k1481l4660K97K1585
$$ 36867 14593 -18526 -11844 -6851 23319 21318 -36703 -19627 36222 14741 -19919 -19622 1963
917A963L1735k8463m8929M0266M2605l4718k8972R324K7547J7883l8424k9425
$$ 1963 33698 5235 -43694 -3428 39177 4459 -24513 -15189 12358 30241 -8183 -37608
929c7608M4045K7651l2319k9040J0410M1875M415n6146n325N5786L888l7861j4742
$$ -37608 6437 34088 1769 -27271 -16861 25014 29429 -26717 -32042 23744 27632 -10229 -24971
942b4971J7385L6605r183n4142J1913N3401j0235l8610o045K6155L0253k5248
$$ -24971 -7586 29019 19836 -34306 -22393 31008 20773 -17837 -23882 2273 32526 7278
954G278m6080K9473M5118k4303l5994N513L1699J6876l6130k9712L9903L0455
$$ 7278 -38802 -9329 35789 11486 -24508 -18995 12704 29580 -6550 -36262 3641 34096
966C4096l2125k8354J3940L2400M051m0888j3206M3575J5828l5104k0466K0227
$$ 34096 1971 -26383 -12443 19957 24008 -16880 -30086 13489 29317 -5787 -26253 -6026
978f026L0787q092m1069K514M3215J495l5669j0239K4696K3045j6910l3416J2036
$$ -6026 24761 16669 -24400 -21886 21329 22824 -12845 -23084 1612 24657 7747 -25669 -13633
991a3633L6072n146l2168o819K7879K0393k5885k9317K3472L0914j6065k8665
$$ -13633 22439 17293 -14875 -21694 6185 26578 693 -28624 -5152 25762 9697 -18968
1003a8968L024K7110J0847k6731k0755K4395K6177j7174k9690O409L3185L972
$$ -18968 -15944 11166 22013 -4718 -25473 -1078 25099 7925 -21765 -15356 17829 21801
1015B1801l5503j1733L3370J7667k6146k3568J6111K9729o000l3733l030L3459
$$ 21801 -13702 -25435 7935 25602 -544 -24112 -8001 21728 15728 -18005 -21035 12424
1027A2424J2473k9538k2978K4149L2295j8702l7873J2336L8555l275l5557q092
$$ 12424 24897 -4641 -27619 -3470 28825 10123 -27750 -15414 23141 19866 -15691 -23783
1039b3783L1156J9450k5756k8746J8741L4705r358l8488j179M0243J0984l8939
$$ -23783 7373 26823 1067 -27679 -8938 25767 16409 -22079 -23258 16985 27969 -10970
1051a0970j8780L3607K5213k4435l1148J3683L5677l289l7286o506L4738J6444
$$ -10970 -29750 3857 29070 4635 -26513 -12830 22847 19558 -17728 -24234 10504 26948
1063B6948k9159k6298K2632L4404j5962l8462Q618L7699P80l4173j1389K9272
$$ 26948 -2211 -28509 -5877 28527 12565 -25897 -17279 20420 21200 -12973 -24362 4910
1075D910K1004k3534k7399J5583L1054n231l3279n461L4773J3630l3646j8320
$$ 4910 25914 2380 -25019 -9436 21618 16387 -16892 -22353 12420 26050 -7596 -25916
1087b5916K7283K1588j6574k5717M971L0158M296l1890j0393K8050J6545k0226
$$ -25916 1367 22955 6381 -19336 -14365 15793 20089 -11801 -22194 5856 22401 2175
1099B175k4192J2281L1006o690l3253J848K9097N806k1581j6396J5408K6009j1450
$$ 2175 -22017 -9736 21270 14580 -18673 -16825 12272 18078 -3503 -19899 -4491 21518 10068
1112A0068l0055O307K8184L131k5076j5087K4159K3819k3797k5125J8497K1896
$$ 10068 -19987 -13680 14504 17635 -7441 -22528 1631 25450 1653 -23472 -4975 16921
1124A6921n727k0129j0114K2685K1337k5707k4956K2347K5141j1700k7622l72
$$ 16921 11194 -8935 -19049 3636 24973 -734 -25690 -3343 21798 10098 -17524 -17896
1136a7896L2979P177l4479q853K6650J2466j2582k2540Q72L4596L205l9516m079
$$ -17896 15083 22260 -12219 -21072 5578 18044 5462 -17078 -16206 18390 21595 -17921 -22000
1149b2000L3620J0353k3306k3383J7860L5182j8536l6460J6974K7034m828j7544
$$ -22000 11620 21973 -1333 -24716 -6856 28326 9790 -26670 -9696 17338 12510 -5034
1161e034j5285J6240L2410k1150l7429K1643L3767j1560l1643l213L5399J1733
$$ -5034 -20319 -4079 28331 7181 -30248 -8605 25162 13602 -18041 -21254 14145 25878
1173B5878l8071j1622L0317J0655j1884j8633m952L3031J0631m1292q324L5117
$$ 25878 -12193 -23815 6502 17157 5273 -13360 -18312 14719 25350 -15942 -24266 10851
1185A0851J0298k0531k3524J2071L8954j5893m1065K1636K5821j3720o180j0019
$$ 10851 21149 618 -22906 -10835 28119 12226 -28839 -7203 18618 4898 -1282 -11301
1197a1301p17L4703p746m3132J6523L4357j1179k3727n755K3842J8862l0675j6994
$$ -11301 -12018 22685 14939 -28193 -11670 22687 11508 -12219 -17974 5868 24730 -5945 -22939
1210b2939K8783P463j1466n718j1034J6593K2152k7728j9451K5096J6304j0228
$$ -22939 5844 13307 1841 -3877 -14911 1682 23834 -3894 -23345 1751 18055 7827
1222G827k4918l98L9927m701m2383J6255K3288j4585M287q217j7636L6335R498
$$ 7827 -17091 -17489 22438 17737 -24646 -8391 14897 312 4599 -3618 -21254 15081 24579
1235B4579m6757M232L4170k251j6076j7573J3016L5270k4443l2565L0024J3272
$$ 24579 -22178 -17946 16224 13973 -2103 -19676 -6660 28610 4167 -28398 1626 14898
1247A4898j4453J438j4824K913L5536j6812l5994K0115K7163n995k8182j0601
$$ 14898 445 1883 -12941 -10028 25508 8696 -27298 -7183 19980 13985 -14197 -24798
1259b4798M1377J1121m8812L061L3630j0923k082l076k1578K9985K2020m5240
$$ -24798 16579 27700 -21112 -18051 15579 4656 2574 -502 -22080 7905 29925 -15315
1271a5315r715L6263P928j6873k5033J0252M4095k1464m2497L1265J9624j8915
$$ -15315 -25030 11233 19161 2288 -22745 -12493 31602 10138 -32359 -1094 18530 -385
1283c85J750j1959j816L6243j3084l6637J8278K3133q46k1039k3176L9352K7433
$$ -385 1365 -10594 -12410 23833 10749 -25888 -7610 15523 14677 -6362 -29538 9814 37247
1296C7247n8052o038N0043j7052j3857J4446k3469J3796L4227l9973j9543L9387
$$ 37247 -20805 -26843 23200 6148 -7709 6737 -16732 -2936 31291 -8682 -28225 11162
1308A1162O248j6766j4884p82L6827l463m6697J8583L1785k0737o694K348n664
$$ 11162 17410 644 -14240 -15022 21805 18342 -28355 -9772 22013 1276 -5418 -3070 -8734
1321h734J9639J923k5846O60J8219J2480j7046l1956L2750L4483n0545j1873M4599
$$ -8734 10905 12828 -13018 -12358 5861 18341 1295 -30661 2089 36572 -13973 -25846 18753
1334A8753j4813j0122J7626k7278O674L8081l1259k0815K8016L395P11j1897k4511
$$ 18753 3940 -6182 11444 -15834 -9160 28921 -2338 -23153 4863 8258 8969 -2928 -27439
1347b7439M0423J9057n7603P155M2124k2657o051R148j9370J8911J8710l3002
$$ -27439 12984 32041 -25562 -18407 23717 1060 -4991 4157 -15213 3698 22408 -10594
1359a0594p555K3082J0959q059l1831J0710M7947k8834l8768L7775J1183j9901
$$ -10594 -18149 4933 15892 7833 -23998 -13288 34659 5825 -32943 4832 16015 -3886
1371c886P407j3351j589L4023j5190k9501J6972J6393K881j8248k4582L7483K5289
$$ -3886 3521 -9830 -11419 22604 7414 -22087 -5115 11278 14159 -4089 -28671 8812 34101
1384C4101n1799o812M1061o975j1914j233j0125K1711J0604k9408k334J4930Q934
$$ 34101 -17698 -24510 16551 9576 -2338 -3571 -13696 8015 18619 -10789 -13123 1807 10741
1397A0741L870l4852k531N7029j9620n1524L7180K0891k6332O379o591p727L3116
$$ 10741 14611 -20241 -22772 34257 14637 -36887 293 21184 -5148 1231 -5360 -13087 20029
1410B0029j0362l1974J9275J3263k940m766k4945J9238L6898m0561k3111M3226
$$ 20029 9667 -22307 -3032 10231 7291 2525 -22420 -3182 33716 -6845 -29956 13270
1422A3270J673k1344L604m989R607J4088k1168p661J4167N748M702k1330j3156
$$ 13270 14943 -6401 -2797 -7786 1821 15909 -5259 -12920 1247 6995 11697 -9633 -22789
1435b2789M2794J358m7120J6068K7758j6847k730k724o219K2951k125k4187Q106
$$ -22789 20005 21363 -25757 -9689 18069 1222 -1508 -4232 -10451 12500 10375 -13812 -5706
1448e706R500M430O8k7659Q829L9238k5765k8506K8701Q748j0589j637j2235J1478
$$ -5706 3794 8224 8292 -19367 -10538 28700 2935 -25571 3130 11878 1289 -348 -12583 -1105
1462a105J9466k0870r922J2233K555J0982j3414k7037L5163K1163m5387k649L1624
$$ -1105 18361 -2509 -12431 -198 2357 13339 -75 -27112 8051 29214 -16173 -18822 12802
1475A2802n849n732n694r732K4351O393k9029J662J5135L982R07k4040k045M0833
$$ 12802 6953 1221 -4473 -14205 10146 16539 -12490 -10828 4307 8289 9196 -14844 -16889 23944
1489B3944j0256l8662J8255K1662q762q275j1246R635K3587j7633j9673J5392
$$ 23944 13688 -24974 -6719 14943 6181 -2094 -13340 -3705 19882 2249 -17424 -2032
1501b032R959J452j0061k0249K2354K5648l3040j7111K8886Q667j2495j1699j419
$$ -2032 7927 9379 -682 -20931 1423 27071 -5969 -23080 5806 14473 1978 -9721 -11140
1514a1140K1362L916k3967j316J4103O220j319k1058j070L3316o505l1196J1164
$$ -11140 10222 14138 -9829 -11145 2958 9178 7859 -13199 -14269 19047 12542 -18654 -7490
1527g490J6926k059n740j5771Q043K6085j7102j9947J7283N961j795n06j8787
$$ -7490 9436 7377 1637 -14134 -6091 19994 2892 -17055 228 6189 4394 3888 -14899
1540a4899R131K8187k1406k1445K2182R709q773o558p232J3710J3210j9871r358
$$ -14899 -5768 22419 1013 -20432 1750 11459 2686 -3872 -11104 2606 15816 -4055 -13413
1553a3413J5412O087k781j1197o959K0352P626k3334m170J6380N677n839j4383
$$ -13413 1999 8086 5305 -5892 -12851 7501 15127 -8207 -12377 4003 9680 3841 -10542
1566a0542J227K2242l102k1323L583J2729L659n443j5540N228K2833q193k0787
$$ -10542 -9315 12927 9825 -11498 -7915 4814 8473 3030 -12510 -7282 15551 7358 -13429
1579a3429O101J4617L332j2213j4136J5438J7633j6970j4204J0621J1242J710
$$ -13429 -7328 7289 10621 -1592 -15728 -290 17343 373 -13831 -3210 8032 9742
1591I742j4480j1250K1063J2300k2075q975J3747R315j191j6996o199K5684N703
$$ 9742 -4738 -15988 5075 17375 -4700 -13675 72 9387 8196 -8800 -14999 10685 16388
1604A6388k7175k581J9286M945q779j3382K891K1406k334k2734J306J7992M459
$$ 16388 -10787 -13368 5918 10863 2084 -11298 -8407 12999 10665 -12069 -10763 7229 11688
1617A1688j2918j3278J1482J9471j1635j9945Q837J7341j618j6303o065J7050
$$ 11688 -1230 -14508 -3026 16445 4810 -15135 -6298 11043 9425 -6878 -12943 4107
1629D107J0117j6085j0792J0616J1677j997j5357n010K0081P349k1097p324J6615
$$ 4107 14224 -1861 -12653 -2037 9640 7643 -7714 -12724 7357 14706 -6391 -13715 2900
1642B900Q899r699j2959M567J6439j851j5851j001J1400O768p126j3930N463J8606
$$ 2900 11799 2100 -10859 -6292 10147 8296 -7555 -8556 2844 9612 2486 -11444 -5981 12625
1656A2625n451j8345L365J4988J912j1924q035J0616J1678r255j1409M625J0033
$$ 12625 7174 -11171 -7806 7182 9094 -2830 -10865 -249 11429 2174 -9235 -4610 5423
1669E423K834j0452r824J2249J3430j2575j3877R591J3747m387j4276n43J4444
$$ 5423 8257 -2195 -12019 230 13660 1085 -12792 -3201 10546 6159 -8117 -8660 5784
1682E784L814j2094o864P256J1056j973j6189j173J9386K791j8816m794J5153
$$ 5784 9598 -2496 -9360 -2104 8952 6979 -9210 -10383 9003 11794 -7022 -11816 3337
1695C337Q609j0958j3206P912J5593m808j5034N2J3063O387j1280j2875J0399
$$ 3337 11946 988 -12218 -4306 11287 6479 -8555 -8503 4560 10947 -333 -13208 -2809
1708b809J7086r008j8514N587J8508j009j7915l344J6267O658j2353r758O724
$$ -2809 14277 5269 -13245 -7658 10850 9841 -8074 -11418 4849 11507 -846 -10604 -3880
1721c880J3747j310j7694k595J9780M647j8182p210J4208J1062j0026j4892P006
$$ -3880 9867 8557 -9137 -11732 8048 12695 -5487 -12697 1511 12573 2547 -12345 -5339
1734e339J6464m064j4891o85J1866P187r893j3119R002J6215p510j6303L902J5397
$$ -5339 11125 7061 -7830 -8515 3351 10538 645 -12474 -3472 12743 5233 -11070 -7168 8229
1748H229J135j4814n403J3920P505j0763q669M977J0885J054j4106m795J5965
$$ 8229 9364 -5450 -10853 3067 10572 -191 -8860 -3883 7002 8056 -6050 -10845 5120
1761E120O274j4462p320J0087R755n440j2756K465J3533j67j1162l524P259R178
$$ 5120 11394 -3068 -10388 -301 9454 4014 -8742 -6277 7256 7089 -4073 -7597 -338 8840
1775H840m693j4305M283J5753l270j3726l10J0753N698r299r908Q550J0723n635
$$ 8840 4147 -10158 -5875 9878 6608 -7118 -7428 3325 9023 -276 -10184 -1634 9089 3454
1789C454r373n74R149P794j1352j2090J3420J2040j1761j0390N929J0549O33j2469
$$ 3454 -5919 -6493 2656 10450 -902 -12992 428 12468 707 -9683 -3754 6795 7428 -5041
1803e041m500J2996O075r648q448L976J3144K50j8298r74J9608O53j5720l315
$$ -5041 -9541 3455 9530 -118 -8566 -4590 8554 8804 -9494 -10468 9140 9793 -5927 -9242
1817i242J0272R043p060j3957O203J4350l950j1039k772Q875J1691j0707j7274
$$ -9242 1030 10073 3013 -10944 -4741 9609 5659 -5380 -8152 723 12414 1707 -15567
1830a5567J4031J6495j3316j2517O912J0535J642j2385o725J4022P014j0583p346
$$ -15567 -1536 14959 1643 -10874 -3962 6573 8215 -4170 -10895 3127 10141 -442 -7788
1843g788K826J1712L713j8496m754K1927K152j8263j597J0252O146m459j2201
$$ -7788 -4962 6750 10463 -8033 -12787 9140 11292 -6971 -8568 1684 7830 3371 -8830
1856h830L325J3869l018r807j582M884J0490m525j7774Q226J8322j0285j3364
$$ -8830 -5505 8364 5346 -4461 -6043 -1159 9331 4806 -12968 -4742 13580 3295 -10069
1869a0069O357Q797J276q540o194R495N966o075m563k337P610J0035j5002j0739
$$ -10069 -3712 5085 6361 -2179 -8373 1122 7088 1013 -3550 -5887 1723 11758 -3244 -13983
1883a3983J9678N446j6019j674O117M853J672j1758k142J4226j134q031k69j629
$$ -13983 5695 11141 -4878 -6552 -435 4418 6090 -5668 -7810 6416 5282 -2749 -3018 -4647
1897d647R265N950j9837j940K3118m024j7157M026Q719K344m607q686M776Q879
$$ -4647 4618 10568 -9269 -11209 11909 7885 -9272 -5246 3473 5817 1210 -7476 -2700 6179
1911F179k440n689n405N656J4403j0922j7193J5988J2391j3519o840L609P865
$$ 6179 3739 -1950 -7355 -1699 12704 1782 -15411 577 12968 -551 -7391 -3782 4083
1924D083N088j3957n778J6345P05q665J79m334Q414J2135k1076r096K6876Q66
$$ 4083 9171 -4786 -10564 5781 6486 -2179 -2000 -6334 2080 14215 -6861 -15957 10919 11785
1938A1785k0983K038R791L818l283j1508L633J2878m310p255j717K343J2903m787
$$ 11785 -9198 -7160 2631 6449 3166 -8342 -4709 8169 3859 -3396 -5113 -2770 10133 5346
1952E346k0106J1194J8102j2927j1334O239Q320L292j1992o514J5396K328j0437
$$ 5346 -14760 -3566 14536 1609 -9725 -3486 4834 8126 -3866 -10380 5016 7344 -3093
1965c093J085j778L686J1902j4810j2091K2157N008j8613j093Q929N179k846j1905
$$ -3093 -2008 -3786 -100 11802 -3008 -15099 7058 12066 -6547 -7640 1289 6468 3622 -8283
1979h283M323J1936o705l604J060m164J1487L158k1206N374J9526j0486r609M818
$$ -8283 -3960 7976 1271 -2333 -1273 -5437 6050 9208 -11998 -6624 12902 2416 -7193 -2375
1993b375K840O703n776j2510J2702P171j2140K057N71l888J3514m298j9075J4144
$$ -2375 465 7168 1392 -11118 1584 8755 -3385 -1328 -757 -4645 8869 4571 -14504 -360
2007c60J3882j5271o734P693N621K17r805j573J0996q17m562j095m137R726O841
$$ -360 13522 -1749 -8483 -790 4831 5048 -4757 -6330 4666 3849 -713 -1808 -5945 3781 10622
2022A0622j8297k211J8414k113j0608j510L701J1083n153j6130J1105J0732j1080
$$ 10622 -7675 -9886 8528 6415 -4193 -5703 -2002 9081 3928 -12202 -1097 9635 -1445
2035a445k70J69m154J4662k021k1742J1668J6704j2973q225M164O520O050j2509
$$ -1445 -1715 -1546 -5700 8962 6941 -14801 -3133 13571 598 -7627 -3463 3057 9107 -3402
2049c402p715J6491K009j0842J569j706M057J0534j4853r106J9851K733j4359
$$ -3402 -11117 5374 7383 -3459 -1890 -3596 461 10995 -3858 -12964 6887 9620 -4739
2062d739j414M918Q201j340j5700N164J4939q439o199L260j394Q297O79j6609
$$ -4739 -6153 -1235 6966 5626 -10074 -4910 10029 1590 -4609 -1349 -2743 5554 6233 -10376
2076a0376N465J5488p754q989J728O488O648j0626q857J4810L497j1031J724q0
$$ -10376 -4911 10577 2823 -6166 -4438 2050 8698 -1928 -10785 4025 7522 -3509 -1785 -1865
2090a865Q72R442r251j0333J4848M729j1238j953K496O582K219j3419M61J4095
$$ -1865 -993 8449 -802 -11135 3713 8442 -2796 -4749 -2253 4329 6548 -6871 -6410 7685
2104G685m806o455K707k223O282L831j4122J081J3164l760n989j428J509J0725
$$ 7685 2879 -3576 -869 -3092 3190 7021 -7101 -6020 7144 3384 -2605 -4033 -2524 8201
2118H201m925j4419J1043Q737j0697L18P19k865J1133l134j5455J0297J0722r891
$$ 8201 3276 -11143 -100 8637 -2060 -1742 -1023 -3888 7245 4111 -11344 -1047 9675 -216
2132b16m334J612M208O555r559p983J2968M117r267k116J328N760L692j1038l174
$$ -216 -4550 -2938 1270 7825 -1734 -9717 3251 7368 -1899 -4015 -2687 3073 6765 -4273 -7447
2147g447J1571J914o818n130K354J1826l120j5362O834J1630o606m421m81R18
$$ -7447 4124 6038 -780 -5910 -3556 8270 5150 -10212 -3378 8252 1646 -2775 -3256 -2338
2161b338J0022m115j4131Q793J0570p635n349J3M959P939r780r500J3086N587
$$ -2338 7684 3569 -10562 -1769 8801 1166 -4183 -4170 789 8728 -1052 -10552 2534 8121
2175H121r640k617J316N539M586j1265m231J3043Q07p796j336K41P683K607j4297
$$ 8121 -1519 -4136 -2820 2719 7305 -3960 -8191 4852 5659 -2137 -3473 -3232 4451 7058 -7239
2190g239N93J4780m370q433K442J355M761M99j1124K336J1709m309p507J484L828
$$ -7239 -6646 8134 3764 -4669 -2227 -872 3889 4388 -6736 -4400 7309 3000 -4507 -3023 805
2205H05M235l743q047N208P718m151o162K60O591L198q554l224Q039J593l243
$$ 805 5040 1297 -6750 -1542 6176 2025 -4137 -3877 2714 5912 -2642 -5866 2173 3766 523
2220E23k384k959P340N083j2189k213J1618j005n286o56j299O844L070j2202n
$$ 523 -1861 -4820 2520 7603 -4586 -6799 4819 3814 -1472 -2128 -3427 3417 6487 -5715 -5720
2235e720J1577k456n810o0K13O319Q95j1147J278J0922j888p534j204N003N848
$$ -5720 5857 3401 -2409 -2469 -2256 4063 4958 -6189 -4911 6011 4123 -3411 -4615 388 6236
2250F236n298p999N859O798l524n059j553N669O046q042p052Q659N834n636n613
$$ 6236 938 -7061 -1202 5596 2072 -2987 -4540 1129 7175 -867 -7919 740 6574 938 -4675
2265d675O95Q055K254j0810k088J0411J421o596k923J967O966J11j0261J03J0146
$$ -4675 -3980 4075 6329 -4481 -6569 3842 5263 -1333 -4256 -2289 4677 4788 -5473 -5370 4776
2280D776M35p701l321N664P244n760q888O222P412m119n119o43M559N445o159
$$ 4776 5211 -2490 -5811 -147 7097 1337 -7551 -1329 6083 1964 -3155 -3798 761 6206 47
2295D7p313P056O396m976n579O83O953K614r172l023R322J969o142k339J630M902
$$ 47 -7266 -210 6186 1210 -4369 -3686 3267 5881 -3291 -6314 3008 4977 -1165 -3504 -1874 3028
2311C028J240p509j921P984K061n854l688L476O299k510q013K660P007j675m543
$$ 3028 4268 -3241 -5162 2822 4883 -971 -4659 -1183 5116 2606 -5407 -2747 4260 2585 -1958
2326a958j248K702M842k396o803K455O508q94n607k086N639M607o502m948N998
$$ -1958 -3206 -504 4338 1942 -4861 -2406 4102 3208 -2399 -4485 1154 5761 -741 -5689 309
2341C09L937l128l612p44M730L635o226m468O009M425l620n435P77P452O79q748
$$ 309 4246 1118 -2494 -3238 1492 5127 -1099 -5567 442 4867 1247 -4188 -3411 4041 4720 -4028
2357d028p44P649J347m921l324K283O094r16p727P0P497J571o482m111N782O488
$$ -4028 -4772 2877 4224 -697 -4021 -1738 4356 3440 -4287 -4217 3280 4851 -1631 -5742 40 6528
2373F528n749o956M819N975k031n268j803N706M729o434n689N764N632l217o163
$$ 6528 779 -6177 -1358 4617 2586 -2682 -4485 1221 5950 -484 -6173 -409 5223 2006 -4157
2388d157QP848J845r018k121Q085K278n235l744K207O040k95p593o04P396J806
$$ -4157 -4149 3699 5544 -3474 -5595 2490 4768 -467 -4211 -2004 4036 3741 -3852 -4456 2940 4746
2404D746n901m160M886O254m603o677L784N614j385m529j986M516M648n141n352
$$ 4746 -1155 -5315 -429 5825 1222 -5455 -1671 3943 2558 -1971 -3957 559 5207 66 -5286
2419e286M668M833k276m796q67N922K730p027k694O213K331l398l119K90M891
$$ -5286 -618 4215 1939 -2857 -3724 2198 4928 -2099 -4793 1420 3751 353 -2766 -2476 2415
2434B415J509o114k060N481K773l637m398K218O047j857o137J401M471N80k607
$$ 2415 3924 -2190 -4250 1231 4004 367 -4031 -1813 4234 2377 -3760 -2359 2112 2692 85
2449H5l670J864O234k374o494K056N187K28m232l339M511N316n235m952M247L622
$$ 85 -3585 -1721 4513 2139 -4355 -2299 2888 3116 -1116 -4455 56 5372 137 -4815 -568 3054
2465C054j043l502k624M825M626n876m690M985M601k444n698K64P184M33p372
$$ 3054 2011 -1491 -4115 710 5336 -540 -5230 -245 4356 1912 -3786 -3522 3662 4095 -3277
2480c277m44N184J725k098m759M94P771p27q424R10O716P20m704l891M156O359
$$ -3277 -3721 1463 3188 1090 -3669 -3175 4596 3869 -4555 -3645 3071 3791 -913 -4804 -648 5711
2496E711m745o339M265M602j241l631k630M174N394n482n734M996N222k589n653
$$ 5711 966 -5373 -1108 3494 2253 -1378 -4008 166 5560 78 -5656 -660 4562 1973 -3680
2511c680kP164P78p367m16N097J090j515l778p91P046N58q080L13O094O59l373
$$ -3680 -3682 3482 4260 -3107 -3523 1574 2664 1149 -2629 -3420 3626 4184 -3896 -3583 2511 3170 -203
2528b03l723K561O386l610o122L893L438j331j378k941J582O120l273o209L588
$$ -203 -3926 -1365 5021 1411 -4711 -818 2620 1289 -89 -3030 -1448 4672 1399 -4810 -1222
2543a222M624j311m011j649N135K768o113j655M508N17l61j876l053M801L744
$$ -1222 3402 2091 -1920 -3569 1566 4334 -1779 -3434 1074 1591 1230 -646 -3699 1102 4846
2558D846o572k515N318K069k172m041L95O370q18o503J687L583j85k47l755n71
$$ 4846 -1726 -4241 1077 3146 974 -3067 -2672 3698 2880 -3623 -1936 1647 1462 1215 -2540 -3111
2574c111O980o09p277J122N284R15l847m185M601N538n767l905M417J528O7j501
$$ -3111 3869 3260 -4017 -2895 2389 3304 -543 -4728 -127 5411 -356 -4261 156 1684 1751 250
2590B50m716M074O414o388m914N342L553j730m715j163P317J165q084M09N274
$$ 250 -4466 -392 6022 -366 -5280 62 3615 1885 -2830 -3993 3324 4489 -3595 -3186 2088
2605B088j31j035l081j384O935P12p931K42N997J146l778m515L943O562n508n193
$$ 2088 1957 922 -2159 -3543 3392 4104 -3827 -3585 2412 3558 -220 -4735 -792 5770 262 -4931
2621d931N226K033j394o98l854K606O512n227n363M957L423j644l720j868O242
$$ -4931 295 2328 934 236 -3618 -1012 5500 273 -5090 -133 3290 1646 -2074 -3942 2300
2636B300K548p973l96N974r93j329p75k463M617K759o632j314N329J230k508l719
$$ 2300 4848 -3125 -3521 2453 1460 131 -644 -3107 1510 4269 -2363 -3677 1652 2882 374 -3345
2652c345J438O176k654n737L566K512j206O2l148L41N800k107n255K388K743Q03
$$ -3345 -1907 4269 1615 -4122 -556 1956 750 812 -2336 -1995 3805 1698 -3557 -1169 1574 2377
2668B377k405m454M893M958o923k186N254n52l20Q9m456L466N352o007l172M606
$$ 2377 -28 -4482 411 5369 -1554 -3740 1514 962 642 731 -3725 -259 5093 -914 -4086 520
2684E20J893p27l675j700O683R35p364Q95M461o02m24k725j191O066J93o361N92
$$ 520 2413 1686 -1989 -3689 2994 3929 -3435 -2540 1921 1319 895 -1830 -3021 3045 3238 -3123 -2531
2701b531L922J647k332n368L456O955n478n074N102J677r55o09l901K644N971
$$ -2531 1391 3038 706 -4662 -1206 5749 271 -4803 299 1976 1021 412 -3489 -845 5126
2716E126m939m779M368L069r74l633k349O260K519p456p64N334L84j558k655o85
$$ 5126 187 -4592 -224 2845 1871 -1762 -4111 2149 4668 -2788 -3552 1782 2166 608 -2047 -2732
2732b732N540K84n926N06L480J167j056n108J640P712m267o307N185K365k230
$$ -2732 2808 3092 -2834 -2328 1152 2319 1263 -3845 -2205 5507 1240 -5067 118 2483 253
2747B53J44k798Q69N949l653n088M221K411j239j647k554L650L835n519k477M694
$$ 253 397 -2401 -1532 4417 764 -4324 -103 2308 1069 -578 -3132 518 4353 -1166 -3643 1051
2763A051R47j426j762j325M174J207m545l03K298J055P66m317j280P124r57o648
$$ 1051 1998 572 -1190 -2515 1659 2866 -1679 -1982 316 1371 2137 -2180 -3460 3664 2707 -3941
2779c941K924K909j563Q09k693j298O138p59o087K184L271n36r46l083J188N290
$$ -3941 -1017 1892 329 1138 -1555 -2853 3285 2526 -3561 -1377 1894 1358 412 -2671 -1483 3807
2795C807k600m892K648L323m60k820j944L710K482l844j739J622J988J588m450
$$ 3807 1207 -3685 -1037 2286 1826 -994 -2938 772 3254 -590 -2329 -707 1281 2869 -1581
2810a581k863P163J346p060P14L576j50N20l464j803O957L8p218J815M066p09
$$ -1581 -4444 2719 4065 -2995 -2281 1295 1145 1665 -1799 -3602 3355 3393 -3825 -2010 2056 1347
2826A347o91k994J4O124j480o360K304M442p61k876k131L206L543l819k948K686
$$ 1347 656 -2338 -2324 3800 2320 -4040 -1736 2706 1945 -931 -3062 144 3687 -132 -3080 -394
2842c94K148K85l107k523N016K567n700j281L844R49o74k808j237N418O98n955
$$ -394 1754 2039 -1068 -3591 1425 3992 -1708 -2989 855 1804 1130 -1678 -2915 2503 3201 -2754
2858b754N79L857l10r66k122k59M577m15m837P77L392M62k065k643K225L781l086
$$ -2754 -2175 1682 1372 406 -1716 -1975 2602 2187 -2650 -1873 1519 1981 -84 -2727 -502 3279 193
2875A93k801K339J328K42j130l117K777L669l943k197K738J046L26j851k764M094
$$ 193 -2608 -269 1059 1301 171 -2946 -169 3500 -443 -2640 98 1144 1470 -381 -3145 949
2891I49K678n155j091L607K65m68j450j769L495J964m275j364L023J756j153l458
$$ 949 3627 -1528 -2619 988 1253 785 -665 -2434 1061 3025 -1250 -2614 409 2165 1012 -2446
2907b446N85M638r38m157P55K474R50j269l375J619M253j972l580J018K452J520
$$ -2446 -1861 2777 1839 -2318 -1563 911 1861 592 -2783 -1164 3089 1117 -2463 -1445 1007 2527
2923B527k696l642L984L919m569k681L294J563l80k203j957L669K496m207k006
$$ 2527 -169 -3811 173 4092 -477 -3158 136 1699 1319 -884 -2841 828 3324 -883 -2889
2938b889K890K351r51l727k36N289j02n223M16L584N96j860k503J191L894j308
$$ -2889 1 2352 1401 -2326 -2562 2727 2625 -2598 -2182 1402 1998 138 -2365 -1174 2720 1412
2954A412l690O59K740J155k379l314L268L913l912l027L099J821o85j864j494
$$ 1412 -2278 -1619 1121 2276 -103 -3417 -149 3764 -148 -3175 -76 1745 1060 -804 -2298
2969b298K841K304l357j828K242J698j29k821j240M192J223m579m80L233N64j289
$$ -2298 543 2847 -510 -2338 -96 1602 1473 -1348 -2588 1604 2827 -1752 -2232 1001 1565 276
2985B76j730J58K906Ok827m76J929J781j314l340J527L935j894l153J355J907
$$ 276 -1454 -1296 1610 1616 -1211 -1687 242 2023 709 -2631 -1104 2831 937 -2216 -861 1046
3001A046L52j398k103J706K681j803k237P62J834J203k379k608L323K811l669
$$ 1046 1398 0 -2103 -397 2284 481 -1756 -994 840 2043 -336 -2944 379 3190 -479
3016d79k051K514J645n28k152r10K867J377k656j814J637K724o25l870K32M595
$$ -479 -2530 -16 1629 1101 -1051 -1961 906 2283 -373 -2187 -550 2174 1549 -2321 -2089 2506
3032B506n09l907J02K456J414j636k997J572L612j482l007L15K299J672k360l410
$$ 2506 1997 -1910 -1808 648 2062 426 -2571 -999 2613 1131 -1876 -1561 738 2410 50 -3360
3048c360L145L773l443l028K414K315m57k411j197K979J852k910k015J838K607
$$ -3360 -215 3558 115 -2913 -499 1816 1359 -1052 -2249 730 2582 -328 -2343 -505 2102
3063B102o82l509o3M219J23l785m17K664J351j649k556J329L069j119k538L7J881
$$ 2102 1420 -2089 -2152 2067 2190 -1595 -2012 652 2003 354 -2202 -873 2196 1077 -1461 -1424 457
3080D57J671j880l075K479L300k682k477J695J690K6j700j469K199J824k053j679
$$ 457 2128 248 -2827 -348 2952 270 -2207 -512 1178 1204 -496 -1965 234 2058 5 -1674
3096a674R24J990M17k678j162L289J044k985q60J761J225l60k155k98K692M17
$$ -1674 -750 1240 1657 -1021 -2183 1106 2150 -835 -1695 66 1291 931 -1224 -1522 1170 1587
3112A587k163r40J183K114o46l305P44L645j030k776M67J661R76j119k292J074
$$ 1587 -576 -1516 -333 1781 1135 -2170 -1426 2219 1189 -1587 -1120 541 1517 398 -1894 -820
3128h20K737q78k385j87K314J389k547k345L008K275k582j861J227J965K00k522
$$ -820 1917 1039 -1346 -1533 781 2170 -377 -2722 286 2561 -21 -1882 -655 1310 1510 -1012
3144a012j038K793J266k140j751J070K705j61l922K07M220n22l237nJ899J393
$$ -1012 -2050 743 2009 -131 -1882 -812 1893 1732 -2190 -1983 2237 1715 -1522 -1527 372 1765
3160A765j180k622Q83L186p82k694k53K249J831k446k771K823K794k639k179J417
$$ 1765 585 -2037 -1154 2032 1250 -1444 -1697 552 2383 -63 -2834 -11 2783 144 -2035 -618
3176f18J886J52k148j291K493J473j935j596P19K363K76l393n71L972K8l266J46
$$ -618 1268 1420 -728 -2019 474 1947 12 -1584 -865 1498 1774 -1619 -2190 1782 1810 -1456 -1310
3193a310J741P14n11k014K04K539q9k189m72J485J573j142k737J576K856j679
$$ -1310 431 1145 634 -1380 -1176 1363 1274 -915 -1387 98 1671 529 -2208 -632 2224 545
3209E45k183J004J447L12j294j192J232J478q40j338m50J873J467k790j610L267
$$ 545 -1638 -634 813 1125 -169 -1361 -129 1349 509 -829 -1279 594 2061 -729 -2339 928
3225I28J038k642m15Q36R66N17j980q45K301P99j704j051M43K221J83l376J6L753
$$ 928 1966 -676 -1091 -255 711 1228 -752 -1597 704 1503 -201 -1252 -809 1412 1595 -1781 -1765 1988
3243A988n11k866K41J531Q58p69k017O69K277k88j914q27J803K239k371k838K859
$$ 1988 1477 -1389 -1148 383 1241 472 -1545 -876 1401 1113 -801 -1628 175 2414 43 -2795 64
3260F4K429k505j641J120J411O07k134j272K462J177j793j291N28K093N34l367
$$ 64 2493 -12 -1653 -533 878 1485 -649 -1921 541 1718 -75 -1366 -838 1255 1789 -1578
3276a578n99L925J94l326j07K035Q68j104j902Q86K121m80j722n36J288K033j588
$$ -1578 -2177 1748 1942 -1384 -1491 544 1412 308 -1594 -708 1413 933 -789 -1325 -37 1996 408
3293D08k943K206K803k316j781J162J268L68j557j326K100J182j706q21K60J282
$$ 408 -2535 -329 2474 158 -1623 -461 807 1175 -382 -1708 392 1574 -132 -953 -693 589
3309E89R99k263j406L021J034k721o56J619R34o08j716L41J846k47j008n56J03
$$ 589 1588 -675 -2081 940 1974 -747 -1403 216 1150 542 -1174 -833 1013 766 -242 -798 -695
3326f95K038p8l229Q80L079j364j851O66O53R06n31k059J161J960j209j129J57
$$ -695 1343 1265 -1964 -1084 1995 631 -1220 -554 99 1005 474 -1585 -424 1536 327 -802 -645
3343f45O13J439r99k445J730K398j916j795J083J649o4j897l26J696M51p47j139
$$ -645 -32 1407 408 -2037 -307 2091 175 -1620 -537 1112 1048 -849 -1175 521 972 225 -914
3360i14k43K332O12l400n8L284l62k066k39Q02J660m16k949J026K795j244j674
$$ -914 -1157 1175 1787 -1613 -1671 1613 1251 -815 -1054 -252 1408 992 -1957 -931 1864 620 -1054
3377a054K61O94J470n93k909J348L039j534k445Q46K038J01k019q64K138Q16j392
$$ -1054 -793 -99 1371 778 -2131 -783 2256 722 -1723 -877 1161 1262 -757 -1621 517 1333 -59
3394e9q42P3J713P60k752p53L164J84k364j55R36J202j27k568M09K904r51j916
$$ -59 -901 -828 885 1645 -1107 -1860 1304 1488 -876 -1031 -95 1107 980 -1588 -1179 1725 774 -1142
3412a142P06O12O69r4k009K59K537p17k120L41J689N23j660r53J637Q17j022n52
$$ -1142 -436 176 845 751 -1258 -999 1538 821 -1299 -958 731 1254 -406 -1359 278 1095 73 -479
3430d79k65R90J222j854j311K322N61j543j95m6J077R95k300q06K760p4j840K71
$$ -479 -744 246 1468 -386 -1697 625 1186 -357 -552 -598 479 1474 -826 -1632 1128 1054 -786 -515
3448e15K62O44P53j823p55K304M62j868o19J034J429q98j796R48J496m97j023
$$ -515 -253 391 1144 -679 -1434 870 1332 -536 -1155 -121 1308 410 -1386 -438 1058 561 -462
3465d62m94Q09J731j362j956J656J530j231q64k64J028J684k072j809K605J199
$$ -462 -956 -147 1584 222 -1734 -78 1452 221 -643 -907 121 1805 -267 -2076 529 1728
3481A728k156n68P90P68M60j576j048K160J006j901j032J058J754p37k137N80
$$ 1728 -428 -996 -206 562 1022 -554 -1602 558 1564 -337 -1369 -311 1443 706 -1431 -851
3497h51K088l40j486m96J061J552j248k014J433J716j123r73j34Q88J494j535
$$ -851 1237 897 -589 -1085 -24 1528 280 -1734 -301 1415 292 -681 -815 73 1567 32
3513C2k086K294J544k042p97Q48P78L24j268r92J835P42j409p54N85J280l2j819
$$ 32 -2054 240 1784 -258 -1055 -207 571 895 -373 -1365 470 1212 -197 -951 -366 914 882 -937
3531i37n9J898k6j381l30P19J116n44j578O88J424o74o83j99K09J476n61k047
$$ -937 -996 902 876 -505 -835 -116 1000 456 -1122 -434 990 316 -367 -566 -357 1119 558 -1489
3549a489J090J740j027j107L54O57O57q85j086J027J074p47q69j18J021R16j494
$$ -1489 -399 1341 314 -793 -439 218 875 -10 -1096 -69 1005 258 -611 -729 292 1208 -286
3566b86j031J612Q33j167p58J66J389J35j709j35J610R5q62n62qJ713N4k373K92
$$ -286 -1317 295 1128 -39 -797 -631 758 893 -816 -951 659 754 -108 -670 -678 1035 1089 -1284 -992
3585i92K167l16j528k69R95J156r98j566J094J347n89j075l46J082J229j503j503
$$ -992 1175 859 -669 -938 57 1213 215 -1351 -257 1090 501 -574 -920 162 1391 -112 -1615
3602a615J671J284j266j092M90J230L86j828m16J794L02j153o02L78J269O8j962
$$ -1615 56 1340 74 -1018 -528 702 1088 -740 -1156 638 940 -213 -815 -437 832 900 -1062
3619a062l3K050M1j599l72R89J054q40j410Q90J231m96q63k46P83J017j011j461
$$ -1062 -1095 955 996 -603 -975 14 1068 228 -1182 -292 939 443 -420 -666 117 1134 123 -1338
3637a338J148J357r55r69K05J059L42j252o12J345M43q00m44O1P64N66j351n85
$$ -1338 -190 1167 212 -757 -552 507 849 -403 -1015 330 773 -27 -471 -410 354 920 -431 -1016
3655a016J432N18j053p07N37J085l83j226L31J063j25n35m76Q1J255j44j653L55
$$ -1016 416 934 -119 -826 -289 796 413 -813 -482 581 456 -79 -555 -474 781 637 -1016 -661
3673f61J480k02j021k69P50Q43p83j223P95J091l85q07l49Q04R14j022j094J039
$$ -661 819 617 -404 -673 77 920 137 -1086 -291 800 415 -392 -741 63 977 -45 -1139 -100
3691a00J164o65j239J24J491J37j563k27J257M33p34p84R6J431J33j900j3J782
$$ -100 1064 399 -840 -716 775 912 -651 -878 379 812 78 -706 -610 821 954 -946 -959 823
3709H23R0j370m00P34J200o81j481O15J391l03j202k74J055Q84r58j245R71J141
$$ 823 913 -457 -857 -123 1077 396 -1085 -470 921 618 -584 -858 197 1081 123 -1122 -151 990
3727I90n12j332J24J414K62j575l00J300L60p31o20L7J302J15j599j65J510K15
$$ 990 478 -854 -730 684 946 -629 -929 371 731 0 -620 -583 719 834 -765 -930 580 795
3745G95j021n28O24R06m37j072K04J157j23q54j75N45P04m51j111M20J101k01
$$ 795 -226 -754 -130 776 339 -733 -529 628 505 -349 -524 21 725 274 -837 -417 684 483
3763D83r84j94J074M07j033m43P05N12k75o06k80Q31O99j141o80J020O85p03o79
$$ 483 -501 -695 379 786 -247 -690 15 527 252 -354 -634 197 896 -245 -925 95 780 77 -602
3782f02J94Q91J59j043l47R87M20o73n94K34J010K4j301j38J276K55r48p07R04
$$ -602 -408 483 642 -401 -748 239 659 -14 -608 -374 636 660 -641 -779 497 752 -196 -903 1
3801AQ42p06j018N57Q52Kp82n43Q26R52r52j040Q09J120n44j008j08J219L66j268
$$ 1 843 137 -881 -324 528 530 -252 -795 31 983 31 -1009 -200 920 376 -632 -740 479 845 -423
3821d23m12R27O63n71q84J34J279O9j461j56J425J92r34o45O47J080n60j300N25
$$ -423 -835 92 755 184 -700 -566 713 782 -679 -835 590 782 -152 -797 -150 930 370 -930 -405
3840d05J057k14p42l52O58Q86o11j254P42J155n12j123K30J010J27r33l31O75
$$ -405 652 438 -304 -656 2 888 277 -977 -235 920 408 -715 -485 525 652 -281 -612 63
3858F3N69m77o81Q2R19J33r58k58P63N29o68o07L76Q77l71q60K30O81m2k89m60
$$ 63 632 155 -526 -444 475 608 -350 -608 155 684 16 -591 -215 662 291 -569 -339 342 300 11 -449
3879d49J48R22k09j086K51R21r4o52k85N25O33m57p72L88O81j71n24l33N68P23
$$ -449 -301 621 412 -674 -423 498 404 -248 -533 -8 625 168 -604 -216 465 294 -230 -563 5 728
3899G28o94q98P07Q02l86p82O7Q30K43q22l55O22O01m90p01J29R85lj000k26Q60
$$ 728 34 -864 -157 645 259 -523 -456 374 617 -205 -560 62 663 173 -528 -399 586 583 -417 -643 217
3920B17N28p50q08O87R56n73r31L68P70K8o35n90O71Q90o98j057P44R51l50r90
$$ 217 745 -5 -813 -126 830 257 -674 -306 464 492 -143 -733 -62 828 130 -927 -183 768 418 -572
3940e72O2R10K89r94l74P78N07m58o71J23Q46J66r82k68R27M04p22o46N13Q98
$$ -572 -510 400 689 -305 -679 99 606 148 -523 -400 446 612 -370 -638 289 693 -29 -675 -162 736
3960G36n13q94L63P68l6n66l61M05P60m52q24L79P82j70o92k13P02N08q53m15
$$ 736 223 -671 -308 460 424 -142 -503 -98 662 210 -614 -235 547 377 -315 -528 174 682 -171 -586
3980e86O36L77k17m69j84O46M41r12k35O42L56m02m91N1Q26m2r04R0O40M4k49
$$ -586 50 427 210 -259 -443 203 644 -268 -503 139 495 93 -398 -347 479 437 -467 -377 263 307 58
4001E8l02o1O59Q0q30r2Q53J36o16m00M92N05l16n52J95M27J89o15m03P20N12
$$ 58 -244 -305 354 434 -396 -488 365 501 -115 -515 -23 482 166 -386 -191 236 425 -190 -593 127 639
4022F39o74n24M35N58o4o34m56J079M13j089k98Q03J81k12m39j62Q24K89j014
$$ 639 -35 -559 -124 434 370 -264 -720 359 772 -317 -615 188 369 157 -282 -444 380 669 -345
4041c45l26J016J75o09n31M58P32j67r29J51P82J29p77l46O48N94n92o71L70O81
$$ -345 -671 345 520 -89 -620 -162 570 403 -526 -375 407 536 -241 -587 61 655 63 -608 -238 443
4061D43p7o56k80Q61L77r02l92P86L01l99m22L4O63J57p79k48O88K71m04n15L05
$$ 443 366 -290 -570 291 668 -234 -626 160 461 62 -360 -326 337 494 -285 -533 155 426 22 -493 -188
4082a88O40k30o17J60M49J58m35m41M75N57m55n14M43K20k5j77n11M28P11p02
$$ -188 452 222 -395 -235 214 372 -63 -504 -29 528 73 -441 2 222 197 20 -491 -63 648 -54
4102e4m30N87K60l61j13j78L13M47m05n91M74M86l23m27M9M58J92m81l08N17L66
$$ -54 -484 103 363 2 -111 -289 24 471 66 -525 -51 435 112 -315 -266 192 384 -97 -405 112 478
4123D78l52n25K53M39k1n37K1K94L03k53o59L96P95m49o24K57M24J13l93m29M58
$$ 478 126 -399 -146 293 272 -265 -244 50 353 100 -559 -163 632 183 -441 -184 240 353 -40 -469 -11
4144a1O69n67n76L63M39L9o24k59P04L95o92l55M98M19k32n78J0Q32r5p37P9L87
$$ -11 658 91 -485 -122 317 356 -268 -527 177 572 -120 -475 23 442 210 -368 -358 474 379 -358 -279 108
4166A08K55k13o07J38P84j13q92K50P00q3n09k18L69M77k67n88L21M00rn01j80
$$ 108 363 150 -457 -319 465 352 -540 -290 410 327 -182 -400 -31 446 179 -409 -88 312 303 -198 -378
4187c78N44K63m76l73L77M38j03o52O3O29K0n98ML68J23m5m46l1O07p1n42P1L93
$$ -378 166 429 -47 -420 -43 395 292 -360 -297 332 352 -246 -242 126 249 204 -242 -273 334 263 -279 -208 185
4210A85Oj58k83R4M94j64m89J54L12R0k27k46J46M94k16n20J25L88Q7m21j53L45
$$ 185 191 33 -250 -156 338 174 -315 -161 151 241 14 -232 -86 408 192 -328 -203 185 272 -149 -302 43
4232D3L40l60l37K61K18Q6l93k77N30L62n47k48K18M12j91m73N2N76Lm86j29M03
$$ 43 383 23 -314 -53 165 251 -142 -419 111 473 -74 -322 -104 308 117 -356 -304 272 275 -211 -340 63
4254F3K38j73m64N9O71j83m97K9M49K69m22m64M62M10l84l61J51L19N2l19k37
$$ 63 301 128 -336 -277 394 211 -286 -257 192 461 39 -425 37 447 63 -298 -147 172 224 -95 -332
4275c32L31M48l79m60L40L72j13m79mN42L7m40j54L50L18k84l96J19M75l0n40
$$ -332 -1 447 68 -392 -52 320 207 -272 -276 266 303 -137 -291 59 377 93 -303 -184 291 261 -279
4296b79J3L57K44l65l02K89M64l00m25J60L46k2k47j74K42K68j96l35J60L34q
$$ -279 -266 91 335 -30 -332 -43 421 121 -304 -144 202 180 -67 -241 1 269 73 -262 -102 232 224
4317B24m81O9L57K0k55j59J78J92J9l19r2M02J03l28q2J74J57o9l84P6M18K9m29
$$ 224 -257 -188 169 189 -66 -225 -47 145 164 -155 -247 155 258 -70 -152 22 179 110 -274 -198 220 249 -180
4340a80n2L42Q1j31k59J1L81J5l52j05L82J60l13l07K94L24k03k64J9L19R5k96
$$ -180 -232 110 191 60 -199 -188 193 208 -144 -249 133 293 -20 -327 -33 291 88 -176 -157 162 257 -39
4362c9l34M61K67l51l37K02L67K1m53m4L85J91l94k66L85K05k24k94J18L34O8
$$ -39 -373 88 355 4 -333 -131 236 257 -196 -240 145 336 -58 -324 61 266 42 -252 -134 200 268
4383B68m24j81M67K08m08k70L31K84j84l54J47K68O1k84k61K97L70k70l79K09
$$ 268 -156 -337 130 338 -70 -340 -9 275 91 -263 -116 152 213 -71 -332 -35 335 65 -314 -105
4403a05L19j6l50j15M09R6l99q3K88J86j38k04l3K58M8j81k24K54K07j54k46Q7
$$ -105 214 198 -152 -267 142 238 -161 -244 44 230 92 -112 -145 113 161 -20 -244 10 217 63 -183 -96
4425i6L01r3k60M4J61R2j10k12J17K14o1k89J03K02K5j75j40K37J06j18j77J7
$$ -96 205 112 -148 -104 57 149 39 -173 -56 158 97 -192 -89 113 138 -37 -177 60 166 48 -129 -112
4447a12K58k3k11o5J60J72q3k80O4K82k5l37M6L01P3k57j17J17J11O9k80j10M06
$$ -112 146 123 -88 -153 7 179 96 -184 -120 162 137 -200 -154 147 220 -37 -154 -37 74 143 -137 -247 159
4470A59P9l59p0K37J60j17l07J62K86j11l17N4K48L0j05k83J53L07j24l12R3L61
$$ 159 238 -121 -191 46 206 89 -218 -56 230 119 -198 -144 104 134 29 -254 -101 206 82 -230 -137 224
4492B24l8l45j06L33J48k19j57R6J78j3k88j4K84J29l48j25L08J68j74k83J32
$$ 224 186 -159 -265 68 216 -3 -160 -64 114 101 -187 -201 83 212 -136 -261 47 215 41 -242 -110
4513a10L21j75j14j07K47M6r4k18J85J81j31j92O1K25N4l29o8K77J53k88j06K19
$$ -110 211 36 -78 -185 62 108 14 -204 -19 162 31 -161 -100 125 179 -150 -218 59 212 -76 -182 37
4535C7M1o7Qj67J43K20k64j59K26J49j05j75P3J68J7k14n1J23J97j53m2j12J77
$$ 37 78 11 19 -148 -5 215 -49 -208 18 167 62 -113 -40 128 145 -69 -120 3 200 47 5 -107 70
4558G0P1j69j16R7K22j71k07J27K50p9j59p5J67J26j66j83J03K74j40j96j8K33
$$ 70 141 -28 -144 -47 175 4 -203 -76 174 95 -64 -139 28 154 -12 -195 -92 182 42 -154 -172 61
4580F1J44k82j84L58J40l19j08J72J59j0k18j62L45J05k74j42K72J30j15j79j7
$$ 61 205 -77 -261 97 237 -82 -190 -18 141 131 -87 -249 96 201 -73 -215 57 187 72 -107 -124
4601a24L01Pk75j09K55J66k17k04J94K45j36j96q3L19L5k48j97K92K24k78j40
$$ -124 177 184 -91 -200 55 221 4 -200 -6 239 103 -93 -176 143 178 -70 -267 25 249 -29 -169
4622a69J09J99k1j85j03K78Q0k43n6j2K74m3k69oK91J1k28p3K86m6r1j25L8K08
$$ -169 -60 139 118 -67 -170 108 188 -55 -111 -123 151 108 -161 -167 124 135 -93 -166 120 74 -17 -142 -104 104
4646A04k6j71o4J66J57j37k79K79J09o1j85L5R7J15j39j25O0K04j19j73K6J64
$$ 104 78 -93 -157 9 166 29 -250 29 138 77 -108 -73 24 139 0 -125 -65 139 20 -153 -127 37
4668C7J00j99r9K05J10j22j38N0J90K0k38m4K06j0o1j78P1L02K9l58n1L57q6k06
$$ 37 137 -62 -161 44 154 32 -106 -56 134 154 -84 -128 78 68 7 -171 -100 202 231 -127 -178 179 93 -113
4692a13K7J36M9m8k32P7K80K2l04n5K85J02j59l53K21L14j46l14J10K58Nk88O2
$$ -113 -86 50 99 51 -181 -104 176 198 -106 -161 124 226 67 -286 -65 249 103 -211 -101 157 162 -126 -64
4715f4J72N0n1j85pL26o2l83L7L23J2k48QO1J58o6l07J35K90j24j98n5J33K13
$$ -64 108 158 107 -78 -85 241 179 -204 -167 156 168 -80 -72 -11 147 81 -226 -91 199 75 -123 -178 -45 168
4739A68j85k26J84K59j25k39O3J90O7k37p1J83R2r6j13M3J14M7j28p3J39P0r2
$$ 168 -17 -243 -59 200 75 -164 -101 89 156 -81 -152 31 123 27 -86 -43 71 118 -10 -83 56 126 34
4762C4k10J52J66r8j44N1J55oj28j31J26J68q5j34KQ7J26j28j48J65K31k52j62
$$ 34 -176 -24 142 44 -100 -49 106 100 -28 -159 -33 135 50 -84 -82 5 131 3 -145 20 251 -1 -163
4785a63J04J27L3j51p4J10K31j90j96J41J68n5k08o6K41J48k92r4K21J20p1k30
$$ -163 -59 68 101 -50 -124 -14 217 27 -169 -28 140 85 -123 -189 52 200 -92 -186 35 155 84 -146
4807a46M2J98J11k45j51K77J61k56k24J52L45j53k71M9K28N9k79j11K38K26k71
$$ -146 -104 94 205 -40 -191 86 247 -9 -233 -81 264 111 -160 -111 117 176 -103 -214 24 250 -21
4828b1k08J46K72Kk74j41L27J25l56n9K23J62r5k11k8K97M2k70k20K98J48j17
$$ -21 -229 -83 189 191 -83 -224 103 228 -128 -187 36 198 103 -108 -136 161 203 -67 -287 11 159 42
4850D2k11P7K59r4k36L5K77q0m6j44K6K09Rk61P4J68J8j91q4J84Q8o3k15Q9J64
$$ 42 -169 -92 167 73 -163 -128 149 69 23 -121 -95 114 123 -138 -64 104 122 -69 -153 31 119 56 -159 -70 94
4875I4J0k28RK21M3j70o4P0J13L3j94k6J84P9k27j4R0N5j8j76P9J48N4k22q0J85
$$ 94 104 -124 -115 106 149 -21 -85 -15 98 131 -63 -89 95 174 -53 -67 23 78 60 -116 -37 111 165 -57 -137 48
4901D8O8k9k07K9J98K9k72K7K21pj37j78J96J44q1k00K5K84oj83j64J84K75k70
$$ 48 116 87 -120 -91 107 136 -136 -109 112 105 -32 -210 -14 130 49 -151 -126 158 152 -31 -195 -11 264 -6
4925fj71J78K37j55k32l5K62O3k06r8K09J43j08k99K44J70q4k58K5K49J68l66
$$ -6 -177 1 238 83 -149 -184 78 141 -65 -163 46 189 81 -218 26 196 112 -146 -121 128 296 -70
4947g0j32K03J82j18k65J54J46m4j08j46K70R7j65j87Q8K76j76j48N4J96O4k62
$$ -70 -202 1 183 65 -200 -46 100 56 -52 -198 72 169 4 -183 -95 181 5 -143 -89 107 171 -91
4969i1n2J40J17r5j47Q9J27K4k14J4J24J02j56j42Q5K52m8j83q5J39J12q2j76
$$ -91 -143 -3 114 19 -128 -39 88 112 -102 -88 36 138 -18 -160 -75 177 129 -54 -139 0 112 30 -146
4992a46J48R5Mk37j1K45M7k40MN9J27l1j56QK16J6k05q0J56K55k50j70P0K12k4
$$ -146 2 97 101 -136 -147 98 145 -95 -91 -32 95 64 -92 -84 132 148 -57 -137 19 274 24 -146 -76 136 112
5017A12k32j5K22M5j30j57J32J77o2k21l5L05Nk32j55L45J19k42j08J02K12j6
$$ 112 -120 -135 87 132 2 -155 -23 154 92 -129 -164 141 146 -86 -241 104 223 -19 -127 -25 187 171
5039A71l40K3K11J30k54j19K40J95j77k89P3L75j19k24K2J61J31j75k59J67K50
$$ 171 -169 -146 65 195 -59 -178 62 257 80 -209 -136 239 120 -104 -82 79 210 35 -224 -57 193
5060A93j53j14o0K99J5k69n9K09K00k54j76J30K41j02k61l5K62Q5k12o4J18J94
$$ 193 40 -74 -134 165 180 -89 -148 61 261 7 -169 -39 202 100 -161 -196 66 151 -61 -125 -7 187
5082A87j54k09P8J89R7l09qJ79J26j46k09J24J92o1j90J9J46O5o6j45R3J34o0
$$ 187 33 -176 -98 91 188 -121 -129 50 176 30 -179 -55 137 76 -114 -95 51 116 50 -95 -2 132 72
5105G2j35k3K24rj58j56K67O7o6k32J5K58J08l24l6K13O3j89o8Q1J53j3k31j3
$$ 72 -63 -86 138 129 -29 -185 82 149 83 -149 -134 124 232 -92 -128 85 148 -41 -109 -28 125 112 -119 -132
5129a32K12N5j87l0L2K18p1k11L1K71k9k94LK55J2j56j46P3K25n0k44%K29J40
$$ -132 80 135 -52 -82 -50 168 97 -114 -83 188 159 -135 -132 123 135 -21 -167 -94 131 81 -163 -163 66 206
5153B06k18j83K64J85k79j53J00K34l7k83Q8K22M7k30j69K09J61r9k87J04L16
$$ 206 -12 -195 69 254 -25 -178 -78 156 119 -164 -76 146 193 -37 -206 3 164 65 -222 -118 198
5174A98r8k49M2J71J41k63j82K57J64j69j02j6J76J07k50j41K33J91k12j48P7
$$ 198 100 -149 -107 64 205 -58 -240 17 181 12 -90 -106 70 177 -73 -214 19 210 -2 -150 -73
5195g3J74j2j06j34J97J65k26j10J49P3r3j08J8J77M8j86j18K63N8j26j72Q9J75
$$ -73 101 89 -17 -151 46 211 -15 -125 24 97 4 -104 -86 91 139 -47 -165 98 156 30 -142 -53 122
5218A22o4p5m3L2K23j10k80K25L9o1m7l3J33N7j87j16J76Q1pj36j04K38J22k83
$$ 122 58 -17 -60 -28 195 85 -195 30 69 8 -39 -72 61 118 -69 -185 -9 72 65 -71 -175 63 185 -98
5242i8l9J73J47j41k18P2K41l1k61K9J88O1j82j28J52K45n3l31Q3L05p2k58q1
$$ -98 -137 36 183 42 -176 -104 137 106 -155 -126 62 123 -59 -187 -35 210 157 -174 -91 214 142 -116 -197
5265a97K83J03j69k21J35K15n4k55qK68J34l03o9J72J49r0k54N5L27l4l32K2K68
$$ -197 86 189 20 -201 -66 149 95 -160 -168 100 234 -69 -138 34 183 93 -161 -106 221 187 -145 -123 145
5288A45Jj66r3J14J68j05k35J01K21mk45n7J85J22k20p8J11O6N8k02r4K45J16
$$ 145 146 -20 -113 1 169 64 -171 -70 151 147 -98 -155 30 152 -68 -146 -35 31 89 -113 -207 38 154
5311A54k22o4J33Q0K4j53q6K17N2k23n3K28K0l4j41l9K40k4k48L4J11Q6lk08J28
$$ 154 -68 -132 1 81 105 -48 -134 83 135 -88 -141 87 107 73 -68 -107 133 109 -139 -105 6 92 89 -119 9
5336IJ83j56j58N6R4M5j01j68K22K36k19j57N6J35Qj63j24K02K12k52j21R3K60
$$ 9 192 36 -122 -66 28 73 -28 -196 26 262 43 -114 -58 77 85 -78 -202 0 212 -40 -161 -68 192
5359A92j36k05K0K69P0l44KR9K10j12k61J30K89j59k06J3J89J00j84j90J77K88
$$ 192 56 -149 -129 140 210 -134 -132 -33 177 65 -196 -66 223 64 -142 -129 60 160 -24 -214 -37 251
5381B51k44j65R9J68K0k15j18L11J65k57j74J26K35p6k69l8K61J03k45n5J78R3
$$ 251 7 -158 -59 109 129 -86 -204 107 272 15 -159 -33 202 126 -143 -181 80 183 -62 -117 61 154
5403A54r9k02J0L54q9k59K9J32R1j35j42J41K41j76j88O0J51O1j16j70J97J14
$$ 154 55 -147 -137 217 128 -131 -102 30 121 -14 -156 -15 226 50 -138 -78 73 134 18 -152 45 159
5425A59k13j15J39R3L8j72j30K80K0j58l7P0J16kj28j93K99M8k53N3R9P2M3k47
$$ 159 -54 -169 -30 63 101 -71 -201 79 99 -59 -96 -26 90 88 -40 -233 66 114 -139 -86 13 85 128 -119
5449a19k1K47N1k17n2N4J48M9j71n0K46n0k18o7K83Q9j91j90J69K34j37j86n2
$$ -119 -140 107 158 -59 -111 -57 91 140 -31 -81 165 115 -103 -170 113 202 11 -179 -10 224 87 -99 -151
5472a51K21Q8k10k25L59N4j29j55O8K80j03k55n4L53jk30q8J37K70j71k57R7K53
$$ -151 70 158 -52 -277 82 136 7 -148 -80 200 97 -158 -212 141 140 -90 -178 -41 229 58 -199 -102 151
5495A51Pk83k7K23O9j19k25J72J52j08j88P4K03P9k12j25J86J65j70j43J30J30
$$ 151 158 -125 -152 71 140 21 -204 -32 120 12 -176 -102 101 180 -32 -157 29 194 24 -119 11 141
5517A41q5j92N0J61M7k00j8N0J43nj78j6K35o3j14r0J31J68j28r4K0J85p6j79
$$ 141 56 -136 -86 75 122 -78 -96 -46 97 92 -86 -102 133 70 -44 -134 -3 165 37 -57 -37 148 72 -107
5541a07J9J24Q5r9k10J76J75j21j40KJ07J36j72n4P4J59j19j33L7J64L3j75o5
$$ -107 -88 36 121 22 -188 -12 163 42 -98 -96 11 147 -25 -79 -5 154 35 -98 -61 103 136 -39 -104
5564a04J24J13j57j40M9K07Qj96MR3J37j49j78J63J31k7k23Q0J91J9k33j22K17
$$ -104 20 133 -24 -164 -115 92 100 -96 -92 1 138 -11 -189 -26 105 78 -145 -65 126 145 -88 -210 7
5587GJ45j74q6l8L05n9k27o2K89O8k52p1J93J09q8k06R3K24q4j94j2K65Rj58j19
$$ 7 152 -22 -108 -146 159 100 -127 -189 100 168 -84 -155 38 147 59 -147 -54 170 86 -108 -120 145 154 -4 -123
5612a23P9K04j32k03R8K17n5j84l3K24K8j56k0K4J20l8j68J0K02k9l7j71J75J18
$$ -123 -44 160 28 -175 -77 140 85 -99 -132 92 120 -36 -56 -32 88 50 -118 -108 94 65 28 -143 32 150
5636A50j48q8M9J53r4q8rJ22O6o8j52O3J24l2j12O5M9mj08q1J14J71j18j46M3
$$ 150 2 -86 -37 116 22 -66 -75 47 113 45 -107 -44 80 48 -64 1 50 46 -62 -143 -29 142 24 -122 -79
5661g9J14L3q0n7J1J84j29j34J18J14mk20P0R1P7j30j1QJ03k6k75J23J53P4j66
$$ -79 35 68 -12 -69 -58 126 -3 -137 -19 95 91 -129 -59 32 109 -21 -32 -24 79 53 -222 -99 54 128 -38
5686c8LL8J66j03k77Q5K59m5k41L2K28O0j47j68J46K05j76j84O3K03O9l14l7J83
$$ -38 -35 3 169 66 -211 -126 133 88 -153 -121 107 167 20 -148 -2 203 27 -157 -94 109 178 -136 -173 10
5710A0J65j82j66R7K17l7k37K3K44Nj50j00R2J30l0k39R4K18p7j64L5N6J48j28
$$ 10 175 -7 -173 -76 141 104 -133 -110 134 139 -11 -111 -19 111 81 -158 -64 154 77 -87 -52 4 152 24
5734B4j39J12J63j45p5n9K24R3k47j24K10J26j77p2J08R7m9k21P4J19j6m8oLQ3
$$ 24 -115 -3 160 15 -60 -119 105 198 -49 -173 37 163 -14 -86 22 119 70 -151 -77 42 26 -22 -28 -25 58
5759E8Rj32MJ92l0j08o2J04P8j17j41J65P6oj25r3J13J45o5j26P1R2j2m9j07J00
$$ 58 67 -65 -61 131 101 -7 -69 35 113 -4 -145 20 96 90 -35 -128 -15 130 65 -61 10 102 90 41 -66 34
5785C4J25k00q8K11k5m7j11k5K00P9k44p2J60J49j50j02K3J89m0j89L2J23J17
$$ 34 159 -41 -129 82 57 10 -101 -126 74 153 -91 -163 -3 146 -4 -106 -83 106 66 -123 -91 32 149
5808A49j87j60J49J82j07j39M5J53jj06j74K55J43k69o1J22J09q3j27j1K16O9
$$ 149 -38 -198 -49 133 26 -113 -68 85 84 -22 -196 59 202 -67 -128 -6 103 20 -107 -118 98 167
5830A67k44p8K33N4j04j51J02J52n1j86NK33k1j52q5J46K08j30k35J11J83n3k03
$$ 167 -77 -155 78 132 28 -123 -21 131 80 -106 -101 132 111 -41 -126 20 228 98 -137 -26 157 104 -99
5853i9n0J54J16j33j13J44J41j03j20j8J06O2r7j13J26J08j38r5Q2J13k3j02M4
$$ -99 -149 5 121 -12 -125 19 160 57 -63 -81 25 87 -10 -123 3 111 -27 -122 -40 73 50 -52 -8
5876hM2K4Pj72M6K17p7k04R0R5l8J5r6M2P8o0n0L4R9n9l3r6P5J67j14j46P7J36
$$ -8 34 58 65 -107 -61 156 79 -125 -35 60 22 37 -59 -17 61 1 -49 -15 84 25 -8 -104 -29 138 24 -122 -45 91
5904I1J4j24q7J80L7q7k01J56J90o7k06n5K98k4j91j12J92J66o4k73O4K04j6k11
$$ 91 105 -19 -106 74 111 24 -177 -21 169 102 -104 -159 139 115 -76 -188 4 170 106 -167 -103 101 85 -126
5928a26L5J06R6j37k05K33K46j94k23M9K20P6k60j54L03R5k35p7J57P5N9k18n4
$$ -126 -91 15 111 -26 -231 2 248 54 -169 -120 100 176 -84 -238 65 160 -75 -152 5 80 139 -79 -133
5951a33K02L2j67o6J37P0r1j21N0K46j23j63R8Q9N5j13m8K5J15o6j19N3J23%q2
$$ -133 69 101 -66 -132 5 75 -16 -137 -87 159 36 -127 -29 60 115 2 -46 -21 94 28 -91 -38 85 85 3
5976Cj64J86O7j74M1K1J37l9j48k5J63K8r1m0j7J17K0k18Q1J97p1j45QQ0J36m9
$$ 3 -161 25 92 -82 -41 -20 117 78 -70 -95 68 96 5 -35 -52 65 85 -133 -52 145 74 -71 -63 17 153 104
6002A04j81p6K48oj32N2m2R2mk25J53J44j6k11qJ84P9j94j27J99N7n2j08LJ70
$$ 104 -77 -153 95 89 -43 9 -33 59 55 -170 -17 127 111 -100 -108 76 155 -39 -166 33 90 38 -70 -67 103
6027A03R4k97j9K19N0k10q7J12J32O4l25M8K08mk12J1Q1J36p5j77L4K50n1j58
$$ 103 197 -100 -119 100 150 -60 -147 -35 97 161 -164 -116 92 88 -124 -113 -32 104 29 -148 -114 136 85 -73
6051g3l6J41J01j84j05J48J99k43o3N1J64n4j13p5K66Oj54p2M2K13l9l10J95J26
$$ -73 -109 32 133 -51 -156 -8 191 -52 -115 -64 100 46 -67 -142 124 130 -24 -96 -54 159 120 -190 5 131
6075A31o5j62J4Q8J09o9j80J38Q8J7j86L7K4J07q6j87J99O9j59O3p2J11J07j98
$$ 131 66 -96 -82 6 115 46 -134 4 92 109 -77 -40 -16 91 5 -182 17 86 -73 -10 -82 29 136 -62
6099f2m9J55O2j29k0k5J24R6k68JJ96K8q8p5l9R3J09j67o3J53J44j94k1l0K11
$$ -62 -111 44 106 -23 -43 -68 56 152 -116 -115 81 109 21 -54 -93 0 109 -58 -121 32 176 -18 -39 -69 142
6124A42m0j93R5Q7Po1j67J46J33j58j35J05J23m9q0q1J55J28j87j34K17Q7k8j86
$$ 142 102 -91 4 91 98 37 -130 16 149 -9 -144 -39 84 35 -45 -126 29 157 -30 -164 53 140 112 -74
6148g4l5J90O8k95J6K12N3j10j43O5J13K2j84K9K38m2j39j08J36J28j15j53J44
$$ -74 -109 81 149 -146 -130 82 135 25 -118 -53 60 82 -102 -73 165 123 -16 -124 12 140 25 -128 16
6171A6J00l3j22j3J35N6k28m4J38K7L1j32K2J21K7j94j8J67R7j82j04J05J86r3
$$ 16 116 83 -39 -52 83 139 -89 -133 5 32 63 -69 -47 74 101 -93 -111 56 153 -29 -133 -28 158 65
6195F5j99O2J26lm9p9P2J57q8j37j2J15M0o4j17J63L1p3n3pJ66j58%k3K0P5o8
$$ 65 -134 -72 54 51 2 -77 -5 152 64 -73 -85 30 70 6 -111 52 83 10 -43 -50 116 -42 -42 -65 -45 30 -38
6222c8j8L5J18k5j62M6J10l2m5l8M1J29j24j63J13J07M2j76p1J88J21j91r5J05
$$ -38 -56 -21 97 72 -90 -44 66 34 -11 -49 -8 121 -3 -166 -53 54 96 -80 -151 37 158 -33 -128 -23
6246b3J32q0j37k4K02K5j42n6J21J07p6q5m1J89M3l08K9K01O0k06jR0J39j49j35
$$ -23 109 29 -108 -132 70 95 -47 -103 18 125 49 -36 -77 112 155 -153 -124 77 137 -69 -70 20 159 10 -125
6271a25R1J37Kk33rK21Qj08j72J70J45j24r2Q7R7N9k24j25K84k9j00l5jJ93K4
$$ -125 -34 103 105 -128 -137 84 92 -16 -188 -18 127 3 -89 -2 95 154 -70 -195 89 60 -40 -75 -76 117 141
6296A41k57K7K47j12l3q2J3K39k23j17J54J08r3o9J0J4J66j20j76R5J47m3j25
$$ 141 -116 -89 158 46 13 -69 -56 183 -40 -157 -3 105 12 -57 -47 -33 133 13 -163 -68 79 36 -89
6319h9O7L7J33j80l9J05M7p0J5p3J12K1j36n7J24N9rj57K5J10nj19N1L1O7l3j30
$$ -89 -22 15 148 -32 -71 34 81 11 26 -47 65 86 -50 -107 17 76 67 -90 -65 45 40 -79 -28 3 70 37 -93
6346i3J00J13m7j55k7J65N4j30j29J47J73j38j42J07J34q8q8o1J88K7r1o6QJ98
$$ -93 7 120 73 -82 -109 56 110 -20 -149 -2 171 33 -109 -2 132 44 -44 -105 83 110 19 -47 -39 159
6370A59j32j10o8K11O9k10m7J93Jn0j50L9J94J2k58N3K04l7r0j28J42J68j12k12
$$ 159 27 -83 -151 60 129 -81 -128 65 66 16 -134 -95 99 111 -147 -94 110 73 -17 -145 -3 165 53 -159
6394a59J23J18q3j22N1J08J43j54j04R2Q7j23k3j48L42p7j82jJ28N6n3n2p1K09
$$ -159 -36 82 -1 -123 -72 36 179 25 -79 13 100 -23 -46 -194 148 71 -111 -112 16 72 19 -33 -104 105
6418A05jj70m7J73L0j00j30J41LO1j64J42jk6o0k2Q8M8q2m2PJ05J1r1q0P4J18
$$ 105 104 -66 -113 60 90 -10 -140 1 4 65 -99 43 42 16 -44 -66 22 70 -12 -54 -47 58 69 -22 -102 -28 90
6445I0j05l8J17j1K4j18nJ06L4j10r2J47P3r7q6j8J66j2r7l7R5K5M4j81K4K47
$$ 90 -15 -53 64 53 77 -41 -46 60 94 -16 -108 39 112 15 -71 -89 77 65 -32 -69 26 51 95 -86 -62 185
6471A85j08j30nJ30Q2j58j18J67J71j95j54J43L2N8q9j84K28Q8j13p4k2J47k4
$$ 185 77 -53 -58 72 154 -4 -122 45 216 21 -133 10 42 100 11 -173 55 143 30 -44 -66 81 57
6494E7j68RK33m2j19n3J23O8o2j90O3K23p4j68kJ35Q6j52j34J90J71j75j44P4
$$ 57 -111 -102 131 89 -30 -83 40 108 46 -144 -81 142 68 -100 -102 33 119 -33 -167 23 194 19 -125 -51
6518e1J73p5j14m2J95Mj02j4N0L9K3j02p0K07k7j13m6P7K2m9n5L5J09Kj31M6K8
$$ -51 122 47 -67 -109 86 90 -12 -26 24 63 86 -16 -86 121 94 -19 -65 12 34 -15 -70 -35 74 76 -55 -9 19
6545A9P6n7k33J44J18m0o4K8L8O3n6j22O6J22n3r3l6R2J32j89m6J08N7m9j34O4
$$ 19 95 38 -195 -51 67 27 -37 -9 29 92 36 -86 -20 102 49 -44 -80 12 144 -45 -91 17 74 25 -109 -45
6571d5J31Qj75j9J73Qq5r1JK42n2k32Q5J68j39l7k1R9J12j36j15J62L8k1o1j05
$$ -45 86 94 -81 -100 73 81 -4 -95 -94 148 96 -136 -51 117 -22 -59 -80 19 131 -5 -120 42 80 59 -2 -107
6597a07J36Q5j54q4J71Pl4j23L8J78o6j21j4K18n7r0j9j9J76p9j17O8J07n2p2
$$ -107 29 114 -40 -124 47 54 20 -103 -65 113 47 -74 -88 130 73 -17 -36 -55 121 42 -75 -7 100 48 -24
6622b4n1J19J01o9k04J65K8Kj01N0K4J01j01j88K34L5j26k4n8J68nr8k8O6J4l9
$$ -24 -75 44 145 76 -128 37 65 67 -34 16 40 141 40 -148 86 121 -5 -29 -87 81 76 -22 -50 16 30 -9
6648inm2J80p4j56J09K5J9l3p8j1J24j3j17K4J03mq9J7K1R1j00n9mJ27M8q0p7
$$ -9 -14 -56 124 50 -106 3 28 47 14 -64 -75 49 36 -81 -57 46 42 -47 -30 -9 82 -18 -77 -81 46 94 14 -63
6676f3Q0J28j77m1J02K2R7j35j33J63J26k39k9J17M1N6j63r2K38K6k74P4J38M5
$$ -63 17 145 -32 -73 29 51 148 13 -120 43 169 -70 -99 18 59 115 -48 -140 98 124 -150 -76 62 107
6700A07n8j74N7J69l9j51P0P3O0q1j64R3J57j41p9J08k4O8q9r6K07L7k02p1J89
$$ 107 49 -125 -68 101 62 -89 -19 54 114 33 -131 -38 119 -22 -101 7 -17 51 -38 -134 73 110 -92 -163 26
6725B6M2p2j26J9K18L1k09p3K75q4o7k0K8O4Qk02J56lQ0p9p1O5N9j07q1J21J1
$$ 26 68 -4 -130 -111 107 138 -71 -144 131 47 -20 -40 -12 52 60 -142 14 11 91 12 -59 6 65 -42 -123 -2 9
6752IL5Kj07R4Q5j23m3J16rn7k6l4J00O2j30r1J54n0l7km5J03O5q3j7O4kM2j73
$$ 9 44 46 -61 33 118 -5 -48 68 59 2 -24 -58 42 104 -26 -117 37 -13 -50 -52 -97 6 71 -12 -29 35 33 75 -98
6781i8R5Q0m7j09j8J32p1J00j09KQ2J1q9J9R5j9m8o3N9J06j20j14R3J05Qj14o7
$$ -98 -3 77 30 -79 -97 35 -36 64 -45 -43 39 50 -39 -20 75 56 8 -55 4 110 -10 -124 -31 74 82 -32 -99
6808i9J97Lj47n9M1J45l9j55M8J79n6r8n4J20P5j30l2O5R7r1r4Q5M7l4k9p7J40
$$ -99 98 101 -46 -105 -64 81 42 -113 -65 114 58 -40 -94 26 101 -29 -61 4 101 10 -84 1 48 14 -15 -92 48
6835D8M6j54l9L8J42m2j23J0J36L3r0j49J85L0m1j00K7R0J5m8m0Q9Qr6k5J1J52
$$ 48 94 -60 -99 -61 81 39 -84 -74 62 95 5 -144 41 71 30 -70 -43 47 62 14 -26 63 71 -25 -50 -39 113
6862A13l9j53O2J08o5q6K4K1J03n3n0j9O9N9r2ql3J35r3n6L3M3mj06K8K9J30p8
$$ 113 74 -79 -17 91 26 -60 -36 -15 88 35 -15 -34 35 94 2 -6 -39 96 3 -53 -20 23 19 -87 -59 -30 100 22
6890B2j23K4J46j01p6J32MN5l9j31O6N8j2j29R5RL1o9mM8M1j8k03P6J41%j98J10
$$ 22 -101 -77 69 -32 -108 24 28 83 44 -87 -21 37 25 -104 -9 0 31 -38 -42 6 47 29 -174 -98 43 43 -155 -45
6918d5J01l6M0j66N4J67j28m5K5J02k7j39O9M5J10j41m0R1L7l8j69J09K8lj7j25
$$ -45 56 20 60 -106 -52 115 -13 -58 -33 69 42 -97 -28 17 127 -14 -54 37 74 36 -133 -24 4 1 -16 -141
6944a41J55L2p6m5P0L9K2j01k6J41Nj32m5J51Ml8p7j3J37m7j16N2R3J0o6q4J60
$$ -141 14 46 -30 -75 -5 34 56 -45 -71 70 75 -57 -102 49 53 15 -62 -75 62 15 -101 -49 44 54 -12 -96 64
6971F4L6j18l0m0Q5N4m4m9L9J11j69K5K2j5R7q2m6P1O3j05L1K2Mmn7m5R8K7n7
$$ 64 100 -18 -48 -88 -3 51 7 -42 -3 108 -61 -36 -14 -29 68 -14 -60 11 74 -31 0 22 26 22 -35 -80 18 45 -12
7000a2J5j1L0J03j38n1Q9Mn6j8K6M8m0p8R0M4K4p7m8M3N9m9k4K8J15l9j42l4J55
$$ -12 3 -8 22 125 -13 -64 25 29 -27 -45 -19 29 -11 -89 1 45 69 -8 -56 -13 46 -3 -27 1 116 77 -65 -99 56
7029E6k2o9p8J89Qj28OK7R1m1p3o2J77M0j70kO1lRj07Q6J39o9r1LL2R0j22r0J23
$$ 56 34 -35 -113 76 84 -44 -38 -11 80 39 -34 -96 81 121 -49 -51 10 7 16 -91 -5 134 65 -26 -23 9 99 -23 -113 10
7059A0R4o6j20k5J65Jj14j0R5L0j34K0O2L3j0j12M8J34j10r4J00K2P7m2r0K1O8
$$ 10 104 38 -82 -107 58 59 -55 -65 30 60 -74 -54 8 41 31 -81 -33 101 -9 -103 -3 19 96 54 -36 -15 53
7086E3j0j13K2N4RQm8K8J03j15Lo8J01j2J2j08N6J14j62Q9k8K6J5l3n6R2j5Mj10
$$ 53 43 -70 -48 6 15 23 -25 3 106 -9 -6 -74 27 15 27 -81 -25 89 -73 16 -12 14 29 -4 -60 32 17 21 -89
7115h9L0Q6K6j12k1M5O1k8l5j3J16k3j30J0J46l1l2r9P7J3Lj18J56P5r7j0r0J58
$$ -89 -59 27 53 -59 -80 -35 26 -2 -37 -50 66 43 -87 -77 69 38 6 -93 -16 -3 0 -118 38 113 16 6 -84 74
7143G4k3k7j39J72L5J0j23qQ7jj42LJ35n4K6nq9J96j00j07k9J50Kp0j9L7R4l3
$$ 74 51 24 -115 57 92 102 -21 -29 58 57 -85 -82 53 -1 25 20 -69 127 27 -80 -109 41 43 -27 -46 -9 85 52
7171E2j01KJ08n3m7j9N2Q8q4m4O2M3n8q6K6J19n0kRo3J23m8r6O6RKm5j9M8O4n9
$$ 52 -49 -47 61 8 -39 -58 -6 82 -2 -46 16 59 1 -85 -59 60 10 8 17 -46 77 29 -67 -1 8 10 -35 -54 -6 58 -1
7202am6j2O5l6LRJ5Jmj9K4N3n0l3M2kK0Jo3N4k2l8pM7J3rm5p6J92n9n3L4j5P5
$$ -1 -47 -59 6 -30 -27 -18 -3 -2 -6 -25 -1 52 2 -31 11 9 29 30 -33 21 -1 -39 -46 1 14 5 -40 -116 76 17 -36 -2 -17 58
7236E8p4J5j8N4op8j9P7P0m6j18N7R2Rj10rR0j2k6j30J24P8o4k9J9NJ4o9p2J61
$$ 58 -16 -1 -19 35 29 -49 -68 9 79 33 -85 -28 64 73 -37 -46 44 32 6 -124 0 78 14 -15 4 9 23 -46 -118 43
7266D3M0j47pM9Q2j7j26P0P6L8j68lN9P7p0n4O8N6M9j68M0L2j4J7k4N8j6m9m3
$$ 43 83 -64 -71 -22 60 43 -83 -13 63 101 -67 -70 -11 66 -4 -58 10 66 115 -53 -13 19 5 22 -2 56 40 -9 -52
7295e2L8L2P0j31N5O8k6o3o2J16k9Jo3j8J17j06N9o3L7O6j3jr5J49o9p4O2Rk5
$$ -52 -14 18 88 -43 12 80 54 -9 -71 45 16 17 -46 -64 53 -53 6 -57 -20 46 33 32 -63 86 17 -57 5 14 -11
7324a1Jl2M3J9J5j51O4M1N1n3o5R3L7k4rq2P3N6r7l9N0M6pn8M7L3O9j68K0L9L3
$$ -11 -10 -42 1 20 35 -116 -52 -11 40 -13 -78 15 52 28 19 -63 10 66 -31 -70 -20 26 19 -39 8 41 110 -58 -38 1 34
7355C4j9l8p1R0P3r7l7J07l1J5o1mJ76j35r6K9J30j0q6j2J7J22j12o1J15M6r7
$$ 34 15 -23 -94 -4 69 -28 -65 42 11 26 -35 -39 137 2 -94 -65 65 55 -31 -43 -26 96 -16 -77 38 84 -13
7382a3p8N7O3K7j04o1J14R1j05r3M2P6N7j49l0Q3O0m9k2P1L2j13NN3L5j7o3o1
$$ -13 -91 -34 29 56 -48 -109 5 96 -9 -102 -60 16 73 -76 -106 -23 37 -12 -34 37 69 -44 -39 14 49 32 -31 -92
7410i2O4O3m6jK3J05j08p5M0N4J6n4p9R3N8j06M3m1N8P0l8j62J52J5o7lk7O0L7
$$ -92 -28 35 -11 -12 11 116 8 -67 -27 27 43 -11 -90 3 61 -45 -2 -43 15 85 47 -115 37 52 -15 -18 -45 15 52
7439E2n6n8J82q6pq0P2l2Np0j6J19On0m5L9N2m1o8M9K6M4j02L8L6K4j9j25O2Q5
$$ 52 -4 -62 120 34 27 -53 19 -13 -8 -78 -94 25 31 -19 -64 -25 27 -14 -82 -33 -7 37 -65 -27 9 33 14 -111 -49 36
7469C6r6N2l5R8P9j86j%J32j27O3n4J03M4j19jO6ro1o3Q7P5j0j83L6J76m0r9J7
$$ 36 -60 -8 -43 55 134 -52 -53 -53 79 -48 15 -39 64 108 -11 -12 54 45 -16 -79 8 83 73 -110 -74 102 62 -37 -20
7498b0oJ24p4o3M0P1p0n3mL5O9o6m8Q6k1l3l4L8N4J0n0j4j4P6J6n8J5N0r4j5L2
$$ -20 -26 98 24 -39 1 72 2 -51 -55 -20 49 -17 -65 21 0 -33 -67 -29 25 35 -15 -29 -43 33 49 -9 6 56 -38 -53 -21
7529b1N1K4j85J75m7N2m2m0J2N3k4n6L4M9l3Pl4J0J0L0m6M2J3k7l4RL0K7o1l0
$$ -21 30 54 -131 44 -3 49 7 -33 -21 32 8 -48 -14 35 2 9 -25 -15 -5 25 -21 21 34 7 -27 -18 12 39 -22 -52
7559e2QM9Oj5p1R6M6q4n8J3J48n3n6o0N0O7r5J7P0n3L1k2mL7N5j21J3N6K0r3n6
$$ -52 -44 5 11 -4 -75 21 67 -17 -75 -62 86 33 -23 -83 -33 34 -61 -44 26 -27 4 -18 -22 15 70 -51 -38 18 38 -55 -111
7590a11J10M9Lj71M2J21j9o9j8M3N8j8m6m0O2Q7j14l6J62o5r3JQ2L1j5j19N2M2
$$ -111 -1 48 51 -120 -78 43 24 -45 -63 -20 38 20 -26 -66 -4 83 -31 -67 95 30 -63 -62 20 51 36 -83 -31 11
7618A1R9k12M3R7n3P0j64J14J15q0p7L1L4L3j28M8l0P7kq5O1jn5J23p6k5R1o0
$$ 11 110 -102 -59 38 -15 55 -109 5 120 40 -37 -6 28 61 -67 -19 -49 28 26 -59 2 1 -54 69 -7 -32 59 -1
7646apk9P9r2J19j52J8J43j3p0nN0m4k3L5k3N8n6J3l1M9M7n2n7L7L2n5l7L4k6
$$ -1 -8 -37 42 -50 69 -83 -65 78 65 -5 -10 40 -4 -27 8 -15 43 -13 0 -31 18 65 13 -44 -7 25 -30 -67 -33 -59
7676e9M4Jn5R3m5MmK5K7Op7N9R7j40o9J02K8j7l4o5P3R6p8j15R6J20q4o1K0L8
$$ -59 -15 -14 -69 24 -21 -17 -21 4 31 37 -40 19 116 -24 -93 9 37 20 -14 -79 -6 90 12 -103 -7 113 29 -32 -12 26
7706B6Q6j80N6N6K6q9NQJ21q9l5k9Q9l1q5n0J32Q1j47K5J9K2k6k0mK6J08j23j08
$$ 26 112 -68 -12 44 70 -19 -14 -6 115 26 -9 -38 51 20 -65 -115 17 98 -49 -24 -5 17 -9 -29 -33 -7 101 -22 -130
7735a30J81K1r9Nm1J06m7q2RJ10K9o5l0L4j9Q1j17lP4K9k0p1K2P6p7pN9O5j36
$$ -130 51 72 -27 -22 -63 43 -4 -86 -77 33 62 -3 -33 1 -18 63 -54 -57 17 46 26 -45 -23 53 -24 -31 28 93 -43
7764d3k2M8m8M1J7K9l6Ok7N2l9N5lMq6Q6k4O9j37N7K1L3m7l3lP6m2m4k7J09j9
$$ -43 -65 -17 -65 -24 -7 22 -14 -8 -35 17 -22 33 30 34 -52 34 10 79 -58 -1 20 53 6 -27 -30 46 4 -40 -67 42 23
7795B3j14O5Q8J4o7n5L0J08o6j34L7Q3N3j06qN5L0kp6k0J20j3j67J40M5l0l2O1
$$ 23 -91 -26 62 76 9 -46 -16 92 26 -108 -71 12 65 -41 -49 6 36 34 -42 -62 58 45 -122 18 63 33 1 62
7823F2p2L5J4j38P7Q9m4m5J6j3P0o6l7L5Q1p4k3K2J1M3lo4LK0j7k7P3m0jn0Q7
$$ 62 -10 25 39 -99 -22 67 23 -22 -6 -19 51 -15 -52 -17 64 -10 -33 -11 0 43 40 -24 -21 -1 -18 -45 28 -12 -13 -63 24
7854B4M8o7L8r3M0J24j27r8J4J60j5o0n2N3N0l7l3M9mK7m6o1R9J0l0m1L5J1k1
$$ 24 72 5 43 -50 -10 114 -13 -111 -97 63 48 -12 -64 -11 39 2 -31 18 14 41 -5 -66 33 43 13 -28 7 18 -3
7883cmJ6l3N3j8jJ9j8l0K4m9jN5k4K7l4Qj1Lq4J43l7nn5k7R9j4j10lJ37mk8pM8
$$ -3 -7 9 -24 29 11 10 29 11 -19 5 -44 -45 10 -14 13 -21 -13 -24 -21 -105 38 1 -4 -59 -86 13 -1 -111 -114 23 19 -9 -16 32
7917C2k9rj17J18QKn1K8O0N9j05m3J4J31j22M6%J6j00O5k6P5l1q9M2J0N7m2j02
$$ 32 3 -6 -123 -5 3 5 -46 -18 42 101 -4 -47 -33 98 -24 22 22 38 -62 3 -23 52 21 -68 -26 -16 41 -1 -103
7946a03Q7J03q1q2N2O8J4r6Rj4R7r1nR9r6N4m7m6J00rl4l4J04j2n5J7n2N4N8j04
$$ -103 -16 87 6 -76 -24 44 58 -38 -29 -43 54 -37 -42 57 -39 15 -32 -78 22 13 -21 -55 49 37 -18 -1 -53 1 59 -45
7976d5J6Qo6O3j1l7J50q2J1J3j5L0p5Q3p7P9l0MNm7J1M4j24P5K7J9l2M2j8k2Q
$$ -45 -29 -21 -87 -24 -35 -72 78 -4 7 20 5 35 -40 43 -34 45 15 19 24 -23 -12 32 -92 -17 10 29 -3 39 21 -1 7
8007Go7K2Q8n7m9J02Mmn2k9N1O5j56J7L6K9p5Q0o6M8lp3M3J5M2o2MK9j2J7p7O1
$$ 7 -60 -38 50 -7 -56 46 50 46 -6 -35 16 81 -75 -58 -22 7 -68 12 -54 -6 -9 -82 -39 -24 18 -44 -40 -11 -23 -6 -83 -22
8039b2RK2j5jJ7J1qm2LN2j3j4k7L5L2n4K2N8ql6p7J2R3L5j01L0J6o1mN1j8K7j
$$ -22 -13 9 -6 -7 10 21 13 -29 -26 26 13 -1 -28 7 39 -15 7 65 57 21 -56 -44 49 84 -17 13 29 -32 -36 15 -3 24 23
8072B3j21J36m6Jl8m1J01J9l3l4J3lNOm3L2N3n3lJ00m4n4N7j21J47m0pq0J01l5
$$ 23 -98 38 -8 -7 -45 -86 15 34 1 -33 -20 -23 -18 -12 -55 -23 30 -23 -26 74 30 -24 33 -88 59 19 12 -68 33 -2
8102bN0k5o8Q8n4k6O6j1Rm3K2K8R3j08k4M9j6j9j5n9j4P2K1l1nM3k4Pp6J00%l3
$$ -2 48 23 -45 43 -11 -37 29 18 27 -16 6 34 127 19 -5 44 28 9 -6 -65 -79 -7 14 -17 -22 21 -3 4 -72 28 28 -5
8134eJ7m5J4N0r3kL0M9Pk1P0j8l3l6J6j5M8o5N4L6m2j4m5k5R8J7r6L6L1o3R2l9
$$ -5 12 -33 -19 31 -62 -64 -34 15 22 1 71 53 20 -16 0 -15 33 -32 22 58 16 2 -43 -68 30 47 -49 -13 18 -45 47 8
8166Hr0R7L9j04P7j0k4n4K1J5Q7r7j8M2J3k0K1m1L2J0P9j14O5k2j8
$$ 8 -82 15 54 -50 27 17 -7 -61 -40 -25 62 -35 -53 -11 2 -18 3 -38 -6 4 83 -31 34 12 -6
8191f
$$ Imaginary data points
##PAGE= N=2
##DATA TABLE= (X++(I..I)), XYDATA
0@%%%Qk4L2l2M0n6P2r3J17j39J67k07K54l04L61m30N06n88O84p97R20j053J206
$$ 0 0 0 0 8 -16 16 -16 24 -32 40 -53 64 -75 92 -115 139 -165 196 -234 272 -316 368 -429 491 -562 644
26F44j377J563j768J997k252K530k833L165l530L934m379M865n392N971o615P328
$$ 644 -733 830 -938 1059 -1193 1337 -1496 1669 -1861 2073 -2306 2559 -2833 3138 -3477 3851
42C851q111Q977r945J1030j2256J3653j5257J7119j9316K1952k5181K9250l4552
$$ 3851 -4260 4717 -5228 5802 -6454 7199 -8058 9061 -10255 11697 -13484 15766 -18786
55a8786M1762n2159O8493r7837J65639n62758j49360J469984r49067l43947P83763
$$ -18786 22976 -29183 39310 -58527 107112 -455646 -605006 864978 -84089 -428036 355727
66C55727m54840o7820O03811p10192o7313P36609k78783k88921J53229j27989
$$ 355727 -99113 -166933 436878 -273314 -340627 395982 117199 -171722 -18493 -146482
76a46482L29290L9592o01512K50798N44978l65194l29844J73306K80292k6225
$$ -146482 182808 222400 -379112 -128314 416664 51470 -278374 -105068 175224 148999
86A48999l19589J05765K02138k38161J94022M5098n60637M65670N28860q84576
$$ 148999 -170590 -64825 137313 -100848 93174 138272 -422365 43305 572165 -312411
96c12411q4039Q01175l17644l02612K66661j32190J52790J35096m39188J42107
$$ -312411 -396450 404725 87081 -215531 51130 -81060 71730 206826 -232362 -90255
106i0255K64719k34601J52687r6769l08988N75709J7790p19859L75525L96449
$$ -90255 174464 -60137 92550 -4219 -313207 262502 280292 -439567 -64042 332407
116C32407l98233J7043J392o5424L79500k57340l24803M93352r0726k46438L79292
$$ 332407 -65826 -48783 -47391 -112815 266685 9345 -315458 177894 87168 -159270 220022
127B20022l52188j76572P75402l59429o65522P22482J95032n97761J57015J55814
$$ 220022 -132166 -308738 466664 107235 -558287 164195 359227 -238534 -81519 74295
137G4295j25059J82800j15308k10891K24224R8601r6242j12775p4550K76257Q8175
$$ 74295 -50764 132036 16728 -194163 30061 128662 32420 -80355 -154905 121352 209527
148B09527l79000K06K86457J9221j32172k04047J43709L49814l21334k29095L94700
$$ 209527 -169473 -169267 117190 136411 4239 -199808 -56099 293715 -27619 -256714 137986
159A37986r8947j33852L03159l48990j35330O70409k75770n70347N35729J90914
$$ 137986 39039 -94813 208346 -140644 -275974 394435 118665 -451682 84047 274961
169B74961l93047P8012j399p046K70452k51815k15267L59123j907j67883P2326
$$ 274961 -118086 -40074 -41473 -48519 221933 -29882 -245149 113974 112067 -55816 16510
180A6510j38270J07252K77677l43263j82036L93686M2117k41774n6061Q5313J94708
$$ 16510 -121760 -14508 263169 -80094 -262130 131556 173673 -68101 -124162 -38849 155859
191A55859q2505k59186J64097J36952j32782N5892q2229j10663L29172k4536m00824
$$ 155859 73354 -185832 -21735 115217 -17565 38327 -43902 -154565 174607 150071 -250753
202b50753J83419K68477j78484j06590J1481Q3878J38207j74530j29569K07731
$$ -250753 -67334 201143 22659 -83931 -72450 11428 149635 -24895 -154464 53267
212E3267J8729p9499K2361j20125Q1987K15757k23295j54145K40371N7773j12278
$$ 53267 71996 -7503 14858 -105267 -23280 192477 -30818 -184963 55408 113181 903
223I03p1559j9900J88735K4147k58979O8861J70093j03791J6734j5408j34779
$$ 903 -70656 -90556 98179 122326 -136653 -67792 102301 -1490 15244 -164 -134943
234a34943K10107R4459l13120K2257K50995o1987j12393k7653L9819J51419p0486
$$ -134943 75164 169623 -143497 -121240 129755 67768 -44625 -72278 -32459 118960 48474
245D8474j85377J10736J13787n9607l5509p2773L8770J83320j01714j96574J28963
$$ 48474 -136903 -26167 87620 28013 -7496 -80269 -41499 141821 40107 -156467 -27504
256b7504J46299o9061j22425k7699J58380P3470j95434m9410J57433K3049m5772
$$ -27504 118795 49734 -72691 -100390 57990 131460 -63974 -113384 44049 67098 21326
267B1326o3605n7388J57589Q3402k21652n0440J97435L5508j14634q4326N1515
$$ 21326 -42279 -99667 57922 141324 -80328 -130768 66667 102175 -12459 -96785 -45270
278d5270J59278m5910j87162N8909J44445k7149p8760n9131N1678J45356o9759
$$ -45270 114008 68098 -119064 -60155 84290 57141 -21619 -80750 -29072 116284 46525
289D6525j75572Q2046J51197m5859j21835k5081J24155Q0266j40556r0084J26808
$$ 46525 -129047 -47001 104196 58337 -63498 -88579 35576 115842 -24714 -114798 12010
300A2010P6499o7286q1399p533J15092N3709j45771o3030J38773O4611r3661q6441
$$ 12010 88509 21223 -60176 -67709 47383 101092 -44679 -107709 31064 95675 2014 -84427
312h4427M4164J22625j6988j42456N667J26218J4878q7125n7072N3857J03993
$$ -84427 -40263 82362 65374 -77082 -71415 54803 69681 -17444 -74516 -20659 83334
323H3334l8383j28386K8010J22487l114j01641l8168Q4739P7210p4649r7107N7904
$$ 83334 44951 -83435 -55425 67062 63948 -37693 -75861 8878 86088 11439 -85668 -27764
335b7764R8020k4571r2946j8443R1619N5631q9103p7488P4424Q7322m4660r4707
$$ -27764 70256 45685 -47261 -65704 25915 81546 -7557 -85045 -10621 76701 32041 -62666
347f2666P695J01723K5189j01871m9602Q9085O9769o3994q8764L3765J04471n285
$$ -62666 -54971 46752 71941 -29930 -79532 9553 79322 15328 -73436 -39671 64800 59515
359E9515j11019k1297J04757M7088q7143p2650O3324R5229l6426j10179Q344J14752
$$ 59515 -51504 -72801 31956 79044 -8099 -80749 -17425 77804 41378 -68801 -60457 54295
371E4295K0641j09407m9656R5138P5842p3978r6750M7842J10367j8048j14667
$$ 54295 74936 -34471 -84127 11011 86853 12875 -83875 -36033 74334 56286 -58381
382e8381j3237J09419M4839r6213p4694P7099R8781n4471j13679K8305J17618
$$ -58381 -71618 37801 82640 -13573 -88267 -11168 87613 33142 -80537 -52232 65386
393F5386J772j11404l4085R9241O4190q2136q7764N9846J01889l2200j07511r3
$$ 65386 67158 -44246 -78331 20910 85100 2964 -84800 -24954 76935 44735 -62776 -62869
405f2869J07271L1864j01179n7958Q8370P6058o6073q7558L5721R4830k925r8825
$$ -62869 44402 76266 -24913 -82871 5499 81557 15484 -72074 -36353 58477 55552 -43273
417d3273k6408R5939M8791q2394o5909N9160Q1003l1208r3373N905R7572J4755
$$ -43273 -69681 26258 75049 -7345 -73254 -14094 66909 35701 -57672 -51767 45805 60560
429F0560q8737l5282O8234N8320m3964q1488K3954R5849p466r4228j1632P9603
$$ 60560 -28177 -63459 4775 63095 19131 -62357 -38403 57446 49980 -44248 -55880 23723
441B3723L7672o2448o4528M8484Q0089l3666p9509Q718P0247K7682o4553o2273
$$ 23723 61395 -1053 -65581 -17097 62992 29326 -50183 -41465 28782 56464 -8089 -70362
453g0362O5101Q0260o0212p9482L7363P2969l9p3980l4507P9358N1163p1644n4554
$$ -70362 -5261 74999 14787 -64695 -27332 45637 45598 -28382 -62889 16469 67632 -4012 -58566
466e8566M1503O2784K90q4772l0126J06527L7262j05333l6263P5145M8355l5399
$$ -58566 -17063 45721 46011 -38761 -68887 37640 74902 -30431 -66694 8451 56806 21407
478B1407p6082J0675R8108k637r1950j0420O2463M5855l7249r3324L5273J20926
$$ 21407 -54675 -44000 54108 51471 -40479 -50899 11564 57419 20170 -73154 -37881 83045
490H3045m4481j11132L4432Q1743O554o4729n4578O9898P5950p2247o5660M1260
$$ 83045 38564 -72568 -38136 43607 50161 -14568 -69146 752 76702 4455 -61205 -19945
502a9945N4106J8232p1577o7247J09245P4608j25923n1500R4845M0307l5362o4436
$$ -19945 34161 52393 -19184 -86431 22814 97422 -28501 -80001 14844 55151 19789 -44647
514d4647o593R9177J0380j00910m438N9018K9695j0769q7856J87J34745k4386
$$ -44647 -51240 47937 58317 -42593 -47031 11987 41682 30913 -56943 -56756 77989 53603
526E3603j29211L7098Q2189m135m5579n4118N0354Q2968o9926n7707N0359J6414
$$ 53603 -75608 -38510 43679 39544 -6035 -60153 -9799 73169 3243 -54464 -4105 12309
538A2309K2495j6652r8931O7828J17413j16348p3310J03455K4090l3052k4889
$$ 12309 34804 18152 -80779 -12951 104462 -11886 -85196 18259 42349 9297 -15592
549a5592l2659O6518M3688q8264j5676N0709Q768J7363n3181n3441J11363L4335
$$ -15592 -48251 18267 61955 -26309 -41985 8724 17492 34855 -18326 -71767 39596 73931
561G3931j23533k548P9212J2395k9549o0391K4808Q8025m9736n3555M0107j1566
$$ 73931 -49602 -52150 27062 39457 9908 -50483 -25675 62350 12614 -40941 -834 -12400
573a2400L6490L2606j32706K0227J65809r0895j09824R5749K9257j7820q283p0624
$$ -12400 24090 56696 -76010 -55783 110026 19131 -90693 5056 34313 16493 8210 -62414
585f2414N6552Q7614r8939l4266O3000r391L5248k1432j08891J01026R9381j42655
$$ -62414 -5862 81752 -17187 -51453 11547 2156 37404 15972 -92919 8107 107488 -35167
597c5167m0909J00088J7890k1965o1523r698J12700k2508r4765M9468R715k93
$$ -35167 -76076 24012 41902 19937 -41586 -51284 61416 38908 -55857 -6389 3326 3033
609C033O0021j08109m4055J83790l2824j61895P7838P6094l6316j8959m8331L5157
$$ 3033 63054 -45055 -89110 94680 61856 -100039 -22201 53893 17577 -1382 -49713 -14556
621a4556Q8269p4239n4621N9248O532J9489j5081r1717P3823R3788j07373m8529
$$ -14556 73713 -526 -55147 4101 10633 30122 15041 -76676 -2853 90935 -16438 -64967
633f4967O7315L4813M176q7265k0415J44240l9482j15959R5558m008n2199J14135
$$ -64967 2348 37161 41337 -45928 -66343 77897 38415 -77544 18014 14006 -38193 75942
645G5942q5833j10342K04359J849j96937R3847P8724p3509K9183m0313l0377J28733
$$ 75942 -9891 -120233 84126 85975 -110962 -17115 61609 -11900 17283 -23030 -53407 75326
657G5326m8464j07485R5063J2849m1759M8528o4962k2863J27597l9430j09518
$$ 75326 26862 -80623 14440 27289 -14470 34058 -30904 -53767 73830 34400 -75118
668g5118N6520O6425j5627o5204j9028R5173l639q5691M9349L488l8143R2941
$$ -75118 -18598 47827 32200 -33004 -52032 43141 39502 -46189 3160 6648 -31495 61446
680F1446n0875j13557J42670M4782j45066K7548N6259j4256K7650p3020k2078
$$ 61446 10571 -102986 39684 84466 -60600 -33052 23207 8951 36601 -36419 -58497
691e8497J32982m8878r1124Q1737j2954j4200P0963j00325l0451J52892m6518
$$ -58497 74485 25607 -65517 16220 3266 -10934 60029 -40296 -70747 82145 35627
702C5627j04498N6960K8724K0044k2959r7992R2219Q4932j40593P971Q2696p4358
$$ 35627 -68871 -11911 16813 36857 13898 -84094 8125 93057 -47536 -39565 43131 -31227
714c1227N3316L2477j53108Q2209J37803j55427m6992J18785j0312j8880k1334
$$ -31227 22089 54566 -98542 -16333 121470 -33957 -80949 37836 27524 8644 -12690
725a2690m2916R1589K3778j11154K1507N6622j8037J1248l9740k8646Q8644N726
$$ -12690 -55606 35983 59761 -51393 -29886 26736 8699 19947 -19793 -48439 40205 45931
737D5931q1474m501M8187N1148n2873r5229J04144O9819j32822J6223P1374p4030
$$ 45931 -35543 -40044 8143 59291 6418 -88811 15333 85152 -47670 -31447 39927 -34103
749c4103N5263L3026j43523P3917J20275j37503k5243Q9234l0008K1707j5850
$$ -34103 21160 54186 -89337 -15420 104855 -32648 -57891 31343 1335 23042 7192
760G192q3548J08081M3436j39458L9143O9476o3020L5419j065q0368Q4039M6273
$$ 7192 -76356 31725 75161 -64297 -25154 44322 -18698 16721 15656 -64712 19327 65600
772F5600j04069p04N6549J0685j0735o4326K1187R1387o2413n1079O3862j6138
$$ 65600 -38469 -39173 17376 28061 17326 -47000 -25813 65574 3161 -47918 15944 -194
784a94N00L8504p9854J976J03629m9258o3451M0661K0225J9094k9043o4735P4729
$$ -194 306 38810 -41044 -39068 64561 15303 -48148 -7487 12738 31832 2789 -61946 12783
797A2783M8732r1112K447M2047k1848L4192j7868o9621P1892M5206p6222j1387
$$ 12783 61515 -29597 -27150 14897 -6951 27241 9373 -60248 11644 56850 -19372 -30759
809c0759K5058K6156K2437q2934j3225J16530l6430q0172N7658J736r694M5522
$$ -30759 -5701 20455 42892 -40042 -53267 63263 26833 -53339 4319 6055 -3639 41883
821D1883p1028k4923J11816k4362q3086L4023K8863J4480j3212p2050M6521Q0209
$$ 41883 -29145 -54068 57748 33386 -49700 -15677 13186 27666 14454 -57596 -11075 69134
833F9134p7131l8347N5879J43P799q816n8157M8082N8787o5246l2357L5441K8049
$$ 69134 -7997 -46344 9535 9678 17477 8661 -49496 -1414 57373 -7873 -40230 -4789 23260
846B3260J0316o0747k4112R3724j025q3036K4071L1424n866J4785m4346j8990
$$ 23260 33576 -27171 -51283 42441 41416 -41620 -17549 13875 8009 22794 -21552 -40542
858d0542P8983n544o7562J3694L0400J6827j1894n9675K8924P1803n2000m3697
$$ -40542 38441 32897 -34665 -20971 9429 26256 14362 -45313 -16389 55414 3414 -40283
870d0283M1950Q732L247m394m6200K8311N3613m3854l2568K5003J9340J4359l5618
$$ -40283 1667 10399 13646 9252 -36948 -8637 44976 1122 -31446 -6443 12897 27256 -8362
883h362l6401O2027K4593o3086k054K9394K412J1297l0129k5781N5623J3657n0456
$$ -8362 -44763 17264 41857 -21229 -23283 6111 8523 19820 -10309 -36090 19533 33190 -17266
896a7266m522K0151K1580L185n4029J146O8822j8659n0127J8481J6704J0821K2
$$ -17266 -21788 -1637 19943 23128 -30901 -29755 39067 20408 -29719 -11238 5466 16287 16309
909A6309m7225Q923O0727k2203m5918J3764K5699J6192k3035m3285L5271M8165
$$ 16309 -30916 -21993 38734 16531 -29387 -15623 10076 26268 3233 -40052 -4781 43384
921D3384m0421l5325K3753K6202N385l2395k6031M3156K9185m0372k6966K1586
$$ 43384 2963 -32362 -8609 17593 22978 -9417 -35448 7708 36893 -3479 -30445 -8859
933h859L4243j195n0030o285N8490L843m8309p453K6786K5074j1463m7037J0004
$$ -8859 25384 24189 -25841 -32126 26364 30207 -18102 -25555 1231 26305 14842 -32195 -22191
946b2191N6209j2451m6901L890L1201J8058k4196m0091K7533M7585k8795m0691
$$ -22191 34018 21567 -25334 -21444 9757 27815 3619 -36472 -8939 38646 9851 -30840
958c0840J6291L2749O209l3266k5064L8959L1249l7730k9085K3809K9416m159
$$ -30840 -14549 18200 24409 -8857 -33921 5038 36287 -1443 -30528 -6719 22697 18538
970A8538l6637r882M3501J4870m0722j7362K7851K5115j3373l6518M757M3413
$$ 18538 -18099 -27981 15520 30390 -10332 -27694 157 25272 11899 -24619 -19862 23551
982B3551r17m0313n088K9993J6426k0174k9067J4473L5832r169l4494l78K9729
$$ 23551 22634 -17679 -22767 7226 23652 3478 -25589 -11116 24716 15547 -18947 -19325 10404
995A0404J3812k6664k5712K5044L0919k0636k9897R997K7760M145k6946j6393
$$ 10404 24216 -2448 -28160 -3116 27803 7167 -22730 -12733 15027 19172 -7774 -24167
1007b4167K6056K3868k1412k8003J2058L1417j013l4665q256L5194J4768l0381
$$ -24167 1889 25757 4345 -23658 -11600 19817 18804 -15861 -24117 11077 25845 -4536
1019d536k0340K1187K6825j1036l2157J450L4095P674l1895j7597K6810K7975
$$ -4536 -24876 -3689 23136 12100 -20057 -18607 15488 23162 -8733 -26330 480 28455
1031B8455k1424l5657J5654L8898q230l7324k248L3407J3960k8594k4470K2429
$$ 28455 7031 -28626 -12972 25926 17696 -19628 -21876 11531 25491 -3103 -27573 -5144
1043e144L2111j4262l6683L936L9605O416m0079j5045L6773K2114k9443k8288
$$ -5144 26967 12705 -23978 -20042 19563 25979 -14100 -29145 7628 29742 299 -27989
1055b7989J9130L3671q384l6910j733L6528J1480l2192k1416K5903L0728j9327
$$ -27989 -8859 24812 16428 -20482 -22215 14313 25793 -6399 -27815 -1912 28816 9489
1067I489l7181J2559L8583m218l6105o017L1753J6542k6550k4642J9911K9459
$$ 9489 -27692 -15133 23450 19232 -16873 -22890 8863 25405 -1145 -25787 -5876 23583
1079B3583j0631l2306k50L4268R971l4755j6269L1046J9920k2160k3469J0575
$$ 23583 12952 -19354 -19604 14664 24635 -10120 -26389 4657 24577 2417 -21052 -10477
1091a0477K8096l5l1482p546L0564J3375k4512k0115J5921K7966r138l3034M461
$$ -10477 17619 17584 -13898 -21444 9120 22495 -2017 -22132 -6211 21755 12617 -20417 -15956
1104a5956L1871J591k5488j0904J8203K1629j3324k9012R393K9624k249k6393
$$ -15956 15915 17506 -7982 -18886 -683 20946 7622 -21390 -11997 17627 15378 -11015
1116a1015r007K4214K0242k4204k5387K2136K3736j3037k0527k250K0984J6615
$$ -11015 -20022 4192 24434 230 -25157 -3021 20715 7678 -12849 -15099 5885 22500
1128B2500k4693k3943K5194K4971j7586k5812N173L0384M650l4760q255L1674
$$ 22500 -2193 -26136 -942 24029 6443 -19369 -14196 16188 20838 -13922 -22177 9497
1140I497R918j9744j6809N832K8978K038l8377l435L7644O278k8360j6340J9509
$$ 9497 19415 -329 -17138 -11306 17672 19710 -18667 -22102 15542 21820 -6540 -22880 -3371
1153c371L0165j7888l7354J8730L2547j2413k1560m790J5597K5170j8614l6501
$$ -3371 26794 8906 -28448 -9718 22829 10416 -11144 -15934 -337 24833 6219 -30282
1165c0282K2551L6103j7819l2017M079L2896Q786l7535j2432L5750J0447k1706
$$ -30282 -7731 28372 10553 -21464 -17385 15511 24297 -13238 -25670 10080 20527 -1179
1177a179j3352K408K5743R233l8691r759M0049P894k7886j5748J4763L2032j2738
$$ -1179 -14531 -12123 13620 22853 -15838 -25597 14452 22346 -5540 -21288 -6525 25507 12769
1190A2769m2359J9648L5055k0015j5243L082O48K3477k320m1449J3223M0157j5884
$$ 12769 -29590 -9942 25113 5098 -10145 -7063 -6415 17062 14742 -26707 -13484 26673 10789
1203A0789k8257L302K2352J3921k7479j9769L1712J2187k1850m861l07J0031J8648
$$ 10789 -17468 -14166 8186 22107 -5372 -25141 6571 18758 -3092 -7953 -8260 1771 20419
1216B0419k3220k1936K8660J6779j8274j9132L361L2755l25m3792J0926L5265
$$ 20419 -2801 -24737 3923 20702 2428 -16704 -13343 19412 19087 -24705 -13779 21486
1228B1486j8162r038N276j3770K3251J5737m4742j828M2648n923k4308o359J2098
$$ 21486 3324 -5714 -438 -14208 9043 24780 -19962 -21790 20858 14935 -9373 -15732 -3634
1241c634K8179j7937l6840K9396K3777k5066l890J97j585K7486j0000l8103K0798
$$ -3634 24545 6608 -30232 -836 22941 -2125 -6015 -5818 -7403 20083 10083 -28020 -7222
1254g222L1406j4773k5635l315L4055J3323m7212m694M4274r273j8571O778j2266
$$ -7222 24184 9411 -16224 -19539 14516 27839 -19373 -24067 20207 10934 -7637 -859 -13125
1267a3125J6346K4698m0543j5863M3487O274k6199j4725J0987L5982j4452m6664
$$ -13125 3221 27919 -12624 -28487 15000 21274 -4925 -19650 -8663 27319 12867 -33797
1279c3797K8248L2649k8345p114M404m733K6599n203l9446J8263L0091j2023j9351
$$ -33797 -5549 27100 -1245 -8359 -3955 -8688 17911 12708 -26738 -8475 21616 9593 -9758
1292i758j2157K8267K8976n0613j8998N8429p459l4245J9851o865k212L2917k9169
$$ -9758 -21915 6352 35328 -15285 -34283 24146 16687 -17558 2293 -4572 -6784 26133 -3036
1305c036k8534M3423J0885k9347p638N746K5705J283m4728J1330M1946k2443j8815
$$ -3036 -31570 11853 22738 -6609 -14247 -8501 17204 18487 -26241 -14911 27035 4592 -14223
1318a4223J3411j933R768M982k5180P89K2614L955j5563k3000K3144L6597m3192
$$ -14223 -812 -2745 7023 12005 -13175 -12386 10228 14183 -1380 -24380 -1236 35361 -7831
1331g831k5525N1553k939k9829K0232j0365p773L7063k1128l1722L3846R978j5239
$$ -7831 -33356 18197 15258 -14571 5661 -4704 -12477 24586 3458 -28264 5582 15560 321
1344C21l851j5379K5333K5864n2527o661N3984j8152k4672J9395r738M914K1938
$$ 321 -3530 -18909 6424 32288 -20239 -26900 27084 8932 -15740 3655 -6083 -1169 20769
1357B0769k9118j2646L0414O543j4554k0143O512M2290j9207m6812L6116K5696
$$ 20769 -8349 -20995 9419 15962 1408 -18735 -12223 30067 10860 -35952 164 25860
1369B5860l2161Q05L521p388K6653p052l4414J9071K2375r094j4548j5265K6732
$$ 25860 -6301 -5496 -1975 -9363 17290 10238 -24176 -5105 17270 8176 -6372 -21637 5095
1382E095K8154m7006j7221M9959k212k7384N692j507J1436J3003k8501n986K4281
$$ 5095 33249 -13757 -30978 18981 16769 -10615 -4923 -6430 5006 18009 -10492 -16478 7803
1395G803K844m317k0434o465M8228p148n8423L0967L7957l5805m829J1148j0740
$$ 7803 10647 6330 -14104 -20569 27659 20511 -37912 -6945 31012 -4793 -9622 1526 -9214
1408i214K2567n16l6120J7546K3129j3978o272j1358R490L4243l0732l2713M5374
$$ -9214 13353 12837 -23283 -5737 17392 3414 -2858 -14216 -4726 29517 -1215 -33928 11446
1421A1446J1554l4457L807P012J598J2321j7116j1729K0238M783m829j1472j1481
$$ 11446 23000 -11457 -7650 -638 960 13281 -3835 -15564 4674 9457 4628 -6844 -18325
1434a8325L2840R306m8156Q286L9716j9414j4389Q738m404J4339L188k6376O808
$$ -18325 14515 23821 -24335 -16049 23667 4253 -10136 -1398 -5802 8537 11725 -14651 -7843
1447g843J7736m239k709j6066K078L6130j7694l6400L0056J8245k1658k677j826
$$ -7843 9893 5654 2945 -13121 -11043 25087 7393 -29007 1049 19294 -2364 -5041 -6867
1460f867N235J8499j7638j5877J9179M545j233n508k1409K4295K6808m2967j2213
$$ -6867 -1632 16867 -771 -16648 2531 7076 5843 335 -21074 3221 30029 -12938 -25151
1473b5151M1455m025j8759K241m362J5522R970k9258j697K3694j095o008j3085
$$ -25151 16304 12279 -6480 -4239 -8601 6921 16891 -12367 -14064 9630 8535 2527 -10558
1486a0558l845L4203l291m2542J6186L0935j5829j3423r80P103J9427j3865k3513
$$ -10558 -14403 19800 16509 -26033 -9847 21088 5259 -8164 -9144 -2041 17386 3521 -19992
1499a9992J8581J4541q381q095j1829J5185K5224k9035k2410L3149J1862k1522
$$ -19992 -1411 13130 4749 -3346 -15175 10 25234 -3801 -26211 6938 18800 -2722
1511b722q570M292J6499M158k4306k312K0304K234p147j2868j658K8522k117l4333
$$ -2722 -11292 -7000 9499 13657 -10649 -12961 7343 9577 2430 -10438 -12096 16426 14309 -20024
1525b0024J0198K4649q389r909o723N222K2773j2708k4856J9067J2948j1257j401
$$ -20024 -9826 14823 6434 -3475 -10198 -4976 17797 5089 -19767 -700 12248 991 -410
1538d10q948L405K5601j5942k6427K3882J5231j6784o524N1R402J1819j7735j2049
$$ -410 -9358 -5953 19648 3706 -22721 1161 16392 -392 -6916 -6865 2537 14356 -3379 -15428
1552a5428J9155P003r524p652l045J5942Q369k3170n760K0928L908j0897r590
$$ -15428 3727 10730 1206 -6446 -9491 6451 14820 -8350 -14110 6818 10726 -171 -9761
1565i761K645J8987j756k3061M148J7501r90q457r512M506K0220o847k2810Q194
$$ -9761 -7116 11871 10115 -12946 -8798 8703 7713 -744 -10256 -5750 14470 7623 -15187 -6993
1579f993J7547k080j2560r158J3377J7008j6897j6388J4942J2123m778j1992p324
$$ -6993 10554 8474 -4086 -13244 133 17141 244 -16144 -1202 10921 6143 -5849 -13173
$$ [...]
8191e0
##END NTUPLES=NMR FID
##END=
