##TITLE=1H_ES-Me-valeric
 CDCl3
 8 sc, 
 1.10.2024
##JCAMPDX= 6.0         $$ Bruker NMR JCAMP-DX V2.0
##DATA TYPE= NMR FID
##DATA CLASS= NTUPLES
##ORIGIN= UXNMR, Bruker Analytische Messtechnik GmbH
##OWNER= root
$$ XWIN-NMR		Version 3.5
$$ Tue Oct  1 13:58:42 2024 Russian Standard Time (UT+4h)  she@DPX200
##.OBSERVE FREQUENCY= 200.1318
##.OBSERVE NUCLEUS= ^1H
##.DELAY= (6, 6)
##.ACQUISITION MODE= SIMULTANEOUS
##.ACQUISITION SCHEME= undefined
##.AVERAGES= 8
##.DIGITISER RES= 18
##SPECTROMETER/DATA SYSTEM= spect
##.PULSE SEQUENCE= zg30
##.SOLVENT NAME= DMSO
##.SHIFT REFERENCE= (INTERNAL, DMSO, 0, 15.7039)
##AUDIT TRAIL= $$ (NUMBER, WHEN, WHO, WHERE, WHAT)
$$ ##TITLE= Audit trail, XWIN-NMR		Version 3.5
$$ ##JCAMPDX= 5.01
$$ ##ORIGIN= Bruker BioSpin GmbH
$$ ##OWNER= she
$$ F:/spectra/data/she/nmr/H-F/1/audita.txt
$$ ##AUDIT TRAIL=  $$ (NUMBER, WHEN, WHO, WHERE, WHAT)
(   1,<2024-10-01 13:57:21.04 +0400>,<she>,<DPX200>,
      <created by zg, POWCHK disabled, PULCHK disabled
       configuration hash MD5:
       00 E9 B6 7A A2 85 ED C7 34 08 36 98 17 FE 4E 26
       data hash MD5: 16K
       95 8F 4F 38 9C 3C 4F 79 F6 83 F5 8A 85 E5 EC 04>)
$$ ##END=
$$ 
$$ hash MD5
$$ 6A 09 D3 E9 D4 27 6C BF 5B DF 2B A6 BE C5 01 45
##$RELAX= 
##$RELAX= 
##$RELAX= 
##$RELAX= 
##$RELAX= 
##$RELAX= 
$$ Bruker specific parameters
$$ --------------------------
##$DU= <F:/spectra>
##$EXPNO= 1
##$NAME= <H-F>
##$PROCNO= 1
##$TYPE= <nmr>
##$USER= <she>
##$AMP= (0..31)
100 100 100 100 100 100 100 100 100 100 100 100 100 100 100 100 100 100 
100 100 100 100 100 100 100 100 100 100 100 100 100 100 
##$AQSEQ= 0
##$AQ_mod= 1
##$AUNM= <au_zg>
##$AUTOPOS= <>
##$BF1= 200.13
##$BF2= 200.13
##$BF3= 200.13
##$BF4= 200.13
##$BF5= 200.13
##$BF6= 200.13
##$BF7= 200.13
##$BF8= 200.13
##$BYTORDA= 1
##$CFDGTYP= 0
##$CFRGTYP= 5
##$CHEMSTR= <none>
##$CNST= (0..31)
1 1 145 1 1 1 1 1 1 1 1 1 1 1 1 1 1 1 1 1 1 1 1 1 1 1 1 1 1 1 1 1 
##$CPDPRG= <>
##$CPDPRG1= <>
##$CPDPRG2= <>
##$CPDPRG3= <>
##$CPDPRG4= <mlev>
##$CPDPRG5= <mlev>
##$CPDPRG6= <mlev>
##$CPDPRG7= <mlev>
##$CPDPRG8= <mlev>
##$CPDPRGB= <>
##$CPDPRGT= <>
##$D= (0..31)
0 1.2 0 0 0 0 0 0 0 0.06 0 0.03 0 0 0 0 0.0002 0 0 0 0 0 0 0 0 0 0 0 0 
0 0 0 
##$DATE= 1727776640
##$DBL= (0..7)
120 120 120 120 120 120 120 120 
##$DBP= (0..7)
150 150 150 150 150 150 150 150 
##$DBP07= 0
##$DBPNAM0= <>
##$DBPNAM1= <>
##$DBPNAM2= <>
##$DBPNAM3= <>
##$DBPNAM4= <>
##$DBPNAM5= <>
##$DBPNAM6= <>
##$DBPNAM7= <>
##$DBPOAL= (0..7)
0.5 0.5 0.5 0.5 0.5 0.5 0.5 0.5 
##$DBPOFFS= (0..7)
0 0 0 0 0 0 0 0 
##$DE= 6
##$DECBNUC= <off>
##$DECIM= 24
##$DECNUC= <off>
##$DECSTAT= 4
##$DIGMOD= 1
##$DIGTYP= 9
##$DL= (0..7)
0 120 120 120 120 120 120 120 
##$DP= (0..7)
150 150 150 150 150 150 150 150 
##$DP07= 0
##$DPNAME0= <>
##$DPNAME1= <>
##$DPNAME2= <>
##$DPNAME3= <>
##$DPNAME4= <>
##$DPNAME5= <>
##$DPNAME6= <>
##$DPNAME7= <>
##$DPOAL= (0..7)
0.5 0.5 0.5 0.5 0.5 0.5 0.5 0.5 
##$DPOFFS= (0..7)
0 0 0 0 0 0 0 0 
##$DQDMODE= 0
##$DR= 18
##$DS= 0
##$DSLIST= <SSSSSSSSSSSSSSS>
$$ [...]
##$SUBNAM2= <"">
##$SUBNAM3= <"">
##$SUBNAM4= <"">
##$SUBNAM5= <"">
##$SUBNAM6= <"">
##$SUBNAM7= <"">
##$SUBNAM8= <"">
##$SUBNAM9= <"">
##$SW= 24.0689170037331
##$SWIBOX= (0..15)
0 0 2 0 0 0 0 0 0 0 0 0 0 0 0 0 
##$SW_h= 4816.95568400771
##$TD= 16384
##$TD0= 1
##$TE= 0
##$TE2= 300
##$TE3= 300
##$TEG= 300
##$TL= (0..7)
0 120 120 120 120 120 120 120 
##$TP= (0..7)
150 150 150 150 150 150 150 150 
##$TP07= 0
##$TPNAME0= <>
##$TPNAME1= <>
##$TPNAME2= <>
##$TPNAME3= <>
##$TPNAME4= <>
##$TPNAME5= <>
##$TPNAME6= <>
##$TPNAME7= <>
##$TPOAL= (0..7)
0.5 0.5 0.5 0.5 0.5 0.5 0.5 0.5 
##$TPOFFS= (0..7)
0 0 0 0 0 0 0 0 
##$TUNHIN= 0
##$TUNHOUT= 0
##$TUNXOUT= 0
##$USERA1= <user>
##$USERA2= <user>
##$USERA3= <user>
##$USERA4= <user>
##$USERA5= <user>
##$V9= 5
##$VALIST= <valist>
##$VCLIST= <CCCCCCCCCCCCCCC>
##$VD= 0
##$VDLIST= <DDDDDDDDDDDDDDD>
##$VPLIST= <PPPPPPPPPPPPPPP>
##$VTLIST= <TTTTTTTTTTTTTTT>
##$WBST= 1024
##$WBSW= 4
##$XGAIN= (0..3)
0 0 0 0 
##$XL= 0
##$YL= 0
##$YMAX_a= 791702
##$YMIN_a= -664248
##$ZGOPTNS= <>
##$ZL1= 120
##$ZL2= 120
##$ZL3= 120
##$ZL4= 120
##$ABSF1= 10
##$ABSF2= 0
##$ABSG= 5
##$ABSL= 3
##$ALPHA= 0
##$AQORDER= 0
##$ASSFAC= 0
##$ASSFACI= 0
##$ASSFACX= 0
##$ASSWID= 0
##$AUNMP= <proc_1d>
##$AZFE= 0.1
##$AZFW= 0.1
##$BCFW= 1
##$BC_mod= 2
##$BYTORDP= 1
##$COROFFS= 0
##$CY= 11.3945322036743
##$DATMOD= 1
##$DC= 2
##$DFILT= <>
##$DTYPP= 0
##$F1P= 15.6554695791079
##$F2P= 12.8336369535428
##$FCOR= 0.5
##$FTSIZE= 0
##$FT_mod= 4
##$GAMMA= 1
##$GB= 0.15
##$INTBC= 1
##$INTSCL= 1
##$ISEN= 128
##$LB= 0.24
##$LEV0= 0
##$LPBIN= 0
##$MAXI= 10000
##$MC2= 0
##$MEAN= 0
##$ME_mod= 0
##$MI= 1.114404
##$NCOEF= 0
##$NC_proc= 0
##$NLEV= 6
##$NOISF1= 3.799351
##$NOISF2= 2.8
##$NSP= 1
##$NTH_PI= 0
##$NZP= 0
##$OFFSET= 15.70392
##$PC= 1
##$PHC0= -26154.57
##$PHC1= 8.587477
##$PH_mod= 1
##$PKNL= yes
##$PPARMOD= 0
##$PSCAL= 0
##$PSIGN= 0
##$REVERSE= no
##$SF= 200.130013532006
##$SI= 16384
##$SIGF1= 3
##$SIGF2= 2
##$SINO= 400
##$SIOLD= 16384
##$SREGLST= <1H.CDCl3>
##$SSB= 0
##$STSI= 0
##$STSR= 0
##$SW_p= 3612.71676300578
##$SYMM= 0
##$S_DEV= 0
##$TDeff= 0
##$TDoff= 0
##$TI= <>
##$TILT= no
##$TM1= 0
##$TM2= 0
##$TOPLEV= 0
##$USERP1= <user>
##$USERP2= <user>
##$USERP3= <user>
##$USERP4= <user>
##$USERP5= <user>
##$WDW= 1
##$XDIM= 8192
##$YMAX_p= 0
##$YMIN_p= 0
$$ End of Bruker specific parameters
$$ ---------------------------------
##NTUPLES= NMR FID
##VAR_NAME=  TIME,          FID/REAL,        FID/IMAG
##SYMBOL=    X,             R,               I
##VAR_TYPE=  INDEPENDENT,   DEPENDENT,       DEPENDENT
##VAR_FORM=  AFFN,          ASDF,            ASDF
##VAR_DIM=   8192,          8192,            8192
##UNITS=     SECONDS,       ARBITRARY UNITS, ARBITRARY UNITS
##FACTOR=    0.0002076,     1,               1
##FIRST=     0,             0,               0
##LAST=      1.7004516,     0,               0
##MIN=       0,             -664248,         0
##MAX=       1.7004516,     791702,          0
$$ Real data points
##PAGE= N=1
##DATA TABLE= (X++(R..R)), XYDATA
0@%%%%Qk4L2l2M0n3O9q9J13j37J62k02K50k98L54m23M95n76O75p87R08j041J193
27F37j364J549j754J985k237K515k821L152l514L919m366M851n378N958o601P311
43C842q093Q957r921J1001j2218J3600j5185J7023j9182K1761k4906K8846l3945
56a8420M0830n0697O6160r4669K18868q26320L73954R58450r40369J49260L99237
67B76284n49647K94643L82548p50679J35304M99530k29935o6339o0491j58954
77b27736M74616l6510n62651K44687M20591k35395k66981L7433K90855J1350k83759
88a33500J26166N6132k07622L58816n6028o04488N24683M46816p87134k2742N69397
99B70496k35398q7316R2623k05962K53500R7449l73694J52619J05128j40017K67930
$$ y = [0, 0, 0, 0, 0, 8, -16, 16, -16, 24, -29, 40, -49, 64, -73, 89, -113, 137, -161, 193, -230, 265, -311, 364, -423, 485, -556, 637, -727, 822, -932, 1053, -1184, 1331, -1490, 1662, -1852, 2067, -2299, 2552, -2826, 3132, -3469, 3842, -4251, 4706, -5215, 5786, -6432, 7168, -8017, 9006, -10176, 11585, -13321, 15525, -18420, 22410, -28287, 37873, -56796, 162072, -664248, -290294, 668156, -272213, -122953, 276284, -273363, 21280, 403828, -346851, -211547, 287983, 58048, -8291, -68782, -227736, 246880, 210370, -352281, -107594, 312997, 77602, -189379, -151946, 138909, 150259, -133500, -7334, 48798, -158824, 199992, 143964, -460524, 64159, 510975, -276159, -298901, 270496, 35098, -52218, 40405, -165557, 87943, 185392, -188302, -35683, 69445, -70572, 197358]
110A97358k22122l35778N94147L9617n96873K62393K40449k02419Q7559j68057
120a03726n6562M30082k38785k70795L79837j61428r4059M15089m37338k20595
130c58280P62940k26720o25811M91531K08489l55420R2456J456q6419K29419o4816
141F8825k09212R3644J02113N8310j09118k11654K19528K10873k55973j25013
151a57677J28882J40567K5211k95712j0593L98613j65490k44712K64605j12497
161b8803p4851L76350l26857l10122O17520m601n53531K41753K20469j67736O1976
172E1567j25058p0674L34923j04656k74416J90280M8367l8907Q7372k26329j4622
183a42153L68787j39556l02110J74376J63761m7510j29275r1583K04840R2568
$$ y = [197358, -24764, -360542, 233605, 273222, -323651, -61258, 179191, -23228, 64331, -103726, -160288, 269794, 31009, -239786, 140051, -21377, -115436, 299653, -137685, -358280, 404660, 177940, -447871, 43660, 252149, -103271, -10815, -9359, -95778, 133641, 68825, -140387, -46743, 55370, 113680, 4562, -207092, 12436, 223309, -32664, -157677, -28795, 111772, 136983, -158729, -169322, 229291, 63801, -180911, 83694, -28803, -103654, 272696, -54161, -364283, 253237, 248636, -304895, -63142, 157327, -10409, 51567, -73491, -144165, 190758, 86102, -188314, 1966, 50333, 11426, 98798, -127531, -142153, 226634, 87078, -215032, -40656, 123105, 75595, -53680, -145263, 59577, 152145]
193A52145k35411J3989J02780o0464J22040n3783k53469K39411K01776l14984
203h5970o6549K11055J7976m2538j03900l0334K04128k0180j80668P0290L9701
214A3011j786Q2068j54099p7422K55283r787k14368M2591R5554M2994l7352j62745
226a26058Q8244J83790j53001p6955J07276m6884N7645O1149k19286L6713K54094
237A66727j28903j66387J08038P1323R354o2573j10121J17814J14531j36070n5606
248g1873O0103K7310O0990p3529j34211J40970J26002j47902r0853Q0708R8978
259G6693l142j50338k0675J78485r33j32268K86L7007O3959L2291j56195l3938
271a08768K02376L975j70123q390J00901O8070o0711j36856O5516J54842p1392
$$ y = [152145, -83266, -69277, 33503, -26961, 95079, 41296, -212173, 27238, 229014, -85970, -152519, 58536, 76512, 33974, -69926, -100260, 103868, 83688, -96980, -26690, 13011, 11225, 93293, -60806, -138228, 117055, 107268, -107100, -64509, 31045, 74039, 36687, -126058, -37814, 145976, -7025, -83980, 23296, -23588, 34057, 95206, -124080, -87367, 166727, 37824, -128563, -20525, 50798, 60152, -2421, -112542, 5272, 119803, -16267, -71873, -11770, 15540, 76530, 3001, -131210, 9760, 135762, -12140, -102993, -22285, 76693, 73551, -76787, -97462, 81023, 80090, -52178, -51892, -14885, 49074, 81365, -74830, -108768, 93608, 97583, -72540, -80930, 19971, 88041, 27330, -109526, -44010, 110832, 39440]
282C9440j15394L0500O7667N2990n7232j25995P7984J46418q3899j25310M4264
293d8567J06170K0832j13834o6849J28336P4070j11718o4645N5804P3051R559
304F2209j04280m8914J28830N6879j18506n9794P6532Q0157l1713j10635P005
315f2230J25133L699j07925k2021P0131N7300l7184r5850K0442J14248q971j04971
327d8199j2922Q1900M7316o1746p9086M7948R2542l0607q7900J167P5908L5863
339F2184o6129o6693N7226Q2280l9948q4615J1408Q1738K1846p8025n0245O9526
351E53O8092n0964p8239K3234Q4773Q005q7396l5168Q2323N5942o6683p2180M1743
364b5965Q4385j2585r1837j6110R1789M2266q2053o4728O4089Q2590l9810r4720
$$ y = [39440, -75954, -45454, 22213, 75203, 17971, -108024, -30040, 116378, 32479, -92831, -48567, 57603, 78435, -35399, -102248, 26088, 100158, -11560, -76205, -20401, 52650, 62209, -42071, -90985, 37845, 94724, -23782, -83576, -7044, 73113, 41400, -69235, -62230, 62903, 66602, -41323, -63344, 6787, 64087, 26903, -68947, -48505, 65743, 56772, -48199, -61121, 20779, 68095, 6349, -72737, -24789, 67753, 37146, -50754, -49587, 26321, 62184, -3945, -70638, -13412, 68868, 28920, -55695, -44287, 37451, 59297, -18728, -68973, 553, 68645, 17681, -60558, -37324, 47449, 55454, -31942, -67110, 15213, 71155, 4472, -67708, -25965, 58420, 45835, -46002, -62112, 29677, 71943, -10110, -74838, -10749, 71841, 32031, -62689]
376f2689J2140R8809J6240r4829m3059Q2316O6353o1367q5032L5320R8098o914
388E5386j03835k0507J00007M4667q6209o5906O3897Q3435l6665r5411Q832R9357
400D7048J8031r3231m3307P7985O6377n7499q5150L4664R5784j1468r5389j2634
412e8789Q5165L8300o8672o2375M9956Q0124l0503q7766Q434Q4701J6915p5395
424a9905m2533O3763O2846m9528p2329K9497P2499k347o8849k7610O4695N1555
436F1754n8471o3927M3983O7193j8953o7877r607O9119L1873o5546m3709M9153
448e015N0419k0583o0597r635P3808K9156p8645l6752O5826M2687l7763n5763
460d2857R041P1641Q087p5864j7589N9370L2840l0761n9950Q858Q7747k109r6184
$$ y = [-62689, -50549, 48260, 64500, -30329, -73388, 8928, 75281, 13914, -71118, -35798, 62300, 55386, -48449, -68956, 31051, 75718, -10491, -76397, -12500, 70935, 34270, -61141, -52309, 47048, 65079, -28152, -71459, 6526, 72903, 15404, -69746, -35082, 60702, 49234, -46155, -58789, 26376, 64676, -3996, -66371, -16415, 63709, 33206, -54560, -46126, 38575, 55490, -19905, -62438, 1325, 64171, 14643, -57686, -28189, 44310, 41963, -26886, -54496, 10199, 61754, 3283, -60644, -16661, 50532, 31579, -36298, -45905, 23214, 55087, -10459, -54168, -5015, 45404, 24821, -35776, -45411, 28397, 57553, -21092, -57844, 7982, 50669, 12906, -42857, -33816, 37825, 45912, -29952, -47541, 11829, 44669, 13908, -46042, -37184, 50563, 48454, -47730]
473d7730j34P9180J4860n1531m5078L2873P2783k6678p8398J6479O2825J3805
485D3256m6325n7275M6469Q8726n6671r0442N2019P1812j9764n9203k4730O5265
497A3137N2292p2695n2082N5132M4360q750n6688l8727Q9503N5741j12945m2411
509g4133R7930L0352n0527m5610P125P8601N874r2671j025O7040J3665k3409n8082
522d4870J105J06727j3164j18821L0394Q7544j5118m7878l2445L8204P0953n4371
534H260o5352N3408K7968o002p079o5843L3047J07387p9812q9583R3093M1493
546E0985m9835j8587j5229L9845M7194o9202l1929N8379R176l786k2315m9005
558e4309O8414N6944r9573k9668Q0289J4999l1000l9758K601P5374j5565o9879
$$ y = [-47730, -47864, 31316, 46176, -5355, -50433, -17560, 55223, 28545, -49853, -33374, 29451, 43256, -3069, -60344, -13875, 74851, 18180, -72262, -20243, 51569, 31805, -27398, -52128, 13137, 65429, -7266, -59348, -4216, 40144, 31394, -25294, -64021, 25482, 81223, -31722, -74133, 23797, 54149, 3622, -41988, -34863, 43738, 49612, -43059, -44084, 22956, 36621, 13212, -44870, -43765, 62962, 49798, -69023, -38629, 48915, 33797, -14081, -46526, -8322, 62631, 8260, -57092, -3684, 24284, 18282, 11203, -54640, -21593, 85794, 5982, -83601, 9492, 50985, 1150, -17437, -32666, 7179, 54373, -14829, -46758, 11621, 20797, 17011, -5304, -54309, 14105, 71049, -28524, -58192, 22097, 37096, 6096, -33662, -31061, 44313, 28748, -41131]
570d1131L3048J3759l001M2464p4857m2343J40043j1775j33898N5357O5203l2192
582A0677l424m1161L141R3240m4579p4379N6772J2803m42J7949q5760J5598J27589
595H8024p0428r7803P7263M5665k1518l6085l9641P3282M4686r5528j473M9417
607A5861k2087M3004k3368j03728J07544Q5113j50453k1448J10604r253l0029
618A760k6389j5800Q2399J204r0180K4672L9058k164J4393o4919j5631J14181
630F2584k1142j00433L1864N1780J5612l7219p6747P9610P7730j20301n515Q2341
642D0164o5031L6181M9201j46538N1559J56415j43369o8599J34297k0271l1999
653g990K1345o5162N4919P3919j15307q586Q7126m1850N222J6216p6156N5737
$$ y = [-41131, -8083, 5676, 2675, 45139, -29718, -72061, 67982, 56207, -77691, -22334, 42869, 10677, 7253, -33908, -30767, 62473, 17894, -56485, 287, 13090, 12648, 30597, -55163, -39565, 88024, 17596, -80207, -2944, 42721, 21203, -14882, -54523, 18759, 63445, -32083, -33556, 15861, -6226, 36778, 13410, -90318, 17226, 102339, -48114, -69562, 41042, 31789, 1760, -24629, -40429, 41970, 43174, -47006, -22334, 16724, 14560, 28953, -35966, -51597, 62584, 41442, -58991, -27127, 24653, 40265, 3046, -73701, 5909, 83639, -36662, -42177, 40164, -24867, 11314, 60515, -86023, -34464, 121951, -21418, -90017, 44280, 24009, -7990, 13355, -51807, 3112, 77031, -38276, -46862, 40264, -1586, 3636, 19852, -56304, -567]
665e67P5309r7014l6293P5023K5381l2669n6127K7899P6071n7015l7416N7748
677B0330l5863R125O9144j03107k5155J41486m6329r1960O1095J3579L867Q223
689B4435q1515M1401Q8716r0466k1189O2857m2089L3189K9184j11358M2388J05725
701H1278q6346m3283M7211J1350L3508n4608o5853J20704J4538j18883N8126K4910
713B2652n9396Q7361k8915j22764J28939O4391j49117J0754P9726j9618L250m0036
725b2773k5140R6534j0179q8107L5948L0049o729J3273n2179q862Q1622j0771
737C2686o4502l977M4512N1237o5636p4609J10067L3646j10837L7056L2803n9041
749c6595P5416k840j24477R3290P9740j20533l93N4953k2208L8474l7151o9467
$$ y = [-567, 74742, -22272, -58565, 16458, 41839, 9170, -46957, -19058, 57013, -2, -37418, 20330, -15533, -6408, 62736, -40371, -65526, 75960, 29631, -62329, -1234, 12345, 16212, 24435, -57080, -15679, 73037, -17429, -38618, 24239, -17850, 15339, 44523, -66835, -24447, 81278, -5068, -48351, -1140, 10210, 43718, -10890, -76743, 43961, 58499, -60384, -2258, 22652, -36744, 50617, 21702, -101062, 27877, 92268, -56849, -46095, 33631, 14013, 17263, -22773, -47913, 48621, 38442, -49665, -13717, 16332, 9603, 22876, -29303, -38165, 43457, 32686, -31816, -35793, 8719, 59956, -5680, -80289, 29778, 63424, -47413, -10357, 22446, -36595, 38821, 35981, -88496, 4794, 84534, -35999, -36392, 18561, -3647, 34827, -2324, -71791]
761g1791J10759J8817j15181M5727L9720m6460M4890j9187o7112Q2555L0008q3557
773c0812J606L5358J8724j977o7177J9214Q1844n4913l8051M9710k1192J0162
785B496L6835p4835j221Q7739l4783m9228K1744J2720L0441k1543o5144N8481
797C702M6595o7976j01K3431j8335M0524j1698o8053N1333M5087m8525j5417R25
810a8508K6619M1513p2422l3517R8576j1944o4572L6402p465l970N5877n8996
822a2407m5864R1588O270o5100O193J2797K9570J0278p6980J1290Q4421l8931
834A3125m5054K7800Q39K1471P369o5248J5875O7800k8619m0637M003K4984L8450
847D2158m1963n7112O7463L6646o1947n575J7856K888L0951l1826m7147N8101
$$ y = [-71791, 38968, 57785, -57396, -11669, 28051, -18409, 26481, 7294, -59818, 22737, 52745, -30812, -29206, 6152, 24876, 22899, -44278, -25064, 56780, 1867, -36184, 13526, -7666, 2496, 39331, -35504, -36725, 51014, 16231, -32997, -11253, 1467, 31908, 10365, -54779, 3702, 50297, -17679, -17780, 5651, -12684, 27840, 16142, -51911, -578, 44509, -4016, -19433, -18508, 8111, 49624, -22798, -56315, 42261, 30317, -34255, 2147, -5318, -9288, 46589, -12407, -58271, 33317, 39587, -25513, -19320, -6523, 23047, 33325, -43655, -32365, 52056, 13125, -31929, -4129, -3290, 18181, 25550, -39698, -23823, 43977, 15358, -25279, -21276, 3708, 42158, 195, -56917, 10546, 47192, -14755, -20330, -2474, 414, 31365, -461, -47608, 10493]
859A0493L0024m9380j4473J1850K8214J7508n9910j4069P3732p751n0068J2903
871a0927Q906J2931J3998m7563p131N7580o816l6740j164J1440L1594q309n6058
884c8259K4635N0768l2578k3326J2333L312K3600q254m5017K4181L8221k3465
896F151j9509k227J5967L1936l2444l9810M6783K3635l6475o606L485J0385K6659
909B7930l0509l3140M2896K1669l1008j4775L657K5472J6155m3849j6966M8902
921A6434R402l3212j1376J0318K6611L013m1631m228M2081N622k9148j8108J6875
934g347L6586j4699m6348J6728M0566r809k7333r824K0557L1435k3942m0993K6737
947g686L6009j7338k7800l577K7702K3482l4466l0971L6565K7993k5665k5622
$$ y = [10493, 40517, -8863, -23336, -11486, 16728, 34236, -25674, -39743, 33989, 26238, -23830, -10927, -2021, 10910, 24908, -22655, -29786, 27794, 20978, -15762, -16926, -5486, 26108, 17799, -38259, -13624, 37144, 4566, -18760, -6427, -3115, 20485, 12231, -32786, -8605, 29616, 6151, -13358, -15585, 382, 32318, -126, -39936, 6847, 30482, -5993, -12599, -9114, 1271, 27930, -2579, -35719, 7177, 28846, -2162, -16937, -13280, 12192, 28347, -15502, -32468, 16434, 25836, -7376, -18752, -8434, 18177, 21190, -20441, -24669, 17412, 23034, -6114, -24222, -7347, 29239, 14540, -31808, -15080, 25486, 15677, -11656, -21480, -923, 30512, 6570, -34423, -7686, 28323, 10985, -16815, -20392, 7310, 30792, -3674, -34645, 1920, 29913, 4248, -21374]
959b1374N922L0911J0426l9301j6573M0144J7143k9285k0776J3095L0594j498
971A9428l9396l475L9364P194l0289j5670J8906K7983j1855l6436Q355L6230k733
984A7606k9370q005K2028K0353j7656k8338J3721K9175n830k6376n907K4463J7273
997B3137k3822k3367K0881K3900j2936k2477R25K2326J0019k2053j7099J8884
1009a682K1044j1558k3940K171K6685N944k7520j1647K4085J5926j6627k0454
1021a7573P884K4399L67k5670p777K3337J5270j8261k2968J2377K9085p041l1359
1034a7930J119K9343O433k4400j4849J8371K2516j1853k7408M043K9374M807k9310
1047i744j3568K7435K0657k3354k4990J6185K7586o717k8848l260K8710J1647
$$ y = [-21374, -15452, 15459, 25885, -13416, -29989, 10155, 27298, -1987, -22763, -9668, 20926, 19428, -19968, -23443, 15921, 23115, -7174, -22844, -3938, 24045, 12190, -24246, -15891, 20339, 17606, -11764, -19769, 2259, 22612, 4956, -23382, -9661, 19514, 13684, -12692, -18599, 5864, 23137, -685, -24052, -3171, 20729, 7793, -14684, -13759, 8567, 18586, -3467, -20566, -1682, 19362, 7804, -16136, -13965, 12720, 18664, -8856, -20503, 3582, 19508, 2881, -17573, -9689, 14710, 15077, -10593, -18370, 4967, 20237, 1976, -20992, -8615, 20470, 13429, -17930, -16811, 12532, 18965, -5435, -20284, -1913, 20603, 8750, -18658, -14615, 14759, 19566, -9744, -23312, 4123, 24780, 1426, -23564, -7379, 20207, 13490, -15358, -18618, 10092, 21739]
1059B1739k5790j8596J9635K4691j1597k9779L607L2848L321l2084r682K7439
1071E752J6061k0362k2436J2759K6789n198k7790l138K6176J2180k3288k0262
1083b2757K0183K5163j5707k6109Q234K4485J589k2685j1264K1124J8042j7895
1095B403k1020J1208K2552k124k4347o178K5413J1130k3152j3584J6122J6214
1107A4637o421k0150j784K3235O963k2151j0602J6080J5665q619k2160L591K5985
1120A4269j237k3587j748J5745Q900p436j8398K828K4703r33k4476k839J9448
1133E239J0594j4960j8887J3356K2347j1216j9251L931J4227Q329j2734j9809
1145a8834J4618K4294j4267k2314P024K0209N062k2631j3859K6272J5162k4284
$$ y = [21739, -4051, -22647, -3012, 21679, 10082, -19697, -16090, 16758, 20079, -12005, -21687, 5752, 21813, 1451, -20985, -8226, 18563, 13365, -14425, -17563, 8613, 20793, -2495, -22757, -2574, 22589, 6882, -19227, -10993, 13492, 15081, -7604, -18868, 2256, 20298, 2403, -18617, -7409, 15143, 13019, -11328, -17506, 7907, 19037, -4115, -17699, -1577, 14637, 8216, -11934, -13718, 9517, 16480, -5671, -16273, -193, 15472, 6853, -15307, -11716, 14269, 13032, -10555, -12303, 3442, 12342, 4906, -13492, -10664, 14039, 13106, -11370, -14209, 5239, 15833, 873, -18014, -4658, 17689, 6473, -12778, -8847, 5380, 13709, 975, -18834, -4216, 20078, 5811, -16503, -9479, 10730, 15792, -6839, -20698, 5574, 20736, -3548]
1157c548j1915J2713J2089K745j8735j3507K6473J6420k7380j5978J9681J9424
1169A8482j0004k6522M931L0297m095k5114J92J3843J1310n512k5182M712L2060
1182A9398o301k8163J396K0260J1615j8163k4114K3158K5420k5681j5432J5949
1194f58N443M555o127k2838J5470K8271k1885k2618J6166J7630k330k1083p199
1207a7203K7522O560k6096j452J2751L368L276j4043j0928K3687R062k2372q016
1220a3884J2184J6129n180k8101Q945L0820j6829j7878J4558j270K929J0368k4366
1233a1575m165L3023n787k4814M448J2236J0125j0089k3945J8579K2956k3486
1245b494r330J3203k189Q173L33k4564R863K6032j3264j9250L442J8322R912k7413
$$ y = [-3548, -15463, -2750, 9339, 12084, -6651, -20158, 6315, 22735, -4645, -20623, -942, 18482, 8478, -18044, -13113, 17184, 13089, -12025, -11833, 2010, 13320, 7808, -17374, -12662, 19398, 13097, -15066, -13670, 6590, 18205, 42, -24072, -914, 24506, -1175, -16607, -658, 4785, 9340, 3213, -19625, -4155, 24116, 2231, -20387, -4221, 13409, 11079, -10004, -17203, 10319, 16879, -9217, -10669, 2082, 5450, 8726, -5317, -16245, 7442, 16504, -5868, -13884, -1700, 14429, 9249, -18852, -9907, 20913, 4084, -13794, 764, -506, 2423, 12791, -11575, -15740, 17283, 11496, -13318, -8870, 3366, 13491, 3402, -20543, -1964, 20992, -2494, -11824, 1379, -810, 7363, 7696, -16868, -7005, 19027, 5763, -13487, -10045, 8277, 18189, -9224]
1259i224j2673L4870K511k6720O890M109j612J6938j5884k1958K8845J4264k5117
1272d761r986J0082J9196j131l3394O423L5599j5468k0238J1902O55O898O399
1285A2176k6172M82K9674n711j9171m109J1809K3668k0086l3214L5702K1447l7770
1298a1275N76J6890j1003J3837o8l1315J8827K7031k4295j4062J0531J2036P873
1311A5583k4437j2581L5676K756l1125O598J2287k497M428j0300q623J7049O822
1324A1636j1300j2273L125K7253o650l7854K1036K9448k9362n785J7117j2489
1336f098R489J0550k8607N233K5304j2926q174k80m62K3140j0564l3084K8977
1349B498K0370l2664J417J4371j0424J0403J371k1788J0649J6536q712j0097o214
$$ y = [-9224, -21897, 12973, 15484, -11236, -4346, -237, -1849, 15089, -795, -22753, 6092, 20356, -4761, -14747, -4665, 14531, 13400, -19994, -13571, 22028, 6560, -13678, -1776, -1121, 5777, 12176, -13996, -13514, 16160, 10449, -8722, -12831, -1022, 22646, 2560, -30654, 5048, 26495, -11275, -10699, 6191, -4812, 9025, 8957, -22358, -3531, 23500, -795, -14857, -4326, 7710, 15583, -8854, -21435, 14241, 16997, -14128, -7530, 4757, 2260, 6688, -3612, -12235, 4814, 11636, 336, -11937, -8812, 18441, 11791, -26063, -5027, 24421, -4941, -10726, 6391, -6098, 3391, 13941, -14666, -9433, 15871, 2945, -5229, -5509, -5971, 17169, 6605, -26479, 2498, 22868, -9796, -8379, 5992, -4432, 5971, 7342, -14446, -3797, 12739, 4027, -6070, -12284]
1362a2284J6874J6705l1999j0479L7567n212k3142J1548r93j24J4980j7390j2045
1375a5994K2550M679j1609q607j102K4379P57l6357J0941L0879j7492j3074P831
1388b219K8J0495j258k0120P745J4569l502n418j4353Q760L0719k5128k9176L7339
1402H481J0811k9284N254M777l314J6313j2107j8961K1965Q384j3540l264n513
1415i998J4070J6091l1401r290L6974m448k4082P919N156K967L734j5437p98J5915
1429G372j695n475p636j569K4041m250l2228J6646K3821j9977p524P972r68R082
1443G612l651j5947J0483R512o051j986r038N504K1369j7895j9407K4804P421
1456A2730j6990J50O69M528R205j3884o258J3868j92j028k967j3032J7153J4795
$$ y = [-12284, 4590, 21295, -10704, -21183, 16384, 11172, -11970, -422, -1415, -1539, 13441, -3949, -15994, 6556, 11235, -374, -8981, -10083, 14296, 15053, -21304, -10363, 20516, 3024, -10050, -2219, -2191, 8304, 7046, -13074, -5329, 9240, 5738, 320, -14033, -5273, 25446, 318, -28858, 8481, 19292, -9992, -4738, 39, -3275, 13038, 931, -18030, 3935, 12319, -1221, -4485, -9998, 4072, 20163, -11238, -20528, 16446, 11998, -12084, -4165, 991, 3958, 7692, -7745, -8543, 7372, 5677, 202, -7434, -9003, 15038, 10788, -21440, -4794, 19027, -950, -8474, -502, -1470, 7612, 3961, -11986, -1503, 8009, 1958, -28, -9066, -3562, 17807, -88, -19495, 5309, 12730, -4260, -4110, -3441, 1087, 10292, -3592, -9850, 4018, 3826, 2798, -169, -13201, 3952, 18747]
1470A8747k9486m223K7222n651j1684K705k773J0030N345j8804O63J4402j938
1483D555k476q402l835K2880j524k8206J0175K0269r887q181j320L619J3835q047
1497C455j6606J1330R941m563m658r296Q109J9517j6914j8528K0305J1174j3010
1510B56p733J290J1438N453j6175m779J3506L842l918r458l917J9438L560k4253
1524a1450J581J8497k051p666o405J732J7279m669k0114R428J2380o190k134o164
1538e946l82J8617n609k1742J1594J4771q984o763j314N488J0499r460j1938J1144
1552b5P664n536n101l970Q009R874j2741r096J2469O003n829o452j818J0955M942
1567I348j4346l255J1576K252m122n966j962J1896L227j4532j833J1084L229n228
$$ y = [18747, -10739, -14962, 12260, 6609, -5075, -2370, -5143, 4887, 10232, -8572, -7909, 6493, 4555, 2079, -6323, -10158, 12722, 11198, -17008, -6833, 13436, 3549, -4632, -5952, -2333, 11502, 3455, -13151, -1821, 8120, 3557, -1101, -10397, -2288, 17229, 315, -18213, 2092, 13266, 256, -7477, -6187, 5251, 10704, -5471, -10250, 3256, 7098, 3180, -6278, -10195, 9243, 12803, -11450, -9869, 8628, 6577, -1089, -7494, -5762, 11517, 6848, -13266, -3838, 8542, 2352, 218, -5946, -6328, 12289, 6680, -15062, -3468, 11303, 2319, -4444, -5758, -270, 10229, 769, -11169, -25, 7639, 2103, -2998, -6968, 1041, 10915, -1826, -10922, 1547, 7550, 1721, -4731, -6549, 4406, 9348, -4998, -8253, 3323, 5575, 1453, -4513, -6475, 5421, 8648, -5884, -7717, 3367, 6596, 1368]
1581A368q617K184J3753k863j3747K813Q984J733m631r164M282J4298o370j3263
1595i240N627Q348Q08n564r457P211J4536j0399j3291R542R377l265p527m710
1609h004R300R334j1185r744R252Q881l523j0213k239J3171N274j4460n906J2058
1623A996O956p329r887L235J2985j350j3131m45J0155M160o396r550M529J3838
1637I766m264j4553L027J2436M40r983n014Q596Q387p666q763M722P995L63q062
1652b573n600R334Q476r955q662P827Q126l444q703p46R842K976r401l657O350
1667A90M790j805p334j850R782L543j0399m362Q833N522n962p268L529Q137j365
1682C981p467j067N303M543l230q354K274J0546j617j0384R7Q735K874p195n863
$$ y = [1368, -7249, -5065, 8688, 5825, -7922, -5109, 3875, 5608, 977, -8187, -3905, 10393, 4023, -9240, -3613, 4735, 5543, -21, -9478, -2267, 12269, 1870, -11421, -1879, 7498, 4233, -3294, -8004, 1296, 10630, -555, -10299, -1047, 7834, 4311, -5902, -8141, 5030, 10304, -4156, -10062, 1996, 8952, 1623, -8264, -5029, 7956, 6606, -6525, -6970, 3185, 7345, 949, -8601, -4072, 9766, 5502, -9051, -6024, 6412, 6852, -3131, -8145, 451, 8838, 1172, -7591, -2869, 5126, 5489, -2573, -8173, 1161, 9637, -318, -8980, -1153, 6973, 3529, -5174, -5920, 3922, 6898, -2503, -6160, 190, 4980, 3175, -4159, -6009, 3773, 7316, -3083, -7445, 1388, 6910, 948, -6320, -2791, 5346, 3981, -3486, -4553, 750, 5293, 2063, -6291, -4017, 6529, 4912, -5472, -5375, 3360, 6234, -961, -6824]
1697f824N927P534m385p605J427O975K653o566o552O591R001n904r900L862J0073
1712F307r58j0202j480R272L441o929n472L569P972j70j0449j850J1329L173j0220
1727b667m949P751P389n258r475L387J0017j432q765j525O795N327n253q790M379
1742c069J0453l098j0462P54R596K508r001m884Q034N924n788o343K073P098J851
1757E646q460m399R038N507p865o007N154P008k137q295J24Q365J217o595l061
1772d760L778N832j570q374O14R211j8p709j848N597M491m089o569L374O481j853
1788B588m842j504L599N548l731q061M320Q039l636o465Q06N285K616n100m672
1803e210M721M977k619m771j117N814M362p588n503Q062M929n885m863K247O227
$$ y = [-6824, -897, 6637, 2252, -5353, -3926, 3049, 5702, -864, -7416, -825, 8176, 2272, -7628, -3766, 6307, 5349, -4853, -6333, 2939, 6380, -549, -6021, -2452, 5520, 5350, -5099, -6949, 4380, 7553, -2667, -7616, 135, 7524, 2266, -7209, -3822, 6195, 4763, -4002, -5527, 1268, 6595, 1342, -7448, -3069, 7384, 4286, -6176, -5422, 4174, 6682, -2319, -7203, 831, 6755, 967, -5376, -3303, 3795, 5646, -2814, -7213, 1825, 7332, -533, -6540, -1386, 5622, 3485, -4810, -4686, 3679, 4896, -1699, -4760, -982, 4850, 3280, -5094, -4480, 4731, 4713, -2996, -4844, 753, 5244, 1155, -5414, -2040, 4441, 2588, -2254, -3758, -159, 5389, 1658, -6403, -2083, 5956, 2320, -4145, -3339, 1946, 4562, -538, -5210, -489, 4488, 1869, -2902, -4019, 1795, 6157, -1431, -6934, 1128, 6057, 172, -4691, -2444, 3783]
1818C783O66p674j757P233K169m123m317N20Q202R35j1339j60J1081j82p935j747
1834d645M592N341l093p911K979P200j192m968l223M110Q055n463j0267P070Q832
1849G417n807o284J571N446K954o669m693O793M153l978l899r95O161M700r462
1864b592n049J0646L419q201l087M109M935j416o784Q68N933l9k502l469j15Q509
1880E165m80j1405K955R782l630n493M45K509M606l149o711M796M458l420p87
1895c59k108K5Q205l205j0387O652P876o380m234K405L213J596m228k677L907
1910C01J898m08k562m199O002N832r271l927Q859J555m270k551j36O146R51q376
1926d156J326N569j910O99k654m608R412L475j3175N47J1262k452n942m13K417
$$ y = [3783, 4449, -3225, -4982, 2251, 4420, 297, -4020, -3500, 4702, 5637, -5702, -5862, 5219, 5037, -2898, -4645, -53, 5288, 2195, -5716, -2737, 4463, 3271, -1697, -4920, -810, 7245, 1782, -8485, -1415, 7417, 1610, -4674, -3103, 2343, 5297, -1372, -6065, 728, 4881, 903, -2996, -3991, 2170, 6870, -2592, -7641, 3005, 6424, -1777, -4864, -755, 4180, 2764, -4020, -3152, 2781, 2742, 240, -3229, -3344, 5165, 4685, -6720, -3765, 6017, 2387, -3106, -2661, -152, 4454, 1305, -5406, -610, 3848, 428, -359, -2467, -2442, 5763, 2558, -7829, -1177, 6699, 319, -3915, -1510, 1703, 3299, -929, -3606, 301, 2199, 1791, -771, -4970, 1032, 6864, -2407, -6334, 2525, 4080, -190, -2741, -2877, 3269, 4220, -4156, -2830, 2739, 829, 1528, -1126, -5734, 3678, 7153, -6022, -5475, 5787, 3335, -2607, -3020, -603]
1941f03M811k417o478L202M166p12j336m936J816R736n231r962P150O680m700
1956A186m267n44N493L622p870k492P094n7j557q57m655N672O825j0329m586J0590
1972C268J808o341k667K333O049j794p384L314M083k097Q22l472k413R582n23
1987D568j1216M186P376l603k459j778J811O666n165o229P218J482m050K534l427
2002b086j222R130l648r088O563N509m855k975N31L833J721n371p35L996n04N47
2018A346j292m455N601M347q007j734N956P55j546l670n85P524j301p679M120
2033f20K808k744K838l360m114R170R32j0202K445O162j261k216l426K256O707
2048E375m802n373N326J035r56J036n513J504Q697n426o830N806L527j829k966
$$ y = [-603, 4208, 1791, -4687, -1485, 2681, 1969, 633, -4303, -2487, 7249, 2018, -7944, -794, 5886, 1186, -3081, -3625, 1868, 5490, -2380, -4872, 2222, 2165, 608, -249, -4904, 768, 7593, -2736, -7322, 3268, 5076, -1265, -3932, -1599, 4450, 2656, -4728, -1414, 2669, 572, 1394, -2078, -4491, 5091, 4568, -6648, -2462, 4914, 1311, -1148, -2926, -1115, 5551, 386, -5843, 1375, 2857, -1193, 1341, -2086, -3308, 5822, 2174, -6914, -351, 5158, 303, -2672, -2141, 1692, 3413, -1958, -2693, 1303, 799, 1346, 54, -4401, 1200, 5547, -2460, -4194, 1762, 2517, 971, -2699, -3284, 4240, 2939, -4740, -620, 2188, -556, 2282, -1078, -5192, 3978, 4910, -5292, -2847, 3315, 2054, -162, -3588, -1332, 5375, 573, -4800, 526, 1561, 605, 1641, -3872, -2368, 6329, 903, -5927, -121, 3406, 1577, -1389]
2063a389k909N957L711q067j122N821p00k61j430l974N936M005q212j653O168
2078A881J288k337m307Q23P461k484p145L905L194j748O34l498o52P601k103p265
2094d752L355M201j016k230l334L645N239n956l209N239L45q80l18l731L250M752
2110D600n565k595M104R90K01k774l108O524J872p776J497M375k578J321r07m259
2126d078N671K699p112J29M396l40l37k729j032N805m49n908J832L032m61l46
2142G72k895J60N047j354m327J027K353J800k105m681L823M987n136k477L123
2157A17O43J122j461m366M161M277n222k397K998J658P40l583k763O036K036o202
2173b206l89L173J153Q4l960j048O258k63n560R62K368J099J51m839K19P246k416
$$ y = [-1389, -4298, 1659, 5370, -2697, -3819, 2002, 1302, 1041, -389, -4363, 1573, 5578, -2634, -4287, 1881, 3169, 832, -3475, -2652, 4809, 2325, -4820, -915, 2279, 531, 1165, -2333, -2985, 4616, 2513, -4752, -1397, 2804, 1788, -442, -3776, -131, 5108, -848, -4057, 1182, 1527, 647, 329, -3402, -152, 4600, -965, -3560, 544, 1534, 1735, -1039, -4147, 2377, 4249, -3527, -2030, 2345, -233, 1088, 181, -4078, 1593, 4292, -2820, -2691, 1705, 1365, 1028, -1701, -2733, 3072, 2623, -3285, -1453, 1579, 1118, 772, -2123, -1963, 3084, 1730, -2597, -1570, 783, 2583, 478, -4203, -380, 4607, -529, -3006, 117, 760, 1882, 421, -3945, 216, 4493, -729, -3126, -128, 1530, 2270, -1313, -4076, 1960, 3996, -2206, -2595, 578, 1731, 1815, -2145, -3193, 3065, 2802, -2758, -1796, 572, 1671, 1822, -3017, -2798, 4448, 2032]
2190B032n967L020K720o78n54l204R70N583k653m966K880K874n87k060k101K698
2206GL339l147l151K292K785l49l623p89M395N29l578k15J293J351R87l894j229
2223b997N629l54m621J154J701L87O31l343n57N225r93m277J568J633J07J57k835
2240a785r3M328q01l821Q48K214Q27j552k578J869L117k130k196R23J318J336
2256A824j705k841K474L051k584k220J188J956Q69k834j899L668J685l302j176
2271a846J441J707L49k799j327L728J238l272j444J953K508j043l755R49M038
2286B425j029k972J68J687J601j152l271J386L748j489l048N15K280J411k483
2301b23k650K986K667k800k011J525J630L98k103j670K630K011k508j971J434
$$ y = [2032, -3935, -915, 1805, 1127, 573, -2631, -1661, 3922, 1269, -3697, -817, 2057, 1470, -590, -2691, 7, 3346, 199, -2952, -660, 2125, 1776, -1847, -2636, 1759, 2288, -1290, -1505, -212, 1139, 2126, -1768, -2997, 2632, 2278, -2343, -1189, 512, 899, 1530, -1813, -2370, 2855, 1862, -2415, -847, 786, 893, 1050, -1785, -1878, 2450, 1649, -2172, -1324, 890, 1717, 165, -2413, -544, 2573, 443, -1753, -830, 488, 1824, 119, -2722, -248, 2803, 219, -2001, -813, 1143, 2012, -822, -2721, 947, 2632, -670, -1846, -405, 1302, 1651, -1148, -2475, 1253, 2491, -781, -2225, -272, 2236, 1193, -2562, -1613, 2425, 1396, -1576, -1408, 279, 1880, 728, -2543, -1157, 2591, 1102, -1946, -1431, 849, 2260, -223, -2873, 113, 2780, -20, -2031, -506, 1124, 1522, -581, -2251, 379, 2390, -118, -2089, -655]
2316f55K337j95l036l25L424K37k800l96J486J224m28k275O5K703L8k245o63J649
2334A45J654j400k394J338K576j339j787M26J128Q70r58j871J124K132j008j831
2350a195J39J713R62j990j550K117J492j709j199O75J265N46j689j088J705J354
2366A548j313j689O04K196q2k547j33K497J97j674p82P33J705j77k366OK468J46
2384A337j805j039J341J949j147k506J164K387q84j907m6J487J195j476j804J346
2400d08K067q75k058J1K281O38k516r03K296R37j453j224M39J841K53k289n17
2417a480K354M86j645r78Q54J857o07k465O31K360m30j716j86J034J149p65j839
2434a386O95J901l54j661l60J567J061j745j180J576J003q38q59k03J117J001
$$ y = [-655, 1682, 1487, -1549, -1874, 1550, 1787, -1013, -1409, 77, 1301, 873, -1402, -1337, 1366, 1404, -841, -1504, 145, 1799, 399, -1995, -657, 1919, 580, -1207, -781, 347, 1217, 259, -1612, -488, 1644, 636, -1195, -1056, 657, 1619, -371, -1921, 196, 1688, -21, -1220, -545, 720, 1266, -423, -1511, 194, 1548, 235, -1454, -850, 1346, 1264, -1283, -1416, 1081, 1278, -396, -1178, -445, 1260, 1083, -1283, -1277, 1191, 1337, -468, -1507, -166, 1783, 636, -1870, -706, 1681, 797, -1110, -1156, 331, 1526, 50, -1754, -408, 1659, 784, -1274, -1263, 1018, 1656, -860, -1763, 533, 1470, 17, -1207, -768, 1073, 1326, -963, -1480, 874, 1360, -285, -1263, -409, 1448, 841, -1624, -993, 1367, 937, -779, -965, 69, 1218, 453, -1386, -691, 1210, 856, -805, -1165, 402, 1463, -282, -1462, 114, 1117, 279, -580, -783, 334, 1335]
2450A335j557j212J638Q29q64r83M1J509M35j903m13J719L04r23n27j1J190M01
2468A008j741l20J578M71j083r78O59J635o03j755O15J266k72m85q93M71J739
2485A312o64j997P88J523k33j232n82J217J210j407j307J359R71o49p93l58J034
2502A92J193j578j228J315J295p34j435J24J884p4j943J24J419R1m99q19r4J680
2520I13J34k177J96J680J08j020q64P81J606j026j670J197J120p64m21m62L98
2537b71J376q55j558J093J207n33r95k84J318P02j829l44J424Pm23k36m94R09
2555B14P73j378n84J405K69p15o52J62J323k10j506M12J088l90k41l49j72J126
2573E75P9j413K13J008J30o68p56P38J116r76r50J061K45l41R0p65K85J390q50
$$ y = [1335, -222, -1434, 204, 1033, 169, -814, -773, 736, 1171, -732, -1145, 574, 878, -45, -572, -583, 607, 1008, -733, -1053, 525, 996, -87, -1065, -406, 1229, 626, -1129, -514, 752, 480, -5, -898, -427, 1312, 648, -1349, -561, 962, 729, -503, -1085, 132, 1342, -65, -1372, -13, 958, 309, -484, -842, 192, 1385, -193, -1421, -106, 1189, 455, -980, -856, 1028, 954, -989, -865, 554, 645, 146, -673, -767, 913, 1047, -1130, -934, 746, 854, -166, -1030, -249, 1357, 331, -1339, -142, 978, 214, -207, -669, -271, 1105, 250, -1308, -215, 992, 459, -536, -820, 498, 1200, -629, -973, 451, 458, 35, -201, -695, 214, 987, -391, -975, 430, 699, -16, -668, -506, 817, 607, -899, -487, 601, 211, -30, -379, -551, 575, 654, -759, -546, 462, 592, -76, -832, -94, 1022, 46, -904, 157, 402, 61, 151, -614, -329, 1061, 211]
2592B11j261Q75P79k67p10m47J189O54j561k44J178o2k12k34n81R79O71j445l11
2611g99J091L63m46r49K32J513o58j371Q78P18m80j7n12KJ264l62j408O46R35
2630F40j98o53n77Q85J005j403o47J270J32n00n0l86M73Q25r74o31R04M65m34
2649A46o80J2J222j14j420M12R92m24j68j97k09R73r8j087K98O52l9k13p38L97
2669b83J279j084q80J256J69n77K53m38L1R63o12q36P91L43k28k82m90Q52O49
2688H76j371j67J070j56k58n6l75O49M24r64j86O50K12j11p69r6J419k27j399
2707h35N60Q28m74N7m75j30J098j15j257M00P34M5m29q00O42J197j046r29R34
2726EM82l02l80m36P63O77j050l90O47K83R8p27n48J455L79j726J20J249l15k56
$$ y = [211, -1050, -175, 604, 337, -373, -820, 369, 1023, -538, -782, 396, 334, 122, -112, -693, 286, 957, -488, -799, 292, 655, 209, -740, -508, 1005, 347, -1024, -146, 572, 92, 75, -437, -435, 829, 467, -941, -295, 640, 442, -211, -788, 97, 1102, -301, -948, 322, 454, -46, -96, -482, -9, 816, -158, -789, 115, 580, 146, -534, -522, 700, 586, -834, -422, 570, 146, -22, -219, -428, 545, 447, -640, -342, 310, 271, 58, -680, -283, 996, -88, -968, 288, 457, -120, 133, -305, -274, 689, 77, -759, 32, 375, 147, -135, -625, 227, 876, -495, -662, 408, 252, -6, -62, -437, 212, 636, -328, -514, 136, 348, 237, -532, -628, 791, 564, -835, -275, 553, 79, 136, -339, -469, 629, 514, -743, -343, 391, 436, 7, -793, -151, 1046, 0, -929, 5, 487, 185, -195, -631, 132, 809, -241, -631, 16, 299, 397, -330, -878, 577, 956, -770, -650, 599, 284, 28]
2746B8k42l63J092K19j368J38R66p4l93n53L20J104m95j236O20P48k04m76m28
2765e97M96Q99q74n70O07J95K16l71q86R38J025j418m30J116n6l12jo11P78O93
2785H37j204k65Q92K2k12l01l41R21L49j126j69Q40J78l26n91K03Q99l57o33J99
2805a85J28M48l3j153L57J433r06q55P42K57K3K6j031N65J174r56q75Q25L90m5
2825C29l09p78P02J020r88q26Q64N33j74q02k39J090K98j105j39N52M30o8r24
2844e34k06J554j25j375K28O98J96k95q66K78J373n52j191M79P86j48l69n58M72
2863a55R52n89r43N19O88N3q46m75J156M29j073l31O81K28P7o99l96J146L39j217
2883d56k6O43J76J0p70k31J318o1j261K16P88r7j26n18K2Q93k2r66P7N52K90m52
$$ y = [28, -214, -577, 515, 734, -634, -496, 470, 396, 3, -550, -230, 874, 379, -857, -237, 511, 307, -169, -597, -101, 798, -76, -646, -39, 156, 372, 1, -885, 53, 1078, -340, -770, 346, 290, -22, -23, -634, 144, 837, -367, -632, 260, 282, 70, -231, -572, 349, 698, -428, -597, 243, 421, 95, -496, -293, 606, 249, -384, -185, -57, 391, 358, -795, -438, 995, 89, -766, -24, 233, 256, 282, -749, -184, 990, 34, -841, -16, 374, 329, 20, -758, -56, 964, -24, -850, 14, 547, 373, -429, -668, 422, 720, -385, -524, 28, 458, 390, -534, -740, 814, 689, -686, -458, 240, 436, 141, -725, -447, 926, 374, -817, -338, 448, 300, -69, -627, -155, 797, 208, -735, -216, 472, 525, -321, -796, 360, 789, -284, -615, 66, 294, 371, -328, -724, 422, 761, -456, -482, 161, 337, 347, -423, -654, 664, 603, -658, -442, 346, 249, 123, -395, -373, 520, 498, -468, -391, 161, 451, -1]
2905ao74M80R36o12o66L80L34K88m51o78O68O88o10m79R8N08M30q05p77J194N52
2926H03j138l04O07M02L2o98m55J146L73r75m31N67O53l4j242l4J513j48j173
2945e36k3P19M84n08r47M84J088l76r63o6Q22O99q28j172J083J181j091q95O06
2964b39O82J09r13n70J066P57j087n67M65Q15J56j193m18J630K33j361l53R10
2982A22N74n13p93K09J029o8r65k16O39P59n04j182N90J253n75j040L00P43K29
3001E91o57p09P00Q11o28o23J27N81N67q31q56R81Q89r98p02N52O32l9o50l95
3021f57Q13N01o49n34J30Q85K61j324k50J293K36r28l71L83Q54n4j234P6J127
3040E58J7p73m27M00J022k61j540L93J589m20j215L1P98P42p80j082O33J196m50
$$ y = [-1, -675, -195, 741, 129, -537, -157, 177, 465, 14, -664, 4, 692, 82, -397, -299, 209, 639, -166, -943, 251, 803, -335, -639, -32, 370, 402, -296, -751, 395, 768, -207, -638, -71, 582, 548, -694, -728, 785, 637, -536, -559, 160, 644, 136, -811, -327, 761, 385, -578, -644, 178, 877, 49, -1123, -40, 1141, 50, -845, -239, 443, 552, -361, -931, 135, 892, -195, -762, -297, 518, 674, -519, -937, 693, 926, -435, -788, 122, 696, 183, -610, -401, 628, 560, -405, -621, 18, 777, 273, -909, -319, 934, 359, -681, -381, 362, 591, -66, -775, -75, 736, 108, -515, -388, 193, 760, -71, -927, 54, 943, -55, -757, -205, 427, 388, -262, -657, 156, 657, 8, -526, -396, 489, 750, -574, -824, 469, 705, -223, -594, -211, 643, 589, -645, -569, 558, 575, -198, -625, -225, 797, 536, -1004, -611, 978, 558, -657, -626, 172, 914, 134, -948, -315, 881, 431]
3059D31r96k67J186P32j365r13J337R92j021j013L83J237J12j455k76J268N23
3076H95r46p81M07J324o4j879J40J738j9j297l86R44Q56o17j257M01J350k19j043
3095d53l46Q48R59r17j256R25J201p15q92J01R83M26j042p32J007O62n92p34O
3114e61R72M88j323o83J555L70r62m64L92P35M5j009k47R85L50n36p12J44J152
3133F91l2j385M0J246R3r24l54M31Q93l27j075K41Q67J79o72q13P53J274q72j405
3153a151Q99J106m55p98k39P66P97q90j009P43J034k48j046m33J396P67j689p03
3171a153J506O07q15r38K43J313N4j428k02J123N07o42j132M21J771n11j982N94
3189f64J714l81j111l90Q48R53o97j296O36J128j18j118m56J171J062j479j059
$$ y = [431, -565, -832, 354, 1086, -279, -1192, 145, 1137, 116, -897, -514, 723, 835, -620, -896, 372, 895, -51, -832, -425, 899, 835, -1044, -904, 834, 815, -482, -868, 76, 932, 315, -942, -541, 809, 590, -453, -799, 49, 1008, 91, -1165, -240, 961, 246, -646, -545, 438, 864, -178, -910, 97, 759, 167, -567, -561, 411, 899, -424, -1107, 448, 818, -144, -608, -216, 519, 564, -445, -692, 293, 643, 107, -605, -461, 691, 659, -726, -686, 560, 653, -271, -625, -194, 699, 372, -703, -462, 405, 584, -88, -901, -148, 1126, 254, -1151, -252, 854, 399, -399, -638, 128, 925, 35, -974, -231, 803, 555, -491, -924, 472, 1239, -450, -1153, 353, 960, 145, -793, -550, 763, 817, -611, -813, 310, 817, 175, -957, -536, 1235, 724, -1258, -664, 1050, 669, -442, -832, 16, 969, 272, -1024, -388, 740, 622, -496, -952, 219, 1281, -198, -1257]
3206a257J318J007q26j036L06J072K12j253k80Q58N67l76j029p8J638O6j802Q
3224h85J557o3p95l93K61J008k13j196K70P59K50m90q22K54J430m06j617O39J214
3243G62l72p83k42N91P33o05o77L17N70L45p20r55J015J290j340j072J168P06
3261G31m10p69k96J021O90j166o11P05P45o8j152n20J763N95j923n01J584N41
3279I59r31r25M14J337k18j270r2R27O50n68j440N22K077q77j905Q38J402k56
3297F44j021o89J133J114j107j138Q47Q78m9r81q27J503J106j680j144J485J018
3314A092p45j176K38J433j22j335j15R17L85j58j174r8J943j22k090M57J350j21
3332E59o62o02L18J336n16j310O07P69j76k91q14L70J400n26j479N53J208k14
$$ y = [-1257, 61, 1068, 242, -794, -488, 584, 796, -457, -737, 121, 688, 312, -717, -795, 843, 909, -893, -885, 672, 609, -186, -579, -318, 690, 477, -719, -449, 310, 560, 70, -752, -498, 932, 526, -1091, -452, 762, 390, -393, -635, -44, 689, 84, -593, -276, 294, 639, -81, -1036, -21, 1269, -71, -1143, 25, 731, 321, -448, -744, 277, 967, -199, -810, -105, 640, 572, -580, -1100, 663, 1258, -665, -1166, 418, 959, 28, -897, -483, 854, 636, -634, -726, 201, 851, 283, -1157, -635, 1442, 565, -1340, -502, 900, 644, -377, -1066, 67, 1181, 74, -1064, -217, 661, 612, -369, -1196, 307, 1413, -267, -1411, 74, 1092, 347, -829, -591, 842, 720, -615, -730, 187, 572, 414, -760, -858, 1085, 963, -1127, -670, 680, 559, -103, -705, -387, 949, 433, -877, -270, 499, 323, 32, -782, -412, 988, 462, -1017, -464, 744, 530]
3350E30r25l47R82N10q72m54M24L28N02p75j089J393J034j579m94Q18N60k2q50
3369c26o68J491M97j512j79Q16K46J95r77o04J580O48j706n50J267P67p41j276
3387a032N88J331m65j034J04N49Q32m39j632O78J871r35j484O53R90K07q60j179
3405a257J293J366j471j118J161O83j31q73p47J283J090j403j140J205J120n94
3421D67j440K08J669j36j342j27P59O59k24j501K21J968n80j549M78Q47K61l61
3439B77j255N22J704q69j504Q90P71j64l28p38M79J168o59j094M04R41J02r82
3457c35n52J219N03j014l36L34M73L72r39o56J312M12j130j96L96K98N62j138
3475d15n67J580L32j518n8P92K63n6q35k52J218L85j230m54P86Q59n45j190M80
$$ y = [530, -395, -742, 240, 750, -122, -576, -152, 176, 678, -97, -1186, 207, 1241, -338, -832, -14, 546, 524, -326, -994, 497, 994, -518, -697, 119, 365, 560, -417, -1021, 559, 1207, -499, -1049, 218, 985, 244, -1032, -444, 887, 422, -612, -508, 41, 873, 434, -1198, -520, 1351, 416, -1068, -415, 575, 782, -78, -1257, 36, 1402, -69, -1187, -26, 657, 526, -347, -1094, 189, 1279, -124, -1264, -59, 1061, 467, -973, -765, 904, 768, -574, -701, 58, 717, 493, -1008, -787, 1181, 601, -948, -470, 377, 638, 277, -978, -456, 1248, 379, -1125, -235, 536, 372, 44, -694, -215, 953, 294, -800, -396, 545, 647, -335, -887, 332, 835, -179, -515, -181, 292, 664, -275, -931, 381, 793, -337, -533, -137, 161, 723, -415, -982, 598, 930, -588, -646, 146, 409, 353, -482, -734, 484, 869, -361, -815, -29, 830, 285, -905, -425]
3494d25J285l91r65j50P34Q87q26j331J071J219r24p42O2O72Q24r76j416J514
3512A22J228j439q54P38P96Q3j108o03J390P17j271p37O79J124k07j497r2J739
3530H08qj333k59Q88Q02o22j355N95J532p13r78J54N72O57m35j425P76J573r90
3549B39j182N91Q01J59q10p17J036P58r46n64L12O63L55r85o30J271N57j065m71
3568f28M15P24Q7j119k17J308J8q36j78K00N54L92j222l47J474J27j091k60N13
3587h6P63k31j163L13R74j01p17l09L83R59l42j407M77J393m02j134n6Q26Q50
3606I90r37j071R28R73o01p81j71Q81Q56j149j101J228J108r96j015L40J200J86
3624H68j460l92J449L76j001o22L43J187Q9j738o9J732J98j323o22R89J040o90
$$ y = [-425, 860, 469, -496, -646, 88, 975, 149, -1182, -111, 1108, 184, -558, -496, 176, 1000, 24, -1392, 122, 1350, -89, -943, -205, 591, 674, -434, -1037, 353, 1070, -201, -938, -259, 865, 658, -839, -931, 808, 800, -533, -792, 96, 898, 276, -1079, -484, 1048, 335, -643, -489, 83, 740, 305, -1120, -344, 1229, 239, -943, -352, 449, 608, -202, -919, 117, 875, -71, -635, -323, 340, 695, -290, -920, 351, 908, -157, -628, -213, 511, 598, -521, -738, 570, 588, -248, -426, -226, 328, 720, -502, -849, 625, 752, -339, -599, -86, 677, 446, -717, -404, 570, 469, -248, -557, -174, 785, 443, -964, -487, 906, 504, -630, -686, 140, 990, 53, -1018, -90, 883, 282, -499, -670, 211, 1067, -82, -1183, 45, 1153, 157, -858, -518, 682, 868, -592, -984, 465, 841, -160, -782, -439, 748, 837, -901, -970, 762, 960, -363, -985, 4, 1044, 354]
3642C54j476O64J333m01j003j78Q31P73p26j272Q48J237n94j090J5J178M44j353
3660d16n72J233N99q72m87J19Q29L73j209n41J281N15r52o14M47Q71m4j159l3
3679f32J087M0o63l12K26P67k6j038j6R99K44q86n83O34R94n38j095N30P68q5
3699D15m75n52M00J080n73j197M69J209k39r81k93Q40P67q33r42P39R40l68r09
3718e03j64R91O15j080q74R80J004o30j152O1J541J6j442r6J093L71n65q97J88
3737e43J406l2j777P2J567J35j097o39P97J167o48j434N72J155n6j142k83R24
3755A44Q98r49j153Q02J147m00j241j0J330M10j431l98J035N57n07p94m2J140
3773E38K90j345l73J268M50q63p00M71R56j95j095P3J004J10o99m96M03Q44j84
$$ y = [354, -1122, -458, 875, 474, -529, -707, 124, 897, 171, -1101, -253, 984, 390, -700, -685, 493, 937, -416, -988, 245, 844, -28, -515, -396, 433, 806, -403, -944, 337, 852, -100, -714, -267, 604, 560, -599, -632, 455, 495, -168, -480, -254, 513, 487, -551, -567, 432, 676, -210, -793, -159, 835, 297, -798, -268, 500, 415, -60, -612, -212, 868, 295, -902, -433, 776, 537, -444, -737, 103, 870, 37, -905, -166, 774, 406, -503, -667, 324, 939, -141, -1015, -35, 969, 339, -813, -752, 789, 805, -637, -733, 360, 731, 166, -731, -543, 863, 831, -946, -874, 693, 828, -269, -908, -111, 1056, 408, -1026, -454, 701, 645, -497, -780, 144, 1042, 93, -1060, -258, 889, 489, -752, -762, 568, 978, -453, -851, 184, 741, 234, -560, -602, 538, 828, -517, -890, 378, 828, -35, -735, -264, 692, 497, -598, -525, 479, 589, -110, -606, -203, 641, 457]
3792D57j100J47J074k2p88m07O33P34o65p01M51O43o2n21n29N84Q77o47r73N17
3812b98R15j71q43k36Q96M38q06n93N11P58r6q75m40J207O15j244o10R12P44m55
3832C29j072Q4J381P3j366j44R28M88n17r97K19J460l6j628r5J597K47j253o57
3851i59R89R27n98j218L69J108K07j258n51J202Q48j101j052Q05J227m07j319
3868g81JJ473K17j367l36R27N27l08r99j2J380R3j470j55J188M58q76p99N38J199
3888H98m72j218L20Q99Q2n72o52N10J044m09j204L31J064n0q90m03Q12O56p01
3907D5o76L93O69M2p64m16P33P49p37q37M52Q81Lj036k31J158K43q98l30L73O41
3928D57P3r83m02J218N53j243n37R01P09l62j130J39J330l2j195j58P77N93m31
$$ y = [457, -643, -496, 578, 556, -232, -639, -6, 728, 63, -638, -187, 456, 394, -127, -656, -72, 805, 158, -815, -298, 617, 446, -397, -633, 263, 701, -105, -698, -187, 571, 475, -400, -840, 367, 982, -262, -872, 40, 784, 329, -743, -659, 722, 795, -571, -715, 213, 701, 184, -813, -594, 866, 830, -798, -893, 704, 951, -302, -959, 30, 957, 359, -859, -490, 618, 825, -433, -984, 218, 1066, -35, -1087, -282, 945, 538, -781, -780, 693, 910, -457, -793, 134, 661, 353, -646, -658, 722, 815, -655, -810, 378, 836, -40, -839, -301, 898, 426, -792, -472, 427, 509, -63, -715, -205, 839, 430, -774, -443, 621, 571, -319, -722, 90, 746, 45, -631, -238, 431, 473, -291, -707, 26, 775, 38, -799, -347, 534, 537, -499, -730, 428, 671, -227, -557, -184, 457, 530, -453, -855, 363, 916, -327, -864, 37, 746, 384, -746, -607, 723, 691, -504, -662, 115, 708, 277]
3947B77j147L14J436j64j438j11J292N54j118j023J068J121q42j043M04J035K08
3964H23j091p71J100J130j115j193P76J286k56j473q7J516K79j329m42Q14Q37
3981H04m33j202J03J516K5j407k24J000O58o28j124N73J319n71j290M28R14R6
3999E57n90p23N60J018m49j112K64J079L5j049l45R65M66o75n41K09P80J02r12
4018c61k69R44L53p49m35J83P45K55j136l79J315K27j084k8L55M17J88q65m95
4037h19J184L84j051m12O80O93m04r99K42J173m7r63l33P23P55n42j114M50J150
4056G50k29j036j64Q53P76r36j151J056J139q81r50L55Q20L58j006p60J095R05
4074I94q62j034N02J199j28j425k8J355K57r78p36O44J178m24j544M76J342k63
$$ y = [277, -870, -556, 880, 716, -722, -833, 459, 1013, -105, -1128, -60, 1061, 219, -824, -420, 615, 823, -268, -1039, 61, 1191, 76, -1117, -341, 945, 689, -784, -871, 645, 924, -405, -847, -33, 804, 371, -831, -728, 788, 813, -594, -818, 182, 840, 212, -912, -339, 980, 409, -881, -453, 461, 557, -33, -756, -196, 822, 373, -739, -475, 604, 639, -410, -755, 210, 676, 1, -540, -331, 449, 551, -361, -630, 314, 667, -82, -517, -334, 411, 666, -470, -849, 466, 693, -391, -419, -64, 353, 541, -324, -819, 365, 749, -302, -714, -34, 659, 255, -744, -502, 671, 624, -339, -672, 51, 806, 264, -850, -400, 750, 521, -515, -679, 174, 950, 14, -1137, -81, 1058, 177, -773, -418, 402, 760, -246, -1006, 89, 994, 132, -902, -400, 799, 671, -754, -782, 573, 830, -148, -884, -240, 938, 514, -1030, -554, 788, 525]
4092E25r25k10M98J012n27j540P79J514q44j031L72O85L42n99r65P29J131p27
4110B19r46L21R26J21q69n37R05O91p86o95L27Q83r6j005L1Q64J51n96l84J43
4130c32P30K02j142j15J178Pq29r1L43N94k02q69P4R02M1p18k95M38P28l28j057
4151g41L57Q84m5p98l61O77R30q28r75P86P58m02m89l38N91R82r30j197J113J002
4171I76q04q73K04Q88M11j052o90J083P43q20q92M54J100o3j246j52J135M59r59
4190i8q83Q20J175o64j335N34J084j13q00m40O07J150q09j318Q21J149m75r00
4208d95j81J008N35j054q17J030P92o86p25J69Q14L55j074n47J107N15o64p94
4226g12M08R35J8j235n7J064N0o09l04J90P05N6j013p5J010J60p48m41M97P92
$$ y = [525, -400, -610, -112, 900, 373, -1167, -388, 1126, 282, -749, -377, 308, 650, 51, -914, -185, 946, 219, -727, -406, 520, 641, -228, -765, 140, 831, 45, -650, -323, 560, 464, -541, -510, 354, 505, -91, -475, -332, 398, 600, -542, -657, 521, 528, -301, -392, -49, 545, 343, -526, -452, 450, 491, -227, -522, -84, 644, 316, -741, -384, 500, 455, -343, -704, -27, 903, 75, -900, -114, 644, 242, -247, -585, 6, 988, 58, -1139, -26, 976, 172, -701, -497, 391, 802, -250, -940, 143, 886, 66, -826, -372, 728, 665, -581, -733, 402, 861, -98, -981, -161, 1014, 350, -985, -451, 633, 520, -280, -720, -113, 1037, 228, -1090, -269, 880, 405, -495, -676, 332, 867, -187, -1004, 26, 818, 132, -593, -424, 390, 745, -329, -876, 231, 746, 82, -712, -304, 631, 649, -586, -643, 421, 471, -138, -442, -252, 453, 509, -504, -579, 431, 591, -157, -598, -101, 691]
4246F91m88q24L48O51nm79m09L62P74l52q68K40P97ro63m98P46P63p38q68P49
4267h0N96j73o17l95Q03O80q08q69P04Q93k72j093l1J131L11j121m35R03N59m92
4287A94q52J19J195Q4j309k89J133O12q83q84N81J251n01j309L21J147j3q00n76
4306g79P89Q59n10j212L16J268q9j224l19J272N52j110o68Q20O71k90q96l5R85
4325D00M32j163m52R61O31o04q86K94J054o0j190q8J078J73o82m05L13P00j09
4344C97q32j29Q86L02p50n13O07P19n40o80K60N98J05m74m65L94P59m38p77J86
4364c85P91Q9o65m66O56P24o12q01M66O75j11o29k31O32N30n21q92L64J038j99
4384D53j025j10J147J61r42l23N89O12k43q17r1J130J99j178l31R93O24p60r19
$$ y = [691, 203, -621, -273, 378, 373, -106, -515, -153, 621, 269, -599, -359, 438, 429, -234, -732, 14, 777, 39, -829, -80, 516, 343, -274, -669, 134, 814, 6, -863, -159, 734, 462, -631, -662, 469, 780, -341, -776, 127, 686, 194, -658, -539, 656, 740, -569, -858, 275, 887, 4, -880, -299, 952, 451, -858, -537, 610, 597, -203, -779, 10, 869, 359, -853, -537, 731, 642, -582, -901, 371, 923, -187, -855, -35, 636, 346, -550, -585, 400, 832, -331, -783, 178, 809, 205, -681, -387, 667, 607, -583, -671, 407, 580, -102, -507, -194, 506, 397, -435, -564, 322, 624, -126, -639, -32, 687, 147, -533, -273, 325, 430, -44, -509, -115, 644, 206, -571, -385, 406, 495, -170, -636, 20, 744, 132, -669, -203, 472, 361, -268, -499, 133, 663, 142, -750, -386, 652, 453, -572, -682, 465, 626, -316, -639, -50, 562, 319, -498, -589, 541, 740, -438, -769, 224, 848, 88, -831]
4403h31N09J155l09j190L8J115K38r16n41O04R09m03j169K00J191J51j198m32
4421h79J155O45j086o25P10P70k89r03j79J022N00j090o57R11Q23o24q80K48J022
4440E94m6j056j72R58M04p10n89M77O74j19q48j81R01M02q13o18P73O99o19n97
4460d86L05M34J19m24m80L75P86m62p91L38O95N5p05m17P16O39o78o40N46M01
4480C26Rn30k64M51O54m96r10M65Q95j46r63r2R28K84p92n15O24O78l33p90J8
4501d99Q38M08j018o32R58Q27p70r77N89R71j91r99j33R32N23q98o99O26R26l59
4521D23j088Q7J036L47j138o50J195Q72j181o96P09N96l2p79m69J047O68j126
4539a79p82R60P65n30q89J16J131Q8j176k34J081L24p55n84M34O80L3r05k61R80
$$ y = [-831, -322, 833, 524, -666, -628, 487, 725, -191, -732, -128, 781, 378, -791, -591, 600, 751, -447, -879, 276, 921, -165, -790, -80, 690, 401, -502, -681, 341, 841, -249, -906, 5, 828, 204, -676, -428, 594, 548, -508, -680, 278, 682, -28, -617, -140, 534, 415, -433, -614, 287, 689, -124, -742, 31, 730, 111, -486, -181, 253, 372, -52, -532, -157, 629, 167, -624, -286, 409, 464, -241, -658, 58, 697, 19, -621, -75, 326, 335, -195, -459, -8, 646, 150, -760, -295, 600, 454, -509, -601, 327, 611, -181, -696, -72, 606, 273, -517, -499, 339, 747, -271, -903, 55, 882, 112, -865, -276, 695, 504, -495, -628, 304, 827, -71, -770, -144, 782, 423, -665, -578, 458, 805, -333, -983, 212, 1084, -97, -793, -84, 512, 480, -299, -768, 279, 947, -179, -961, -1, 764, 234, -655, -539, 592, 680, -496, -730, 351, 675, -80, -664, -230, 450, 483, -422, -683, 297]
4559B97M79q95p23P68Q42n98p14J99O48J66n79n08N85N70m27n67J37N82K79p59
4579b18m41Q89M53q43l43M13M04M8n07m37P04N05n87n81L11P05J1q61k33R32K85
4600F09p41m75O17N29k94o38j32Q38L66q72o06P46Q64o14r84M34R69j96r07j13
4620f00P57O39q29q14O26R33l57q98j25J064M48j100p83J196P29q47q57N03R55
4639F40p6j032l56J149M80r01p67O40R49l01j109j3J301R7j113k88Q56N57n83
4658A30q79M58Q96j48q82j71P99M92p85p14P39P57m85p03L9Q56K06q90l20P73
4678A68L51m84l71j26P36L49r47l45R94K33o66k16J39N21N9o63k71P83K71n80
4698f5m42L14O22J1q20j64Q63L43p71n52O82N38l58o47J01O68J17m24o17M84P74
$$ y = [297, 776, -119, -842, -74, 768, 170, -544, -345, 303, 469, -110, -618, -33, 537, 110, -457, -320, 262, 541, -218, -659, 230, 683, -160, -503, -90, 314, 362, -145, -582, 122, 627, 40, -541, -230, 475, 486, -375, -608, 324, 609, -132, -607, 10, 539, 245, -393, -525, 313, 679, -193, -799, -53, 811, 197, -787, -353, 616, 420, -487, -600, 157, 796, -33, -847, -221, 712, 355, -543, -668, 396, 844, -256, -1039, 157, 886, 39, -818, -315, 640, 564, -468, -824, 325, 805, -96, -863, -223, 726, 425, -684, -697, 604, 701, -412, -700, 156, 713, 130, -749, -291, 605, 457, -425, -596, 203, 695, -90, -804, -65, 692, 207, -496, -457, 399, 605, -285, -605, 168, 519, 35, -336, -462, 274, 623, -324, -669, 325, 558, -108, -324, -185, 336, 395, -268, -539, 244, 515, -65, -507, -193, 429, 440, -380, -544, 319, 662, -109, -661, 21, 559, 201, -446, -345, 323, 440, 16, -601, -117, 657]
4719F57m56q28L42P90m9p08m04Q75N37p57o66N63O50j57p69l30R83N47j092n58
4739h30Q85O83m78r50J72J112P5j295q8J126J95o11o11K85J007q9j300O1J296
4758F45k9r11m21P28P52n95r34M34R78j90r14k29R05L75o58n25M26P76k20r32
4778e39m7J077J13j045q9P19K33k69n37n9Q94L0r75m9Q36Q8l13n15J16P97n2r57
4800e43J61P32l3l36l39J75N47nq23K6P37N9m46l58K50P34l00p57K56N49J66o00
4822a48l55M40N95l10o43O2P18K14q79m07Q72M83o47n53L35P27p6p93l54J112
4842C93K35q63l22M53O30k3j143oJ280nj110j04P79L75m50p26K51J083k74j059
4862f06N3R04K91p71o15O49Q85n45j015L71J004q7r05j27P57L83o70n60K89Q64
$$ y = [657, 201, -627, -285, 505, 456, -252, -656, 219, 756, -1, -667, -104, 546, 389, -380, -710, 273, 820, -272, -830, 55, 738, 260, -690, -518, 594, 669, -626, -714, 412, 607, -4, -615, -330, 677, 588, -712, -651, 645, 616, -295, -716, 12, 764, 169, -765, -331, 647, 457, -457, -686, 219, 594, -64, -589, -163, 613, 393, -539, -586, 491, 604, -441, -530, 189, 422, 153, -384, -443, 451, 481, -494, -543, 293, 381, 68, -447, -331, 466, 414, -543, -382, 350, 317, -19, -358, -183, 364, 359, -464, -438, 299, 358, -88, -446, -196, 538, 238, -519, -263, 286, 452, -148, -503, -63, 532, 222, -421, -359, 359, 573, -306, -713, 159, 642, -5, -558, -223, 504, 428, -365, -719, 393, 628, -235, -557, -104, 526, 503, -640, -646, 634, 629, -481, -585, 194, 569, 119, -607, -356, 727, 453, -606, -553, 351, 642, -129, -744, -95, 790, 245, -770, -399, 605, 518, -387, -514, 243, 626, -44, -604, -315, 549]
4882E49r9r10j67J053K41r06k98N82N08l55o88J22Q77q7p49j8M00M13k57p81K33
4903c37R14k37p70N3O22J08l40m84L57O05k94n51Q7L85K68l20n67L73O37l17o64
4924d72J46O35O2m64l30L91M45k62n72QO51K12o53l94O21N38m95n63J17Q95m7
4945D69q74j37P78K57m72n29J67Q63m2j030k6J017K15r20l92P53N57m60q02K75
4965c33Q33J7r94j40Q58M70p07o78M78R06l32j008J19R77J57r30l25P36N31n43
4985I2o67K87P37J0q93j25P93M34p94n52O54O45m65o21J83N72J22o26l86O27M76
5006E03l91o39K82P31j28o37j81N94L72n52m44M72M29k09m83j6L53L60l72m85
5026d41K70O84k54p44J52O21P1m19l02K92N01k17n62Q6N44O3m48l88M51N81l32
$$ y = [549, 450, -460, -627, 426, 667, -239, -537, 45, 553, 198, -490, -368, 509, 422, -327, -345, 55, 468, 211, -570, -337, 577, 340, -430, -377, 245, 353, 13, -471, -114, 491, 197, -354, -267, 118, 386, 66, -501, -128, 509, 192, -472, -326, 309, 371, -93, -423, -32, 413, 151, -421, -413, 238, 450, -203, -597, 24, 562, 67, -496, -379, 516, 469, -405, -542, 236, 493, 21, -508, -341, 522, 480, -550, -576, 441, 656, -264, -656, 97, 654, 194, -608, -333, 500, 517, -477, -617, 241, 711, 4, -674, -196, 710, 378, -630, -511, 466, 623, -307, -632, 104, 635, 92, -575, -288, 449, 459, -434, -559, 234, 668, -126, -678, -24, 621, 156, -465, -282, 290, 412, -214, -600, 27, 503, 112, -527, -245, 486, 358, -279, -460, 134, 506, -46, -490, -18, 411, 202, -281, -297, 56, 416, 44, -441, -171, 513, 259, -485, -333, 288, 359, -60, -362, -70, 431, 214, -348, -262, 282, 345, -103, -491, -40, 541, 209]
5047B09o79J96O37k9n81k06N27M56m82n70K82O89p2q07o8P61K91p11m74O08N85
5068E62l79p26Q2Q56J23q37k43O99L98m55p24L31R05k20r53J51P73K86p74m30
5088e75N31P41m38q99K64Q30kp32l02P58M64o79o03N10O73k70o96M8P15J45p36
5109b53k77N49M82l10o52J24P69K0q12o9O44J52l75m36K51O50j93o42M7N49N7
5130B75l43l94K62O24k25o46J85M78K7l48k25K67M41k59m49J22M62J25n01l12
5150d34L91M80l78m25J69N08Pm68k11M47L70l49n30J56O02M1o93k55P72K85n53
5171f8l99L39O18j56p54J7P68O1o40j79L27N96l19q49K57J028k34r75J13O58L17
5192E26n34o24M47Q12l14q43J18Q11L6o69l68O95N31o04o07L06Q40j70q36j7Q57
$$ y = [209, -470, -274, 363, 334, -247, -453, 74, 530, 48, -522, -240, 449, 377, -430, -498, 263, 554, -157, -631, -23, 562, 183, -543, -461, 395, 518, -319, -562, 137, 535, 80, -644, -313, 592, 372, -581, -430, 343, 629, -145, -575, -44, 697, 259, -640, -376, 454, 452, -280, -582, 176, 640, -39, -642, -132, 541, 271, -425, -377, 338, 483, -253, -530, 19, 501, 191, -461, -337, 432, 452, -360, -429, 215, 367, -8, -444, -193, 457, 264, -378, -331, 218, 275, -68, -462, -200, 424, 199, -447, -262, 216, 243, -105, -330, -63, 378, 119, -330, -208, 254, 379, -122, -434, -43, 437, 59, -366, -197, 311, 318, -150, -361, 86, 456, 107, -423, -267, 335, 376, -317, -572, 200, 485, -68, -467, -128, 490, 334, -420, -403, 365, 426, -214, -393, -66, 530, 211, -638, -381, 647, 413, -562, -449, 209, 526, -8, -632, -185, 627, 313, -530, -412, 399, 435, -234, -602, 93, 624, 20, -587, -281, 559, 389, -447, -464, 393]
5213C93J26o42l82L51P00k69q03J17R34j09p85q7M90M49l94o36M21O02k79n45
5233c48J08L47L15m17n02M40M96l13m70J28L46K17m26m10N22L80l35l37K7L39
5253A07K64m47l60M26L73l19l93Q2N36P6n00k01M60K00j87m24k4O77K0p11j7N10
5275A48K63l14m60K01O42j35p98J57N95L9l71m11K61P49k77p78J90P28K5p22k80
5296e48O31O00o71n87M51O06j79o34j95P85L75q49m08O16N76m22n52L7P89R8r08
5317c89q0O82L48n89m78L15P38j99q36J52O49O0m43m43M48O28m73o49M25M41q6
5338B21m74j86N62M26n74m93M39M05k08l56j45N32K97o56k37N39K62k61l44m4
5358b95M54J31m44j53L11K75o9n24K8N73M8n22m8L12R6j3n22J43N53k9n83N8K95
$$ y = [393, 519, -123, -505, -154, 546, 277, -526, -409, 525, 416, -369, -456, 34, 483, 89, -547, -126, 476, 197, -348, -240, 107, 422, 5, -497, -57, 439, 126, -344, -216, 130, 347, -79, -489, 33, 413, 78, -259, -232, 107, 371, -76, -436, -10, 363, 44, -349, -267, 269, 345, -155, -356, 104, 304, 117, -307, -331, 346, 366, -345, -362, 148, 411, 97, -363, -162, 480, 345, -453, -296, 299, 338, -33, -444, -183, 566, 289, -489, -299, 429, 454, -268, -548, 83, 683, 12, -575, -124, 482, 303, -331, -526, 259, 634, -215, -623, -7, 569, 147, -405, -368, 421, 519, -389, -469, 213, 561, -28, -506, -191, 547, 348, -488, -336, 313, 373, -70, -513, -65, 563, 90, -559, -134, 307, 221, -253, -439, 123, 549, -25, -518, -79, 326, 118, -238, -383, 149, 446, -210, -447, 92, 354, 93, -251, -295, 159, 290, -154, -307, 4, 279, 210, -314, -286, 287, 335, -187, -235, 77, 173, 160, -362, -219, 334, 305, -278, -220, 75]
5381G5K62j67n51J65O90j70n94N4L59K36l30m94L51O32l12n76Q6M78K79n49n64
5402f40P42M94n35n97L27N10R2p14k12P33L38p57l51M69N76k07p54J54P26M4p12
5423b74k22N86M54m54o41L53P58k58p23O4M69L71m91o07N91O08n80m62L15M07
5443B64O1n33k96N88M45o28l09L81L55q6n54o3O13J53n18k01L30L16j69n01P6
5464b76O12n2m25q5J90L39j53m35K5N33m1m19n1K12L01j86m20J80M74j94l19n8
5486b48K78L41l36m08K49M96k28k84j72L52L82m24m61M60L82k89k93q1L92L66
5506D74n47m13N14M15l27m66J23N31J25o01l03O29L31n35m38M16N35j96o90m1
5526d64P18K22n86m28N16N97n02o28L53O33j13o40j58O32L88o14m76N64N27l79
$$ y = [75, 337, 170, -381, -216, 474, 304, -290, -236, 123, 359, 29, -465, -114, 518, 206, -370, -284, 194, 473, -76, -640, 102, 596, 61, -536, -209, 301, 393, -321, -533, 200, 538, -219, -570, -101, 475, 268, -486, -332, 394, 438, -274, -496, 90, 544, 90, -551, -198, 560, 302, -421, -357, 112, 483, -8, -615, -24, 584, 4, -458, -143, 264, 325, -208, -504, 84, 529, -99, -408, -27, 328, 242, -312, -375, 238, 391, -127, -328, 2, 318, 149, -352, -276, 336, 284, -141, -226, -36, 303, 150, -285, -260, 273, 232, -187, -238, -26, 275, 89, -331, -151, 323, 129, -190, -248, 30, 371, 35, -373, -124, 372, 144, -140, -312, 40, 422, -2, -463, -3, 379, 90, -203, -284, 108, 474, -73, -486, 28, 443, 116, -350, -227, 304, 429, -172, -475, 154, 485, -50, -488, -72, 463, 267, -423, -464, 254, 476, -110, -538, -22, 575, 73, -555, -202, 431, 318, -322, -480, 152, 540, -74, -550, 14, 541, 162]
5546A62n73Q5P07Q3o73l06O48L84n13m44K61M76po40p2N82J77l48m07L57M94k48
5568A85n51Q9N07L5m56j25K70M12k89l29P4M08ml78j61L74K03k20l23J45L68o2
5590A72k68j58L28J59j49l83O4M46M9m66r8L74K30l22k67K15L01K3m90q7M72K54
5612C99m55k94L61M02k25n68J28N03Q2n23k42M57L94l30n46K90N51r5n15j82N77
5633A69L23n90m36M78N02l19n18P1N57J43o70j78O04L01m29m29K08O29n3q26R7
5654c66O62O1m76l00M04M77l18o07J85O64j32m34j90M83L62n66l56L95L63j67
5674A44m26l5M60K04m51k25L01L02j75l31jM67N6m76q7M85lk06j98N3L60K7l89
5697a44q6L09J21j85k95O6M39l2m53K6K82K04j86l63J45M21k15k79N3K11J70j89
$$ y = [162, -411, -326, 381, 464, -209, -515, 133, 517, 4, -440, -179, 297, 290, -350, -422, 160, 337, -11, -418, -61, 433, 185, -366, -277, 230, 265, -191, -316, -46, 366, 77, -252, -178, 230, 226, -152, -313, 61, 264, 44, -279, -134, 234, 172, -96, -254, 74, 233, 84, -299, -235, 211, 260, -206, -304, 70, 300, -22, -289, -74, 227, 250, -240, -327, 145, 399, -56, -350, 11, 413, 188, -380, -252, 251, 333, -190, -432, 25, 419, 89, -457, -167, 384, 289, -226, -408, 169, 492, -98, -534, -56, 446, 127, -391, -320, 237, 380, -290, -468, 136, 437, 8, -421, -213, 416, 363, -463, -366, 296, 357, -119, -419, -15, 462, 144, -463, -278, 386, 254, -180, -370, 113, 475, -91, -447, -52, 311, 144, -282, -317, 143, 347, -104, -329, -28, 274, 99, -232, -233, 234, 290, -186, -273, 212, 209, 3, -195, -142, 218, 245, -144, -230, 79, 200, 15, -280, -214, 225, 193, -260, -234, 48, 252, 66, -297, -152, 269, 54, -225, -172, 39, 209, 20]
5719B0l79K31N17k14m88Q6M34P5l82l46L64N09l25m41J04M35K02o28l27P00L49
5740D96m95m33M00L27m1n70j60Q03R2o76j67N06L11k36n82J27O88m0p34n0O42
5761B08K32m77m05M23M11k34m83R2M57J97n92l56P39K80n72k76L26L22K4n57j83
5782d24O45J80o59r6M93J07j52k89j68N63J30n38j49N18J32k29l26Q1L71l8k69
5803a17r5K63K26k75l03J97K15k7k42LJ29K74j26m77K66L67j54k26j18L00J65
5824B45j79l78K18M18j23l57q9L53J79l77l04M23K16j64k50j44M92K60o33k87
5844d81O31K56m48l38J72M98O2n91j32N98J75n51k91M47L86j76o45J78N58J34
5864D42o37l81P33L91o59l93N08L18o7m91j93N93L49o64l19N90K46l07l95M7N81
$$ y = [20, -359, -128, 389, 175, -313, -227, 207, 282, -100, -446, -82, 427, 102, -339, -235, 200, 402, -226, -553, 147, 496, 1, -432, -32, 295, 254, -316, -476, 327, 419, -257, -424, 82, 393, 157, -425, -298, 390, 350, -384, -434, 208, 440, -37, -442, -19, 392, 158, -325, -233, 224, 421, -171, -527, 212, 492, -80, -356, -30, 292, 316, -241, -424, 221, 401, -258, -354, 139, 246, 94, -195, -363, 200, 330, -208, -357, 161, 293, 64, -262, -181, 190, 152, -117, -212, 51, 277, 2, -301, -104, 111, 84, -158, -155, -26, 248, 122, -355, -89, 278, 124, -102, -220, 80, 245, 66, -312, -94, 324, 201, -156, -245, 108, 287, -90, -394, 29, 245, 81, -169, -313, 179, 439, -194, -481, 150, 406, -42, -380, -208, 290, 352, -239, -371, 227, 402, -149, -440, 7, 393, 217, -428, -250, 308, 442, -195, -576, 157, 548, -111, -504, 4, 322, 255, -236, -429, 164, 513, -151, -470, 120, 366, 59, -336, -289, 292]
5885B92J38p30j72P25J37n84q2J59M63j72m77J07M37Q7m92j50L08M23l74m27L41
5906d3K10j0k29j84L19L02l42k39K10J86o9k37j46K84L16l48k26K89N9L5k52j45
5928b60L51J52k64j95J41K01J42l99j71N26J53n38j40K36K83jm80j18N95J50n19
5949a55j54K46L85j78m96J21O09ko17j55N17L25l60n14K97O02k80n23m6N81K76
5970D79n43n08O23L92m62l04K2N96O4n87k45P69J39n56k13K19M00j5o61L9Q45
5991D93r7o81q0M49K05k04m67K07O31k05o05J37L60K18l69m41M44M93m77l64K39
6012a14L22J01n01j77N16J66l85j16R4J90J41l90j39N00J11m31p9J03K10J32m15
6033a61j51M60N1k57j44O5K12J86m55o8M58K6k57j90J01L64j0n13L6M18N7l01
$$ y = [292, 430, -300, -472, 253, 390, -194, -276, -117, 346, 174, -303, -196, 241, 328, -164, -314, -6, 417, 43, -384, -43, 167, 157, -72, -256, 63, 365, 23, -216, -6, 180, 111, -126, -272, 12, 328, -20, -246, 43, 102, 137, -115, -260, 91, 243, -21, -216, -75, 126, 268, -131, -302, 224, 377, -161, -301, -65, 218, 217, -263, -381, 214, 364, -155, -309, -63, 322, 144, -352, -231, 378, 376, -241, -396, 121, 446, 86, -428, -131, 471, 191, -332, -378, 203, 479, -64, -572, 51, 443, -19, -323, -301, 295, 359, -228, -473, 296, 435, -121, -334, -115, 285, 270, -391, -352, 493, 396, -285, -365, 84, 289, 85, -382, -175, 456, 251, -354, -217, 143, 361, -8, -449, -5, 488, 11, -353, -114, 208, 309, -192, -369, 147, 313, -72, -188, -94, 96, 237, -153, -292, 208, 319, -112, -191, -88, 122, 254, -161, -312, 148, 199, -58, -202, -137, 75, 261, -194, -262, 196, 222, -35, -225, -124, 240, 230, -283, -247, 171, 228, -73]
6055g3k02J03N47j66n81J60M95l7l72j77L34L82l93m78L80M72j82m51q8M56M27
6076E56o76l90N71L06k35m75O5N82J42p86j60P30J55n31j46J46N55m3q00J6Q80
6097D62k13m75r1K75M98k55p01L18N82k23n13M7M22K06m24l03L79L81k59l82R7
6118a72M73O5n65j18M71P9k17k16M9M23j8m60o6M16K3k01j79O0M12m0m73M0M44
6141B30j64p1j05K3L03rl88k2L24R0k46k19J61L67j88k92M6K81Q5k01k42J73L82
6164C18j87m09R0M19K5l39k59L25L91l35m88K61N33p7n06r6M61L66m99l90K57
6185a39N58j72o49J13N47Q8n81j84N37L05l29n70K82P07j77p01j0N64J77m22m27
6206d83M58N49l01p26K90O14j72n24m1M80K33l79m60L13N81k99m79J45M80K1n33
$$ y = [-73, -275, -172, 375, 209, -372, -212, 283, 246, -126, -303, 31, 413, 20, -458, -78, 394, 212, -239, -327, 129, 556, -120, -510, 61, 367, 132, -343, -278, 304, 446, -340, -500, 230, 385, -146, -292, -146, 409, 366, -434, -418, 462, 249, -226, -317, -42, 456, 201, -500, -182, 400, 177, -336, -289, 133, 339, -85, -388, -9, 372, 113, -269, -172, 301, 366, -199, -317, 154, 233, 16, -200, -151, 272, 254, -206, -272, 144, 167, -34, -213, -153, 259, 219, -254, -214, 230, 66, -5, -110, -87, 216, 207, -181, -203, 121, 211, -35, -254, -93, 274, 86, -206, -160, 121, 206, 5, -237, -64, 318, 131, -278, -188, 231, 256, -83, -342, -17, 374, 39, -449, -188, 345, 268, -238, -334, 127, 493, -6, -396, -139, 419, 247, -402, -289, 258, 346, -235, -419, 118, 423, 94, -476, -194, 513, 336, -365, -375, 189, 366, -56, -483, -25, 524, 223, -503, -213, 401, 229, -295, -336, 144, 377, -2, -462, -149, 432, 133, -346, -201, 279, 300, -233]
6227b33j58L97L70l79m41L44L72o3m43n6L64K11l04k96K53L12j23k57r1M25P5
6248B79l49j47K00J74q1j74j25L69J30l70j24K14J41n2k51j1L09J20k88j47K02
6269A9J85l9l38o2M22Q5l45k16K81L24j47m62J03M64k6n44K6L13L60k69n94K89
6291a71O43l00m87J63L00K18l80n14N43N01n37l34K74L22K8m54l35O44L57o35
6311a54l66M54M43j47o24O1P51j7p08n3N15K09k93m98K20P17k47o30J42M11J71
6332C57l94m87N65M72n48l54L26K48k0l28k21M67L43n34j91K75K50j9m02q1M72
6353A96J22m61m9K23Q7Ol04o5M49m5l00J2J13J77Kl35m3M44ml31l7J25J61N0m71
6378b78N4M26Nl20j09K02K49l4n06R2N22j59k83j47K51L45k87m20L44L48j96k81
$$ y = [-233, -391, 6, 376, -3, -444, -100, 272, 209, -234, -290, 74, 285, -19, -315, -62, 250, 127, -130, -221, 204, 279, -70, -217, -17, 157, 76, -98, -223, 146, 276, -94, -218, -4, 137, 85, -166, -177, 132, 252, -36, -183, 19, 204, 165, -173, -235, 187, 272, -73, -289, -8, 316, 169, -293, -190, 274, 248, -296, -270, 43, 403, 134, -460, -171, 472, 172, -315, -152, 148, 366, -14, -528, 15, 516, -21, -355, -81, 241, 269, -185, -520, 124, 481, -154, -520, -66, 377, 230, -394, -333, 418, 401, -307, -360, 155, 364, 71, -427, -207, 510, 263, -367, -225, 186, 357, -37, -524, 41, 513, -35, -389, -63, 185, 165, -163, -384, 83, 426, -108, -299, -24, 226, 207, -195, -276, 196, 318, -143, -192, 31, 118, 124, -180, -245, 204, 159, -141, -129, -16, 161, 163, -172, -215, 229, 225, -106, -143, -18, 143, 193, -278, -224, 202, 207, -113, -222, -20, 229, 195, -311, -219, 303, 144, -139, -286, -35, 310, 23, -397, -53, 295, 99, -182]
6400a82j38M04M11n62m45O22L62n32k97J45M27K01o00l15O68K99n38k54J99N38
6420D13j30p03J25O28qn53j80M69L74l48n66L74N34k61l74p5M11L32m55n78N99
6441B8M87m75m21K36L63K9m22j38M58K20m73j91K54L16j01m83J02M29Jk86j93
6462b60J97M01k42m79L52K42j72j07l5k0L90q4n04K67K79j73j92J6M1K74j53k91
6484b53R5L46k1k70p7J45L08j69l92K05K78J2l44j48L73J77k68k95K60K08N6l58
6506a32k43N39K76n46l18M18L16k21m20M7N87J0n13j01L49L60l25n30K19O05j78
6527A99n32R9M56J74m80m13M63N67n52m34L24L91Rm43j93N31L40o16l37M06M03
6548C62j38o30O6O25J1n22o5L78K91l45m18K55N01j83m85P3K79K77l91k84L90
$$ y = [-182, -320, 84, 495, -67, -512, 110, 472, -60, -357, -212, 215, 416, -184, -499, 169, 468, -70, -324, -125, 413, 283, -420, -295, 333, 325, -228, -408, 61, 435, 87, -479, -105, 429, 168, -206, -281, 130, 462, 7, -571, 28, 515, 40, -381, -145, 218, 247, -175, -313, 145, 365, -108, -299, -45, 271, 170, -313, -211, 218, 219, -67, -260, -63, 338, 96, -383, -31, 211, 39, -68, -103, -123, 267, 183, -321, -54, 225, 52, -140, -124, -83, 191, 38, -253, -158, 188, 167, -103, -180, -35, 273, 104, -288, -83, 195, 207, -137, -285, 88, 265, -3, -298, -38, 170, 226, -132, -375, 164, 440, -106, -424, -6, 310, 89, -331, -284, 303, 313, -200, -301, 48, 408, 83, -447, -228, 377, 199, -333, -234, 222, 396, -84, -497, -34, 533, -19, -453, -129, 262, 271, -172, -365, 166, 506, -110, -447, -41, 362, 224, -406, -340, 285, 296, -226, -291, 87, 378, 33, -385, -130, 371, 188, -297, -224, 55, 332, -59, -343, 47]
6569D7L28l44k60K51J13M9k50k16K66L13l04j89J52K39L9k76k64L35K45k96j67
6590a89J32J41J24k66j81K74J91k72q0LK09J63m10j46M67o0o0j95LL29J40n31
6612b14j04N11j6k61j61J48L96r3n58J15N80j16l01k37K48N17l68n32L03M56j64
6633A49k94k74N77L57o08m57O05L04l79k25j03N79J83p21k15P84R1m59k30J46
6653a90M89J08q31J10O78q1n18o1L18L56k95n46L75M24k34k74j45L76L92n18l33
6674d00M58K64l17j95j1K88L13n41k25N92O1l91q3Q6K03K32m62j15M13K6k57l7
6696i8J5J94O4l96J00K37j6q2r4r9M26j3m70J49J56L2k1k35j27M92J2n12J66J65
6720D5J37j46k20n2N50j24n25J56L35Q0k64k86K64M05l17m46L56L10p0k73l06
$$ y = [47, 375, 31, -229, 22, 135, 184, -66, -282, -16, 297, -7, -196, -44, 195, 234, -42, -306, 29, 274, -22, -189, -57, 84, 208, -58, -239, 35, 226, -46, -126, -123, 86, 249, -161, -307, 160, 100, 40, -155, -152, 177, 317, -214, -318, 193, 177, -84, -245, -97, 299, 206, -352, -237, 343, 227, -74, -311, -63, 454, 86, -446, -143, 313, 149, -145, -419, 158, 515, -93, -550, 55, 359, -20, -245, -348, 231, 414, -307, -522, 262, 353, -106, -336, -190, 299, 407, -424, -314, 364, 283, -235, -296, 22, 378, 83, -463, -88, 336, 102, -172, -317, 59, 451, -67, -400, 58, 322, 5, -190, -201, 87, 400, -141, -366, 226, 287, -104, -187, -101, 102, 334, -128, -243, 170, 196, -61, -98, -83, 111, 175, -221, -121, 116, 100, 18, -76, -175, 251, 238, -232, -83, 73, 105, 84, -151, -278, 214, 226, -286, -120, 45, 182, 36, -184, -236, 314, 190, -335, -179, 156, 236, -28, -314, -50, 355, 38, -408, -52, 258, 188, -85, -391]
6741c91M71L60n39k79M42J90o0n04j06P08R4o83j4M39K38l01l72J03N92r0o72
6762c74P7N26P6l78l17L64M42l06n50L59M08q6l80j48L69M02o32k64M43K44j62
6783A13k93o9M80J79o30j27N02J32l07k05K8M00j0l92o5M10N5k26j36R3K51%l68
6806a85J3K85N5k50j23K06J48L2k49k6J45Q8r4k25R1L43j28k67J4K26N4o9m08
6829c24J73M79k76k95L5L10J28k59k60J89L81j60m82K00L84K9m26o5L41K06k98
6850A0l22J65M77j23m87J4N15J25n54j49L80K66k04m64J53O06q1o40o8N79R5l68
6872g5k25J90N46k67n71J95N83r4m86n9L46K51k45m91K97N07k75m78J12M30N0
6893B41l36k24K93L55k95l16J47L63p6l26p2L54Q3k61j01J66J97N8m70KL68k3
$$ y = [-391, 80, 440, -99, -378, 64, 254, 194, -310, -416, 292, 386, -297, -311, 128, 366, 65, -307, -204, 388, 298, -374, -297, 229, 305, -73, -390, -26, 416, 110, -440, -81, 327, 241, -139, -287, 82, 484, -148, -412, 31, 275, 113, -180, -249, 231, 410, -220, -347, 155, 287, -20, -225, -197, 203, 193, -199, -264, 146, 201, -25, -161, -68, 183, 183, -185, -172, 113, 168, -82, -205, 1, 149, 181, -68, -94, 51, 139, 45, -180, -89, 254, 126, -141, -127, 99, 153, 84, -324, -151, 328, 52, -243, -208, 102, 230, -29, -289, -100, 281, 121, -361, -161, 223, 252, -174, -239, 102, 308, 10, -312, -147, 330, 207, -280, -266, 249, 374, -180, -329, 51, 317, 113, -351, -198, 408, 327, -313, -381, 198, 293, -75, -300, -110, 436, 169, -402, -207, 376, 282, -204, -263, 83, 334, 89, -402, -105, 402, 127, -351, -239, 191, 241, -95, -319, -26, 329, 34, -282, -135, 228, 152, -174, -246, 108, 191, -70, -171, -5, 192, 250, -220, -218, 150, 127]
6915A27j40j29J28J31j8k91P0L02m2k34o2J09J79j6l06O3K69l5j10r6mK61k0l15
6939a79N2K70l7q9j38j4M07j37m54J63M45j74j79j68K16K75j27n23L05M58k22
6960A50l07l6L02K16l45l86M81L29l10l97J64M03J07o15j08N77R8l24l27J90M46
6981C08j25o19K53N40j35l54l1J31L53j96o80N04N57m59l27J15K29K47l82k89
7001c60M32L69m08l27J46L36J7l82p6M08R4k99j61J79K20k2l41q3N25j50k59j3
7023a55J07K45j1m22J07L47j44j53K2l1K07L1l62J19K13j24l6l6lK75j08k72J78
7046fJ21Lj43j51Q7L24k31k60J99J41M4j56k31J64M58l40l50L17K50j27k35j13
7068b35L61J86l48k56K66K93j59l43J3M75J9m86o8L19K59j83m87J90N80k08m88
$$ y = [127, -13, -142, -14, 117, 99, -192, -122, 180, 138, -96, -158, -49, 130, 114, -192, -129, 140, 105, -5, -101, -105, 156, 136, -179, -127, 143, 106, 17, -121, -135, 272, 135, -319, -156, 289, 115, -64, -232, -16, 259, 132, -391, -86, 372, 150, -157, -193, 109, 325, -20, -406, 75, 404, 94, -303, -139, 264, 371, -244, -352, 225, 323, -1, -328, -138, 308, 183, -436, -183, 357, 222, -132, -163, -32, 321, 125, -555, -51, 506, 47, -280, -165, 64, 311, -71, -360, 72, 441, 33, -294, -148, 188, 205, -177, -253, 155, 249, -50, -211, -32, 188, 166, -175, -258, 267, 117, -142, -155, -48, 197, 186, -236, -129, 218, 74, -79, -57, -88, 119, 150, -212, -93, 120, -4, -40, -76, -79, 196, 88, -184, -6, 115, 118, -25, -176, -89, 235, 4, -256, -57, 84, 128, -28, -259, -95, 363, 23, -327, -10, 240, 113, -122, -235, 126, 312, -36, -292, -26, 267, 108, -235, -222, 253, 272, -214, -282, 37, 296, 113, -374, -184, 396, 188, -300]
7089c00J19L93j6l50j36J83N11l45n33M24M26k74k93j27M06K43m13k61L56L30
7109C43k51l78Q5M34M3m99j3M10L0k07k29R2M07p2m71J53L28q4j43j72J38L01
7131B45q5m35J97K54o2j57p9J23J75j67j53R3J56J9j81r2J71J26j89q3J47Q7L0
7154A40k00q2J46J21r5j10M3R9O5j74j80K93J36k10k31J56K61m7k64n9K67J29
7176B04k28k12J87L05r9l82J7N02j7l76j89L21L42k60n04K38M00r9m16J4L15K24
7198B87l11l45L74L76l13l06M8M75l7m62m6M56Q7k99k82K20L83j20n34J88M13
7219B52l0l53j71K85L32l29k90K51L17j59l45J00J91J78l57j12K56K72k94j61
7239a67M7K72K0l88KL58q7q7n8K6J37O5k95J2J84N5q6o8rK05k2k71N1K29r8j0
$$ y = [-300, -181, 212, 196, -154, -290, -107, 404, 59, -474, -50, 376, 102, -191, -318, 88, 331, -82, -343, 13, 343, 92, -286, -201, 233, 276, -223, -236, 174, 204, -3, -232, -140, 267, 195, -276, -123, 205, 121, -22, -194, -56, 245, 160, -275, -78, 176, 114, -43, -122, 1, 176, 9, -144, -51, 105, 124, -57, -149, 22, 148, -41, -124, 23, 110, 140, -60, -142, 4, 125, 30, -80, -37, 62, 127, -47, -227, 66, 202, -8, -239, -83, 178, 131, -133, -192, 75, 204, -24, -236, -49, 256, 157, -225, -208, 294, 277, -99, -288, 33, 375, 115, -389, -151, 249, 150, -266, -252, 63, 287, -24, -369, 5, 381, 68, -238, -190, 285, 248, -214, -260, 196, 283, -16, -298, -78, 305, 185, -349, -161, 252, 222, -131, -302, -17, 315, -14, -304, -53, 264, 105, -240, -140, 51, 229, -128, -240, 16, 288, -6, -167, -120, 152, 172, -216, -214, 144, 57, -30, -88, -62, 75, 140, -155, -143, 41, 96, 10, -58, -67, 138, 116, -155, -104, 125, 27, 17]
7265A7n8n9K88o6k70KK03M7l8j77J2K95k7m05J93PK02j28k71M4N03k22k81J00
7289h9J30R0j14l13L62K42k81k45J83J52Q0l02k46M49K29m83q5K78J88j13k90
7310a78k9M73Q9o31N3L24J16j39l53J01M37j60l92R6L76J3k79k37K94L65l84k25
7332b70K58J64j2k22k58L94L13n34q6L17P2j1k46j10L78J36n00J3L59r4o4j16
7354a19l5K95K6l30J72J04K9j21j36K7L04j81k35K33l3j8Q0k22M8L44j80k00J47
7377aK5qM2j62l5K99j22j46K0R9J03p5j96J23J83p7j69k6J61J50k23k18K54K12
7401B13j94j85O5K48O4l50j37M23P8l24n8R4K38N5m94JN72p1l98p1K57J74p5l38
7425b13J3N42k06l32O6J65K38l12k96L09L74l86k64K23K40Pl22j12L83J68l78
$$ y = [17, -41, -100, 188, 122, -148, -146, 57, 104, 66, -111, -99, 196, 169, -236, -43, -36, 166, 38, -233, -189, 314, 92, -189, -89, 41, 131, 17, -296, 66, 308, 27, -218, -35, 117, 197, -105, -351, 98, 327, -156, -241, 37, 225, 112, -178, -207, 266, 355, -276, -223, 101, 217, 78, -275, -174, 263, 103, -289, -193, 183, 196, -83, -320, -26, 339, -45, -270, -12, 152, 140, -82, -340, 54, 367, -167, -253, 64, 136, 125, -121, -231, 147, 283, -217, -204, 155, 61, -3, -119, -154, 141, 167, -163, 9, 113, 142, 21, -115, -88, 216, 35, -200, 33, 0, -18, 62, -160, -112, 232, 52, -148, -1, 24, 16, 58, -104, -139, 160, 38, -108, -88, 11, 114, 39, -157, -34, 149, 72, -97, -123, 38, 188, -35, -253, 1, 213, 19, -166, -101, 147, 211, -139, -276, 147, 225, -99, -157, -63, 175, 230, -264, -263, 309, 238, -160, -231, 26, 200, 125, -213, -200, 342, 136, -196, -130, 35, 273, -39, -335, -26, 348, -38, -302, -79, 161, 168, -154, -266, 117, 285, -93]
7446i3j68K63J62k8l32K8L87p6l27j7K35J17j05k56R0L69j48k71P3J71J2r2j37
7469a43J12K15j55j90J25Q7M9o4j38J26J28k13j9K3J03Q3j25j07J42O8r0r7QQ2
7493A0J06l9k09J6K99j44j53L3J21M5j01j82J44J66j05q1n6L15J5l15j7J52J83
7516B03j75l11K73J10O8l43m0L40Q3l67oJ74K06j00l56Q4M16q4l71N7L61K7k65
7539a6j95J43L45j55m20J38M02o7l23o8K88Q5j42k82K19L10j20l74L3K88R3l63
7561a81n5L13N6o9j97R9K71j43l15N8K96l5j36p2K2K08p5k55J77J90r5j14k6O8
7585a0J55j8k96J32J97j03p3o9L5J82j16j21O3J31jr6o5K3K25j05j52R9l1Q0l9
7610B7j68J19J57p0k08P8J80J6k18r2K18J51k27j52Q5J43J10k38j24L59Q8l00
$$ y = [-93, -261, 2, 164, 136, -196, -168, 219, 143, -184, -201, 34, 151, 46, -210, -120, 249, 101, -170, -97, 74, 86, -6, -143, -31, 184, 29, -161, -36, 51, 100, 36, -102, 24, 152, -61, -80, -57, 46, 129, 4, -103, 39, 107, 17, -80, -72, 10, 116, 77, -132, -116, 183, 39, -114, -81, 40, 85, -16, -198, -54, 112, 7, -74, -130, 185, 200, -115, -132, 20, 203, 28, -283, -10, 100, 168, -175, -215, 125, 208, -159, -165, 9, 215, 115, -241, -157, 259, 175, -196, -139, 222, 249, -16, -211, -68, 277, 122, -298, -160, 242, 175, -148, -216, 72, 157, 15, -267, -48, 262, 142, -232, -199, 89, 182, -181, -236, 77, 133, 64, -133, -34, 237, 94, -221, -163, 133, 98, -38, -110, -88, 120, 45, -210, -33, 157, 62, -52, -78, -10, 145, 127, -169, -37, 160, 57, -16, -85, -50, 132, 16, -105, -42, 89, 88, -8, -73, -50, 175, 70, -82, 17, -14, 66, 27, -141, -22, 135, 65, -143, -65, 115, 131, -87, -179, 39, 190, -37, -189, -104, 39, 149, -89, -213, 146, 234, -66]
7632f6j16K42O1mk08j31M10M6m21j0L74n1r1k09Q3L89k49l51J96L03j01j88j05
7655a97J85K81k27k92K83J98k00j96J6K51J07l64o6K60J14m0l22N1L93p7l08O8
7677h2K45q2l0j94L2K84r8l16J44K74j15Mj53%K75j70k68K87J06j56j8m8N3J19
7701I3j03r9Q7O6%m7p2M2J45j25k8M8L7Ro9j53J98J00j19j11R4L9K3k8k08K35
7727E4R2j79o5O1J41oj71m7J86Q2j85j26J62J33M5l53J2L38j9k84K7J46J34j79
7751aj91O3L79k07k48J24K01M4j52k56K22K90k47k10J27K28r8k35j0L05P5j69
7773C4k05J55J81l7l02M6K41n5k16mK07P2j28j31O1K99j41k20R1J60Pj55j08J38
7797a0J37j41j26Q6J60l8j66jJ74j0j32O0J9M9J3j42J1J31Kr5m0KJ13no0l9J00
$$ y = [-66, -182, 60, 121, 117, -91, -222, 188, 234, -187, -197, 177, 126, 35, -174, -91, 298, 49, -302, -106, 197, 96, -92, -197, -12, 269, 42, -250, 33, 231, 31, -165, -149, 102, 209, -155, -221, 39, 153, 113, -209, -158, 235, 158, -150, -82, 163, 81, 51, -143, -111, 173, 75, -241, -97, 177, 62, 66, -87, -87, 188, 18, -250, 37, 143, -13, -31, -79, -26, 93, -10, -109, -22, 44, 44, -3, -75, -33, 112, -13, -41, 7, 44, 53, -16, -169, 29, 129, 10, -101, -7, 32, 55, 27, -181, 54, 146, -33, -98, -37, 104, 98, -73, -120, 66, 148, -37, -163, -1, 132, 177, -176, -164, 174, 155, -129, -102, 44, 178, -1, -192, -129, 250, 43, -205, -81, 120, 164, 12, -244, -22, 268, 21, -189, -62, 166, 68, -167, -177, 128, 203, 34, -171, -16, 165, 128, -174, -128, 113, 58, -158, -162, 45, 117, -11, -142, -81, 218, 77, -143, -52, 108, 115, -40, -148, -10, 127, -14, -140, -54, 106, 68, -98, -99, 75, 65, -67, -7, 12, 61, 74, -68, -57, 74, 76, -19, -59, -57, 56, 51, -9, -48, 52]
7824E2O5j10l9K4L7J03j60j03R1Q6n8j06J01R2j8j57O3P6Q5j37j30J19J46q1j91
7849a50O4J77Qj45j62J65K10j29j81J26N6P9k05l5J68J21k18j71J87K81k07j92
7871a53L0K90p2k55N6J53J31k15p6L6K45r6j98oJ91O5j59j61K19J84k54q5K21
7894I1mn8j05m6K32M2k34q2K37j8p6j09LK50qj88P4O7rj01j09J92J08j81j04J68
7920C2P0o8J0k05J28J71j02j92J99n6MQ4k34J46J55j85j7K5mJ04J5j95O8J77j63
7945c3LK1nJ00j36n0R8J22j27p8RJ7J89j87j32K54P4j90M3l6J01J60l61m7K42
7970E1P4j75n2J9K37q7j59lK08n6j98K5R8J94j24k70K19J53j59j06K3J58J13j58
7994B5l07M28N7k58n0P7Q8J30k79j43L21R8k37K7M8L5P8k55mK76k9k82R1N4P6
$$ y = [52, 117, 7, -32, -8, 29, 132, -28, -131, -40, 46, -12, -118, -17, 75, 57, -100, -37, 39, 124, -13, -143, -24, 122, 41, -150, -86, 91, 99, -46, -208, -43, 167, 38, -143, -17, 39, 118, -87, -122, 46, 167, -51, -222, -35, 246, 39, -153, -123, 167, 95, -160, -104, 49, 180, -35, -111, -75, 170, 74, -124, -130, 61, 126, -33, -194, 25, 209, -45, -130, 91, 87, 29, -76, -122, 110, 152, -82, -164, 73, 55, -21, -130, -127, 123, 115, -73, 1, 68, 59, -42, -151, 41, 149, -32, -136, 32, 102, 34, 44, -161, -33, 138, 36, -156, 43, -13, -9, 75, -159, -13, 142, -43, -60, -35, -39, 65, 80, -115, -47, 130, -33, -30, -9, -14, 86, -50, -100, -2, 120, -7, -85, -76, -59, 130, -57, -189, 65, 139, -51, -8, -44, 57, 217, -144, -191, 51, 125, -50, -102, -83, 154, 67, -92, -95, 113, 57, -141, -116, -18, 176, 52, -218, 1, 154, -5, -111, -88, 70, 183, 25, -282, 146, 203, -55, -105, -28, 60, 190, -89, -232, 89, 187, -50, -23, 25, 60, 138, -117, -121, 155, 126, -156, -65, -11, 65]
8019F5mk32R3K36k00j8JL0P9m8p7M7J85k11%M8j2P6j03pN7Q3j54L6L2l6J10p5
8047Ar4J27R2j24K5n4j8J95j86j1R8p6K3J4j27P6K55k37j37J94l5K2o2p6J69J02
8073A56k13j00K40l8o3j03L1K48lk70qK92q4j79L9P6J19p8k72K10J32m9j50n7
8097a24J10J73k05j42K35M9m3m5j19J78J34k99j00L79j39j76P7N6O7L1j87l6K84
8120A58n6j94O3M3R9j18j24L4K03j09j19J00K7J02r9r1Q2J04j02j25R4M8%m3n4
8145g7J21k5j08kL3K8J39j51l5R4M5n0QQ4q6P4n4j29Q4Q0o0p0kR2Q5j72q6J65
8173B5k9N6j10p4J70N5j86l6J99O5j52r6M9J74kj34r2J88
$$ y = [65, 61, -171, -78, 158, -42, -60, -59, -29, 50, 2, -75, -28, 157, -54, -54, -6, -18, 58, -45, -52, 5, 88, -66, -30, 2, -34, 76, 1, -93, 34, 126, 2, 27, -27, -45, 150, -36, -47, 51, -25, -2, 12, -115, -39, 216, -21, -158, 36, 1, 23, -39, -115, 54, 156, -57, -157, 83, 45, -18, -121, -90, 158, 155, -115, -123, 169, 85, -94, -55, 21, 140, 62, -210, 0, 132, 83, -67, -124, -14, 159, -46, -188, 47, 96, 53, 8, -111, 67, 201, -98, -198, 181, 42, -134, -57, -1, 66, 97, -90, -126, 158, 102, -92, -29, 14, 113, -5, -129, -95, 108, -1, -120, -20, 7, 109, 10, -81, 1, 105, 3, -122, -28, 20, 20, -23, -77, 44, 19, -89, -91, -58, -30, 109, -42, -77, 17, 62, 12, 20, 104, 18, 92, 38, -91, -7, 73, 13, -57, -59, 33, 118, -54, -140, 25, -4, 52, -58, -132, 38, 93, -93, -129, 70, 135, -17, -113, -64, 110, 108, -26, -118, 70]
8191G0
$$ Imaginary data points
##PAGE= N=2
##DATA TABLE= (X++(I..I)), XYDATA
0@%%%Qk4K9k9L4m7O9q8J06j30J58j92K36k84L36l98M67n44O36p41Q54r77J119
26E98j279J450j639J853k089K345k627K938l278L654m066M515n004N541o141O804
42C575p530Q335r234J0241j1376J2670j4159J5888j7926K0369k3361K7129l2037
55a7416L8705m8315O3405r0490J53024n19566j33970J346325q55962l24372P04640
66C16008m04652p9061N64824o22881r1209O73232k31373k91743J36178j10736
76a41413K97616Q4734n54712J52691N15103k81211l20264J33437K68565J3047
86A67593l02935M0188K07283k00813J49441J18889n22823K86445N79461p09827
96a87098k41460P34984j50357l33838K12610j08018Q2985J94593l62584L7586
$$ y = [0, 0, 0, 0, 8, -16, 13, -16, 18, -29, 40, -48, 58, -72, 86, -106, 130, -154, 182, -216, 251, -293, 343, -398, 456, -521, 598, -681, 769, -870, 983, -1106, 1239, -1388, 1550, -1728, 1926, -2140, 2375, -2629, 2912, -3229, 3575, -3955, 4380, -4854, 5387, -5989, 6681, -7478, 8410, -9516, 10853, -12508, 14621, -17416, 21289, -27026, 36379, -54111, 98913, -420653, -554623, 791702, -64260, -388632, 316008, -88644, -167705, 397119, -225762, -316971, 356261, 124888, -166855, -30677, -141413, 156203, 240937, -313775, -161084, 354019, 72808, -247456, -114019, 154546, 167593, -135342, -95154, 112129, -88684, 60757, 179646, -343177, -56732, 522729, -187098, -428558, 306426, 156069, -177769, 34841, -73177, 9808, 204401, -158183, -120597]
106a20597K79316j96224R7610j1552l55380M35916K17549o52888J39925M44220
116B77895k86675m4890L3854j22571L40946q1401m05480L54863O2407k90048L37470
127A76370j68181l72321O51627J384p50773M05178M27177m70488k2783J83228
137F0418j24531J45396J0243k45371J05339J50800l2277q5890j48753J61236K31779
148B28389k57658j66462K09083J11666m0908k08520m5377L70148o8814l58291
158b26744K42627P5893k09220K76478j17072l87861N07438J65857o33054J53904
168a51754M02692k45940n2721L1082j02427K58328j0417l38691J74053J66148
178A30353j42311M4194r5014p3793L24141o6345l57023J80052K28709j24728j28075
$$ y = [-120597, 158719, -37505, 60105, 48553, -306827, 129089, 346638, -306250, -166325, 277895, -8780, -53670, -19816, -142387, 198559, 117158, -288322, 66541, 128948, -161100, 176370, 8189, -364132, 287495, 288879, -461894, -56716, 370461, -100027, -122810, 60418, -64113, 81283, 91526, -153845, -48506, 102294, 70017, -15873, -164626, -3390, 228389, -29269, -195731, 13352, 125018, 84110, -124410, -169787, 200361, 131547, -226744, 15883, 91776, -117444, 159034, 41962, -345899, 161539, 327396, -305658, -151754, 250938, 4998, -47723, -16641, -119068, 139260, 128843, -209848, -35795, 130353, -11958, 32236, -62778, -136571, 187570, 121225, -235798, -55746, 172963, 48235, -79840]
189g9840l2801J61171J12317k36631m3229J89721n5020R515K2245k09532J49310
200a2774K48384l00057j33093K81702K3918j23312m8795j2000J62910J5038k11794
211a09873N5115J17974n3086L3097p3241r6657K20144L5868k51988M0382J55854
222G3589j2429n2224j07621N2374J91304j28133j41823J48375P385l3999P1589
233F8387j48610k0386K55991r2448k19561J34964J11684n5179n4576o9184Q8067
244h51J24872j37614q7113J09204L2489R53m2526j07955J10387J38465j55049
255a4738j06646J20776Q7366l8101j22631j7079J71957J1841j64978P531Q6352
266B1650K4430N097j11201m0887J88783J8481j94984J142J35541L3010p4502j05709
$$ y = [-79840, -112641, 48530, 160847, -75784, -119013, 70708, 15688, 25203, 47448, -162084, -12774, 235610, -64447, -197540, 84162, 108080, -15232, -64027, -76027, 86883, 101921, -109873, -54758, 63216, 10130, 43227, -30014, -126671, 93473, 129341, -122647, -82265, 73589, 61160, 8936, -98685, -46311, 144993, 16860, -124963, 23412, 30797, -3202, 68387, -80223, -100609, 155382, 62934, -156627, -21663, 90021, 34842, -19734, -88918, -851, 124021, -13593, -100706, 8498, 40987, 41940, -586, -108541, 1846, 140311, -14738, -121384, -608, 86758, 48657, -73974, -91053, 80904, 92745, -72233, -64702, 21650, 46080, 51177, -60024, -100911, 87872, 106353, -88631, -87489, 48052, 81062, 6560, -99149]
278i9149N9352J54299p2073j39988N8087Q8864Q750n6782r4594O6226J43469q5776
290C0685j38557O9710J12926j2134j06747m8552J22868P4734j25650o8915Q7432
301b200O5298k1595q7263l3731J19575N5613j28594n7043R9969O7551n2519r5668
313g0607J6545J21414j302j20426j0651Q9828L8024n1796p7679K7066J08574j5168
325E3822j12503p9R3949K9189p0786o4736N4400Q8448m0530r1867J7555Q1927
337C8789J7380p0595n2918O2216P6370n0001q4651K6899Q3290N233q0089l7214
349f5291P4823O0547o1628p3801L8023Q1835p507q6841k2356Q6060M6155p5886
361e867o4483N5072P8894k7281q9001j911R2943K9628q8110n4007P3872P4213
$$ y = [-99149, -39797, 114502, 42429, -97559, -39472, 49392, 58142, 1360, -93234, -27008, 116461, 30685, -107872, -38162, 74764, 62630, -44117, -92669, 30199, 104933, -20717, -89632, -2200, 63098, 41503, -45760, -79491, 40084, 95697, -32897, -89940, 10029, 77580, 25061, -70607, -54062, 67352, 66050, -54376, -65027, 24801, 62825, 11029, -66650, -39584, 68990, 53822, -58681, -58760, 35189, 64378, -6408, -71144, -16744, 71704, 31174, -60693, -43138, 38789, 56169, -14426, -67344, -5128, 71242, 21241, -63410, -36511, 46779, 52012, -28077, -65291, 9532, 70079, 8451, -65350, -27327, 54508, 47001, -39840, -62196, 23864, 70019, -5867, -70350, -15278, 63616, 36335, -52666, -54577, 38366, 67994, -20116, -74123, -251, 73962]
373G3962n2522q9469K6155R7835K210r7981k9806Q9579N5326p2722p6363M8804
385b4992R2266k1225j02016p058J03203L2957r4370n5661P6024P5301n0577r0319
397f6467K2656R8586M716r7579l0950Q6514N5141o8089p6583M6281R1854k3246
409D2834r6905l61R1390K5256p7396n0892N9392P2405m0486q5307J9828Q7471
421D7229L879q0518k9960O9776N3796n7100o9066M0400P3299j6732p0875j2839
433d8711O6872M0907o2313n9140N2608O6329l2551o7427M404O8525K2057o8609
445a7049l8890N9110M7150l5929n4780M857O7357K1246p8087l4072P4671L9157
457E4741n2923m8319K2423O4205J151p6189j2890P0078K3788m5465m5202J8109
$$ y = [73962, 21440, -68029, -41874, 55961, 58171, -39810, -69616, 19963, 75289, 2567, -73796, -24992, 67274, 46049, -55967, -63025, 40178, 73135, -21235, -76896, -872, 74429, 23852, -66467, -43811, 54775, 59491, -38088, -69038, 17476, 72617, 4528, -72055, -25774, 66080, 42834, -54071, -54432, 36958, 62214, -15182, -66074, -6682, 65723, 25237, -60070, -40242, 47229, 51108, -29410, -59370, 10406, 64202, 7102, -61964, -21564, 51735, 35003, -35872, -48711, 18161, 59068, -3245, -62385, -9777, 56552, 24001, -43426, -39022, 29503, 51560, -17049, -55939, 3171, 50321, 14392, -40388, -35531, 31826, 53072, -25015, -59087, 15584, 54741, 1818, -46501, -24078, 40127, 41278, -34911, -47801, 22277, 46065, 600, -44602, -26493]
469b6493P4947l910r5217J570R0344N152o5246k8864M0386O0803k8957p9019K3517
482c0987P2393m173n3163l5310M4095P6000n1660r3512N7742Q2137l9119o3313
494c8870k743O0355M2111p0678n5042O8071M7152l4389m6988j7334P1885N2071
506G5601j04753n1313J10965L3950p6316l4232K5943O1941L320r0171l553Q4342
518C5724L364m4896l2716P720Q4766l910j18905K3954J07111k8083o5785o633
530c8289L8297N5828m5305p4301N8894M7990l5444j2434l0137J4517R3475n7271
542A5820j05403R3455O5626p7442k4332J6279K4835L7858n7103m3925P0611J8041
554C4320l4354j0047k6489M3798N9269q9094m4966R6339J7868n6235k3007J1652
$$ y = [-26493, 48454, 44544, -50673, -49103, 41241, 46393, -18853, -47717, -7331, 53472, 24515, -54504, -30987, 41406, 37233, -15930, -51240, -7145, 68855, 17195, -76317, -18575, 63562, 24443, -38870, -41613, 18742, 60853, -9825, -64867, 3204, 50356, 15967, -31021, -48355, 23530, 75601, -29152, -80465, 30500, 64450, -11866, -46098, -20155, 41786, 45106, -45065, -48618, 35724, 39088, -5808, -38524, -30804, 53962, 50052, -68853, -44899, 62212, 34129, -31656, -38289, 8, 55836, 10531, -63770, -4876, 43114, 7670, -4764, -34901, -20384, 73091, 15820, -89583, 3872, 69498, -7944, -32276, -15997, 8838, 46696, -10407, -54332, 16279, 34320, -34, -10081, -36570, 7228, 66497, -22597, -67563, 28776, 46644, -9591, -32598, -20946]
566b0946N9760n160p9828K7490M6009k5794J8629l2808n1093J13701J8787j47247
578g8500L9669J03817n3080k8630k094n270P4561k2827r2774N8445M4359l6504
590A172J0312m3705q123J15983m5144j20069Q2740O9784n4855l3373j3281N1787
602A3228N0770r0850k5629Q1818j7503m515Q163q2076O5486J04175j38701n4035
614h9669J40055k053p0449j519p75N6706J4242r4919J4849O9571k1115q225k8989
627b2290k2525R6001j718j15307L3461P6186j4260l6852m9549N3350Q7849j05746
639b1400m7589J13724l6314k8989P0407r9598m870J66602j05791j20012J53912
650D0082J7155q9778L3910k4238J2063Q2348r3433m5741J13241k4217m4001L8876
$$ y = [-20946, 38814, 33654, -46174, -18684, 27325, 1531, 20160, -12648, -63741, 49960, 68747, -78500, -38831, 64986, 11906, -16724, -18818, -24088, 50473, 27646, -65128, -6683, 37676, 1172, 11484, -32221, -40344, 75639, 30495, -89574, -6834, 62950, 8095, -25278, -38559, 13228, 63998, -26852, -52481, 29337, 11834, 7319, 15482, -66594, -1108, 103067, -35634, -89669, 50386, 48333, -22116, -23635, -24410, 32296, 46538, -48381, -33532, 36039, 14924, 6699, -22290, -44815, 51186, 49468, -65839, -32378, 43808, 29548, -7304, -56853, -3503, 84346, -21400, -68989, 44735, 8421, -20568, 49839, -49759, -54629, 111973, 6182, -113830, 40082, 57237, -32541, 1369, -22869, -10806, 71542, -21891, -67632, 45609, 21392, -22609, 16267]
662A6267m8447J8786Q4478q4149n6086R2663K4590n2002l7935K3902P1640m1552
674A2155o4443O4938O71l2195O1773n7856n5635J33377j2798j25825O4485N0449
686C9096l5999P606m7262J0798R6779p2054o0522Q8315j7031j8895M6504q0298
698d2963M028J19572p3242p6254P6699J8600o319k4771o0232R0880M8699j32346
710e7649K5669Q0526p1374L5746K3224j18323Q4227J01886j52174k2493J22219
721E1484k5975l3941n307k3765P3931J1059j01504K8613O1538k8288k968k2887
733a8010j6188P3234k699p7164R409N1062K6418m9258o9855Q8720O1955j19939
745d2315K806Q0601n8293K3253L7094j11627N0484J12113j18999l8270R7170k2041
$$ y = [16267, -32180, -13394, 71084, -13065, -69151, 23512, 48102, -3900, -41835, -17933, 53707, 12155, -52288, 12650, 13321, -18874, 42899, -14957, -70592, 62785, 49987, -75838, -11353, 39096, 3097, 10703, -36559, -25761, 71018, -1036, -61558, 26757, 9726, -9169, 37335, -42963, -38935, 80637, 7395, -68859, 7840, 26440, 20121, -4650, -64882, 25998, 74697, -57649, -31980, 48546, -22828, 12918, 36142, -82181, 2046, 103932, -48242, -70735, 51484, 25509, -8432, -13739, -37504, 36427, 47486, -54018, -25405, 36133, 7845, 4877, -18010, -34198, 39036, 36337, -40827, -31418, 19644, 46062, -3196, -73051, 15669, 77624, -42315, -39509, 41092, -17201, 6052, 43146, -68481, -17997, 94116, -24883, -63153, 34017, 11976]
757A1976n453K21o5412P8314N1671j24770J7730Q4190n6423P010J8588o5734N6220
770H128N2533r1950r263O1965J866j3113m3198M803Q1917l8770o5820N9938O065
783A5101k4522L6570m6219k3132Q9473k0789p2270L5445K6869K725j1043n3476
795d5268L9848O2363o9787k3192N1490j5350R950Q004o1288L4269O1086n6945
807d820k7368K7954J4721K4790m8139m4551R1603J2151q9272L0305K9721k7202
819a0107L8271k7443n7749Q2253K6085q4855O150L8341O802M798n5568l419Q7490
832E1049k7777o8757L9643K0304n818Q763m7108K625P2121k6197n5533K0830K9089
845A3234J7649l0011n2705N6355N0763p0110j9691M3335o68Q828j5028m4298M8004
$$ y = [11976, 6523, 6744, -58668, 19646, 71317, -53453, -35723, 48467, -7956, -946, 17642, -48092, 8128, 60661, -31289, -40552, 21413, 23279, 10166, -33032, -28229, 53688, 14918, -50902, 9036, 15101, -9421, 27149, -19070, -42202, 47271, 26482, -45788, -10343, 16526, 19251, 8208, -45268, -5420, 56943, -12844, -36036, 15454, 104, 10054, 18058, -43230, -8961, 52125, -4820, -32188, -4234, 10487, 35277, -12862, -57413, 34190, 46341, -42931, -12626, 17095, -10107, 28164, 721, -57028, 25225, 51310, -33545, -27395, 10946, 17748, 22546, -33022, -36441, 51049, 23272, -45485, -5842, 14462, 8644, 17407, -29701, -27076, 45045, 18848, -36685, -15855, 13234, 30883, 872, -51833, 4522, 55285, -14825, -34516, 8819, 8151, 16979, 1951, -42347, 5657]
858E657M0955n8861j9618L2304J7407O214m3972j9859P1126L184o6212J4262K9290
871A1877l205O413l1474j3407N6910j127m9864O472K2575J4881o313m6614J5521
884a7355N7424l1597l8041K5901J0659N512k825l7675J6781M4687k7150k8456
896b2135J2886J4816J8407k2677l9496M1780L3544m5314j3410K1499N447J3755
908A9102j9738l3157L9228K8222l9891j6328J7749J8061Q404l4980j8825M9060
920A6907J3068m3187q414K1503J7794j777l5353m635M4071L871l6485j0351K2045
933i43K7403j4410m3305J5976M5222j4961l3960J176K2492K1396k1503l8177K6321
946g273L9699k3774l1392P707K6478J4608l0888k9004L6871L0125l2773k6152
$$ y = [5657, 46612, -12249, -31867, 437, 17844, 24058, -19914, -39773, 31353, 34537, -31675, -17413, 11877, 8672, 15085, -16389, -29796, 27114, 25987, -23877, -17405, 5170, 20051, 13738, -32876, -17355, 40069, 8472, -29569, -3668, 6991, 12503, 9678, -27997, -11216, 33471, 6321, -22135, -9249, 5567, 23974, 1297, -38199, 3581, 37125, -8189, -21599, -100, 5347, 19102, -636, -33793, 5435, 33657, -6234, -22562, -4813, 13248, 21652, -13328, -32153, 16907, 29975, -13212, -21626, -123, 17671, 15894, -19459, -24094, 19977, 23848, -12637, -22988, -943, 26460, 12050, -31255, -15279, 29943, 14982, -18978, -17802, 4690, 26086, 4583, -33594, -7273, 32426, 8652, -22740, -15033, 11445, 26053, -4835, -33839, 3032, 33157, 384, -25768]
958b5768J6223K7297L470l5437j4677M1193J6941l5940j8206K1161K5241o348
970A5150l5702j731M0843M910l5571j0656K4355K1723j4642l3215J0006L7578
982B3048o224l3295k024K5314J4362j9420k5276J6014K9479j0368k7903K76K5199
995I182J1982k4186k1127K2918K4069j7611k3119P124K2332M893k2406j4063K1039
1008A027J9381j5740k2517O866K5419K180k7544r060K6429J3796k0768j8016J2330
1021f217K2494l530k5562m229K5073J1333k1010j9175J5310K6432r664l0769M234
1034a5280L0877K384k7101j0564K1397J8977j5304k5351Q141K8719L16k9566r330
1047b1685K8701J7457k5813k3137K0160K6487j1737k8355J634K9057P628k7659
$$ y = [-25768, -9545, 17752, 21222, -14215, -28892, 12301, 29242, -6698, -24904, -3743, 21498, 15150, -20552, -22283, 18560, 23470, -12101, -22757, 1598, 23321, 8679, -24536, -14530, 23048, 16824, -16471, -18495, 6819, 21181, 1761, -23515, -7501, 21978, 11610, -16293, -16017, 9182, 21164, -3022, -24149, -1231, 22838, 5227, -17892, -10768, 11564, 16457, -5949, -20012, 1027, 20408, 4668, -17849, -10983, 14436, 16616, -10928, -19988, 6441, 20237, -531, -18547, -6217, 16277, 12747, -12815, -17044, 8029, 19362, -1648, -20823, -5513, 20919, 11255, -19514, -15280, 15597, 17981, -9120, -19684, 1713, 20690, 5386, -19965, -11824, 16895, 17211, -12355, -21685, 7016, 24473, -1340, -24477, -4317, 22170, 10433, -17922, -16288, 12769, 20397, -7262]
1059g262j5250K3181K1699j5775k7392P518L1676ol3005o489L0057J2871k3981
1072b158j9459J6640K4943r041k7620J133K7310P590k4864j6469K1748K3266j8236
1085D783k6061J2436K5373l595k3384o681K1951J5169j9984j9780J4975K1814
1097A7016o868k3353k330K5077R147k4838j2590K0272J4724j1349j8087J929K2007
1110A0757M739k3351q727J9473J2928j2208j8955N644K4830k261k5717P6K0153
1123G381M815j1315j3686M534K2255j719k5469m37K2224O301j6921j4961J3952
1136c046K1458j2776k1441Q419J6567J775j2878j4578J3571K3012j5192k3664
1148a8773J1594K0744j055k0824j0353K4712J5475k6483j3560J9534J1220m913
$$ y = [-7262, -22512, 669, 22368, 6593, -20799, -13281, 18395, 18389, -14616, -21105, 8952, 21823, -2158, -21617, -4977, 19966, 10925, -16695, -15562, 11748, 19338, -5526, -21995, -247, 23019, 4783, -21278, -8842, 16531, 12936, -10448, -17129, 4822, 19991, 7, -19773, -4798, 17016, 10148, -13205, -15535, 9542, 18689, -6149, -18739, 1533, 16257, 4908, -13179, -11250, 10757, 15496, -7855, -16582, 2891, 15819, 3611, -15344, -9700, 15130, 12869, -12848, -12772, 7381, 12196, 881, -12805, -8271, 13984, 12265, -13204, -13641, 8583, 14884, -2037, -16998, -3046, 18412, 5636, -15805, -7386, 9181, 10956, -1922, -16500, -2929, 20083, 4891, -18773, -7179, 13565, 12510, -8314, -18667, 6045, 21520, -4963, -18523, 1011, 12231, 7318]
1160G318j4773r291K3124J5833k8127j6024K4294J6996j4571k2854O688K9303
1172A7916m457k8717K913J9750M641q741j8514M270K9985n918l1224N090K3941
1185A0935M506j8120j8738K0287K6421k5413k1344K2602R623o419m251j4874J0272
1198d513K7430j9916k6127K0585J9346r532j8300l641K4677Q034k8406l703K0542
1211F476J018m192q193q478J9936J0666k4684p717J7763J0943p514k2439N827
1224a0588L1380j3359k6043J7685P907p260P770j4209q820L0989j372l0562P067
1237i415J7990J769r365j8274J3640K5659k2480j6965K0444K347k976K959j7928
1250a2595M605K7124j3212k2839R807J7384L800k2049j3153L2345Q584l3068L483
$$ y = [7318, -7455, -16746, 6378, 22211, -5916, -21940, 2354, 19350, 4779, -18075, -11387, 17916, 13459, -15258, -12345, 7405, 12046, 3305, -15209, -10939, 19046, 13128, -18096, -13006, 10935, 15441, -2679, -21417, -1130, 25291, -122, -21466, 1136, 10759, 4340, 89, -14785, -4513, 22917, 3001, -23126, -2541, 16805, 7273, -11027, -14668, 10009, 18043, -10363, -14066, 6476, 7494, 3302, -4891, -13369, 6567, 17233, -7451, -15168, 2595, 13538, 6024, -16415, -10588, 20792, 7433, -18610, -925, 6982, -278, 7492, -6717, -15537, 15452, 14080, -16482, -9415, 8575, 10344, 979, -17295, -3655, 22004, -476, -17441, 3003, 5350, 2374, 5333, -12595, -7990, 19134, 5922, -16917, -7110, 10274, 14074, -7975, -21128, 11217, 19801, -13267, -9784]
1263i784J6304o355P796o502k1697K4003J8796k9224j0618J7881J3123l963k6764
1276a7004K228L6814j1484k9729J5963R695l740M978j7782l921L0340m466k5329
1289a3437K926J3866J3884j4006l0873K8192K9922l9661j0336K9956q438j233
1301G62P765k5289R866L1565k4185k0239J9279J0908o04j7036j2557L1407Q787
1314B0429l5838L147K2569o280k716l667q163J5298P626j5551q023O494J9219
1327A4544l008l4331J3353L6299k7145j8462K6019n329m448J4164k1353l081K9727
1340A6949j1335j7158Q805J580J2000k984l0823K0344K9113l3650r079K5667q406
1353A023j371P499j8532N595K0598j1909j2222J946J1673J3155k4407j5773L7075
$$ y = [-9784, 6520, 165, 7961, 1459, -20238, 3765, 22561, -6663, -17281, 600, 13723, 9760, -17004, -14776, 22038, 10554, -19175, -3212, 6483, 2743, 7721, -10061, -13982, 16358, 11892, -13437, -10511, 3355, 17239, 3233, -27640, 552, 30474, -9187, -19523, 10433, 1995, 762, 8527, -16762, -6896, 24669, 484, -19755, -476, 10432, 9828, -7208, -19765, 11642, 20429, -15409, -12262, 10307, 4027, 1311, -2356, -10519, 4779, 12405, -3146, -11169, -4675, 14544, 11536, -22795, -9442, 26857, -288, -18750, 7269, 1940, -2508, 11656, -9697, -12778, 16949, 5614, -11544, -2739, -1159, 10841, 7857, -22966, -2622, 26491, -7159, -16238, 9429, 1023, -348, 7151, -11381, -5786, 14812, 2903, -9319, -7373, 4300, 17455, -6952, -22725, 14350]
1366A4350K589l2569J0531J0913p692J0176r093j5218K2163P857j8529m608M256
1379d874J5716K944l2126M704L5875j5908k2531J4670M937J372R27j7209N004
1392f499J8811p569r280m438M946K4132j6142l2695L3074K1032l6009j114J7935
1405F184o760P472l743k0193J8982J4186k0009m118M220O812J2901k3148j4551
1418b1765L6504K154l2443Q156J4319l801J111j0091l267J7594j381j1388j360
1431e658O75J5752L63l0091J0600K9877k0208j5617J5536J533J078j38j4360P727
1445b931J3947j0095m945p51K201J6443j1386k2327K2873J3818k2725k125Q850
1458H47Q02N901r565r139J5629K613q635K99o795R220J5937k4577j0467L0519
$$ y = [14350, 16939, -15630, -5099, 5814, -1878, 8298, -795, -16013, 6150, 14007, -4522, -9130, -4874, 10842, 13786, -18340, -13636, 22239, 6331, -16200, -1530, 3407, 4779, 5706, -11503, -6499, 12312, 4743, -4537, -8975, -4029, 20103, 3961, -28734, 4340, 25372, -10637, -11751, 6184, -576, 6896, 3153, -17040, 1942, 16128, -3881, -7999, -3779, 3033, 15934, -7214, -21765, 14739, 16893, -15550, -7394, 6925, 3124, 4235, -5856, -9123, 8471, 7090, -4298, -5658, -4983, 10769, 11132, -18959, -8359, 21518, 1310, -14307, 1229, 2762, 3840, 3702, -10658, -2931, 11016, 921, -4024, -4775, -2574, 13869, 2483, -19844, 3029, 16847, -5878, -8003, 847, 1649, 7550, -2015, -11154, 4475, 7088, -1547, -1248, -8043, 1177, 17114, -7463, -17930, 12589]
$$ [...]
8191A03
##END NTUPLES=NMR FID
##END=
