##TITLE=1H_ES-DMTF
 CDCl3
 8 sc, 
 26.6.2024
##JCAMPDX= 6.0         $$ Bruker NMR JCAMP-DX V2.0
##DATA TYPE= NMR FID
##DATA CLASS= NTUPLES
##ORIGIN= UXNMR, Bruker Analytische Messtechnik GmbH
##OWNER= root
$$ XWIN-NMR		Version 3.5
$$ Wed Jun 26 14:32:20 2024 Russian Standard Time (UT+4h)  she@DPX200
##.OBSERVE FREQUENCY= 200.1313
##.OBSERVE NUCLEUS= ^1H
##.DELAY= (6, 6)
##.ACQUISITION MODE= SIMULTANEOUS
##.ACQUISITION SCHEME= undefined
##.AVERAGES= 8
##.DIGITISER RES= 18
##SPECTROMETER/DATA SYSTEM= spect
##.PULSE SEQUENCE= zg30
##.SOLVENT NAME= CDCl3
##.SHIFT REFERENCE= (INTERNAL, CDCl3, 0, 15.7039)
##AUDIT TRAIL= $$ (NUMBER, WHEN, WHO, WHERE, WHAT)
$$ ##TITLE= Audit trail, XWIN-NMR		Version 3.5
$$ ##JCAMPDX= 5.01
$$ ##ORIGIN= Bruker BioSpin GmbH
$$ ##OWNER= she
$$ F:/spectra/data/she/nmr/H-F/1/audita.txt
$$ ##AUDIT TRAIL=  $$ (NUMBER, WHEN, WHO, WHERE, WHAT)
(   1,<2024-06-26 14:31:27.42 +0400>,<she>,<DPX200>,
      <created by zg, POWCHK disabled, PULCHK disabled
       configuration hash MD5:
       00 E9 B6 7A A2 85 ED C7 34 08 36 98 17 FE 4E 26
       data hash MD5: 16K
       4E DB 08 49 0D 06 4F 50 9A 1C 49 47 A2 84 4A 4D>)
$$ ##END=
$$ 
$$ hash MD5
$$ 01 45 43 11 BD 0D E2 4C A1 6A F6 4F C7 AB 19 CE
##$RELAX= 
##$RELAX= 
##$RELAX= 
##$RELAX= 
##$RELAX= 
##$RELAX= 
$$ Bruker specific parameters
$$ --------------------------
##$DU= <F:/spectra>
##$EXPNO= 1
##$NAME= <H-F>
##$PROCNO= 1
##$TYPE= <nmr>
##$USER= <she>
##$AMP= (0..31)
100 100 100 100 100 100 100 100 100 100 100 100 100 100 100 100 100 100 
100 100 100 100 100 100 100 100 100 100 100 100 100 100 
##$AQSEQ= 0
##$AQ_mod= 1
##$AUNM= <au_zg>
##$AUTOPOS= <>
##$BF1= 200.13
##$BF2= 200.13
##$BF3= 200.13
##$BF4= 200.13
##$BF5= 200.13
##$BF6= 200.13
##$BF7= 200.13
##$BF8= 200.13
##$BYTORDA= 1
##$CFDGTYP= 0
##$CFRGTYP= 5
##$CHEMSTR= <none>
##$CNST= (0..31)
1 1 145 1 1 1 1 1 1 1 1 1 1 1 1 1 1 1 1 1 1 1 1 1 1 1 1 1 1 1 1 1 
##$CPDPRG= <>
##$CPDPRG1= <>
##$CPDPRG2= <>
##$CPDPRG3= <>
##$CPDPRG4= <mlev>
##$CPDPRG5= <mlev>
##$CPDPRG6= <mlev>
##$CPDPRG7= <mlev>
##$CPDPRG8= <mlev>
##$CPDPRGB= <>
##$CPDPRGT= <>
##$D= (0..31)
0 1.2 0 0 0 0 0 0 0 0.06 0 0.03 0 0 0 0 0.0002 0 0 0 0 0 0 0 0 0 0 0 0 
0 0 0 
##$DATE= 1719397886
##$DBL= (0..7)
120 120 120 120 120 120 120 120 
##$DBP= (0..7)
150 150 150 150 150 150 150 150 
##$DBP07= 0
##$DBPNAM0= <>
##$DBPNAM1= <>
##$DBPNAM2= <>
##$DBPNAM3= <>
##$DBPNAM4= <>
##$DBPNAM5= <>
##$DBPNAM6= <>
##$DBPNAM7= <>
##$DBPOAL= (0..7)
0.5 0.5 0.5 0.5 0.5 0.5 0.5 0.5 
##$DBPOFFS= (0..7)
0 0 0 0 0 0 0 0 
##$DE= 6
##$DECBNUC= <off>
##$DECIM= 32
##$DECNUC= <off>
##$DECSTAT= 4
##$DIGMOD= 1
##$DIGTYP= 9
##$DL= (0..7)
0 120 120 120 120 120 120 120 
##$DP= (0..7)
150 150 150 150 150 150 150 150 
##$DP07= 0
##$DPNAME0= <>
##$DPNAME1= <>
##$DPNAME2= <>
##$DPNAME3= <>
##$DPNAME4= <>
##$DPNAME5= <>
##$DPNAME6= <>
##$DPNAME7= <>
##$DPOAL= (0..7)
0.5 0.5 0.5 0.5 0.5 0.5 0.5 0.5 
##$DPOFFS= (0..7)
0 0 0 0 0 0 0 0 
##$DQDMODE= 0
##$DR= 18
##$DS= 0
##$DSLIST= <SSSSSSSSSSSSSSS>
$$ [...]
##$SUBNAM2= <"">
##$SUBNAM3= <"">
##$SUBNAM4= <"">
##$SUBNAM5= <"">
##$SUBNAM6= <"">
##$SUBNAM7= <"">
##$SUBNAM8= <"">
##$SUBNAM9= <"">
##$SW= 18.0517328524113
##$SWIBOX= (0..15)
0 0 2 0 0 0 0 0 0 0 0 0 0 0 0 0 
##$SW_h= 3612.71676300578
##$TD= 16384
##$TD0= 1
##$TE= 0
##$TE2= 300
##$TE3= 300
##$TEG= 300
##$TL= (0..7)
0 120 120 120 120 120 120 120 
##$TP= (0..7)
150 150 150 150 150 150 150 150 
##$TP07= 0
##$TPNAME0= <>
##$TPNAME1= <>
##$TPNAME2= <>
##$TPNAME3= <>
##$TPNAME4= <>
##$TPNAME5= <>
##$TPNAME6= <>
##$TPNAME7= <>
##$TPOAL= (0..7)
0.5 0.5 0.5 0.5 0.5 0.5 0.5 0.5 
##$TPOFFS= (0..7)
0 0 0 0 0 0 0 0 
##$TUNHIN= 0
##$TUNHOUT= 0
##$TUNXOUT= 0
##$USERA1= <user>
##$USERA2= <user>
##$USERA3= <user>
##$USERA4= <user>
##$USERA5= <user>
##$V9= 5
##$VALIST= <valist>
##$VCLIST= <CCCCCCCCCCCCCCC>
##$VD= 0
##$VDLIST= <DDDDDDDDDDDDDDD>
##$VPLIST= <PPPPPPPPPPPPPPP>
##$VTLIST= <TTTTTTTTTTTTTTT>
##$WBST= 1024
##$WBSW= 4
##$XGAIN= (0..3)
0 0 0 0 
##$XL= 0
##$YL= 0
##$YMAX_a= 30739
##$YMIN_a= -35102
##$ZGOPTNS= <>
##$ZL1= 120
##$ZL2= 120
##$ZL3= 120
##$ZL4= 120
##$ABSF1= 10
##$ABSF2= 0
##$ABSG= 5
##$ABSL= 3
##$ALPHA= 0
##$AQORDER= 0
##$ASSFAC= 0
##$ASSFACI= 0
##$ASSFACX= 0
##$ASSWID= 0
##$AUNMP= <proc_1d>
##$AZFE= 0.1
##$AZFW= 0.1
##$BCFW= 1
##$BC_mod= 2
##$BYTORDP= 1
##$COROFFS= 0
##$CY= 11.3945322036743
##$DATMOD= 1
##$DC= 2
##$DFILT= <>
##$DTYPP= 0
##$F1P= 15.6554695791079
##$F2P= 12.8336369535428
##$FCOR= 0.5
##$FTSIZE= 0
##$FT_mod= 4
##$GAMMA= 1
##$GB= 0.15
##$INTBC= 1
##$INTSCL= 1
##$ISEN= 128
##$LB= 0.24
##$LEV0= 0
##$LPBIN= 0
##$MAXI= 10000
##$MC2= 0
##$MEAN= 0
##$ME_mod= 0
##$MI= 1.114404
##$NCOEF= 0
##$NC_proc= 0
##$NLEV= 6
##$NOISF1= 3.799351
##$NOISF2= 2.8
##$NSP= 1
##$NTH_PI= 0
##$NZP= 0
##$OFFSET= 15.70392
##$PC= 1
##$PHC0= -25229.49
##$PHC1= 15.78748
##$PH_mod= 1
##$PKNL= yes
##$PPARMOD= 0
##$PSCAL= 0
##$PSIGN= 0
##$REVERSE= no
##$SF= 200.130013532006
##$SI= 16384
##$SIGF1= 3
##$SIGF2= 2
##$SINO= 400
##$SIOLD= 16384
##$SREGLST= <1H.CDCl3>
##$SSB= 0
##$STSI= 0
##$STSR= 0
##$SW_p= 3612.71676300578
##$SYMM= 0
##$S_DEV= 0
##$TDeff= 0
##$TDoff= 0
##$TI= <>
##$TILT= no
##$TM1= 0
##$TM2= 0
##$TOPLEV= 0
##$USERP1= <user>
##$USERP2= <user>
##$USERP3= <user>
##$USERP4= <user>
##$USERP5= <user>
##$WDW= 1
##$XDIM= 8192
##$YMAX_p= 0
##$YMIN_p= 0
$$ End of Bruker specific parameters
$$ ---------------------------------
##NTUPLES= NMR FID
##VAR_NAME=  TIME,          FID/REAL,        FID/IMAG
##SYMBOL=    X,             R,               I
##VAR_TYPE=  INDEPENDENT,   DEPENDENT,       DEPENDENT
##VAR_FORM=  AFFN,          ASDF,            ASDF
##VAR_DIM=   8192,          8192,            8192
##UNITS=     SECONDS,       ARBITRARY UNITS, ARBITRARY UNITS
##FACTOR=    0.0002768,     1,               1
##FIRST=     0,             0,               0
##LAST=      2.2672688,     0,               0
##MIN=       0,             -35102,          0
##MAX=       2.2672688,     30739,           0
$$ Real data points
##PAGE= N=1
##DATA TABLE= (X++(R..R)), XYDATA
$$ [...]
$$ plain form
590 2405 5392 5426 2419 -1765 -4549 -4503 -2062 945 2410 1728 -125 -1297 -674 1331 2913 2620 59
607 59 -3214 -4976 -3893 -321 3616 5517 4328 901 -2543 -3909 -2816 -396 1371 1282 -252 -1576
623 -1576 -1338 684 2968 3737 2020 -1404 -4360 -5006 -2735 1063 4132 4630 2641 -423 -2503 -2557 -924
640 -924 719 953 -313 -1867 -2153 -539 2168 4069 3740 985 -2651 -4823 -4248 -1339 2123 3995
656 3995 3378 1053 -1208 -1881 -865 677 1139 -22 -1939 -3043 -2107 636 3423 4454 2928 -392
672 -392 -3483 -4495 -2999 -30 2429 3016 1727 -170 -1140 -581 736 1488 755 -1288 -3149 -3313 -1316
689 -1316 1783 4138 4146 1872 -1462 -3674 -3605 -1592 933 2222 1712 171 -890 -590 844 2101 1855
706 1855 -107 -2615 -3964 -3061 -243 2817 4212 3237 554 -2129 -3192 -2281 -290 1204 1271 170
$$ packed form
590B405K987L4l007m184k784M6K441L007J465o82j853j172O23K005J582k93k561
607E9l273j762J083L572L937J901j189l427l444j366J093K420J767q9j534j324
623a576K38K022K284P69j717l424k956o46K271L798L069M98j989l064k080n4J633
640i24J643K34j266j554k86J614K707J901l29k755l636k172N75K909L462J872
656C995o17k325k261o73J016J542M62j161j917j104R36K743K787J031j526l320
672c92l091j012J496K969K459N87j289j897r70N59J317P52p33k043j861j64J997
689a316L099K355Qk274l334k212O9K013K525J289n10j541j061L00J434J257k46
706A855j962k508j349R03K818L060J395r75k683k683j063R11J991J494O7j101
$$ plain form
722 170 -875 -816 534 2209 2743 1449 -1123 -3468 -3952 -2197 823 3248 3684 2058 -449 -2138 -2156
739 -2156 -805 647 968 22 -1213 -1499 -299 1737 3163 2830 603 -2230 -3934 -3427 -1068 1647
755 1647 3091 2602 764 -1050 -1646 -850 384 863 135 -1260 -2036 -1397 625 2726 3487 2327 -324
772 -324 -2821 -3651 -2487 -52 1970 2470 1427 -210 -1122 -721 415 1097 634 -869 -2286 -2386 -828
789 -828 1592 3345 3330 1393 -1253 -3012 -2980 -1341 663 1741 1393 172 -745 -585 440 1436 1340 -57
807 -57 -1904 -2898 -2207 -25 2405 3472 2693 490 -1738 -2645 -1910 -301 1002 1094 239 -717 -766 257
825 257 1500 1952 1022 -958 -2660 -3012 -1576 837 2730 3033 1698 -374 -1799 -1868 -787 397 718
842 718 113 -839 -1151 -317 1176 2292 2074 413 -1759 -3060 -2653 -709 1495 2719 2305 743 -833
$$ packed form
722A70j045N9J350J675N34j294k572k345m84J755L020K425M36j626k507j689j8
739b156J351J452L21r46j235k86J200K036J426l33k227k833j704N07K359K715
755A647J444m89j838j814n96P96J234M79p28j395p76O39K022K101P61j160k651
772c24k497q30J164K435K022N00j043j637r12M01J136O82m63j503j417j00J558
789h28K420J753j5j937k646j759L2J639K004J078l48j221r17J60J025R96r6j397
807e7j847r94O91K182K430J067p79k203k228r07P35J609J303R2q55r56m9J023
825B57J243M52r30j980j702l52J436K413J893L03j335k072j425o9J081J184L21
842G18o05r52l12Q34J493J116k18j661k172j301M07J944K204J224m14j562j576
$$ plain form
859 -833 -1388 -854 193 677 191 -892 -1550 -1106 388 2021 2586 1669 -381 -2272 -2908 -1919 57 1727
877 1727 2119 1322 -17 -857 -654 129 721 465 -614 -1693 -1827 -705 1126 2539 2503 1002 -1091 -2506
895 -2506 -2453 -1050 663 1642 1377 358 -482 -493 246 1031 1008 -2 -1437 -2225 -1710 -8 1798 2650 1998
914 1998 251 -1537 -2233 -1638 -291 851 1052 428 -350 -520 136 1093 1427 755 -731 -2063 -2342 -1192
932 -1192 655 2141 2418 1293 -383 -1588 -1652 -768 295 745 324 -480 -748 -158 983 1787 1577 294
950 294 -1410 -2400 -2050 -567 1199 2147 1824 543 -778 -1307 -861 -23 488 239 -510 -1040 -739 363
968 363 1573 2056 1296 -319 -1834 -2358 -1553 57 1432 1807 1096 -62 -810 -742 -46 510 354 -411 -1203
987 -1203 -1310 -405 1013 2076 2024 825 -876 -2004 -1928 -821 555 1356 1152 311 -463 -520 -11 636 677
$$ packed form
859h33n55N34J047M84m86j083o58M44J494J633N65r17k050j891o36R89J976J670
877A727L92p97j339q40K03P83N92k56j079j079j34J122J831J413l6j501k093j415
895b506N3J403J713R79k65j019q40j1P39P85k3j010j435p88N15J702J806Q52o52
914A998j747j788o96N95J347J142K01o24p78j70O56R57L34o72j486j332k79J150
932a192J847J486K77j125j676j205o4Q84J063M50m21q04k68N90J141Q04k10j283
950B94j704r90L50J483J766R48l23j281j321n29M46Q38N11k49p49n30L01J102
968C63J210M83p60j615j515n24Q05J610J375L75p11j158p48O8O96N56j56p65p92
987a203j07R05J418J063n2j199j701j128P6J107J376Q01k04q41p74n7N09O47M1
$$ plain form
1006 677 -80 -1120 -1706 -1278 54 1484 2216 1656 205 -1227 -1834 -1389 -209 739 951 448 -235 -470
1024 -470 10 734 1051 540 -609 -1629 -1798 -896 648 1847 2007 1111 -311 -1275 -1343 -640 267 619 336
1043 336 -288 -579 -213 625 1276 1154 139 -1202 -1951 -1650 -412 1014 1858 1542 481 -631 -1073 -724
1061 -724 -16 454 273 -316 -799 -546 298 1247 1560 946 -351 -1550 -1921 -1242 118 1242 1565 980 19
1080 19 -646 -598 -84 373 334 -267 -932 -1039 -364 767 1619 1551 543 -839 -1726 -1641 -689 516 1187 1032
1100 1032 331 -338 -407 41 516 581 -19 -830 -1293 -936 108 1239 1758 1299 78 -1095 -1565 -1150 -191
1119 -191 665 852 420 -158 -360 28 611 843 414 -465 -1324 -1434 -708 551 1500 1588 807 -359 -1182 -1197
1139 -1197 -582 189 546 302 -175 -443 -100 556 1053 928 120 -916 -1528 -1251 -261 906 1495 1243 366
$$ packed form
1006F77p57j040n86M28J332J430P32n60j451j432o07M45J180R48K12n03o83k35
1024d70M80P24L17n11j149j020j69R02J544J199J60q96j422r64o8P03R07L52k83
1043C36o24k91L66Q38O51j22j015j341p49L01J238J426Q44l16j061j112m42L49
1061g24P08M70j81n89m83K53Q44R49L13o14j297j199l71O79J360J124L23n85r61
1080A9o65M8N14M57l9o01o65j07O75J131Q52o8j008j382q87Q5R52J205O71j55
1100A032p01o69o9M48M75O5o00q11m63L57J044J131N19m59j221j173m70M15R59
1119a91Q56J87m32n78k02L88N83K32m29q79q59j10P26J259R49Q8p81j166q23j5
1139a197O15P71L57k44m77k68L43O56M97j25q08j036o12K77R90J167N89k52q77
$$ plain form
1158 366 -545 -942 -661 -79 339 232 -237 -587 -421 233 1012 1267 752 -282 -1256 -1538 -941 122 1023
1177 1023 1262 732 -98 -590 -543 -135 280 223 -266 -752 -775 -198 733 1359 1278 400 -679 -1334 -1242 -490 484
1198 484 980 833 272 -300 -403 -50 337 374 -45 -701 -1029 -766 102 1048 1427 1007 17 -899 -1261 -888
1218 -888 -73 574 683 311 -136 -263 -80 415 599 290 -457 -1108 -1121 -533 470 1249 1301 687 -289 -901
1238 -901 -920 -380 232 493 320 -102 -307 -82 393 799 674 18 -802 -1295 -1027 -196 744 1205 994 247
1258 247 -454 -771 -530 -78 273 205 -193 -436 -335 232 767 965 536 -313 -1036 -1267 -744 106 878 1013
1278 1013 609 -44 -466 -461 -91 255 222 -140 -529 -584 -160 577 1065 979 280 -596 -1159 -1063 -449 378 814 685
1300 685 189 -235 -332 -51 266 304 -31 -555 -814 -577 136 815 1132 802 -19 -770 -1060 -747 -105 470 592
$$ packed form
1158C66r11l97K81N82M18j07m69l50J66O54P79K55n15j034r74k82N97J063R01
1177A023K39n30q30m92M7M08M15n7m89m86k3N77R31O26q1q78j079o55R2P52R74
1198D84M96j47n61n72j03L53L87L7m19o56l28K63Q68R46L79m20r90r16l62L73
1218h88Q15O47J09l72m47j27J83M95J84l09p47o51j3N88J003P79N2o14r76o12
1238i01j9N40O12K61j73m22k05K25M75M06j25o56q20m93K68Q31R40M61k11p47
1258B47p01l17K41M52L51o8l98k43J01N67N35J98m29q49p23k31N23Q50P72J35
1278A013m04o53m22NL70L46l3l62l89n5M24P37M88q6o99q76n63R6O14Q27M36j29
1300F85m96m24r7K81L17L8l35n24k59K37P13O79L17l30q21p51k90L13O42N75J22
$$ plain form
1321 592 324 -84 -216 1 343 515 255 -320 -816 -888 -386 458 1046 1057 505 -288 -834 -790 -392 145 403
1342 403 217 -95 -238 -78 351 643 531 -10 -664 -997 -802 -91 683 1036 838 180 -424 -662 -476 -19
1362 -19 259 185 -106 -356 -212 176 646 773 437 -276 -834 -1007 -548 169 765 890 535 -75 -438 -420 -146
1383 -146 130 136 -135 -470 -494 -138 461 855 747 182 -492 -947 -863 -296 382 712 602 213 -187 -293 -60
1404 -60 213 247 -47 -428 -654 -445 120 689 944 637 -38 -645 -883 -600 -17 421 552 290 -52 -192 -37
1425 -37 223 361 160 -327 -678 -748 -307 356 794 817 378 -253 -661 -665 -279 161 357 222 -13 -199 -18 265
1447 265 485 428 -23 -551 -804 -629 -58 567 843 641 130 -383 -527 -378 -44 206 147 -89 -242 -190 168
1468 168 523 608 318 -249 -701 -836 -483 130 605 688 370 -63 -366 -338 -91 159 160 -97 -329 -345 -40 422
$$ packed form
1321E92k68m08j32K17L42J72k60n75m96p2N02Q44N88J1n52p93n46M4L98N37K58
1342D03j86l12j43J60M29K92j12n41o54l33J95P11P74L53j98o58o04k38J86M57
1362a9K78p4k91k50J44L88M70J27l36p13n58j73M59P17N96J25l55o10l63J8K74
1383a46K76Ok71l35k4L56N99L94j08n65o74m55Q4N67O78L30j10l89m00j06K33
1404f0K73L4k94l81k26K09N65N69K55l07o75o07k38K83N83M38J31k62l42j40J55
1425c7K60J38k01m87l51p0M41O63M38K3m39o31m08mL86M40J96j35k35j86J81K83
1447B65K20n7m51n28k53J75N71O25K76k02n11n13j44J49L34K50n9k36j53N2L58
1468A68L55Q5k90n67m52j35L53O13M75Q3l18m33l03K8K47K50Jk57k32j6L05M62
$$ plain form
1490 422 713 621 183 -440 -773 -681 -210 333 572 448 144 -158 -220 -66 191 188 -26 -367 -495 -323 135 579
1512 579 718 471 -61 -561 -722 -486 -49 305 372 201 -67 -133 -23 211 299 121 -236 -563 -551 -158 307
1533 307 731 681 305 -210 -542 -537 -220 152 285 162 -83 -167 -39 215 400 314 -37 -469 -674 -465 -27 446
1555 446 706 501 116 -325 -482 -307 -71 157 106 -81 -220 -154 161 415 516 254 -215 -566 -644 -330 152
1576 152 527 605 323 -50 -259 -261 -27 92 95 -88 -277 -305 -25 328 561 497 82 -373 -611 -531 -163 268 461
1599 461 372 79 -144 -158 -51 117 109 -63 -305 -433 -280 98 465 621 392 -65 -471 -540 -367 15 310 345
1621 345 202 -28 -78 19 173 240 59 -236 -429 -472 -121 266 541 528 201 -231 -489 -439 -158 109 243 155
1643 155 -50 -112 -8 194 317 234 -44 -393 -544 -402 -18 407 568 389 46 -272 -364 -214 17 144 103
$$ packed form
1490D22K91r2m38o23l33R2M71N43K39j24l04l02o2J54K57lk14l41j28J72M58M44
1512E79J39k47n32n00j61K36M37L54O7j71k68o6J10K34Q8j78l57l27J2L93M65
1533C07M24n0l76n15l32NL17L72J33j23k45q4J28K54J85q6l51m32k05K09M38M73
1555D46K60k05l85m41j57J75K36K28n1j87j39O6L15K54J01k62m69l51p8L14M82
1576A52L75P8k82l73k09kK34J19Lj83j89k8K80L53K33o4m15m55k38Q0L68M31J93
1599D61q9k93k23j4J07J68qj72k42j28J53L78L67J56k29m57m06o9J73L82K95L5
1621C45j43k30n0R7J54O7j81k95j93m3L51L87K75j3l27m32k58N0K81K67J34q8
1643A55k05o2J04K02J23q3k78l49j51J42L84M25J61j79l43l18r2J50K31J27m1
$$ plain form
1664 103 -48 -146 -63 153 380 397 196 -193 -494 -539 -286 110 431 426 228 -76 -267 -190 -44 86 88 -89 -229
1687 -229 -229 8 297 498 375 75 -325 -521 -414 -101 220 379 292 73 -114 -153 -3 119 114 -59 -272 -307
1709 -307 -188 129 426 523 313 -61 -414 -455 -297 21 235 252 99 -79 -125 -15 124 143 -15 -232 -412 -369
1731 -369 -98 257 476 425 161 -183 -376 -331 -98 115 168 78 -48 -88 38 186 301 193 -54 -311 -412 -291
1753 -291 16 364 469 316 28 -205 -266 -211 9 126 37 -93 -157 -84 127 300 341 118 -222 -432 -438 -183 118
1776 118 356 368 158 -75 -182 -134 9 101 33 -93 -206 -171 37 284 417 315 9 -290 -417 -340 -48 232
1798 232 314 225 28 -76 -117 23 105 72 -90 -263 -294 -179 114 349 367 210 -111 -370 -373 -200 2 208 185
1821 185 68 -61 -63 54 174 152 24 -185 -345 -280 -11 240 411 352 132 -175 -294 -240 -104 84 143 66 -70
$$ packed form
1664A03j51r8Q3K16K27J7k01l89l01m5K53L96L21nj98l04j91P7J46J30Kj77j40
1687b29%K37K89K01j23l00m00j96J07L13L21J59q7k19j87l9J50J22nj73k13l5
1709c07J19L17K97R7k10l74l53m1J58L18K14J7j53j78m6J10J39J9j58k17j80M3
1731c69K71L55K19n1k64l44j93M5K33K13N3r0j26m0J26J48J15j08k47k57j01J21
1753b91L07L48J05j53k88k33o1N5K20J17q9j30o4P3K11J73M1k23l40k10oK55L01
1776A18K38J2k10k33j07M8J43R2o8j26j13L5K08K47J33j02l06k99j27P7K92K80
1798B32Q2q9j97j04m1J40Q2l3j62j73l1J15K93K35J8j57l21k59lJ73K02K06k3
1821A85j17j29kJ17J20k2j28k09j60O5K69K51J71n9k20l07j19N4J36J88N9p7j36
$$ plain form
1844 -70 -73 20 191 260 160 -104 -292 -386 -245 67 289 376 236 -28 -186 -255 -129 -6 75 -1 -83 -132 -31 152
1868 152 295 302 114 -177 -347 -328 -112 119 287 301 144 -51 -148 -87 7 67 27 -128 -197 -188 18 259 357 233
1892 233 -18 -274 -362 -296 -36 156 216 135 -1 -98 -85 24 106 47 -87 -252 -250 -123 167 341 374 198 -44 -272
1916 -272 -288 -133 78 174 179 54 -47 -21 70 156 142 -13 -219 -334 -289 -50 226 364 288 83 -165 -299 -221 -48
1940 -48 46 98 5 -74 -90 7 164 204 111 -61 -277 -307 -189 81 277 331 233 9 -145 -158 -81 30 74 26 -80
1965 -80 -86 -23 154 241 252 63 -190 -357 -331 -139 106 268 221 90 -69 -156 -67 -8 49 0 -85 -174 -120 43 228
1990 228 303 229 -23 -254 -329 -207 -23 138 235 143 16 -88 -28 78 132 82 -53 -212 -201 -85 112 297 278
2013 278 137 -118 -279 -292 -137 31 118 113 13 -58 -47 60 140 106 -24 -183 -276 -178 -18 213 286 259 67 -147
$$ packed form
1844g0lR3J71O9j00k64j88r4J41L12K22Q7j40k64j58o9J26J23Q1p6q2m9J01J83
1868A52J43Pj88k91j70J9K16K31J68J4j57j95r7O1R4O0m0j55o9RK06K41R8j24
1892B33k51k56q8O6K60J92O0q1j36r7J3J09Q2n9j34j65KJ27K90J74L3j76k42k28
1916b72j6J55K11R6Nj25j01K6R1Q6j4j55k06j15M5K39K76J38p6k05k48j34P8J73
1940d8R4N2r3p9j6R7J57M0r3j72k16l0J18K70J96N4r8k24j54j3P7J11M4m8j06
1965h0oO3J77Q7J1j89k53j67K6J92K45J62m7j31j59q7Q9N9N7m9q5q9N4J63J85
1990B28P5p4k52k31p5J22J84J61R7r2j27j04O0J06N4n0j35j59J1J16J97J85j9
2013B78j41k55j61j3J55J68Q7nj00p1J1J07Q0l4j30j59r3R8J60K31P3k7j92k14
$$ plain form
2037 -147 -215 -162 -27 65 79 37 -66 -78 58 158 242 126 -71 -251 -304 -140 66 273 276 171 -36 -161 -164 -93
2061 -93 39 41 9 -84 -93 -28 88 272 205 20 -170 -289 -268 -98 138 267 227 97 -65 -98 -46 39 56 2 -120
2086 -120 -151 -101 44 241 320 203 -12 -233 -300 -197 -24 152 199 113 -2 -81 -71 3 75 19 -92 -217 -215 -88
2110 -88 110 258 262 109 -105 -238 -245 -116 59 158 118 18 -42 -12 67 163 100 0 -150 -252 -168 18 223 298 237
2135 237 89 -112 -195 -157 -21 63 51 -8 -66 -58 52 180 159 79 -98 -234 -262 -156 69 228 261 141 -23 -138
2159 -138 -145 -16 61 68 -12 -71 -73 10 145 245 215 54 -142 -267 -192 -80 114 225 194 44 -68 -115 -35 30 41 -12
2185 -12 -111 -134 -126 45 211 239 135 -37 -233 -310 -182 -5 155 172 107 -27 -54 -44 79 84 33 -58 -125 -159 -52 165
2211 165 283 248 112 -76 -214 -188 -95 56 100 80 27 -44 13 31 103 97 -69 -198 -230 -208 -2 189 254 153 8
$$ packed form
2037a47o8N3J35R2J4m2j03j2J36J00Q4j16j97j80n3J64K06K07Lj05k07j25lP1
2061i3J32Kl2r3rO5J16J84o7j85j90j19K1J70K36J29m0j30j62l3N2Q5J7n4j22
2086a20l1N0J45J97P9j17k15k21o7J03J73J76M7q6j15p9J0P4P2n6j11j25KJ27
2110h8J98J48Mj53k14j33pJ29J75R9m0j00o0L0P9R6o3j00j50j02Q4J86K05P5o1
2135B37j48k01q3L8J36Q4j2n9n8QJ10J28k1q0j77j36k8J06K25J59L3j20j64j15
2159a38pJ29P7Pq0n9kQ3J35J00l0j61j96j25P5J12J94J11l1j50j12m7Q0O5J1n3
2185a2r9k3QJ71J66K8j04j72j96p7J28J77J60J7o5j34k7J0J23Nn1r1o7l4J07K17
2211A65J18l5j36j88j38K6R3J51M4k0n3p1N7J8P2oj66j29l2K2K06J91O5j01j45
$$ plain form
2236 8 -143 -207 -163 -23 73 42 -10 -86 -52 74 151 158 81 -69 -218 -221 -94 91 231 245 152 -1 -119 -121 -26 49 21
2263 21 -21 -80 -82 20 121 217 165 16 -188 -260 -218 -74 79 223 160 53 -76 -95 -24 28 22 -14 -88 -133 -90 79
2289 79 209 233 114 -61 -182 -218 -154 35 141 172 107 17 -26 -18 34 84 16 -105 -185 -196 -46 107 237 233 74 -97
2315 -97 -213 -217 -106 11 102 91 3 -55 -3 79 117 77 -66 -175 -220 -156 24 168 269 184 13 -121 -173 -89 12
2340 12 47 57 28 -36 -8 90 156 141 55 -116 -215 -236 -111 67 182 204 74 -64 -134 -92 -69 42 33 -50 -75 -105 1
2367 1 119 211 157 0 -166 -238 -182 -11 99 187 160 55 -51 -75 -21 44 37 -6 -86 -117 -52 66 208 194 129 -65
2393 -65 -168 -232 -130 1 130 126 47 -52 -71 -19 42 49 3 -111 -178 -110 -28 154 215 214 51 -105 -176 -145 -63 68 92
2420 92 83 -26 -28 16 70 110 85 -31 -161 -198 -116 34 174 250 158 18 -118 -176 -121 -27 53 74 -16 -38 -45 62 143 117
$$ packed form
2236Hj51o4M4J40R6l1n2p6L4J26P7Pp7j50j49lJ27J85J40J4r3j53j18kR5P5k8
2263B1m2n9kJ02J01R6n2j49k04p2M2J44J53J44o3j07j29j9P1N2ol6p4m5M3J69
2289G9J30K4j19j75j21l6O4J89J06L1o5r0m3QN2N0o8j21q0j1J50J53J30mj59j71
2315i7j16mJ11J17R1j1q8n8N2Q2L8m0j43j09m5O4J80J44J01q5j71j34n2Q4J01
2340A2L5J0k9o4K8R8O6j5q6j71r9k1J25J78J15K2j30j38p0M2K3J11rq3k5l0J06
2367AJ18R2n4j57j66p2N6J71J10Q8k7j05j06k4N4O5pm3q0l1O5J18J42j4o5j94
2393f5j03o4J02J31J29mp9r9j9N2O1Pm6j14o7O8Q2J82O1jj63j56p1L1Q2J31K4
2420I2rj09kM4N4M0k5j16j30l7Q2J50J40P6r2j40j36n8N5R4Q0K1r0k2pJ07Q1k6
$$ plain form
2448 117 37 -83 -210 -224 -92 60 208 199 111 -29 -121 -106 -61 67 31 -12 -57 -72 9 118 162 146 -8 -119 -204
2473 -204 -131 -1 148 171 141 41 -65 -82 -44 5 11 -43 -134 -158 -56 66 168 187 97 -51 -174 -224 -132 3 147
2498 147 143 75 18 -49 -16 62 51 16 -55 -144 -113 -6 142 215 177 52 -106 -165 -156 -57 29 65 64 -7 -46 -16 34 100 43
2527 43 -71 -110 -185 -131 35 177 192 111 -17 -119 -145 -124 -12 35 64 6 -32 2 55 121 147 31 -86 -144 -172 -70
2553 -70 90 166 186 98 -40 -107 -90 -35 22 19 -45 -58 -50 -19 81 128 108 -43 -136 -195 -154 -33 104 150 113 16 -52 -66
2581 -66 -64 12 30 -19 -51 -59 2 90 177 224 99 -2 -155 -152 -94 48 159 112 98 26 -37 -35 17 23 6 -77 -130 -103 -38 81
2611 81 194 138 20 -114 -182 -165 -24 48 73 59 3 -13 -10 40 39 48 -15 -93 -147 -81 65 154 201 140 35 -102 -146 -69
2639 -69 12 81 43 62 -39 -25 51 61 96 52 -65 -166 -136 -53 82 164 160 35 -19 -129 -89 -29 24 28 -28 -40 -76 18
$$ packed form
2448A17q0j20j27j4J32J52J48rq8j40r2J5M5J28l6m3m5j5Q1J09M4j6j54j11q5
2473b04P3J30J49K3l0j00j06j7L8M9On4r1k4J02J22J02J9r0j48j23n0R2J35J44
2498A47mo8n7o7L3P8j1l5p1q9L1J07J48P3l8j25j58n9RR9Q6L6jp1l9L0N0O6n7
2527D3j14l9p5N4J66J42J5q1j28j02k6K1J12M7K9n8l8L4N3O6K6j16j17n8k8J02
2553g0J60P6K0q8j38o7J7N5N7lo4j3QL1J00M7k0j51r3n9M1J21J37M6l7r7o8j4
2581f6KP6J8m9l2qO1Q8Q7M7j25j01j53LN8J42J11m7j4p2o3KN2Oj7q3n3K7O5J19
2611H1J13n6j18j34o8J7J41P2K5j4n6j6LN0jRo3p8n4O6J46Q9M7o1j05j37m4P7
2639f9Q1O9l8J9j01J4P6J0L5m4j17j01L0Q3J35Q2mj25n4j10M0O0N3Mn6j2l6R4
$$ plain form
2667 18 90 118 85 -6 -91 -152 -102 -2 141 168 117 61 -36 -51 -39 7 30 15 -58 -66 -35 56 94 140 62 -47 -136 -215 -111
2696 -111 8 112 112 51 18 -32 -52 40 23 -11 -78 -79 -93 5 116 154 118 53 -81 -124 -96 -48 58 82 77 41 -12 10 41
2725 41 83 51 -9 -114 -106 -53 32 96 154 91 -35 -109 -110 -79 -27 45 39 10 -50 -3 33 80 78 38 -68 -137 -113 -8 87 156
2755 156 158 80 -25 -61 -55 -20 24 32 -46 -81 -26 15 81 86 65 -3 -110 -150 -141 22 104 142 93 -23 -36 -81 -55 -23 20 3
2785 3 -65 -62 -45 64 107 128 80 -10 -163 -134 -85 46 109 107 59 3 -43 -26 30 26 6 -18 -90 -49 40 92 153 89 13 -92
2815 -92 -114 -122 -50 48 83 36 1 -31 -11 6 27 16 -56 -99 -121 -71 35 125 170 88 15 -97 -94 -63 4 49 61 53 5 -9 69
2846 69 41 39 -3 -82 -101 -111 -22 67 127 111 54 -57 -76 -100 -27 17 32 -36 -51 -48 -2 73 90 27 -2 -121 -139 -80 -16 84
2876 84 121 99 53 -10 -45 -3 -5 27 25 -19 -36 18 88 96 125 92 -45 -110 -69 -66 34 113 82 45 7 -52 -37 10 -9 -18 -54 -77
$$ packed form
2667A8P2K8l3r1q5o1N0J00J43K7n1n6r7j5J2M6K3j5p3qL1R1L8M6p8j09q9p9J04
2696a11J19J04%o1l3n0k0R2j7l4o7jj4R8J11L8l6o5j34m3K8M8J06K4nl6n3K2L1
2725D1M2l2o0j05QN3Q5O4N8o3j26p4jL1N2P2ok9o0M7L6M7km0j06o9K4J05R5O9
2755A56Kp8j05l6OL5M4Qp8l5N5M1O6Nk1o8j07m0RJ63Q2L8m9j16j3m5K6L2M3j7
2785Co8LJ7J09M3K1m8r0j53K9M9J31O3km8n6m6J7N6mk0k4p2M1Q9N2O1o4p6j05
2815i2k2qP2R8L5m7l5l2K0J7K1j1p2m3k2N0J06R0M5q2p3j12LL1O7M5J2qm8j4P8
2846F9k8km2p9j9j0Q9Q9O0j6n7j11j9k4P3M4J5o8j5LM6P5J7o3k9j19j8N9O4J00
2876H4L7k2m6o3l5M2kL2km4j7N4P0QK9l3j37o5M1LJ00P9l1l7l8n9J5M7j9rl6k3
$$ plain form
2908 -77 -92 -3 69 152 59 -21 -111 -118 -93 -36 34 84 39 35 -8 -7 5 40 32 -25 -59 -87 -25 74 151 125 77 -20 -71 -130 -63 -10
2940 -10 22 19 11 -35 -48 10 44 33 -32 -82 -115 -87 -50 36 91 81 40 -53 -74 -76 -34 25 13 -3 -28 -11 0 68 65 73 13 -69 -87
2973 -87 -26 17 110 107 99 26 -35 -73 -55 23 -9 -7 -45 -65 -48 33 86 108 6 -62 -107 -118 -54 15 73 71 26 -23 -21 -24 1 21 1
3006 1 -51 -74 -43 6 62 123 72 29 -59 -90 -101 -4 58 50 61 6 -10 -18 36 34 41 -28 -106 -79 -64 -9 107 87 46 -33 -77 -125
3038 -125 -57 16 34 9 -2 4 -17 36 46 77 22 -67 -64 -103 -8 67 124 105 24 -30 -57 -61 1 42 18 11 -14 -8 0 74 98 39 -9
3071 -9 -110 -113 -100 -22 71 100 39 20 -57 -80 -59 -19 53 26 -43 -41 -31 72 94 53 67 -64 -100 -79 -40 37 74 89 28 5
3101 5 -2 -22 15 4 -1 -54 -84 -46 8 66 109 48 -40 -90 -114 -108 -44 16 64 23 -21 -30 -54 -14 19 16 -23 -47 -96 -28 27 101 110 68
3135 68 19 -84 -79 -78 19 44 68 40 9 2 29 51 26 30 -59 -98 -96 -13 55 82 88 19 -34 -54 -57 -79 -10 4 -12 -48 -37 14 19 48
$$ packed form
2908g7j5Q9P2Q3r3q0r0pK5N7P0N0m5mm3JJ2L5qn7l4k8O2R9P7k6m8r7n1n9O7N3
2940a0L2lqm6j3N8L4j1o5n0l3K8L7Q6N5j0m1r3k1kM2N9j2j6k5J7J1O8lQo0q2j8
2973h7O1M3R3lqp3o1l8J8P8l2Kl8k0J7Q1N3K2j02o8m5j1O4O9N8km5m9KlK5K0k0
3006An2k3L1M9N6O1n1m3q8l1j1R7O2qJ1n5j6qN4kPo9p8K7J5N5J16k0m1p9m4m8
3038a25O8P3J8k5j1Ok1N3J0L1n5q9Ll9R5P5N7j9q1n4k7mO2M1k4pk5OQP4K4n9m8
3071ij01lJ3P8R3K9o1j9p7k3K1M0P2k7o9KJ0J03K2m1J4j31l6K1L9P7L7J5o1k3
3101Epk0L7j1nn3l0L8N4N8M3o1q8n0k4OO4O0M8m1m4rk4M0L3ll9k4m9O8N5P4Rm2
3135F8m9j03NJR7K5K4k8l1pK7K2k5Mq9l9KQ3O8K7Oo9n3k0lk2O9J4j6l6J1N1NK9
$$ plain form
3169 48 35 -11 -91 -90 -58 22 70 87 75 21 -19 -49 -33 4 35 18 -38 -21 -26 49 100 69 0 -52 -138 -115 -26 32 81 67 -2
3200 -2 -36 -39 -26 -2 -45 -24 -47 -82 -68 0 65 93 73 -16 -73 -105 -67 10 70 84 62 31 9 2 9 12 31 -1 -51 -67 -27 33 86
3233 86 79 60 -23 -86 -105 -61 0 20 43 -22 -11 -19 -2 38 42 -11 -74 -94 -111 -52 58 74 85 18 -45 -36 -39 -7 43 39 -8 -9 0 34
3267 34 60 90 36 -8 -95 -82 -71 0 72 87 57 33 -58 -94 -35 -5 8 -36 -46 -54 -14 39 64 45 24 -57 -104 -122 -50 57
3297 57 58 80 44 -26 -31 -32 2 -3 11 -20 -43 -8 23 79 90 65 1 -59 -85 -75 1 45 39 52 -2 -3 -23 -22 16 3 -63 -82 -73 -57
3331 -57 43 95 70 21 -36 -76 -114 -48 7 16 40 26 -16 -4 56 49 20 -13 -43 -69 -40 0 57 119 96 43 -11 -82 -54 -14 23
3362 23 10 33 -30 -37 -39 46 44 15 -54 -143 -106 -71 -25 47 107 47 -22 -45 -86 -15 38 16 -15 -30 -41 16 46 58 86 29 -42 -110
3394 -110 -66 -45 36 93 117 8 -9 -20 -15 -24 -1 -12 -36 -31 -20 -15 54 60 77 -25 -86 -114 -95 -16 34 76 13 7 -30 -41 -12 11
$$ packed form
3169D8j3m6q0JL2Q0M8J7j2n4m0l0J6L7L1j7n6J7nP5N1l1o9n2q6K3Q9N8M9j4o9
3200bl4lJ3K4m3K1k3l5J4O8O5K8k0q9n7l2L8P7O0J4k2l1k2pPLJ9l2n0j6M0O0N3
3233H6pj9q3o3j9M4O1K0K3o5J1qJ7M0Mn3o3k0j7N9J10J6J1o7o3RlL2N0mm7jRL4
3267C4K6L0n4m4q7J3J1P1P2J5l0k4r1l6N9L0J3m4j0qM0N3K5j9k1q1m7j8P2J07
3297E7JK2l6p0njL4nJ4l1k3L5L1N6J1k5o4o0k6J0P6M4oJ3n4jk0JL8j3o6j9RJ6
3331e7J00N2k5m9n7m0l8O6N5RK4j4m2J2O0pk9l3l0k6K9M0N7O2k3n3n4p1K8M0L7
3362B3j3K3o3pkQ5kk9o9q9L7L5M6P2O0o0o9k3m1P1N3k2l1j5j1N7L0J2K8n7p1o8
3394a10M4K1Q1N7K4j09j7j1NrK3j1k4NJ1NO9OJ7j02o1k8J9P9N0M2o3ol7j1K9K3
$$ plain form
3426 11 10 -1 -70 -59 -2 36 104 120 52 -69 -60 -66 -33 13 28 36 20 2 -10 -5 21 38 -24 -71 -92 -76 -30 61 61 50 25 -45 -106
3459 -106 -66 -43 13 1 4 -47 -52 8 25 83 28 -41 -96 -64 -45 20 89 99 97 33 -16 -38 -49 6 22 -15 -20 -14 4 36 57 71
3491 71 33 -51 -68 -97 -45 21 59 56 39 -6 -62 -79 -3 -18 -24 -17 -60 -34 33 77 78 52 21 -68 -82 -29 0 61 77 44 25 -38
3523 -38 -13 39 31 10 -40 -61 -39 -5 46 86 99 -1 -48 -76 -105 -63 -3 56 46 -27 -20 -26 5 26 40 -12 -55 -58 -45 -11 99
3554 99 155 76 33 -43 -48 -67 -19 45 30 16 23 -5 24 58 76 3 -53 -76 -68 -47 36 64 66 30 -47 -51 -63 -9 -22 17 -11 -37 -20
3587 -20 0 22 64 40 20 -49 -100 -94 -23 49 88 84 52 6 -19 -32 8 16 40 -47 -46 -1 23 73 82 84 -9 -76 -86 -53 40 32 61 48
3621 48 23 -42 -45 -15 9 11 -2 -55 -51 -2 35 26 75 55 -33 -81 -77 -28 26 29 74 28 -3 5 0 47 27 -11 -47 -50 -24 36 85 78 74 5
3657 5 -46 -68 -74 -24 23 12 21 -11 27 -28 23 46 7 -47 -71 -50 -44 13 68 84 13 -3 -38 -44 -1 -7 8 11 -1 16 0 23 64 59
$$ packed form
3426A1jj1o9J1N7L8O8J6o8j21RoL3M6J5Qj6j8j2NK6J7o2m7k1J6M6R1%j1k5p0o1
3459a06M0K3N6j2Ln1nO0J7N8n5o9n5L2J9O5O9J0ko4m9k2j1N5J6l7nOJ8L2K1J4
3491G1l8q4j7k9N2O6L8lj7m5n6j7P6j5oPm3K6O7M4Jk6l1q9j4N3K9O1J6l3j9o3
3523c8K5N2qk1n0k1K2L4N1M0J3j00m7k8k9M2O0N9j0p3PoL1K1J4n2m3lJ3L4J10
3554I9N6p9m3p6nj9M8O4j5j4Pk8K9L4J8p3n6k3QK1Q3K8Kl6p7mj2N4j3L9k8k6J7
3587b0K0K2M2k4k0o9n1OP1P2L9ml2m6k5j3M0QK4q7JM5K4N0RKr3o7j0L3R3qK9j3
3621D8k5o5lL0K4Kj3n3MM9L7rM9k0q8m8MM9N4LM5m6l1QnM7k0l8l6lK6O0M9pmo9
3657En1k2oN0M7j1Rl2L8n5N1K3l9n4k4K1ON7N5J6p1j6l5oM3oJ5Lj2J7j6K3M1n
$$ plain form
3691 59 49 -41 -63 -33 -30 25 78 90 46 -14 -46 -21 -21 -9 20 -8 -49 -35 7 33 69 42 -38 -59 -78 -59 -6 50 58 58 -3 -43
3723 -43 -22 -36 11 11 7 -37 -31 -4 42 80 93 36 -26 -65 -60 -20 11 51 61 22 10 -15 -11 0 5 -21 -92 -74 -49 6 -4 46 25
3756 25 -31 -24 -101 -65 2 33 54 9 1 -12 -11 7 16 26 -24 -24 -57 -14 39 33 73 27 -14 -37 -65 -8 1 6 21 -19 -28 1 -17 27 -1
3791 -1 -19 -68 -78 -91 -37 -3 39 45 -1 -14 -54 -12 -24 20 21 0 -27 -9 30 45 72 10 5 -74 -75 -34 -7 65 62 26 -11 -6 -17 13
3825 13 10 -12 -20 -31 -48 -32 30 10 22 22 -26 -81 -61 -57 9 44 34 29 -12 -18 19 10 15 7 -25 -56 -22 0 41 57 50 5 -40 -49 -32 -13
3861 -13 26 19 12 -4 0 1 21 31 -21 -14 -57 -57 -54 5 4 39 19 -22 -61 -74 -48 5 5 8 -23 -24 -6 17 27 26 24 -22 -48 -44 6 50 41 78
3899 78 43 12 -22 -25 15 5 -7 -7 6 15 10 16 83 21 -32 -44 -74 -37 -4 60 49 26 -1 -23 -16 -15 -3 19 -13 -70 -58 -24 39 75
3933 75 38 24 -64 -43 -50 -26 13 49 54 54 17 -16 -17 9 20 -6 -34 -24 -32 -14 58 92 34 -11 -60 -48 -69 -19 2 -18 18 -10 -2
$$ packed form
3691E9j0r0k2L0LN5N3J2m4o0l2K5%J2K9k8m1J4M2K6L6k7q0k1j9J9N3N6Q%o1m0
3723d3K1j4M7%mm4OK7M6L8J3n7o2l9NM0L1M0J0l9j2k5MJ1Nk6p1J8K5N5j0N0k1
3756B5n6Pp7L6O7L1K1m5qj3JJ8RJ0n0%l3M3N3oM0m6m1k3k8N7RNJ5m0rK9j8M4k8
3791aj8m9j0j3N4L4M2Om6j3m0M2j2M4Jk1k7J8L9J5K7o2np9jM1K7P2ll6l7Nj1L0
3825A3lk2qj1j7J6O2k0J2%m8n5K0MO6L5j0nm1oL7rNql2l1L4K2M1J6pm5m5rJ7J9
3861a3L9ppj6MJK0J0n2Pm3%LN9jL5k0m1l9j3K6N3%Ll1jJ8K3J0jkm6k6MN0M4rL7
3899G8l5l1l4lM0j0j2%J3RnOO7o2n3j2l0L7L3O4j1k3k7k2PJJ2K2l2n7J2L4O3L6
3933G5l7j4q8K1pK4L9L6N%l7l3jK6J1k6k8J0qJ8P2L4n8m5m9J2k1N0K1k0L6k8Q
$$ plain form
3966 -2 -27 9 31 14 -18 -32 -60 -30 -14 64 60 52 -9 -50 -37 -27 23 1 21 -6 -9 18 17 20 -6 -3 -39 -44 -36 7 20 34 64 0 4
4001 4 -59 -36 -3 -4 4 -22 -29 -18 6 45 17 49 -33 -61 -70 -31 6 51 18 41 36 -28 -7 -9 4 -6 8 -37 -4 8 14 55 42 -1
4035 -1 -30 -42 -65 -59 9 34 28 8 -34 -16 -20 33 19 -25 -28 -55 -26 3 42 63 38 -27 -33 -51 -47 9 25 44 41 -2 18 -1 9 -5
4069 -5 6 19 -33 -21 21 45 61 74 6 0 -39 -48 -17 14 19 9 -22 -22 8 3 18 -28 -16 -71 -69 -20 3 77 31 30 19 -21 -33 -50
4103 -50 2 18 24 -18 -6 14 29 25 50 40 1 -36 -39 -18 31 46 50 40 9 -37 -55 -17 11 2 -15 -32 -27 -48 32 -1 45 15 -47
4136 -47 -74 -52 -35 21 43 22 5 3 4 -9 33 9 13 -10 -17 -17 38 40 72 50 18 -35 -49 -25 -5 47 34 21 11 -9 11 17 5 -4
4170 -4 0 -37 -16 -29 16 40 29 15 -18 -30 -43 6 -5 48 10 17 6 -10 23 34 47 -17 -17 -35 -20 14 63 71 37 14 -20 -19 -31
4203 -31 21 46 -14 -14 0 12 19 12 18 -10 -17 -46 -73 -17 4 18 25 20 20 -22 -42 -36 -20 6 9 3 -15 26 52 38 41 42 -16 -39 -21 -11 48
$$ packed form
3966bk5L6K2j7l2j4k8L0J6P8mqo1m1J3J0N0k2K0k7lK7jLk6Ll6nQM3J3J4L0o4M
4001Do3K3L3jQk6pJ1K4L9k8L2q2k8rL9L7M5l3K3no4K1kJ3j0J4m5L3J2OM1j3m3
4035ak9j2k3OO8K5ok0m2J8mN3j4m4lk7K9K9L9K1k5o5oj8MN6J6J9lm3K0j9J0j4
4069eJ1J3n2J2M2K4J6J3o8ol9rL1L1Nj0l1%L0nJ5m6J2n5KM9K3P4m6jj1m0j2j7
4103e0N2J6Om2J2K0J5mK5j0l9l7lK1M9J5Mj0l1m6j8L8K8rj7j7Nk1Q0l3M6l0o2
4136d7k7K2J7N6K2k1j7kJj3M2k4Mk3p%N5KL2k2l2n3j4K4K0N2j3j3j0k0K0Oj2r
4170dMl7K1j3M5K4j1j4l3j2j3M9j1N3l8Pj1j6L3J1J3o4%j8J5L4M9Ql4k3l4Jj2
4203c1N2K5o0%J4J2PpOk8pk9k7N6K1J4Pn%m2k0OJ6K6Loj8M1K6j4LJn8k3J8J0N9
$$ plain form
4240 48 68 45 0 23 -5 -19 3 41 19 -13 -52 -8 18 14 35 6 -20 -47 -68 -50 -17 18 1 17 -8 -7 -29 -4 -23 10 -49
4271 -49 -19 -14 -3 24 27 28 26 25 -11 -15 -6 9 14 6 32 -3 10 17 28 18 11 -7 -20 -10 2 45 34 53 -24 -57 -48 -34 -34 31 5 -16 -29
4308 -29 -7 1 39 38 12 -17 -38 -31 -2 23 73 83 44 1 5 5 0 -51 21 13 1 -20 10 17 22 27 19 -26 -46 -39 -21 6 24 38 -6 -21
4344 -21 -22 -19 -21 5 3 -17 -43 -11 26 24 37 13 13 -41 -2 -12 -17 36 60 27 36 40 -2 23 36 55 13 -29 -13 10 16 40 52 27 -1
4379 -1 -37 -52 -35 -4 14 14 12 -27 -4 -16 25 -8 -8 -11 -44 -14 8 58 38 13 27 -39 -53 -22 -28 21 22 10 14 13 9 19 23 1 -23 -1
4415 -1 -20 -10 9 40 45 17 -2 -21 -14 -13 -28 13 5 -3 -21 -3 47 16 52 19 -31 -41 -41 -2 29 52 45 7 23 -32 -20 6 -4 15
4449 15 3 -53 37 36 44 41 14 -11 -16 -29 -21 -24 16 37 6 -35 -17 -14 3 7 -15 -56 -31 -51 -23 21 32 20 28 -35 -26 -45 -24 43 49 54
4485 54 14 32 -4 41 8 40 29 -10 -22 -3 35 36 59 42 21 -7 -69 -37 -22 -6 -2 9 1 4 1 0 -4 -17 -23 -45 -42 -11 7 47 18
$$ packed form
4240D8K0k3m5K3k8j4K2L8k2l2l9M4K6mK1k9k6k7k1J8L3L5j7J6k5Jk2K5j9L3n9
4271d9L0NJ1K7LJkjl6mRJ5NqK6l5J3PJ1j0pj8j3J0J2M3j1J9p7l3RJ4%O5k6k1j3
4308b9K2QL8jk6k9k1PK9K5N0J0l9m3M%nn1P2qj2k1L0PNNqm5k0PJ8K7J8J4m4j5
4344b1jLkK6kk0k6L2L7kJ3k4%n4L9j0nN3K4l3RMm2K5J3J9m2m2J6K3OK4J2k5k8
4379al6j5J7L1J8%kl9K3j2M1l3%ll3L0K2N0k0k5J4o6j4L1oM9Jj2MjmJ0Mk2k4K2
4415aj9J0J9L1Nk8j9j9PJj5M1qqj8J8N0l1L6l3n0j0%L9L1K3pl8J6n5J2K6j0J9
4449A5j2n6R0jQlk7k5nj3QlM0K1l1m1J8LJ7Mk2m1K5k0K8M4J1j2Qo3Rj9K1O7ON
4485E4m0J8l6M5l3L2j1l9j2J9L8JK3j7k1k8o2L2J5J6MJ1qLljmj3ok2LL1J8M0k9
$$ plain form
4520 18 18 29 -28 -16 2 35 -7 11 42 22 -26 53 31 33 1 -3 -32 -46 -21 29 67 35 13 -9 5 -24 6 23 8 -25 -17 2
4552 2 2 21 38 14 -15 -72 -23 -7 -7 10 2 -14 9 12 24 -1 9 27 -17 -23 -10 0 16 45 21 27 -2 -5 -4 19 25 19 3 36 5 -10
4588 -10 -1 -11 17 11 -52 -30 -29 -15 15 27 29 5 -29 -46 -32 -23 19 34 9 -7 -11 17 34 21 9 6 -34 -43 -23 28 82 43 17 24 -49
4623 -49 -1 -22 21 -7 -16 -15 14 -3 0 15 7 5 -21 -69 -42 -16 17 -18 14 10 -29 -40 -37 -6 -2 1 -19 6 -24 11 17 39 54 -1 -26
4658 -26 -17 -12 -20 33 6 22 1 18 17 7 32 6 26 -28 -16 18 0 24 34 -11 -22 -54 -48 -35 -4 9 0 -4 -8 -1 -21 -11 28 -24 -17
4693 -17 2 10 -9 13 46 21 -1 -38 -21 -34 12 27 25 52 -13 11 15 37 36 -16 -13 -24 -43 8 6 53 7 1 -19 -10 -41 -47 1 7 -12
4728 -12 -30 -2 23 29 44 30 -4 20 -44 -18 22 11 48 32 4 8 -12 -8 23 16 -18 25 -21 5 14 39 58 1 22 -51 -29 -20 -5
4761 -5 16 28 -40 2 -9 -17 -18 -19 -25 -22 -35 -53 8 -7 47 28 -1 -39 -14 -4 0 15 50 31 15 3 -7 -19 27 9 4 -9 17 -18
$$ packed form
4520A8%J1n7J2J8L3m2J8L1k0m8P9k2Kl2mk9j4K5N0L8l2k2k2J4k9L0J7j5l3QJ9
4552B%J9J7k4k9n7M9J6%J7qj6K3LJ2k5J0J8m4oJ3J0J6K9k4Ok9lJK3Ooj6L3l1j5
4588a0Rj0K8oo3K2JJ4L0J2Kk4l4j7J4RM2J5k5j6mK8J7j3j2lm0rK0N1N4l9k6Pp3
4623d9M8k1M3k8rJK9j7LJ5qkk6m8K7K6L3l5L2ml9j1LL1MLk0K5l0L5OK2J5n5k5
4658b6RNqN3k7J6k1J7jj0K5k6K0n4J2L4j8K4J0m5j1l2OJ3L1J3rmmPk0J0L9n2P
4693a7J9Qj9K2L3k5k2l7J7j3M6J5kK7o5K4MK2jn2Lj1j9N1kM7m6ok0Rl1oM8Oj9
4728a2j8K8K5OJ5j4l4K4o4K6M0j1L7j6k8Mk0ML1pl4M3m6K6RK5J9n7K1p3K2RJ5
4761eK1J2o8M2j1qjjoLj3j8O1j5N4j9k9l8K5J0MJ5L5j9j6j2j0j2M6j8nj3K6l5
$$ plain form
4795 -18 13 10 62 67 13 -21 -39 -5 -8 -1 -4 19 -2 -26 -4 -9 2 21 -34 -31 -53 -18 29 66 69 7 -34 -15 -53 30 -9 21 33 37 -17
4830 -17 48 37 44 40 1 -26 -37 -30 -16 10 20 13 40 -37 -10 -20 -19 -9 -3 -14 -32 -8 -10 49 43 2 -7 -53 -66 -58 -8 20 37 38 23 -4
4866 -4 6 -5 18 49 8 3 6 19 42 39 49 35 -11 -37 1 1 58 14 2 -23 -12 -6 -12 5 -3 -14 -55 -47 -37 -25 22 18 46 21 -40
4901 -40 -37 -8 -8 9 16 7 26 -19 33 35 36 7 35 -12 -11 -2 41 19 16 21 -7 6 -27 -4 0 -20 -4 -26 -17 -19 -7 5 -2 -34 -41 -54 -23 3
4939 3 7 16 36 15 -1 -10 -29 -2 6 -8 21 13 8 22 40 48 38 0 -2 -3 -12 31 45 40 39 41 12 -17 19 -25 -10 -27 -26 -35 -21 -1 0 20 -11
4978 -11 -31 -27 -39 0 5 -7 28 17 10 32 -8 22 7 -20 4 -14 -15 18 69 56 49 3 -8 -27 0 13 25 10 28 20 13 8 26 13
5012 13 -25 -36 -37 -19 1 -2 15 7 -30 -41 -57 -20 -52 -17 11 -9 -13 -24 9 34 46 39 5 -13 -35 -51 9 39 53 58 20 4 10 -16
5046 -16 9 13 23 -10 -17 -23 7 10 23 10 -38 -49 -55 8 10 5 6 -18 -13 -22 -8 -19 -7 -16 -15 -9 -10 -13 11 58 21 -28 4 -19 -34 -9 17 44
$$ packed form
4795a8L1lN2Nn4l4j8L4lPlK3k1k4K2nJ1J9n5Lk2L5M7L7Lo2m1J9l8Q3l9L0J2Mn4
4830a7O5j1Pml9k7j1PJ4K6J0pK7p7K7j0JJ0Oj1j8K4kN9om1rm6j3QN0K8J7Jj5k7
4866dJ0j1K3L1m1nLJ3K3lJ0j4m6k6L8%N7m4j2k5J1OoJ7qj1m1QJ0J2M7mK8k5o1
4901d0LK9%J7PrJ9m5N2KJk9K8m7JRM3k2lNk8J3l3K3Mk0J6k2RkJ2J2pl2pj3L1K6
4939CMRK0k1j6rj9K7Qj4K9qnJ4J8Qj0l8kjrM3J4njKk9k9L6m4J5j7JrJ4K0JK0l1
4978a1k0Mj2L9Nj2L5j1pK2m0L0j5k7K4j8jL3N1j3pm6j1j9K7J3J2j5J8qpnJ8j3
5012A3l8j1jJ8K0lJ7ql7j1j6L7l2L5K8k0mj1L3K5J2pl4j8k2j6O0L0J4Nl8j6Ok6
5046a6K5MJ0l3poL0LJ3j3m8j1oO3KnJk4NrJ4j1J2rJOjlK4M7l7m9L2k3j5K5K6K7
$$ plain form
5084 44 30 26 27 -5 -26 1 -6 18 10 -22 -12 12 -2 29 29 -16 -3 -40 -33 -3 -5 30 9 -15 -21 13 -6 21 17 -18 -26 -16 -42 5 59
5119 59 69 28 -4 -26 -11 8 2 2 17 16 -1 12 36 35 35 -25 -56 -64 -32 -29 23 20 -8 -12 -43 -46 -40 -50 -37 -25 -31 -5 14 37 20 11 6
5156 6 -16 -35 -25 11 14 48 5 31 38 -3 9 5 21 9 -3 -9 16 24 25 58 23 -10 -26 -29 -35 -29 16 -14 29 4 -5 -6 -1 -36 11 13 -33
5193 -33 -23 -21 -7 25 25 32 5 -43 -24 -20 0 24 29 7 25 -2 -16 26 34 22 18 -31 -29 -22 -4 7 45 12 -12 -31 -42 -26 -14 -2 17
5228 17 -6 -11 2 31 -15 6 -4 -18 -48 -26 -14 23 25 8 5 -2 -6 -29 10 3 19 35 19 19 -19 35 -1 29 -18 -46 -33 -27 23 15 28
5263 28 -13 -16 -3 -12 -3 -16 -25 -3 -30 -13 14 2 14 8 2 -48 -43 -56 -34 10 20 20 25 24 -5 -13 5 28 -24 0 -5 -15 50 53 35 32 -10
5300 -10 0 -50 -14 28 13 23 0 -40 -6 -3 6 -20 -27 -20 -32 -33 -31 -15 21 26 -24 -8 -21 -26 -10 28 -3 6 8 4 -3 48 29 13 18 -13 -42
5337 -42 -14 -7 -1 24 34 -16 5 -8 -27 6 -9 18 -2 -27 -6 19 11 -16 -28 -14 -52 -67 -47 -25 13 36 -11 -23 -18 -25 -50 -17 -22
$$ packed form
5084D4j4mJl2k1K7pK4ql2J0K4j4L1%m5J3l7PL0kL5k1k4oL4j9K7ml5qJ0k6M7N4
5119E9J0m1l2k2J5J9o%J5jj7J3K4j%o0l1qL2LN2lk8ml1lOj0J3J2oK6J9K3j7rn
5156Fk2j9J0L6LL4m3K6Pm1J2mJ6j2j2oK5QJL3l5l3j6loOM5l0M3k5rjNl5M7Km6
5193c3J0KJ4L2%Pk7m8J9MK0K4Nk2J8k7j4M2Qj2mm9KPJ8J1L8l3k4j9j1J6J2J2J9
5228A7k3nJ3K9m6K1j0j4l0K2J2L7Kj7lpmk3L9pJ6J6j6%l8N4l6L0m7k8J3ON0qJ3
5263B8m1lJ3rRj3rK2k7J7K7j2J2oon0Nj3K2M4J0%Njk9qJ8K3n2K4nj0O5Lj8lm2
5300a0J0n0L6M2j5J0k3m0L4LRk6pPj2jKJ6L6Nn0J6j3nJ6L8l1RKmpN1j9j6Nl1k9
5337d2K8POK5J0n0K1j3j9L3j5K7k0k5K1K5qk7j2J4l8j5K0K2L8K3m7j2Npk5L3n
$$ plain form
5370 -22 -26 -2 -13 2 47 21 23 1 -10 -8 -31 2 34 23 43 27 -36 11 7 17 -9 -22 -51 -64 17 10 10 24 -12 -16 -38 -62 -12 -13
5404 -13 18 0 -5 2 -10 -20 16 0 -18 -16 -10 -35 12 19 58 26 11 -12 -18 -21 3 0 61 30 2 3 22 -2 17 12 -19 -27 -54 -25 -23 24
5440 24 29 21 -35 -36 -32 -14 0 14 12 14 -5 30 25 23 14 19 3 -45 -16 7 32 16 53 30 23 6 -14 17 2 15 10 24 1 -19 38 41 4
5477 4 -8 -36 -33 6 -44 -13 -2 11 -14 -2 -36 -11 -4 -20 -25 -21 -6 13 -3 7 31 -12 8 -18 -33 2 7 -1 46 43 33 -1 -16 6
5511 6 45 -13 -13 -19 -55 -4 44 42 -5 2 -6 -43 -23 -18 -7 19 -12 -20 -42 -7 -12 -5 10 -3 -36 -16 -25 17 30 60 39 31 -4 17 3 30
5547 30 31 21 -2 29 25 19 35 5 5 -6 -25 -20 -14 4 22 33 25 -4 -3 -56 -49 -4 -10 -20 -25 -22 -8 3 42 33 12 -45 -23 -24 -8 35 50
5584 50 44 5 -8 -10 -31 12 19 38 14 -27 -16 34 11 54 26 6 -35 -63 -27 25 5 14 6 -2 -24 -29 3 -10 -28 -28 -30 -50 -24 14 41
5619 41 4 0 -6 -17 -20 -15 13 46 43 5 -1 -2 8 26 38 -7 -27 -12 6 8 37 64 25 -4 -43 -37 -10 -25 -3 7 17 -18 19 3 -2
$$ packed form
5370b2mK4j1J5M5k6Kk2j1Kk3L3L2j1K0j6o3M7mJ0k6j3k9j3Q1p%J4l6mk2k4N0j
5404a3L1j8nPj2j0L6j6j8KOk5M7PL9l2j5k3olK4lO1l1k8JJ9k4J9nl1qk7K9KM7
5440B4Nqn6jMJ8J4J4kKj9L5nkrNj6m8K9K3K5j6L7k3pj7k0L1j5J3nJ4k3k0N7Ll7
5477Dj2k8LL9n0L1J1J3k5J2l4K5Pj6nMJ5J9j6J0K4m3K0k6j5L5NqM7lj0l4j5K2
5511FL9n8%ol6N1M8km7Pql7K0NJ1K6l1qk2L5nPJ5j3l3K0rM2J3L0k1ql5K1j4K7
5547C0Jj0k3L1moJ6l0%j1j9NOJ8J8J1qk9Jn3PM5oj0nLJ4J1L9rk1n7K2jJ6M3J5
5584E0ol9j3kk1M3PJ9k4m1J1N0k3M3k8k0m1k8L6N2k0Rqqk2nL2j3j8%kk0K6L8K7
5619D1l7moj1lNK8L3ll8ojJ0J8J2m5k0J5J8KK9K7l9k9l9OK7j5K2J0J0l5L7j6n
$$ plain form
5654 -2 -8 -16 -21 -50 -39 -11 5 66 -2 22 -5 -31 3 4 1 -3 3 3 -14 14 55 29 27 -5 -14 -35 11 17 -2 47 46 50 -22 -26 -18 3 9 -2 10
5693 10 -29 -7 7 10 15 23 -4 -23 -17 -27 2 7 35 50 9 23 -20 -4 40 30 -1 0 1 17 33 36 31 29 37 -19 1 -25 -40 27 14 12
5729 12 -27 5 13 -6 -17 -23 -30 -52 -17 6 23 24 2 23 0 -32 -38 -23 -34 -2 19 8 2 31 49 15 -12 9 -19 -19 17 8 52 50 8
5764 8 9 9 2 0 -9 8 -34 -27 -9 16 12 -2 -13 -33 -34 -27 -31 -13 6 50 28 2 1 -37 -6 -5 25 -4 9 27 2 11 40 61 22 17 0 -20
5802 -20 13 16 -16 38 55 41 21 7 -20 -21 -8 12 -40 -18 -43 6 22 9 7 -14 -25 -31 -31 16 0 26 -7 -3 24 8 26 21 14 -25
5836 -25 -15 5 4 34 28 64 -8 -8 -2 -23 25 -11 28 49 3 24 16 21 -26 -16 -37 -35 -25 -9 3 22 21 12 -14 -36 -62 2 -4 7 12 -14
5872 -14 0 33 27 24 37 -13 5 -24 -8 4 36 34 66 5 -6 4 14 0 7 37 3 9 3 11 43 18 48 -7 -9 -56 -23 13 0 13
5906 13 6 -16 -26 -27 -29 -23 -29 -16 -3 -31 15 9 19 30 15 -10 -27 -23 9 -3 34 57 30 22 13 13 -20 31 -16 -37 0 -25 11 29 29 17
$$ packed form
5654boqnk9J1K8J6O1o8K4k7k6L4JlmO%j7K8M1k6kl2rk1M6Oj9M9jMp2mQK1Oj1J2
5693A0l9K2J4LNQk7j9Oj0K9NK8J5m1J4m3J6M4j0l1JJJ6J6LnkQn6K0k6j5O7j3k
5729A2l9L2Qj9j1opk2L5K3J7Jk2K1k3l2oJ5j1L2K1j1oK9J8l4k7K1k8%L6rM4km2
5764HJ%pkrJ7m2PJ8K5mj4j1k0jPmJ8J9M4k2k6jl8L1JL0k9J3J8k5RK9K1l9nj7k0
5802b0L3Ll2N4J7j4k0j4k7jJ3K0n2K2k5M9J6j3kk1j1o%M7j6K6l3MK7j6J8npl9
5836b5J0K0jL0oL6p2%Ok1M8l6L9K1m6K1qNm7J0k1KJ0J6J2J9jrk6k2k6O4oJ1Nk6
5872a4J4L3olJ3n0J8k9J6J2L2kL2o1j1J0J0j4PL0l4OoQL2k5L0n5km7L3L6j3J3
5906A3pk2j0jkOoJ3J3k8M6oJ0J1j5k5j7ML2j2L7K3k7qr%l3N1m7k1L7k5L6J8%j2
$$ plain form
5942 17 11 -12 -28 -47 4 -13 -6 3 -10 -4 4 11 4 -14 -10 -30 -24 -6 38 35 25 18 15 -13 -11 -11 -3 12 2 29 19 13 13 28 39 11 5 -36 -63
5981 -63 -1 6 21 22 35 -8 -5 -42 -16 -19 -11 10 -14 -33 -12 34 42 12 -17 -45 -30 7 10 40 27 29 -24 -16 -8 16 13 -5 34 -1 22 12
6017 12 31 31 30 15 -27 -30 -33 -8 3 17 19 14 -24 -32 -6 28 -12 -20 -33 -1 -10 12 36 18 7 -10 -8 -57 -14 -8 22 43 17 28 6 2
6053 2 30 27 12 16 -27 8 3 11 7 29 17 -31 -30 -42 -10 9 -6 35 23 -2 -8 -16 -7 -15 -35 -63 -44 -28 -4 7 3 16 24 -3 -2 -2 -7 -10 17
6092 17 -1 9 32 26 47 44 33 -4 -37 -10 -4 2 26 39 37 -19 -2 -54 -9 21 -12 -18 -38 -8 -10 -27 -8 -11 -1 -7 -46 -10 -8 -5 29 19
6128 19 -17 11 -1 14 41 -5 20 -5 3 -2 56 14 -3 6 19 22 2 -20 5 22 33 4 30 -11 11 20 -4 -8 -32 -41 -6 -22 -19 27
6162 27 -18 -24 -4 -27 -24 -15 9 34 15 -43 10 -15 29 40 21 12 -4 -5 -4 18 28 41 21 30 29 18 -14 -16 -20 -12 -15 -13 6 1 20 15 32 -38
6200 -38 -39 -35 -3 36 15 31 28 -14 6 -1 -15 -48 -24 16 -22 9 12 21 34 8 10 3 -4 -27 20 58 32 38 24 32 -2 0 36 -11 -9 -12 -4 -14
$$ packed form
5942A7ok3j6j9N1j7PRj3OQPpj8Mk0OJ8M4lj0plk8K%QJ5j0K7j0o%J5J1k8om1k7
5981f3O2PJ5JJ3m3Ll7K6lQK1k4j9K1M6Ql0k9k8J5L7LL0j3Kn3QQK4lj8L9l5K3j0
6017A2J9%jj5m2llK5J1J4Knl8qK6L4m0qj3L2rK2K4j8j1j7Km9M3OL0K1k6J1k2m
6053BK8lj5Mm3L5nQmK2j2m8Jj2L2J9j5M1j2k5oqRqk0k8J9J6K4J1mJ3Qk7J%nlK7
6092A7j8J0K3oK1lj1l7l3K7OOK4J3kn6J7n2M5L0l3ok0L0kj7J9lJ0ol9L6KLL4j0
6128A9l6K8j2J5K7m6K5k5QnN8m2j7RJ3Lk0k2K5J7J1k9K6m1K2Rk4mk4rL5j6LM6
6162B7m5oK0k3LRK4K5j9n8N3k5M4J1j9rj6jJK2J0J3k0Rjj1l2kmQlKJ9nJ9nJ7p0
6200c8jML2L9k1J6lm2K0pj4l3K4M0l8L1LRJ3k6Kppk3M7L8k6Oj4Ql4KL6m7KlQj0
$$ plain form
6238 -14 -5 26 -6 6 -8 -26 -72 -37 12 -10 11 36 -32 -7 -29 10 12 3 -9 -1 -19 14 27 49 10 -15 8 -17 -30 3 -5 18 6
6271 6 -2 8 -12 -1 17 -8 -58 -17 -48 -6 -15 6 11 37 -14 -42 -19 -31 -32 8 -3 10 2 0 19 32 12 18 -9 -23 -11 13 36 33 25
6306 25 34 12 9 4 9 27 12 20 4 33 -1 8 27 30 1 -11 -37 -52 -26 -10 9 6 -8 -18 10 -23 11 2 -13 -34 -14 24 10 18 38
6341 38 38 8 -2 -3 -8 31 45 32 34 14 19 -1 25 11 29 9 -14 -11 25 24 27 29 -25 25 -47 -36 -28 -15 -2 -14 -16 -18 -22 -33 -12 -16 -18 5
6379 5 -8 -62 -6 8 48 21 7 15 -11 -13 -15 -6 16 14 13 -5 40 21 34 11 13 -29 -13 -3 -27 13 28 18 -25 -38 -33 -48 -2 -28 -24
6414 -24 -57 -25 19 0 13 -14 -3 -31 -8 -5 -19 36 -3 -18 25 1 15 29 31 34 5 21 -6 -25 27 34 26 -4 18 17 -42 -23 9
6447 9 5 15 7 -12 7 -31 2 -4 15 -36 -31 -22 -10 -7 7 34 33 22 2 -33 6 -22 25 21 31 18 -8 36 -7 4 1 -8 -23 0 20 10
6483 10 51 20 15 -17 -32 -19 -12 23 20 1 -25 -38 1 9 16 0 -12 -3 -18 -33 14 12 22 -4 13 8 -17 9 -22 32 -5 1 29 19 47
$$ packed form
6238a4RL1l2J2j4j8m6L5M9k2K1K5o8K5k2L9Krj2Qj8L3J3K2l9k5K3k5j3L3qK3j2
6271FqJ0k0J1J8k5n0M1l1M2rK1NK6n1k8K3j2jM0j1J3qkJ9J3k0Ok7j4J2K4K3lq
6306B5Rk2lnNJ8j5Qj6K9l4RJ9Lk9j2k6j5K6J6J9lj4j0K8l3L4rj5k1K0L8j4QK0
6341C8%l0j0jnL9J4j3Kk0Nk0K6j4J8k0k3LL6jLKn4N0p2J1QJ3J3j2kkmj1K1mkK3
6379Ej3n4N6J4M0k7j4Qk6kkRK2kjj8M5j9J3k3Km2J6J0k4M0J5j0m3j3Nj5M6k6M
6414b4l3L2M4j9J3k7J1k8K3Lj4N5l9j5M3k4J4J4KLk9J6k7j9N2Pql0K2jn9J9L2
6447ImJ0qj9J9l8L3oJ9n1NRJ2LJ4K7jj1k0l5L9k8M7mJ0j3k6M4m3J1lrj5K3K0j0
6483A0M1l1nl2j5J3PL5lj9k6j3L9QPj6j2Rj5j5M7kJ0k6J7nk5K6l1N4l7OK8j0K8
$$ plain form
6518 47 51 22 45 -13 -1 -43 16 15 31 41 1 -30 -20 9 11 -25 -23 -30 15 -31 -15 1 2 -7 -24 -41 -63 -4 0 6 -26 -25 17 12 2 10
6554 10 14 16 -1 -6 32 12 5 37 53 21 22 -29 9 14 7 6 5 7 -20 -32 3 2 -5 -10 -21 -39 -5 -8 -5 -10 4 -26 -25 -19 -14 -7 -5 -19 13 24 -11
6595 -11 5 36 19 11 16 -32 -34 0 37 21 36 31 12 -20 19 -2 -22 4 8 11 -4 8 3 1 -9 -4 -35 -47 -34 -24 -18 9 13 -11 -16 -9 -7
6632 -7 -1 1 -7 1 31 -4 0 30 18 14 3 7 20 14 24 -16 47 15 15 -1 0 12 6 29 -12 -11 -14 -32 12 33 21 -12 -48 -48 -34 -22 6 -11
6670 -11 -5 0 -5 5 56 -9 -1 10 -9 -34 -24 -8 36 30 14 17 -20 -22 19 24 43 38 27 30 2 -2 19 13 -20 18 -23 -30 -24 22 8 22 2
6707 2 -16 -10 -12 12 -3 -3 19 -1 -9 -10 0 16 32 -1 -1 28 -19 19 27 19 14 17 -25 19 2 -6 26 35 9 18 13 -1 59 1 -15 -14 -31 2
6745 2 -36 -38 -34 -5 -25 -62 -38 -37 1 17 -4 -4 -3 -13 -2 -10 11 6 19 8 10 -25 21 18 17 9 0 19 27 33 20 33 -2 20 -5 7 22 16
6783 16 21 11 3 -13 -29 -13 -5 -16 4 -7 -16 -4 7 15 0 -9 -32 -11 -55 -7 -32 12 13 -2 35 18 -32 -16 23 17 12 0 6 -4 7
$$ packed form
6518D7Mk9K3n8J2m2N9jJ6J0m0l1J0K9Kl6KpM5m6J6J6Jrj7j7k2N9MOl2JM2nj0Q
6554A0MKj7nL8k0pL2J6l2Jn1L8NpjjKk7j2L5jpnj1j8L4lLnJ4l0JONPKj4L2J1l5
6595a1J6L1j7qNm8kL4L7j6J5nj9l2L9k1k0K6MLj5J2nkj0Nl1j2J3J0OK7Mk4nPK
6632gOKqQL0l5ML0j2mj1MJ3oJ0m0O3l2%j6JJ2oK3m1Jlj8M4K1j2l3l6%J4J2K8j7
6670a1ONnJ0N1o5QJ1j9k5J0J6M4oj6Ll7kM1NJ9nj1Lk8mK1ol3L8m1pOM6j4J4k0
6707Bj8OkK4j5%K2k0qjJ0J6J6l3%K9m7L8QqnLm2M4j7qL2Rk6Rnj4O0n8j6Jj7L3
6745Bl8kMK9k0l7K4JL8J6k1%Jj0J1qK1nJ3j1Kl5M6ljqrJ9QOj3J3l5K2k5J2J5o
6783A6Nj0qj6j6J6Qj1K0j1rJ2J1Qj5rk3K1m4M8k5M4Jj5L7j7n0J6L9onj2Oj0J1
$$ plain form
6818 7 4 31 18 25 -40 3 -14 -5 -2 12 -5 -2 -26 -33 5 -11 -14 -32 -1 -2 -1 25 0 -11 -28 2 5 -20 15 31 16 11 -7 17 4 9 29
6855 29 10 -7 6 30 -2 4 30 13 6 -2 -33 -6 1 22 23 4 11 8 0 -32 -20 -21 -6 -25 -8 2 3 -3 19 -5 -2 -27 -9 -17 5 5 4 11
6893 11 6 10 -10 44 -13 46 27 -8 -7 -2 35 19 13 23 30 -7 -35 3 -14 -28 2 -18 20 -3 17 1 8 -40 -27 1 -43 -4 14 -4
6927 -4 48 19 14 -9 3 6 -3 -14 -2 13 -9 24 33 56 38 -42 -19 2 -4 5 17 2 14 13 -13 3 -1 -25 -8 -1 -6 -16 0 -16 19 6
6963 6 -5 -31 -36 -48 -15 7 9 -9 28 -4 -10 5 15 16 -23 9 10 12 41 35 10 27 27 7 0 -1 14 19 19 7 0 -6 12 -22 8 -47 23 -5
7001 -5 -26 -10 4 3 7 16 -19 -33 -22 -14 -7 -6 -5 -3 15 33 -1 18 26 13 -4 -9 -8 23 48 42 27 35 -9 -8 24 10 4 21 -30 -21 -30 19 -5
7040 -5 -12 35 -11 -58 -65 -13 -13 -10 14 -21 -18 -11 8 5 -13 2 -16 -8 -9 -2 16 9 20 33 11 2 -19 -6 45 35 51 4 -15 24 -21 -28 4
7077 4 27 -8 -5 9 6 4 -9 -24 15 -28 -18 -39 -31 -3 -11 2 -21 3 -18 10 -9 -6 -12 -15 -11 16 6 21 46 41 11 -10 0 21 25 5
$$ packed form
6818GlK7j3Po5M3j7RLJ4j7Lk4pL8j6lj8L1jJK6k5j1j7L0Lk5L5J6j5nj8K4j3NK0
6855B9j9j7J3K4l2OK6j7pql1K7PK1Jj9Plql2J2jJ5j9J7J0JoK2k4Lk5J8qK2%jP
6893A1nMk0N4n7N9j9l5JNL7j6oJ0Pl7k8L8j7j4L0k0L8k3K0j6Pm8J3K8m4L9J8j8
6927dN2k9nk3J2Lrj1J2J5k2L3RK3j8q0K3K1oRJ2j5J2jk6J6mk4J7Pnj0J6j6L5j3
6963Fj1k6nj2L3K2Kj8L7l2oJ5J0Jl9L2JKK9ok5J7%k0pjJ5N%j2poJ8l4L0n5P0k8
7001ek1J6J4jMRl5j4J1QPJJKJ8J8l4J9Qj3j7nJL1K5oj5Qm4JL2j4oJ7n1RrM9k4
7040epM7m6m7pN2%LK4l5LPJ9lj8J5j8QjPJ8pJ1J3k2rk1J3N1j0J6m7j9L9m5pL2
7077DK3l5LJ4lkj3j5L9m3J0k1QK8qJ3k3K4k1K8j9LolMK7j0J5K5nl0k1J0K1Mk0
$$ plain form
7113 5 25 -14 12 -8 4 29 -2 15 25 -45 -25 19 14 3 19 -13 10 -46 15 -27 8 -3 -31 -37 -10 8 -6 16 0 -25 0 -18
7145 -18 4 7 7 38 11 11 3 22 20 20 18 -3 -23 -11 3 10 23 17 -6 15 -35 -27 -3 15 9 6 -7 -12 -39 -20 -1 -15 -64 -31 -54 -15 -19
7182 -19 6 0 -21 2 4 0 -30 6 16 4 12 18 3 16 17 23 -1 -9 -27 -10 -6 3 5 7 -25 -31 -53 -13 -32 2 -21 12 -11 -43 -7 -16 -18 -19
7220 -19 -21 -36 -75 -9 -19 0 18 31 7 9 5 0 -15 40 25 16 -13 14 7 13 48 9 -5 -2 -33 -13 -2 -23 15 10 10 -13 -14 -16 -1 -28
7256 -28 -3 -52 -4 0 -1 -13 -3 -15 -48 -45 -34 -3 -16 37 17 12 -1 -1 -15 -4 21 9 16 4 16 8 15 7 8 12 -36 -33 -28 8 19 8 12
7293 12 19 1 26 0 -27 -3 -36 -4 -57 -7 -4 10 -17 -5 -12 -4 -1 -26 21 -13 -6 -3 7 28 11 10 12 10 -20 7 19 0 33 -10 10
7328 10 3 -27 -14 7 -14 -37 3 -21 25 -43 -7 26 11 2 6 -19 -25 4 -8 -7 3 -10 -33 0 -2 7 14 -3 9 3 -8 13 8 11 40 21
7364 21 -35 -13 17 4 23 13 15 7 4 -13 17 1 -7 -9 -39 -24 -7 -13 12 19 20 -7 -24 -45 3 -12 -6 3 -2 -10 -3 -33 -17 -6 7 -29 -15
$$ packed form
7113EK0l9K6k0J2K5l1J7J0p0K0M4nj1J6l2K3n6O1m2L5j1k8oK7J8j4K2j6k5K5j8
7145a8K2L%L1k7%qJ9k%kk1k0J2J4PJ3ok3K1n0QK4J8olj3nk7J9J9j4m9L3k3L9m
7182a9K5ok1K3Kml0L6J0j2QOj5J3JOk4qj8J7MRKKl2ok2M0j9L4k3L3k3l2L6rkj
7220a9kj5l9O6j0J9J8J3k4Kmnj5N5j5rk9K7pOL5l9j4Ll1K0J1k1L8n%k3jkJ5k7
7256b8K5m9M8Mjj2J0j2l3LJ1L1j3N3k0nj3%j4J1K5j2Pj2J2qPqJMm8LNL6J1j1M
7293A2Pj8K5k6k7K4l3L2n3N0LJ4k7J2pQLk5M7l4PLJ0K1j7jKkl0K7J2j9L3m3K0
7328A0pl0J3K1k1k3M0k4M6o8L6L3j5rMk5oK9j2JJ0j3k3L3kRPj7J2oj1K1nLK9j9
7364B1n6K2L0j3J9j0Kqlj7L0j6qkl0J5J7oK5PJk7j7k1M8j5ORnqPl0J6J1J3l6J4
$$ plain form
7401 -15 0 1 42 37 -3 8 -27 -5 17 4 31 -8 18 1 15 19 14 -1 -33 -26 -17 -27 -24 2 11 -11 10 25 -34 -5 -25 -27 -7 -11 20
7436 20 10 11 10 17 -16 27 -15 8 -12 10 7 17 25 14 16 7 5 0 -35 7 -7 -16 -5 16 -11 -37 -2 -10 -38 -43 -26 -19 21 -18 -19 -20 -44 -34
7474 -34 -27 -4 6 2 -11 -26 -34 12 -29 21 44 3 4 4 -9 7 15 26 31 -28 3 -23 8 -17 6 -10 -6 9 13 -15 2 15 -2 -9 -16 -32
7510 -32 -43 -19 1 -13 -28 -8 12 -9 -14 -5 3 -19 10 -12 17 -21 -14 19 0 -1 -18 -4 -2 60 76 2 6 9 11 52 9 6 12 -22 -10 5
7546 5 9 -10 17 -14 -41 -25 -36 -9 -10 -30 -16 3 -30 -9 12 6 6 -1 8 -29 -11 -2 2 38 42 -2 29 1 -3 8 -4 4 -28 15 9 19 19
7583 19 26 -6 -2 -26 -38 -53 -13 -20 0 -15 -21 -17 11 6 -32 -51 -11 -29 -29 -13 -11 -4 7 -5 -12 -9 -24 5 -9 30 19 1 8 2 14 2 29
7620 29 -20 -10 -6 8 13 -5 33 33 10 -25 -15 -41 -29 -1 -21 -16 -12 0 -17 -27 -11 -7 -17 -46 -23 -17 11 26 54 -10 -21 -1 -19 15
7654 15 8 9 -11 15 -6 6 22 24 18 -17 -41 -14 -19 7 -6 27 -10 6 -21 -38 -12 -11 -14 -22 -15 -16 -43 9 -13 7 -8 6 -18 -33 -15
$$ packed form
7401a5J5JM1nm0J1l5K2K2j3K7l9K6j7J4Mnj5l2PRj0LK6Rk2K1J5n9K9k0kK0mL1
7436B0j0JjPl3M3m2K3k0K2lJ0Qj1Krknl5M2j4rJ1K1k7k6L5qk8nJ7PM0l9jjk4J0
7474c4PK3J0mj3j5qM6m1N0K3m1J%j3J6QJ1Nn9L1k6L1k5K3j6MJ5Mk8J7J3j7ppj6
7510c2j1K4K0j4j5K0K0k1nRQk2K9k2K9l8PL3j9jj7J4KO2J6p4MLKM1m3lOl4J2J5
7546EMj9K7l1k7J6j1K7jk0J4J9l3K1K1o%pRl7J8RML6Mm4L1k8mJ1j2Ql2M3oJ0%
7583A9Pl2Mk4j2j5M0pK0j5oMK8nl8j9M0j8%J6KPJ1j2pLj5K9j4L9j1j8PoJ2j2K7
7620B9m9J0MJ4Nj8L8%k3l5J0k6J2K8k0NMJ2j7j0J6Mj0k9K3OK8J5K8o4j1K0j8L4
7654A5pJk0K6k1J2J6Kol5k4K7nK6j3L3l7J6k7j7K6JlqPjk7N2k2K0j5J4k4j5J8
$$ plain form
7689 -15 -1 12 -15 23 -13 21 -2 -31 0 -6 -5 -3 10 38 8 20 8 -17 -30 -38 -41 -13 24 38 5 -17 -18 -4 -5 -4 -22 -7 -52 -40
7723 -40 -52 -28 -13 9 12 -24 6 -41 -10 -11 5 -12 -22 -20 10 9 31 9 6 20 -60 7 11 15 8 21 7 0 1 -13 -5 26 -13 4 -20 16
7759 16 6 -35 -20 5 23 -46 -25 -29 -28 -3 -24 35 17 -7 -27 -24 -18 2 7 0 -16 14 49 4 18 13 21 -7 -20 -4 -21 21 33 7
7793 7 18 8 14 -1 7 -11 -41 -25 -23 -14 -25 -32 -5 0 -14 -30 -11 -23 -3 6 -16 -5 8 -18 -13 -29 -5 -8 -21 -19 15 18 14 22 14 -14 12 10
7831 10 -3 11 -21 10 8 -9 -24 51 10 9 -23 -17 -18 -22 -33 9 9 7 -32 -21 -40 -28 -4 -24 6 -20 14 9 20 20 0 -2 -4 -10 -16 15 2
7868 2 26 39 28 16 4 17 -3 -22 -21 -8 1 -4 7 24 7 -11 -5 3 -29 -45 -1 6 -13 15 -31 -21 -12 -19 -18 1 -31 -37 1 6 -21 0
7904 0 9 24 6 -19 -32 -13 -1 25 14 -20 40 -14 -2 -11 17 28 -2 -13 -6 -12 -15 4 3 50 -28 16 -35 -17 -25 8 -30 -19 -20 0 5
7939 5 6 9 -9 -2 -25 13 13 8 41 19 0 17 1 27 20 28 18 -7 24 33 -9 20 38 33 -19 -6 -25 -27 -31 1 2 -2 -2 -20 -7 -31 -34 3
$$ packed form
7689a5J4J3k7L8l6L4k3k9L1oJKJ3K8l0J2j2k5j3qlK8L7J4l3k2jJ4jJj8J5m5J2
7723d0j2K4J5K2Ll6L0m7L1jJ6j7j0KL0jK2k2lJ4q0O7MMpJ3j4pJj4QL1l9J7k4L6
7759A6j0m1J5K5J8o9K1mJK5k1N9j8k4k0LOK0Npj6L0L5m5J4nQk8j3J6j7M2J2k6
7793GJ1j0Oj5Qj8l0J6KRj1pK7Nj4j6J9j2K0Rk2J1J3k6Nj6K4lj3KL4LmQqk8K6k
7831A0j3J4l2L1kj7j5P5m1jl2Ojmj1M2%kl9J1j9J2K4k0L0k6L4nJ1%k0kkooL1j3
7868BK4J3j1j2j2J3k0j9JJ3RnJ1J7j7j8OQl2j6M4Pj9K8m6J0RpJJ9l2oL8Nk7K1
7904@RJ5j8k5j3J9J2K6j1l4O0n4J2rK8J1l0j1PolJ9jM7p8M4n1J8qL3l8J1jK0N
7939EJLj8Pk3L8%nL3k2j9J7j6K6pQj0k5L1Rm2K9J8nn2J3j9kmL2Jm%j8J3k4lL7
$$ plain form
7977 3 -35 4 15 -8 -23 12 21 -3 -10 -18 -2 7 -10 38 36 11 5 -8 -2 -12 -13 -6 -2 -11 -7 10 36 32 30 -16 -5 -20 -38 12 -5 -22 -9 -28
8015 -28 -22 -8 -14 -21 -10 -13 9 -19 -28 -17 1 17 -1 2 18 1 -12 10 0 -6 24 6 -3 45 2 8 -14 23 14 -2 2 41 29 10 16 -16
8051 -16 -6 -7 -9 3 2 -11 -52 5 -24 5 -22 -5 -35 -38 -17 -62 -10 2 -18 4 13 5 10 4 30 -14 27 24 0 -9 12 23 10 -1 19
8086 19 -38 -25 -10 -17 -1 -4 -4 4 -18 -15 -32 -24 0 -25 -34 -37 -1 -24 -28 -18 14 -26 -56 -7 -28 -16 8 14 -17 0 10 -9 -7 3 10 -3
8122 -3 30 -5 20 45 48 32 -5 -14 -18 -32 -1 2 8 9 -19 -15 -20 -18 -28 -13 -15 -25 -26 -6 7 -29 17 -10 -6 1 -25 -14 -8 15 7 -21 -8 -15 -7
8161 -7 24 19 -17 -14 6 4 7 30 31 18 41 24 5 3 -40 -14 -23 20 -24 -6 21 -10 -21 3 -19 -20 -45 -8 -8 -28
$$ packed form
7977Cl8L9J1k3j5L5Rk4pqJ6Rj7M8kk5oj3Oj0jPMrMJ7K6mkm6J1j5j8N0j7j7J3j9
8015b8OJ4opJ1lK2k8rJ1J8J6j8LJ6j7j3K2j0oL0j8rM8m3Ok2L7rj6ML9j2j9Ol2
8051a6J0jkJ2jj3m1N7k9K9k7J7l0lK1m5N2J2k0K2RqNoK6m4M1lk4rK1J1j3j1K0
8086A9n7J3J5pJ6l%Qk2Lj7QK4k5rlL6k3mJ0L2m0l0M9k1J2K4Ol1J7J0j9KJ0Pj3
8122cL3l5K5K5Lj6l7rmj4L1LOJk8MnKj0J5kj0jK0J3l6M6k7MPk6J1OK3qk8J3pQ
8161gL1nl6LK0kLK3Jj3K3j7j9km3K6rM3m4J8K7l1j1K4k2jk5L7%k0
8191b8
$$ Imaginary data points
##PAGE= N=2
##DATA TABLE= (X++(I..I)), XYDATA
$$ plain form
0 0 0 0 0 0 0 0 0 0 0 0 0 0 0 0 0 0 0 0 0 0 0 0 0 0 0 0 0 0 8 -8 8 -8 8 -8 8 -8 9 -16 16 -16 16 -18 24 -24 25 -32 32
47 32 -35 40 -42 48 -53 57 -64 72 -80 89 -98 107 -123 139 -162 188 -220 270 -343 461 -695 1322
69 1322 -6697 -19878 -8950 9865 27556 30732 17318 -9207 -31438 -35102 -17958 6012 23294
82 23294 25408 13644 -3582 -12932 -8981 1851 7413 2991 -8423 -18355 -18228 -3755 17449 30739
96 30739 26253 7144 -15373 -29002 -26164 -8654 11129 19996 14617 2603 -6352 -6626 1078 9420
110 9420 8743 -3190 -17728 -23184 -14602 4096 22841 29908 19732 -1230 -19296 -24165 -15353 -254
124 -254 11357 12658 4506 -4395 -5546 1581 10198 12449 4790 -9770 -22104 -22419 -8719 10674
138 10674 24078 24022 11294 -6289 -17932 -16961 -6263 4683 8282 3918 -3323 -6475 -1480 8925
$$ packed form
0@%%%%%%%%%%%%%%%%%%%%%%%%%%%%Qj6J6j6J6j6J6j6J7k5L2l2L2l4M2m8M9n7O4
47C2o7P5q2R0j01J10j21J36j52J69j87K05k30K62l01L50m08M90o13Q04j156K017
69A322q019j3181J0928J8815J7691L176j3414k6525k2231l664J7144K3970J7282
82B3294K114j1764j7226r350L951J0832N562m422j1414r932J27J4473K1204J3290
96C0739m486j9109k2517j3629K838J7510J9783Q867n379j2014q955k74P704Q342
110I420o77j1933j4538n456Q582J8698J8745P067j0176k0962j8066m869Q812J5099
124b54J1611J301q152q901j151P127Q617K251p659j4560j2334l15J3700J9393
138A0674J3404n6j2728j7583j1643R71J0698J0946L599m364p241l152M995J0405
$$ plain form
152 8925 15961 12367 -1025 -16214 -23803 -18374 -2268 14987 22803 17215 3404 -9215 -13573 -8638
166 -8638 377 5786 3391 -3856 -8477 -5415 4300 14374 17329 9200 -6258 -19473 -21919 -12204
180 -12204 3351 15650 17983 9970 -1820 -8873 -7517 -968 4216 3508 -2823 -9559 -10074 -1898 10207
195 10207 17973 15674 3850 -10869 -19829 -17561 -5919 7130 13805 11370 3202 -4087 -5544 -942
209 -942 4616 5238 -540 -8727 -12810 -8686 2451 14144 18599 12172 -1198 -13393 -17521 -11796 -718
224 -718 8323 10016 4807 -1700 -4070 -782 4858 7460 3539 -5274 -12896 -13282 -5090 7076 15943
239 15943 16037 7168 -5028 -13252 -12990 -5910 2424 6518 4639 -379 -3641 -1666 4220 8815 7641
254 7641 178 -9338 -14660 -11552 -1169 10299 15828 12339 2523 -7323 -11288 -7982 -990 3926 3568
$$ packed form
152H925P036l594j3392j5189p589N429J6106J7255P816n588j3811j2619m358M935
166h638R015N409k395p247m621L062R715J0074K955q129j5458j3215k446R715
180a2204J5555J2299K333q013j1790p053J356O549N184p08o331o736n15Q176J2105
195A0207P766k299j1824j4719q960K268J1642J3049O675k435q168p289j457M602
209i42N558O22n778q187m083M124J1137J1693M455o427j3370j2195m128N725J1078
224g18R041J693n209o507k370L288N640K602l921q813p622l86Q192J2166Q867
239A5943R4q869j2196q224K62P080Q334M094j879n018l262J975N886M595j174
254G641p463r516n322L108J0383J1468N529l489r816r846l965L306O992M916l58
$$ plain form
269 3568 -747 -4473 -3653 1996 8637 10912 5931 -3840 -12398 -14225 -7851 2845 11519 13137 7460
284 7460 -1202 -7025 -7103 -2773 1747 2641 -757 -5069 -5943 -1479 5959 11321 10452 2879 -7065 -13399
300 -13399 -11999 -3903 5644 10919 9354 2986 -3337 -5315 -2597 1631 3116 85 -5104 -8175 -5785
315 -5785 1565 9416 12520 8372 -754 -9383 -12423 -8336 -221 6685 8372 4852 -419 -3274 -1999
330 -1999 1657 3963 2076 -3219 -8260 -8874 -3719 4665 11126 11476 5239 -3601 -9799 -9858 -4492 2286
346 2286 5991 4853 838 -2309 -1772 1819 5111 4745 -96 -6625 -10351 -8144 -817 7366 11436 8965
362 8965 1822 -5497 -8602 -6314 -951 3329 3853 997 -2138 -2428 818 5141 6864 3852 -2803 -8901
378 -8901 -10427 -5971 1903 8537 9982 5779 -909 -5724 -6027 -2637 1347 2745 699 -2479 -3637
$$ packed form
269C568m315l726Q20N649O641K275m981r771q558j827O374J0696Q674J618n677
284G460q662n823p8M330M520Q94l398m312q74M464P438N362q69p573r944o334
300a3399J400Q096R547N275j565o368o323j978K718M228J485l031n189l071K390
315e785P350P851L104m148r126q629l040M087Q115O906J687l520n271k855J275
330a999L656K306j887n295n041o14N155Q384O461L50o237q840o198n9N366O778
346B286L705j138m015l147N37L591L292l66m841o529l726K207P327Q183M070k471
362H965p143p319l105K288N363M280N24k856l135k90L246M323J723l012o655o098
378h901j526M456P874O634J445m203o688m815l03L390L984J398k046l178j158
$$ plain form
393 -3637 -983 3942 7643 7045 1694 -5503 -10046 -9028 -3075 4117 8294 7287 2480 -2603 -4545
408 -4545 -2814 543 2352 934 -2478 -4840 -3641 1124 6503 8770 5919 -748 -7218 -9656 -6622
423 -6622 -351 5144 6704 4087 -143 -2840 -2258 481 2561 1764 -1753 -5218 -5735 -2256 3661 8145
439 8145 8276 3675 -2963 -7635 -7806 -3769 1563 4647 4116 1072 -1680 -1802 544 3105 3280 281
455 281 -4182 -6950 -5476 -285 5617 8647 6798 1282 -4469 -7009 -5304 -1065 2550 3259 1198 -1350
471 -1350 -1929 189 3247 4564 2640 -1928 -6220 -7173 -3911 1849 6642 7682 4505 -689 -4571 -5064
487 -5064 -2632 594 2044 934 -1385 -2494 -1014 2357 5110 4904 1246 -3896 -7183 -6443 -2001 3496
503 3496 6709 5932 2066 -2089 -3872 -2704 -67 1602 827 -1553 -3383 -2674 649 4475 6088 4097
$$ packed form
393c637K654M925L701n98n351p197m543J018N953P192M177j007m807n083j942
408d545J731L357J809j418l412k362J199M765N379K267k851o667o470k438L034
423f622O271N495J560k617m230k697N82K739K080p97l517l465n17L479N917M484
439H145J31m601o638m672j71M037N332L084n31l044k752j22K346K561J75k999
455B81m463k768J474N191N902L030j849n516n751k540J705M239L615P09k061k548
471a350n79K118L058J317j924m568m292r53L262N760M793J040l177n194l882m93
487e064K432L226J450j110k319j109J480L371K753k06l658n142l287P40M442N497
503C496L213p77l866m155j783J168K637J669p75k380j830P09L323L826J613j991
$$ plain form
519 4097 -658 -5327 -7041 -4734 -15 4222 5484 3616 224 -2195 -2110 -252 1460 1193 -1050 -3596
535 -3596 -4106 -1758 2438 5755 5954 2616 -2330 -5882 -5854 -2701 1506 4083 3641 1225 -1070 -1499 69
552 69 1946 2203 108 -3095 -4956 -3992 -243 4101 6248 4887 784 -3511 -5379 -4100 -827 2131
568 2131 2917 1531 -489 -1223 -4 2103 3142 1852 -1449 -4570 -5374 -3021 1302 4936 5708 3261
584 3261 -745 -3779 -4175 -2112 621 1931 1226 -553 -1512 -624 1742 3663 3480 765 -3014 -5395
600 -5395 -4842 -1522 2648 5039 4404 1508 -1772 -3268 -2409 -285 1221 949 -700 -2115 -1715 575
616 575 3406 4543 3044 -572 -4202 -5429 -3721 -26 3291 4286 2731 -14 -1957 -1930 -471 985
632 985 964 -579 -2379 -2797 -1030 2053 4481 4504 1902 -1860 -4562 -4612 -2145 1130 3191 2965 1044
$$ packed form
519D097m755m669j714K307M719M237J262j868l392k419Q5J858J712k67k243k546
535c596n10K348M196L317J99l338m946l552K8L153M207K577m42k416k295m29J568
552F9J877K57k095l203j861R64L749M344K147j361m103m295j868J279L273K958
568B131P86j386k020p34J219K107J039j290l301l121q04K353M323L634P72k447
584C261m006l034l96K063K733J310p05j779r59Q88K366J921j83k715l779k381
600e395N53L320M170K391o35k896l280j496Q59K124J506k72j649j415M00K290
616E75K831J137j499l616l630j227J708L695L317R95j555k745j943K7J459J456
632I85k1j543j800m18J767L083K428K3k602l762k702n0K467L275K061k26j921
$$ plain form
649 1044 -967 -1443 -364 1138 1548 137 -2121 -3577 -2851 62 3338 4918 3858 597 -2855 -4344
665 -4344 -3313 -650 1736 2397 1249 -400 -1111 -279 1301 2157 1241 -1139 -3378 -3909 -2034 1239 4020
682 4020 4517 2633 -538 -3011 -3394 -1785 384 1568 1133 -250 -1181 -661 1001 2554 2483 499 -2354
699 -2354 -4176 -3664 -1006 2293 4212 3655 1241 -1417 -2678 -1978 -273 955 798 -440 -1554 -1307
715 -1307 365 2424 3260 2117 -596 -3290 -4161 -2748 155 2763 3600 2399 158 -1503 -1638 -534
731 -534 686 819 -339 -1730 -2125 -904 1441 3327 3376 1334 -1667 -3710 -3681 -1614 1102 2743 2549
748 2549 934 -638 -1127 -357 841 1146 110 -1587 -2697 -2127 38 2505 3750 2854 291 -2370
764 -2370 -3555 -2712 -499 1486 2085 1279 -84 -801 -277 907 1633 996 -798 -2561 -3053 -1595 953
$$ packed form
649A044k011m76J079J502M10j411k258j456P26K913L276J580j060l261l452j489
665d344J031K663K386O61j148j649p11Q32J580Q56r16k380k239n31J875L273K781
682D020M97j884l171k473l83J609K169J184m35j383r31N20J662J553p1j984k853
699b354j822N12K658L299J919n57k414k658j261P00J705J228j57j238j114K47
715a307J672K059Q36j143k713k694q71J413K903K608Q37j201k241j661j35J104
731e34J220J33j158j391l95J221K345J886M9k042l001k043K9K067K716J641j94
748B549j615j572m89P70J198L05j036j697j110N70K165K467J245q96k563k661
764b370j185Q43K213J985N99q06j363p17N24J184P26o37j794j763m92J458K548
$$ plain form
781 953 3132 3516 1939 -654 -2626 -2879 -1480 349 1395 1080 -5 -768 -407 843 2004 1881 378
798 378 -1827 -3223 -2819 -728 1805 3276 2846 879 -1278 -2325 -1806 -400 757 807 -79 -988 -915 323
816 323 1919 2587 1682 -448 -2565 -3317 -2156 157 2270 2891 1839 -57 -1385 -1530 -645 398 593
833 593 -120 -1179 -1490 -532 1234 2630 2643 1044 -1277 -2876 -2890 -1290 883 2252 2115 811 -591
850 -591 -1114 -557 414 818 121 -1145 -1943 -1554 80 2065 3008 2287 246 -1890 -2840 -2135 -360 1280
868 1280 1789 1094 -53 -706 -434 430 1000 632 -642 -1930 -2221 -1141 842 2515 2810 1595 -484
885 -484 -2076 -2298 -1235 297 1213 1040 154 -583 -445 417 1309 1289 207 -1469 -2515 -2188 -474 1515
903 1515 2729 2356 764 -1051 -1905 -1476 -346 657 785 107 -670 -736 137 1282 1778 1104 -466 -2066
$$ packed form
781I53K179L84j577k593j972k53J399J829J046l15j085p63L61J250J161j23j503
798C78k205j396M04K091K533J471m30j967k157j047N19J406J157N0q86r09P3J238
816C23J596O68r05k130k117p52J161K313K113O21j052j896j328j45Q85J043J95
833E93p13j059l11R58J766J396J3j599k321j599j4J600K173J369j37j304j402
850e91n23N57R71M04o97j266p98L89J634J985R43p21k041k136r50P05J775J640
868A280N09o95j147o53K72Q64N70l68j274j288k91J080J983J673K95j215k079
885d84j592k22J063J532R16j73q86p37J38Q62Q92k0j082j676j046L27J714J989
903A515J214l73j592j815q54M29J130J003J28o78p77o6Q73J145M96o74j570j600
$$ plain form
921 -2066 -2612 -1681 177 1855 2400 1588 41 -1169 -1363 -628 327 630 54 -740 -1113 -451 867 1945
939 1945 1958 709 -1163 -2414 -2368 -994 795 1918 1813 718 -448 -947 -550 251 607 193 -754 -1409
957 -1409 -1147 96 1565 2239 1695 75 -1627 -2364 -1827 -340 1078 1572 1073 76 -563 -423 251 781
975 781 560 -399 -1400 -1690 -838 691 2021 2241 1159 -547 -1836 -1963 -1100 236 1038 931 212 -405
993 -405 -373 290 1013 1006 176 -1079 -1905 -1600 -330 1256 2186 1838 559 -906 -1655 -1373 -388 527 678 174
1013 174 -425 -528 111 986 1419 935 -344 -1604 -2044 -1287 230 1590 1972 1268 -16 -1034 -1242 -619
1031 -619 143 416 86 -532 -811 -311 716 1538 1550 547 -902 -1905 -1860 -723 721 1634 1545 610 -414
1050 -414 -879 -596 66 431 154 -566 -1074 -883 108 1282 1842 1362 78 -1308 -1892 -1364 -220 961
$$ packed form
921b066n46R31J858J678N45q12j547j210j94P35R55L03n76p94l73O62J318J078
939A945J3j249j872j251M6J374J789J123j05j095j166m99L97Q01L56m14r47o55
957a409K62J243J469O74n44j620j702p37N37J487J418M94m99r97o39J40O74N30
975G81k21r59j001k90Q52J529J330K20j082j706j289j27Q63J336Q02j07p19o17
993d05L2O63P23pq30j255q26L05J270J586R30l48j279j465p49K82R85R15J51n04
1013A74n99j03O39Q75M33m84j279j260m40P57J517J360L82p04j284j018k08O23
1031f19P62K73l30o18k79N00J027Q22J2j003j449j003M5J137J444R13q9r35j024
1050d14m65K83O62L65k77p20n08J91R91J174N60m80j284j386n84N28J144J181
$$ plain form
1068 961 1360 882 85 -530 -421 88 521 353 -346 -1175 -1324 -641 590 1632 1805 919 -425 -1479 -1614
1087 -1614 -817 260 926 879 309 -293 -321 143 679 721 48 -969 -1554 -1310 -211 1072 1778 1520 415
1106 415 -777 -1361 -1072 -247 491 627 255 -243 -383 55 729 1020 629 -369 -1332 -1679 -1038 206 1289
1125 1289 1607 1046 -39 -868 -1003 -493 134 453 172 -366 -602 -220 578 1205 1151 344 -829 -1620 -1514
1144 -1514 -596 575 1321 1231 496 -327 -726 -463 35 364 164 -413 -786 -631 130 1023 1433 1012 -52
1163 -52 -1147 -1584 -1174 -156 770 1108 705 28 -433 -370 87 406 307 -255 -851 -1004 -433 562 1360 1422 703
1184 703 -440 -1257 -1338 -691 203 742 685 195 -236 -265 113 557 623 73 -720 -1149 -1009 -109 936 1465 1213
1205 1213 306 -702 -1173 -939 -225 357 491 178 -262 -328 49 565 865 507 -296 -1071 -1303 -767 236
$$ packed form
1068I61L99m78p97o15J09N09M33j68o99q29j49O83J231J042J73q86j344j054j35
1087a614P97J077O66m7n70o02k8M64N36M2o73j017n85K44J099J283P06k58j105
1106D15j192n84K89Q25P38J36l72m98j40M38O74K91l91r98r63l47O41J244J083
1125A289L18n61j085q29j35N10O27L19k81n38k36L82P98O27n4q07j173p91J06
1144a514R18J171P46r0p35q23l99K63M98L29k00n77l73J55P61Q93M10m21j064
1163e2j095m37M10J018R26L38m03o77m61O3M57L19r9n62n96j53N71R95P98O2p19
1184G03j143q17q1O47Q94N39n7m90m31k9L78M44O6n50p93m29J40R00J045N29k52
1205A213r07j008m71K34P14N82J34l13m40o6L77N16L00l58q03p75k32N36J003
$$ plain form
1224 236 1092 1334 808 -51 -750 -865 -453 67 302 123 -330 -470 -147 491 954 939 254 -657 -1293 -1149
1244 -1149 -434 556 1136 1039 382 -368 -645 -427 11 242 78 -349 -659 -525 128 832 1131 799 -38 -908
1264 -908 -1207 -882 -30 708 908 640 93 -326 -294 16 297 198 -243 -698 -814 -368 449 1056 1142 552 -395
1285 -395 -1028 -1065 -510 216 659 604 175 -183 -205 83 420 426 22 -619 -986 -825 -77 752 1164 940 189 -579
1307 -579 -921 -718 -160 354 455 245 -140 -205 41 486 632 377 -285 -868 -1027 -640 205 897 1073 611
1327 611 -70 -618 -725 -373 71 289 133 -194 -323 -101 367 781 726 171 -589 -1061 -975 -342 437 909 817
1348 817 290 -253 -557 -380 -14 212 109 -214 -436 -346 166 684 899 613 -61 -784 -1052 -731 -22 561
1368 561 775 475 -18 -331 -295 -46 234 159 -174 -533 -597 -237 435 928 918 418 -336 -861 -877 -406 190 548
$$ packed form
1224B36Q56K42n26q59o99j15M12N20K35j79m53j40L23O38M63j5o85r11o36J44
1244a149P15R90N80r7o57p50k77K18M38K31j64m27l10J34O53P04K99l32q37q70
1264i08k99L25Q52P38K00k68n47m19L2L10K81r9m41m55j16M46Q17O07Q6n90r47
1285c95o33l7N55P26M43n5m29l58k2K88L37Om04o41l67J61P48Q29M12k24p51p68
1307e79l42K03N58N14J01k10l85o5K46M45J46k55o62n83j59L87Q45O92J76m62
1327F11o81n48j07L52M44K18j56l27j29K22M68M14n5n55p60m72Q6O33P79M72r2
1348H17n27n43l04J77L66K26j03l23k22R0N12N18K15k86o74p23k68L21P09N83
1368E61K14l00m93l13L6K49K80p5l33l59o4L60O72M93j0n00p54n25j6M71N96L58
$$ plain form
1390 548 482 171 -165 -195 40 311 361 39 -429 -758 -583 -24 666 1006 753 137 -507 -770 -579 -128 324
1411 324 361 143 -94 -195 6 324 491 282 -255 -710 -826 -431 228 780 888 522 -77 -520 -586 -275 58
1432 58 240 79 -158 -270 -60 320 589 561 94 -502 -845 -730 -215 413 789 692 246 -253 -458 -287 -22
1453 -22 192 76 -202 -373 -295 72 531 750 458 -116 -664 -846 -555 9 503 629 402 28 -246 -250 -9
1474 -9 181 116 -125 -471 -451 -200 344 751 745 278 -325 -727 -725 -343 164 483 420 138 -112 -129 43 248 263 -11
1498 -11 -402 -632 -471 0 535 784 578 77 -409 -686 -500 -70 264 313 167 -38 -143 57 269 407 226
1519 226 -219 -595 -660 -347 213 629 723 363 -97 -478 -478 -236 93 202 105 -126 -191 -27 291 510 477 73
1541 73 -412 -691 -603 -179 340 624 496 186 -235 -358 -273 -30 109 70 -151 -278 -203 91 441 607 377 -80
$$ packed form
1390E48o6l11l36l0K35K71N0l22m68l29J75N59O90L40k53o16o44k63J91M51M52
1411C24L7k18k37j01K01L18J67k09n37m55j16L95O59N52J08l66n99m43o6L11L33
1432E8J82j61k37j12K10L80K69k8m67n96l43J15N15O28L76r7m46m99k05J71K65
1453b2K14j16k78j71P8L67M59K19k92n74n48j82K91N64M94J26k27l74k74mK41
1474iJ90o5k41l46K0K51N44M07om67o03m02KL82N07L19o3k82k50j7J72K05J5k74
1498a1l91k30J61M71N35K49k06n01m86k77J86M30L34M9j46k05j05K00K12J38j81
1519B26m45l76o5L13N60M16R4l60m60l81%K42L29J09r7k31o5J64L18K19l3m04
1541G3m85k79Q8M24N19K84j28l10m21j23Q5K43J39l9k21j27P5K94L50J66k30m57
$$ plain form
1563 -80 -540 -673 -456 19 396 482 316 9 -233 -222 5 125 82 -148 -350 -398 -102 296 618 546 212 -284
1585 -284 -596 -571 -266 130 364 365 88 -150 -126 9 157 202 -2 -322 -477 -364 7 465 659 467 52 -327
1607 -327 -521 -353 -59 200 237 100 -74 -90 -5 259 325 149 -206 -488 -548 -261 200 534 564 266 -89 -352
1629 -352 -394 -194 41 174 64 -107 -169 -44 224 365 342 -18 -363 -539 -470 -121 326 541 430 131 -193
1650 -193 -287 -200 -10 113 53 -107 -249 -167 118 393 496 272 -149 -488 -600 -362 52 345 424 255 -12 -135
1672 -135 -152 19 134 74 -122 -334 -304 -74 246 520 441 147 -245 -497 -460 -188 150 317 239 69 -73 -85
1694 -85 60 191 171 -49 -308 -359 -279 44 380 518 357 -2 -303 -466 -281 -57 154 172 63 -95 -79 65
1716 65 204 288 129 -188 -421 -461 -177 173 422 450 232 -117 -311 -298 -122 47 103 9 -70 -111 -23 221 374
$$ packed form
1563h0m60j33K17M75L77Q6j66l07k42J1K27J20m3k30k02m8K96L98L22p2l34m96
1585b84l12K5L05L96K34Jk77k38K4J35J48M5k04l20j55J13L71M58J94j92m15l79
1607c27j94J68K94K59L7j37j74j6Q5K64O6j76l55k82o0K87M61L34L0k98l55k63
1629c52m2K00K35J33j10j71o2J25K68J41k3l60l45j76O9L49M47K15j11k99l24
1650a93r4Q7J90J23o0j60j42Q2K85K75J03k24m21l39j12K38M14K93P9j69k67j23
1672a35j7J71J15o0j96k12L0K30L20K74p9k94l92k52L7K72L38J67p8j70j42j2
1694h5J45J31k0k20k59n1Q0L23L36J38j61l59l01j63J85K24K11J8j09j58J6J44
1716F5J39Q4j59l17k33m0K84L50K49K8k18l49j94J3J76J69N6r4p9m1Q8K44J53
$$ plain form
1739 374 298 45 -301 -485 -354 -51 261 389 342 79 -142 -210 -147 -2 96 -1 -160 -211 -158 111 351 410 239
1762 239 -115 -415 -430 -237 49 303 314 182 -33 -178 -77 25 102 8 -147 -245 -251 -66 278 443 407 139 -212
1785 -212 -373 -350 -105 120 242 205 25 -81 -60 56 157 77 -65 -292 -360 -252 61 348 429 286 -14 -258
1807 -258 -328 -178 14 132 156 14 -73 -65 62 206 215 75 -180 -336 -356 -124 191 369 392 148 -100 -226 -223 -61
1831 -61 62 71 -36 -120 -127 -10 200 312 193 -15 -307 -402 -314 -46 232 368 232 76 -132 -205 -80 32 93
1854 93 -23 -137 -203 -58 112 305 325 155 -137 -356 -383 -197 32 241 273 137 -27 -102 -27 53 77 -7 -106 -244
1878 -244 -229 -9 215 385 297 75 -237 -340 -285 -71 106 177 134 26 -84 -28 80 160 96 -55 -244 -333 -154
1901 -154 63 306 381 248 -14 -244 -296 -179 -11 106 80 9 -95 -66 98 165 213 75 -205 -320 -326 -94 177
$$ packed form
1739C74p6k53l46j84J31L03L12J28m7k63k21o8O3J45R8r7j59n1N3K69K40N9j71
1762B39l54l00j5J93K86K54J1j32k15j45J01J02P7r4j55r8oJ85L44J65l6k68l51
1785b12j61K3K45K25J22l7j80j06K1J16J01q0j42k27o8J08L13K87Q1j43l00k44
1807b58p0J50J92J18K4j42q7QJ27J44Rj40k55j56k0K32L15J78K3k44k48j26LJ62
1831f1J23Rj07q4pJ17K10J12j19k08k92r5Q8K68K78J36j36j56k08p3J25J12O1
1854I3j16j14o6J45J70J93K0j70k92k19k7J86K29K09L2j36j64p5P5Q0K4q4r9j38
1878b44J5K20K24J70q8k22l12j03N5K14J77P1m3j08j10N6J08Q0o4j51j89q9J79
1901a54K17K43P5j33k62k30n2J17J68J17k6p1j04K9J64O7M8j38k80j15oK32K71
$$ plain form
1924 177 321 297 114 -87 -208 -169 -73 65 58 -29 -118 -92 33 200 260 176 -42 -242 -327 -226 -13 223 296 187
1948 187 28 -116 -152 -43 18 66 7 -126 -183 -93 109 286 276 136 -118 -310 -325 -185 70 236 242 88 -42
1971 -42 -91 -69 69 89 -10 -150 -233 -201 -2 209 320 257 26 -200 -312 -245 -56 98 193 107 30 -52 3 84 123
1996 123 52 -81 -213 -290 -168 63 294 336 191 -32 -231 -236 -151 24 87 67 8 -75 -27 58 174 181 27 -178 -322
2021 -322 -289 -70 126 314 242 97 -126 -223 -175 -37 39 43 -61 -97 -87 50 157 250 134 -53 -242 -326 -255 -9
2045 -9 205 267 199 -30 -116 -125 -51 8 29 -32 -137 -139 -45 121 277 234 110 -131 -273 -296 -149 61 178 193 57 -41
2071 -41 -102 -9 63 34 -11 -129 -210 -164 -16 225 284 234 29 -198 -267 -208 -38 104 153 93 -8 -77 -1 79 109 40
2097 40 -67 -205 -271 -136 85 240 305 169 -56 -191 -240 -113 23 65 45 0 -70 -21 70 175 144 32 -163 -266
$$ packed form
1924A77J44k4j83k01j21L9R6J38pq7q9K6J25J67O0q4k18k00q5J01K13K36P3j09
1948A87j59j44l6J09O1M8n9j33n7R0K02J77j0j40k54j92j5J40K55J66Oj54j30
1971d2m9K2J38K0r9j40q3L2J99K11J11o3k31k26j12O7J89J54R5q6p7q2N5Q1L9
1996A23p1j33j32p7J22K31K31M2j45k23j99nQ5J75O3k0n9q3M8Q5J16Pj54k05j44
2021c22L3K19J96J88p2j45k23r7M8J38P6Mj04l6J0J37J07R3j16j87j89q4P1K46
2045iK14O2o8k29q6rP4N9K1o1j05kR4J66J56m3j24k41j42k3J47K10J17J5j36r8
2071d1o1R3P2k9m5j18q1M6J48K41N9n0k05k27o9N9J70J42M9o0j01o9P6Q0L0o9
2097D0j07j38o6J35K21J55O5j36k25j35m9J27J36M2k0m5p0M9R1J05l1j12j95j03
$$ plain form
2121 -266 -222 -50 167 269 249 77 -68 -162 -122 -22 30 26 -63 -116 -62 52 178 198 128 -50 -254 -297 -172 -2
2145 -2 190 239 159 -5 -45 -108 -54 43 14 -52 -137 -139 -73 118 265 223 85 -134 -280 -235 -114 91 197 148 51 -36
2171 -36 -68 6 58 84 -17 -137 -198 -149 -8 194 243 189 -10 -184 -250 -182 -23 79 115 84 16 -42 15 56 102 55
2197 55 -72 -252 -202 -116 76 202 252 118 -48 -197 -210 -97 25 91 60 -21 -69 -10 65 160 105 6 -176 -256 -193
2222 -193 -39 124 219 179 49 -117 -135 -107 -14 7 31 -31 -106 -43 64 177 203 75 -54 -204 -253 -143 28 196
2246 196 242 129 -21 -75 -88 -30 39 29 -66 -133 -124 -30 117 249 199 50 -112 -271 -217 -109 72 167 134 66 -49
2271 -49 -51 6 49 88 -28 -160 -168 -115 37 176 278 197 -19 -150 -203 -168 -22 45 117 70 -10 -41 -3 98 101 56 -68
2298 -68 -206 -224 -115 118 241 214 94 -55 -185 -175 -83 22 54 25 -38 -74 -21 87 146 123 -12 -156 -207 -204 -43
$$ packed form
2121b66M4J72K17J02k0j72j45r4M0J00N2mq9n3N4J14J26K0p0j78k04m3J25J70
2145bJ92M9q0j64m0o3N4R7k9o6q5kO6J91J47m2j38k19j46M5J21K05J06m9r7q7
2171c6l2P4N2K6j01j20o1M9J41K02M9n4j99j74o6O8J59J02L6l1o8n8N7M1M6m7
2197E5j27j80N0Q6J92J26N0j34j66j49j3J13J22O6l1q1m8N9P5R5n5r9j82q0O3
2222a93J54J63R5m0j30j66j8K8R3K1K4o2p5O3J07J13K6j28j29j50m9J10J71J68
2246A96M6j13j50n4j3N8O9j0r5o7RR4J47J32n0j49j62j59N4J08J81R5l3o8j15
2271d9kN7M3L9j16j32qN3J52J39J02q1k16j31n3L5J46O7P2m7q0l1L8J01Lm5j24
2298f8j38j8J09K33J23k7j20j49j30J0R2J05L2k9o3l6N3J08N9k3j35j44n1LJ61
$$ plain form
2323 -43 154 231 207 68 -79 -137 -87 -1 53 32 -56 -78 -42 90 173 203 90 -72 -202 -269 -150 24 139 184 75
2348 75 10 -66 -76 -37 40 30 -61 -103 -121 -8 101 178 186 24 -136 -244 -192 -90 102 142 118 11 -53 -47 13 66 65 -30
2376 -30 -126 -154 -116 5 186 227 147 5 -150 -206 -165 -46 66 104 45 -9 -52 -2 86 109 21 -89 -178 -173 -78 100 191
2403 191 182 112 -40 -157 -157 -110 48 85 32 -31 -25 -3 82 178 92 -9 -174 -203 -172 -23 155 203 141 26 -83 -131 -97
2430 -97 -34 11 45 -40 -67 -54 52 135 169 77 -54 -208 -216 -120 36 178 154 90 4 -98 -97 -25 38 10 -44 -114 -84 9
2458 9 71 222 152 9 -115 -184 -165 -71 72 101 136 29 -46 -63 -17 65 31 -5 -131 -169 -129 23 177 191 138 -3
2484 -3 -125 -191 -169 -4 92 92 42 -17 -9 30 61 71 27 -75 -156 -158 -69 90 188 195 100 -59 -129 -173 -66 19 63 54 -28 -46
2514 -46 -9 52 116 65 -34 -175 -194 -123 -9 113 199 157 55 -49 -102 -77 -24 58 43 -4 -61 -8 59 161 171 86 -46
$$ packed form
2323d3J97P7k4j39j47n8N0Q6N4k1q8k2L6J32Q3L0j13j62j30o7J19J74J15M5j09
2348G5o5p6j0L9P7j0r1m2j8J13J09P7Qj62j60j08N2J02J92M0k4j07o4OO0N3jr5
2376c0r6k8L8J21J81M1q0j42j55n6M1J19J12L8n9n4m3N0Q8K3q8j10q9NR5J78R1
2403A91rp0j52j17%M7J58L7n3o3OK2Q5R6q6j01j65k9L1J49J78M8o2j15j09m8L4
2430i7O3M5L4q5k7J3J06Q3L4r2j31j54qR6J56J42k4o4q6j02JP2O3k8n4p0L0R3
2458IO2J51p0j43j24o9J9R4J43K9L5j07p5j7M6Q2l4l6j26l8M0J52J54J4n3j41
2484cj22o6K2J65R6%n0n9QL9L1J0m4j02q1kQ9J59R8Pr5j59p0m4J07Q5M4rq2j8
2514d6L7O1O4n1r9j41j9P1J14J22Q6m2j02j04n3K5N3Q2j5m7n7N3O7J02J0q5j32
$$ plain form
2541 -46 -194 -183 -132 40 135 202 88 2 -64 -78 -10 16 22 -40 -66 -96 -12 121 166 124 49 -123 -208 -158 -50 62 132
2568 132 122 41 -10 -86 -5 42 28 -29 -74 -124 -85 56 162 191 134 -26 -158 -175 -117 -30 53 83 61 -16 -22 7 52 73
2596 73 16 -110 -141 -161 -48 85 197 160 75 -62 -134 -136 -56 32 74 33 11 -4 -4 67 117 65 7 -115 -157 -134 -9 135
2624 135 176 149 40 -62 -131 -61 -7 39 26 -52 -38 -45 59 107 133 45 -73 -169 -169 -105 73 178 164 112 11 -111 -77
2651 -77 -47 3 -3 -25 -54 -56 7 95 161 149 31 -106 -164 -165 -53 70 140 121 82 -30 -55 -13 17 33 -55 -64 -105 -36 64
2680 64 126 158 77 -28 -139 -169 -90 28 75 122 57 7 -36 -14 27 45 23 -85 -94 -123 -43 82 177 170 73 -33 -136 -105
2708 -105 -40 15 87 50 2 -18 -11 41 80 31 -17 -81 -183 -116 -11 104 154 111 38 -63 -97 -49 -19 28 19 -38 -22 10 31
2737 31 120 104 42 -61 -142 -169 -72 54 119 150 85 -12 -54 -61 -21 1 4 -10 -48 -44 -17 111 104 88 17 -112 -139 -144 -8 64
$$ packed form
2541d6j48J1N1J72R5O7j14q6o6j4O8K6Oo2k6l0Q4J33M5m2p5j72q5N0J08J12P0
2568A32j0q1n1p6Q1M7j4n7m5n0L9J41J06K9n7j60j32j7N8Q7Q3L0k2p7oK9M5K1
2596G3n7j26l1k0J13J33J12l7q5j37p2kQ0Q8M2m1k2j5%P1N0n2n8j22m2K3J25J44
2624A35M1k7j09j02o9P0N4M6j3p8J4pJ04M8K6q8j18r6%O4J78J05j4n2j01j22L4
2651g7L0N0ok2k9kO3Q8O6j2j18j37n8jJ12J23P0j9l9j12k5M2L0J6q8rm1O9J00
2680F4O2L2q1j05j11l0P9J18M7M7o5n0m3K2M1J8k2j08rk9Q0J25R5pr7j06j03L1
2708a05O5N5P2l7m8k0PN2L9m9m8o4j02O7J05J15N0m3p3j01l4M8L0M7rn7J6L2K1
2737C1Q9j6o2j03q1k7R7J26O5L1o5r7m2pM0K2Lj4l8MK7J28pj6p1j29k7nJ36P2
$$ plain form
2767 64 117 71 15 -42 -45 -13 -7 22 -8 -65 -71 -26 9 115 173 82 -36 -114 -137 -112 8 82 96 73 1 -13 21 57 58 2 -35
2798 -35 -125 -101 -47 71 154 124 46 -47 -129 -104 -34 29 42 24 13 -48 -10 68 59 67 -21 -96 -120 -68 13 103 182 71 37 -70
2828 -70 -62 -65 -20 29 14 -23 -15 -17 12 103 94 30 -46 -142 -136 -85 38 93 97 72 -21 -37 -76 -10 33 -18 -27 -63 -70 -13 108 93 81 -19
2862 -19 -106 -129 -130 -66 53 109 78 65 -13 -39 -10 30 28 -1 -49 -66 -44 48 65 114 100 19 -75 -129 -78 -7 79 93 25 -26 -9
2893 -9 10 35 23 -25 -66 -100 -102 0 59 114 97 40 -31 -106 -91 -32 15 69 50 2 -5 -1 43 58 37 0 -60 -79 -64 18 102 130
2925 130 83 -6 -71 -73 -58 27 6 32 19 2 -14 40 45 79 25 -33 -98 -84 -52 24 123 85 65 -11 -45 -37 -4 12 46 -27 -30 -14
2957 -14 -10 68 93 78 9 -85 -148 -114 0 39 122 63 14 6 -59 -11 24 15 -4 -40 -66 -26 49 89 78 77 -39 -117 -94 -45 11
2988 11 66 54 56 22 -15 -5 13 51 -9 -51 -90 -42 -7 36 125 118 31 -34 -82 -73 -40 39 16 53 -31 -35 -3 33 81 22 -21 -72
$$ packed form
2767F4N3m6n6n7lL2OK9l0n7oM5L5J06N8r1j18p8k3K5J20P4J4k3p2j4L4L6Jn6l7
2798c5r0K4N4J18Q3l0p8r3q2K5P0O3J3j8j1o1L8P8rQq8p5k4N2Q1R0P9j11l4j07
2828g0QlM5M9j5l7QkK9R1ro4p6r6ON1J23N5Mk5r3j6l9O6M3n1rl6pN7J21j5j2j00
2862a9q7k3jO4J19N6l1j3p8k6K9M0kk9m8j7K2R2J7M9j4q1r4n4N1P1Q6J4o8n1J7
2893iJ9K5j2m8m1l4kJ02N9N5j7n7p1p5J5N9M7N4j9m8pMM4J5k1l7o0j9J5Q2Q4K8
2925A30m7q9o5kJ5Q5k1K6j3j7j6N4NL4n4n8o5J4L2P6R9l8k0p6l4QL3J6L4p3lJ6
2957a4MP8K5j5o9r4o3L4J14L9Q3n9m9qo5M8L5rj9l6k6M0P5M0j1jj16p8K3M9N6
2988A1N5j2Kl4l7J0J8L8o0m2l9M8L5M3Q9pq7o5m8RL3P9k3L7q4mL2L6M8n9m3n1
$$ plain form
3020 -72 -76 -81 -16 82 117 80 -18 -89 -95 -82 -44 30 37 4 -26 -14 31 81 50 31 -41 -64 -84 -14 61 113 90 51 -17 -47 -26 9
3052 9 18 3 -10 -40 -34 18 70 85 69 -24 -82 -96 -73 -21 55 83 70 15 -8 -42 -5 5 -7 3 -48 -72 -25 20 104 107 31 -43
3084 -43 -88 -117 -79 10 49 71 48 -33 -13 -16 23 27 23 -36 -71 -42 -18 70 113 90 49 -47 -96 -100 -23 30 42 55 -18 8 21 25 54
3117 54 28 -42 -84 -106 -34 4 108 104 74 -20 -64 -94 -43 -7 2 26 -9 -36 -14 54 77 70 20 -45 -129 -133 -47 50 112 119 62 -51
3149 -51 -55 -38 -32 -19 25 -37 -32 -35 7 50 100 37 0 -77 -89 -86 -12 53 95 56 29 -17 -41 1 -7 -11 -30 -60 -45 9 42 104 103 28
3183 28 -33 -84 -105 -62 20 44 52 30 -32 -18 -24 15 16 1 -38 -83 -84 23 92 90 82 31 -47 -57 -59 -5 4 75 21 11 -16 28 3 32
3217 32 35 -22 -73 -85 -90 22 91 127 65 10 -53 -59 -39 10 11 21 -16 0 -14 11 74 24 44 -67 -89 -90 -42 60 55 109 50 -20
3249 -20 -51 -46 -21 25 33 -14 -22 2 -1 53 91 64 -1 -83 -119 -82 -2 79 90 49 4 -22 -36 -51 0 -2 -35 -41 -77 -25 28 89 71
$$ packed form
3020g2mnO5R8L5l7r8p1oJ3L8P4Pl3l0J2M5N0l1j9p2k3k0P0P5N2k3l9o8l0K1L5
3052IRj5j3l0ON2N2J5j6r3n8j4K3N2P6K8j3n5k3l4L7J0j2J0n1k4M7M5Q4Lp6p4
3084d3m5k9L8Q9L9K2k3q1K0lL9Mmn9l5K9K4Q8M3k3m1r6m9mP7N3J2J3p3K6J3MK9
3117E4k6p0m2k2P2L8J04ml0r4m4l0N1L6RK4l5k7K2O8K3pn0o5q4mQ6R7O2Pn7j13
3149e1mJ7OJ3M4o2NlM2M3N0o3l7p7j2LP4O5M2l9k7m6k4M2qmj9l0J5N4L3O2jp5
3183B8o1n1k1M3Q2K4Qk2o2J4oL9Jj5l9m5jJ07O9kqn1p8j0kN4RP1n4j0k7M4k5K9
3217C2Ln7n1j2nJ12O9L6o2n5o3oK0M9JJ0l7J6j4K5O3n0K0j11k2jM8J02nN4n9p0
3249b0l1NK5M6Qm7qK4lN4L8k7o5q2l6L7Q0Q1J1m1m5k6j4j5N1kl3ol6N2N3O1j8
$$ plain form
3282 71 39 -9 -92 -113 -59 34 65 67 52 -29 -35 15 62 30 1 -49 -35 -58 23 79 112 77 24 -50 -103 -93 -26 39 21 39 5
3313 5 -4 9 46 55 -3 -14 -96 -72 -42 27 63 78 43 -24 -57 -90 -45 -6 34 12 39 -40 9 32 67 54 31 -74 -94 -77 -9
3344 -9 52 67 103 29 15 -77 -75 -31 -17 -5 -19 -39 -29 33 45 80 34 -2 -81 -104 -75 -32 49 89 59 12 -15 -73 -45 9 -15
3375 -15 -18 -43 -39 -42 49 107 59 14 -37 -99 -96 -61 -18 29 78 10 -34 1 13 -4 33 -13 -64 -78 -70 -4 61 82 70 9 -62 -86 -80
3408 -80 -44 -18 41 34 5 -15 -24 -1 -2 22 -30 -71 -75 -70 29 88 107 66 -22 -67 -74 -15 10 48 47 1 -25 -5 17 63 45 1 -45 -67
3442 -67 -61 -15 51 72 60 16 -29 -26 -33 4 11 2 -8 -40 -23 13 67 79 59 -29 -49 -117 -48 9 45 90 43 13 -34 -36 -20 -17 1 -9
3476 -9 -67 -53 -4 27 66 105 29 -38 -114 -101 -49 12 31 37 11 -14 -14 -21 19 33 32 -36 -42 -37 21 39 80 75 5 -34 -72 -68 -6 24 56
3511 56 50 -6 -14 -44 10 41 7 -29 -77 -91 -29 9 91 85 37 -18 -69 -81 -36 -12 20 18 28 -9 -3 12 49 65 8 -39 -84 -50 -29
$$ packed form
3282G1l2m8q3k1N4R3L1Kj5q1oN0M7l2k9n0J4k3Q1N6L3l5n3p4n3J0O7O5j8J8l4
3313ErJ3L7Rn8j1q2K4L0O9L6J5l5o7l3l3M5L9M0k2K7p9M9K3L5j3k3j05k0J7O8
3344iO1J5L6p4j4r2KM4J4J2j4k0J0O2J2L5m6l6p9k3K9M3Q1M0l0m7k7n8K8N4k4
3375a5lk5MlR1N8m8m5n1o2LL5M3M7M9o8m4L5J2j7L7m6n1j4QO6O5K1j2o1p1k4O
3408h0L6K6N9pk9k0rK3jK4n2m1mNR9N9J9m1q8m5pN9K5L8jm6k6K0K2M6j8m4m6k2
3442f7OM6O6K1j2m4m5LpL7Prj0l2J7L6N4J2k0q8k0o8O9N7L6M5m7l0m7kJ6LJ8j0
3476in8J4M9L1L9L9p6o7p6J3N2O1J9Ok6k5%pM0J4jo8oNN8J8M1np0l9l8MO2L0L2
3511E6on6ql0N4L1l4l6m8j4O2L8Q2om8n5n1j2M5K4L2kJ0l7OJ5L7J6n7m7m5L4K1
$$ plain form
3544 -29 50 102 59 30 -6 -49 -39 -61 14 6 18 -3 -6 30 40 46 52 -2 -89 -84 -69 -1 63 67 49 -2 -20 -39 -11 -1 12 -10 -44
3577 -44 -45 -23 26 78 67 22 -31 -84 -85 -24 -3 87 69 25 -13 -18 -19 -9 5 -24 -22 -35 -31 -16 71 63 64 15 -27 -103 -91 -23 37 62
3611 62 60 -8 -29 -16 -9 -6 30 -13 -83 -56 -19 18 76 91 33 -30 -74 -101 -53 -1 47 37 -9 -16 9 13 38 51 30 -54 -39 -53 -31
3644 -31 59 74 39 38 -29 -38 -47 -38 -18 8 -21 -9 -8 -6 33 56 39 -23 -73 -56 -46 -10 49 54 42 29 -24 -19 -30 -7 13 -20 -7 -24
3678 -24 -33 15 56 40 18 -56 -74 -64 -15 38 64 59 38 5 -27 -23 3 -9 -19 -24 -47 -40 9 54 68 45 17 -63 -64 -43 -13 48 54 42
3712 42 28 -20 6 -5 41 18 17 -48 -45 -32 39 86 95 57 -7 -70 -79 -56 -9 18 -1 -1 -6 -8 2 39 6 0 -44 -81 -24 -20 36 91 74
3747 74 23 1 -48 -33 3 10 5 13 -12 6 20 30 47 18 -14 -50 -67 -40 23 81 78 44 -7 -35 -55 -44 -37 -14 -6 -11 -15 -40 -8 38
3781 38 18 9 -49 -105 -82 -5 12 64 32 0 -56 -63 -1 4 33 -7 -21 -34 -13 40 18 64 34 0 -72 -47 -53 -24 21 42 44 10 5
$$ packed form
3544b9P9N2m3k9l6m3J0k2P5qJ2k1lL6J0OOn4q7NJ5O8O4Mj8n1j8j9K8J0J3k2l4
3577d4jK2M9N2j1m5n3n3jO1K1R0j8m4l8njJ0J4k9Kj3MJ5Q7qJm9m2p6J2O8O0K5
3611F2ko8k1J3PLL6m3p0K7L7L7N8J5n8o3m4k7M8N2M8j0m6pK5MK5J3k1q4J5j4K2
3644c1R0J5l5jo7rrRK0K6k9J2JKL9K3j7o2n0J7J0L6N9Nj2j3n3Nj1K3K0l3J3j7
3678b4rM8M1j6k2p4j8J0M9N3K6nk1l3l2MK6j2j0nk3PM9M5J4k3k8q0jK1L0O1Oj2
3712D2j4m8K6j1M6k3jo5LJ3P1M7Rl8o4o3rK3M7K7j9%nkJ0L7l3om4l7N7MN6N5j7
3747G4n1k2m9J5L6PnQk5J8J4J0J7k9l2l6j7K7O3N8ll4n1k8k0J1PK3Qnmk5L2M6
3781C8k0rn8n6K3P7J7N2l2l2n6pO2NK9m0j4j3K1N3k2M6l0l4p2K5oK9M5K1Kl4n
$$ plain form
3814 5 -19 25 36 9 -2 -43 -25 -11 27 66 80 17 -17 -45 -53 -33 1 14 60 17 24 4 11 -13 27 -11 -24 -49 -53 -20 26 88 73
3847 73 40 -14 -42 -49 -4 33 26 2 -10 0 37 24 19 24 -25 -62 -75 -27 15 66 44 55 11 -66 -14 -51 -6 13 2 -4 -11 -15 39 63
3881 63 58 3 10 -46 -58 -20 40 51 26 1 -8 -2 -7 -19 -17 11 -18 -43 -21 12 38 24 15 2 -71 -102 -45 0 20 47 19 3 -29 -7
3915 -7 -15 -6 -7 0 -34 -33 -15 27 79 44 51 -8 -50 -61 -24 9 37 28 9 -10 -26 22 44 -5 8 -25 -42 -79 -22 33 58 47 2 -28
3949 -28 -71 -40 -35 0 19 -9 -16 15 7 32 10 -2 -16 -87 -45 -67 -24 67 42 29 2 -12 -56 -16 -10 14 -11 4 -29 18 33 54
3981 54 8 -3 -17 -78 -78 -8 10 36 47 39 -27 -26 -15 -18 40 -12 -15 -32 -34 1 38 45 24 15 -22 -55 -56 -19 17 81 17 25 23 -3 5 12 43
4018 43 -31 -46 -19 -13 29 44 53 3 -21 -40 -52 -28 -3 -8 28 18 -29 37 8 20 6 21 -13 -44 -47 -18 -3 66 51 11 -52 -23
4050 -23 -46 -14 1 -6 -6 -23 -35 -9 44 22 -2 10 -32 -55 -46 -14 49 47 25 11 -21 -21 -42 -41 11 20 -15 -5 -33 -4 -2 41 11 -28
$$ packed form
3814Ek4M4J1k7j1m1J8J4L8L9J4o3l4k8qK0L4J3M6m3Pk0Pk4M0l8j3k5mL3M6O2j5
3847G3l3n4k8pM5L7pk4j2J0L7j3nNm9l7j3M8M2N1k2J1m4p7N2l7M5J9j1opmN4K4
3881F3nn5Pn6j2L8O0J1k5k5rOnj2KK8k9k5K2L3K6j4rj3p3l1N7M5K0K7k8j6l2K2
3915gqRjPl4JJ8M2N2l5Pn9m2j1L7L3K8rj9j9j6M8K2m9J3l3j7l7N7N5K5j1m5l0
3949b8m3L1NL5J9k8pL1qK5k2j2j4p1M2k2M3R1k5j3k7j4m4M0OK4k5J5l3M7J5K1
3981E4m6j1j4o1%P0J8K6J1qo6JJ1lN8n2lj7kL5L7Pk1rl7l3jL7L6O4o4Qkk6QPL1
4018D3p4j5K7OM2J5Rn0k4j9j2K4K5nL6j0m7O6k9J2j4J5l4l1lK9J5O9j5m0o3K9
4050b3k3L2J5p%j7j2K6N3k2k4J2m2k3RL2O3kk2j4l2%k1JN2Rl5J0k8K9KM3l0l9
$$ plain form
4084 -28 -64 -33 -18 -14 54 23 40 -19 -46 -41 -7 6 -16 -16 -3 -19 25 52 69 33 -32 -67 -57 -33 -40 15 15 18 5 0 -20 0 -29 -18
4118 -18 -31 -38 -52 -23 -2 70 34 18 2 -55 -41 -51 9 8 30 16 8 -13 -10 -6 -13 -33 -32 -56 -23 13 37 52 22 22 -46 -28 -16 -9 6
4153 6 -3 -1 36 -13 -4 28 41 8 -4 -30 -57 -40 20 57 66 43 -21 -30 -32 -16 -8 -1 -5 -8 11 -20 19 36 29 3 -4 -61 -45 -8 38 67 29
4190 29 -24 1 -19 -21 -8 5 21 -8 -22 -54 17 12 21 -2 -25 -25 -87 -59 -27 20 75 44 -16 -33 -5 0 -3 9 -4 -35 -35 0 47 50
4224 50 39 18 -41 -56 -45 -56 14 23 52 0 -9 0 -7 6 12 13 -52 -40 -54 6 29 31 27 1 -50 -31 -46 -35 -3 16 14 -14 -9 0 11 14
4260 14 15 -3 -22 -27 -16 19 47 39 25 31 -28 -58 -2 -3 1 -3 8 -7 17 24 21 21 -22 -48 -14 -29 -29 13 57 4 31 -16 -13 -24 18 4
4296 4 22 -21 -13 14 26 20 30 43 -27 -54 -78 -18 -32 46 40 40 15 -12 -18 4 -7 1 -3 -31 -2 17 40 12 33 6 -27 -47 -64 -27
4330 -27 -22 15 -15 -11 6 -6 -9 2 15 4 -21 -35 -16 -8 34 25 19 27 -16 -51 -35 -17 60 40 15 9 -4 5 -22 -14 -1 5 -44 -56 -25 15
$$ packed form
4084b8l6L1J5MO8l1J7n9k7NL4J3k2%J3j6M4K7J7l6o5l5J0K4pN5%Lj3nk0K0k9J1
4118a8j3pj4K9K1P2l6j6j6n7J4j0O0jK2j4qk1LMpk0Jk4L3L6K4J5l0%o8J8J2PJ5
4153FrKL7m9RL2J3l3j2k6k7J7O0L7Rk3o4rkJ6QPmlJ9l1L9J7pk6pn7J6L7M6K9l8
4190B9n3K5k0kJ3J3J6k9j4l2P1nRk3k3%o2K8L2M7N5l1o0j7K8NlJ2j3l1%L5M7L
4224E0j1k1n9j5J1j1P0RK9n2rRpJ3OJo5J2j4O0K3Kmk6n1J9j5J1L2J9kk8NRJ1L
4260A4Jj8j9nJ1L5K8qj4On9l0N6jMmJ1j5K4Pl%m3k6L4j5%M2M4n3K7m7Lj1M2j4
4296DJ8m3QK7J2oJ0J3p0k7k4O0j4P8o%k5k7oK2j1Qmk8K9J9K3k8K1k7l3k0j7L7
4330b7NL7l0MJ7j2lJ1J3j1k5j4J9QM2roQm3l5J6J8P7k0k5oj3Rk7QJ3Om9j2L1M0
$$ plain form
4366 15 16 50 33 4 -21 -35 -6 14 13 -4 -17 0 17 30 34 14 12 -29 -35 -46 -9 31 26 23 -6 -5 -15 -15 11 -1 18 12 -6 -7 -7 27
4402 27 56 26 -2 -32 -62 -51 -3 18 41 18 33 -31 -14 16 -16 -16 -2 -19 -27 10 2 41 18 10 -39 -42 -31 -11 18 44 15 15 -18
4435 -18 -19 -44 -5 18 35 -31 -47 -28 -10 49 5 57 14 -17 -18 -35 -11 24 19 6 -16 -1 1 -22 42 13 -18 -16 -14 -63 11 44 39 31
4469 31 -14 -37 -33 26 -12 9 17 -28 4 11 1 21 7 18 -29 -40 -45 -2 38 41 55 13 -15 -44 -31 -13 38 8 6 3 -5 -17 3 24
4503 24 5 8 -49 -45 -26 3 27 34 48 17 -11 -6 15 23 -6 -24 -3 -30 -4 28 29 20 28 -31 -29 -32 -25 38 30 -9 20 -9 -34 2 -7 4 -5
4540 -5 -22 -27 -16 -12 16 20 4 -27 -54 -58 -15 -24 28 56 8 5 -2 6 8 41 32 -2 -24 0 -13 9 51 43 19 17 -34 -41 -9 -13 38 -8 3 11
4578 11 -4 13 9 8 6 -3 -44 -16 -16 25 23 8 13 33 -29 -11 1 12 7 30 -11 -23 -7 46 26 5 -3 -12 -33 -15 -6 51 45 31 -19 -1
4614 -1 -23 -36 20 3 2 -21 -22 -11 41 4 17 2 -33 -40 -51 -5 -5 32 43 24 -3 -10 6 35 6 11 -2 14 -12 29 41 27 32 32 0
$$ packed form
4366A5JL4j7k9k5j4K9K0jj7j3J7J7J3Mk0km1oj1L7M0nlk9Jj0%K6j2J9oj8j%L4
4402B7K9l0k8l0l0J1M8K1K3k3J5o4J7L0l2%J4j7qL7qL9k3qm9lJ1K0K9K6k9%l3
4435a8jk5L9K3J7o6j6J9J8N9m4N2m3l1jj7K4L5nj3k2J5Kk3O4k9l1KKm9P4L3nq
4469C1m5k3MN9l8K1Qm5L2Pj0K0j4J1m7j1nM3M0LJ4m2k8k9J3J8N1l0klqj2K0K1
4503B4j9Ln7MJ9K9K4PJ4l1k8NK1Qk9j8K1k7K6L2JrQn9KlPO3ql9K9k9k5L6rJ1r
4540ej7nJ1MK8Mj6l1k7mM3rN2K8m8lpQKL3rl4k2K4j3K2M2qk4kn1pL2mN1m6J1Q
4578A1j5J7mjkrm1K8%M1kj5NK0o2J8J2J1nK3m1j2J6N3k0k1qrk1J8RN7oj4n0J8
4614ak2j3N6j7jk3jJ1N2l7J3j5l5pj1M6%L7J1j9k7pJ6K9k9Nj3J6k6M1J2j4N%l2
$$ plain form
4649 0 -1 -17 2 20 20 27 -9 11 8 17 1 17 -17 -31 19 -4 19 28 20 24 11 -47 -45 -6 3 16 -4 6 -2 32 -14 41 38 19 -25 -29 -19
4686 -19 -11 31 47 46 29 -21 -31 -37 13 10 -9 -4 -20 -9 31 21 26 20 -12 -40 -72 -38 -17 30 13 19 6 -24 -31 -7 0 -17 2 -38 9
4721 9 25 18 64 -5 15 -25 -32 -19 -23 9 28 32 17 -4 0 -11 17 63 2 -2 -39 6 9 12 27 38 6 -33 -63 -19 -32 14 21 34 -3
4756 -3 23 38 29 2 17 -8 -17 -8 -41 29 56 47 31 -8 -28 -39 -13 -17 31 -2 20 11 4 1 31 42 -14 -12 -60 -45 -19 37 48 18 11 -29
4792 -29 -5 -8 -31 21 13 8 -8 -3 -4 34 -5 28 13 -81 -54 -9 -11 13 52 38 12 -26 -33 1 -15 23 -8 2 11 11 38 50 65 -16 4
4827 4 -30 -30 -15 50 16 46 7 34 17 -32 -11 20 10 -4 -42 -16 -16 27 70 28 -9 -41 -19 -14 20 29 14 15 -6 9 3 -7 19 18
4861 18 1 -55 -21 -10 10 26 66 46 -13 -28 -35 -20 12 -3 43 -27 -10 15 5 3 -16 -17 -28 -48 -12 -30 -1 40 29 6 -3 -13
4893 -13 4 -6 -12 7 -6 19 9 16 -6 41 21 11 -22 -67 -8 5 28 56 31 -2 -28 -7 -11 -7 -9 0 4 -19 22 18 50 31 -5 -15
$$ packed form
4649@jj6J9J8%Pl6K0lRj6J6l4j4N0k3K3RqMj3n8KL9RJ3k0J0qL4m6N5lj9m4mJ0
4686a9QM2J6jj7n0j0oN0lj9Nj6J1M0j0Nol2k8l2L4K1M7j7Oj3l0pK4Pj7J9m0M7
4721IJ6pM6o9K0m0pJ3mL2J9Mj5k1Mj1K8M6o1ml7M5LLJ5J1l2l9l0M4j3M6PJ3l7
4756cK6J5rk7J5k5rRl3P0K7rj6l9k0j1K6mM8l3K2rplL0J1n6Km8J5K6N6J1l0pm0
4792b9K4lk3N2qnj6NjL8l9L3j5r4K7M5kK4L9j4k6l8pL4j6L8l1J0R%K7J2J5q1K0
4827Dl4%J5O5l4L0l9K7j7m9K1L1j0j4l8K6%M3M3m2l7l2K2NL4Rj5Jk1J5oj0K6j
4861A8j7n6L4J1K0J6M0k0n9j5pJ5L2j5M6p0J7K5j0kj9jj1k0L6j8K9M1j1k3rj0
4893a3J7j0oJ9j3K5j0Pk2M7k0j0l3m5N9J3K3K8k5l3k6K1mMkRMk3M1mL2j9l6j0
$$ plain form
4927 -15 -62 -77 -5 11 35 53 12 0 -5 21 12 26 -1 -11 -12 14 8 62 41 9 -8 -44 -65 -60 0 -2 39 22 -5 -4 -20 -18 27 -15
4961 -15 -20 -47 -39 -13 14 25 36 53 3 -73 -28 15 -21 9 42 0 11 -17 15 25 27 33 1 -11 -1 24 35 61 42 0 11 -10
4993 -10 -29 -23 12 13 -1 27 -21 18 17 22 17 4 -33 -31 6 4 44 39 4 -22 -25 -28 -4 11 11 10 -9 8 5 27 26 24 -16 -30 -45 -23 7 42
5031 42 42 21 3 5 -6 -10 0 4 6 -14 -30 -5 -14 -3 27 3 -4 -53 -39 -27 -4 -11 16 27 -3 14 -41 0 20 21 15 -25 -5 0 9 31
5067 31 73 31 -38 -6 -17 -3 3 22 23 10 -10 -4 45 20 6 10 -31 -12 -28 7 32 46 8 17 -4 -32 -43 -22 23 -1 -1 -7 18 -21
5101 -21 10 37 -2 -5 -64 -20 -11 9 56 35 27 -19 -4 -32 -19 -33 17 26 -10 -3 12 1 34 -13 -26 -37 -36 -48 -13 13 13 23 23 1
5135 1 9 -10 -5 2 11 8 1 -26 -4 20 10 16 2 -37 -28 -21 23 19 20 -14 -5 -20 1 -5 21 8 -23 -33 -22 -18 25 1 27 -7 -1 -31 -41 -39 7
5174 7 -6 -10 -10 -32 15 -20 -14 14 -37 -34 -37 -12 -17 27 55 49 19 -4 -35 -33 8 -4 -7 30 24 12 21 8 53 18 -33 -59 -26 -21 -11 8 -18
$$ packed form
4927a5m7j5P2J6K4J8m1j2nK6rJ4k7j0jK6oN4k1l2j7l6k1NO0kM1j7k7Jj6KM5m2
4961a5nk7QK6K7J1J1J7n0p6M5M3l6L0L3m2J1k8L2J0KOl2j2J0K5J1K6j9m2J1k1
4993a0j9OL5Jj4K8m8L9jNnj3l7KL7kM0nl5k6llK4J5%jj9J7lK2jkm0j4j5K2L0L5
5031D2%k1j8Kj1mJ0MKk0j6K5rJ1L0k4pm9J4J2K3pK7J1l0J7n5M1K0Jom0K0NRK2
5067C1M2m2o9L2j1J4OJ9Jj3k0OM9k5j4Mm1J9j6L5K5J4l8Rk1k8j1K1M5k4%oK5l9
5101b1L1K7l9ln9M4RK0M7k1qm6J5k8J3j4N0Rl6PJ5j1L3m7j3j1Jj2L5K6%J0%k2
5135AQj9NPRlpk7K2K4j0Oj4l9RPM4mJl4Rj5K1oK6j3l1j0J1MM3k4K6l4Ol0j0KM6
5174Gj3m%k2M7l5OK8n1LlK5nM4K8ol0k3l1KM1j2lL7oj2Rj3M5l5n1k6L3NJ0J9k6
$$ plain form
5211 -18 18 -30 -16 -35 -23 -23 1 2 11 -11 -18 40 2 6 -4 -18 -32 -22 33 -3 34 28 1 -29 -17 -25 9 16 4 -4 -13 32 -1 2 24 -6
5247 -6 -14 -57 -44 -40 -15 15 7 -12 -18 -6 -24 14 10 -16 11 -32 -52 0 -23 40 25 -7 -3 -35 -21 0 45 7 -2 13 -12 16 -20 12
5281 12 30 13 -33 -5 -18 0 55 3 34 -41 -19 -3 -45 -14 7 0 13 -22 -6 -12 14 11 9 -33 -30 -31 -3 1 24 39 23 14 3 15
5315 15 -11 31 3 9 -1 5 -17 31 17 19 23 -20 -17 -65 -3 62 -11 30 1 -20 -28 -13 -30 -3 -34 -14 -16 -29 11 10 2 15 -1 -11 -21
5350 -21 -16 -42 22 29 11 7 -1 -47 -12 16 -27 -9 -15 -26 7 40 52 51 8 -19 -23 -6 -22 13 -4 35 40 -5 -20 -2 12 10 -15 -16 -24 3
5386 3 -2 37 21 30 -23 -1 -49 -8 0 3 19 6 13 19 -12 21 19 19 -17 -1 -22 -5 10 44 29 16 14 -32 -30 -19 -19 -3 29 9 -8 -8 20
5423 20 -7 3 -9 -16 -34 -1 -9 18 51 3 1 -24 -20 -16 -13 -15 0 -6 -6 -17 24 40 39 36 -34 -26 -26 -28 22 33 59 17 2 -3 -3 -8 10 16 0
5462 0 -26 -41 -3 34 34 29 -7 -38 -43 -6 -14 20 29 19 28 21 -31 -35 -18 -37 -4 -29 -27 6 1 29 30 29 -7 -26 -2 -54 -12 -6 9 2 -4 -10 -2
$$ packed form
5211a8L6m8J4j9J2%K4JRk2pN8l8Mj0j4j4J0N5l6L7ok7l0J2qL4Pj2qrM5l3LK2l0
5247fqm3J3MK5L0qj9oJ2j8L8mk6K7m3k0N2k3O3j5l2Ml2J4K1M5l8rJ5k5K8l6L2
5281A2J8j7m6K8j3J8N5n2L1p5K2J6m2L1K1pJ3l5J6oK6lkm2LjK8MK3J5j6rj1J2
5315A5k6M2k8Oj0Ok2M8j4KMm3Lm8O2O5p3M1k9k1qJ5j7K7l1K0kj3M0jqJ3j6j0j0
5350b1Nk6O4Pj8mqm6L5K8m3J8oj1L3L3J2jm3k7mJ7j6L5j7L9Nm5j5J8J4kk5jqK7
5386CnL9j6Rn3K2m8M1QLJ6j3POl1L3k%l6J6k1J7J5L4j5j3km6KJ1%J6L2k0j7%K8
5423B0k7J0j2pj8L3qK7L3m8kk5MMLkJ5o%j1M1J6jlp0Q%kN0J1K6m2j5n%nJ8Oj6
5462@k6j5L8L7%nl6l1nL7qL4Rj0Rpn2mJ7j9L3k5KL3nK8Jjl6j9K4n2M2OJ5pooQ
$$ plain form
5501 -2 4 -2 -13 -14 -55 -24 -14 21 9 23 -8 -1 -48 -46 -14 6 9 -2 -22 -1 -12 -12 43 37 13 -14 12 -33 37 31 20 33 5 -18 -18 -13
5537 -13 2 -3 5 -2 4 9 26 26 5 10 9 -22 -48 -36 -2 14 31 -1 0 -18 -8 2 -33 15 -1 -19 -14 -12 39 54 35 25 -16 -17 -9 7 28
5574 28 20 43 34 1 1 14 -5 33 -17 -33 7 2 38 12 58 -7 11 -18 -9 -48 -23 -2 35 -4 -13 -17 -4 0 9 -12 -35 -32 -26 -23 33 65
5610 65 52 30 26 7 -20 -8 28 35 13 6 11 -5 30 20 9 3 -29 -32 -34 5 -10 57 -4 5 10 -22 -30 -35 -10 2 -27 -21 19 10 38 13 -9
5647 -9 -13 -51 -25 -23 4 38 41 49 3 -6 -16 6 8 26 22 11 -49 10 28 0 13 -18 -14 -36 -50 8 31 48 -13 -4 12 -30 -7 1 34 -20
5683 -20 -40 -29 -7 8 17 40 24 5 -15 -35 -10 5 26 23 21 38 4 -3 2 20 2 -20 -21 -45 7 42 40 -4 13 -23 -42 -38 1 10 -8
5718 -8 19 10 -9 6 5 -22 25 -7 -9 -54 -6 4 11 23 31 -4 -30 -30 -38 11 -17 27 0 16 17 10 29 18 24 -28 -19 -25 -5 6 16 21 8
5755 8 17 16 -25 -26 -13 -9 -31 -7 -6 -19 13 -25 21 4 -10 -34 -13 -4 9 33 18 -11 -2 14 -3 0 3 -10 -9 0 -10 28 24 53 20 -14 -9
$$ packed form
5501bOoj1jm1L1J0L5j2J4l1Pm7KL2K0Lj1k0K1j1%N5ok4k7K6m5P0oj1J3k8k3%N
5537a3J5nQpONJ7%k1Njl1k6J2L4J6J7l2Jj8J0J0l5M8j6j8NKN1J5j9j0m1jQJ6K1
5574B8qK3rl3%J3j9L8n0j6M0nL6k6M6o5J8k9Rl9K5K1L7l9rmJ3MRk1k3LOLN6L2
5610F5j3k2mj9k7J2L6Pk2pNj6L5j0j1ol2lkL9j5O7o1RNl2qnK5J2k9OM0rK8k5k2
5647iml8K6KK7L4LQm6rj0K2KJ8mj1o0N9J8k8J3l1Mk2j4N8K3J7o1RJ6m2K3QL3n4
5683b0k0J1K2J5RK3j6j9k0k0K5J5K1lkJ7l4pNJ8j8k2jk4N2L5km4J7l6j9ML9Rj8
5718hK7rj9J5jk7M7l2km5M8J0PJ2Ql5k6%qM9k8M4k7J6JpJ9j1On2RoK0J1J0Nj3
5755HRjm1jJ3Mk2K4Jj3L2l8M6j7j4k4K1RJ3K4j5k9RJ6j7LLj3JRj0L8mK9l3l4N
$$ plain form
5792 -9 -26 -16 -6 7 37 55 3 6 1 4 15 -36 -19 -5 -10 -12 5 20 5 21 -11 -13 8 10 26 25 22 2 0 22 18 12 -8 34 -11 -11 -17 -15
5830 -15 27 67 61 17 -16 -15 -26 -12 20 29 0 -15 -22 21 26 7 18 -24 -30 -33 -49 31 20 23 12 6 -16 -18 7 -1 43 7 -3 -9 25 42
5866 42 48 43 24 -20 -41 -10 -18 34 64 25 45 -26 -12 27 -14 4 26 -3 -22 -8 -14 -6 24 29 -11 -53 -39 -28 -14 32 12 -2 27
5899 27 -23 -20 -6 23 -1 -17 -5 -36 3 54 39 49 39 5 -10 -43 -9 -5 13 7 -15 37 12 -5 -12 32 -4 -21 -17 -30 5 28 22
5932 22 10 12 -7 -51 -25 7 -13 0 -4 -10 9 24 7 31 12 -5 -24 -39 -15 10 60 33 20 -4 -1 -40 7 8 -6 7 2 22 -21
5965 -21 10 42 22 -5 -36 -52 -51 -21 25 47 14 23 -7 12 -10 -9 0 -15 -19 -30 22 21 26 50 11 -5 -30 -54 -19 2 1 34 31 15 26
6000 26 6 5 11 -15 -25 -33 -1 -5 5 41 32 21 -22 -48 -22 -19 -7 -10 -24 5 2 -9 -3 8 -25 -22 -50 -18 -37 8 36 -3 31 1 2 -4
6036 -4 20 20 4 16 26 28 -5 -15 29 21 -4 -4 -48 -36 -43 4 4 18 -2 -10 -40 -52 -19 -2 -12 -5 -9 -22 -3 5 -3 41 1 -54 -40 -38 -7
$$ packed form
5792ij7J0J0J3L0J8n2LnLJ1n1J7J4nkJ7J5j5J6l2kK1KJ6jlk0kK2mok0M2m5%oK
5830a5M2M0om4l3Jj1J4L2Rk9j5pM3Nj9J1m2olj6Q0j1Lj1ok2kK5qM4l6j0oL4J7
5866D2Onj9m4k1L1qN2L0l9K0p1J4L9m1J8K2k9j9J4oQL0Nm0m2J4J1J4M6k0j4K9
5899B7n0LJ4K9k4j6J2l1L9N1j5J0j0l4j5l3L4MJ8ok2N2k5j7pM4l6j7Mj3L5K3o
5932B2j2Kj9m4K6L2k0J3moJ9J5j7K4j9j7j9j5K4K5N0k7j3k4Ll9M7Jj4J3nK0m3
5965b1L1L2k0k7l1j6JL0M6K2l3Rl0J9k2JRj5mj1N2jNK4l9j6k5k4L5K1jL3lj6J1
6000B6k0jOk6j0qL2mJ0L6rj1m3k6K6LJ2lj4K9lj1OJ1l3Lk8L2j9M5K8l9L4l0Jo
6036dK4%j6J2J0Kl3j0M4qk5%m4J2pM7%J4k0ql0j2L3J7j0Pmj3J9QqM4m0n5J4KL1
$$ plain form
6073 -7 16 54 23 23 -17 15 -18 -21 25 -27 7 5 -9 16 -9 30 15 -23 -27 -5 -23 0 28 -18 7 -11 -40 -34 10 0 16 -2 -4 -2
6107 -2 -11 -1 12 -5 -1 1 -45 -15 15 17 31 36 34 7 3 50 42 0 -19 16 -18 -8 18 14 37 37 4 -14 7 -22 -17 12 -2 14 2 -17
6143 -17 -7 -6 -2 -8 -6 -39 -55 5 26 41 45 30 4 -22 -22 12 5 -18 41 4 6 -14 7 35 40 49 -1 -14 10 -6 20 23 25 -2 -19 -8
6179 -8 -5 2 -8 -24 -21 -1 -16 -11 -10 23 -8 -18 -40 -17 10 12 14 16 45 9 -6 -43 4 23 18 -9 21 2 34 43 24 8 -6 -32 -3 -27
6215 -27 0 -6 26 33 -2 -18 7 24 1 10 13 -1 -43 -21 4 32 -10 49 -15 -13 -31 -16 -8 10 48 19 11 -3 -1 -3 22 13 -10 -1 -18 13
6251 13 9 20 42 8 10 -28 -22 -2 2 19 14 -18 19 3 -10 34 14 13 -32 -26 -27 -27 17 7 -13 3 -7 3 -30 -11 -25 11 4 -7 8
6286 8 12 37 29 52 4 -34 -27 -6 2 17 5 7 -19 -22 -5 36 23 -42 -23 5 -9 -25 3 27 29 32 -32 -37 -44 -23 16 -2 14 18 6 12 -6
6323 -6 15 28 -6 9 -12 -9 34 13 27 44 -10 2 -7 -28 16 -7 20 36 19 15 10 -7 22 -2 -8 -26 -26 -29 3 38 8 11 11 -20 -30
$$ packed form
6073gK3L8l1%m0L2l3lM6n2L4kj4K5k5L9j5l8mK2j8K3K8m6K5j8k9OM4j0J6j8kK
6107brJ0J3j7MKm6L0L0KJ4Nkk7mM7qm2j9L5l4J0K6mK3%l3j8K1k9NK9j4J6j2j9
6143a7J0JMoKl3j6O0K1J5Mj5k6k6%L4pk3N9l7Kk0K1K8NRn0j3K4j6K6LKk7j7J1
6179hLPj0j6LK0j5NJL3l1j0k2K3K7KKKK9l6j5l7M7J9nk7L0j9L2Rj9j6j4k6K9k4
6215b7K7oL2Pl5j6K5J7k3RLj4m2K2K5K8m2N9o4Kj8J5QJ8L8k9qj4KkK5rk3Rj7L1
6251A3mJ1K2l4Kl8OK0MJ7nl2L7j6j3M4k0jm5Oj%M4j0k0J6j0J0l3J9j4L6pj1J5
6286HMK5qK3m8l8PK1QJ5j2Kk6lJ7M1j3o5J9K8j4j6K8K4KLo4npK1L9j8J6Mj2Oj8
6323fK1J3l4J5k1LM3k1J4J7n4J2rk1M4k3K7J6j7mnj7K9k4oj8%lL2L5l0L%l1j0
$$ plain form
6358 -30 -8 9 23 37 -29 -3 10 16 30 -10 -25 3 -3 -37 -5 30 71 24 -9 -4 -24 -5 1 20 13 -9 -15 -1 14 8 22 5 -3 -36
6392 -36 15 -22 -4 43 20 43 -15 -9 -2 -25 -4 -15 13 -4 -9 -9 19 7 24 23 -19 -5 -31 17 2 9 29 0 -19 -47 0 10 5 26
6426 26 -9 -19 -27 7 30 26 28 10 15 -3 -58 -26 -10 22 -15 10 4 -5 25 17 -7 -23 1 -22 -17 2 17 70 14 -1 11 -14 5 3 -10
6461 -10 15 -4 4 10 -2 10 46 27 -47 -26 4 14 28 -7 15 31 -34 -33 26 -6 -7 -11 -26 12 -22 11 20 9 -7 -16 -16 -18 -26 -3 36
6496 36 30 34 -14 2 -19 20 -10 15 17 -21 -1 -6 32 56 13 0 -20 9 -17 19 23 23 17 -11 -16 -12 -11 35 14 -28 -10 -19 -17 -3 46 -21
6532 -21 -23 1 -10 -17 -13 -14 -3 18 12 28 15 23 20 1 4 -11 -37 -28 -21 -6 37 9 2 2 -19 -37 -42 -26 -15 39 -13 1 -26 -11 -6 15 -29
6569 -29 -21 -35 -39 -8 16 13 14 -6 6 -6 20 -16 -6 -1 26 -3 17 17 14 4 0 -15 -22 -32 -11 4 14 13 11 5 -17 -25 -17 5 20 -19 -16 -42
6607 -42 0 -7 5 8 -16 5 -23 -16 -20 15 24 1 14 27 13 -6 14 38 23 -3 -14 -5 5 5 0 11 42 0 -24 -3 -22 11 37 -17
$$ packed form
6358c0K2J7J4J4o6K6J3OJ4m0j5K8ol4L2L5M1m7l3Nk0J9OJ9pk2oJ4J5oJ4j7ql3
6392c6N1l7J8M7k3K3n8OPk3K1j1K8j7n%K8j2J7jm2J4k6M8j5PK0k9j9k8M7J0nK1
6426B6l5j0qL4K3mKj8Nj8n5L2J6L2l7K5orL0qk4j6K4k3NJ9J5N3n6j5J2k5J9kj3
6461a0K5j9QOj2J2L6j9p4K1L0J0J4l5K2J6o5JN9l2jmj5L8l4L3Rj1j6r%kqK3L9
6496C6oMm8J6k1L9l0K5Kl8K0nL8K4m3j3k0K9k6L6M%ok8nMJM6k1m2J8rKJ4M9o7
6532b1kK4j1pMjJ1K1oJ6j3Qlj9Lj5k6RPJ5M3k8p%k1j8nJ6J1N4n2J4k7J5NK1m4
6569b9Qj4mL1K4lJk0J2j2K6l6J0NK7k9K0%lj0mj5pj0K1J5J0jkok2qQK2J5l9Lk6
6607d2M2pJ2Lk4K1k8PmL5Rk3J3J3j4j9K0K4j5k6j1RJ0%nJ1L1m2k4K1j9L3K6n4
$$ plain form
6641 -17 22 -8 -14 23 26 -19 -18 -19 -14 -20 7 28 22 2 -4 1 -3 15 10 -3 4 -19 0 3 15 0 3 3 -32 -17 -15 26 32 28 16 -5 -6 -1 -2 11 39
6682 39 10 -49 1 5 8 24 -7 9 13 -7 -18 11 -13 19 29 22 25 -36 -24 -11 -17 -6 0 -9 21 13 6 34 69 12 -10 -4 -11 9 10 20 6
6719 6 -7 11 -28 -3 5 -7 -31 -1 -31 16 -7 -8 -9 18 0 -17 -17 -43 -24 31 -7 3 9 8 4 23 -1 25 -51 -20 -27 5 11 27 48
6754 48 18 -1 -7 17 -33 19 3 11 -18 22 28 9 -8 9 -19 -21 -15 2 -14 -9 13 -5 0 -16 10 -20 -13 -9 1 4 15 -8 20 35 26 21
6790 21 45 2 -17 -16 11 44 12 -15 -1 18 -10 7 23 18 -14 -11 -5 -6 1 0 -4 11 -13 -17 -48 -42 -17 -13 11 -21 -14 5 -7 7 -28 -14
6826 -14 -21 -33 -26 4 30 38 28 -15 -27 -50 -14 13 29 28 -16 5 -25 36 35 -19 -18 -6 -20 0 15 -30 11 3 12 9 -16 -26 -5 -36 -10
6861 -10 -20 -3 1 -14 6 9 8 -15 -24 -38 0 -11 11 35 13 28 -4 -11 -30 -9 25 25 -9 2 17 -10 25 30 8 -10 -26 -18 7 1 2
6896 2 33 15 -22 -16 -20 26 -6 7 -34 41 -10 12 20 42 54 27 -13 -5 -16 -19 -17 35 -12 -8 -5 20 -5 1 16 -2 20 4 15 12 39 16
$$ packed form
6641a7L9l0oL7Lm5JjNoK7K1ok0oNmJ8nj3Pk3J9LJ2j5L%l5J5KM1Omj2k1jNjJ3K8
6682C9k9n9N0MLJ6l1J6Mk0j1K9k4L2J0pLo1J2J3oJ1OrL0qpK8L5n7k2OpK0JJ0j4
6719Fj3J8l9K5Qj2k4L0l0M7k3jjK7j8j7%k6J9N5l8J0OjmJ9k4K6p6L1pL2OJ6K1
6754D8l0j9oK4n0N2j6Qk9M0Oj9j7J7k8kOJ7j6NK2j8Nj6K6l0PMJ0LJ1k3K8J5rn
6790B1K4m3j9JK7L3l2k7J4J9k8J7J6nl2LOjPjmJ5k4ml1OK5MK4l2PJ9j2J4l5J4
6826a4pj2PL0K6Qj0m3j2k3L6K7J6jm4K1l0O1jn4JJ2j4K0J5m5M1qRlk5j0K1l1K6
6861a0j0J7Mj5K0Ljk3rj4L8j1K2K4k2J5l2pj9K1L4%l4J1J5k7L5Nk2j8j6QK5oJ
6896BL1j8l7OmM6l2J3m1P5n1K2QK2J2k7m0Qj1lKN2m7MLK5k5OJ5j8K2j6J1lK7k3
$$ plain form
6932 16 9 4 1 -42 -13 0 12 -22 -32 -9 -12 -24 26 4 -6 -24 -21 14 -21 16 1 22 7 14 -39 -16 1 29 23 20 34 8 9 9 -1
6967 -1 -4 3 -22 -2 -5 46 19 35 10 -1 -42 -10 -2 -12 -10 7 -15 -24 0 14 -8 16 -14 12 1 -29 -26 -21 25 6 -31 28 2 -15 -15
7002 -15 27 9 5 16 -36 10 12 23 19 -2 -21 17 14 -3 -1 3 29 17 -8 -15 2 -20 -3 3 -50 -10 -21 13 -14 25 -12 -8 -9 -45 -23
7037 -23 4 -23 25 9 9 29 0 23 -9 -4 6 -3 11 32 31 12 36 6 -5 -10 -7 20 18 -3 -7 3 -6 1 -5 -13 -10 11 -19 -19 10 -21 -10
7074 -10 -3 16 -29 -13 9 -22 21 3 18 -11 12 -9 7 32 1 10 3 -26 -7 6 -4 10 28 -1 40 -20 -14 -29 10 13 -26 13 11
7107 11 -5 9 -8 -11 -8 -31 -29 -11 9 7 38 40 14 -14 -25 15 17 -8 -2 -4 7 27 -3 35 21 -15 -35 -41 -34 -3 -2 15 37 6 33 -11
7143 -11 -19 -24 1 2 -8 -33 -12 13 16 6 -29 -2 -51 -35 -3 -6 -8 7 41 13 1 25 11 -1 12 28 -9 -9 -35 20 7 35 61 8
7177 8 -7 -17 3 11 2 -4 -5 15 27 -26 9 23 -17 1 -5 -6 -10 12 26 8 -25 3 -31 0 6 3 7 4 -11 -11 30 24 12 13 21 -8 8 17 34
$$ packed form
6932A6pnlm3K9J3J2l4j0K3lj2N0k2j0j8LL5l5L7j5K1j5Pn3K3J7K8olJ4k6J%j0
6967alPk5K0lN1k7J6k5j1m1L2Qj0KJ7k2rK4J4k2K4l0K6j1l0LNM6j9l7N9k6j7%
7002a5M2j8mJ1n2M6KJ1mk1j9L8lj7KMK6j2k5pJ7k2J7On3M0j1L4k7L9l7Mjl6K2
7037b3K7k7M8j6%K0k9K3l2NJ0rJ4K1jj9K4l0j1nLK7kk1mJ0rPoqLK1l0%K9l1J1
7074a0PJ9m5J6K2l1M3j8J5k9K3k1J6K5l1Rpk9J9J3j0J4J8k9M1o0Oj5L9Ll9L9k
7107A1j6J4j7lLk3KJ8K0kL1Kk6k8j1M0Kk5OkJ1K0l0L8j4l6k0oPL1JJ7K2l1K7m4
7143a1qnK5Jj0k5K1K5Lj0l5K7m9J6L2lkJ5L4k8j2K4j4j2J3J6l7%k6N5j3K8K6n3
7177Hj5j0K0QrojK0J2n3L5J4m0J8ojmK2J4j8l3K8l4L1OlMlj5%M1oj2JQk9J6RJ7
$$ plain form
7216 34 29 39 32 24 6 -12 23 0 8 9 4 -10 0 -16 38 23 4 -16 -10 9 -15 -20 4 36 -12 -18 12 25 -1 0 -3 -10 6 -22 -12 16
7252 16 8 16 -6 -2 -23 -12 -13 -12 24 18 -18 11 11 0 8 -9 -18 -15 -20 0 -1 -17 36 -3 20 -41 0 -23 -18 -3 -12 13 4 28 -12 -8 9 4 -21
7291 -21 -5 -26 -23 -15 7 -4 3 7 -2 -59 -15 -14 -13 -16 5 21 1 17 -11 -20 10 -9 8 -17 -2 12 1 -4 -6 -45 -36 -17 -12 1 -9 -26 6
$$ packed form
7216C4nJ0pqj8j8L5k3QJnj4J0j6N4j5j9k0OJ9k4nK4L2m8oL0J3k6JlpJ6k8J0K8
7252A6qQk2Mk1J1jJL6ol6K9%j1Qj7rLnK0jj6N3l9K3o1M1k3NJ5rK5rK4m0MJ7nk5
7291b1J6k1LQK2j1PMrn7M4JJlK1J6k0J6k8rL0j9J7k5J5J4j1nkl9RJ9NJ3j0j7L2
$$ [...]
8191G
##END NTUPLES=NMR FID
##END=
