##TITLE=1H_ES-DMS
 CDCl3
 8 sc, 
 8.2.2024
##JCAMPDX= 6.0         $$ Bruker NMR JCAMP-DX V2.0
##DATA TYPE= NMR FID
##DATA CLASS= NTUPLES
##ORIGIN= UXNMR, Bruker Analytische Messtechnik GmbH
##OWNER= root
$$ XWIN-NMR		Version 3.5
$$ Thu Feb  8 14:32:00 2024 Russian Standard Time (UT+4h)  she@DPX200
##.OBSERVE FREQUENCY= 200.1313
##.OBSERVE NUCLEUS= ^1H
##.DELAY= (6, 6)
##.ACQUISITION MODE= SIMULTANEOUS
##.ACQUISITION SCHEME= undefined
##.AVERAGES= 8
##.DIGITISER RES= 18
##SPECTROMETER/DATA SYSTEM= spect
##.PULSE SEQUENCE= zg30
##.SOLVENT NAME= CDCl3
##.SHIFT REFERENCE= (INTERNAL, CDCl3, 0, 15.7039)
##AUDIT TRAIL= $$ (NUMBER, WHEN, WHO, WHERE, WHAT)
$$ ##TITLE= Audit trail, XWIN-NMR		Version 3.5
$$ ##JCAMPDX= 5.01
$$ ##ORIGIN= Bruker BioSpin GmbH
$$ ##OWNER= she
$$ F:/spectra/data/she/nmr/H-F/1/audita.txt
$$ ##AUDIT TRAIL=  $$ (NUMBER, WHEN, WHO, WHERE, WHAT)
(   1,<2024-02-08 14:30:46.37 +0400>,<she>,<DPX200>,
      <created by zg, POWCHK disabled, PULCHK disabled
       configuration hash MD5:
       00 E9 B6 7A A2 85 ED C7 34 08 36 98 17 FE 4E 26
       data hash MD5: 16K
       BA E3 BE 8A 6B 01 C9 55 BB 91 D4 CA 2E EF 86 22>)
$$ ##END=
$$ 
$$ hash MD5
$$ 32 6A C8 F5 70 35 69 DF 86 5A B6 3A 69 D4 AC 0C
##$RELAX= 
##$RELAX= 
##$RELAX= 
##$RELAX= 
##$RELAX= 
##$RELAX= 
$$ Bruker specific parameters
$$ --------------------------
##$DU= <F:/spectra>
##$EXPNO= 1
##$NAME= <H-F>
##$PROCNO= 1
##$TYPE= <nmr>
##$USER= <she>
##$AMP= (0..31)
100 100 100 100 100 100 100 100 100 100 100 100 100 100 100 100 100 100 
100 100 100 100 100 100 100 100 100 100 100 100 100 100 
##$AQSEQ= 0
##$AQ_mod= 1
##$AUNM= <au_zg>
##$AUTOPOS= <>
##$BF1= 200.13
##$BF2= 200.13
##$BF3= 200.13
##$BF4= 200.13
##$BF5= 200.13
##$BF6= 200.13
##$BF7= 200.13
##$BF8= 200.13
##$BYTORDA= 1
##$CFDGTYP= 0
##$CFRGTYP= 5
##$CHEMSTR= <none>
##$CNST= (0..31)
1 1 145 1 1 1 1 1 1 1 1 1 1 1 1 1 1 1 1 1 1 1 1 1 1 1 1 1 1 1 1 1 
##$CPDPRG= <>
##$CPDPRG1= <>
##$CPDPRG2= <>
##$CPDPRG3= <>
##$CPDPRG4= <mlev>
##$CPDPRG5= <mlev>
##$CPDPRG6= <mlev>
##$CPDPRG7= <mlev>
##$CPDPRG8= <mlev>
##$CPDPRGB= <>
##$CPDPRGT= <>
##$D= (0..31)
0 1.2 0 0 0 0 0 0 0 0.06 0 0.03 0 0 0 0 0.0002 0 0 0 0 0 0 0 0 0 0 0 0 
0 0 0 
##$DATE= 1707388245
##$DBL= (0..7)
120 120 120 120 120 120 120 120 
##$DBP= (0..7)
150 150 150 150 150 150 150 150 
##$DBP07= 0
##$DBPNAM0= <>
##$DBPNAM1= <>
##$DBPNAM2= <>
##$DBPNAM3= <>
##$DBPNAM4= <>
##$DBPNAM5= <>
##$DBPNAM6= <>
##$DBPNAM7= <>
##$DBPOAL= (0..7)
0.5 0.5 0.5 0.5 0.5 0.5 0.5 0.5 
##$DBPOFFS= (0..7)
0 0 0 0 0 0 0 0 
##$DE= 6
##$DECBNUC= <off>
##$DECIM= 32
##$DECNUC= <off>
##$DECSTAT= 4
##$DIGMOD= 1
##$DIGTYP= 9
##$DL= (0..7)
0 120 120 120 120 120 120 120 
##$DP= (0..7)
150 150 150 150 150 150 150 150 
##$DP07= 0
##$DPNAME0= <>
##$DPNAME1= <>
##$DPNAME2= <>
##$DPNAME3= <>
##$DPNAME4= <>
##$DPNAME5= <>
##$DPNAME6= <>
##$DPNAME7= <>
##$DPOAL= (0..7)
0.5 0.5 0.5 0.5 0.5 0.5 0.5 0.5 
##$DPOFFS= (0..7)
0 0 0 0 0 0 0 0 
##$DQDMODE= 0
##$DR= 18
##$DS= 0
##$DSLIST= <SSSSSSSSSSSSSSS>
$$ [...]
##$SUBNAM2= <"">
##$SUBNAM3= <"">
##$SUBNAM4= <"">
##$SUBNAM5= <"">
##$SUBNAM6= <"">
##$SUBNAM7= <"">
##$SUBNAM8= <"">
##$SUBNAM9= <"">
##$SW= 18.0517328524113
##$SWIBOX= (0..15)
0 0 2 0 0 0 0 0 0 0 0 0 0 0 0 0 
##$SW_h= 3612.71676300578
##$TD= 16384
##$TD0= 1
##$TE= 0
##$TE2= 300
##$TE3= 300
##$TEG= 300
##$TL= (0..7)
0 120 120 120 120 120 120 120 
##$TP= (0..7)
150 150 150 150 150 150 150 150 
##$TP07= 0
##$TPNAME0= <>
##$TPNAME1= <>
##$TPNAME2= <>
##$TPNAME3= <>
##$TPNAME4= <>
##$TPNAME5= <>
##$TPNAME6= <>
##$TPNAME7= <>
##$TPOAL= (0..7)
0.5 0.5 0.5 0.5 0.5 0.5 0.5 0.5 
##$TPOFFS= (0..7)
0 0 0 0 0 0 0 0 
##$TUNHIN= 0
##$TUNHOUT= 0
##$TUNXOUT= 0
##$USERA1= <user>
##$USERA2= <user>
##$USERA3= <user>
##$USERA4= <user>
##$USERA5= <user>
##$V9= 5
##$VALIST= <valist>
##$VCLIST= <CCCCCCCCCCCCCCC>
##$VD= 0
##$VDLIST= <DDDDDDDDDDDDDDD>
##$VPLIST= <PPPPPPPPPPPPPPP>
##$VTLIST= <TTTTTTTTTTTTTTT>
##$WBST= 1024
##$WBSW= 4
##$XGAIN= (0..3)
0 0 0 0 
##$XL= 0
##$YL= 0
##$YMAX_a= 855708
##$YMIN_a= -761837
##$ZGOPTNS= <>
##$ZL1= 120
##$ZL2= 120
##$ZL3= 120
##$ZL4= 120
##$ABSF1= 10
##$ABSF2= 0
##$ABSG= 5
##$ABSL= 3
##$ALPHA= 0
##$AQORDER= 0
##$ASSFAC= 0
##$ASSFACI= 0
##$ASSFACX= 0
##$ASSWID= 0
##$AUNMP= <proc_1d>
##$AZFE= 0.1
##$AZFW= 0.1
##$BCFW= 1
##$BC_mod= 2
##$BYTORDP= 1
##$COROFFS= 0
##$CY= 11.3945322036743
##$DATMOD= 1
##$DC= 2
##$DFILT= <>
##$DTYPP= 0
##$F1P= 15.7292609196834
##$F2P= 12.9074282941183
##$FCOR= 0.5
##$FTSIZE= 0
##$FT_mod= 4
##$GAMMA= 1
##$GB= 0.15
##$INTBC= 1
##$INTSCL= 1
##$ISEN= 128
##$LB= 0.24
##$LEV0= 0
##$LPBIN= 0
##$MAXI= 10000
##$MC2= 0
##$MEAN= 0
##$ME_mod= 0
##$MI= 1.114404
##$NCOEF= 0
##$NC_proc= 0
##$NLEV= 6
##$NOISF1= 3.799351
##$NOISF2= 2.8
##$NSP= 1
##$NTH_PI= 0
##$NZP= 0
##$OFFSET= 15.70392
##$PC= 1
##$PHC0= -24752.01
##$PHC1= 11.65268
##$PH_mod= 1
##$PKNL= yes
##$PPARMOD= 0
##$PSCAL= 0
##$PSIGN= 0
##$REVERSE= no
##$SF= 200.130013532006
##$SI= 16384
##$SIGF1= 3
##$SIGF2= 2
##$SINO= 400
##$SIOLD= 16384
##$SREGLST= <1H.CDCl3>
##$SSB= 0
##$STSI= 0
##$STSR= 0
##$SW_p= 3612.71676300578
##$SYMM= 0
##$S_DEV= 0
##$TDeff= 0
##$TDoff= 0
##$TI= <>
##$TILT= no
##$TM1= 0
##$TM2= 0
##$TOPLEV= 0
##$USERP1= <user>
##$USERP2= <user>
##$USERP3= <user>
##$USERP4= <user>
##$USERP5= <user>
##$WDW= 1
##$XDIM= 8192
##$YMAX_p= 0
##$YMIN_p= 0
$$ End of Bruker specific parameters
$$ ---------------------------------
##NTUPLES= NMR FID
##VAR_NAME=  TIME,          FID/REAL,        FID/IMAG
##SYMBOL=    X,             R,               I
##VAR_TYPE=  INDEPENDENT,   DEPENDENT,       DEPENDENT
##VAR_FORM=  AFFN,          ASDF,            ASDF
##VAR_DIM=   8192,          8192,            8192
##UNITS=     SECONDS,       ARBITRARY UNITS, ARBITRARY UNITS
##FACTOR=    0.0002768,     1,               1
##FIRST=     0,             0,               0
##LAST=      2.2672688,     0,               0
##MIN=       0,             -761837,         0
##MAX=       2.2672688,     855708,          0
$$ Real data points
##PAGE= N=1
##DATA TABLE= (X++(R..R)), XYDATA
0@%%%%%%%%%%%%%%%mJ2j5J5k0K1k2L3m0M3n2O5p4Q4r9J15j34J54j75K00k26K53
37A34k88L25l61M08m59N07n64O29o96P69q51R39j035J142j258J386j525J676j847
56i69K037k246K481k749L050l393L790m241M747n279N689n329M27O3107P94586
71H55708j39274j003111l69335L81041M78052R5416j40392r6538q5666l16193
81c40292q6107O21852N60857n08269q99699J5489Q22846M76841l63240o45895
91c45617j11651M42696K67182j55624n0614Q9933k52786l26990K96057O25514
101D78100M6152o47285n25329K78694P52656K17526n67157m57163J91500K99348
111F7042J3494K4483J06152j43048l56504r8366M04320M89360j21229o82644k90899
$$ plain form
0 0 0 0 0 0 0 0 0 0 0 0 0 0 0 0 0 -4 8 -7 8 -12 9 -13 20 -20 23 -29 36 -38 46 -53 62 -72 82 -93 107 -119 134
37 134 -154 171 -190 218 -241 266 -298 331 -365 404 -447 492 -543 599 -659 727 -798 878 -969
56 -969 1068 -1178 1303 -1446 1604 -1789 2001 -2240 2507 -2772 2917 -2412 -1985 61122 855708
71 855708 716434 -286677 -656012 -274971 203081 298497 158105 61567 -24099 -340292
81 -340292 -426399 195453 756310 248041 -651658 -636169 186677 663518 300278 -345617
91 -345617 -457268 -14572 252610 96986 46372 136305 -116481 -443471 -147414 478100
101 478100 524252 -123033 -648362 -369668 382988 600514 33357 -423806 -232306 67042
111 67042 80536 105019 211171 68123 -288381 -386747 17573 506933 385704 -296940 -587839
122e87839N19465N19527j56685m23149j11137J43374J13837L6064N9663N4942
132A68062j61913l23278L0126N08812K66033m18838m92508R6244M62026K14562
142C49328k08729k92892k8928J41589L9336K2114J57382Q246l35101k23623K82736
153h8542M22562q471m10062k78806J91652L72150M3239k52396j14467P7877N111
164d0153k2242J38505J27698j46335k77357k7662L10145K65409j66922l88471
174b27385n4466L12222J90226j19624j50367j7893Q246q706O5716J40950K9508
185A68427k14350k26874J22936L54214Q0486k97389k34410J04392K26310O1750
195A45492r6270p9389p925k3150k3254J09475J59889o7912k69529q6871K38527
$$ plain form
122 -587839 -68374 451153 294468 -128681 -239818 -96444 17393 53457 113120 168062
132 168062 6149 -317129 -287003 221809 487842 69004 -423504 -327260 134766 349328
142 349328 140599 -152293 -181221 -39632 -296 21818 179200 187446 -147655 -371278 -88542
153 -88542 334020 325549 -84513 -363319 -171667 200483 243722 -8674 -123141 -45264 -40153
164 -40153 -62395 76110 203808 57473 -219884 -247546 62599 328008 161086 -227385
174 -227385 -281851 30371 220597 100973 -49394 -67287 -59041 -67747 -2031 138919 168427
185 168427 -45923 -272797 -149861 204353 284839 -12550 -246960 -142568 83742 145492
195 145492 49222 -30167 -38092 -61242 -84496 24979 184868 116956 -152573 -239444 -917
206i17K33076p7256k55805r3403J51515J52142k4991q3613r859j7323o5642L3678
218e8398J64768O5033j71554j97815N2951K47696J08988j70392j95358L3958J54640
229C4517M7717m7820k0526j1013o4182l6740R8964J44702k5251k06682j10826
240a97140J54864K07213k4930j90123q3907Q6722R4689M093k4269l124l6749p7092
252h9753R525J46388R7023j22264j94053O659J94992J13438r7668j47845j2956
263i6514Q6780M7255o051P260n686p9839o6447Q0929J53856P494j69552j20591
275a61106R2293J68978K1157j25268q1099L9195N5969N925J0016K5448l6952r4690
287h0134j4241J24912J07694p3006j65703l0005J39138J08249n2204j08362k1008
$$ plain form
206 -917 232159 154903 -100902 -194305 -42790 109352 84361 748 -9111 -26434 -92076 -58398
218 -58398 106370 171403 -151 -197966 -145015 102681 211669 41277 -154081 -120123 34517
229 34517 82234 34414 13888 2875 -61307 -98047 917 145619 120368 -86314 -197140
240 -197140 -42276 164937 140007 -50116 -134023 -47301 47388 51481 27212 24088 -12661 -89753
252 -89753 -80228 66160 163183 40919 -153134 -146475 48517 161955 64287 -83558 -96514
263 -96514 -9734 37521 31470 38730 33044 -46795 -113242 -32313 121543 129037 -40515 -161106
275 -161106 -68813 100165 121322 -3946 -85045 -45850 10119 16044 26060 51508 14556 -80134
287 -80134 -94375 30537 138231 65225 -100478 -130483 8655 116904 64700 -43662 -64670
298f4670M5817K4142Q338L0968O876p7560p9829N2453J43487L7008j32424j23680
310a29074M8694J38990M2043p9915o8958O518K5905R082L0722M2463l0937j04205
322f8672l8182J06385J20882l4377j45268n7539R1678J00780j1856p0973k7601
333c4743J2013J060J0246N2294K9569o6893r5706J5595J25483O5986q5381j15903
345h6380N934R9174M9918l8735m5487m814j178o117L1653N7546o727r3811o0862
358i9886P0686J15959J692j10727o8759N1015Q0904J0351l9116k3220o160j4919
370c2180M926N6079M6010m8578r9734j0787J02146P7957m7722r8526k1139O2776
382h772M9795j0513k4699p559j7679k2755K6184O8290J3643p7741p1541L5692
$$ plain form
298 -64670 -18853 5289 13627 44595 51471 -26089 -105918 -53465 90022 127030 -5394 -129074
310 -129074 -80380 58610 100653 20738 -48220 -41702 -15797 -6715 24007 66470 35533 -68672
322 -68672 -106854 -469 120413 86036 -59232 -116771 -25093 75687 63831 -7142 -34743
333 -34743 -22730 -21670 -11424 40870 70439 3546 -92160 -76565 48918 114904 29523 -86380
345 -86380 -80446 18728 68646 29911 -15576 -20390 -21568 -27685 3968 61514 54787 -39024 -99886
358 -99886 -29200 86759 88451 -22276 -91035 -40020 40884 51235 12119 -11101 -17261 -32180
370 -32180 -27254 28825 74835 26257 -73477 -84264 17882 95839 48117 -50409 -71548 -8772
382 -8772 41023 30510 5811 -1748 -19427 -42182 -15998 52292 65935 -11806 -83347 -47655
394d7655R7755K9614p1371o8052J6967N5293J6821j3195n035j2123l2253p320
406d0554N0975N4782k3769q5609l3751O8771P7916j7793p4067k7541L4261L1738
418A5359M127l572m446k1890l0460J2544O2262L1888n7592p4034J3537P9004L5758
431F2485m2388n3625l418L2870K0098q82K181n921l7063k2553M3913O2382j0109
444D7970p2927m1158M1343O7348Q104n1407l5371J5243K0723M635J3093J1239
456B8835k8248m2778M249N6181L9970l2273o8411j3135O0319M4205k5292m0265
468a6643n474J2374P302J1108J3985m878l2126k8669K2486O0539J3912o1122m9256
481e6462K7499N4389J3363k7619k7425n048J0263R906J3222J7648j3681m8153
$$ plain form
394 -47655 50100 79714 8343 -59709 -42742 12551 29372 16177 11142 -981 -33234 -40554
406 -40554 10421 65203 41434 -44175 -77926 -9155 68761 50968 -23099 -50640 -16379 15359
418 15359 19486 15914 11468 -10422 -40882 -28338 33924 65812 8220 -65814 -52277 26727 62485
431 62485 20097 -33528 -36946 -4076 16022 15140 17321 11400 -25663 -48216 -4303 58079 47970
444 47970 -24957 -66115 -24772 42576 50680 -727 -36098 -20855 -132 4503 17596 28835
456 28835 587 -42191 -37942 18239 58209 25936 -42475 -55610 4709 48914 23622 -16643
468 -16643 -22117 -9743 -2441 8667 22652 17774 -14352 -43021 -20535 40004 53916 -7206 -56462
481 -56462 -28963 25426 38789 11170 -16255 -21303 -11040 -1134 12088 29736 16055 -32098
493c2098j6772N2456M8455j9769n6642k1754L2977M1703P46l0562j3500N493j888
506a1155M795K8105J0514l6331l8405J3804N0804K5970l2990n3396r69M7195K4097
519C2038j8008j7054n465q429R29K2953K3353o768l8557k9660K5711N5140O533
532D2716m9097l0179J8764K7728P697o391j0866r217n385J508K0111K4467j5941
545A5915m5928p247M4358L0953j8712l6326j2521K0825K6144M70j5286n490n711
558h556j1727J1733L5231N392l8148l1439J2874M0682K1754k3802l7848j700K5705
571A51J1103k687K644p325k1278m673K3481K4378l422l2152k3761K0482L8056
584B4997L43l0641j3224R717J0431M996L245l477j0636j1487J423K3321K0677
$$ plain form
493 -32098 -48870 3586 52041 32272 -24370 -46124 -13147 28556 29302 -1260 -14760 -9267 -11155
506 -11155 -6360 21745 32259 -4072 -42477 -28673 22131 48101 15111 -38285 -39254 7941 32038
519 32038 14030 -3024 -8489 -16918 -15989 6964 30317 23549 -15008 -44668 -18957 36183 42716
532 42716 -6381 -36560 -17796 9932 17629 11238 372 -8845 -14230 -12722 7389 31856 15915
545 15915 -30013 -37260 7098 38051 19339 -16987 -29508 -8683 17461 17931 2645 -2845 -8556
558 -8556 -20283 -8550 26681 32073 -6075 -37514 -24640 16042 37796 13994 -23854 -25554 151
571 151 11254 8567 11211 3886 -17392 -22065 1416 25794 22372 -9780 -33541 -13059 24997
584 24997 25340 -5301 -18525 -8808 1623 6619 9864 6387 -4249 -15736 -14313 9008 29685
597B9685j8765l7085j479L2879K0431j1023k2083j0304Q467J3299M306J454r66
610H816j5812j5781J2956L0827L840k7245k2148P821K5497J2719j4179j8759P25
623a0723Q694J898M765Q550q648j9354k638J9395J9275m735k6606j4359J7330
636g156K4507k343j6772o389P70K208P420Q716M07j2641j5760J363K3702J6439
650B4471j6345k5722K02J9164J0748l349r951o339O52L529N090P937O4j6729j2403
665a8981J3415K2085n01j9674j2722O793J6211O381r310q708l69m9J576J0072
679F219Q046j0619j7783j325J8027J5376n986k0382p925J2595J2987p58o764l149
693a441m449k340O930J1267J899j2934j4417L983J9905Q921j3810j5483J617J1563
$$ plain form
597 29685 10920 -26165 -27644 5235 25666 14643 -7440 -17744 -9277 4022 8328 9782 8816
610 8816 -6996 -22777 -9821 21006 24846 -2399 -24547 -16726 8771 21490 7311 -11448 -10723
623 -10723 -2029 -131 4634 13184 4536 -14818 -17456 1939 21214 16479 -10127 -24486 -7156
636 -7156 17351 15008 -1764 -8153 -7383 -5175 2245 10961 11368 -1273 -17033 -15670 8032 24471
650 24471 8126 -17596 -17394 1770 12518 9169 -782 -7121 -6469 -2940 2150 10087 10151 -6578 -18981
665 -18981 -5566 16519 16018 -3656 -16378 -9585 6626 13007 3697 -5011 -5380 -5429 -3853 6219
679 6219 14265 3646 -14137 -15462 2565 17941 11955 -8427 -16352 -3757 9230 8472 1708 -1441
693 -1441 -5890 -8230 -1300 9967 11866 -1068 -15485 -11502 8403 17324 3514 -11969 -10352 1211
707A211N918j408l933m520l536j87Q189J0348k940j7250q232J2772J7130p97j5470
722b705r517N367J0203L185k949k016m352n421J768J3038P255j0261j6271q45
736a3521J6071J2147o362j4702m496Q182O561Q17m86k419p449m526P880J3106
750A0803J844j4705j3185O136J7008O064j1039j1127M26O187M830J990K29m956
764E05q613k029J1381J2706m395j6965p640J1390J4210p2j1345o538K098M715
778e92L298K494M22o732r480K443J4629Q107j0222j6025q74J4118R965m637j0323
793c409l485K883L470L626M216k349j0293p131Q276J5830J788j4977j2669N386
807h838J4557N217p255p770j544J627K930N701M271n528j2598l281J2851J3699
$$ plain form
707 1211 7129 5721 1788 -2732 -6268 -6455 1734 12082 9142 -8108 -16340 -3568 13562 12765 -2705
722 -2705 -12222 -6855 3348 6533 3584 1568 -2784 -8205 -6437 6601 13856 3595 -12676 -13521
736 -13521 2550 14697 8335 -6367 -10863 -2681 3880 4697 4211 1792 -5657 -10183 -2303 10803
750 10803 12647 -2058 -15243 -9107 7901 13965 2926 -8201 -7775 -1588 3242 5232 5461 505
764 505 -8108 -10137 1244 13950 9555 -7410 -15050 -3660 10550 10478 -867 -7405 -5307 -592
778 -592 2706 5200 5622 -1110 -10590 -8147 6482 14589 4367 -11658 -12532 1586 11551 6914 -3409
793 -3409 -6894 -4011 -541 3085 7301 4952 -5341 -12472 -4196 11634 13422 -1555 -14224 -8838
807 -8838 5719 10936 3681 -4089 -5633 -4006 -1076 4625 8896 3368 -9230 -12511 340 14039
821A4039l805j6290p566R220J1924R88o991n054j077J66L477P555K740r252j2096
836a2022J918J5564R066r275j4785j665J1034Q129j969n761l343j882qO088Q369
851I458j327j3086r064Q374J6027K870j3383j1531L596J0977M508l105m091l345
865c122l228J505Q979P305n990j4527m508J2834J3702l008j4177o627O269Q326
879C733K057k071k988m530l761L847J0943M523j0559j3734K007J5246Q353p892
893E174j2068k091P664N508M36j216l227n350l509P650J1688j054j3798r468P840
908e821J4171L385j0587r616J899O836L146R34j59n059p324Q13J1176Q513n981
923F326j4757m688J2110J2234l106j1026m257K954M227L571K093j938p376o155
$$ plain form
821 14039 10234 -6056 -13622 -4402 7522 8510 1519 -3535 -4612 -4446 -969 6586 9326 74 -12022
836 -12022 -10104 5460 14526 5251 -9534 -11199 -165 7964 5995 234 -3109 -4991 -4999 1089 9458
851 9458 8131 -4955 -14019 -5645 10382 13252 -131 -11662 -8066 2911 7419 4314 223 -3122
865 -3122 -6350 -4845 4134 11439 5449 -9078 -13586 -752 12950 9942 -4235 -10862 -4593 3733
879 3733 5790 3719 731 -3799 -7560 -3713 7230 11753 1194 -12540 -10533 4713 13066 5174
893 5174 -6894 -8985 -1321 4187 4623 3407 180 -5170 -8679 -1029 10659 9605 -4193 -13661 -5821
908 -5821 8350 11735 1148 -8468 -6569 267 3413 4347 4188 -871 -8195 -7382 3794 12307 6326
923 6326 -8431 -13119 -1009 11225 8119 -2907 -7164 -4210 17 3588 5681 3743 -3633 -9788
937i788M434J3039N459j2124j3601K790J3807O774n854q960k480L123L979L059
951C657K639k601j0191m760J0052J2704j519j4139p936O760J2061K567q056o300
965e062Q38K238J928M779K743p602r394J248J2612P898o495j4042l607J1543R335
980H960k745p094k959p62J016N291O012j327r792p933M962J4622M810j2336j1862
995a1137L608J0393M207k753n356l017j13J849M912N447l202j2420m209J1836
1009D5J1753l769j2258n905N625R639K155n475l926j161j849K612R237K988j0143
1024d32j0449K588J2243P787o324j2663k074R191N559j946j781j891m714p93O800
1039A101O900j612r954p608O486J3848J186j2311p102M627O502K631o09l467m145
$$ plain form
937 -9788 -5354 7685 13144 1020 -12581 -9791 4016 10790 4936 -4024 -6504 -3381 598 3657
951 3657 6296 3695 -6496 -11256 -1204 11500 9981 -4158 -12094 -5334 6727 9294 1238 -5062
965 -5062 -4224 -1986 -58 4721 7464 -138 -9532 -8284 4328 12226 5731 -8311 -11918 -375 8960
980 8960 6215 -879 -3838 -4600 -3584 1707 7719 6392 -3400 -11333 -6371 8251 13061 725 -11137
995 -11137 -7529 2864 7071 4318 -1038 -4055 -4168 -2319 2593 8040 4838 -7582 -11791 45
1009 45 11798 8029 -4229 -10134 -4509 5130 7285 1810 -2116 -3277 -5126 -2514 6723 9711 -432
1024 -432 -10881 -8293 3950 11737 5413 -7250 -9324 -133 5426 3480 1699 -192 -4906 -5699 1101
1039 1101 8001 6389 -3565 -11173 -4687 9161 10347 -1964 -9066 -4439 2063 4694 4085 618 -3527
1054c527k133K062P629O407o596j3933j056J3288Q818m845r652m216L863O488
1068B597J943j493j522m310n046M639J1280J221j1135q236M283J0554M520p117
1082B178q805J174O418J678k31R73l512o365P64Q765O347m220j1587m958R807
1097a574J1715k511j0465l561K813L340L411K134k465n941m668K827J0700N550
1111A1305r617j2169K565J1393M580m521o334k296K553L531J610J337j324p042
1125d429m486Q517J0556k813j1998n092O172R692J902p443n833J500K724J253
1139B22M459J646p216q017K558J1002N483n799j1805k259J0210P426l508o098
1153a696j329Q4N72M085M262k198p437n106N322J1506J731j1608q477N554R193
$$ plain form
1054 -3527 -5660 -3598 4031 10438 3842 -10091 -11147 2141 10959 6114 -3538 -7754 -3891 2597
1068 2597 4540 3047 1525 -2785 -7831 -3192 8088 9309 -1826 -10062 -5779 4775 9295 2178
1082 2178 -6627 -5453 965 2643 2412 3385 -127 -6492 -5728 3037 9384 5164 -6423 -11381 -1574
1097 -1574 10141 7630 -2835 -6396 -3583 -243 3168 5302 2837 -3104 -7772 -4945 5755 11305
1111 11305 1688 -10481 -7916 3477 8057 3536 -2798 -5094 -2541 990 2600 3937 2613 -4429
1125 -4429 -8915 -398 10158 7345 -4653 -9745 -3573 6119 8021 578 -5255 -3755 -1031 222
1139 222 4681 6327 -889 -8906 -6348 4654 10137 4338 -7467 -9726 484 7910 4402 -1696
1153 -1696 -3025 -2941 -2369 1716 5978 3780 -3657 -8763 -3441 8065 9796 -1812 -10289 -4735 4458
1168D458J914m026m323j863N82K293M371L663m614j0327j720J1440R175n143j1208
1183e328l700O567P666J39m633k777j002r23K767P370J098r011q091M412J1103
1198E657M154q079r518J142Q496L553k914k474j388k595J89O095N392l632r730
1213e652m147Q265J1155k062j1069m837N277O202J188j843k499k659k113K282
1227b512P216L948p674j0435J608J1552O196o193r252j199N633M612j9j513j867
1242A01l860k344N772Q613j089j1073o493O613J0816J428q588o557K318N367J713
1257B737K8j90l219n199L13Q904N970n989j0856j566R813Q192m157q371j846L570
1273a866K907J191R21q83n220m132M595R580J466j0043q468M412J0920K544o385
$$ plain form
1168 4458 6372 2346 -1977 -3840 -3258 -965 3406 7069 2455 -7872 -9592 1848 11023 5880 -5328
1183 -5328 -9028 -2461 5205 5344 711 -2066 -3068 -3991 -1224 6146 7244 -1767 -9858 -5446 5657
1198 5657 9811 1732 -7786 -6644 1852 5405 2491 17 -1371 -3966 -3777 2318 7710 4078 -5652
1213 -5652 -9799 -1534 9621 7559 -3510 -8347 -3070 3132 4320 2477 -22 -2681 -4794 -2512
1227 -2512 4704 8652 978 -9457 -7849 3703 9899 3706 -5546 -6745 -1112 3500 3481 1968 101
1242 101 -3759 -6103 -331 8282 7193 -3880 -10373 -3760 7056 8484 -104 -6661 -4343 1024 2737
1257 2737 2765 2575 -644 -5843 -5530 3374 9344 3355 -7501 -9067 746 8938 4781 -3590 -5436 -1866
1273 -1866 1041 2232 3153 2270 -2950 -7082 -2487 7093 8559 -1484 -9952 -5540 5380 7924 1539
1288A539o152O08L208J774K100J000l393o690j146Q921Q112m358j1372l561Q520
1303h90P976q48p131l597J364K106J823L131K48n947o011K931R990N009q571j0317
1319h734K007R077M621l828n398r82J076J013K917L830k107q448l540O799J0519
1334H822n67j1589n882O059Q723J73n340l038l24K62J860M485K734n898q855J111
1350g264J0791P092o959j0816j033Q485N818k011m443j857r24k55L742O101m64
1365F003r272o907N661J1814J903r488p839K859P882K032k239k348j577k603M48
1380c671O208N413m264j0486k720R864R049l363j0438l075N624N337J51k188j272
1395A69k727k371K785P698K475q353r613L192J1881M600p838q425O32N941L207
$$ plain form
1288 1539 -4613 -4005 -797 977 3077 4077 684 -6006 -7152 1769 9881 5523 -5849 -9410 -890
1303 -890 7086 6238 -893 -4490 -3126 -1020 803 3934 4182 -1765 -7776 -4845 5145 10154 1583 -8734
1319 -8734 -6727 2350 6971 3143 -2255 -3237 -2161 -1148 1769 5599 3492 -4956 -8496 -1697 8822
1334 8822 8255 -3334 -9216 -3157 5566 5739 399 -2639 -2963 -2701 -841 3644 6378 480 -8375 -7264
1350 -7264 3527 10619 3660 -7156 -8189 296 6114 4103 -340 -2197 -3121 -3376 366 6467 6003
1365 6003 -3269 -10176 -4515 7299 9202 -286 -8125 -5266 2616 4648 2409 61 -1516 -4119 -3671
1380 -3671 2537 7950 3686 -6800 -9520 344 9393 6030 -4408 -7483 -1859 3478 3629 1441 169
1395 169 -2558 -4929 -2144 5554 8029 -324 -9937 -6745 5136 9736 1898 -6527 -5895 46 3253
1410C253m12j366j669l638k064O007Q591k650j1427m650P451J0324J56q991n628
1425f713L165M988J177j64L47l728n623J549R148N330o787j0648r67J0490P494
1440I058m527q389j190L710K000J333J670j125n815l706M547R231J597j0026q090
1455i722N033J0268J391o468m484O36K413J792J576J179k550o545j477Q861P984
1470I887n209j1234k307Q417P654j822o761l028J940J831J181L577R70o940o738
1485h582M116J0475L092q052r120J308R588M077m772m373J03j47K52L918L775
1500E658k854p589k822O557R477j038j1154n190P013O971q05l862j971r84j97
1515b790J972M293K578m825r194M49J1478O006p376r151K60O609M172j245l750
$$ plain form
1410 3253 2841 1475 -194 -3832 -5896 111 8702 6052 -5375 -10025 -2574 7750 7906 -1085 -6713
1425 -6713 -3548 1440 2617 2453 2800 -928 -6551 -5002 4146 9476 2689 -7959 -8926 1564 9058
1440 9058 4531 -3858 -5048 -1338 662 1995 3665 2540 -3275 -6981 -2434 6797 8394 -1632 -9722
1455 -9722 -4689 5579 6970 502 -3982 -3346 -933 859 2435 3614 1064 -5481 -6958 1903 9887
1470 9887 4678 -6556 -8863 -446 7208 5386 -1375 -4403 -2463 -632 549 4126 5096 -1844 -8582
1485 -8582 -4466 6009 9101 1049 -8071 -6763 2825 6902 2130 -2243 -2140 -2287 -2035 1883 5658
1500 5658 2804 -4785 -7607 -1050 8427 7389 -3765 -8955 -1942 5029 4224 362 -1609 -2593 -2790
1515 -2790 -818 3475 6053 1228 -7966 -7517 3961 9967 2591 -6560 -6300 309 4481 3236 -514
1530e14j476l27q52K802O395j02r849n383O872R538L86q472o780L208P989J325
1546D760l861j170p87l203N91P462M333n827r454j555R219R275l603j0854k626
1561g300O105L877j97J06j183l951k820K840P422L065p464r620K860J1370L007
1576H117p492n823J430L995K420m05j078r42l258k384N652Q401l100j1413l372
1591i252Q259Q209n92q097m957L205M886L27Q4J366l845o818K268R622M249o600
1607B314r520r57R325P280m493p748r9L075M65J485L207j555n930l687M371Q432
1623E965K150r147q619M913J0179Q92n737l627r5J519J960K141J544k350o876
1638e188k598Q720Q607m297j0863k262O964O086p15m833k614J182P69K85L627
$$ plain form
1530 -514 -1990 -2317 -3169 -367 6028 5926 -3923 -9306 -2434 7104 7490 -982 -7762 -4554 3435 4760
1546 4760 899 -271 -1058 -4261 -3670 3792 8125 2298 -7156 -8711 508 9783 6180 -4674 -7300
1561 -7300 -1195 2682 2485 2591 1408 -2543 -5363 -2523 4899 7964 500 -9120 -6260 5110 8117
1576 8117 625 -5198 -3768 227 2647 2242 1164 222 -3036 -5420 232 8633 5533 -5880 -9252
1591 -9252 -993 7216 6624 -1473 -6430 -3225 1661 1988 2072 3438 -407 -7225 -4957 4665 8914 2314
1607 2314 -7206 -8163 1162 8442 3949 -3799 -3898 -823 -358 1127 4334 2779 -3151 -6838 -2467 5965
1623 5965 8115 -1032 -9651 -4738 5441 6333 596 -3031 -3126 -1607 353 2494 4038 1688 -5188
1638 -5188 -7786 934 9541 5244 -5619 -7881 -917 5169 4454 -379 -2993 -1811 -1042 -757 2870
1653B870K549n840p248L010R595L058o844p962P18Q171M035l996m080K35k18m62
1669b409L624M541k101p917l620N908R247K47r525n931M554O756K90k392j319
1684d7j561j759J031M740L879l834q740j378R448O487m774q476m46N227L005k46
1700B556k504m53j402j366J790N667J722p355o845M003R053J729n894n323P97
1715c825M657K016j649m39n44l253j131N245N562k773q298k576N966P492j179
1730E271p010l612L809L465k11k24K62k851l284J525O145L268n073p738M41Q043
1746B226M545m585n555j28K842J253J191M62n65l845k628L105O975K07p384n213
1762g097M396O611Q54m644l230R42K006K22J169J622k168m799o51O240N118l241
$$ plain form
1653 2870 5419 -421 -7669 -4659 4936 7994 1150 -6812 -6094 2077 6112 2116 -1964 -1729 -1947 -2409
1669 -2409 1215 5756 3655 -4262 -7882 -1974 7273 7520 -2005 -7936 -3382 3374 3664 1272 -47
1684 -47 -1608 -3367 -2336 2404 6283 2449 -6291 -7669 1779 8266 3492 -4984 -5430 -203 2802 2556
1700 2556 52 -401 -1803 -3169 -1379 4288 6010 -1345 -8190 -4187 4866 6595 701 -4622 -3825
1715 -3825 832 2848 1199 760 216 -3037 -4168 1077 6639 3866 -4432 -7008 -1042 6450 5271
1730 5271 -1739 -5351 -1542 1923 1712 1488 1750 -1101 -4385 -2860 3285 6553 1480 -6258 -5817 2226
1746 2226 6771 2186 -3369 -3497 -655 598 1789 2251 1686 -2159 -4787 -1682 5293 5500 -1884 -7097
1762 -7097 -2701 3910 4764 120 -3110 -2168 -162 60 1229 2851 683 -4116 -4767 1473 6591 3350
1778C350p739j792O230N200k201m631j100J552Q40O24K304M74m390m217K281P182
1794C967K607n963p067J949O624K478k857l169j54L03Q0K239K857j400n640k687
1810e833M859O568q84o910l508L533N092K31k619j518j44o43M21L368K404l460
1826I57n747k4O622M284l789o175m89M585K892j147k222l90o98r34J925L885L03
1843C838n282m293L080O717J380n537m501J623M208J362j373q77q80j816k50L628
1859A027L763k037o339k162N330N646j338n688k270K633K827K93n50k76j685k335
1875c161R76M777K452m223n744O01O092L228l169m544k85K715J514j94K73m37
1891H71k586j818K822M763o0n546l682L059N543P61m174k918J167J945N03N46
$$ plain form
1778 3350 -4389 -6181 49 5249 3048 -1583 -2683 -1131 -291 333 2637 3111 -1279 -5496 -3215 3967
1794 3967 6574 611 -6456 -4507 2117 4595 1738 -1431 -1585 -1282 -1202 1037 3894 2494 -3146 -5833
1810 -5833 -974 5594 4710 -2200 -5708 -2175 2917 3148 529 -989 -1133 -1776 -1355 2013 4417 957
1826 957 -4790 -4814 1808 6092 2303 -3872 -4361 224 3116 1969 -253 -643 -1341 -2275 -350 3535 3838
1843 3838 -1444 -5737 -2657 4060 5440 -97 -4598 -2975 1233 2595 1222 345 -535 -2351 -2601 1027
1859 1027 4790 2753 -3586 -5748 -418 5228 3890 -1798 -4068 -1435 1392 1685 1135 859 -826 -3161
1875 -3161 -2185 2592 5044 821 -4923 -4322 1770 4998 1829 -2715 -3000 -285 1229 1035 1308 871
1891 871 -1715 -3533 -711 4052 3992 -1554 -5236 -2177 3366 4127 -47 -2965 -1798 147 650 1196
1907A196P43j719l233k73M379L872k398n972j533M869M256j542l760j226J161
1922a180R75Q57J246J07k831l146J519N419K145m684m987J090M950K165k168k827
1938a350m44P94N86J073J945o18m261k149L690N024n35n172l023K630M241N10
1954B941k779j453L50n1J91K376J547k567m084KM742L616k544n443r89M190K913
1971B958j132j997p04n86j02J702K610K02l829l725J952N758J639m544m131J382
1987b547L316J511r20j338q37p00k96K268L337j329n457j530M608M251j039m786
2003a488k187K098L330K26j487l17o73j969Q11M075J699l756m397M12M796L464
2019D637k526m819m89L078J528l74K44o77k430r06K421L623q9m309l675K686N406
$$ plain form
1907 1196 1939 220 -3013 -3286 1093 4965 2567 -3405 -4938 -69 4187 2645 -1115 -2341 -1180
1922 -1180 -205 652 1898 2005 -826 -3972 -2453 2966 5111 427 -4560 -3470 1480 3645 1477 -1350
1938 -1350 -1794 -1000 -414 659 2604 1986 -2275 -4424 -734 4290 3755 -1417 -4440 -1810 2431 2941
1954 2941 162 -1291 -941 -992 -801 1575 3122 555 -3529 -3527 1215 4831 2287 -3156 -4145 45 2958
1971 2958 1826 -171 -875 -1461 -1563 139 2749 2951 -878 -4603 -2651 3107 4746 202 -3929 -2547
1987 -2547 769 2280 1360 22 -815 -1515 -1811 457 3794 2465 -2992 -4522 86 4337 3298 -1488
2003 -1488 -3675 -1577 1753 1979 492 175 -498 -2467 -1656 2419 4118 362 -4035 -3623 1173 4637
2019 4637 2111 -2708 -3197 -119 1409 1035 1279 602 -1828 -2734 -313 3310 3221 -1088 -4763 -2077 3329
2036C329P29m707k324J192K018R93M84m81j770j916m43L963L787k613o269r01
2052d929N437L469j135l592k254J325J986P86L97M23k418l105J487M823K013m496
2068B17m191O03M499L037k656l479n1J773R2R85J376r00l956r17L729L896o84
2085C373n360l418M250M654k83l583j575K92N44J668J653L72k758l557N4N279
2101A605L998l626n867j05M225K681p82k217j559J23P66R72K123M88m202l388
2117d765L153N517K64m657l567J332M228J957k360k414p0J07L27K530K330k778
2133A134m647p29M522M325j112n568k501L450L585m30j617n37j206r43J758L086
2149B570O59l299m120Q53N697K658m216m444P53L342J715m85j234j449r05KK367
$$ plain form
2036 3329 4058 -649 -2973 -1781 237 1230 1714 1233 -537 -2453 -2896 1067 4854 2241 -4028 -4929
2052 -4929 508 3977 2842 -750 -3004 -1679 307 1093 1490 1913 -505 -3610 -2123 2700 4713 217
2068 217 -3974 -3371 1128 4165 1509 -1970 -2021 -248 -156 829 2205 1305 -2651 -3568 161 4057 3373
2085 3373 -1987 -5405 -1155 3499 3216 -367 -1942 -1650 -1106 562 2215 2587 -171 -3728 -3674 1605
2101 1605 5603 1977 -3890 -3995 230 2911 2129 -88 -1647 -1524 -758 214 2337 2825 -1377 -4765
2117 -4765 -1612 3905 4169 -488 -4055 -2723 1505 3462 1102 -1312 -1382 -1275 -948 1582 3912 1134
2133 1134 -3513 -4242 280 4605 3493 -2075 -4576 -1126 2459 2029 412 -125 -1331 -2274 -516 2570
2149 2570 3229 -70 -4190 -3337 2360 5018 802 -3642 -2889 453 2168 1683 449 -1000 -1905 -1903 464
2166D64L416r30n577k679M380N229n01m505k984J416L283J206r49p34j194k114
2182b773N47M404K317l576m935O1M724L676k047m661j018K744J817l6M1o52k557
2199a924j184K757L842J48m632l882K269N750J177m138l050O45K003J313P02j71
2215A625j925k566q7L910L810k156o014j558M717M207j041l689j993J085J923
2230B48Q88P84m97k489k680J471N307J729m729m557J310M927K310k374l419m91
2246b262J529O88J236J443j287m254j063L873M560q40n468l034L146M614M23l177
2262A27j885J02O49J144J967N45k881l656P63N114L057l430n419k70M499K996
2278C422j204k767j242J35P22J772K091p31m193k614L179N490L83n093l776J735
$$ plain form
2166 464 3880 2950 -2627 -5306 -926 4303 3802 -703 -3687 -2271 1012 2218 1269 535 -659 -2773
2182 -2773 -2226 2178 4495 919 -4016 -3955 769 4445 2398 -2263 -3281 -537 1280 1244 1285 633 -1924
2199 -1924 -3108 -351 3491 3639 -993 -4875 -2606 3144 4321 183 -2867 -2222 -219 1094 1796 1625
2215 1625 -300 -2866 -2953 957 4767 2611 -3403 -4961 -244 3963 2922 -767 -2760 -1675 248
2230 248 1136 1920 1423 -1066 -3746 -2275 3032 4761 32 -4525 -3215 1712 4022 1648 -1771 -2262
2246 -2262 -733 -45 1191 2634 1347 -2907 -3970 -97 4463 3623 -1845 -4879 -1733 2881 3304 127
2262 127 -1758 -1656 -1007 137 2104 2649 -232 -3888 -3125 1989 5046 1616 -3803 -4073 426 3422
2278 3422 2218 -549 -1791 -1656 -934 838 2929 2198 -1995 -4609 -1430 4060 4443 -650 -4426 -2691
2294b691M341J536j842k071q26k73P92K759J983k642m881n16M904M352j949n348
2310b372j922L311L347K4j847j237r69m64J827L293L54m147l957J883N702J994
2326D820m023m473N02L635J979o82j455j149j366K79K911L073j742n048k187M311
2342f15M935m01n083k829K101L113R81o49j061j937j492J180M265J685l632m996
2358d435N02N175L364k441m420j180K555K248M88m13j126k465r59K874M131k46
2374C652n072l612K820N336J098l955l219O11K356J261O84n06j985k665N73M278
2390A655K987k613n751j052M816M299j391l969j856J347J483J629N17p54k880
2405a533k252K246N314P54m538m565J222M968K376k334l552n62J304J455J424
$$ plain form
2294 -2691 1650 3186 1344 -727 -1553 -1826 -1034 1725 3708 1066 -3815 -4331 573 4925 2976 -2372
2310 -2372 -4294 -983 2364 2388 541 -696 -1665 -2129 -302 2991 3345 -802 -4759 -2876 2826 4820
2326 4820 797 -3676 -3174 461 2440 1758 303 -846 -2212 -1933 978 4051 2309 -2739 -4926 -615
2342 -615 4320 3919 -1164 -3993 -1892 1221 2202 1553 492 -1445 -2937 -1757 2508 4193 561 -4435
2358 -4435 -3933 1242 4606 2165 -2255 -3435 -880 1368 1856 1443 317 -2148 -3107 -233 3898 3652
2374 3652 -1420 -5032 -2212 3124 4222 267 -2952 -2341 15 1276 1960 1454 -531 -3196 -2623 1655
2390 1655 4642 2029 -3722 -4774 42 4341 2950 -1019 -2875 -1528 -45 1584 2101 1347 -1533
2405 -1533 -3785 -1539 3775 4529 -9 -4574 -3352 1616 3992 1658 -1894 -2456 -1152 303 1727
2420A727R05j931l740q15M142M362j255n539k782L366M698J93l192k067R7P81
2436a050J411K014J40l033l425R30N123K977l555n372j46M425K830j090k643j417
2452a881J31R85J795J798p85m181k516L494N336N1n111l501J759M274J796k070
2468A374k437p62L0J005K866J687l071m629r5M847M002j921n206k076L309L602
2484B525k42j742j051j294m38K228L058q1l760l621J619N508K184m205m425Q45
2500b892L405J678l16j318j828j018O91K658K656j313n256k214M592M818r46m433
2516a036k406J120L174J499q11j316j269j413O70M365J549l757m594Q29M817K722
2532D143k045m479j107K951K282k33k75j003k614o15L358L449p71m535l331K412
$$ plain form
2420 1727 2632 701 -3039 -3854 288 4650 3395 -2144 -4926 -1560 3138 3331 139 -1928 -1831 -1050
2436 -1050 361 2375 2515 -518 -3943 -3013 2110 5087 1532 -3840 -3986 439 3269 2179 -464 -1881
2452 -1881 -1750 -765 1030 2828 2043 -2138 -4654 -1160 4176 4227 -884 -4385 -2626 1648 3444 1374
2468 1374 -1063 -1825 -1795 -790 2076 3763 692 -3937 -4032 815 4817 2896 -2310 -4386 -1077 2525
2484 2525 2283 541 -510 -1804 -2242 -14 3044 2963 -797 -4418 -2799 2709 4893 688 -3737 -2892
2500 -2892 513 2191 1875 557 -1271 -2289 -1598 1060 3716 2403 -2853 -5067 -475 4343 3397 -1036
2516 -1036 -3442 -2322 852 2351 1540 224 -1045 -2458 -1788 2577 4126 369 -4225 -3396 1421 4143
2532 4143 2098 -2381 -3488 -537 1745 1512 1237 234 -2380 -2995 363 3812 3041 -1494 -4825 -2413
2548b413N593J241m241l138P31J828J433J154n45k385k123L84L598L221k127n577
2564c366j017M621L358j353l057j581Q08K050J039j75l94k101k229K122M804M24
2580C953m807l419J691M281K261k353l819m15J956J181J008J100j999l956j24
2595c461M178L337j114m648k876K914M683M5l105j495J12J64J582K064l46k796
2611g62k411P69M177K677l303m921M47M365J876j325k063j361J60J493J395J079
2627B292n77l611k224L080M932p00m541k289J172L665J636j539k356n21M14L44
2643h23K398J645k860l931O77L990K696j780m161j505L052L169o40j871p35r54
2659a633k80K644K051m32l843k286J687M659J739l918l881Q72L317J017J00j312
$$ plain form
2548 -2413 3180 4421 180 -2958 -2227 -399 1034 2188 1643 -742 -2865 -2481 1117 4338 2211 -3366
2564 -3366 -4383 238 3596 2243 -814 -2395 -1587 463 1502 1327 933 -1168 -3397 -1275 3529 3953
2580 3953 -854 -4273 -2582 1699 3960 1607 -2212 -2627 -671 510 1518 2618 619 -3337 -3461
2595 -3461 717 4054 2940 -1708 -4584 -1670 3013 3058 -47 -1542 -1430 -1266 316 2380 2034 -762
2611 -762 -3173 -2404 1773 4450 1147 -3774 -3327 1038 2914 1589 -474 -1835 -1675 -182 1213 2292
2627 2292 1715 -1896 -4120 -1040 3892 3192 -1349 -3638 -2466 1199 2835 1296 -1060 -1581 -1167 -823
2643 -823 1575 3220 360 -3571 -2894 1096 3792 2012 -2149 -3654 -602 2567 1927 56 -679 -1633
2659 -1633 -1913 731 2782 2350 -1493 -3779 -2092 2567 4306 388 -3493 -2621 696 1713 1813 501
2675E01j726r16J006K200J668j135m349j170L878L498j032m043j153Q93L068O20
2691A808j008j356o09r32J268L277Q99l770l348J131M204J986k488l422k39K365
2707b34J713q9o20r54j908n16L082K950j365l732k330K599M322K60l382k318R71
2724a551J554J080L48o56j325j870P81L010K000k137m337k83M080K583j839k431
2740i93j394J443J230O62O47j108k152j157J988L728L38l685l071J336M166Q77
2756B855k139k234l85J543J041M16L28j176k389q7L059K641j476m248j395K956
2772f90L131j96k612j302K33J118R78J217m41k389k071J342L890J458l224l647
2788c205M67L587J787j305j951p72K05P25J429J206j031k925j351K711L577m56
$$ plain form
2675 501 -1225 -2141 -1135 1065 2733 1598 -2751 -3921 -43 3455 2423 -1620 -2773 -1880 1188 1808
2691 1808 800 -556 -1165 -2097 -829 2448 3347 -423 -3771 -2640 1564 3550 1062 -2360 -2599 -234
2707 -234 1479 1390 770 -184 -2092 -2608 474 3424 2059 -1673 -4003 -1404 2918 3178 -204 -2522 -1551
2724 -1551 3 1083 1431 775 -550 -2420 -1639 1371 3371 1234 -3103 -3386 694 3277 1438 -993
2740 -993 -2387 -944 286 948 1595 487 -1665 -2822 -834 2894 3232 -453 -3524 -2188 1978 2855
2756 2855 716 -1518 -1903 -360 681 1097 1425 249 -2140 -2227 832 3473 1997 -2251 -3646 -690
2772 -690 2441 2245 -367 -1669 -1436 -318 660 1877 1436 -953 -3024 -1682 2208 3666 442 -3205
2788 -3205 -2738 849 2636 1331 -620 -1392 -1187 -462 967 2173 1142 -1783 -3134 -423 3154 2698
2804B698l782k116J844K959N17j629j356l38J76Q17J665O94k123k830N01L630
2820A327K074k203l526l34K613K020n39j425q79l11J14J516J845m22l155k009
2836c294K097L836N40l373k672R43K707J067p80j095q63p21N92K142J606j651
2852A081l501o69L298K973j114l305j292J645J868M26o75p13j011p27J177K521
2868A982N45k872k728J053L553J429k294k593N9J967R99r5m19p45j273k37K168
2885D99K138r16l408j470K575L218k40k955j595R52J572P28ml63j509j319Q52
2902a245K862J356k362l389J43L345K079j379k543o47J057J036O91J30n53j932
2918a351r77J707L119Jl245k429J679K965R51j929j606j35J068N85K35O87j129
$$ plain form
2804 2698 -1084 -3200 -1356 1603 2120 491 -865 -1203 -1027 -210 1455 2149 26 -2804 -2303 1327
2820 1327 3401 1198 -2328 -2662 -49 1971 1432 7 -872 -1183 -1069 447 2292 1870 -1285 -3294
2836 -3294 -1197 2639 3179 -194 -2866 -1923 784 1851 1071 -24 -887 -1608 -1016 1126 2732 1081
2852 1081 -2420 -3089 209 3182 2068 -1237 -2529 -884 984 1410 735 22 -989 -1716 -539 1982
2868 1982 2527 -345 -3073 -2020 1533 2962 668 -1925 -1866 101 1100 1005 586 -159 -1432 -1669 499
2885 499 2637 1721 -1687 -3157 -582 2636 2396 -559 -2154 -1202 370 1098 1094 731 -778 -2097 -1245
2902 -1245 1617 2973 611 -2778 -2635 710 2789 1410 -1133 -1780 -723 313 1004 1134 581 -1351
2918 -1351 -2328 -621 2498 2499 -746 -3175 -1496 1469 2420 491 -1115 -1250 -182 403 638 1325 196
2935A96j924j67K665K109j450l123j170K296K723l96k337r80Q70K54Q48R83j0
2952A387k172j533J116L030J191k734k982J030K626J168j216j536o32K23J021
2967a3Q85P77o43k389j114K361L165o93l350j358J617K187L09j031j213o53N68
2984e88L89J514M75j508k849O57K682J930j517k590j007K458J706l62j480k96
3000c86n88MJ075J732k05k581j483J081L181Q45k661k710J541J740N31j93q36
3017H7o16o90K19J715J342j004l010n51K558K476p90k684j007J122J569M44m71
3034G09p71p29n41N60K380Q07k550k475Q02K836J366j317k370m92J478J159p0
3051G82k8l50j601o25J786K186m81k453j659J269K803N56k316j441Q21R20K16
$$ plain form
2935 196 -1728 -1895 770 2879 1429 -1694 -2864 -568 2155 1759 -578 -1558 -688 -434 414 1397 1387
2952 1387 -785 -2318 -1202 1828 3019 285 -2697 -1667 959 2127 911 -625 -1257 -1034 -13
2967 -13 872 1649 1006 -1383 -2497 -136 3029 2336 -1014 -2372 -755 1432 1741 710 -503 -1156 -588
2984 -588 -199 1315 1790 282 -2567 -1910 772 2702 1185 -1405 -2412 46 1752 1390 -90 -386
3000 -386 -974 -970 105 1837 1632 -949 -2432 -1351 1830 2675 14 -2696 -1155 585 1116 923 87
3017 87 -529 -1219 -1000 715 2057 1053 -1957 -2508 50 2526 1736 -948 -1955 -833 736 1180 709
3034 709 -62 -791 -1332 -772 1608 2415 -135 -2610 -1808 1028 2394 1077 -1293 -1785 -307 852 782
3051 782 754 404 -1197 -1822 -36 2150 1669 -784 -2443 -1174 1629 2185 -131 -1572 -751 169 385
3068C85M13j37j054j085N01J739J477j272l086m98L192J480o51k073k69o16J162
3085c92J376J2k12j735j019J064K723N82k063k821J163J998J526j008k061n23
3101a390J087M91K12P28n40k123m75J936K391o13k247j776J429K379O2j599r98
3118a046M31k8N45J436j10j839j602M64K171K373j613l336K09K147J271o50p95
3135B8n42m31K33J206P60K2j957j609J395K946J23k717j462R46J622J063r07j419
3153g00k34L65R1J185J711j515k953r3K422K163o87k541j242J197J879K97j140
3170B05k47n63j048J016K103P28k247j913K87K377J701j526k476M45J668J25r
3187F26q1o71r06l3J114J555j86k094j738J488K858l9k262j108M79J203Q08j33
$$ plain form
3068 385 798 661 -393 -1478 -977 762 2239 967 -2119 -2617 575 2055 1404 -669 -938 -1554 -392
3085 -392 984 996 784 -951 -1970 -906 1817 2399 336 -2485 -1322 676 2202 1194 -867 -1390
3101 -1390 -303 188 400 1128 588 -1535 -2010 -74 2317 1704 -543 -2319 -890 1489 1551 -48 -1046
3118 -1046 -615 -643 -98 1338 1228 -611 -2213 -1749 422 2795 1182 -2154 -1945 202 1473 823 28
3135 28 -514 -945 -712 494 1254 1276 -681 -2290 -895 2051 2174 -543 -2005 -1059 563 1626 719 -700
3153 -700 -934 -569 -478 707 2418 903 -2050 -2143 279 2442 1755 -786 -2028 -831 1048 1345 205
3170 205 -42 -605 -1653 -637 1466 2194 -53 -1966 -1679 698 2399 873 -1603 -1158 510 635 626
3187 626 545 -126 -1032 -1065 49 1604 1418 -676 -2414 -926 1932 1893 -369 -1477 -998 205 1013 880
3205H80o23p34p18M3J980J530j481k815k32K454J678m56k243q41Q81J061K74R0
3223G28p2j276j242J094K242P23k364k136P55K532Q80j249j608j5P67L24N99M31
3241A113j044j167l23J527J939m48k436j619J589K446o6j702o88J43M19O21N06
3258H10J72j082j537P4K746J302j895k535O9K234J272o33j346p02M08M19N51Q91
3276A218j85j935j346J570K559L09k428j983P39K238R01j055j036k76r1L43J208
3293G50R21j044k166n58K191K168o96k548j113J546J690k3q49m99m14k56O05J408
3311A113N29j711k016N29K657J189j716k198J8J777R86m03o32m83m99j75J211
3328A76J557l17k424j394J717K634J50k347j636P71J623N82l81m46o80q37K58
$$ plain form
3205 880 257 -477 -1195 -1152 828 2358 877 -1938 -2170 284 1962 1506 -737 -1578 -697 364 638 728
3223 728 656 -620 -1862 -768 1474 2197 -167 -2303 -1548 984 1864 615 -993 -1008 -241 83 682 1113
3241 1113 69 -1098 -1421 106 2045 1597 -839 -2458 -869 1577 1511 -191 -879 -736 -317 304 810
3258 810 982 -100 -1637 -1563 1183 2485 590 -1945 -1876 358 1630 997 -349 -1051 -643 -224 327 1218
3276 1218 1033 -902 -2248 -678 1881 2190 -238 -2221 -1482 756 1657 602 -434 -710 -801 -458 750
3293 750 1671 627 -1539 -2097 94 2262 1566 -982 -2095 -549 1141 1118 269 -230 -644 -900 -295 1113
3311 1113 1642 -69 -2085 -1556 1101 2290 574 -1624 -1606 171 1157 754 122 -361 -860 -1035 176
3328 176 1733 1416 -1008 -2402 -685 1949 2099 -248 -1884 -1113 510 1092 711 265 -415 -1252 -994
3345i94J916J215j417k573l16K419K024r29k248p13J154R95J67j7l34j057q53
3362a561R51K106M69k086k127P00K717Q95j599j694J06R19O76J41J18n49j274
3379a092m10J622J934o79k545j145J786K222l4j828j116N03P93M44M20l2j141
3396b98j403L82K400J228j725k501m1K266J598q49j657n07N19M62N96O87k82j747
3414h72j098J345K404L45k380j983R72K287N29j098j024j70J22M51Q97O04q96
3431D35j863l93K066K025q96k606p84J703J618j68j116p01n6K22M42J207K05j655
3449c15j770Q69K597Q09j838k139K23J943J067p13r85k44k21n7J213J248p35k151
3467a199r10J740K274L9k364j552J017J714J42m45l24p23m96O35J477P47j403
$$ plain form
3345 -994 922 2137 720 -1853 -2169 250 2274 1345 -903 -1616 -462 533 700 683 349 -708 -1561
3362 -1561 -610 1496 1965 -121 -2248 -1548 1169 2064 465 -1229 -1123 -204 472 613 731 182 -1092
3379 -1092 -1502 120 2054 1375 -1170 -2315 -529 1693 1659 -169 -1285 -782 11 455 875 843 -298
3396 -298 -1701 -1319 1081 2309 584 -1917 -1958 308 1906 1057 -600 -1107 -588 -126 470 1157 875 -872
3414 -872 -1970 -625 1779 2124 -256 -2239 -1267 1020 1549 451 -573 -743 -621 -170 727 1331 435
3431 435 -1428 -1821 245 2270 1374 -1232 -2016 -313 1305 1137 21 -680 -736 -514 -72 1135 1340 -315
3449 -315 -2085 -1216 1381 2190 352 -1787 -1564 379 1446 733 -252 -496 -717 -774 439 1687 952 -1199
3467 -1199 -2109 -369 1905 1944 -420 -1972 -955 759 901 456 132 -591 -1087 -452 1025 1772 369
3484C69k150k41K694J618j179k141j60R80P73M03m02o27q36k16P62J702Q3k142
3502g10j304J126K724k1j639j495P8J538Q59l70m56m43j170l7J801J557j254k203
3520a419o34J877J817n7k116q92Q96P01K62O34q14j022q81P50K108N99j553k332
3538b076O75K165J226j040j844j83M37L98Q86L06o66q57r85J433J914L14k843
3555g40j527J820J867j57o92p64p85O77N46N42J46n66k241J014J987P15j299k241
3573a698R5J594J350J37k139rK63m8O22Q83m6k014q86J251K183M31j844k203P75
3592a303J899P12q20r24J2j70J48J180M50p16j593o96J787K071p14k489n37J497
3610b06J133k5o54p05l40L11N67Q15P11j802k250J215K324J009j736j689k05J605
$$ plain form
3484 369 -1781 -2022 672 2290 1111 -1030 -1190 -210 563 966 564 -63 -899 -1115 -353 1349 1432 -710
3502 -710 -2014 -888 1836 1815 176 -1319 -1241 297 1156 786 330 -113 -1283 -1320 481 2038 784 -1419
3520 -1419 -2053 -176 1641 1584 -532 -1424 -528 173 435 1069 255 -767 -1648 -898 1210 1809 256 -2076
3538 -2076 -1401 764 1990 950 -894 -1077 -640 -242 644 950 284 -573 -1558 -125 1789 2103 -740
3555 -740 -2267 -447 1420 1263 571 -193 -978 -301 245 787 933 367 -1874 -860 1127 1842 543 -1698
3573 -1698 -1603 -9 1341 1478 -661 -670 -407 -455 167 1050 1004 -1010 -1896 -645 1538 1969 125 -2078 -1303
3592 -1303 596 1308 488 -436 -424 -594 -446 734 1184 468 -1125 -1821 -34 2037 1323 -1166 -1703 -206
3610 -206 927 902 248 -457 -797 -486 81 896 1607 -195 -2445 -1230 1094 2103 367 -1322 -1527 78
3628G8J181m95q80j34k54m67J137J421o34k108p63J705J813k0j915j399Q16J568
3646F50Lk03l77j31j184P85J525K14j058j806k90K387J658j104k235J92M10J058
3664D94N5J41n80q84o2L09J925K48j693k038J235K252m90o42j393nO96Q95L0m01
3684I2J16j586N14J429J182q26k003n80J894J356l55j752r73N97J365N5L54p7
3702H02j518l87O49J511Q50j791j739p2K154J600j487j250k26M20M44Q93J15m42
3720E26j738k98J191K022q0k445n84P01J991l15q89q54k08L39Q21P66l06r48j357
3739a665J94K183J355j532k028q7K114J120p30j247k38j68O33J34J031j01j771
3756h03o72J233J748k0j264j860Q44J570M68j020q89J03K08MJ166K73p38j917
$$ plain form
3628 78 1259 764 -116 -250 -504 -971 166 1587 953 -1155 -1918 -213 1600 1580 -335 -1734 -918 650
3646 650 653 450 73 -58 -1242 -457 1068 1282 224 -1582 -1872 515 2173 1069 -1166 -974 -564 494
3664 494 549 690 110 -774 -836 -527 1398 1646 -47 -2085 -850 1402 912 270 -1123 -1128 -432 463 493 92
3684 92 208 -1378 -864 565 1747 921 -1082 -1662 232 1588 1233 -519 -1492 -895 470 525 879 802
3702 802 -716 -1103 -454 1057 1907 116 -1623 -1695 459 2059 572 -678 -904 -484 -40 853 968 526
3720 526 -1212 -1510 -319 1703 1623 -822 -1406 -705 1286 971 82 -772 -980 -641 180 946 640 -308 -1665
3739 -1665 -1471 712 2067 535 -1493 -1580 534 1654 924 -323 -561 -729 -96 38 1069 968 -803
3756 -803 -1475 -242 1506 1486 222 -1638 -794 776 1244 224 -665 -562 -354 -350 816 1089 351 -1566
3774a566J02J426J727o65k002n59J346Q96J06m56n72k90j60J247N80L37j749j427
3792a679O47K134O80j430j597L62R43N78j28l89n53k20P8Q58J211p49j735q20
3810a809J368J874j90j623r38O39J018L71k38l20o27l19L81J252O51j101j702
3827a313k79K144J215r37j659n59J008Q83j38K31m53r21k20R19J586j20j721j537
3845a871R00K161K59j351j170K34P54N54K63j51q97p09J03J389J223r07j846k61
3863a323J125J458l29j069j025O18N71L72M29j51j415m51Q01J484M49j548j613
3880a617M46J817Q16o84j514qL35N74N45J18p33q64m36J232J453j49j855j029
3898a553J111J178L38q05r29j76M12O46M77L37r83j191K10J577R15j002j814J39
$$ plain form
3774 -1566 -1464 -38 1689 1024 -978 -1537 -191 705 811 355 -217 -507 -667 580 1160 1497 -252 -1679
3792 -1679 -1032 1102 1782 352 -1245 -883 60 638 510 121 -432 -652 -574 284 1495 746 -989 -1809
3810 -1809 -441 1433 1243 -380 -1318 -679 339 710 472 152 -475 -794 -413 839 1490 389 -1313
3827 -1313 -1592 552 1767 830 -829 -1388 -380 503 365 596 143 -778 -998 -79 1507 1387 -334 -1871
3845 -1871 -971 1190 1449 98 -1072 -838 -84 470 733 582 -315 -1024 -921 468 1691 784 -1062 -1323
3863 -1323 -198 1260 931 -138 -1163 -545 26 398 827 676 -739 -1190 -389 1095 1544 -4 -1617
3880 -1617 -1171 646 1462 778 -736 -744 -409 165 710 828 95 -769 -1205 27 1480 1331 -524 -1553
3898 -1553 -442 736 1074 269 -660 -836 -424 222 699 1036 53 -1138 -928 649 1564 562 -1252 -1113
3916a113J110J064j87q93n85N3K06O63Q60o59j019r60J015J494L36j343j453N10
3934i01J369N44o06o40k02l4K50Q87L79p71j409j75J399J416n98j463o89Q86Q83
3953E25L32m46o24l85J08K92J124R7j189j046J66J786P49j105j100k81Q07J071
3971H81J58r02n27J92q27J372P14m33j395m95Q65J566p8j195j074M96J004K13
3989E35k63r4m83o29O06J079M93j132j323j8J307J171n66j282k91N44O36K71J06
4008F67o19p79K4N43J198J26j413j233O04J682L36q59r26o1N37N80K11k59m73
4027a14o08j60J211J049p18j559m53J071J187K9r20r03L70N65K48L14k7r12p41
4046a071N76J281L81r35j202j61J380Q05n94q12p2J1K59O70J82n39p46k66P16
$$ plain form
3916 -1113 -3 1061 874 -19 -604 -551 -345 318 1178 519 -500 -1460 -445 1049 1385 42 -1411 -901
3934 -901 468 1012 406 -234 -436 -470 -220 667 1046 275 -1134 -1309 90 1506 908 -555 -1244 -358 525
3953 525 857 411 -213 -598 -490 -198 926 1023 -166 -1212 -1046 740 1489 384 -716 -997 -190 881
3971 881 1039 137 -390 -198 -1025 347 1061 628 -767 -1262 -397 1169 1091 -104 -1178 -682 322 535
3989 535 272 178 -305 -934 -328 751 1244 112 -1211 -1229 78 1249 683 -599 -890 -346 290 561 667
4008 667 48 -731 -707 -164 1034 1160 -253 -1486 -882 800 1136 277 -649 -710 -173 407 618 359 -114
4027 -114 -722 -882 329 1378 660 -899 -1352 -281 906 935 15 -888 -518 47 295 609 582 -330 -1071
4046 -1071 -495 786 1167 232 -970 -1131 249 1054 460 -352 -424 -413 -154 516 698 159 -587 -853 -137
4065a37J190mj435j016R08J239R1n41o27m42L29P42K86O2n70j039r3J443J006
4084A392q29j325k56P05R00K51p09n56L3N8L21P65K9j169o51N90J117L30q19j096
4104i19K6J146N19m71m93l1k99K50P74L09n47r64k76P89J287j12j442n96O53P35
4124C38L04k23m92m63J4M46O12L29p27j144R7J397O18p37r41k13M68P79J89m47
4144B04m46j86j37N52R64j97j224o33P13J085K84p61r84M9Q27L27j51k1m03n93
4164g31J94R69M09m97r16m37Q38J121k35j023l69M27K87L36R0l87n08j38L38P86
4184E54L31q79j038L71J199L44n93p00j86K92N52K10kl97l77r6K66J256l08j088
4204b89p04N63R29L81o76p07o1M24K92K17J56n56p97L14Q67N55n22r59l06Q89
$$ plain form
4065 -137 1053 1049 -386 -1402 -494 745 836 295 -332 -774 -445 297 583 645 75 -964 -1057 386 1392
4084 1392 563 -762 -1018 -313 587 838 129 -427 -394 -336 -15 750 779 -390 -1041 -451 666 996 177 -919
4104 -919 -893 253 772 301 -192 -223 -522 -272 502 811 264 -700 -976 -187 1100 988 -454 -1050 -397 338
4124 338 642 419 -73 -536 -522 -76 536 865 138 -1006 -909 488 1106 369 -572 -785 -317 462 651 204
4144 204 -242 -428 -565 -13 951 754 -470 -1103 -390 695 979 218 -766 -717 110 437 286 265 -138 -731
4164 -731 -537 432 841 344 -572 -1009 -171 950 715 -308 -677 -250 37 373 463 76 -432 -570 -232 554
4184 554 885 6 -1032 -661 538 882 289 -411 -597 -305 247 457 455 58 -319 -415 -149 1107 799 -289
4204 -289 -993 -430 499 880 204 -503 -564 -140 152 369 525 -31 -828 -514 353 908 386 -573 -879 10
4224A0O87J28q30m12J06J25M14K77k69o63k24K38R65L12p71j022M07Q18L92l89
4244B99m18n04o4P72N1L69l11p86l33O88J074l84q36m83O78N43L26l77m08n48
4264f52L43K78M77K53p50o62oJ272K06n45o32l86Q80L25L08q73J95l31NN16M05
4285F26l48p24k17J61J289K5q61m70J02P41M7j60l79j91N0L01K54M33j91q32n78
4306i22Q70R87n72p48j59P16L06O5k86k79n04Q5K61M93K12q54o47M87Q72L56n87
4327A52o44j6N29K03O9j00k75k95o6L83P91l63r00k16P13O50Q2o65m13N1K09M59
4349C38n6jn31k36K83N85L02n67p28N9O73M86l51n47j28K58K46K26j07J81p82
4370c97m7K34O90N4p50o20N83Q85p4k61m02k37N64j01L31j52n93l06J44R79J54
$$ plain form
4224 10 697 825 -5 -417 -311 -186 228 505 236 -427 -651 -413 552 864 93 -929 -522 296 688 299
4244 299 -119 -623 -687 85 136 505 194 -592 -925 -237 837 453 -383 -866 -188 355 681 304 -104 -652
4264 -652 -309 -31 446 699 -51 -713 -719 553 759 214 -418 -804 76 401 709 -164 31 -300 -295 221 626
4285 626 278 -446 -663 -502 787 812 -49 -519 -417 324 371 211 -168 -359 -309 -8 246 679 488 -344 -922
4306 -922 -52 935 363 -385 -544 172 478 543 257 -22 -526 -441 -180 313 525 -329 -976 -489 383 739 152
4327 152 -492 -508 21 224 293 193 -82 -377 -443 -60 731 368 -532 -748 -35 615 697 32 -381 -330 -121 338
4349 338 282 281 -250 -486 -203 382 684 117 -611 -552 121 607 256 -291 -419 -161 85 311 204 385 -397
4370 -397 -444 -210 480 534 -216 -836 -253 632 558 297 -105 -342 222 121 452 300 -293 -599 -455 524 678
4391F78J17j268j47O85N20k73k56k66l8O9N42L18m31o03j57L70N58L7l10n82p3
4412e10O62K64j18m40j24M6J49M57j69J66p08k40N86N68r6o38m21L30K95N11n28
4433D2j74k61J39L19J16K03r2o90L3O47O27r58k32l54L85N91k5l64J8j60r2L03
4455B1M25K5p32l58M97N45L62r97n26M16K65K93n5Kl69P7OL50K28k62n60l97P78
4478C4N85k23m78n23L76L84J87k15j44l03J49k27Q73j27o55k08J39P27M16r29
4498a62l05P2P5N53j42L1k59j65j31N56L61j12o64k6J21O33J76n85m14R7K79J71
4520A60J00m0l44k80J71M61L65l38o65k01O51N83j08l70l93o1K20L78o1l6j64
4541B8m84L23N84L19q28m62M26N53J43o54m6k82L60N9J57P4j55o91j40P08N30
$$ plain form
4391 678 795 -473 -620 65 585 312 56 -210 -248 -179 363 681 250 -353 -510 -140 418 455 145 -437 -510
4412 -510 152 416 298 -142 -266 -220 -71 386 217 383 -325 -565 21 589 493 -145 -566 -236 59 570 42
4433 42 -132 -393 -254 65 181 384 292 -398 -365 282 909 -49 -281 -635 -250 341 316 -48 -30 -190 -282 21
4455 21 446 471 -261 -619 -122 423 785 -212 -738 -322 -57 236 181 183 -186 -109 -103 247 475 213 -347 -744 34
4478 34 619 396 -82 -605 -229 155 342 127 -17 -320 -171 -398 475 348 -307 -515 -376 351 767 -162
4498 -162 -467 -395 -320 233 91 122 -137 -302 -433 123 484 372 -292 -318 -197 436 612 27 -387 -290 -11 160
4520 160 260 220 -124 -404 -233 228 593 255 -410 -611 40 623 515 145 -248 -309 -89 289 228 192 28
4541 28 -456 -133 451 770 -58 -520 -94 459 602 -52 -98 -380 -20 39 196 270 115 -576 -716 -8 522
4562E22j34n73l57K45P78Q8o64p3L4o4J14M85L3k65o98M0P55L05l80n54k19L16
4584b66N55l28J28o00%J76M87N25m56l96l10K45O88j46m78r7%L47K36q4l84K8
4606a30KKJ43N41n98l85j26O01N56n60n07L8L23L83R4l39q7j91j65N86J33l20
4628fj91j71J13K90N88n04n34J0M72K25p2p1k85k40J90L06L33j10o14m37N35O73
4650E00j00m04l71o1N53L76l11J9n45J03P1M61l2j63o06J5N37K59N4m78k38O3
4672b98K98P5q1J06j84n99P67K78K39l95j000M46P19M94r64k41m3N20j85K49j59
4693D2j03m31K31L13M33L3q51k65M03P11p9n62j04K53k09L39J90k36k37m22J46
4714d05P84K00m45q53K84N71K87j24l89k09J13K03J46J52l2p39j01N30N77n0o40
$$ plain form
4562 522 388 -185 -542 -297 481 569 -95 -168 -134 -198 -84 401 434 169 -529 -489 266 571 191 -363 -582 -266
4584 -266 289 -39 89 -511 -511 -335 152 677 221 -175 -485 -240 448 302 -176 -273 -273 74 310 226 -158 -130
4606 -130 -128 -126 17 558 -40 -425 -551 50 606 46 -461 -423 -100 283 377 38 -49 -240 -405 181 314 -6
4628 -6 -197 -368 -255 35 623 119 -415 -405 67 292 220 149 -136 -376 -186 120 453 343 -271 -708 -173 500
4650 500 400 -4 -375 -436 117 493 182 201 -344 -241 -170 291 259 96 -510 -495 42 301 355 -123 -361 -298
4672 -298 0 75 -6 100 -84 -683 84 362 601 206 -794 -348 371 865 -99 -340 -383 137 -48 201 42
4693 42 -61 -492 -261 52 485 518 -333 -598 -195 516 437 -125 -229 24 -185 154 344 108 -129 -551 -405
4714 -405 379 579 134 -719 -435 136 423 299 -90 -299 -186 17 163 315 283 -456 -557 -27 550 500 -140
4735a40m62K12P08J73l82k59n0l5J52M29O5l75n05p9P41M28k23n87l37N20M42
4756D36L3m80j63P3k12N32J84J6o15m15K78Q14K28o68o19J44M57L55p4j39m48
4777b83k00L77K99L50m09n63m05N62O37K40q85l58R8O32J69l34k19k87M12jN97
4798D29R5n01n66Q7O58M29l54p04p7M30L14J11j47k41l50M0M05M97p6p61m65M17
4820c30P79K73q63qp5J90K46K08l14O8j032J79Q58N37k64r97j79P79O30j52p12
4841a79k59L26J32K14J09j49m18k92J81O58M46j011l80K91O88N3k37n01k15L48
4861a95K33J41R9j83n10J1J43P69L9j026l75O28P18lm21l56m3K48K67J29M0m84
4883a31m44J23P43M20m95p57n3O09M78m8m20k81p8J74L35K30o9n73m37M69P18
$$ plain form
4735 -140 -602 -390 318 491 109 -150 -200 -235 -83 346 411 36 -469 -548 193 621 398 -189 -526 -6 436
4756 436 469 -11 -174 -101 -313 219 403 419 -196 -611 -333 481 709 41 -578 -434 23 378 304 165 -283
4777 -283 -483 -106 193 543 134 -429 -834 -272 365 605 -280 -638 -540 92 261 -73 -292 -579 -167 -168 429
4798 429 524 23 -543 -456 202 631 277 -427 -504 -74 240 351 204 -37 -387 -347 58 555 479 -282 -747 -330
4820 -330 449 722 -141 -149 -224 -34 212 420 106 174 -858 -679 179 716 452 -545 -724 55 685 533 -179
4841 -179 -438 -112 20 234 343 194 -224 -516 -335 323 769 -242 -622 -331 357 410 173 -328 -543 -195
4861 -195 38 179 278 95 -415 -404 -261 508 547 -479 -854 -226 492 489 68 -288 -331 -83 184 313 353 -131
4883 -131 -575 -452 291 711 216 -541 -594 15 493 445 25 -256 -334 -160 175 405 336 -237 -674 -205 513
4904E13R9o22m72K2O62K27l30k22R9k51R4M67J98Oj176Q3R89L75k75p54k54L66
4926a56L10L06k65l42j59J40O7L55P3n17m80J62R57K55m63p27O1M69K81K4k78
4947G3k88j41P0K70L86mq58j94O46N77J2o32n34K17N36J73o5j03l78j54M7P70
4969D26Q6m25o19J23N31M49j89k10m26M98J44k90R5j45k32k86K01P77j54k82o57
4990e85L21P61J72m64o15J99J12K05J37j14l76n9p7N00M50k15o60j30K78M71P4
5011C85m49m43Q9M64J68M8l9l55n23K55R75o2l14p66j82R69M68k89n22L2N6K2
5033a3K68J32k11m53k03L98O19l5n01o40N39L26M67o38k89N6k53N62M48j92o39
5054b52j12l31Q52N49m94n65j7N47M98k46j94l69o9K15nL50K56r14l90O60L70
$$ plain form
4904 513 612 -10 -482 -460 202 429 99 -123 -24 -275 -181 286 484 490 -686 -603 386 761 486 -268 -522 -156
4926 -156 154 460 195 -147 -306 -166 -99 256 329 -188 -668 -506 451 706 243 -484 -423 46 327 351 73
4947 73 -215 -356 -286 -16 370 366 -492 -686 -40 537 549 -83 -617 -400 136 309 244 141 -237 -391 -344 426
4969 426 512 87 -532 -409 122 571 382 172 -254 244 388 98 193 48 -184 -470 -269 508 354 72 -585
4990 -585 -264 497 669 205 -410 -211 -99 106 243 129 -247 -306 -383 117 567 352 -308 -438 -160 311 385
5011 385 -64 -507 -418 46 214 262 223 -132 -655 -400 575 513 199 -567 -749 220 688 399 -123 -91 -35 -13
5033 -13 255 387 176 -277 -480 -82 537 502 1 -639 -100 226 693 55 -234 -178 -431 131 579 387 -252
5054 -252 -364 -695 157 706 212 -353 -370 177 675 429 235 -134 -203 12 7 357 613 -301 -691 -31 339
5075C39L84m42j116L82N16N40m62j91j71n6o2N01M3J2k11o19P59L83J27r14n05
5096g63N88O74k58j04j01k63l2K93L74p8l38n03Q7P93K86n28n24M7L22K54R9j99
5118A26k53j81J50J63M96j17n33n60P86N48k75m02l73N0L40M05l51j35J28m57
5138d45L3N49L89l72o04l82R85J67j24o16P1O5O38j93j3j22l83p0L59M61M4m63
5160b6m61L0P05K01m60k61M8J16J54M65k49m75J71k70L66O10k98q20r7N30M37
5181D16p8l36l38J4L90J54J6p3l09l21K45O08J61m17l60l87M41O55l28m14k67
5202e28K21K12J87M10o86j8J75J14J37K25l55o64L18M64J72j66k91k07M0J96L82
5223C38j25k13l75J0M95J00Ln16j76M28K53L5j95k57l1J42J94J78j07l75k99L20
$$ plain form
5075 339 723 281 -835 -453 63 603 141 -50 -221 -277 -339 162 205 217 6 -613 146 529 656 -258 -763
5096 -763 -175 499 241 137 36 -227 -259 34 408 330 -8 -511 -424 369 655 127 -397 -350 -28 226 325 126
5118 126 -127 -308 -158 5 501 384 -149 -709 77 625 350 -52 -425 -375 -35 370 19 -116 12 -445
5138 -445 -412 137 526 154 -450 -832 153 320 196 -420 -349 -284 354 161 148 26 -357 -427 -68 393 437 -26
5160 -26 -487 -457 248 449 -11 -272 -224 -108 46 511 262 -213 -42 -312 54 664 366 -454 -551 -21 416
5181 416 338 2 -336 -322 68 222 238 165 -144 -465 -220 388 549 132 -228 -615 -174 481 153 -261 -528
5202 -528 -307 -95 92 502 -184 -202 -27 87 224 449 94 -570 -252 212 384 218 -73 -280 -240 -44 338
5223 338 213 0 -375 -365 130 230 233 -283 -459 -31 222 257 62 -195 -226 -84 110 288 181 -194 -493 -173
5245a73N64Lm11k87J1L35K28l4k82j58qR4K87K39l05n22K4M42L67o4n00k79K87
5268a42L20K5j38m5j86j01K21L27M7l13m33J77M55K86m04l82jK77P4J35k05j22
5290a28J48k43M16J91j05n56k10M25M35r0l15l08J75Q5L94l62l3n1j96R0M62K92
5312E16m18m54j66N45M02j73m25j88K27J59J21K4j17k23j83L97K28L3o10k05K22
5333b88N02J91k54k17j87J88j68K37P0j29k81o3O84K24k87n97J9K29M15j13l68
5354a93J13j09J70j7L06O0k96n15L53L79J50l31n13P6L54K14l8k69k29J62K21
5375D8M6K41k47k98j54M08K55j06k56m22R4N68L2j79O6j06J11N5j1K41l33m37
5397c84K14K76L48n17k73%K55N01n1q9m30J45J71o5j1r7J23o04L03O85k56j26
$$ plain form
5245 -173 391 394 -17 -304 -293 42 270 236 -46 -204 -212 -118 169 408 103 -419 -395 47 414 350 -150 -429 -142
5268 -142 178 203 65 20 -166 -267 -46 281 328 15 -418 -241 214 500 96 -286 -287 -10 64 199 -6 -128
5290 -128 20 -223 193 384 279 -277 -487 -62 373 283 -32 -340 -165 -80 314 -48 -81 -132 -328 -238 224 516
5312 516 98 -356 -522 23 425 252 -173 -361 -134 25 146 170 53 -170 -353 44 272 305 -305 -510 -288
5333 -288 214 405 151 -66 -253 -65 -233 4 74 -55 -336 -399 285 509 222 -375 -356 -127 288 175 -193
5354 -193 -80 -189 -19 -36 270 330 34 -481 -128 251 401 70 -443 -367 -13 201 163 -106 -335 -173 48
5375 48 94 335 88 -210 -364 44 299 193 -63 -485 -391 177 209 30 96 -10 101 156 145 386 53 -384
5397 -384 -170 106 454 -63 -336 -336 -81 420 369 280 -150 -5 166 101 90 -7 116 -488 -185 500 244 118
5419A18l56j39L29L28q6k24j04q5J99K73Q3k43m72k6M90K10m7m65j8O0K31J46
5441B02k2k08j93o0M26j00J63q1n55j08O18K93l23O3l75K70O5O1lk10o6j1K13
5464E9J54M1l91j77K90L00k57J63k47O4K46p7J72k83j3j90p7L66J60l20k85K26
5486g6J19J35L35m20l45jl0K41M11m75nr5J83J97J00j91l48%L58J86j76j73k7
5509i7k9J01J80L1j89j74J4K15J97J0l94k00K71K38k1p9j39n4L2O8J28l6q3k81
5533b91J05L59J49k32l06nJ96J72J14n27J62J3J13k72J18L99n42M6J6N59O1q88
5555d81K63j02J04M91r7k27K25l42N47n3M05q25k5j69Q8K62m4o45L49L9K54L58
5577C75k25k53k81M86K82N7k65j89j71j1J81p9j7j51j47M28j70K60r0j65J69l7
$$ plain form
5419 118 -238 -377 -48 280 194 -30 -134 -219 -20 253 336 93 -379 -405 85 295 248 -217 -235 -175 56 202
5441 202 180 -28 -221 -281 145 45 208 127 -428 -536 82 375 52 115 -260 10 75 136 133 -77 -143 -154 59
5464 59 213 254 -137 -314 -24 276 19 182 -65 -1 245 168 340 57 44 -146 -223 143 303 -17 -302 -76
5486 -76 43 178 513 93 -252 -253 -283 -42 369 -106 -111 -206 -23 174 274 83 -265 -265 93 279 103 -70 -97
5509 -97 -126 -25 155 186 -3 -177 -163 52 249 259 -135 -335 -64 174 153 74 -65 -119 -87 -19 109 73 -10 -291
5533 -291 -186 173 322 90 -216 -221 -25 147 261 -266 -104 -91 22 -250 -132 267 -275 -229 -213 346 407 -481
5555 -481 -218 -320 -216 275 178 -49 176 -166 381 328 733 -92 -117 -286 -198 64 20 -625 -276 -237 17 375
5577 375 150 -103 -384 102 384 441 176 -13 -184 -195 -14 -93 -110 -261 -408 20 -150 110 20 -145 24 -13
5599a3J92m1R4l73q6L25J23Q0l67k07J26Q0L16j92n5L3k93J05M93j75j82j86j69
5622c72K84L02r9k19j32J77K0J99j2l9k54j49J78N01k25M1n54Q8L15J09rk36j67
5645b53O2K86PQ1j28j94j23L00K54j65k36j03J40J94P7k06j86R3P0M3J70j14k21
5668a52K6N8O0M00l01m07J94K07N4K8n8l3j97L4J91K62j66j95k97M65O9j62OM5
5692A31j78J16k8j54l33L12j3K3O9M76m54l40J06M72R3k19j73jk70K94L05m43
5714b09kL5R8q9K71J36l13j67J64K34R7k21j97n2K07J88n4j32o5j04M6K08R1p2
5738I8k69m4R0L11Q1k80l71L22j4J69N9j20j20j70M8L90k4j17m84L82J36J8J84
5761B75j35k99L6J99rN0j35q0j5M7K68K6k10k50O1K25J30m5k23j39K08J16j7J8
$$ plain form
5599 -13 179 138 232 -141 -227 98 221 301 -66 -273 -147 -67 249 57 2 35 -258 -153 340 165 -17 -203 -372
5622 -372 -88 214 115 -104 -236 -59 -39 160 148 109 -145 -294 -116 385 160 201 -353 -265 50 159 150 -86 -253
5645 -253 -191 95 102 183 55 -139 -262 38 292 127 -109 -212 -72 122 199 -7 -193 -100 -30 13 183 69 -152
5668 -152 -126 -68 -8 392 91 -316 -122 85 139 167 109 76 -121 -87 104 366 200 5 -292 173 242 80 86 131
5692 131 -47 69 41 -113 -446 -134 -147 -124 -55 421 -33 -373 -267 205 298 79 -94 -95 -365 -71 234 -209
5714 -209 -211 -176 -78 -167 104 240 -73 -240 -76 158 255 34 -163 -215 -8 180 126 -6 -71 -175 -129 79 170 98
5738 98 -171 -215 -125 186 267 -13 -384 -62 -76 93 152 32 -88 -258 -210 180 156 39 -445 -63 73 91 275
5761 275 140 -159 -123 76 67 117 -18 -98 -113 -66 202 228 18 -232 -171 54 184 139 -84 -223 -15 101 84 102
5785A02r1j02j8P0K88j08j97j51R8K63J11j65m09K37R1k4J39j24r2l2q1L37K67
5808D09k31n81J46K83K08jj38j13j81K05O0P9q4l8k28K99k0K87m23M6l99K22l04
5831d97J30M71Q5m97L00o69J255m03m61l2L48K27q0k35m12P86k54L04m20N8J23
5852A27k26k81P77o0k62k82J60O3J77m14J16lJ68m4K95l34j92J29k8J41J89j65
5874E1j06m15M89J47Q0l15j17L7J30J07O5r3l43J63pK43P1p9k84n3K61K42l9l79
5898a44k22o2K32K44n81M68Q1L10j30j44L26m72m0j71N77m59M11l64k7N32j40
5919B25k19pK23k29L8J84m4m9J42l55q2K91p3j09k16Q6M62m04N54n72O0Qo9M23
5943B68j16k53p3q6L46M5n7j78K1PK97j05k2q7k68J04J48J96J8k02k8J02j4Pp1
$$ plain form
5785 102 11 -91 -109 -39 249 141 -56 -207 -109 154 265 100 -309 -72 19 -5 134 10 -82 -114 -195 142 409
5808 409 178 -403 -257 26 234 233 95 -18 -199 6 66 145 61 23 -205 94 74 361 -62 -16 -415 -193 -497
5831 -497 -367 104 189 -308 -8 -677 578 175 -286 -318 30 257 177 -58 -470 316 62 366 -54 4 127
5852 127 -99 -380 397 337 75 -207 -47 16 193 -221 -105 -108 60 16 311 -23 -215 -86 -114 27 216 51
5874 51 -55 -470 19 166 246 -69 -186 -149 -19 88 153 60 -283 -120 -127 116 187 108 -176 -229 32 274 235 -144
5898 -144 -366 -428 -196 48 -533 -65 16 326 196 52 378 -94 -134 -305 272 -187 224 -140 -167 365 225
5919 225 6 -1 222 -7 31 215 171 122 264 -91 -173 118 45 -64 -280 -194 268 -136 418 -154 -94 -86 -155 268
5943 268 152 -101 -174 -260 86 131 74 -104 -83 -76 221 116 94 7 -261 -157 -9 187 205 3 -25 77 63 70 -1
5968aO1r8k06J96J55j79J40k95K01N5K16k10j12j63K80P9R2j23k77M0J85J77q4
5991A29L9l43j36K96M51o9k52l49M1O8L35O0l01p1J8N8P6J08l1k85j6K13P4nj40
6016c2k20J78J39J58j47j20j5k7J51Q6l5k49k76M86J89j31K05k89m53M01M98l58
6038A39p9l66l4J07N7L99J52p12Q5L24K94l44j01j28N9j5L13L64m36j07l01L77
6060D7J62o1k24Jm43M19K73P5l71O9M3M9o1J93j67P0k39J29L19k23Q5k14OK80
6084B17J4k63P6K6K4N7rN4n41n4O41k18K54n57M32m23P94j12m31L5q9q0R2Q9l7
6109iL30n61l7O5L80J66j22m13n0n4K22k11L02j86J4O4N4K12k68r5j98M67L14
6132C86l01j38j75J05J81K74k13k83J13J22r6J56J4j86k3L6J65K1q7k72K87j3
$$ plain form
5968 -1 60 -38 -244 -48 107 -72 68 -227 -26 29 245 35 -77 -240 40 119 211 88 -189 -149 36 213 129
5991 129 168 -175 -311 -15 436 367 115 -234 -193 -125 210 270 -31 -102 -84 -26 50 158 127 -158 -174 39 113 108 -32
6016 -32 -252 -74 65 223 76 -44 -59 -86 65 151 116 -133 -409 77 266 135 340 51 -402 -1 497 139
6038 139 60 -306 -340 -233 -176 223 375 -337 -252 72 366 22 -79 -207 -148 -163 150 514 78 -29 -330 47
6060 47 209 148 -76 -75 -518 -99 174 249 -122 -53 -10 39 -22 171 4 74 -165 -36 283 60 145 -69 -63 217
6084 217 231 -32 44 70 94 151 142 196 -345 -399 242 24 278 -279 153 -270 524 412 -19 16 -73 -153 -61 28 -9
6109 -9 321 -240 -277 -212 168 334 212 -201 -251 -305 -83 -294 8 -178 -164 -100 -46 166 -102 -197 -395 72 386
6132 386 85 -53 -228 -123 58 332 119 -164 -51 71 -25 131 145 -41 -64 -28 137 158 71 -201 86 73
6154G3J84q0n9n0k82J07J00n0L51k12j74n8J31M68m64j57J29J77j1K84n07j71
6176b71L03P0J92k51J34m09k76Q37P0j98j36j30J24J82J0m56M2j46K01J42L95
6197D29j76l45j74K81R5P3j98k2J9K88k86J03j16l7k15K99J66p6k05p6L9J81J39
6220A86q5r8k69K9M48j01Q3k07j47pL5O50k65n6m90Q1M05j44j24J95k29K1K24
6243A35J59m03J83k90K7J25L8J81l23n8L56j6l4j09j58K14K01mK27k63j40R5j69
6266b6J15M5j68K04l40M39jj70j11Q7L12k34j0k1J19m00n7L9P44n79j79k11N48
6289A45k98M49j10k13k40J86J41R8L6j96J33q71P42O21o53L12l69l9M16k70K60
6310B80l93k1K23q5L42m8r44O85j37J22r0J50J00m14J97J83J08p0m68K1M14K1
$$ plain form
6154 73 257 177 118 68 -214 -107 -7 -57 294 82 -92 -150 -19 449 -15 -172 -43 134 123 407 -100 -271
6176 -271 32 102 294 43 177 -232 -508 329 399 201 65 -65 59 241 251 -205 -163 -309 -108 34 429
6197 429 253 -92 -266 15 110 183 -15 -37 -18 270 -16 87 -29 -66 -281 18 184 108 -97 -173 -134 47 186
6220 186 101 3 -266 -237 211 110 193 -14 -161 -168 -133 517 252 196 -294 -213 192 48 -76 119 -110 -89 135
6243 135 294 -109 74 -216 -189 -64 -26 155 -168 -226 130 114 80 -29 -187 27 228 224 451 188 48 143 -26
6266 -26 89 134 -34 170 -170 269 268 98 -13 74 386 152 142 121 240 -160 -217 -178 566 -13 -192 -403 145
6289 145 -153 296 186 -27 -267 -81 60 158 194 -2 131 -740 2 623 -30 282 -87 -126 290 20 280
6310 280 -113 -134 89 4 346 298 -646 39 -98 24 -66 84 184 -230 -33 150 258 188 -280 -259 155 176
6332A76j84O2k71mK68J41l7J6l95O47k90k34J14j66OJ26J11j9qr1j81M2M79q3
6356B25m5k98j03K56J07j4p6j39n7R1N6J18J5k45j26J18K30Q8j42j88n5J61R2
6379F9L1j23n9o8R7J67M8m2k39l9J76J51P7k70j06Q6O5J07k2j92J8j3M8J27N0
6404A44j28k04mK66J46j49j28q5N5K09j4l9j19r9Q2J14J01q4j38r8M6K64L3j11
6428F0k01m0J96R4K9j03j11j40N4K90QR9l60N9n6L17R9k77j43n8J04K35K34l86
6452CJ36j69j8J53j52J60j86M1L27l16k4RR8l75L36R1k5j77rp9K42K04J0l15p5
6477a10J30K13m2l15K07j77L6j25O03m06k44J72L7M02p1O3l51r7R4J42Q6M0l39
6500e2q6K44J99k66J92l59M23l15K8P5P2k25k85L41J4L06n39L33j11j94N74m33
$$ plain form
6332 176 -8 54 -217 -221 47 188 151 167 -228 419 129 -105 9 -157 -151 -25 86 67 59 -32 -213 -171 308 225
6356 225 180 -118 -221 35 142 128 52 -87 -144 -53 3 121 136 -109 -235 -117 113 201 59 -129 -184 -23 69
6379 69 100 -23 -82 -150 -53 114 162 120 -119 -158 18 169 246 -24 -130 -44 21 128 106 -86 -68 -81 -33 94 144
6404 144 16 -188 -192 74 220 71 -57 -142 -87 122 108 69 -50 -149 -67 47 148 64 -74 -172 -126 138 171 60
6428 60 -141 -181 15 109 138 35 -76 -216 -162 128 136 235 -125 -66 -122 195 294 17 -126 -184 -80 155 389 3
6452 3 139 -30 -48 105 -47 113 -73 -32 295 -21 -45 -36 62 -313 23 114 89 -88 -97 -176 66 270 280 -35 -110
6477 -110 20 233 191 -124 83 -94 -58 -183 420 14 -230 -58 -21 381 310 373 22 -75 19 161 247 287 -52
6500 -52 -138 106 305 39 231 -128 295 -20 8 83 155 -70 -355 -14 0 306 -233 100 -11 -205 369 -64
6522f4K56o46l5M96J84k55p4L1L9n45Q97k53J38l04L55j70Jk00j34K74j73L79
6544A97j12J67m12J18p6n4L46J69m27j08O6J84K66k14k24J64k73M27k4k79j76
6565b75K81R9N04n28O32n75k42L13p6l11M02k92j24M77k03J30k30o6J38j14K17
6586A57j12N8j87l67L93J30l41j25M58j61L68q2k8n18L25M5q2R5K02l59k0rK06
6609D6R2q7j09j71J81K19p7j59Oo6o0L70o2j13O9m12N77k92L07J90m50K04l84
6632a81L89j98P0j68O4MJ34o5l8o2n7J01J82r0j90%M4P5J43j14p2L1j8J6O7L5
6658A02j23p5P6R5po0k65J25K2K63j6r1p8n8J0J94o5m0k5l8LJ06J40r3k54J32
6684b0m9j06J87M1k37J81R2l35L89J1j9k63L33k78J27N4l81O15m09J7K8J51K60
$$ plain form
6522 -64 192 -454 -489 7 191 -64 -138 -107 -68 -613 284 31 169 -135 220 50 51 -149 -283 -9 -182 197
6544 197 85 252 -160 -42 -118 -172 174 343 -84 -192 -126 58 324 110 -114 50 -223 204 180 -99 -275
6565 -275 6 105 609 81 713 138 -104 209 133 -178 224 -68 -192 285 82 212 -18 -84 54 -60 157
6586 157 45 103 -84 -451 -58 72 -269 -394 64 -97 271 189 161 -357 -32 13 -69 26 228 -131 -151 -160 46
6609 46 138 51 -58 -229 -48 171 94 -65 -59 -125 -185 185 123 10 79 -333 244 -48 259 449 -1 203 -181
6632 -181 208 10 80 -88 -24 -20 114 49 11 -51 -108 -7 175 85 -105 -105 -61 14 157 43 -29 2 -16 0 67 102
6658 102 -21 -96 -20 75 68 8 -257 -132 -110 153 137 46 -32 -90 -80 114 49 9 -16 -54 -51 55 195 102 -152 -20
6684 -20 -69 -175 12 53 -184 -3 89 -246 143 154 135 -128 205 -73 54 108 -273 342 -67 -50 -22 129 389
6707C89m88J77J32o1l01n4K93k33M33n0l88k6N3J45J34j48j3j26p4O04k25R4j72
6730I5J09Q6N0j52j67QM0K0J72pj41j73n9J76j8P4k85J22j37J28K20r6L2K9k18
6755i2K35j67K1J51k18rj21K44J43l05n9M9N4K59j42p6n5M3K9J6N6n1p6N2O2L
6781D6L7j18n0M2J34Mr0q4K9N1M1OQj15k5nJ15R2n7j65M9Q6L6J2n5j27J15L8J51
6810B01j05j30l9qL2O6Q0j38j19K77k62K37M6k82J34j39J62J52j42q5j65J78K6
6833b3O5M8o5j29P5J17J6j51K8k6J3N7M4m0l9lj9P0M2o2n4k21J78P6Q1J4j01p8
6861h7K63O4O2k9j34J03l33J5J2Q6k34L11j70Q4j4J25n0N9m98Q79l16j99Ko6K73
6886B08j92k17J15L4L9Q4N1j30j40O8J20qML9l4r0MQ1P9r8j03j1L5R9N4n5o5q3
$$ plain form
6707 389 -99 78 210 149 -152 -206 87 -146 287 237 -151 -177 -124 21 155 7 -6 -132 -206 398 173 267 95
6730 95 204 290 340 188 21 29 69 89 261 254 113 -60 -119 57 39 113 -172 -50 -187 -59 161 65 97 126 -92
6755 -92 143 -24 -3 148 -70 -79 -200 44 187 -118 -177 -128 -74 185 43 -33 -88 -45 -16 0 56 5 -71 -19 43 46
6781 46 83 -35 -85 -43 91 95 5 -79 -50 1 42 48 56 -59 -84 -89 26 118 61 -104 -55 31 67 79 24 -103 12 50 201
6810 201 96 -34 -73 -81 -49 17 97 -41 -160 117 -145 92 138 -144 -10 -149 13 165 23 -62 -227 -49 -23
6833 -23 42 90 25 -104 -29 88 104 -47 -19 -45 -32 25 69 29 -10 -13 -32 38 80 18 -36 -257 -79 -3 78 92 -9 -87
6861 -87 176 240 302 273 139 242 -91 -76 -64 22 -212 99 -71 13 -1 124 74 133 -365 514 198 -1 1 -65 208
6886 208 16 -201 -86 -52 -13 71 122 -8 -148 -80 40 32 36 75 41 -49 -45 36 115 17 -86 -97 -62 37 91 36 -29 -112
6914a12R1R7o2J37j89O3J4L5J28j24j58NL7L9R5r4l2n8O3P7R4j08p6n7qJ75K8
6941A00P0k26Q8L1Qk9N4J01k35k6J6N0j70K0o8L17l31J39K95l53j63K26k8K60
6965A46K05m37M3L03l96N6J70l16J56J73j4j40Pp9k1J56k1J72j59m7N4L7J74K6
6989B48k78M7j2J68K3j45j4j60J38J42j09o3p2j9OJ71Mp9r2L0J06L3Qj88K51K11
7015C55k65Pl5Q2k32l0L9j87K84j02k01K95M50l50k09J2K9M0JJ42p6j22l2P4R5
7040F4L9p3m4j25J78l8J45k18L3O5j56J82O3r2j72J32j77K38J34j7l11j10K81
7063B1L4K1q0p8j2P8Q2J7o8l9n1L3J73O1lj68j91K79k36K0O4o7O8P6L9P6k07m8
7091a06J00L7M7Pj13j15J10j1J50m8n1Kj25J34J14p4j13j24N3J50K6m0j65l0j3
$$ plain form
6914 -112 -21 76 14 151 -38 25 39 74 202 78 -80 -75 -38 1 96 2 -30 -88 -25 52 146 38 -38 -95 -103 72 100
6941 100 170 -56 32 63 71 42 96 197 -38 -64 -48 2 -168 -148 -216 101 -230 -91 204 -149 -312 -86 -114 146
6965 146 351 -86 -43 260 -136 -80 90 -226 -70 103 89 -51 -44 -123 -144 12 -9 163 4 -43 11 48 222 248
6989 248 -30 17 5 173 196 51 37 -123 15 157 48 -15 -87 -106 -100 71 75 -4 -96 -66 40 73 81 -107 144 355
7015 355 90 97 62 144 -88 -118 -79 -266 18 -84 -285 10 460 110 -99 -87 -58 -18 -17 125 49 -73 -105 -31 64
7040 64 103 30 -14 -139 39 1 146 -72 -39 26 -130 52 115 23 -149 -17 -194 44 178 161 -150 -260 21
7063 21 55 76 -4 -82 -94 -16 66 83 15 -24 -75 -42 131 192 189 21 -170 109 -127 -107 -43 -110 -42 34 73 149 -58 -106
7091 -106 -6 31 78 85 -28 -143 -33 -44 106 58 7 9 -116 18 132 58 -55 -179 -126 24 50 10 -155 -185 -198
7116a98K57j10J59j32O1J84q3k71k21J19J36l9M63j94M9k62J65l29L67l66K49
7137Dm82K2M90L45L4p28L93j85J84j31J58r1k26j93M16K64j23L6k68l82Q40j64
7159B13j6l71J62j35M20M7l02j86J60K2N5K03k5k42j58J37J0R1q0K3m4j63M12
7182B33k05k78J96J43J85k61k33K51J7k02L28r7O9m9j02j13N4M33k50k16J25k6
7204BL2K08n52L35r7M6J00j41%r0J28j5K8Q9k9j78R0k41N00k15N3j32p1K02j20
7229f8K25j65j92M28m0j52J21J85m94j3P9R1P7j20j19NJ84o3J65K10l90q0Q6K64
7253B24j35o6Q6k64M27o77N98k15l24K74j96K20p3p3Q6J84O0l57L31Ol62J11J61
7276B6M2l64l01N81Lm5J89k89K56O4l09o4J59N76l41l00kJ8K16M06p97J99o5J02
$$ plain form
7116 -198 59 -51 108 -24 37 221 138 -133 -354 -235 -99 -138 325 131 180 -82 83 -246 121 -245 4
7137 4 -478 -456 34 379 413 -315 78 -107 77 -54 104 13 -213 -406 10 274 151 187 -81 -463 377 213
7159 213 197 -174 -12 -147 273 320 18 -168 -8 14 69 272 247 5 -153 -16 -6 85 5 28 -16 -179 233
7182 233 28 -250 -54 89 274 13 -220 31 48 -154 174 77 146 97 -5 -118 -64 369 119 -97 28 2
7204 2 34 242 -310 25 -72 -26 74 -67 -67 -157 -29 -44 -16 73 44 -134 -44 -285 215 0 53 -79 -150 52 -68
7229 -68 157 -8 -200 228 188 36 157 342 -152 -165 -86 5 82 -38 -157 -152 32 -31 134 344 -46 -126 -40 224
7253 224 89 23 109 -155 272 -405 193 -22 -346 -72 -268 -48 -121 -194 -108 76 136 -221 110 116 -246 -135 26
7276 26 68 -296 -597 -16 -13 -58 131 -158 98 162 -147 -211 -52 524 183 -117 -119 -101 115 521 -276 -77 -142 -40
7300d0K87j59k01j87N31j01q9k4n49M34j40M52l3l80K88k19nJ33l9J82j35N7q4
7323b1N43j95n03K89n4J37k02j65k12O03k03K50k10k96L5k49M73M5r0K25k63J07
7345D4n9K51l07jJ82M0j63M26m37J69m92K22K22K29l01J26m76K46j65K92J49l53
7367a56J2K98j19m4k7J3n1j20K98n7j39Q9j5q7J11O8k6n1J5L9J3l9l4o3K5K7j23
7394a43L52r7k99J00J55O0l4j73o9N0j57L37j12j0Q4k57QL35J19j36J33l00M1
7417a3J09M1j48q0l8K12r2Q8J24k28MO62n04j90K18p45L02J16L63K21m14j3l3
7440c8L7M4K00j37k73J52k8J02m5j4k02O4K02j7l5K1j10O9M9km6r1l4K22j24N1
7466A7k1%j17P8J87r6P2k61MR9mJ76j13n1q7Q3N0Q0r1q8R2J11o2o1n4L9o8Q8M0
$$ plain form
7300 -40 247 88 -113 -300 231 130 41 17 -532 -98 -238 214 181 -199 89 -130 -135 -2 -41 141 6 63 -21
7323 -21 522 327 -176 113 59 196 -6 -171 -383 220 17 267 57 -239 -204 -453 20 65 -25 200 -63 44
7345 44 -15 236 -71 -72 110 150 -13 413 -24 145 -347 -125 97 326 25 151 -325 -79 -244 48 197 -156
7367 -156 -144 154 35 -9 -36 -23 -74 -194 104 47 -92 -3 -18 -105 6 74 48 -3 12 51 64 25 -9 -72 -47 -20 -143
7394 -143 209 112 -187 -87 68 128 94 -79 -148 -98 -255 82 -30 -40 44 -213 -205 130 249 113 246 -54 -13
7417 -13 96 137 -11 -91 -129 83 -9 79 203 -25 -21 641 137 -53 165 -580 -278 -162 201 422 8 -5 -38
7440 -38 -1 43 243 106 -167 -15 -43 59 14 0 -202 -138 64 47 12 33 -77 -8 41 39 -7 -98 -132 90 -34 17
7466 17 -4 -4 -121 -43 144 48 120 -141 -137 -38 -42 134 21 -30 -117 -34 16 96 5 -83 9 120 58 -3 -57 -18 -86 2 42
7495D2l6J3j09O9nJ89q3o6j89J07pM3RJ69k37Q8n7K58j86m6mR2N3r5jj62J04M
7523d3O5K5n1j51O5Q7O9N5q5k46J68QK17j32l4j25nP4l8J52j20O6k3r1K95k58
7549e6J08k4j19K11j10k8O4j9n6l4J17o4m6k6R0J67M7k39k53J62J59j7N0p7j05
7574i8K09j13J34k46K45k37%M21l96O6O8j08j24J37j10K42j10JlK38j07r7J70
7597A82m74K88n9J35J5Kk65Q5K10o4J65j32jk0k2n3R4O1l32J91K25l29K99j45
7621E6K9l19L23j93L03k54o1K81j25rQ2o7j73Q6j56K38j73k33n9L09J40mN8q0
7645al39J87J71R8m25K84r8P0K99m15M64j44k50L85k77L6n3ol50J82K34P8m26
7668b96N06l52K88j18k19j74L44L19l22J25k18r1N14l03J6Q5j15L47l99r7l4K53
$$ plain form
7495 42 6 19 -90 -21 -26 163 80 14 -175 -68 -75 -32 -23 146 -91 -3 -60 198 12 -34 -38 54 107 12 11 -151 -47 -43
7523 -43 22 47 -4 -155 -90 -3 66 121 36 -210 -42 -34 183 51 17 -108 -113 -39 -77 75 -45 21 -2 -93 202 -56
7549 -56 52 28 -91 120 10 -18 46 27 -29 -63 54 -10 -56 -82 8 175 222 -17 -270 -108 51 34 84 7 -98
7574 -98 111 -2 132 -114 131 -106 -106 315 -81 -15 53 -55 -179 -42 -152 90 -20 -19 -22 216 109 12 182
7597 182 -292 -4 -63 72 87 89 -176 -91 119 55 220 88 87 67 45 -8 86 147 -185 6 231 -98 201 56
7621 56 85 -234 89 -104 199 -55 -116 165 40 31 113 46 -127 -41 -197 41 -132 -365 -424 -115 25 21 79 -1
7645 -1 -340 -153 18 116 -309 -25 -123 -53 246 -169 295 151 -99 286 9 45 -8 -14 -364 -182 52 130 -296
7668 -296 210 -142 146 28 -191 -365 -21 298 -24 101 -117 -208 306 3 19 104 -11 336 -63 -160 -194 59
7690E9j37M5M2m6j73J16J47J5n35M11k41K91M21n36j20J99K8l31J71J64j76O8
7712a18PJ34j38o9J82k39L85p2pr5L8Q0j09m9K3k90M13k85L43j41Q9M6m17N40
7736B51l54N35l86k43K92j71J81j59j6J4J6j2j23K59L3m11N36k70K06k24N4j20
7758a12K45l64L99l59P3p6J23j54J42M5J54J60j20j14kj20l04J83J80j41J18j7
7780f1J58p6K63n23K5K81l95J07L84k68K0k58r9M93j01K80RN2j71k50K66M32m60
7803A08k71L13m73K90qQ8L5o38N92k56L26R6m53J52RJ92k5k22k02P7KL09j08m6
7827a13K16k28O7R7K58n79O30k24j8p2oK89m48K03p1r1R3j0Q4l67K35L40o1p26
7851e02j15O74m20K79L6J24q2k37M9J81p2o4m43M89j64P99j71K87k89o55L20j96
$$ plain form
7690 59 -78 -33 9 -37 -210 -94 53 68 -467 -56 -297 -6 415 -121 -241 -42 -14 -345 -174 -10 -186 -118
7712 -118 -111 23 -115 -184 -2 -241 144 72 65 -30 8 88 -21 -70 -47 -337 76 -209 134 -7 82 128 -289 251
7736 251 -103 432 46 -197 95 -76 105 -54 -70 -56 -40 -52 -175 84 117 -294 242 -28 178 -46 8 -112
7758 -112 133 -231 168 -191 -118 -194 -71 -225 -83 -38 116 276 156 42 40 -80 -384 -201 -21 -162 -44 -61
7780 -61 97 21 284 -239 -214 67 -328 -221 163 -105 -85 -343 -442 51 -50 230 239 291 120 -130 136 568 108
7803 108 -163 150 -323 -33 -41 47 82 -556 36 -220 106 202 -251 -99 -90 102 77 -145 -347 -270 -268 41 -67 -113
7827 -113 103 -125 -58 39 297 -282 348 124 106 34 28 317 -131 72 1 -90 3 -7 77 -290 -55 285 224 -502
7851 -502 -617 57 -363 -84 -48 76 -6 -243 -194 -13 -85 -149 -592 -103 -267 532 361 648 359 -296 24 -172
7873a72K8J59J16Rl14Q9J61m16M54k84J27K20P4l26L73n88L14J58p9J55l84J72
7895D6q2K84J52q81K73K95K4l09K32k79L64l26O13m90k66l15M14r9L26J65l66
7916b25M20j02O5K26o6J92m84k18Q3n12L46j78J86l54K05M63M00m16J64l18j80
7937c03l6K75L32l76P2j14J95p4m3N5k26K23l66K47J38qK43l28j29L79m93K85
7959e2Q2m8J76j76j31J15J27j41N1j07l03L77K8J40J24k82o9J15K51k00n0k73
7981b46K97j89J19J52J03l2o9m13L30K89ll89j31L58k54K24k01L3j4m9J8L0l54
8004c91M28j04NM85n29K03o3j13J28K66p6j27l1Q8K5m26K66k67J67M4Q7lM00n64
8028a02k52O96j60o44nQ54m80R6n1L0J67p4R6l44n97P74J80j99k33O2K23J43j55
$$ plain form
7873 -172 -144 15 131 140 -174 -85 76 -340 114 -170 -43 177 251 -75 298 -290 24 182 103 258 -126 46
7895 46 -36 248 400 -481 -208 87 111 -198 34 -245 119 -207 406 -84 -350 -665 -251 -350 -24 141 -225
7916 -225 195 93 158 384 318 510 26 -192 -109 -621 -275 -453 -267 -621 -416 47 447 31 195 -123 -303
7937 -303 -339 -64 268 -108 -36 -150 45 -29 -72 -17 -243 -20 -386 -139 -1 -9 234 -94 -223 156 -337 -52
7959 -52 30 -18 158 -18 -149 -34 93 -48 3 -104 -407 -30 -2 138 262 -20 -89 26 277 77 27 -246
7981 -246 51 -138 -19 133 236 204 135 -278 52 341 338 -51 -182 176 -78 146 -55 -22 -36 -85 -67 -37 -391
8004 -391 37 -67 -62 423 -106 97 34 -79 49 315 239 112 81 169 194 -232 34 -233 -66 -22 65 62 462 -102
8028 -102 -354 342 182 -462 -467 387 -93 3 -48 -18 149 75 171 -173 -770 4 184 -15 -248 -186 37 180 25
8051B5j24p9Q9N21m59P5PJ41l70K39J49l44m39N51R6l61rJ62J66J44J38m61J80
8074C7J39O9l06p9J83K25n24l93O73O8K30p24K68K2L3K94j5l80J70J66l33m1L88
8097A70q7m6k10K52K7l16J72J14j68J27k23J5Q7M87m16R3L12m36K51k70Pl97N10
8120E5j49L20j59r8L63rj88k07k74M81k20J44n02M26o9P8l10N48l60J42M6j51
8142i3K29P2j15P7j40o9K13q2J87m64P8L47o7J03k91q7k0Q7K64l89J57K20k68
8165e1m06N43j54K90l78l7K76k01K11M0J15j69r1J31J36j97R8O4j94j23j32N33
8187C04m52K8m7K97
$$ plain form
8051 25 -99 -178 -89 432 -27 48 55 196 -174 65 214 -130 -569 -18 78 -283 -292 -130 36 180 318 -143 37
8074 37 176 245 -61 -140 43 268 -256 -649 24 92 322 -402 -134 -112 -79 215 200 -180 -10 156 -177 -218 170
8097 170 83 37 -173 79 106 -210 -38 76 -92 35 -188 -173 -86 401 -15 78 390 -46 205 -65 -58 -455 55
8120 55 -94 226 67 -31 332 323 135 -72 -346 135 -85 59 -443 -17 -86 -8 -318 230 -130 12 58 -93
8142 -93 136 208 93 170 30 -39 174 92 279 -185 -107 240 173 276 -15 -102 -122 -35 229 -160 -3 217 -51
8165 -51 -457 86 -68 222 -156 -193 83 -118 93 133 248 79 -12 119 255 58 156 220 26 -97 -229 304
8187 304 -148 -120 -167 130
8191A30
$$ Imaginary data points
##PAGE= N=2
##DATA TABLE= (X++(I..I)), XYDATA
0@%%%%%%qJ6qQk4L2l3M1n6P2q8J07j33J62j92K32k80L28l85M56n29O11p08Q12
30D33r30J061j206J368j546J744j962K198k455K743l059L398l773M186m630N116
46B686n651O232o868P567q334R183j0124J1165j2329J3641j5127J6829j8800K1108
60A1178k3861K7217l1405L6803m4069N4424p0479R8953j64385N82756J22912j267534
72f67490n2386O41306N48721j39855k91956j93659J8044j10074P6485M88789L25124
83F43049o44202p60684K75911R32961K48368o09372o18919J12109N70486K45855
93C95562k96264j91156P5203j10612j82562L29060M90438j60001o88251k92067
103f30650M99042O89242k4575p05363l89018L82030M22045m6595j32753J2170
$$ plain form
0 0 0 0 0 0 0 0 -8 8 0 8 -16 16 -17 24 -32 40 -48 59 -74 88 -104 128 -152 176 -209 247 -282 329 -379 433
30 433 -497 564 -642 726 -820 924 -1038 1160 -1295 1448 -1611 1787 -1986 2200 -2430 2686
46 2686 -2965 3267 -3601 3966 -4368 4815 -5309 5856 -6473 7168 -7959 8870 -9930 11178
60 11178 -12683 14534 -16871 19932 -24137 30287 -40192 58761 -105624 477132 600044 -667490
72 -667490 -719876 -78570 470151 330296 38340 -155319 -137275 -247349 -170864 317925 643049
83 643049 -1153 -761837 -485926 447035 695403 86031 -532888 -420779 149707 395562
93 395562 99298 -91858 -16655 -127267 -309829 19231 509669 349668 -338583 -630650
103 -630650 -131608 557634 533059 -172304 -561322 -179292 242753 196158 63405 75575
113G5575j29048k37501O0074M19110K97001k98706o27816q7723O45205M43944
123E60115l45142n08617p017K87698J44824k5377l4687k3961j32888j79829J27525
134a37356M42999J09419n02739m05578K74597N11739P8098l50311k88483P2322
144a95293K35690O7893m5666M4299l7864k65838j03047L43256L41592j62136m47264
155b24378j48768L17150L55941o3359l32396j05774J58978P5768k7618P5215N9814
166A40573j66029k08122P7563L15225J49368k58083l49690N5407L74153J43545
176B73910k20110j91131L3588Q1811K4724M6547P1008l9449j94610j24987J89923
187d8776L09942k5639l50124j73817K08251K51927p621j68522r1002L1821L6432
$$ plain form
113 75575 -53473 -290974 -230900 188210 485211 186505 -441311 -529034 116171 560115
123 560115 214973 -293644 -300661 -12963 131861 106484 71797 47836 -85052 -264881 -137356
134 -137356 305643 415062 -87677 -493255 -218658 293081 371179 20868 -267615 -195293
144 -195293 40397 108290 62624 106923 69059 -196779 -299826 43430 385022 222886 -224378
155 -224378 -373146 -55996 299945 236586 -95810 -201584 -42606 33162 5544 80759 140573
166 140573 -25456 -233578 -156015 159210 308578 50495 -299195 -243788 130365 273910
176 273910 53800 -137331 -103743 -21932 2792 49339 120347 80898 -113712 -238699 -48776
187 -48776 261166 235527 -114597 -288414 -80163 171764 164143 -4379 -95381 -63560 -27128
198b7128J1134P7920Q5648j07541k28004k104K74303J70305j67928k63024j5993
209a92412K14742J40963q2957j29898q341K8615j7435M0885J20258M547j83819
220f4852j34960J24930K38512L0192k23309j67257J02005J89354J9743j02209
230A2149m6512O527k1560l91R3785Q9212p5408j87492m1269J95318J71078r4433
242A01004k13045l8582J44061J02757l3748o4657j6690j4048l1807L6530J19653
253I1428L8315j48853j53372P1714K09003N9026j54313j44482L7978J25771M3503
264G5718m2318k8569j2001m7550k2664R3049J13823m6108j73337o6648J40846
275a5759J56216l4659j57275o1406Q2273P7381o806k2916K01l2064n9939K0202
$$ plain form
198 -27128 -15994 61926 147574 40033 -187971 -190075 84228 254533 86605 -176419 -192412
209 -192412 22330 163293 80336 -49562 -57903 -29288 -46723 -5838 114420 118967 -64852
220 -64852 -199812 -74882 163630 193822 -29487 -196744 -94739 94615 114358 12149
230 12149 -34363 -27836 -49396 -49787 43998 133210 57802 -129690 -170959 24359 195437 101004
242 101004 -112041 -150623 -6562 96195 62447 -2210 -18900 -32948 -64755 -28225 91428
253 91428 129743 -19110 -172482 -100768 108235 167261 12948 -131534 -93556 32215 75718
264 75718 33400 4831 -7170 -54720 -77384 15665 129488 83380 -89957 -156605 -15759
275 -15759 140457 105798 -51477 -112883 -30610 46771 39965 17049 17250 -14814 -74753 -54551
287e4551J19456O0111j09115j45324K3297J63438P6903r9426j18496R311Q0443
298F047L2400j2683j97j0448o0384l9393P5359J17735j3081j48335q6154R7218
310d1916J42142k2j15424o6178M0460N3273J1782N954R945m0484p6618K274J15195
323D0383Q3245p7922j43249j3402J26182Q8801n0953r3179j6261M0362K0992P432
335A2431K6599K566o7200o3605M8925J18641K4659j13032r8914M7011J15934K7689
347H1704p0395n5663J1135K4137P138K2524K9878k7556q1142k4354R0342R4147
359A01895l8063j22412l9532Q5126Q3211j6641o4421k4255J2752Q546J2970L8588
371C7764J6588o0380p5912K3559J08814M7437p9932r6342J1624Q6220M2112l4932
$$ plain form
287 -54551 64905 125016 15901 -129423 -106126 57312 134215 34789 -83707 -74396 6047
298 6047 38447 25764 25567 15119 -45265 -84658 -9299 108436 95355 -52980 -139134 -41916
310 -41916 100226 100204 -15220 -81398 -40938 12335 24117 30071 40016 -468 -77086 -74812 40383
323 40383 123628 45706 -97543 -110945 15237 104038 53085 -40094 -56355 -15993 4999 12431
335 12431 39030 41596 -25604 -89209 -40284 78357 103016 -10016 -108930 -61919 54015 81704
347 81704 11309 -44354 -33219 -9082 -1944 20580 50458 22902 -58240 -82594 7748 101895
359 101895 63832 -58580 -98112 -12986 70225 53584 -10837 -35092 -22340 -13794 -824 37764
371 37764 54352 -6028 -81940 -58381 50433 97870 17938 -78404 -66780 19440 61552 26620
383B6620m2580n287K439k890K8415M7000j1316p9904m3764O2538R1224k559r0820
396b0884n4523M4630O7552M980l5115j6044m633j2760P562M6832L0324m3957p4246
409f0282m315Q3627O0244m5415q2458p839N6494L5028j1585k0384r385j2320r919
422b8509K2352M8658P449o5356n6266L9564Q1889J2906o4711m9899J8359M7526
434A3962J6559j6031j2832p379k0786m613M5564M3859l1174p2683j6382O1463
446d73N9162j5943o4042k6868L4220L1946j367l704n23k5261k7043K0577N4230
459C4911J7197m8770n8193J0590O8872L2139m4631m6537P352K8076J0128K712
471A3846J821j3139k5508j0219L2180M7209o707o5206l4298M6898N7215n760m4230
$$ plain form
383 26620 -15960 -21247 -18808 -21698 6717 53717 42401 -37503 -81267 -18729 72495 69936 -20884
396 -20884 -75407 -30777 36775 41755 6640 -9404 -14037 -26797 -19235 27597 57921 13964 -60282
409 -60282 -64597 19030 79274 33859 -48599 -56438 56 35084 23499 3115 -6270 -18590 -28509
422 -28509 -6157 42501 49950 -15406 -71672 -32108 49781 62687 -2024 -51923 -33564 13962
434 13962 30521 14490 1658 -5721 -26507 -31120 14444 58303 27129 -45554 -61936 -473
446 -473 58689 42746 -21296 -48164 -13944 18002 16635 12931 12408 -12853 -39896 -19319 34911
459 34911 52108 3338 -54855 -44265 24607 56746 12115 -34422 -27070 1006 11134 13846
471 13846 15667 2528 -22980 -33199 -1019 46190 39483 -25723 -60021 -13123 44092 38332 -5898
484e898k4341R234K2253J1419L093J431j7467l4723R14N4711L4156l8634n6913
497d0765k078M6845L6042j4872l9357j0999J7853Q792L066J5284k95l5203k5231
510d0918K8808M7935O201m5978m3318J6890N4395J5511l3335k4241L107M821O838
523c284J9113J0423j9026l3766j0640L5917M5499j0431n6163k0980L5210L2490
535B4362l246j7882j2787l586M025Q225J4573J0516k0968l7360N949M8597K0180
548D0598l3871l6407K513L0439K2527r584k3282n994M652q44J1463K4686n682
561B1214m0444j9057K8316L9476N116l4922l3360J0465L4852R359j3955o358n151
574d449j2905L582K5615J4636j5677l0397j0787K8708L2876r964l7219p996K0831
$$ plain form
484 -5898 -30239 -21005 1248 12667 15760 17191 -276 -34999 -34085 20626 54782 16148 -40765
497 -40765 -42843 4002 40044 25172 -14185 -25184 -7331 1461 4527 19811 19516 -15687 -40918
510 -40918 -12110 35825 42026 -3952 -47270 -30380 24015 39526 6191 -18050 -14943 -10122 -3284
523 -3284 15829 26252 7226 -26540 -37180 -1263 44236 33805 -22358 -43338 -8128 24362
535 24362 21116 3234 -9553 -13139 -9114 -889 13684 24200 3232 -34128 -28179 20418 40598
548 40598 6727 -29680 -27167 3272 25799 16215 -7067 -13061 -8409 -9253 2210 26896 21214
561 21214 -19230 -38287 -9971 29505 34621 -301 -33661 -23196 11656 21015 7060 702 -4449
574 -4449 -17354 -13772 11843 26479 10802 -19595 -30382 -1674 31202 21238 -15981 -23977 -3146
587c146J3441r22l803o641q408k716P648J9514Q277k3284l0491R532L7979J2627
601B9607k3497k3755j253J6199J4662k40p386n635q998p037J7116K4517n601l1182
615a2483j4491J8450K6018L983k1300j7509O768J4454K585j466K415q945j3994
628a5515L984K1415J1073j3130k5158m824K3923K0960j0129k2467l606Q818O371
641A715M422L680n530j2432p557Q521K1331P638k1645k2958Q303K4280P013j1793
655D988j1948k667N484O308L525J965l872j3404o369J6697J8388p488k2262o751
669a7406J3234J6506K78j3741q603L773N174K091N679K682j2081j3538N906J9327
683I281R036j3130j9386j976J8099J2066o397j0992k153M11J765O691O894l481
$$ plain form
587 -3146 10295 9373 5570 -1071 -9479 -12195 -4547 14967 23244 -40 -30531 -20999 16980 29607
601 29607 6110 -17645 -18898 -2699 11963 11723 4337 -1298 -10296 -17333 -217 24300 18699 -12483
615 -12483 -26974 -8524 17494 21477 177 -17332 -10564 3890 6475 5009 7424 -1521 -15515
628 -15515 -11531 9884 20957 7827 -17331 -22155 1768 22728 12599 -9868 -13474 -4656 1715
641 1715 6137 9817 4287 -8145 -15702 -7181 14150 21788 143 -22815 -14512 9768 16781 4988
655 4988 -6960 -9627 -4143 2165 5690 7655 3783 -9621 -15990 707 19095 11607 -10655 -17406
669 -17406 -4172 12334 12612 -1129 -9732 -5959 -785 1306 6985 9667 -2414 -15952 -10046 9281
683 9281 18317 5187 -14199 -16175 1924 13990 7593 -3399 -5552 -5141 -3376 3315 10209 6728
697F728j3433q188R605J8521K559j8203j3617P957J4657L447o770o273k528M87
711e051L273P214M900o757j5173k393J6371J4582q085j7493n236J0664J1407O2
725H285o968m891j389m95M133J0128K515j3354j2732N457J7631P031j1764j4951
739a1364L57J2491O802l208m467k852m057L5Q729R248m150j4929p681J0872J6922
754A2748L50j5495r812N517J0051K464j582k942m522m689K486J1245P273q755
768D337j6228j880J5833J1709n674j3763m428O685P511J114j356k648n706m664
782i158N856J2874K756j3541j2969M676J6473O263j0063j1331J08P176M592P81
796D493P9m095q048j843J0586J1829l743j6422p901J0755J5101L93j1661p779
$$ plain form
697 6728 -6705 -14893 -5288 13233 15792 -2411 -16028 -8071 6586 10033 3263 -3010 -5538 -5051
711 -5051 -1778 5436 10336 3579 -11594 -13987 2384 16966 8881 -8612 -13848 -3184 8223 8285
725 8285 1317 -3574 -4963 -5458 -1325 8803 11318 -2036 -14768 -9311 8320 15351 3587 -11364
739 -11364 -11007 1484 8286 5078 611 -2241 -6298 -6263 2466 11714 7564 -7365 -15046 -4174 12748
754 12748 13098 -2397 -12209 -6692 3359 5823 4241 1299 -3223 -7912 -5426 5819 13092 4337
768 4337 -11891 -13771 2062 13771 8097 -5666 -10094 -3409 4102 5216 3860 1212 -4494 -9158
782 -9158 -3302 9572 12328 -1213 -14182 -9506 6967 13230 3167 -8164 -8056 -880 3712 4493
796 4493 4572 477 -7571 -9414 1172 13001 9258 -7164 -15065 -4310 10791 11184 -477 -8256
810h256K314N548L442K510m3o929q906J891J3994R027r227j6327k226J3721J0958
825A1491l804j0456m078K669L476L420L913j268r528p731O680J4967L616j3406
839c9j3095L876J3984N935o623q066j513J987K696M944M106m823j1688l704J1933
854i0J3486l064j5899q188Q921J2593J214p626n428q10Q29L557O958K471q743
869A81j1683J299J4925R813q499j5253k452J0935Q617j486n879l688j795K97N379
884G11P901l61j1997r563P069J5637L560j2378j1409K722J0576N048k978m853
898c15k627k632P69Q175P614n863j3948l831J1324J3296k222j3264p540O329R061
913D326J755k992k773l938l378L725J0271L719r564j2735J227J4432R078p639
$$ plain form
810 -8256 -5942 -394 3048 5558 5515 -1414 -10320 -8429 5565 14592 5365 -10962 -13188 533 11491
825 11491 7687 -2769 -6847 -4178 -702 2718 6631 5363 -4165 -11896 -5216 9751 13367 -39
839 -39 -13134 -9258 4726 10661 4038 -4028 -5541 -3554 -858 4086 8192 3369 -8319 -12023 -90
854 -90 13396 10332 -5567 -13755 -4834 7759 8973 1347 -4081 -4891 -4062 -505 6453 8924 181
869 181 -11502 -10203 4722 14535 6036 -9217 -11669 -734 7883 6397 518 -3170 -4965 -4668 711
884 711 8612 8251 -3746 -13309 -6240 9397 12957 579 -10830 -8108 2468 7516 4538 -315
898 -315 -2942 -5574 -4805 3370 10984 5121 -8827 -12658 -1334 11962 9740 -3524 -11064 -4735 4326
913 4326 6081 3089 316 -3622 -7000 -3275 6996 10715 1151 -11584 -10357 4075 13153 5514
927E514j2923j392P154N717Q52j425l864n324j601O558J0594K48j4427r919Q390
942e848J4998K284j0323q905P86O657M338O45j450l726o816m41J0920R589o537
957F171j4906l226J1188J0782j498j1284n470M400N356J365J352p03o779o226
971i478N723J1299L268j0193j2159J597J4119P760p815r106r33L204L126L816
985D228K281m345q380l692Q304J2610m29j4703r050Q206J2059J149o790n699j052
1000e303L190L474L026J311n132r416n3J3354Q378q495j3061j412R691Q831j415
1015F968q401m027J931J737K883N854m37j0873o942P109J2395K831j0040j1314
1029a0326J950J1871M727n576m472p60j567J385O620L789n088r076l042R061J1541
$$ plain form
927 5514 -7409 -8801 -1647 4070 4922 3497 -367 -5691 -7292 -734 9860 10108 -4319 -14238 -5848
942 -5848 9150 11434 1111 -7794 -7008 -351 3987 4632 3182 -544 -7360 -7801 3119 12708 6171
957 6171 -8735 -11961 -773 10009 8511 -2773 -8243 -3843 1513 2878 4230 3527 -3252 -9478
971 -9478 -3755 7544 10812 619 -11540 -9943 4176 11936 4121 -4985 -5918 -2714 412 4228
985 4228 6509 2164 -6216 -9908 -1604 11006 10577 -4126 -13176 -4970 7089 8238 1448 -4251 -5303
1000 -5303 -2113 1361 4387 5698 566 -8850 -8903 4451 12829 4334 -8727 -10139 -448 8383 6968
1015 6968 -1433 -5460 -3529 -1792 1091 6945 6508 -4365 -11307 -4198 8197 11028 988 -10326
1029 -10326 -8376 3495 8222 2646 -1826 -2586 -4153 -2768 3852 7641 2553 -6523 -9565 -504 11037
1044A1037k810j4060m826Q883P704m75l857m054k311J059M200N386J662q164j0781
1059a1407L311J4758N502r656j0359j97P347O407m80m515k695j833j289N365Q644
1074H903k227j2216n005Q316J0292L20r593p425M107Q382Q24l336j065k225l608
1089e556K886Q299K530p335r540k47J1661Q985o442j2084j115O968M404Q91p88
1104C517m012m664p48N275Q360J050j1289r218O402J3065J334q610o359N25N188
1119a84L474J66j631k166m953j097Q930P844o493j1848j412R850Q295k111r327
1134b663n100N060M881R02j74Lo040n285N787R899J879r269r694K141J1665N642
1150I634o960p755O72L279J535K792J537l872o435j247P201Q883k101j2567n518
$$ plain form
1044 11037 8227 -5833 -10659 -1776 5928 5453 1596 -2458 -4769 -3710 490 5876 7538 -626 -11407
1059 -11407 -8096 6662 12164 2508 -7851 -8048 -701 5706 5226 711 -1984 -3817 -5106 259 8903
1074 8903 6676 -5540 -10545 -2229 8063 8383 -1210 -8635 -4528 3854 4678 1342 277 -1948 -5556
1089 -5556 -2670 5629 8159 824 -8716 -8963 2698 11683 5241 -6843 -7958 -990 3414 4305 3517
1104 3517 -495 -5159 -5907 -632 7728 8778 -2511 -11729 -5327 7738 9072 462 -5897 -5372 -184
1119 -184 3290 3456 1825 -341 -5294 -6391 2539 10383 3890 -7958 -9370 480 8775 6664 -2663
1134 -2663 -7763 -2703 2178 3080 2906 2909 -3131 -8416 -2629 7270 9149 -120 -9814 -7673 3992 9634
1150 9634 2674 -5081 -4409 -1130 405 3197 4734 862 -5573 -6820 381 9264 7163 -5404 -10922
1165a0922R132R729j577p283l725P31L070K956J980on063p450J904J1995N896
1180A1367r122j1086M76R764O211k645o996k506J940J449K632M431j479r175m558
1195i297P575J0210k40j0244p613M746R915J810n986l809K48N2J615M989K171
1210F142n523q117l7J0012Q013n587j1849j896Q758O186j745m456k362j042N50
1225b953L558N061N56q385p560M956J2206K639r809q776K549Q133L425k504l742
1240f46j858j210M63N621N669m159j0724k765R711R420k662j0544m649N491O800
1255C958L78k763j801k304k329K659P502K329p750q908K204J1281N034o932r020
1270f462N28O284L534j041j238k102l238j240N839O957k015j0605n350P876J0504
$$ plain form
1165 -10922 -1790 7939 6362 -921 -4646 -3915 -845 2111 4091 4085 -978 -8428 -6524 5471 11367
1180 11367 2245 -8841 -8365 1399 7610 4965 -2031 -4537 -2597 -1148 1484 5915 4436 -4739 -9297
1195 -9297 -1722 8488 8248 -1996 -9609 -4863 5052 6862 876 -2933 -2685 -2633 -1018 3971 6142
1210 6142 619 -7498 -7535 2477 10490 4903 -6946 -8842 -84 6102 4357 -99 -2461 -3503 -2953
1225 -2953 605 5666 6222 -2163 -9723 -4767 7439 10078 269 -8507 -5958 2175 5600 3096 -646
1240 -646 -2504 -3714 -3251 2370 8039 3880 -6844 -9609 102 9522 6860 -3684 -8333 -2842 3958
1255 3958 4336 1573 -228 -2532 -4861 -2202 5300 7629 -121 -9029 -6825 4456 9490 2558 -6462
1270 -6462 -5934 350 3884 2843 1605 -497 -3735 -4975 864 7821 5806 -4799 -10149 -2273 8231
1285H231o25r338n414L621M888J991p56r97l617m056K297Q262N134p509j0717
1300h605lJ0735P423n387q498k098M576M183L53M29j233n234l273N198R105M07
1316H078j0144p979N351J0342J910p100n651P99M014K162R47J027l282o270m25
1331f221Q844P302n295j1433k274Q733P966k134p589k586K462J949J665K473m90
1346C372n724n478L845J0816K702r457r806L054J0439M216n408n848p28J971J532
1361e02L076L000k861q472k990Q552R850k802j1154n322O539Q691L64n683l009
1376b723K2J04J732N081K275o270q346J205J0980O407p049j0772n70Q439N829
1391F344k949m158j532m24j28L540N285o09q919o159O384J1399R84j0570p193
$$ plain form
1285 8231 7606 -1732 -7146 -3525 1363 3354 2598 1601 -2016 -6072 -3775 4487 9621 2112 -8605
1300 -8605 -8608 2127 9550 4163 -4335 -6433 -1857 2326 2679 3108 1875 -3359 -6632 -1434 7671 8078
1316 8078 -2066 -10045 -4694 5648 7558 458 -5193 -4394 -380 1782 2729 3756 474 -5796 -6221
1331 -6221 2623 9925 4630 -6803 -9077 -344 7622 5488 -2101 -4687 -2225 -276 1389 3862 3372
1346 3372 -2352 -7830 -3985 6831 9533 76 -9730 -6676 3763 7979 2571 -3277 -4005 -2034 -502
1361 -502 2574 5574 2713 -5759 -8749 -197 9653 6851 -4303 -9625 -3086 5605 5969 286 -2723
1376 -2723 -2701 -2597 -865 4216 6491 221 -8125 -6920 4060 10467 3418 -7354 -7924 515 6344
1391 6344 3395 -763 -2295 -2719 -2847 693 5978 5369 -3550 -9709 -3325 8074 9058 -1512 -8705
1406h705M045Q021K119l560k829j271j449P63N788M519m559j0501j315J0421Q388
1421I875m499j0116l321O257O069m52k737j131k445k613L312Q198J464q914q517
1436i570L173J1436M945q041q842J301O440K381p72n07k064m059r02N801O872
1451G592j806j0453n188Q099J0003j731q965l623L539M090J202n15q57k683m021
1466e317J223Q478M675p712j0269J734J0394N361m970p909j439M547L399K3O98
1481B916p23n932l545O153R311r03j0162o594N046J0231J746p353n231K523K503
1496a4M88K212J638m238o050L57P879O586m444j0870k475R754O931l820o175j055
1512c296Q86J702K246K462m85n270n882L180J1005L022j0250q247L908Q391K664
$$ plain form
1406 -8705 -4660 3361 5480 1920 -909 -2180 -3629 -2866 2922 7441 2882 -7619 -8934 1487 9875
1421 9875 5376 -4740 -8061 -1804 4265 3813 1076 -55 -2500 -5113 -1801 6397 7861 -1053 -9570
1436 -9570 -6397 5039 9984 1943 -6899 -5598 842 3223 2451 1944 -120 -4179 -5081 720 7592
1451 7592 5786 -4667 -9855 -1756 8247 6516 -2449 -6072 -2533 1557 2759 2244 1387 -1296 -5317
1466 -5317 -4094 4384 9059 1347 -8922 -7188 3206 8567 3597 -4312 -5751 -1204 2195 2218 2916
1481 2916 2193 -3739 -7284 -1131 8180 7277 -2885 -9479 -4433 5798 7544 191 -5040 -2517 -14
1496 -14 474 2686 4324 86 -5964 -5607 2272 8858 4414 -6456 -8931 823 7754 3934 -2241 -3296
1512 -3296 -2410 -708 1538 4000 3515 -1755 -7637 -4457 6548 9570 -680 -8927 -5019 3372 6036
1527F036l964m664o09J902N30J780M415j937r115k541Q969Q148l425r738m184
1542h397O135Q195m18o552j926J183n41J350N809J476p496p266K538J0088N992
1557A0170o893j0959M7R097M029k970k057j325k405n82M332N264k02p997o792
1572i243N495J1372L64j0160n195M472N670R90k140k447q17j062q8N002N346n158
1588B401j0365JJ0609O498m733q931k680N526O065r70k794k48k329m009M013Q537
1604F591O80q699p425L176R946M910p282q199J475N881J174p66J040k049m558
1619d105p42N493O205j186r692n737P860J0081k045q488k655K751K770J597P25
1634B832p69l069m419N04Q460N745p023j0490J039R464M762l655o055j599K973
$$ plain form
1527 6036 2072 -2592 -3201 -1299 -769 1011 5426 3489 -5626 -8167 802 8950 5525 -4213 -8397
1542 -8397 -2262 5933 5515 -1037 -2963 -1780 -2321 -971 4838 6314 -1182 -8448 -5910 4178 10170
1557 10170 3277 -7682 -7635 1462 5491 2521 464 -861 -3266 -3848 484 5748 5546 -2451 -9243
1572 -9243 -3748 7624 7988 -2172 -7367 -2895 2775 3765 1625 -822 -1639 -2701 -2789 2213 7559 2401
1588 2401 -7964 -7963 2646 9144 4411 -4520 -7200 -1674 4391 3421 627 379 -1950 -5959 -1946 6591
1604 6591 7271 -1428 -8853 -5677 4269 9179 1897 -6302 -4827 1054 2228 1462 2502 453 -4105
1619 -4105 -4847 646 6851 5665 -4027 -9764 -1904 8177 6132 -2356 -5011 -2260 510 2107 2832
1634 2832 2063 -1006 -5425 -4921 3539 9284 2261 -8229 -7190 2274 7036 3381 -2674 -4273 -1300
1649a300K311QJ500O29n322m925N041Q973j18q875n921L962Q612K201o366m782
1665d372J857K224J75K426K282l744o563m28P535O901l031j0256l543P538P246
1680F247k281m832j377k0L25J871L774N69m762o037J431Q924N076p918p836K282
1696d564O094K875k458l079k74j24j88K044M189o99p134l779N915Q233j591p651
1712b191m738M439N711Q46l435j512Q4j594L39M534L539n202o812m23Q150N694
1728G429l645q404j493N744L708j194j495r48j568j477K248N613M43o436n877
1743g352L510Q237K135o100n697J967M193J335m33r92j036k528q01L601N507j609
1759C937p651l005O095O571j326o844k432K742L368J99n61N37k278l193J233N588
$$ plain form
1649 -1300 1011 1019 2519 3148 -2174 -7099 -2058 6915 6797 -2078 -7999 -4037 4575 6776 410 -4372
1665 -4372 -2515 -291 -116 2310 4592 848 -5715 -6143 1392 8293 5262 -4994 -8537 -999 6247
1680 6247 3966 -866 -2243 -2263 -1938 -67 3707 4276 -486 -6523 -5092 3832 8908 990 -6846 -4564
1696 -4564 1530 4405 1947 -1132 -1406 -1530 -1718 326 4515 3816 -3318 -7097 -1182 7051 5460 -2191
1712 -2191 -6929 -2490 3221 4067 632 -880 -796 -2390 -2051 2483 6022 820 -5992 -6415 1735 7429
1728 7429 3784 -4620 -6113 -369 3339 2145 650 -298 -1866 -3343 -1095 4518 4961 -1475 -7352
1743 -7352 -3842 4395 6530 430 -5267 -3300 893 2228 1795 803 -233 -2761 -3562 39 5546 3937
1759 3937 -3714 -6719 -624 5947 4621 -2223 -4655 -1913 1455 1654 1093 1630 -648 -3841 -2608 2980
$$ [...]
8191i2
##END NTUPLES=NMR FID
##END=
