##TITLE=1H_ES-C12diacid
 Cd3OD
 8 sc, 
 9.4.2024
##JCAMPDX= 6.0         $$ Bruker NMR JCAMP-DX V2.0
##DATA TYPE= NMR FID
##DATA CLASS= NTUPLES
##ORIGIN= UXNMR, Bruker Analytische Messtechnik GmbH
##OWNER= root
$$ XWIN-NMR		Version 3.5
$$ Tue Apr  9 14:11:53 2024 Russian Standard Time (UT+4h)  she@DPX200
##.OBSERVE FREQUENCY= 200.1309
##.OBSERVE NUCLEUS= ^1H
##.DELAY= (6, 6)
##.ACQUISITION MODE= SIMULTANEOUS
##.ACQUISITION SCHEME= undefined
##.AVERAGES= 8
##.DIGITISER RES= 18
##SPECTROMETER/DATA SYSTEM= spect
##.PULSE SEQUENCE= zg30
##.SOLVENT NAME= CDCl3
##.SHIFT REFERENCE= (INTERNAL, CDCl3, 0, 15.7039)
##AUDIT TRAIL= $$ (NUMBER, WHEN, WHO, WHERE, WHAT)
$$ ##TITLE= Audit trail, XWIN-NMR		Version 3.5
$$ ##JCAMPDX= 5.01
$$ ##ORIGIN= Bruker BioSpin GmbH
$$ ##OWNER= she
$$ F:/spectra/data/she/nmr/H-F/1/audita.txt
$$ ##AUDIT TRAIL=  $$ (NUMBER, WHEN, WHO, WHERE, WHAT)
(   1,<2024-04-09 14:10:20.98 +0400>,<she>,<DPX200>,
      <created by zg, POWCHK disabled, PULCHK disabled
       configuration hash MD5:
       00 E9 B6 7A A2 85 ED C7 34 08 36 98 17 FE 4E 26
       data hash MD5: 16K
       70 F1 57 AE 6D 6B BF 78 B5 62 E1 20 35 D8 82 E9>)
$$ ##END=
$$ 
$$ hash MD5
$$ 13 50 7B D6 A3 2E E1 84 B7 A7 8E 3D 63 A6 1F 82
##$RELAX= 
##$RELAX= 
##$RELAX= 
##$RELAX= 
##$RELAX= 
##$RELAX= 
$$ Bruker specific parameters
$$ --------------------------
##$DU= <F:/spectra>
##$EXPNO= 1
##$NAME= <H-F>
##$PROCNO= 1
##$TYPE= <nmr>
##$USER= <she>
##$AMP= (0..31)
100 100 100 100 100 100 100 100 100 100 100 100 100 100 100 100 100 100 
100 100 100 100 100 100 100 100 100 100 100 100 100 100 
##$AQSEQ= 0
##$AQ_mod= 1
##$AUNM= <au_zg>
##$AUTOPOS= <>
##$BF1= 200.13
##$BF2= 200.13
##$BF3= 200.13
##$BF4= 200.13
##$BF5= 200.13
##$BF6= 200.13
##$BF7= 200.13
##$BF8= 200.13
##$BYTORDA= 1
##$CFDGTYP= 0
##$CFRGTYP= 5
##$CHEMSTR= <none>
##$CNST= (0..31)
1 1 145 1 1 1 1 1 1 1 1 1 1 1 1 1 1 1 1 1 1 1 1 1 1 1 1 1 1 1 1 1 
##$CPDPRG= <>
##$CPDPRG1= <>
##$CPDPRG2= <>
##$CPDPRG3= <>
##$CPDPRG4= <mlev>
##$CPDPRG5= <mlev>
##$CPDPRG6= <mlev>
##$CPDPRG7= <mlev>
##$CPDPRG8= <mlev>
##$CPDPRGB= <>
##$CPDPRGT= <>
##$D= (0..31)
0 1.2 0 0 0 0 0 0 0 0.06 0 0.03 0 0 0 0 0.0002 0 0 0 0 0 0 0 0 0 0 0 0 
0 0 0 
##$DATE= 1712657420
##$DBL= (0..7)
120 120 120 120 120 120 120 120 
##$DBP= (0..7)
150 150 150 150 150 150 150 150 
##$DBP07= 0
##$DBPNAM0= <>
##$DBPNAM1= <>
##$DBPNAM2= <>
##$DBPNAM3= <>
##$DBPNAM4= <>
##$DBPNAM5= <>
##$DBPNAM6= <>
##$DBPNAM7= <>
##$DBPOAL= (0..7)
0.5 0.5 0.5 0.5 0.5 0.5 0.5 0.5 
##$DBPOFFS= (0..7)
0 0 0 0 0 0 0 0 
##$DE= 6
##$DECBNUC= <off>
##$DECIM= 32
##$DECNUC= <off>
##$DECSTAT= 4
##$DIGMOD= 1
##$DIGTYP= 9
##$DL= (0..7)
0 120 120 120 120 120 120 120 
##$DP= (0..7)
150 150 150 150 150 150 150 150 
##$DP07= 0
##$DPNAME0= <>
##$DPNAME1= <>
##$DPNAME2= <>
##$DPNAME3= <>
##$DPNAME4= <>
##$DPNAME5= <>
##$DPNAME6= <>
##$DPNAME7= <>
##$DPOAL= (0..7)
0.5 0.5 0.5 0.5 0.5 0.5 0.5 0.5 
##$DPOFFS= (0..7)
0 0 0 0 0 0 0 0 
##$DQDMODE= 0
##$DR= 18
##$DS= 0
##$DSLIST= <SSSSSSSSSSSSSSS>
$$ [...]
##$SUBNAM2= <"">
##$SUBNAM3= <"">
##$SUBNAM4= <"">
##$SUBNAM5= <"">
##$SUBNAM6= <"">
##$SUBNAM7= <"">
##$SUBNAM8= <"">
##$SUBNAM9= <"">
##$SW= 18.0517689322627
##$SWIBOX= (0..15)
0 0 2 0 0 0 0 0 0 0 0 0 0 0 0 0 
##$SW_h= 3612.71676300578
##$TD= 16384
##$TD0= 1
##$TE= 0
##$TE2= 300
##$TE3= 300
##$TEG= 300
##$TL= (0..7)
0 120 120 120 120 120 120 120 
##$TP= (0..7)
150 150 150 150 150 150 150 150 
##$TP07= 0
##$TPNAME0= <>
##$TPNAME1= <>
##$TPNAME2= <>
##$TPNAME3= <>
##$TPNAME4= <>
##$TPNAME5= <>
##$TPNAME6= <>
##$TPNAME7= <>
##$TPOAL= (0..7)
0.5 0.5 0.5 0.5 0.5 0.5 0.5 0.5 
##$TPOFFS= (0..7)
0 0 0 0 0 0 0 0 
##$TUNHIN= 0
##$TUNHOUT= 0
##$TUNXOUT= 0
##$USERA1= <user>
##$USERA2= <user>
##$USERA3= <user>
##$USERA4= <user>
##$USERA5= <user>
##$V9= 5
##$VALIST= <valist>
##$VCLIST= <CCCCCCCCCCCCCCC>
##$VD= 0
##$VDLIST= <DDDDDDDDDDDDDDD>
##$VPLIST= <PPPPPPPPPPPPPPP>
##$VTLIST= <TTTTTTTTTTTTTTT>
##$WBST= 1024
##$WBSW= 4
##$XGAIN= (0..3)
0 0 0 0 
##$XL= 0
##$YL= 0
##$YMAX_a= 114116
##$YMIN_a= -108386
##$ZGOPTNS= <>
##$ZL1= 120
##$ZL2= 120
##$ZL3= 120
##$ZL4= 120
##$ABSF1= 10
##$ABSF2= 0
##$ABSG= 5
##$ABSL= 3
##$ALPHA= 0
##$AQORDER= 0
##$ASSFAC= 0
##$ASSFACI= 0
##$ASSFACX= 0
##$ASSWID= 0
##$AUNMP= <proc_1d>
##$AZFE= 0.1
##$AZFW= 0.1
##$BCFW= 1
##$BC_mod= 2
##$BYTORDP= 1
##$COROFFS= 0
##$CY= 11.3945322036743
##$DATMOD= 1
##$DC= 2
##$DFILT= <>
##$DTYPP= 0
##$F1P= 15.7292609196834
##$F2P= 12.9074282941183
##$FCOR= 0.5
##$FTSIZE= 0
##$FT_mod= 4
##$GAMMA= 1
##$GB= 0.15
##$INTBC= 1
##$INTSCL= 1
##$ISEN= 128
##$LB= 0.24
##$LEV0= 0
##$LPBIN= 0
##$MAXI= 10000
##$MC2= 0
##$MEAN= 0
##$ME_mod= 0
##$MI= 1.114404
##$NCOEF= 0
##$NC_proc= 0
##$NLEV= 6
##$NOISF1= 3.799351
##$NOISF2= 2.8
##$NSP= 1
##$NTH_PI= 0
##$NZP= 0
##$OFFSET= 15.70392
##$PC= 1
##$PHC0= -25461.54
##$PHC1= 13.18731
##$PH_mod= 1
##$PKNL= yes
##$PPARMOD= 0
##$PSCAL= 0
##$PSIGN= 0
##$REVERSE= no
##$SF= 200.130013532006
##$SI= 16384
##$SIGF1= 3
##$SIGF2= 2
##$SINO= 400
##$SIOLD= 16384
##$SREGLST= <1H.CDCl3>
##$SSB= 0
##$STSI= 0
##$STSR= 0
##$SW_p= 3612.71676300578
##$SYMM= 0
##$S_DEV= 0
##$TDeff= 0
##$TDoff= 0
##$TI= <>
##$TILT= no
##$TM1= 0
##$TM2= 0
##$TOPLEV= 0
##$USERP1= <user>
##$USERP2= <user>
##$USERP3= <user>
##$USERP4= <user>
##$USERP5= <user>
##$WDW= 1
##$XDIM= 8192
##$YMAX_p= 0
##$YMIN_p= 0
$$ End of Bruker specific parameters
$$ ---------------------------------
##NTUPLES= NMR FID
##VAR_NAME=  TIME,          FID/REAL,        FID/IMAG
##SYMBOL=    X,             R,               I
##VAR_TYPE=  INDEPENDENT,   DEPENDENT,       DEPENDENT
##VAR_FORM=  AFFN,          ASDF,            ASDF
##VAR_DIM=   8192,          8192,            8192
##UNITS=     SECONDS,       ARBITRARY UNITS, ARBITRARY UNITS
##FACTOR=    0.0002768,     1,               1
##FIRST=     0,             0,               0
##LAST=      2.2672688,     0,               0
##MIN=       0,             -108386,         0
##MAX=       2.2672688,     114116,          0
$$ Real data points
##PAGE= N=1
##DATA TABLE= (X++(R..R)), XYDATA
0@%%%%%%%%%%%%%%%%%%%qJ6j6J6j6J6k1K9l2L4m2M8n6O4p2Q2r0J04j18J31j46
$$ 0 0 0 0 0 0 0 0 0 0 0 0 0 0 0 0 0 0 0 0 -8 8 -8 8 -8 8 -13 16 -16 18 -24 24 -32 32 -40 42 -48 56 -62 69 -77
40g7J63j81K02k24K48k75L04l36L69m06M47m92N43n99O60p28Q05q93R93j108J244
$$ -77 86 -95 107 -117 131 -144 160 -176 193 -213 234 -258 285 -314 346 -382 423 -470 523 -585 659
61F59j402J594j834K136k532L074l841M912p670J19020l7661j75983M3314J53261
$$ 659 -743 851 -983 1153 -1379 1695 -2146 2766 -4904 114116 76455 -99528 -56214 97047
75I7047k1670j36400K6642J08711l7150j03472M6927Q6325o7120r5887P7170J04321
$$ 97047 75377 -61023 -34381 74330 37180 -66292 -19365 66960 -160 -96047 -18877 85444
87H5444p4504j14338O6474J19609m1639j03723L3167Q7002k3242o3664K5399L8700
$$ 85444 10940 -103398 -36924 82685 41046 -62677 -29510 57492 34250 -29414 -4015 34685
99C4685l7674k3730N1357R043p5710j4605Q8614K3427r1435l2014Q6916L6533
$$ 34685 -2989 -26719 24638 33681 -42029 -56634 31980 55407 -36028 -68042 18874 55407
111E5407p3287k7186O8062J8107o1504j399O2675j6845p3619K8750Q8089l5315
$$ 55407 -17880 -45066 22996 41103 -20401 -21800 40875 24030 -49589 -20839 67250 31935
123C1935j08556K5941J17660j3990j18214L176J12429M277j00081l151R0501J34
$$ 31935 -76621 -50680 66980 52990 -65224 -62048 50381 54658 -45423 -48574 41927 42061
135D2061p8774J1401P4097k5153p8474L3706Q6636l6245r6912K8120R8540j9677
$$ 42061 -36713 -25312 48785 23632 -54842 -21136 65500 29255 -67657 -39537 59003 39326
147C9326r4966J1897Q7315n764p4497N405O1543q958m7748K0699M1320l3691m2905
$$ 39326 -55640 -43743 43572 37808 -36689 -31284 30259 21301 -26447 -5748 35572 1881 -41024
160d1024M1812M7458m5052n2481M1905N2634l8562n0875L4015M5716k9130l5653
$$ -41024 788 48246 3194 -49287 -7382 45252 6690 -44185 -10170 35546 6416 -29237
172b9237K8916K4236l3319j3715M3882J0159n3880j2156N9550J5540o2101j9279
$$ -29237 -321 23915 -9404 -23119 20763 30922 -22958 -35114 24436 39976 -22125 -41404
184d1404O0869K1148n8280k2234N2755J9564m6728j2033M4987L613m7483L114
$$ -41404 19465 40613 -17667 -39901 12854 32418 -14310 -26343 18644 22257 -25226 -22112
196b2112N3175m737n7517L860N9428k665o0261K35N8798K038n4965l375M8234
$$ -22112 31063 26326 -31191 -27331 32097 29432 -30829 -30594 28204 30242 -24723 -28098 20136
209B0136P94m2101N581L9819j1730m0317J6006M2192j7827m2926J9029M3258j9444
$$ 20136 20930 -21171 -15590 24229 12499 -27818 -11812 30380 12553 -30373 -11344 31914 12470
222A2470m4076J8002M2670j6079l8474J5376L2743j8258k8276K2905K6715k6405
$$ 12470 -31606 -13604 29066 12987 -25487 -10111 22632 4374 -23902 -997 25718 -687
234f87k6135K8857K5628l0798k5093L2487K5748l2828k6350L0917K4577k9064
$$ -687 -26822 2035 27663 -3135 -28228 4259 30007 -2821 -29171 1746 26323 -2741
246b741k0857K8974J6773l0848j4278L2698J3038l3520j1194L4432R477l5843
$$ -2741 -23598 5376 22149 -8699 -22977 9721 22759 -10761 -21955 12477 21954 -13889
258a3889q665L6766R087l5945q878L3840O517l2500l590L2680J214l3014J1L2627
$$ -13889 -22554 14212 23299 -12646 -21524 12316 18833 -13667 -17257 15423 16637 -16377 -16366 16261
272A6261j593l1792L987L2050n834l2747O291L2539o302l0924P478K9077r763
$$ 16261 14668 -17124 -13137 18913 13079 -19668 -13377 19162 12860 -18064 -10586 18491 8728
285H728k8589J1460K8534j2197k7612J2971K5872j4541k4740J6509K4670j7347
$$ 8728 -19861 -8401 20133 7936 -19676 -6705 19167 4626 -20114 -3605 21065 3718
297C718k4407J7369K3068j7863k1182J9342K0027k0721j9904K1100J9125k1014
$$ 3718 -20689 -3320 19748 1885 -19297 45 20072 -649 -20553 547 19672 -1342
309a342j7339K1578J5584k2790j4719K3539J4373k3338j3111K3153J1010k3751
$$ -1342 -18681 2897 18481 -4309 -19028 4511 18884 -4454 -17565 5588 16598 -7153
321g153r521K4872Q869k5216q368K4727O997k4543n161K5000M142k5591l638K5093
$$ -7153 -16674 8198 17067 -8149 -16517 8210 15207 -9336 -14497 10503 14645 -10946 -14584 10509
335A0509K946k4185j119K3803o88k4216J647K4402k229k3752L241K3097m940k3090
$$ 10509 13455 -10730 -11849 11954 11266 -12950 -11303 13099 10870 -12882 -9641 13456 8516 -14574
349a4574O082K3585o311k3293O449K1963p293k0700Q704K0180r822j9714J0395
$$ -14574 -8492 15093 8782 -14511 -8062 13901 6608 -14092 -5388 14792 4970 -14744 -4349
362d349J8727j1282j7641J2929J7255j4441j7683J4758J7819j4228j6972J4020
$$ -4349 14378 3096 -14545 -1616 15639 1198 -16485 -1727 16092 1864 -15108 -1088
374a088J5508j4377j4362J4895J3329j5075j1793J5673R842j7089q769J8956Q931
$$ -1088 14420 43 -14319 576 13905 -1170 -12963 2710 12552 -4537 -13306 5650 14581
387A4581j9945r705J9757R817j8945r179J8275Q234j7643p067J6758N249j6276
$$ 14581 -5364 -15069 4688 14505 -4440 -13619 4656 12890 -4753 -11820 4938 10187 -6089
400f089k662J6999M13j8886M44K0726J15k1430j139K1106J637k0132j785J8601
$$ -6089 -8751 8248 8661 -10225 -9781 10945 11060 -10370 -11509 9597 11234 -8898 -10683 7918
414G918J582j6541l44J4477k253j3581N495J4441p817j6466Q604J8121p914j9016
$$ 7918 9500 -7041 -7385 7092 4839 -8742 -3247 11194 3377 -13089 -4485 13636 5722 -13294
428a3294O831J8831n425j7764M267J5369l937j2196N423R315q480q256J1975R179
$$ -13294 -6463 12368 6943 -10821 -6554 8815 4878 -7318 -1895 7420 -1060 -9316 2659 11838
442A1838j4454j0973J5186J2967j4752j4388J3163J4843j0750j3686Q447J0593
$$ 11838 -2616 -13589 1597 14564 -188 -14576 -1413 13430 2680 -11006 -2559 8034
454H034p549o635Q992L463j2180k096J5563K744j8107m744J9204P325j8645r634
$$ 8034 485 -6150 2842 6305 -5875 -7971 7592 10336 -7771 -12515 6689 14014 -4631 -14265
468a4265J6254J0521j2517r252R234N689p817j305Q814k144j1596L917J4809l653
$$ -14265 1989 12510 -7 -9259 -25 5664 -2153 -3458 5356 3212 -8384 -4467 10342 6689
482F689j7590J777J9032J145j8224m064J5145N224j0703l814O881J93n263M414
$$ 6689 -10901 -9124 9908 11053 -7171 -11235 3910 9134 -1569 -5383 1498 1691 -3572 842
496H42N801q247q204J0554J1559j0801j4783Q725J6663n254j5901J866J2725m25
$$ 842 6643 -1604 -9808 746 12305 1504 -13279 -4554 12109 6855 -9046 -7180 5545 5120
510E120q230J518M373m895k214R184K374j3153m759J5780Q484j5963j2228J3409
$$ 5120 -3110 -1592 2781 -2114 -4328 4856 7230 -5923 -10682 5098 13582 -2381 -14609 -1200
524a200J4476r327j3827N373J0567l205o185L626K013o160O30R986r46j4020j000
$$ -1200 13276 3949 -9878 -4505 6062 2857 -3328 298 2311 -3849 -3219 6767 5821 -8199 -9199
539i199J6536M641j6405q345J3552J0487r342r771N192O692k689k326K489k107
$$ -9199 7337 11978 -4427 -12772 780 11267 1925 -7846 -2654 4038 1349 -977 1512 -595
553e95m503N284Q081o110j2027M497J4577j142j4619k371J2192M283q254l971
$$ -595 -5098 186 8267 2157 -9870 -5373 9204 8062 -6557 -8928 3264 7547 -707 -4678
567d678M369J375j691K740J165p119k943J0313O507j1227j0505R617J3158o297
$$ -4678 -309 1066 -625 2115 3280 -3839 -6782 3531 10038 -1189 -11694 -2077 11081 4784
581D784j3371K684J1381m19p782N3M108j975j253N365L69r197j805J1944M965
$$ 4784 -8587 -5903 5478 5059 -2723 -2670 1438 -537 -1790 3575 3944 -5253 -7058 4886 9851
596I851j2636q419J1000J0722p905j0896M467R141j997n915J198K283k501P56
$$ 9851 -2785 -11204 -204 10518 2613 -8283 -3816 5325 3328 -2587 -1389 894 -1607 -851
610h51N239j907q488R97J0948J378j1613m037J0281N932p645o252M545M917k208
$$ -851 4388 2481 -6007 -5010 5938 7316 -4297 -8334 1947 7879 234 -6018 -1473 3444 1236
625A236k042J278j392k202M169M707n454p520M804R745k857j0474M68R624J279
$$ 1236 -806 472 -920 -3122 1047 5754 300 -7220 -2416 7329 4472 -6002 -5534 4090 5369
640E369p415j989M913R34k666J384J646m151k310O357M225p338o440O851Q159
$$ 5369 -2046 -4035 878 1812 -854 530 2176 -1975 -4285 2072 6297 -1041 -7481 -630 7529
655G529n205q830L159Q196j498o392P53M110j344k069K956J128n019j385O711
$$ 7529 2324 -6506 -3347 4849 3351 -3041 -2288 1822 478 -1591 1365 2493 -2526 -3911 2800
670B800K462p357m147P157N361n903n872M294N313k856l866K153K017k524k80
$$ 2800 5262 -2095 -6242 915 6276 373 -5499 -1205 4108 1252 -2614 -461 1556 -968 -1248
685a248L598n94n130O62O374R0p055j103O870K069n937k579M768K150l654j052
$$ -1248 2350 1756 -3374 -2712 3662 3752 -3303 -4406 2464 4533 -1404 -3983 785 2935 -719 -1771
701a771L081l21l166J457L891k257m746K280N690j949o071J238N898m81n372K14
$$ -1771 1310 989 -2177 -720 3171 914 -3832 -1552 4138 2189 -3882 -2644 3254 2773 -2599 -2385
717b385M504n44l541J129L035j960l046K862L267l288l750L334M224l133m356
$$ -2385 2119 1575 -1966 -837 2198 238 -2808 54 3321 33 -3717 -383 3841 708 -3648
732c648K670M281k410l722K180L172k331k600K680K154l038k106L566K104l816
$$ -3648 -978 3303 893 -2829 -649 2523 192 -2408 272 2426 -612 -2718 848 2952 -864
747h64k206L766K432l722k425L581K177l357j866L210J605l368j220L477R76l501
$$ -864 -3070 696 3128 -594 -3019 562 2739 -618 -2484 726 2331 -1037 -2257 1220 2196 -1305
763a305r04L724P56l789o78L705N94l648m97L637K85l582m5L538j26l508K02L530
$$ -1305 -2209 1515 2271 -1518 -2196 1509 2103 -1545 -2042 1595 1880 -1702 -1747 1791 1665 -1843 -1641 1889
781A889l07l468L84L374n21l212O66L075q63k946J058K975j296l001J410L033
$$ 1889 1582 -1886 -1502 1872 1351 -1861 -1195 1880 1017 -1929 -871 2104 808 -2193 -783 2250
797B250j533k902J434K901j471k705J429K566j562k322J726K079j866j991K071
$$ 2250 717 -2185 -751 2150 679 -2026 -597 1969 407 -1915 -189 1890 24 -1967 104
812A04J980k305j969K379K006k336j979K285J944k245j809K166J569k146j302
$$ 104 2084 -221 -2190 189 2195 -141 -2120 165 2109 -136 -1945 221 1790 -356 -1658
827a658K237J063k295r21K432P89k525q13K744P04k750p03K666P23k633o41K476
$$ -1658 579 1642 -653 -1574 858 1647 -878 -1691 1053 1757 -993 -1696 970 1693 -940 -1581 895
844H95N92k316m52K159K38k187R0K239l60k295N35K357n20k565N34K638m59k543
$$ 895 1487 -829 -1281 878 1116 -1071 -981 1258 898 -1397 -862 1495 975 -1590 -1056 1582 1123 -1420
862a420K78K495k67k250K76J995m41j741P21J587j122j537J416J704j616j985
$$ -1420 -1142 1353 1086 -1164 -888 1107 666 -1075 -354 1233 111 -1426 -10 1694 78 -1907
878a907J621K255j501k289J139K219q27j917P08J410p49r11J030N58j494m59K030
$$ -1907 -286 1969 468 -1821 -682 1537 710 -1207 -499 911 162 -749 281 839 -655 -1114 916
895I16N36k221j136K453J443k131j738J672J768j128j484Q13P53o97J4R07m71
$$ 916 1452 -769 -1905 548 1991 -140 -1878 -206 1562 434 -1050 -237 516 -181 -167 740 269
912B69j549P17K208n24k749k5K929O59k627j288K069J427j219j087N67L48l95
$$ 269 -1280 -563 1645 1121 -1628 -1653 1276 1935 -692 -1980 89 1516 297 -790 -223 125 -270
929b70P08M63j340j219J719K068j482k785Q68L014N5k795q04K013J110j011q45
$$ -270 438 901 -439 -1658 61 2129 647 -2138 -1270 1744 1799 -996 -1800 213 1323 312 -533
946e33R3Q1L06J135k27j978o11K474J607k298k457J499K965n25k678n04J775J043
$$ -533 -440 -359 -53 1082 855 -1123 -1734 740 2347 49 -2408 -909 2056 1531 -1147 -1651 124 1167
964A167o50p41n55l3J132J272r44k514K99L072R14l085j975K241K620q91k621
$$ 1167 517 -224 -779 -812 320 1592 648 -1866 -1567 1505 2419 -666 -2641 -400 2220 1329 -1292
981a292j73J627R14l57p74r08j64J809J290j706k566R09L378K74l321j543K506
$$ -1292 -1465 162 1076 719 -55 -963 -1127 682 1972 266 -2300 -1391 1987 2261 -1060 -2603 -97
998i7K347j277k242j25J423R66q0j032j242K67K164J000k276k319J524L286l36
$$ -97 2250 973 -1269 -1394 29 995 915 -117 -1359 -1092 1072 2072 -204 -2523 -999 2287 1951
1015A951l221j107K536J861j098j906l94J211J308J02j440j599Q06K587N41k918
$$ 1951 -1270 -2377 159 2020 922 -984 -1378 -167 1141 1243 -197 -1796 -990 1597 2138 -780
1031g80j858K162K925r78l068l37K222J455j014j564m08Q79J465L85j779j808
$$ -780 -2638 -476 2449 1471 -1597 -1934 288 1743 729 -835 -1243 -364 1101 1486 -293 -2101
1047b101J183K845J20l076j570K544K472j220k813k7K133J049r79j414l13Q10
$$ -2101 -918 1927 2047 -1029 -2599 -55 2417 1197 -1616 -1643 490 1539 560 -854 -1167 -357
1063c57J454L85j882j658J293K750k41l019j054K543J997j365k364J00J888R33
$$ -357 1097 1482 -400 -2058 -765 1985 1744 -1275 -2329 214 2211 846 -1518 -1418 470 1403
1079A403p41j397n65R83J665j5k025j376J781K311p31k725l94K259J432j349j781
$$ 1403 662 -735 -1300 -317 1348 1333 -692 -2068 -287 2024 1293 -1432 -1826 433 1865 516 -1265
1096a265J92J374Q39m51j290p28R35J840j40k206j036K003J946j182k358J78K052
$$ -1265 -1073 301 1140 689 -601 -1329 -394 1446 1306 -900 -1936 67 2013 831 -1527 -1349 703
1113G03P42j298j152K62R30O36j66j124q03R18J686j85k075p29J857J602j310
$$ 703 1445 147 -1005 -743 187 823 657 -467 -1270 -352 1334 1149 -926 -1655 202 1804 494
1130D94j932M09J844L85j145q91K73P10N86j33j004o63Q88J389m18j756l56J783
$$ 494 -1438 -1029 815 1200 55 -836 -563 147 733 600 -404 -1067 -179 1210 792 -964 -1320 463
1148D63J014j262j391M99J312K00q16n50N7M63O10K8j054n56R68J181o64j484
$$ 463 1477 215 -1176 -677 635 835 19 -531 -474 -11 599 627 -427 -983 -15 1166 502 -982
1166i82J41J456M20j128p29N05P79o2l87k20k07K51O30Q9r81m45R96R27q14j163
$$ -982 -841 615 1035 -93 -822 -317 462 400 13 -207 -414 -163 467 556 -425 -870 126 1053 239 -924
1186i24L76J214Jr69k73N42K73j21k3j24k68J09O24O1q79l08Q95N99o95q57M83
$$ -924 -548 666 667 -302 -575 -33 240 119 96 -28 -296 -187 437 498 -381 -689 206 805 110 -747 -264
1207b64Q00j58o41J6L11Nj57K57j22l34J23N54p2p07j49Q19L41o99m40M57M52
$$ -264 536 378 -263 -247 64 69 -88 169 47 -287 -164 390 318 -389 -538 281 622 -77 -517 -60 392
1228C92l39l25K94J66l37L8L37j06m41J01O29j63o36O6O08P8n18r3M05Ml51QM22
$$ 392 53 -272 22 188 -149 -111 226 120 -321 -220 409 246 -390 -324 284 362 -156 -249 156 160 -191 -183 239
1251B39n4m07Q7M18j29m80K07M57k03m54J17N08q4m36J11L20j63l61K20M27k92
$$ 239 185 -222 -135 283 154 -326 -119 338 135 -319 -202 306 222 -214 -103 217 54 -307 -87 340 48
1272D8l51K25M04k08m64K96M29l09l24K22J83k15j77L60J15l23j86M02K01l71
$$ 48 -303 -78 326 118 -346 -50 379 70 -254 -32 151 -64 -241 119 234 -89 -275 127 328 -43
1292d3k91L73K95l06l28L34K25k99j37K73M9l40P7L13K8m87K4M73M9n67RM63J16
$$ -43 -334 39 334 28 -300 34 259 -40 -177 96 145 -195 -118 195 223 -264 -240 233 282 -285 -276 187 303
1315C03m24j59L48J08k47j9K29kl18J02K88j28l97J78M71j52n33J23N51r3m55
$$ 303 -121 -280 68 176 -71 -90 139 137 -181 -79 209 81 -316 -138 333 181 -352 -229 322 229 -226
1336b26N1L15L7l03N1K25n2k79J92K58l33k67L93K68l96k66L05L93k71l76J85
$$ -226 -175 140 177 -126 -75 150 98 -181 11 269 -64 -331 62 330 -66 -332 -27 366 95 -281 -96
1357i6L37q5k98M9K52j84m8J89l8k82l8N45Qm70k65M83L64m42l64K91M08j88k99
$$ -96 241 156 -142 -93 159 -25 -73 116 78 -204 -242 303 311 -159 -424 59 423 -19 -383 -92 316 128 -171
1380a71R8M2jJ37Q8k54k40K46N07k19o46N1O25J76n64k87L77L37j84k69QL7J41
$$ -171 -73 -31 -32 105 193 -61 -301 -55 452 233 -413 -362 263 439 -125 -412 -35 302 118 -151 -143 -106 35
1403C5J85k8m18j54M39M87m15p05K34P44P7o95k45M61L59j55k70j82P0K36K63
$$ 35 220 192 -226 -380 59 546 131 -574 -340 404 481 -214 -459 2 361 206 -64 -246 -176 60 323
1424C23k10n08JO74L36o56o32M44Q12j38p34j79M52M17p5m08k24O9M50K66m49
$$ 323 113 -395 -394 280 616 -40 -672 -228 584 446 -288 -467 -15 402 327 -81 -305 -236 214 480 31
1445C1o84L02Q58J15q46m88N89P48k47p30j40M27M55n5m75k61J51N81K80o80o53
$$ 31 -653 -351 507 622 -224 -712 -123 625 378 -352 -492 -65 390 335 -140 -401 -250 331 611 -69 -722
1466g22M28R50m4j018m26Q30O74k98p50j42N00M22pn53l52K70P13J47q64n86O19
$$ -722 -294 656 612 -406 -832 -2 672 374 -376 -518 -18 404 397 -156 -508 -238 475 622 -242 -828 -209
1487b09R58k01j028k66Q20N84l53o23j55M27M97L0o78m55M33Q76n3r54n17P80
$$ -209 749 548 -480 -746 74 658 305 -318 -473 -46 451 481 -197 -652 -219 657 604 -350 -867 -87
1507h7R02l63j031p4P31N63l60o15j42L74O00J4p76m46O08Q14j23j085l41Q60
$$ -87 815 452 -579 -653 78 641 281 -334 -476 -102 498 512 -264 -710 -102 712 589 -496 -837 23
1527B3Q04m22r92PP63M76l94o07k04M88N49lp89m64P03Q18k56j044k71R27O19
$$ 23 827 405 -587 -580 183 659 265 -342 -546 -58 491 488 -301 -765 -62 756 500 -544 -815 112 731
1548G31m80p11o2O62M23l01n53k55M83O20j61q39k91P70P13l83r42k5Q43M49n07
$$ 731 251 -460 -522 140 563 262 -291 -546 -63 557 396 -443 -734 36 749 366 -576 -601 242 691 184
1569A84o17K6N57L52k43n45k71N39O65j99q74k40Q24N60m80q10Q3P12L35m63m87
$$ 184 -433 -407 150 502 259 -286 -557 -18 647 448 -426 -666 158 718 238 -572 -489 223 558 95 -392
1590c92J6M53L26j69m90k23M83N85l20p66k9O87M76n02o35J12P09J43l69m34L5
$$ -392 -376 77 403 234 -256 -479 4 589 269 -497 -526 161 637 135 -500 -388 321 464 95 -339 -304
1611c04L92L04j80m42j90N04M32k78p20JP28K67n10m25J94M83J06k60l73K5K66
$$ -304 88 392 212 -230 -420 84 516 238 -482 -481 247 514 4 -421 -227 256 362 102 -271 -246 20
1632B0L84j97n39n8M87L99l69m97Q6N40J43m78k74J97K11K21j68k84k8K07L65
$$ 20 404 207 -332 -390 97 496 127 -370 -284 256 399 -79 -353 -156 55 276 108 -176 -204 3 368
1653C68j74m79o5M88K76l24m58J66M36P1m18q1Q4J56P5o7j71j46K85K26j42l51
$$ 368 194 -285 -350 138 414 90 -368 -202 234 305 -113 -194 -110 46 121 54 -117 -263 22 248 106 -245
1675b45%L96K09l72k33J91K12Kj92q9P9M8Q4P0k35j28K24J70j16l14Q4L32J7l25
$$ -245 -245 151 360 -12 -245 -54 158 160 -32 -121 -42 6 90 160 -75 -203 21 191 75 -239 -155 177 194 -131
1699a31o0J55J38o8l8m0Qj0R9M4r9j53J77J87k39j37Q1K11n7j66K5R6k5o5K6R0
$$ -131 -191 -36 102 34 -4 -44 -36 -46 53 97 -2 -155 22 209 -30 -167 -86 125 68 -98 -73 23 -2 -67 -41 49
1725D9q0l1J51K9j94m4J74Q1j18j15J12O9n1r1MR3n5%L7M9j64rK41rk37qJ95q
$$ 49 -31 -62 89 118 -76 -120 54 135 17 -98 14 83 32 -59 -55 38 -17 -17 20 69 -95 -104 137 128 -109 -117 78 70
1753G0j13m6J25o7n4K2J00m5o2J5J06L5j57l9K17L4k14N7M5Nq9K0R9n3j05R0J13
$$ 70 -43 -89 36 -31 -85 -63 37 -8 -70 -55 51 86 -71 -110 107 141 -73 -16 29 34 -55 -35 64 11 -94 -4 109
1780A09j17p1P7J06j15q0J6J96j0k04P5J7J8j03Q8O3r3oJ10J5j21m4P2J47j36
$$ 109 -8 -79 -2 104 -11 -91 -75 121 111 -93 -18 -1 17 -86 2 65 -28 -34 76 91 -30 -74 -2 145 9
1805Ij41Q4J15K2r1K6K1p0m6J29o7m0M1O4k6j42K2J79N7j72k8R5K2j26J9J01j3
$$ 9 -132 -48 67 89 -2 24 45 -25 -71 58 -9 -49 -8 56 30 -112 -90 89 146 -26 -54 41 63 -63 -44 57 44
1832D4p6R7m5j06M5L9J26o6j74J0K29k2j42k2Q6Q7j83L3O6O2o8pj4k0j1J00Q4
$$ 44 -32 65 20 -86 -41 -2 124 58 -116 -106 123 101 -41 -63 23 110 -73 -40 26 88 20 13 -1 -21 -32 68 152
1859A52k13o8R6J72j55r6J10P0j4j14p9J72j5O3j5n5j19J05O7Nj26r3K53J0j60
$$ 152 -61 -129 -33 139 -16 -112 -2 68 54 -60 -139 33 18 81 66 11 -108 -3 64 69 -57 -150 103 113 -47
1884d7j10J07K01k7k08m2J20K3O2l8j14m0J11J28j45j17N1K71l2k02j30K03J78
$$ -47 -157 -50 151 124 -84 -126 -6 17 79 41 -73 -113 -2 126 -19 -136 -85 186 154 -48 -178 25 203
1907B03p5k11m1Q5K3J59j25j37M1J59P0k24q2Q1L08o0l01m8J38J75jj91p5J21
$$ 203 128 -83 -124 -39 -16 143 18 -119 -78 81 151 -73 -155 -74 234 174 -127 -175 -37 138 137 -54 -129 -8
1931hQ9m1J6k08J30J46M8k39k05K05L00n4k94n6J31K40j19r8o6M4J36J9j51j66
$$ -8 81 40 56 -152 -22 124 172 -67 -272 -67 233 179 -115 -171 -40 200 81 -17 -83 -39 97 116 -35 -201
1955b01J57K38l0l11j63K74K79p1k79l3J45J94p9k47k4J40J44J6k77j95K81K83
$$ -201 -44 194 164 -147 -310 -36 243 172 -107 -140 5 199 120 -127 -151 -11 133 149 -128 -323 -42 241
1977B41%m07k4K13J69r6k51%J85J14o0k31p1K57J54Ol16j37K68K55j02l30n0K22
$$ 241 241 -166 -190 23 192 96 -155 -155 30 144 84 -147 -218 39 193 199 -117 -254 14 269 167 -163 -213 9
2001IJ89j25k00k4J77J93j31k37p6K85J70n1l27q6K18K23j00l10O3K66N5j12k29
$$ 9 198 73 -127 -151 26 219 88 -149 -225 60 230 179 -148 -234 -16 207 107 -203 -140 126 181 69 -160
2024a60O4J50J81p5l20p9K17K36n3k25j50K86J17j44k18Q6J69J08j76k18nK49
$$ -160 -96 54 235 160 -160 -239 -22 214 161 -64 -214 72 189 45 -173 -87 82 190 14 -204 -209 40
2046D0J88j10k17j12K22K55j58k91%K41J46j67k15P0K23O8j80j97m7K70J75p4
$$ 40 228 118 -99 -211 11 266 108 -183 -183 58 204 37 -178 -108 115 183 3 -194 -241 29 204 130
2068A30k72l7J80K04j98j61M0K39R9k27k03O1K58R8r2k25n6J63J79j20j62k0J94
$$ 130 -142 -179 1 205 7 -154 -114 125 224 -3 -206 -145 113 211 119 -106 -162 1 180 60 -102 -122 72
2091G2P2k24m5k3K79J6j03k25O8J72J02r1j49kJ01R9m1k10R4J82l4j80j39J36
$$ 72 144 -80 -125 -148 131 147 44 -181 -113 59 161 70 -79 -81 20 119 78 -132 -38 144 110 -70 -209 -73
2115g3J52O9j26j16l3J48O9m6r3m9J83Pj08j14L9J62N9j48j20Q9R9L1m3q6k0R4
$$ -73 79 148 22 -94 -127 21 90 44 -49 -98 85 92 -16 -130 -91 71 130 -18 -138 -49 50 81 38 -48 -68 26
2141B6J5l7m6M7O0N9j16j48R3J85l1r0j12pJ37l2Qpk0k5O8n5q7J00R6K3p7j67
$$ 26 41 4 -42 5 65 124 8 -140 -47 138 107 17 -95 -102 35 3 11 4 -16 -41 27 -28 -115 -15 81 104 27 -140
2169a40P3R7N7p7p6L5MQM5Pl8N0q1M2p7M3J30K3j14m2k8K2nL4k8K4j2knK3L5L8
$$ -140 -67 30 87 10 -66 -31 -27 -19 26 33 -5 45 -36 6 -71 -28 102 125 11 -31 -59 -37 -42 -8 -36 -12 -24 -26 -31 -8 27 65
2201F5k6Oj05N6L9l8K2j9Kj6j9%P8k1k7K0k7r1P3N4M9o5q7K5K0L2J7k0K3l9m8
$$ 65 39 45 -60 -4 35 -3 19 0 2 -14 -33 -33 45 24 -3 17 -10 -101 -28 26 75 10 -77 -52 -32 0 17 -3 20 -19 -67
2232f7O3J7J3J4o1L0l1m9L2J19l3j7n0j3L3k7P0j4l1K0Jko1M0M3L4j25o2Q5J5
$$ -67 -4 13 26 40 -21 9 -22 -71 -39 80 47 30 -20 -33 0 -27 43 29 -2 18 19 17 -44 -4 39 73 -52 -114 -29 -14
2262a4M1J7j7n4k8O7K8L4k1Rp6k4J3L2K3M4m1q6O9j5K5l4J9k9O8q5K1nL4j1M7
$$ -14 27 44 27 -27 -55 12 40 74 53 62 -14 -38 -25 7 30 74 33 -53 16 1 26 -8 11 -18 50 -35 -14 -19 15 4 51
2293E1m5n0NK6M7l6J0o6J7J1JJ6j8K7J2k5j3P1j9m1N2q9JO1%K5l1j8l1k9O4j7
$$ 51 6 -44 -39 -13 34 -2 8 -58 -41 -30 -29 -13 -31 -4 8 -17 -30 41 22 -19 33 -56 -55 6 6 31 0 -18 -49 -78 -14 -31
2325c1L7l2N6j8jk9M4mj8q8K0P3J1p8O6K7l3l9N1pm3J31j33O8r9L9Q1m2l4K0N3
$$ -31 6 -26 30 12 11 -18 26 22 4 -84 -64 9 20 -58 8 35 2 -37 14 7 -36 95 -38 30 -69 -30 51 9 -25 -5 48
2356D8r3J7L6l3P4k1k3k3l7M5O9o2mN8j6Nn6l4Q4K1m1m0J8j6K3P9j07k9k1N9R
$$ 48 -45 -28 8 -25 49 28 5 -18 -55 -10 59 -3 -7 51 35 40 -16 -50 34 55 14 -26 -8 -24 -1 78 -29 -58 -79 -20 -11
2387a1K7j5k2J9J8q9O1j0O7J9o1J5k3PJ0K0j9pOK2j4l4J1N8k1r7JN4L3J9j05K1
$$ -11 16 1 -21 -2 16 -73 -12 -22 45 64 3 18 -5 2 12 32 13 6 12 34 20 -14 -3 55 34 -63 -62 -8 25 44 -61 -40
2419d0LQ3k6qm5O3k7K4l2l3N4L0n2%p2L3O9K9l9j2JM2j0p3J2L8O3o1p3J2P7O3
$$ -40 -37 46 20 12 -33 30 3 27 -5 -38 16 46 -6 -6 -78 -45 24 53 14 2 3 45 35 -38 -26 12 75 14 -59 -47 30 93
2451I3o4m6j9Q4Mj3r7OL5K2j2o6oK3J36o7o3QLJ14l1r8K8L7N5o0J3l5M8k5%p5
$$ 93 29 -17 -36 48 52 39 -58 -52 -17 5 -7 -73 -79 -56 80 13 -50 -42 -39 75 44 -54 -26 11 66 6 19 -16 32 7 7 -68
2483f8m3J17R3m4j01OM4LK8m9l2R0Lj8j00P5M0km1n7J8O1J5o1kK1k9K7J0l7L5
$$ -68 -111 6 99 55 -46 -40 4 7 35 -14 -46 44 47 29 -71 4 44 42 1 -56 -38 23 38 -23 -25 -4 -33 -6 4 -33 2
2514Bj9P1p6j4K1J25p8j2j16P4mJ13p8j17J16L9K5p7l7l2Q4J2l3j8K7K6K2Mr4
$$ 2 -17 54 -22 -36 -15 110 32 20 -96 -22 -26 87 9 -108 8 47 72 -5 -42 -74 10 22 -11 -29 -2 24 46 50 -44
2543d4KR3mr5ML4N9l2m2K3KJ6k3%J1j6P4r9O8o7R7k6j0j23M7L8M5km9rL2L8nq5
$$ -44 -42 51 47 -48 -44 -10 49 17 -25 -2 0 16 -7 -7 4 -12 62 -37 31 -36 61 35 25 -98 -51 -13 32 30 -19 -28 4 42 37 -48
2577d8J7N5l5P0p2m0M3J3M1o0rJ7k0J4N2m7RRMo0N9l2L9j1j2L7l1J4L4p1j9M9
$$ -48 -31 24 -11 59 -13 -53 -10 3 44 -16 -25 -8 -28 -14 38 -9 0 9 13 -47 12 -20 19 8 -4 33 2 16 50 -21 -40 9
2609IL1j4j6j2m4P6l5Nl0K3K5m0MmL2mmk4J0l3M4%l2M5J9o9N5J8k8l3RN9k9k7
$$ 9 40 26 10 -2 -46 30 -5 0 -30 -7 18 -22 -18 -22 10 6 2 -22 -12 -45 -1 -1 -33 12 31 -38 17 35 7 -26 -17 42 13 -14
2643a4j8M2l2ok2J16o0o4R1o6L8L0nol3L6pm7J1l4L8L7l4J3J4J7k8KK7m7j8K2
$$ -14 -32 10 -22 -28 -50 66 6 -58 33 -33 5 35 30 24 -9 27 20 -27 -16 -50 -12 25 -9 4 18 35 7 9 36 -11 -29 -7
2675gJ3L1q8O4l7k1K7j8P4j9Mk6m0N5K5o4kL2J1N4m3KJ1j2q1M6j4pO5m8K8l0L8
$$ -7 6 37 -51 13 -24 -45 -18 -36 38 19 23 -3 -43 12 37 -27 -29 3 14 68 25 27 38 26 -55 -9 -23 -30 35 -13 15 -15 23
2708B3j0K0q0J6K1M7k9k0j7O7n9k8N1L7jo8M8M1r6L0RK3o2N3j8J5l2JL5m1l1N0
$$ 23 13 33 -47 -31 -10 37 8 -12 -29 38 -21 -49 2 39 38 -30 18 59 -37 -7 2 25 -37 16 -2 13 -19 -18 17 -24 -55 -5
2740ek0K3moJ0PJ6p3K4M8p9P5m9K2L6n2J7j1J5J2MJ3K9k6o3M3l3K6J8J2n8N9j5
$$ -5 -25 -2 -6 -12 -2 5 21 -52 -28 20 -59 16 -33 -11 25 -27 -10 -21 -6 6 10 23 52 26 -37 6 -27 -1 17 29 -29 30 15
2773A5l2j0J2L9n4O2o8O2nn3k2P4k5JmQ4o2jj6j8qN6j2p3M0oL5mj2j8PkO8n2j7
$$ 15 -17 -27 -15 24 -30 32 -36 26 21 -32 -54 20 -5 -4 -8 76 14 13 -3 -21 -29 27 15 -58 -18 -24 11 7 -5 -23 -16 -18 50 -2 -19
2808a9K4Rk0j0O4l7m8J12o6Ml2K0K6m3J5l9R8p1J4j3l7K7KL0pk7P1j07J3N1j4
$$ -19 5 14 -6 -16 48 11 -37 75 9 13 -19 1 27 -16 -1 -40 58 -13 1 -12 -49 -22 -20 10 3 -24 47 -60 -47 4 -10
2839a0j6M5K6m2k5RKL0k9K9k9K6j6k9K9pL0rj8K8l8l1pJ2L3jM2k3n4K2K5JOk4
$$ -10 -26 19 45 3 -22 -13 -11 19 -10 19 -10 16 0 -29 0 -7 23 14 -4 24 -14 -45 -52 -40 -7 -8 34 11 -43 -21 4 5 11 -13
2873a3L2nn2L8L9n0lMK0m0O5k3M8j15N2MJ4jk3M5l6N0k8Mp2N5k6L3k0ql5M9m5
$$ -13 19 14 -38 0 39 -11 -14 -10 10 -30 35 12 60 -55 -3 1 15 14 -9 36 0 50 22 26 -46 9 -17 16 -4 -12 -47 2 -43
2906d3M9Mn7P0rJ6p0N2m9O4q2Q8l4JL4j1k7K9n7L2lk8RJ6M6q9N0j3N2J0m0j6K9
$$ -43 6 10 -47 23 14 30 -40 12 -37 27 -55 33 -1 0 34 23 -4 25 -32 0 -3 -31 -22 -6 40 -49 1 -12 40 50 10 -6 23
2939B3rr7R5QL1m7K2o1ON9n3L4n8O4K7n3M6o7O4m2mjL4j03J10n5qL1k0K4p2J8
$$ 23 14 -83 12 20 51 4 26 -35 -29 30 -23 11 -47 17 44 -9 37 -30 34 -8 -12 -13 21 -82 28 -27 -35 -4 -24 0 -72 -54
2971e4R1%j4j8n4N7mM3q8L0PN9n5k1LN4m6J6j8j8L9Pl1k4O6o4J3j5M7J4j8j9R
$$ -54 37 37 23 5 -49 8 4 47 -41 -11 -4 55 0 -21 -18 36 -10 6 -12 -30 9 16 -15 -39 27 -37 -24 -39 8 22 4 -15 -6
3004fK1J6j9j1K7l7K0mM6j11N3M4n6j6Q1m8P8r3%N3l0kL8l8kl9l6N7M5lq3qM7
$$ -6 15 31 12 1 28 -9 11 7 53 -58 -5 39 -17 -33 48 0 78 -15 -15 38 8 6 44 6 4 -35 -71 -14 31 28 -55 -63 -16
3037a6K6j5J0lKj7L8o2n0P2J0m4J6l8M0J4rJ4k4P9j5M0l4j4m5P4n3jL6r1J16l8
$$ -16 10 -5 5 2 4 -13 25 -37 -87 -15 -5 -49 -33 -71 -31 -17 -26 -12 -36 43 28 68 34 20 -25 49 -4 -5 31 -60 56 18
3069A8l9oj5P6p4M1m7N5MLM7q3Oj4K5J9k2n7Q0j1p1O2k6n1N6OJ2K7n9j3M1L7k7
$$ 18 -21 -27 -42 34 -40 1 -46 9 13 16 63 -20 -14 -28 -3 16 -6 -63 17 6 -65 -3 -29 -80 -24 -18 -6 21 -38 -51 -10 27 0
3102@mJjm2N3Qn6O2O1q7J6K2n8L8rJ35j02o0K8k5M0J6j1l6%J4j8mL3O3p0o2J7
$$ 0 -4 -3 -4 -46 7 15 -41 21 82 -5 11 33 -25 13 4 139 37 -23 5 -20 20 36 25 -11 -11 3 -15 -19 14 77 7 -55 -38
3135c8L4jk3J1N1q0P0l6K2l5P6j15Q1j5j4qM6p9O5%l7j1L3K6klk9mLK5RPn7LL
$$ -38 -4 -5 -28 -17 34 -46 24 -12 10 -25 51 -64 17 2 -12 -20 26 -53 12 12 -25 -36 -3 23 21 18 -11 -15 -12 13 22 29 -28 -25 -22
3170b2RK1Ql9K7l8M6J0onK2p0P2Ql1L1n1J3l7N7m1J8J3k9N1m6L6nn0M4l6k9K1
$$ -22 -13 8 16 -23 4 -34 12 22 16 11 33 -37 35 43 12 43 -8 5 -32 25 -16 2 15 -14 37 -9 27 22 -28 16 -20 -49 -28
3203b8J6j1K1J3J8K5q3M9j4j0n2O6nJ8k6rL3l0K7l6L7l2%k4OM0n8N0M9k0RJ9p4
$$ -28 -12 -23 -2 11 29 54 -29 20 6 -4 -56 10 5 23 -3 -12 21 -9 18 -18 19 -13 -13 -37 -31 9 -49 1 50 30 39 58 -16
3236a6k9J5N0j1k4O1j3m7N6q8j3N8l0K9QRj3jj9l0Q2l9O5o8LK3L6p6J1K1n1OJ2
$$ -16 -45 -30 20 9 -15 46 33 -14 42 -46 -59 -1 -31 -2 6 15 2 1 -18 -48 34 -5 60 -8 -5 18 54 -22 -11 10 -41 -35 -23
3269b3J5j6%M9k9kj8K1N9m4K9j7m1N3l2m0J8J5L5l6Rk7L3O0p5O3o6L5j4K2p7L8
$$ -23 -8 -24 -24 25 -4 -6 -24 -3 56 12 41 24 -17 36 4 -36 -18 -3 32 -4 5 -22 11 71 -4 59 -7 28 14 36 -41 -3
3301cJ6l0l8L0l0K5Q%O2p0P4l1k6O0n1m2NR0o4J1oj7L3j4kK7k4J0o2N7K7k0J0
$$ -3 13 -17 -55 -25 -55 -30 -22 -22 40 -30 44 13 -13 47 -4 -46 -41 49 -15 -4 -10 -27 6 -8 -10 17 -7 3 -59 -2 25 5 15
3334A5n2J2NJ05m8k3n2K7J3l3J5J1m8J02l6K3m2JK4j6k2Rn4M8R3n1K2m3J4n2J5
$$ 15 -37 -25 -20 85 37 14 -38 -11 2 -31 -16 -5 -53 49 13 36 -6 -5 19 3 -19 -10 -64 -16 77 26 48 5 19 -33 -18
3365a8K2l6R1p1Rn2J04Pr7M6j0KJ3k6l5J3J03r9K0qJ4L7K2n1M2K4m1k2K0K2p0
$$ -18 4 -32 59 -12 -3 -55 49 56 -41 5 -5 -3 10 -16 -51 -38 65 -34 -14 -22 -8 29 51 0 42 66 25 3 23 45 -25
3396b5M7k7J4k5k3L4l0M8o7N7j1N8m6l1j1M3Ok9MQP9q4N0o1k1O9L4p8j1J2L7j6
$$ -25 22 -5 9 -16 -39 -5 -35 13 -54 3 -8 50 4 -27 -38 5 11 -18 -14 -6 73 -11 39 -22 -43 26 60 -18 -29 -17 20 4
3428DK5m5j1P4n1k2N8k6K3j8K3n7J1J2K7l3j7K4O2p0J5o3N4J8Jm8PpJ5kj0O7p0
$$ 4 29 -16 -27 47 -4 -26 32 6 29 11 34 -23 -12 0 27 -6 -23 1 63 -7 8 -55 -1 17 18 -30 -23 -30 -15 -17 -27 40 -30
3461c0L1k5rK7J2M0n5n2K1L5L6Loqp1M3pKJ3Pk4j6N0n5L1J1j0J6kj2K1K4pkl5
$$ -30 1 -24 -33 -6 6 46 -9 -61 -40 -5 31 34 28 20 -51 -8 -15 -13 0 7 -17 -33 17 -38 -7 4 -6 10 8 -4 17 41 34 32 -3
3496cj4j3j6J5N0o1J0j7LO6L4n5J5j1LRl7k6L2nk9M8nk4K9k5Q1k6k5KO5q1Rm3
$$ -3 -17 -30 -46 -31 19 -42 -32 -49 -46 20 54 -1 14 3 6 15 -22 -48 -16 -21 -50 -2 -7 -31 -2 -27 54 28 3 5 70 -11 -2 -45
3530d5JL5M8j5n6O4oj0j7j9L5kNMm2J2J5oo8P8L6k0l0mJj6j7O9p7J7J8M2p8J1
$$ -45 -44 -9 39 24 -32 32 26 16 -1 -20 15 13 18 22 -20 -8 7 1 -67 11 47 27 -3 -7 -6 -22 -39 30 -47 -30 -12 30 -48 -37
3564c7M7l8M6%n6mQ8jp9J8k1N5l9N3m0n4N6j4M9n2J7J9ln0NJ1L3j3j1MlM9l1j0
$$ -37 10 -28 18 18 -38 -42 46 45 -34 -16 -37 18 -21 32 -8 -62 -6 -20 29 -23 -6 13 10 -40 -35 -24 9 -4 -15 -11 -14 35 4 -6
3598fPJ7k4J6k0qoM8l3l3L4rL9pk7L5l3L8J1p3KQ4r3J4k2P5j1J6l7k9M3k5P0k
$$ -6 1 18 -6 10 -10 -18 -24 24 -9 -42 -8 -17 22 15 -12 23 -10 28 39 -34 -32 52 -41 -27 -49 26 15 31 -6 -35 8 -17 53 51
3632E1l6l5J6J5k4l8Q0m4K6K0k6l8M3pNK0k9mkJ0L8r5n2N6M7Q1j03O2p7N4K2o9
$$ 51 15 -20 -4 11 -13 -51 29 -15 11 31 5 -33 10 3 8 28 -1 -5 -7 3 41 -54 -106 -50 -3 78 -25 37 -40 14 36 -33
3664c3P9k8l8M6p6L6K1n0J03p9M1k7J4j3J2K5K0m9l1k3M6L3l2J7o2M3k2kL0j4
$$ -33 46 18 -20 26 -50 -14 7 -43 60 -19 22 -5 9 -4 8 33 53 4 -27 -50 -4 29 -3 14 -48 -5 -27 -29 1 -13
3694a3N8p6L6p8J16oj6l6j3L1k6M5lkrj4R0q5m1L4J8pj8M2j2j02J14Jl8mPm5N7
$$ -13 45 -31 5 -73 43 37 21 -15 -28 3 -23 22 19 17 8 -6 84 -1 -42 -8 10 3 -15 27 15 -87 27 28 -10 -14 -7 -52 5
3727Ek8M0j8nJ3k4oKO1Pq0J6N0k5K1l3k7M4m2J9O%K9o6M9k5j0J2P8k9l4k8J5J5
$$ 5 -23 17 -1 -6 7 -17 -23 -21 40 47 -33 -17 33 8 29 -4 -31 13 -29 -10 -4 -4 25 -41 8 -17 -27 -15 63 34 0 -28 -13 2
3761BKM3k4n6K6NK1l1mlm5P4j0L3q1L7QL5l2%Nj9kL0Km8O5j7j5pK8n7L9k2n9P8
$$ 2 4 47 23 -33 -7 -2 19 -12 -16 -19 -64 10 0 33 -48 -11 -3 32 0 0 5 -14 -16 14 16 -32 33 16 1 -6 22 -35 4 -18 -77 1
3797An5P7K5n7j1M8Lq3L8M3l2K0kp8K7M0k8N7m2K0Mm7O0o6Q6n7j4L3n0O5j01J16
$$ 1 -54 23 48 -9 -20 28 31 -52 -14 29 -3 17 15 -63 -36 4 -24 33 -9 11 15 -32 28 -38 48 -9 -23 10 -40 25 -76 40
3829D0p1J3N0m1j3j1K1K9rm5P2j1l4jk0K0OJ%kO3q4J6l2K5J0l8J8K5k5L2K%m3
$$ 40 -31 -18 32 -9 -22 -33 -12 17 8 -37 35 24 -10 -11 -31 -11 -5 -4 -4 -6 57 -27 -11 -43 -18 -8 -46 -28 -3 -28 4 6 6 -37
3863c7N0j2L9J5o6K3k0Rj1m1J6N9r6L6K5J1k9R1m8j4m5N7O4p2L4k2k7nK1J9pJ5
$$ -37 13 1 40 55 -11 12 -8 1 -10 -51 -35 24 -72 -36 -11 0 -29 62 14 0 -45 12 76 4 38 16 -11 -16 5 24 17 32
3895C2m0k4L7n7L5K7qn8L2K7k4O1o5ML8m3J8K5j5K9p9L6L6J7l4n0Q6p6N6j3l8
$$ 32 -8 -32 5 -52 -17 10 2 -56 -24 3 -21 40 -25 -21 17 -26 -8 17 2 31 -48 -12 24 41 7 -43 43 -33 23 10 -28
3926b8j4L9M8m5N5m8k4j1mJ9L2k5J7J1k5J8n1l3P9n1J8m6J03m7Pqj2Oj6K7Jqk3
$$ -28 -42 -3 45 0 55 7 -17 -28 -32 -13 19 -6 11 22 -3 15 -36 -69 10 -41 -23 -69 34 -13 -6 -14 -26 -20 -36 -9 -8 -16 -39
3959c9L4j0L4M2n1j1O3n8k3L5kKm1j3lK7K8o9O6k4P4n9p7J18p4L5n9N7Lk4J5O4
$$ -39 -5 -15 19 61 10 -1 62 4 -19 16 14 16 -25 -38 -41 -14 14 -55 11 -13 61 2 -75 43 -31 4 -55 2 5 -19 -4 60
3991F0m0K1m8K2J9m6j0N8m4O4m0j01Q0j0N0j11N8NK5l4K9N4r8K3rn4P8n1K7j0
$$ 60 20 41 -7 15 34 -12 -22 36 -8 56 16 -85 -5 -15 35 -76 -18 -13 12 -22 7 61 -37 -14 -23 -77 1 -50 -23 -33
4021c3O6r3L9K1J7l8n5O9k3M9j3J6pj0lk1M0J1Jj9j7ln2Q4L0m5n1O6l0L2k8pL
$$ -33 33 -60 -21 0 17 -21 -76 -7 -30 19 6 22 15 5 2 -19 21 32 33 14 -3 -6 -58 26 56 11 -40 26 -4 28 0 -7 -4
4054dnLj5j1M3pK9r4O0j9Qj1R6p3K3o8J7P6n1o2N8L4L7j35J06j2nPj6L3k2l1j4
$$ -4 -9 -6 -21 -32 11 4 33 -61 -1 -20 -12 -23 73 0 23 -45 -28 48 -3 -65 -7 27 64 -71 35 23 18 25 9 42 20 -11 -25
4087b5R1j05L7l5K4J9K9o0L0j1l8rQ9l7oJ8l9K4Lj9O2qk6L9m4m1L0M9m5L5k7L3
$$ -25 66 -39 -2 -37 -13 6 35 -25 5 -6 -44 -53 36 -1 -7 11 -28 -4 -1 -20 42 34 8 47 3 -38 -8 41 -4 31 4 37
4119C7j17Q6oJ5J3l7K5ok1K1K5k8O1j05N9pk4L6m9K6L0q0NM0k1J24j17OK5o6J05
$$ 37 -80 6 0 15 28 -9 16 10 -11 10 35 7 68 -37 22 15 -9 27 -22 4 34 -46 -41 -1 -22 102 -15 -9 16 -50 55
4150E5j6p4R0j20O2J3m6J16j03qJ05r5K2P1m1n8M6nj7K2o9O3j0l2k4K1P9q0j8
$$ 55 39 -35 55 -65 -3 10 -36 80 -23 -31 74 -21 1 72 31 -27 19 14 -3 19 -50 13 3 -29 -53 -32 47 -33 -51
4179e1R0o8M5K7l2Rj9L2l6J1j6m0L3l2M0qKk5k7P5p7P1l9J5J3k0Q6q2Q0n7k6L9
$$ -51 39 -29 16 43 11 20 1 33 -3 8 -8 -48 -15 -47 -7 -15 -13 -38 -65 10 -67 4 -35 -20 -7 -27 59 -23 57 0 -26 13
4211A3J3m7O3r8N5jl1P7n8K3nJ9k0n5N7k2k1J5K4Mk1K0K4j4k1M9k2mn6NM6pm0
$$ 13 26 -21 42 -56 -1 -2 -33 44 -14 9 4 23 3 -52 5 -17 -38 -23 1 5 -16 4 28 14 -7 42 20 16 -40 -35 11 4 -36
4244c6L2K4k0j9L3L1j1l4LMl3K1l1L5OK1n0L5Opj0n6M2LM2k2p6M6l3N0OK3o1N5
$$ -36 -4 20 0 -19 14 45 34 0 3 7 -26 -5 -36 -1 5 26 -24 11 17 10 0 -56 -14 -11 31 9 -67 -21 -54 -4 2 25 -36 19
4278A9l2N1n9n5Q1K5Rp4M5l4J3j5k5K3kJ0k5P4m8j3M4J8m7J3k7O9qk9On6N6j5
$$ 19 -13 38 -21 -76 5 30 39 -35 10 -24 -11 -26 -51 -28 -30 -20 -45 29 -19 -32 12 30 -17 -4 -31 38 30 1 7 -49 7 -8
4310hl5O1m6N5J5j2o6J9N2p1J4J0O5n8%j7M1p4O5j5j4P8l9Qj1o0M3oN4k0n0j3
$$ -8 -43 18 -28 27 42 30 -36 -17 35 -36 -22 -12 53 -5 -5 -22 19 -55 10 -5 -19 59 20 28 17 -43 0 -6 48 28 -22 -35
4342c5k5L3K5M7m1n3R1k0l7L5l6N7m3KjL3Qn9O6po4M4k4K0jj1rJ9l9P3l8k4K7
$$ -35 -60 -27 -2 45 4 -49 42 22 -15 20 -16 41 -2 0 -1 32 40 -19 47 40 -24 20 -4 16 15 4 -5 14 -25 48 10 -14 13
4375A3k5m3M8K1mj4l3N8n7R1Mmn7J7k1l3Q9n1kL7J0oKj9k2k2jO4j2q7Q9Jnn6L9
$$ 13 -12 -55 -7 14 10 -4 -37 21 -36 55 59 55 -2 15 -6 -39 50 -1 -3 34 44 38 40 21 -1 -23 -24 40 28 -59 30 31 26 -30 9
4410IJ0p9L5oN7L0o8l9R1p5L8K2j1OJ5j4k4L0o7N6J6k5k9J5Ql2J0M2Qn9M1j2J8
$$ 9 19 -60 -25 -31 26 56 -12 -51 40 -35 3 25 14 20 35 21 -3 27 -40 16 32 7 -22 -7 1 -31 -21 21 29 -30 11 -1 17
4443A7m4N2r9M1K9RoJ1k1K4m6k8N7k7mK0N0q2M0k4Q7k6m7j5kL0L3p8N8l8L5PL9
$$ 17 -27 25 -74 -33 -4 5 -1 10 -11 13 -33 -61 -4 -31 -35 -15 35 -47 -7 -31 56 30 -17 -32 -34 -4 29 -49 9 -29 6 13 52
4476E2m0K3pK0j03K5L1j3m0J08k5m8Rl7M0KM4l1N4p4KON3k9j1J9kPl4N1m1M0p6
$$ 52 12 35 28 48 -55 -30 1 -12 -52 56 31 -17 -8 -45 -5 -3 41 10 64 -10 -8 -2 51 22 11 30 28 35 1 52 11 51 -25
4509b5N4n3j0J2M0L6o3M8n2k2M3K4l5J5k5j6K9KQ6j06j8M4j2k5M6mk3m3R2o9N1
$$ -25 29 -24 -34 -22 18 54 -9 39 -13 -35 8 32 -3 12 -13 -29 0 2 88 -18 -36 8 -4 -29 17 13 -10 -53 39 -30 21
4540B1J2L4m4j6j5oO9n7L9Qk0l5K3J1oQq2K3K5j0J2L2Nll1j7PJ6Jj5pK6J6m0N2
$$ 21 33 67 23 7 -8 -14 55 -2 37 45 25 -10 13 24 18 26 -56 -33 -8 -18 -6 26 31 28 -3 -20 -13 3 4 -11 -18 8 24 -16 36
4575C6l5J6l8J5N2r8P1j8OL6k7L4j04M7Q2o8Nm4N0j8MoK7o3N1j3J0k3roK3Jm9
$$ 36 1 17 -21 -6 46 -52 19 1 7 43 16 50 -54 -7 75 7 12 -32 18 0 4 -2 25 -38 13 0 10 -13 -22 -28 -5 -4 -53
4608e3J9M0j1m1N4l6j0L1M9j6l0nonL8nQj4K6j4J8l2nMk8P3n2kmj0L1K9o7M6K
$$ -53 -34 6 -5 -46 8 -28 -38 -7 42 26 -4 -9 -15 -20 18 13 21 7 33 19 37 5 0 4 -24 49 -3 -5 -9 -19 12 41 -26 20 22
4643B2J3j3l9N2pk0K3j5o7M4Plm7JK3L%J8j8k6J0j5M1lJ2J4Pm7M9j0K3l8m9O3
$$ 22 35 22 -17 35 28 8 31 16 -51 -7 0 -3 -50 -49 -26 -23 -23 -5 -23 -49 -39 -54 -13 -16 -4 10 17 -30 19 9 32 -6 -55 8
4677HNJ3l5N1p2K4j6J6k4N9l4J4rN3o1K2n9O2k7K9l8QR1n8j8j0m3K5Pj2k1Q8j
$$ 8 13 26 -9 42 -30 -6 -22 -6 -30 29 -5 9 0 53 -8 14 -45 17 -10 19 -19 -11 80 22 4 -6 -49 -24 -17 -29 -50 38 37
4710C7q4L7k8RL0J5j6j7%J9j1LJ5n5R2k8m8O4j23P8J0qN3q5N5L3k3Qp7N7j9J1
$$ 37 -47 -10 -38 -29 1 16 0 -17 -17 2 -9 -6 9 -46 46 18 -30 34 -89 -11 -1 -9 44 -41 14 47 24 32 -45 12 -7 4
4742Dp3N1J0j2M8k0lj8O3n9pL2j1J9n9%J3L4J4m3P6qq4K3m1P3Ppk3jM4k3JKk1
$$ 4 -69 -18 -8 -20 28 8 5 -13 50 -9 -16 16 5 24 -35 -35 -22 12 26 -17 59 51 -33 -10 -51 22 29 22 -1 -2 42 19 20 22 1
4777Ak5M4Lm3L5%j1K4p6L5P8n6m1k8O5N6r7QK9j1N3m1K6k8j3%J0K0o5O7j3oJ1
$$ 1 -24 20 23 -20 15 15 4 28 -48 -13 65 9 -32 -60 5 61 -36 -28 1 -10 43 2 28 0 -13 -13 -3 17 -48 19 6 0 11
4810A1l2J1M4l1k2K7K9l9L4m2k4P4k7nQl7O8r3L1Mlj4L4j7MO5k6oj4k0%J4m7M
$$ 11 -21 -10 34 3 -19 8 37 -2 32 -10 -34 40 13 8 16 -21 47 -46 -15 -11 -14 -28 6 -11 -7 58 32 26 12 -8 -8 6 -41 -37
4844c7L2k1J0J6M9q7L5J9j8K2qo0L8J3j7K4o4M1k6N0jk6J0Lk2N3o5K4N3p5L3j7
$$ -37 -5 -26 -16 0 49 -38 -3 16 -2 20 12 -48 -10 3 -14 10 -54 -13 -39 11 10 -16 -6 -3 -25 28 -37 -13 40 -35 -2 -19
4876a9K0L4mq4K7L5L0rj0l7K0L2m6L1j8K5jQm3l0N9m0M3j0l6O6l7k0q9Q3K1Om0
$$ -19 1 35 31 -53 -26 9 39 30 20 -17 3 35 -11 20 2 27 26 34 -9 -39 20 -20 23 13 -23 43 6 -14 -103 -20 1 7 -33
4909c3k5N3m5K2M3k5pJJ5oN1l0k9J5jJ2l5K1NL7q2K3O0l2J3prJ3k3k9j9N8J6l2
$$ -33 -58 -5 -50 -28 15 -10 -17 -16 -1 -7 44 14 -15 0 -1 11 -24 -3 2 39 -43 -20 40 8 21 14 5 18 -5 -34 -53 5 21 -11
4943a1j2QN0j4n8M7nl8l4R7l0J2m9L5M1n4Qj7J1MJ8J4l6k7K8M9q0K1qL5l8NM8
$$ -11 -23 -15 35 21 -37 10 5 -33 -67 30 0 12 -37 -2 39 -15 -7 -24 -13 -9 9 23 -13 -40 -12 37 -43 -22 -30 5 -33 -28 20
4976B0K7Mj8n3K0l8LK4p0O1M5o0OJNOK2J1n6RNQ5l8m5N3K7m3oJ1J6k6oRl4M3J6
$$ 20 47 51 33 -20 0 -38 -35 -11 -81 -20 25 -35 -29 -28 -23 -17 5 16 -40 -31 -26 59 21 -24 29 56 13 7 18 34 8 2 11 -23 20 36
5012C6orj01Q1%%O6n9pRjj5R8r6RRj3k9L7J0Jk3k4K8K7p3M9Jl9N7m4K9Jl3O5n1
$$ 36 30 21 -80 1 1 1 67 8 1 10 9 -6 92 -4 5 14 1 -28 9 19 20 -3 -27 1 28 -45 4 5 -34 23 -21 8 9 -24 41 -10
5048a0K6l2oL4m4%K5kJJlmn4R3k9N3m4k0J9k6K4l4J2mJ2L%lK5p2N5qJ2Nm6K1n
$$ -10 16 -16 -22 12 -32 -32 -7 -9 -8 -7 -10 -14 -68 25 -4 49 5 -15 4 -22 2 -32 -20 -24 -12 -9 -9 -12 13 -59 -4 -12 0 5 -41 -20 -25
5085b5k1PQ1m5MMj1K7j8m9P5J4k4K3l7L9k9ml2RL1m3Rl8N4L2l8l7N0k6J7K9q8
$$ -25 -46 -39 42 -3 1 5 -6 21 3 -46 29 43 19 42 5 44 15 11 -21 -12 19 -24 -15 -53 1 33 -5 -42 8 -18 -1 28 -60
5118f0K3K8lJ9N3Pj15P7Mn9N2j7M4l2om0L1K7k2K7l9m3J2L6j9l8J9N7Oj7Ok0j3
$$ -60 -37 -9 -12 7 60 67 -48 29 33 -26 26 9 53 21 15 -25 6 33 11 38 -1 -44 -32 4 -15 -53 -34 23 29 12 18 -2 -15
5151a5K9ln8M7l7P7j1n0N6l5K7n6K9QJ3o5J5P6j22J17o9oM2N3l1j7JkL9o6N3l3
$$ -15 14 11 -47 0 -37 40 29 -21 35 0 27 -29 0 8 21 -44 -29 47 -75 42 -27 -33 9 62 31 14 15 13 52 -14 39 6
5183FMK3l4K1k2rK5jJL5j9l0m4j9L2jN6l2N1k8K1Rkn4M8j0PmRj6Om1K5l4qJ3j4
$$ 6 10 33 -1 20 -2 -11 14 13 14 49 30 0 -44 -63 -31 -32 24 -8 43 15 36 45 43 -11 37 27 34 30 39 23 29 -12 13 -21 -29 -16 -30
5220c0K6M6mj2p9L4J9rJ1pLMN2q3Q8o6J1L8J2k6j3k6K4p0O9%j4O3l5l0%K0n1M5
$$ -30 -4 42 38 26 -53 -19 0 -9 2 -5 -2 2 54 -29 59 -7 4 42 54 28 15 -11 13 -57 12 12 -2 61 26 -4 -4 16 -35 10
5254A0Kj7n6J04n1RJ0jn2J3K6m0K6O0mm4K9JrM4p1J03l8o0N2mj3rJ5p3O1l2j7
$$ 10 12 -5 -61 43 -8 1 11 10 -42 -29 -3 -43 -17 43 39 -5 24 25 16 60 -11 92 54 -6 46 42 29 20 35 -38 23 -9 -26
5287b6M1j7J3L8j9o2M2nJk9K3Ql6J3M9K3q2N9l5pM0k5J8k3j0k4N6P5p9jKk9rK4
$$ -26 15 -2 11 49 30 -32 10 5 6 -23 0 8 -28 -15 34 57 -25 34 -1 -8 32 7 25 2 -8 -32 24 99 20 19 21 -8 -17 7
5321GM0m5J0Ml5M3J7o3K2Ll5O5p2M6J8o5qO0m4L1k0mj9M0mM0m4L2Ok6K9Pj9O7
$$ 7 47 2 12 16 -19 24 41 -22 0 3 -32 33 -39 7 25 -40 -48 12 -32 -1 -21 -25 -44 -4 -8 32 -12 20 26 0 29 36 17 84
5355H4j04l5J06o5K7J6l0P4p5K0ql8J5J7J8l8K7%l3KK4J1MNj4j6J8nj3j6LJ1K8
$$ 84 -20 -55 51 -14 13 29 -1 73 -2 18 10 -28 -13 4 22 -16 11 11 -22 -20 4 15 19 24 10 -6 12 7 -6 -22 -19 -8 20
5388B0j0j4lj2jJ4L1m0N1j5k4LK5Qmj7j1NN0o4K1nl9k8P1Lk5%k7P5n7lRM5p7O7
$$ 20 10 -4 -7 -19 -20 -6 25 -15 36 21 -3 0 25 33 29 12 1 6 56 -8 13 8 -31 -59 12 15 -10 -10 -37 38 -19 -22 -13 32 -45 22
5424B2l4L9n7nL0%OMJ7K3m2mqM0j8m6J23r7PJ2M1k5j2qm6KO1n3M1k0M9K3m9l4
$$ 22 -12 27 -30 -35 -5 -5 1 5 22 45 3 -1 -9 31 13 -33 90 -7 0 12 53 28 16 8 -38 -36 25 -28 13 -7 42 65 16 -18
5458a8j9KP3n8QJ9n2M4ML7l4k4PjOK3mK2o3O2k2n1O5m4nRJ3m2M0k6N7l8J7K5M
$$ -18 -37 -35 38 -20 -12 7 -45 -1 3 40 6 -18 -11 -12 -6 17 13 35 -28 34 12 -39 26 -18 -23 -14 -1 -43 -3 -29 28 -10 7 32 36
5493C6j4l1N5j0o0L1J9j6qo3J15j22J17o5M3l5PMj1O6kr1Q0j6k5k1Kl4J12p6q
$$ 36 22 -9 46 36 -24 7 26 10 2 -61 54 -68 49 -16 27 -8 -1 3 -8 58 56 -35 45 29 4 -17 -15 -49 63 -13 -21
5524b1Lj9N4L0m6m2O6n0J2M7m5L1Rm5k8N2l3M0P%k7J6m5O3mm4O3n8Ok7K1M6K3
$$ -21 -18 -37 17 47 1 -41 25 -25 -13 34 -11 20 29 -16 -44 8 -25 15 22 22 -5 11 -34 29 25 -19 44 -14 -8 -35 -14 32 55
5557E5n2J4l8l2J03m4m1M0qj7P3o2L7K9n8M2j04N5K4qK6j0n6J5K9l1J6L6j6K5
$$ 55 3 17 -21 -53 50 6 -35 5 -3 -20 53 -9 28 57 -1 41 -63 -8 16 8 34 24 -32 -17 12 -19 -3 33 17 42
5587D2q3J9L4m7O1q0N3k0R2n7j1nj0L3l0L4j3M5r1QL3LqK6l0J6J4m6J7L8j2NK9
$$ 42 -41 -22 12 -35 26 -54 -1 -21 71 14 3 -2 -12 21 -9 25 12 57 -34 -26 7 10 2 28 -2 14 28 -18 -1 37 25 30 59
5620E9m1k0N9j13J10n5j9L0j9PJ3J9Ll2j4J9l7N1k3j4N6q0kJ5J1L4j4MPJ1pn4
$$ 59 18 -2 57 -56 54 -1 -20 10 -9 -2 11 30 33 1 -13 6 -31 20 -3 -17 39 -41 -43 -28 -17 17 3 7 14 25 18 -36
5652c6L9ol5O2k5K7k7K8p2K8L3J5l1mJ7Ko4M2P3p0L8p0K2m5K5N8k2n5L8M5m9P
$$ -36 3 -3 -38 24 -1 26 -1 27 -45 -17 16 31 0 -4 13 15 -49 -7 66 -4 34 -36 -14 -59 -34 24 2 -53 -15 30 -19 -12
5684a2ll4P0k7rJlj9j4P9j00J04L0j16O1m4P5q5R8o7rN6q0P1n2MK1K1kl4O5l9
$$ -12 -15 -49 21 -6 -15 -14 -17 -36 -50 29 -71 33 63 -53 8 -36 39 -46 52 -15 -24 32 -48 23 -29 -25 -4 17 15 -19 46 7
5716Gj9J4n8O0L9m8o3J60m1p2J0M8n7M7p9RJ5L0K6p3M8p7J7JM9L4k0m0K4P6o5
$$ 7 -12 2 -56 4 43 -5 -68 92 51 -21 -11 37 -20 27 -52 -43 -28 2 28 -45 3 -74 -57 -56 -7 27 7 -33 -9 67 2
5747BJ0pj7RL5o9J5M4m5M7m8Qk8J1JK1RJ2k6M9l9j6J6l2M8j5J3k6l3J04o9lL1
$$ 2 12 5 -12 -3 32 -37 -22 22 -23 24 -24 -16 -44 -33 -32 -11 -2 10 -16 33 -6 -22 -6 -38 10 -5 8 -18 -51 53 -16 -19 12
5780A2j7K3l2N0m7K1J5o2P5m7M5m9j1NMM0m9L2m2K7L8n8l4J2Q2m8K3j0mj0PJ5
$$ 12 -5 18 -14 36 -11 10 25 -37 38 -9 36 -13 -24 -19 -15 25 -24 8 -34 -7 31 -27 -61 -49 33 -15 8 -2 -6 -16 -9 6
5812FO7n3L%j7N2J9q0K0J4L3n5l2K4j5M6Mm7j1qL9j5L2k4jJ8o3P7n2J8J8ll8K6
$$ 6 73 20 23 23 6 58 77 -3 17 31 64 9 -23 1 -14 32 36 -11 -22 -30 9 -6 26 2 1 19 -44 33 -19 -1 17 14 -24 2
5846Bn3O1Qj6Mj4L0j6JJk9j7K2j9k5L8j1O1j6l2m2J08j6nk4O2m1p3J4N2l9J2J1
$$ 2 -51 10 18 2 6 -8 22 6 7 8 -21 -38 -16 -35 -60 -22 -33 28 12 -20 -62 46 30 25 1 63 22 -51 -37 15 -24 -12 -1
5879aJ8j9o5K7K7K0j2l3K6J1n4M6m1L5M2J6k0n5L6rLJ7l6M6K3j6Oo3LJ6K0k8K2
$$ -1 17 -2 -67 -40 -13 7 -5 -38 -12 -1 -55 -9 -50 -15 27 43 23 -32 4 -5 -2 15 -21 25 48 32 38 -25 -22 -6 14 -14 8
5912HM2r9P2q0R2n2qK0J3j7K6k3J5k4L0k1J7J2o%rJ3J3l9qk2L8l6J0J6J4o3K4
$$ 8 50 -49 23 -57 35 -17 -25 -5 8 -9 17 -6 9 -15 15 -6 11 23 17 17 8 21 34 -5 -13 -35 3 -33 -23 -7 7 -56 -32
5945c2L0K8m3K4O0k9jl5M0n8N8Ok2lm8J9j2M6km8P0p6j7Q1l6M1m1K7l6K1joJ4
$$ -32 -2 26 -17 7 67 38 37 2 42 -16 42 48 26 23 -25 -6 -18 28 26 -22 48 -28 -45 36 0 41 0 27 -9 12 11 5 19
5978A9l4P4l8n8R0k2m8J0PQJ5j8OK1l2JO1m2j1l7M4Njqjjj1l5J26n9k2k0P2j5
$$ 19 -15 59 21 -37 53 31 -17 -7 0 8 23 5 11 32 0 1 62 20 9 -28 16 21 20 12 11 10 -1 -36 90 31 9 -11 61 46
6012D6p7L7l5K2J6l4j5N7l8J5j7jM8l1K0k2K2L9j21L5L3J0oN5n7k9K8RL3m5lM2
$$ 46 -31 6 -29 -7 9 -25 -40 17 -21 -6 -23 -24 24 -7 13 -9 13 52 -69 -34 -1 9 3 58 1 -28 0 9 42 -3 -6 36
6044C6oPm5LL2K1k9l8L0nk9K6j8K2K4l1k1K9Rj0m3jQ5o8LM1n0Q4j04NN3m6L2o
$$ 36 30 37 -8 -5 27 48 19 -19 11 6 -23 3 -15 7 31 0 -21 8 17 7 -36 -37 48 -20 -17 24 -26 58 -46 -41 12 -34 -2 -8
6078hLMqj6L6N1q9K4J1oK9l5rj0M4jn0KLM9o9O1rQol9M1J8o8N1m3lK4LKJ5j3K2
$$ -8 -5 -1 -9 -25 11 62 -27 -3 8 2 31 -4 -13 -23 21 20 -30 -28 -25 24 -45 16 7 15 9 -30 11 29 -39 12 -31 -34 -10 -7 -5 10 -3 19
6116A9l3j1l7P5j0j1M0qo8M5k9N8n1j0N3m3J4L5k2o3N5J2P5j41O5m2K7l2K1k7
$$ 19 -14 -25 -62 13 3 -8 32 24 -44 1 -28 30 -21 -31 22 -21 -7 28 6 -57 -2 10 85 -56 9 -33 -6 -38 -17 -44
6146d4O4o0PK3Kl0J6M4J4n0K7Nk0P7m2lpL1j04N0L5n0lM3k2m2L8oj0M0%l8K8l5
$$ -44 20 -40 -33 -10 -8 -38 -22 22 36 -14 13 18 -2 75 33 30 23 54 -50 0 35 -15 -18 25 3 -39 -1 -7 -17 23 23 -15 13 -22
6180b2KJK4K2q8K1J5K5Nl3jKK3QN1o6oK0J2j2J5j1P2r7o1O5k0NK9M7o2m1J01q8
$$ -22 -20 -19 5 27 -61 -40 -25 0 5 -28 -29 -27 -4 4 55 -11 -17 3 15 3 18 7 79 -18 -79 -14 -34 -29 0 47 -15 -56 45 -43
6214d3K1j1k9K4M4L1o4JN6o4O4o6n8P5j1RK8k4M4pj9Pn4M1J8Ml8N9l9K5Oo1M0
$$ -43 -22 -33 -62 -38 6 37 -27 -26 30 -34 30 -36 -94 -19 -30 -21 7 -17 27 20 1 8 -46 -5 13 17 -21 38 -1 24 30 -31 9
6247IOk8L2jl1j9O1Jjk4O2o7M6k3K1p8M7l0RjQnJ5kPk4l9L8l3N3m2L1O1j04M7
$$ 9 15 -13 19 18 -13 -32 29 30 29 5 67 0 46 23 44 -34 13 -17 -8 -9 -1 -6 9 7 14 -10 -49 -11 -44 9 -33 -2 59 -45 2
6282BJ2m4M4K4p0K7J4p0R7l4J6k7rO6j01P3j2j9J2K7m9j4L9P0j23O7p7O4j8J1
$$ 2 14 -30 14 38 -32 -5 9 -61 36 2 18 -9 -18 48 -53 20 8 -11 1 28 -21 -35 4 74 -49 18 -59 5 -13 -2
6312bm5M1l4L4l5j1P3j0J8qm2PL5j4k0J0J5nl7L5oK2j0J7rM7j5p9NQk7M9o6R0
$$ -2 -47 -6 -40 -6 -41 -52 21 11 29 21 -21 -14 21 7 -13 -3 12 7 -30 5 -1 21 11 28 19 66 51 -28 -23 -15 -42 7 -59 31
6346C1m2j8J8L3l2k8l5J37p9j7K9k5L5m5J5rOj1JK5kK0oK8k0m5J6L1K1K8o1k1
$$ 31 -11 -29 -11 22 -10 -38 -73 64 -15 -32 -3 -28 7 -38 -23 -32 -26 -37 -36 -11 -13 7 1 29 9 -36 -20 11 32 60 -1 -22
6378b2L7k1K6m7N0Pm9J3J3qL2l3oN6n1qRl5K2K8m4J2pJ8J7Rj2j5J9l0P3n3OK6
$$ -22 15 -6 20 -27 23 30 -19 -6 7 -1 31 -2 -8 48 -3 -11 -2 -37 -15 13 -31 -19 -26 -8 9 18 6 -9 10 -20 53 0 6 32
6412C2l2K7n5N9l6P8q3P1o6mK8k5K3K4o3qJ7pj1M3J7j00M3K1KN5p5P6r6M6Pk3
$$ 32 0 27 -28 31 -5 73 -10 61 -5 -9 19 -6 17 41 -22 -30 -13 -20 -31 12 29 -71 -28 -7 -5 50 -25 51 -45 1 8 -15
6444a5N7o1k7RM6j7K3k5N5j6K0k6o8P4J4o3M5k6M5l7K8J9n4P0n1j7J7m0J5PL7
$$ -15 42 -19 -46 -37 9 -8 15 -10 45 29 49 23 -45 29 43 -20 25 -1 44 7 35 54 0 70 19 2 19 -21 -6 1 38
6475C8k5l8jO1j7m9j9N5j0J3l1P5n2J9Jm4Pm0O6j5Kj2j1ol9J27l3O5o6j3l6J5
$$ 38 13 -25 -26 35 18 -31 -50 5 -5 8 -23 52 0 19 20 -24 -17 -57 9 -6 -4 -16 -27 -33 -72 55 22 87 21 8 -28 -13
6507a3OJ4K8n2L6%J4l0k9L1k5L5m9J7j8M5p5L6k3L6N1m4m1R3p0K7j5m6L4J7L9
$$ -13 -7 7 35 -17 19 19 33 3 -26 5 -20 15 -34 -17 -35 10 -65 -29 -52 -16 35 -9 -50 43 -27 0 -15 -61 -27 -10 29
6538B9knJ6Kkk1j8ml9K7P1Nm2p3M9ol5M2K6n9N7%Ol6p8J17m4P7r2QN9om8n0K2
$$ 29 27 22 38 40 38 17 -1 -5 -44 -17 54 59 17 -56 -7 -13 -48 -6 20 -39 18 18 24 -12 -90 27 -17 60 -32 -24 35 29 -19 -69 -47
6573d7J6N9qon8L9k6L4l4MjJ09r5L1K7k0Qj1J8j7j7j8PMn3N4Lk7j1L6Nk1J1k7
$$ -47 -31 28 20 14 -44 -5 -31 3 -31 -27 -28 81 -14 17 44 24 32 21 39 22 5 -13 -6 -2 -55 -1 2 -25 -36 0 5 -16 -5 -32
6607c2j1P8k9j3J3k8O3k9o8M4J8j1NL0J7l9kl0MP0p3L4L8k9j7j9K4%k6MK9q5Q8
$$ -32 -43 35 6 -7 6 -22 41 12 -56 -12 6 -5 0 30 47 8 6 -24 -20 50 -23 11 49 20 3 -16 8 8 -18 -14 15 -70 18
6640A8k2j2J7k9JJJ3kL3L8n8j1m1QJ3L8rm4M1JJ7j4K6k0JnQj7K9kKm5M9l3J8j3
$$ 18 -4 -16 1 -28 -27 -26 -13 -15 18 56 -2 -13 -54 -46 -33 5 -4 -48 -7 -6 11 -3 23 3 4 -1 7 -10 19 17 19 -26 23 -10 8 -5
6676elN2j11O9MN%j4Pl6j9Q8l7l8O9q5j9O9j2ON1n9L0p5P5m6mP2o6M2L8q4MKk1
$$ -5 -8 44 -67 2 6 11 11 -3 4 -32 -51 37 0 -38 31 -54 -73 -4 -16 -10 41 -18 12 -63 12 -34 -38 34 -32 10 48 -36 -32 -30 -51
6711e1K9J3Nj2J3N4k0k7K4k9j9lM7olj0o3PQ1M3o8J8p4O2n3%K4L8j9l6P0Nk5j7
$$ -51 -22 -9 -4 -16 -3 51 31 4 28 -1 -20 -23 24 18 15 5 -58 -51 30 73 5 23 -51 11 -42 -42 -18 20 1 -35 35 40 15 -2
6745brM2k8l0j0K6L1mn2OQ5k7oL9j8l5O9m6j23R4K1K7m6o0N4n1L4M5lk8kRl0K
$$ -2 -11 31 3 -27 -37 -11 20 16 -36 -30 55 28 22 61 43 8 77 31 -92 2 23 50 4 -56 -2 -53 -19 26 23 -5 -7 2 -28 -26
6779b6n6P1Mk2M8k7j7P3k5qQj6J0Oj6Lk4j2M4l0L1NL8j2l1k6j3JMJ5J5M6r8RJ1
$$ -26 -82 -11 -7 -29 19 -8 -25 48 23 15 23 7 17 23 7 10 -14 -26 18 -12 19 24 62 50 19 -7 -20 -19 -15 0 15 61 -37 -28 -17
6814a7M1l2j6J6k3rMK6l7Q0q8J4LJ0N1j1j1Qm6K6mOK3kNNqJ7Rm2l6J5N6rK2J1
$$ -17 24 -8 -24 -8 -31 -40 -36 -10 -47 33 -55 -41 -38 -28 23 12 1 9 -37 -11 -15 -9 14 12 17 22 14 31 40 -2 -38 -23 33 24 46 57
6850E7k4j6Qk0K8L4m3m9K4mNrj1K5l1j3N6lp6P2p0J2O3p6O7l3P2j5j7J0j7J7k3
$$ 57 33 17 25 5 33 67 24 -25 -1 -5 0 -9 -20 5 -26 -39 17 14 -62 10 -60 -48 15 -61 6 -27 45 30 13 23 6 23 0
6883@K0k5M5m6rNn6M8j1L6qk2RL2l8J7K7M9p7O0l0Kn7NL9o2K1M7m6LK7Kj2QQJ9
$$ 0 20 -5 40 -6 -15 -10 -66 -18 -29 7 -1 -23 -14 18 -20 -3 24 73 -4 56 26 28 -29 -24 15 -47 -26 21 -25 -22 5 7 -5 3 11 30
6919C0m6O8n2J6k4K6mj7N6r2K4L3K1m2K3J2j1k4J3m0N4j3K8jn2nL6m5%J3Rk3R
$$ 30 -16 52 0 16 -8 18 14 -3 53 -39 -15 18 39 -3 20 32 21 -3 10 -30 24 11 39 38 -14 -19 17 -28 -28 -15 -6 -29 -20
6952b0K9m0R1n7q3L3L1J2nk9J2OK2j4K4J5n4L1l7RJ1K2j5L1Qoll8m7N7J4J4k6
$$ -20 9 -31 60 3 -80 -47 -16 -4 -9 -38 -26 -20 2 -12 12 27 -27 4 -33 -24 -13 9 -6 25 33 27 24 -14 -61 -4 10 24 -2
6985bj1J4nm3mN2J9Opm3RnP1k0nq4Q3j8l2J9lL8l6J2L0p3L0pN7j03M2K6ll5N5
$$ -2 -13 1 -4 -47 -51 1 20 26 19 -24 -15 -20 51 31 26 -58 25 7 -25 -6 -9 29 -7 5 35 -38 -8 -15 42 -61 -19 7 4 -31 24
7020B4k8l4O6n2L6m1N7k9k5M9k4j8k7j3J17n0K2k0M5q8P2kj2Jn5J2m4N7j5J4l2
$$ 24 -4 -38 28 -24 12 -29 28 -1 -26 23 -1 -19 -46 -59 58 8 30 10 55 -33 39 37 25 26 -29 -17 -61 -4 -19 -5 -37
7051c7JM7j6m1kO0M6n6L1r3k1P7k6j2K6qL5j6j0k3M4qL9m8%K8nLqm9N5m4MJQN8
$$ -37 -36 11 -5 -46 -48 12 58 2 33 -60 -81 -4 -30 -42 -16 -24 11 -5 -15 -38 6 -2 37 -11 -11 17 12 15 7 -42 13 -31 -27 -26 -18 40
7087D0mj05Q7Nl2M2m4O1rl9nj2j0M2k3l5O0j6p1J11om4l3L6J4%J6k8kLRjoJ2j0
$$ 40 36 -69 18 23 -9 33 -11 50 41 2 -3 -15 -25 17 -6 -41 19 3 -68 43 37 -7 -40 -4 10 10 26 -2 -4 -1 8 7 1 13 3
7122Ckq4R6p0M6L0j0j5M6l9Pj2J8j0L1j0n6J5j7M0mJ4j8j9j3L1j4oN1rk0p8J11
$$ 3 1 -83 13 -57 -11 19 9 -6 40 1 8 -4 14 4 35 25 -31 -16 -33 7 3 17 -1 -20 -33 -2 -16 -22 29 20 0 -78 33
7155C3j2n4LK2K1j1k7m4N5Q8o6rpk2R8m7j8J2K8Ml5l8K7M1l4m2L0rK1LM9k2m7
$$ 33 21 -33 -30 -8 13 2 -25 -69 -14 74 8 -1 -8 -30 68 21 3 15 43 47 12 -26 1 42 8 -34 -4 -13 8 11 60 38 -9
7188iL8j4k0J2K4j3m5nM3Pk1%O5o3No6O4K4rJ0pj7j0O1k2o5j4J02m4m0Rk1L5j2
$$ -9 29 15 -5 7 31 18 -27 -32 11 18 -3 -3 62 -1 4 -62 2 26 17 27 20 3 -7 54 32 -33 -47 55 11 -29 -20 -41 -6 -18
7222a8Q5r0N3L1q8k9K2L2K3k9q2O3O0nn0L2%j5l3K6j0L3k6k2k2rR6J6n6M1Jk5
$$ -18 67 -23 30 61 -27 -56 -34 -2 21 -8 -90 -27 33 28 -22 10 10 -5 -38 -12 -22 11 -15 -37 -59 -68 28 44 -12 29 30 5
7254El5M5%l7Kk3L2M0j3Nn4R3j8l5PkK6q1N3Ln6QM8Krk9l4O7L4k2n4O5j0k8k1
$$ 5 -30 15 15 -22 -20 -43 -11 29 16 21 -33 60 42 7 14 12 38 -43 10 13 -43 -35 13 15 6 -23 -57 10 44 22 -32 33 23 -5 -26
7289b6j3K8oj1K1m0O5l4O5k4l1M6r6M0J0K8ok2k1L7k4k3rQ3q0Q9L2j04K1L4l9
$$ -26 -39 -11 -17 -28 -7 -47 18 -16 49 25 -6 40 -56 -16 -6 22 16 -6 -27 10 -14 -37 -46 37 -43 46 78 -26 -5 29 -10
7320a0J6K4n9J1K9j8L1q7JP5j0rK0J6j3k5OKJj3l2O6j4j7JJ6L8m7M3j5%n9NP2
$$ -10 6 30 -29 -18 11 -7 24 -63 -62 13 3 -6 14 30 17 -8 -2 0 1 -12 -44 22 8 -9 -8 8 46 -1 42 27 27 -32 -27 45
7354D5l4j5m5OK6L1l3j5NM1l0r%mJ3J3K1m5k9J3N1m5j4L9k3oM4j7mN6k9m0Q3o7
$$ 45 11 -4 -49 -43 -17 14 -19 -34 -29 12 -18 -27 -27 -31 -18 -5 16 -29 -58 -45 6 -39 -53 -14 -37 -43 1 -16 -20 36 7 -33 50 -17
7388a7K7k7j5J0M0p7R9J6l2j8Ql0L0o0M9k5pP4n0j1m7L9j9J02j24J13l5%M2o6
$$ -17 10 -17 -32 -22 18 -59 40 56 24 6 14 -16 14 -46 3 -22 -29 45 -5 -16 -63 -24 -43 59 -65 48 13 13 55 -11
7418a1J3l4R4n6o2P2ql9rK0N7oo5K3J9J0m5K3M2l5KN8l9J9m0j8O2o4J0K0K7o5
$$ -11 2 -32 62 6 -56 16 8 -31 -40 -20 37 31 -34 -11 8 18 -27 -4 38 3 5 63 24 43 3 -15 47 -17 -7 13 40 -25
7450b5qM3Nm6k1N2Pj5L8n9K6j3Kj6L1m6N5rj7K3K0K9r9L8KJnj7O2o3j1P6q2OJ7
$$ -25 -33 10 15 -31 -52 0 7 -8 30 -29 -3 -16 -14 -30 1 -45 10 1 -16 7 27 56 -43 -5 -3 -2 -7 -24 38 -25 -36 40 -42 -36 -19
7485a9nM3j7k0NN3k1k7lk7J7M9k8o9J3J4J02n1J8l5k3M2k2L1l8J0MrK3l0L0K9
$$ -19 -24 19 2 -18 -13 40 19 -8 -11 -38 -21 28 0 -69 -56 -42 60 9 27 -8 -31 11 -11 20 -18 -8 -4 -13 10 -20 10 39
7517C9o1K5qK8K7n3n9Q4q1L3J4J8j4Qk2mR6o8j4l6J9n5P8nN5l1j02R1k8j9L9k7
$$ 39 -22 3 -5 23 50 -3 -62 22 -59 -26 -12 6 -8 0 -22 -26 70 2 -12 -48 -29 -84 -6 -11 44 13 -89 2 -26 -45 -6 -33
7549c3N7j04R8j4L8No5J0n1R4Nm6K6j5K1j2m7l8Q0Pk2J4qj8j4P5m8m4L5J6K0o8
$$ -33 24 -80 18 4 42 47 -18 -8 -59 35 40 -6 20 5 26 14 -33 -71 9 16 -6 8 0 -18 -32 43 -5 -49 -14 2 22 -46
7581d6L1N8l0j2L4k5LN2J0m1p8O0l0ONJ3J3J4jJ9p1N2n7P0o6k5N5o5M5K6k2j7
$$ -46 -15 43 13 1 35 10 13 65 75 34 -44 16 -14 -8 -3 10 23 37 36 55 -16 36 -21 49 -17 -42 13 -52 -7 19 -3 -20
7613b0KJ3j3L5L3m2qJ9ON5n2k7j6n8N6N3on2J9k0K9j6M3k2J4l1J6J6pk7j3K4J7
$$ -20 -18 -5 -18 17 50 8 0 19 25 80 28 1 -15 -73 -17 36 30 -22 -3 -23 6 -10 33 11 25 -6 10 26 19 -8 -21 3 20
7646B0p1P5m8R1q0k4M1J0k6m0P1o4N8JM2o2LJ5rm3K2pK8k0L8J9r7M8k4K6N9o2
$$ 20 -51 24 -24 67 -13 -37 4 14 -12 -52 19 -45 13 14 56 -6 -3 12 3 -40 -18 -25 3 -17 21 40 -57 -9 -33 -7 52 -10
7678a0Qkl9RO3rj9MQKLK0l4J7%k9J8J0k3L9k1l7k3QP4o2R6p8R0p7L2q8P0K8l5
$$ -10 -2 -4 -43 -34 29 20 1 5 13 15 18 38 4 21 21 -8 10 20 -3 36 15 -22 -45 -37 37 -25 71 -7 83 6 38 -50 20 48 13
7713A3o4M6j3K2l7N6Ok8J8l6L3K3rqj9qk1O6j3J3n8M3m3O3r6R2LNm8JL9k6m5O1
$$ 13 -51 -5 -18 4 -33 23 29 1 19 -17 16 39 30 22 3 -5 -26 40 27 40 -18 25 -18 45 -51 41 44 49 1 2 41 15 -30 31
7747C1Pn3m4QK9N8Nj8m6j6LL8Pj2m9O4kl9M3l4P6l9J3J7oo7N4l2nj9Qj4P3j8o2
$$ 31 38 -15 -59 -51 -22 36 41 23 -23 -39 -36 2 9 -3 -52 12 10 -29 14 -20 56 17 30 47 41 -26 28 -4 -9 -28 -20 -34 39 21 -41
7782d1O2oNqk5N1Nm0Ll0KJ6nlJ7l5j1M8o6J43n6j0L4l1j2k3O9k4K8n3Oj4p5Q4
$$ -41 21 15 20 12 -13 38 43 3 6 -24 -22 -6 -11 -14 3 -32 -43 5 -61 82 26 16 50 19 7 -16 53 29 57 4 10 -4 -79 5
7816EK8okK9m2M0K6p5J5k0K4om5K0J8n1j8M8J5J1o9M2Kk9M9L0l6m5K2N0n5kJ4
$$ 5 33 27 25 54 12 52 78 3 18 -2 22 16 -29 -9 9 -42 -60 -12 3 14 -55 -13 -11 -40 9 39 3 -42 -20 30 -25 -27 -13
7849a3M8%m2k5M2Pnj1J3L3m7n1j0O6L1o0J4J8k7J1L4jm3l1O9k5L8m1M5l5K4l2
$$ -13 35 35 -7 -32 10 17 12 1 14 47 0 -51 -61 5 36 -24 -10 8 -19 -8 26 25 -18 -49 20 -5 33 -8 37 2 26 -6
7881fn5M9K2j6J2k8O4n2J6j7L6K6j01M7N3j9J0j5m2N8n1mMJ7j2K3N0o0On1K1K5
$$ -6 -61 -12 10 -6 6 -22 42 -10 6 -11 25 51 -50 -3 50 31 41 26 -16 42 -9 -13 -9 8 -4 19 69 9 15 -36 -15 10
7913A0JJ2l6nL7Nqlrl5M0J5m9JOk0N1m6jQ7n2L2K2n5N4r6L1K2k4Lk0O1qk3OM5
$$ 10 11 23 -13 -18 19 24 16 13 4 -31 9 24 -25 -24 -18 -38 13 -33 -34 53 1 33 55 0 54 -42 -11 11 -13 -10 -30 31 23 0 6 51
7949E1k7k0RPOl3K8MqK7l2j4J4j9K7j2j3K7QJ8k7Ln9OK4k9m0J15m1K5l8mM9j3
$$ 51 24 4 13 20 26 -7 21 25 17 44 12 -2 12 -7 20 8 -5 22 30 48 21 24 -35 -29 -5 -34 -74 41 0 25 -13 -17 32 19
7983A9m8N4rk9K7l6OPM9k8qL4o7M6rj7L3m2O5l2J1o4L5JK4n4K5KJ7Qo0J7PM7m6
$$ 19 -29 25 16 -13 14 -22 -16 -9 40 12 4 38 -29 17 8 -9 24 -18 47 15 26 -38 -3 -2 22 -32 -7 -5 12 20 -40 -23 -16 31 -15
8018a5K6J1K4p3L2Oj6%LpM1L9n8m5J2O4n1pN3n0k3O7o0k9J01n6j5N5m6J2%k1N8
$$ -15 11 22 46 -27 5 11 -5 -5 -2 -9 32 71 13 -32 -20 44 -7 -14 39 -11 -34 33 -27 -56 45 -11 -26 29 -17 -5 -5 -26 32
8051C2l7j3K7l0k4N6o7O4m4J6Lj9K6JK1L9ro1M3k9K4k1J0k6M6m1l7P4j7j6M5r0
$$ 32 -5 -18 9 -21 -45 11 -56 8 -36 -20 -17 -36 -10 -9 12 51 42 -19 24 -5 19 -2 8 -18 28 -13 -50 24 7 -9 36 -54
8083e4K5J6n0R1l2k8KK1JJ1m0M3J8jm7j4M2rNJ5l1M7KK2k9n2L8j8m6P8nk6j3P
$$ -54 -29 -13 -63 28 -4 -32 -30 -9 -8 3 -37 6 24 23 -24 -38 4 -5 0 15 -16 31 33 55 26 -26 12 -6 -52 26 21 -5 -18 -11
8117a1nJ2l6O9n1M6J0oJ9m4K0k5M1p0Qk5O7rn2L5j5j9N5l3K7l3jL3K7l1k0LK1
$$ -11 -16 -4 -40 29 -22 24 34 28 47 3 23 -2 39 -31 -23 -48 19 10 -42 -7 -22 -41 14 -19 8 -25 -26 7 34 3 -17 -14 7
8150Gk5l3J6J8M1m3L3Ml3O0q4L5j6J8N6o8K8k1m5J9R1o6L5j9L0r1J09l3%j03P5
$$ 7 -18 -51 -35 -17 24 -19 14 18 -15 45 -39 -4 -20 -2 54 -14 14 -7 -52 -33 58 -8 27 8 38 -53 56 23 23 -80 -5
8181eoj1O3m1M8l8lJ7l0j7
$$ -5 -11 -22 41 0 48 10 7 24 -6 -23
8191b3
$$ Imaginary data points
##PAGE= N=2
##DATA TABLE= (X++(I..I)), XYDATA
0@%%%%%%%%%%%%%%qJ6j6J6j6K4l2L2m0M8n6P2q0Q8j04J20j36J60j84K08k35K61
$$ 0 0 0 0 0 0 0 0 0 0 0 0 0 0 0 -8 8 -8 8 -8 16 -16 16 -24 24 -32 40 -40 48 -56 64 -72 88 -96 112 -123 138
36A38k94L32l71M12m59N12n68O29o97P70q50R38j032J136j252J380j523J680j855
$$ 138 -156 176 -195 217 -242 270 -298 331 -366 404 -446 492 -540 596 -656 724 -799 881 -974
55i74K052k274K530k828L179l598M104m737N557o665Q247j0706J5082k5172Q9845
$$ -974 1078 -1196 1334 -1494 1685 -1913 2191 -2546 3011 -3654 4593 -6113 8969 -16203 73642
70G3642J7355j99383N5835J51931k4962j54800K5887J14596k8916j10388M4298
$$ 73642 90997 -108386 -52551 99380 74418 -80382 -54495 60101 31185 -79203 -34905
81c4905R1132n3472r0445P7471R9785p3673j09457P4856J18341n2374j14161L6613
$$ -34905 56227 2755 -87690 -10219 89566 15893 -93564 -18708 99633 47259 -66902 -30289
93c0289R4005k7871p7902K2147M8734l1248l1996M3741J4581o2897r749Q4877
$$ -30289 63716 35845 -42057 -19910 28824 -2424 -34420 9321 23902 -38995 -48744 36133
105C6133J9584q9966k7306R1338L6031p9514l2883P0127K2511o5073j1205O0083
$$ 36133 55717 -34249 -61555 29783 65814 -13700 -46583 23544 46055 -19018 -30223 29860
117B9860q770o7777K2947P9861l3646r8626L2270J15104j9404j18428Q968J16637
$$ 29860 21090 -46687 -23740 56121 22475 -76151 -43881 71223 51819 -66609 -57641 58996
129E8996J740j06090m284R5165K128q4740M349P4761j8864p5752K9872Q1908l6310
$$ 58996 60736 -45354 -49638 45527 47655 -37085 -32736 42025 23161 -52591 -22719 59189 22879
142B2879r2235L2988R8999k3366r6945J5969R2040q064q1030N004O8201o457n4369
$$ 22879 -69356 -36368 62631 39265 -57680 -41711 50329 42265 -38765 -33761 34440 27983 -26386
155b6386J3794M3132k7785m1626L8327M4857m4360n0349M3899N3184m0075n1762
$$ -26386 -12592 30540 2755 -38871 -544 44313 -47 -50396 -6497 46687 6612 -45150
167d5150L6620M9114l1165m1056K8451L0047l0350j8594L8094J0858m9416j0901
$$ -45150 -8530 40584 9419 -31637 -3186 26861 -3489 -22083 16011 26869 -22547 -33448
179c3448N7139J3662o1342j7591O1835K0470n9742k1867N5899K1718m9420j6184
$$ -33448 23691 37353 -23989 -41580 20255 40725 -19017 -40884 15015 36733 -12687 -28871
191b8871M5361P784m5708K06N0145m602n5768M372N8571l332o0072J473N9787
$$ -28871 16490 24274 -21434 -21228 28917 24315 -31453 -27081 31490 28158 -31914 -30441 29346
204B9346R67n7132k974N1901K717m4843K295M0569q903l9781J4162M1187j7176
$$ 29346 30313 -26819 -29793 22108 24825 -20018 -17723 22846 13943 -25838 -11676 29511 12335
217A2335m2680J8475M2954j9497m3903J9079M3661j6991m0875J5381L5769j6466
$$ 12335 -30345 -11870 31084 11587 -32316 -13237 30424 13433 -27442 -12061 23708 7242
229G242l0080K0515K7358k4834k6350K7660K5880k9871k5314L1664K5313l3026
$$ 7242 -22838 -2323 25035 201 -26149 1511 27391 -2480 -27794 3870 29183 -3843
241c843k6171L2019K5799k9810k2967K8826J8693k9738j5337L2016J3685l3216
$$ -3843 -30014 2005 27804 -2006 -24973 3853 22546 -7192 -22529 9487 23172 -10044
253a0044j2185L3872J0214l5055q888L6383Q772l6729r112L4987P845l2952m992
$$ -10044 -22229 11643 21857 -13198 -22086 14297 23069 -13660 -22772 12215 20060 -12892 -17884
266a7884L2419K294l2863o22L2946o35l2099K722L1783n032l2480O182L2870o253
$$ -17884 14535 16829 -16034 -16656 16290 15655 -16444 -13722 18061 13029 -19451 -13269 19601 13348
280A3348l1847O637K9895q517k8697J0714K8557j1909k8083J2367K6825j3574
$$ 13348 -18499 -11862 18033 9516 -19181 -8467 20090 8181 -19902 -7535 19290 5716
292E716k5190J5612K4646j7145k4664J7376K3870j7527k2078J8552K0462k0147
$$ 5716 -19474 -3862 20784 3639 -21025 -3649 20221 2694 -19384 -832 19630 -517
304e17j9965K1170J9529k1055j8240K1109J6340k2066j5036K3317J4496k3526
$$ -517 -20482 688 20217 -838 -19078 2031 18371 -3695 -18731 4586 19082 -4444
316d444j3756K3131J2002k3299j0180K4397R048k5163q724K5023P837k4505o087
$$ -4444 -18200 4931 16933 -6366 -16546 7851 16899 -8264 -16988 8035 15872 -8633 -14720
329a4720K4687M537k5351l855K5473L405k4574k136K3795J94k4046J392K4329
$$ -14720 9967 14504 -10847 -14702 10771 14176 -10398 -12534 11261 11455 -12591 -11199 13130
342A3130j924k4194K692K3331m085k3056N686K3421o289k3525O252K2660o692
$$ 13130 11206 -12988 -10296 13035 8950 -14106 -8420 15001 8712 -14813 -8561 14099 7407
355G407k1296Q014K0325r254k0023J0050J9293j0768j8065J2110J7249j3834j7396
$$ 7407 -13889 -5875 14450 5196 -14827 -4777 14516 3748 -14317 -2207 15042 1208 -16188
368a6188J4738J7912j4548j7514J3958J6345j4124j4873J4643J3827j4942j2636
$$ -16188 -1450 16462 1914 -15600 -1642 14703 579 -14294 349 14176 -766 -13402
380a3402J5271J0746j6238r222J8149Q725j9719r273K0018R794j9344r506J8584
$$ -13402 1869 12615 -3623 -12845 5304 14029 -5690 -14963 5055 14849 -4495 -14001 4583
393D583Q652j7967p667J7242O205j6379l991J6393J471j7904J78J9972k84k1253
$$ 4583 13235 -4732 -12399 4843 11048 -5331 -9322 7071 8542 -9362 -9184 10788 10504 -10749
407a0749o52K1407J378k0601j856J9528J809j7700j185J5522q32j3838L931J3825
$$ -10749 -11401 10006 11384 -9217 -11073 8455 10264 -7436 -8621 6901 6069 -7769 -3838 9987
421I987o858j5444Q477J7400q325j8780P408J9036o172j8421M821J6739l947j3800
$$ 9987 3129 -12315 -3838 13562 5237 -13543 -6135 12901 6729 -11692 -6871 9868 5921 -7879
435g879M360J0628o778q571J0372Q412j3364j0024J5018J2004j5184j3704J4118
$$ -7879 -3519 7109 331 -8240 2132 10544 -2820 -12844 2174 14178 -1006 -14710 -592
448e92J4772j2051j4532R559J2288p720q605P982M867j0445k506J3902K220j6934
$$ -592 14180 2129 -12403 -2844 9444 1724 -6881 1101 5968 -4477 -6983 6919 9139 -7795
462g795l707J8817O072j9195q509J7667J0323j4539j0180J0758P715q207l620
$$ -7795 -11502 7315 13387 -5808 -14317 3350 13673 -866 -11046 -288 7427 -780 -4400
475d400Q146p22j0001L336J3144m023j6344K983J8504l92j8924k734J6914M990
$$ -4400 3746 3024 -6977 -3641 9503 5480 -10864 -7881 10623 10231 -8693 -11427 5487 10477
489A0477j3014m836Q642K200n881K272N135o449o840R691R742j0910j3281R985
$$ 10477 -2537 -7373 1269 3469 -2412 -140 4995 -1454 -8294 1397 11139 229 -13052 -3067
503c067J6061p135j6584L413J4617q87j0496O56O074l007k989P007J972j1233
$$ -3067 12994 5859 -10725 -7312 7305 6418 -4078 -3422 2652 -355 -3344 3663 5635 -5598
517e598l267J4634O489j6144j0491J4985J3623j1457j4492P166J2493l969q530
$$ -5598 -8865 5769 12258 -3886 -14377 608 14231 2774 -11718 -4552 7941 3972 -4558
530d558L178L923m699m41Q042j052j2123K23J5551K715j6736o719J5310R710j1573
$$ -4558 -1380 2543 -2156 -2597 5445 4393 -7730 -7507 8044 10759 -5977 -12696 2614 12324 751
545G51j0404P087Q499l732m558K309n5l200L967O155o059j0079N550J3606k916
$$ 751 -9653 -2566 5933 2201 -2357 -48 -103 -3303 664 6819 760 -9319 -3769 9837 6921
560F921j4964o38J3567L575j0273m414O219K896k800N90J088m977j747Q885M633
$$ 6921 -8043 -8681 4886 8461 -1812 -6226 -7 2889 89 679 1767 -3210 -4957 3928 8561
575H561j1130q577J0723J2055q032j3613M460J2642j352r739k7N935q14k487L610
$$ 8561 -2569 -11146 -423 11632 3600 -10013 -5553 7089 5737 -4002 -4029 1906 1092 -1395 2215
590B215M51p275q75J0864L212j2621o697J2081R677r462j1084O064J0254l076
$$ 2215 2666 -4609 -5484 5380 8592 -4029 -10726 1355 11032 1570 -9514 -3450 6804 3728
604C728p589J285M066j506n43L640j697o803J764R830P5j1504k746J1165N172
$$ 3728 -3861 -2576 1490 -16 -559 3081 1384 -5419 -3655 6175 6250 -5254 -8000 3165 8337
619H337r087o312O067N777l232l616J500L90j585K964L349n039o122N280Q813
$$ 8337 -750 -7062 -995 4782 1550 -2066 -566 -176 -1761 1203 4552 -487 -6609 -1329 7484
634G484l956j0315J674J0247N07q587j924O238J647l671N3J975k756j727N308
$$ 7484 3528 -6787 -5113 5134 5641 -2946 -4870 1368 3015 -656 -603 1372 -1384 -3111 2197
649B197L103o966n342P278P364o112q688M236Q598k196p350R42N265q48l038K007
$$ 2197 5300 -1666 -7008 270 7634 1522 -7166 -2930 5668 3472 -3878 -2936 2329 1481 -1557 450
665D50J502m022j136O011J787p146l322P491M696o559n785N233N608l462m681
$$ 450 1952 -2070 -3206 2805 4592 -2554 -5876 1615 6311 -248 -6033 -800 4808 1346 -3335
680c335K386K945k234j040K943k32m421P75N855m16o817o15P112J680o541k390
$$ -3335 -949 1996 -238 -1278 1665 1433 -2988 -2213 3642 3226 -3591 -4206 2906 4586 -1955 -4345
696d345N460K390m201j640L200M64l067J003L405j911m334K329N246k163n865
$$ -4345 1115 3505 -696 -2336 864 1328 -1739 -736 2669 758 -3576 -1247 3999 1836 -4029
711d029J544O078q53n676L53M885l00l966P68L282j549l067K484L120l071l516
$$ -4029 -2485 3593 2740 -2936 -2583 2302 2002 -1964 -1196 2086 537 -2530 -46 3074 3 -3513
727c513L316M030l297m294K961M319k540m016K187L520k223k881K435K429k903
$$ -3513 -197 3833 536 -3758 -797 3522 982 -3034 -847 2673 450 -2431 4 2433 -470
742d70k132L320K089l669k145L831K289l825k365L677K255l463k034L347J712
$$ -470 -2602 718 2807 -862 -3007 824 3113 -712 -3077 600 2855 -608 -2642 705 2417
757B417l389j258L363J108l630q24L686P73l791o33L719O13l670n55L677L17l520
$$ 2417 -972 -2230 1133 2241 -1389 -2213 1473 2246 -1545 -2178 1541 2154 -1516 -2071 1606 1923 -1597
774a597j90L535n1l467R0L592l26l475L77L430m90l259N50L170p64l065R58L005
$$ -1597 -1787 1748 1697 -1770 -1680 1912 1586 -1889 -1512 1918 1428 -1831 -1281 1889 1125 -1940 -982 2023
792B023j126l054J394L036j484l015J512K911j465k926J547K648j497k399J596
$$ 2023 897 -2157 -763 2273 789 -2226 -714 2197 732 -2194 -647 2001 504 -1895 -299
807b99K258j833k047J973J967k144k010K348K017k472k031K474J915k292j840
$$ -299 1959 126 -1921 52 2019 -125 -2135 213 2230 -242 -2273 201 2116 -176 -2016
822b016K185J761k163j521K122J219k220q64K219R10k529p69K613P60k689p48
$$ -2016 169 1930 -233 -1754 368 1587 -633 -1497 722 1632 -897 -1666 947 1707 -982 -1730
838a730K689P46k664o97K542O78k463m86K267L18k169n5K176j75k238L65K399
$$ -1730 959 1705 -959 -1656 886 1564 -899 -1385 882 1200 -969 -1024 1152 977 -1261 -896 1503
855A503o16k469N60K637n69k573L73K575k91k388K46K098l85j770O43J522q72
$$ 1503 887 -1582 -1022 1615 1046 -1527 -1154 1421 1130 -1258 -1012 1086 701 -1069 -426 1096 224
872B24j555J269J652j555j857J604K160j615k247J339K263r72k064O86J724o47
$$ 224 -1331 -62 1590 35 -1822 -218 1942 327 -1920 -581 1682 710 -1354 -668 1056 409
888D09j242Q90P27j211m75J707N06k145q89K447J310k350j678J967J805j454j589
$$ 409 -833 57 784 -427 -902 805 1311 -834 -1723 724 2034 -316 -1994 -27 1778 324 -1265
905a265R08J158o63n04P84k79j130N38J922o07k550K63K930L48k841j011K381
$$ -1265 -357 801 138 -366 418 139 -991 -453 1469 862 -1688 -1425 1505 1853 -988 -1999 382
922C82J350j645j244P63Q65l77J18L51j008q23J560J644j661k466J162L046l73
$$ 382 1732 87 -1157 -394 471 94 212 563 -445 -1268 292 1936 275 -2191 -1029 2017 1644
939A644l108m33K482J102j560j079N03M82K35N44m17j548j59K337J013k437k034
$$ 1644 -1464 -1897 585 1687 127 -952 -449 33 268 812 395 -1153 -1312 1025 2038 -399 -2433
956b433J961K748j056k822r5K382P69j220r71M8L64R03P10j129j999P72K862K77
$$ -2433 -472 2276 1220 -1602 -1697 685 1454 234 -737 -689 -325 578 1288 159 -1840 -1068 1794 2071
974B071l191j493K721K394j614k709L95K146O17r74r70l10L70J440O80j809k023
$$ 2071 -1120 -2613 108 2502 888 -1821 -1426 720 1337 363 -607 -917 -547 893 1573 -236 -2259
991b259J406L102m13l388r97L020K034j896k414N02J964N78p48j136o11P76J728
$$ -2259 -853 2249 1836 -1552 -2549 471 2505 609 -1805 -1303 661 1239 491 -645 -1256 -480 1248
1008A248L78k389j582J999K820r27l388l96K953J544j813k038L62J635Q89n06
$$ 1248 1626 -763 -2345 -346 2474 1547 -1841 -2237 716 2260 447 -1591 -1229 406 1295 789
1024G89j538q66J225K244k45k843j297K743K481j704l031K07K807R87j717j596
$$ 789 -749 -1615 -390 1854 1609 -1234 -2531 212 2693 989 -2042 -1835 972 1959 242 -1354
1040a354L02J298J006k92j741j075J472K471n06l162q73K963K153j971k845O95
$$ -1354 -1052 246 1252 960 -781 -1856 -384 2087 1581 -1581 -2454 509 2662 691 -2154 -1459
1056a459K510O29j618j302L41J192R38k33j814r71J659K289q51l063l69K882J573
$$ -1459 1051 1680 62 -1240 -899 293 1231 998 -816 -1787 -128 2161 1310 -1753 -2122 760 2333
1073B333k023k257P94K147N51j511j169R1J319J159o07j899o84K054J814j318
$$ 2333 310 -1947 -1153 994 1545 34 -1135 -1044 275 1434 827 -1072 -1756 298 2112 794
1089G94k575K45K546R12j908j611P37J704L56r54j177j64J274J330o85k032n04
$$ 794 -1781 -1536 1010 1922 14 -1597 -860 844 1200 246 -931 -1095 179 1509 824 -1208 -1712
1106a712K206J500j578k231O69K297L87j840j026Q54J175J70o60q93l93J087J341
$$ -1712 494 1994 416 -1815 -1146 1151 1538 -302 -1328 -474 701 871 211 -682 -1075 12 1353
1123A353n62k036k28K053J194j683j777R51J895J4j586o60P25Q18K23l98r45k70
$$ 1353 791 -1245 -1473 580 1774 91 -1686 -735 1160 1174 -412 -1072 -347 471 694 296 -649 -919
1141i19J073J158q10j640M1J846O95j618j198R57J344j66j020n16M70O32L22k89
$$ -919 154 1312 502 -1138 -1097 749 1444 -174 -1372 -415 929 763 -257 -773 -303 329 651 362
1159C62r04k93J053R35q99j361L87J545J81j356o40Q57Q27l40n48k18J44L06M83
$$ 362 -542 -835 218 1153 254 -1107 -720 825 1006 -350 -990 -133 694 354 -194 -412 -268 38 521
1178E21j55r05j85R66O97q79j038M83J258j06j125k38Q17L74l73j81p2p4J80L80
$$ 521 366 -539 -724 242 939 60 -978 -495 763 657 -468 -706 111 485 112 -69 -141 -215 -35 345
1198C45p2p57j00R19M26q29p65O38Q94l74o99K4N27k7k04J05J5l05R2N35r4o81
$$ 345 273 -484 -584 335 761 -68 -833 -195 699 325 -374 -350 177 150 -54 51 66 -239 -147 388 294 -387
1220c87o8P80K72p87l48N54M50m01m13L62K06k44j31L67j02l67J50M36j25n75
$$ -387 -455 325 597 -190 -538 16 466 65 -348 14 220 -24 -155 212 110 -257 -107 329 204 -371
1240c71Q7O57kn96j03M87Q7m36K0L55l5m68J72L98j65l93J75N27k30n72K36M82
$$ -371 -284 373 371 -225 -328 159 246 -190 -170 185 150 -318 -146 252 87 -306 -131 396 166 -406 -170 312
1262C12j33m84J96L76k58l45L06L86l54l35L17L91l41l73K57M31k58m04K23L10
$$ 312 179 -305 -109 267 9 -336 -30 356 2 -333 -16 375 34 -339 -82 349 91 -313 -90 220
1282B20k31k02K70J84l34k02L72K19m02k32M00K91m18l16M14J77k31j79J85J68
$$ 220 -11 -213 57 241 -93 -295 77 296 -106 -338 62 353 -65 -381 33 210 -21 -200 -15 153
1302A53l01jL51l9l70j9M87Qn05k1M50J08l94j64K99J72k87p0K49Nl04J29K88
$$ 153 -148 -149 202 163 -207 -226 261 269 -236 -257 193 301 -93 -257 42 214 -73 -143 106 111 -193 -64 224
1325B24j66k96J78L76j87n00J70N17q8m36l6L80pl34J27J97j4k53K05J21j65k30
$$ 224 58 -238 -60 316 129 -371 -201 316 228 -208 -244 136 129 -205 -78 119 105 -148 57 178 13 -217
1347b17K58K30l17l63L49M50k93m26J68L89n4k88j5K23j1j25J00Rk25OM14M9n13
$$ -217 41 271 -46 -409 -60 390 97 -329 -161 228 174 -114 -129 94 83 -42 58 67 -158 -152 262 311 -202
1370b02j46M72L12n05l52L80M12k39l65J10J39J3K6j0j70j60K36M12k76n13J54
$$ -202 -348 124 436 -69 -421 -41 371 132 -233 -123 16 29 55 45 -125 -285 -49 363 87 -426 -272
1391b72O29J33o98k18N12L47l18l20R5J64L4O6o2k93o9M77K75m24n70K36Q40j70
$$ -272 357 490 -208 -426 86 433 115 -205 -110 54 88 154 92 -201 -270 207 482 58 -512 -276 564 394
1413C94p25j51N02L70k00m16N4J35K07P0j88m55J09O74J69p86l85N45O80k42p28
$$ 394 -331 -482 20 390 190 -226 -172 -37 170 240 52 -403 -294 380 549 -237 -622 -77 603 361 -367
1434c67r8N76L53k82l89j01K44L42J46n23m48L30P83n4q81l43P75O66n05p32J8
$$ -367 -465 111 464 182 -207 -308 -64 278 424 -99 -547 -217 566 512 -369 -712 63 729 224 -508 -490
1455d90O00L36k75m28j44L29M61K5o19n28N57R14k58r86k66R01O58o01o94L1O42
$$ -490 110 446 171 -257 -401 -72 389 414 -205 -733 -176 738 480 -506 -772 129 787 186 -508 -477 165
1476A65L14l21m84j78M51O03p6p94l87P34Q33m33j054pQ84M78n23p36R0O21L94
$$ 165 479 158 -326 -504 -53 550 474 -320 -707 27 860 427 -627 -634 250 728 205 -531 -441 180 574
1497E74l12o06k66N67P34k23r81k78J008N90n69r67J38R16K99n48o38R2N78M52
$$ 574 262 -344 -610 -43 691 468 -513 -791 217 807 238 -729 -591 325 624 76 -562 -470 108 560
1517E60l28o07k41O46P26l74j084m5J045N99p29q28J77Q69K50n98n56J26N23M80
$$ 560 232 -375 -616 30 756 382 -702 -747 298 897 168 -660 -483 386 636 38 -518 -392 131 611
1537F11l82o77j47O63P35n08j005K4J015M44o98p23J98P62K77n36n76j6P02M17
$$ 611 229 -448 -595 68 803 295 -710 -686 329 773 75 -648 -450 312 589 53 -523 -539 163 580
1557E80k58q63m4Q30O04o20q90J96R12K21o44o17L26N64J86l74n29nN47N04m30
$$ 580 322 -541 -585 245 849 229 -661 -465 447 668 24 -593 -267 297 483 109 -420 -425 122 626 196
1578A96p32J2Q17M13o41p42L04Q13J29p00m35L12N05J41k94m90k6N10M46m16o50
$$ 196 -536 -524 293 706 65 -677 -373 440 569 -131 -566 -254 251 392 98 -392 -418 92 538 122 -528
1599e28N5P83L18o62n47L17O63N7n11l26J81M64J42l17m61J9N16L92m66n83J51
$$ -528 -473 310 628 -34 -581 -264 399 456 -55 -381 -200 264 406 89 -372 -353 163 555 89 -494 -343
1620c43P56L1n50m10L35M86j3l20k47O9L98J15k38m51kN76K45m30m69K71N79m4
$$ -343 413 444 -106 -516 -181 305 292 -28 -275 -206 192 307 69 -382 -384 192 437 7 -462 -191 388 344
1642C44m61k91L52L11q1k32j20N8K10J44j31l80J8M67J51m56l82L19N14j32l14
$$ 344 -117 -408 -56 255 174 -58 -178 -120 90 234 103 -277 -259 208 359 -97 -479 -160 354 222 -92
1663i2j54K45J58k1j33j07m9K01J88j83l32M9L88R4l92j53K85K75j81k12k7J39
$$ -92 -246 -1 157 136 3 -104 -153 48 236 53 -279 -230 158 252 -140 -293 -8 267 86 -126 -153 -14
1685a4L4P9m8j16q6J81K00k22k45J29K86Jk42j37K29J38j91p8Q7N4k4R2o7j34
$$ -14 20 99 51 -65 -151 30 230 8 -237 -108 178 179 -63 -200 29 167 -24 -102 -15 39 15 107 40 -94
1709i4k5J47J16r4k69J54K26j17j24k9J13N1l7q2Q6o2PJ37m6o9j03J45J25j62
$$ -94 -119 28 144 50 -219 -65 161 44 -80 -109 4 55 18 -64 22 -40 -33 104 58 -11 -114 31 156 -6
1733fj55J68P7o5q9J55qm9p3J14L8j38J2J04l9j60K2K17Nj89JR6L4j19k4R0Or4
$$ -6 -161 7 84 19 -70 85 77 28 -45 69 107 -31 -19 85 46 -114 -92 125 130 -59 -58 38 72 -47 -71 19 25 -69
1761f9K6Q8L2j69R5P8m3o2m1O0N5K3j00J12o3r9R4P7j20o6J24O8r2o2K0J87q1
$$ -69 -43 45 77 -92 3 81 38 -24 -65 -5 50 73 -27 85 22 -77 17 94 -26 -92 32 100 8 -54 -34 153 72
1788G2j52J2P7M7k3QL0r5m7J20Lq7q2J38J01j59o4O8P7J7j05m4J42r2j6M5L5n3
$$ 72 -80 -68 9 56 33 41 71 -24 -71 49 52 -35 -117 21 122 -37 -101 -33 44 61 -44 -88 54 -38 -54 -9 26 -27
1816b7j6Q7j8j41Q4J73o4j57n5J21P4n2l0L2N4o7J3j1L8o0N9M3j02q7P7J07L4
$$ -27 -43 44 26 -115 -31 142 78 -79 -134 -13 61 9 -21 11 65 -2 11 0 38 -22 37 80 -22 -109 -32 75 109
1843A09k04QJ00O5j57KQ9K7p0Lj0k6P5P2J5j73l6Q4J29j15n0j3K10p5j21NQ4N8
$$ 109 -95 -87 13 78 -79 -77 12 39 -31 -28 -38 -64 11 83 98 -75 -111 -27 102 -13 -63 -76 134 59 -62 -57 27 85
1871H5q0J2p9OP0O4m9q6n7J78M2j70j33J85J06q3j35r0J98N4J5k7j13K7J09K1
$$ 85 5 17 -62 -56 14 78 29 -57 -114 64 106 -64 -197 -12 94 11 -124 -214 -16 38 53 26 -87 -60 49 70
1897G0j3j78N0J53L1k48j5K24P3j18j24r7J98R1M1j40j27J27O6L9j69p5J19J83
$$ 70 57 -121 -71 82 113 -135 -150 74 147 29 -95 -192 6 97 138 -2 -129 -2 64 103 -66 -141 -22 161
1921A61qk76o8K04J57j04j44k7N0J07K4j49n7J17J12M3k51j24K38K40j49l04K0
$$ 161 153 -123 -191 13 170 66 -78 -105 -55 52 76 -73 -130 -13 99 142 -109 -233 5 245 96 -208 -188
1944a88J74J71q0k18M5J29P1m2j84n9J98K51j47l23o4L16J95j37k83qK35R0j33
$$ -188 -14 157 77 -141 -96 33 104 62 -122 -181 17 268 121 -202 -266 50 245 108 -175 -183 52 142 9
1967Ij30l9K00J70j43k34r2L36J73j27l70k3L35J15p9k12rJ33J48j63r8K0J71
$$ 9 -121 -160 40 210 67 -167 -259 77 250 123 -247 -270 65 180 101 -111 -120 13 161 -2 -100 -80 91
1990I1J30j51k86KL16K31k48k88L5K52R6j68j65M3K47M0j89j54K0K46J75k40k86
$$ 91 221 70 -216 -214 102 333 85 -203 -168 84 180 12 -153 -110 137 177 -12 -166 -146 100 275 35 -251
2013b51k0L00K30k16k34ML15M0k25j52Q0K33J18j56l12P0K80K10k12k75j4K21
$$ -251 -271 29 259 43 -191 -187 128 168 -57 -209 -129 104 222 66 -246 -176 104 314 102 -173 -187 34
2035C4K21k59j45N5K71k0j95j78J24K40Q5k01k41J3K80J60j64k91Q9K09O1k03
$$ 34 255 -4 -149 -94 177 157 -38 -216 -92 148 233 32 -209 -196 84 244 80 -211 -122 87 148 -55
2057e5j50J78J86rj89k10J38K19J05j35k01k9J99J40j75j86J12K41o9j51j48J51
$$ -55 -205 -27 159 150 -39 -249 -111 108 213 78 -123 -152 47 187 12 -174 -62 179 110 -41 -189 -38
2079c8J96j6j32j30l1K51O7q5j92LJ92O0k14r9J67J31j6j70j51J13K22L3j35j46
$$ -38 158 142 10 -120 -151 100 167 82 -110 -107 85 145 -69 -168 -1 130 114 -56 -207 -94 128 161 26 -120
2103a20LR9J13r8j11O6J85jj96j38J76J44J9j54r0O7P1P7n1r7j9J11qj06r8J33
$$ -120 -117 -18 95 -3 -114 -48 137 136 -60 -198 -22 122 141 -13 -103 -36 35 112 61 -36 -55 56 48 -58 -156 -23
2129b3J81n7k01m3R9J25oo1r7P7J0J8k4o1N3O7L7j55j34J44J73n3j51o3P9O8M1
$$ -23 158 101 -100 -143 -44 81 75 14 -83 -6 4 22 -2 -63 -10 57 94 -61 -195 -51 122 69 -82 -145 -66 2 43
2156D3J0j21R5L9l8n9kJJ37j5j28m6J3Q7M4p8n8M4N6Kk2l7J6O8o1On6K5J43n8
$$ 43 53 -68 27 66 28 -31 -33 -32 105 90 -38 -84 -71 16 60 -18 -76 -32 24 26 4 -33 -17 51 -10 -4 -60 -35 108 50
2186E0j17pLQ3j4M1Lm8J2pj5K8qK4L6r7%J9O7j1Mn5j3K6m4L9O1l6j7l6QM8k5L1
$$ 50 -67 -74 -71 12 -2 39 42 -6 6 -1 -16 12 4 28 64 -33 -33 -14 53 42 46 -9 -22 4 -40 -1 60 24 7 -29 -21 27 2 33
2220C3on5k3LN9k5j9J7O8n4nJ4L9p9L7K5o5n0P7N1j9j3p0K2J3NK5L3om8NL4K6
$$ 33 27 -28 -51 -48 11 -14 -33 -16 52 -2 -7 7 46 -33 4 29 -36 -86 -9 42 23 10 -60 -38 -25 -20 5 38 32 -16 -11 23 49
2253D9m7K0J0j3m4j6P0k1M4n1J9q2O5n0K2M2mk7mj7qR0mK1j20rR5m0L1L1r6Nk8
$$ 49 2 22 32 19 -25 -41 29 8 52 1 20 -62 3 -47 -25 17 13 -14 -18 -35 -43 47 43 64 -56 -65 30 -10 21 52 -44 -39 -67
2286f7K0K8K7J5K8l7l4o6R3M7J7j2o0o0P8%k9R5q1l7LNm0N6K6L6p9jQ%L3Ll1J
$$ -67 -47 -19 8 23 51 14 -20 -86 7 54 71 59 -1 -61 17 17 -12 83 2 -35 -32 -27 -67 -11 15 51 -28 -29 -21 -21 12 15 -16 -15
2320a5J6j7j4J03m5k5j2k7K4J5P8q4K3m4O2m9ON0l8KlKm3K7QJ0Qn6k6j6P1O4o4
$$ -15 1 -16 -30 73 28 3 -9 -36 -12 3 81 -3 20 -24 38 -11 -5 45 7 9 6 8 -35 -8 0 10 18 -38 -64 -80 -9 55 -9
2353iLk4mNJ4N8K1p6LL6n9J05rn3j3l5M7L3l6k2%Q2p1j4j3M7N2j7n5j2k3L2K5
$$ -9 -6 -30 -34 -29 -15 43 64 -12 -9 27 -32 73 64 11 -2 -37 10 43 7 -15 -15 67 -4 -18 -31 16 68 51 -4 -16 -39 -7 18
2386A8nn8P9M8q9l9J6N8M2r0J2o6L3P3l8j2Nk9%N6n3P6L6l1m2q3O1L1L8j6k0j03
$$ 18 13 -45 34 82 -7 -46 -30 28 70 -20 -8 -74 -41 32 -6 -18 -13 -42 -42 14 -39 37 73 42 0 -83 -22 9 47 31 11 -92
2418i2R1L7K3l8k5O5m9m9j6J1J10J8j04j3n5J01Lk1l7M7OKrm5pN9kl2n9Q1j0P7
$$ -92 -1 36 59 21 -4 61 12 -37 -53 -42 68 86 -18 -31 -86 15 18 -3 -40 7 13 15 6 -39 -46 13 11 -21 -80 1 -9 68
2450F8r4Kj6J7R3l9p2M3K9J8n0J4l1R1Qn0l4m5R4N4q5n6J6j7K4L1n2L5M7k5j7
$$ 68 -26 -24 -40 -23 70 31 -41 2 31 49 -1 13 -18 73 81 31 -3 -48 46 100 15 -41 -25 -42 -18 13 -39 -4 43 18 1
2481Al4JLR8o8o8M8K3J9Kl7k3P6M5j05K6m9N1M0n7n3M9R2k8Jj16M2K0M3n6K8J1
$$ 1 -33 -32 -29 69 1 -67 -19 4 23 25 -12 -35 41 86 -19 7 -42 9 49 -8 -61 -12 80 52 53 -63 -21 -1 42 -14 14 25
2513B5O3j04J9n3jJ19K7q0r7O4JO3q8o0J82j9j3r8%M5O5p7j3J1ON0J7l8k2N6M
$$ 25 88 -16 3 -50 -51 68 95 15 -82 -18 -17 46 -42 -102 80 61 48 -50 -50 -5 60 -17 -30 -19 -13 37 54 16 -6 50 54
2544E4pn0k8L9L3lm7k7J4M5L6q0l9L7O3jo2n5N9M4K8j00K1l2J40m6n1j5L3j6J2
$$ 54 47 -3 -31 8 41 38 -9 -36 -22 23 59 -21 -60 -23 40 39 -23 -78 -19 25 53 -47 -26 -58 82 36 -15 -30 3 -13 -1
2575aL5o1kK7rL6m5R2q7lj1qM2L1L9r7l0N2L1Qm3K9k2K4l2p1N7l5R3o6N2rKJ2
$$ -1 34 -27 -29 -2 -11 25 -20 72 -15 -18 -29 -37 5 36 75 -22 -52 0 31 39 -4 25 3 27 -5 -76 -19 -54 39 -27 25 16 18 30
2609C0m1LK6j7Pk5l0OL3Rj7k5M3K1Qj9j4k2P4j1n4OKK1n6N8M0o4Q3o8rl2J9L2
$$ 30 -11 -8 18 1 8 -17 -47 -41 -8 1 -16 -41 2 23 31 12 -2 -24 50 39 -15 -9 -7 14 -42 16 56 -8 75 7 -2 -34 -15 17
2643A7K7rl3K1l3J3j1j3K5RM7n0n8K6O9p4K4J3m1mKP7k2jL0j5p3ML8%nK3m5K8
$$ 17 44 35 2 23 -10 3 -8 -21 4 13 60 10 -48 -22 47 -27 -3 10 -31 -35 -33 44 22 21 51 36 -37 -33 5 5 0 23 -22 6
2677FJ2j9J5Jj2J3l8O2l4j4j9M1j6ql2mL1L6q1P2m6K3qO6p7oL4j1M1j3M8q1M1
$$ 6 18 -1 14 15 3 16 -22 40 6 -8 -27 14 -2 -10 -42 -46 -15 21 -60 12 -34 -11 -19 47 -30 -36 -2 -13 28 15 63 -18 23
2710B3r0M5M4L1Ko0J6lok7K1K7On3JK7l8O0Ll8pj6J5QJ2J6k5KQK7l6K4k7k6M1
$$ 23 -67 -22 22 53 55 -5 11 8 2 -25 -4 23 29 -24 -23 4 -34 26 29 -9 -16 -32 -17 -9 3 19 -6 -4 4 31 -5 19 -8 -34 7
2745GNl6OjJ8n0J09m2j6J0k0n%%M9km7qK2Ql4j8Q4o7M6Mj1%np1K3O0j8l6O2o9
$$ 7 12 -24 -18 -19 -1 -51 58 16 0 10 -10 -15 -15 -15 34 32 -15 -23 -1 7 -27 -45 39 -28 18 22 11 11 6 -65 -42 18 0 -36 26 -43
2781d3N4k9K7n2Q7l1j2jQJ7n2O6o6L8J5m3K4J6ok8m0R7k3pj8m5R4Mk5n1N2L9j41
$$ -43 11 -18 9 -43 44 13 1 0 8 25 -27 39 -27 11 26 -17 7 23 17 -11 -51 46 23 16 -2 -47 47 51 26 -25 27 66 -75
2814g5P3K7k5Ok7L2qk0k4Q6o2k6L0J8j3j9J1K3J4m1N7o4J0k3Q6n7M0j0L0on6K5
$$ -75 -2 25 0 6 -21 11 3 -17 -41 45 -17 -43 -13 5 -8 -27 -16 7 21 -20 37 -27 -17 -40 46 -11 29 19 49 43 -13 12
2846A2J7k5PKl0K5J8%K9q2K4k8N4q7M4M4m2J5MK6l4mL3k7l6K2j5K0K9J1o4P1m7
$$ 12 29 4 11 13 -17 8 26 26 55 -27 -3 -31 23 -64 -20 24 -18 -3 1 27 -7 -11 22 -5 -41 -19 -34 -14 15 26 -38 33 -14
2879a4M5j5j6Mj9L6L0k3k0j3N3k4m0mO0m7n6NM6j8K6M2n5K3l4L3j1K2Qm2lK0o9
$$ -14 31 16 0 4 -15 21 51 28 8 -5 48 24 -16 -20 40 -7 -63 -58 -12 -30 -4 38 -17 6 -28 5 -6 16 24 -18 -21 -1 -70
2912g0N4lL8n9K0N2m0l9K2lL5Nm3K9QPj6m6O5k9N2l5%lj2M5m1J6M6m3j3K4k4m
$$ -70 -16 -19 19 -40 -20 32 -8 -47 -25 -28 7 12 -31 -2 6 13 -3 -49 16 -13 39 4 4 1 -11 34 -7 9 55 12 -1 23 -1 -5
2946epK0J8n3K1J3k8pl3L0%L8n9K1K6l5J8J7n2N4J5nl1Q4k8L3j8p8JK8k1K9Kp
$$ -5 -12 8 26 -27 -6 7 -21 -28 -61 -31 -31 7 -52 -31 -5 -40 -22 -5 -57 -3 12 7 -24 60 32 65 47 -31 -30 -2 -23 6 8 1
2980AK5n6m1J00J1r7M4Rm3j3M4K3Lk7l2N0K5n0k2Q0Pm3K2pL3l4K6j9j0o6Q0L3
$$ 1 26 -30 -71 29 40 -57 -13 -4 -47 -60 -16 7 10 -17 -49 1 26 -24 -46 34 41 -2 20 13 46 12 38 19 9 -57 23 56
3012E6n4k5o4J18%K2m6j2L0Om6N2Jn4k8L6Omj6Ll5L9L1j1J5j8l2M8n4JJ4k1O6
$$ 56 2 -23 -87 31 31 53 7 -5 25 31 -15 37 38 -16 -44 -8 -2 -6 -22 -19 -54 -15 16 5 20 2 -30 18 -36 -35 -21 -42 24
3045B4l1K8o3K9j5M0nPnj8O9k0m5L6oK4k9lm9M2j1N9j5o9l5N4K5Lo7R3l7l2Nr
$$ 24 -7 21 -42 -13 -28 12 7 14 9 -9 60 40 -5 31 25 49 20 17 -32 10 -1 58 43 -26 -61 -7 18 21 -46 47 10 -22 -17 -26
3079b6N3j05Q0l8k7N9L7l5M3q3O5k7Qn4L0O1o7J16q1NmJ6Jk1lKL0o0M1K8l0n0
$$ -26 27 -78 2 -36 -63 -4 33 -2 41 -42 23 -4 4 -50 -20 41 -26 90 9 14 10 26 27 6 3 5 35 -25 16 44 14 -36
3111c6R2p0k4pP3m2lkj6L2k1ON1m0K7n4k1J2L0j1OK4j0NRJ0%lrJ7km3Q3l4q4K0
$$ -36 56 -14 -38 -45 28 -14 -17 -19 -35 -3 -24 -18 33 -7 20 -34 -55 -43 -13 -24 -18 6 -4 1 10 20 20 17 8 25 23 -20 63 29 -55 -35
3147c5L5lJ1j6ol6PL8N6n5n7K4N6o0Q4m5l0J8k3L9p1M1M2l8O5l9M6p0J5j4N7l8
$$ -35 0 -3 8 -8 -14 -50 -43 -5 51 -4 -61 -37 19 -41 43 -2 -32 -14 -37 2 -69 -28 14 -24 41 2 48 -22 -7 -21 36 -2
3179bQn4N8jK3Rp1K6Pj8K6N8m7j2o4M1N3q9rL2RN8q9oL4j1L0NJ3kq7P8mk3M5l9
$$ -2 6 -48 10 9 32 41 -30 -4 3 -15 11 69 22 10 -54 -13 40 -49 -58 -26 -17 41 -48 -54 -20 -31 -1 4 17 15 -72 6 2 -21 24 -15
3215a5N5n3rK7nKlJ5ln7P8n8N2j2J4l8J0j5Om8M0KKj1RJ6M5j53Q8L1Qo9O6n7O
$$ -15 40 -13 -22 5 0 2 -1 14 11 -46 32 -26 26 14 28 -10 0 -15 -9 -57 -17 -15 -13 -24 -15 1 46 -107 -19 12 20 -49 17 -40 -34
3250c4K1PN4q8J11o8j8P5n1l5OQ4p9L3%m9J0M4Qp0N8p1R2j01P3jNkN8o2j2mLK0
$$ -34 -13 -6 48 -40 71 3 -15 60 9 -26 -20 64 -15 18 18 -31 -21 23 31 -39 19 -52 40 -61 12 11 16 14 72 10 -2 -6 -3 17
3284A7o5J5J7k3N1Ol4L4k1Lkj6m3P9l0m5K5OK7k0M2L0q2L3K4l1O2k0p2K6j8L8
$$ 17 -48 -33 -16 -39 12 18 -16 18 -3 0 -2 -18 -61 18 -12 -57 -32 -26 1 -19 23 53 -29 4 28 -3 59 39 -33 -7 -25 13
3316A3j1k0L6l3Ql0L3%LK5m1K4j1Ol1L0o6L8M0J0o2K5Qm6R8l5Ol5%K3K1k7Pk5
$$ 13 2 -18 18 -15 -7 -37 -4 -4 -1 24 -17 7 -4 2 -29 1 -65 -27 13 23 -39 -14 -6 -52 46 11 17 -18 -18 5 26 -1 6 -19
3350a9K6m0J8qK8L6kko5O2J4p8pJ7j5M8M2o6QL0qj8j0Pk7Q4p7M1m7oK6l9l0N1
$$ -19 7 -33 -15 -23 5 41 39 37 -28 34 48 -30 -37 -20 -35 13 55 -11 -3 27 19 1 -9 -2 -29 55 -22 19 -28 -34 -8 -47 -77 -26
3384b6M0pk7O0o9J5M2Kl7ON0n7L0j7k0k3J1M4Po8J2O4q1L3OKkM0j2o2J4O1l7l1
$$ -26 14 7 -20 40 -29 -14 28 30 -7 -1 49 -8 22 5 -15 -38 -27 17 24 -44 -32 32 -49 -16 -10 -8 -10 30 18 -44 -30 31 -6 -37
3418c7J6j6L1L9k9j6M3N1n8j8KL1on2L0mK9J2j6q4M1QP9o3l7L2M1pn7j8N3pj0
$$ -37 -21 -37 -6 33 4 -12 31 82 24 6 8 39 33 -19 11 7 36 48 32 -52 -11 -3 76 13 -24 8 49 42 -15 -33 20 13 3
3451CJ2k8j8N8j4q5Q2j5l1J2k9J7M4L4l3J1j3QJ0J6lj9M3j3j7p5L3P1l1l8j2M8
$$ 3 15 -13 -31 27 13 -72 10 -5 -36 -24 -53 -36 8 42 9 20 7 15 25 41 38 19 62 49 32 -43 -10 61 30 -8 -20 28
3483B8o4J07k9j4p6M7N6n7j9K4J4l0j7k5%P0K3J4m6l4oJ7k1K4m2M1LMl0Q2p0O9
$$ 28 -36 71 42 28 -48 -1 55 -2 -21 3 17 -13 -30 -55 -55 15 38 52 6 -28 -34 -17 -38 -14 -56 -15 -12 -8 -38 44 -26 43
3515D3l7K7m1k4L4lm1L0M5L4p3K0O8q0J8k6L0j0KpK7l3k0l6R2m8J5mK5o9L5l6
$$ 43 6 33 -8 -32 2 -1 -42 -12 33 67 -6 14 82 2 20 -6 24 14 16 9 36 3 -17 -53 39 -9 6 2 27 -42 -7 -43
3547d3J5J9Nrpj6p5J52m5M8q3M5m3N2j5j9K5pk2J9PK8n6NK8K1k5J0l1Pl5N5l8
$$ -43 -28 -9 -4 -13 -20 -36 -111 41 -4 44 -39 6 -37 15 0 -19 6 -1 -23 -4 3 31 -25 -20 8 29 4 14 -17 -10 -45 10 -28
3580b8K9mn3K1j4L7L5n0l4O6j2J2Ok1qJ9l4J00p4K0N5o3j1ON9jl4Nj1K2n3k6K1
$$ -28 1 -3 -56 -35 -49 -12 23 -27 -61 5 -7 5 11 -10 -18 1 -33 67 -7 13 68 5 -6 0 59 58 24 29 18 40 -13 -39 -18
3613a8N2j5PJ3m6j7P8K2j12M1m1rM9o7Q7p2ML4m8O3j0J4qn1MM1N0m9J5pk9LJ9
$$ -18 34 19 26 39 -7 -24 54 76 -36 5 -36 -45 4 -63 24 -48 -44 -10 -58 5 -5 9 1 -50 -46 -5 45 -4 11 4 -25 -22 -3
3646cPK4OJn7O0o0J7J0K1j9RJ4mm5k9N3j0mL3n9m3Q8n1N3J3l8k2Q7j5rn6j4O3
$$ -3 4 28 34 35 -22 38 -22 -5 5 26 7 16 30 26 -19 -48 5 -5 -9 24 -35 -78 10 -41 12 25 -13 -35 52 37 28 -28 -42 21
3680B1l2L1k7J8jLj0m0M4L5k1rPj3l9K1J3M4J3l3j0m3NL3RLl5J7m6RK7M1l0m4
$$ 21 -11 20 -7 11 10 13 3 -37 7 42 21 12 19 6 -33 -12 1 45 58 25 15 -28 -23 10 19 22 -13 4 -42 -33 -6 35 5 -39
3714c9P7J9o8m1Q3om1k7O8o3j2M9K7n4M6L8p1O1k6l7K8j5K0Oq6P5mjJ3l0M0o2
$$ -39 38 57 -11 -52 31 25 -16 -43 25 -38 -50 -1 26 -28 18 56 -15 46 20 -17 11 -4 16 22 -64 11 7 6 19 -11 29 -33
3746c3K4k7o3P7L6j9J3m2M4j6j1j3J9K1l6rJ7J4mJ2n5O7k9ljM3l7k5J28r2K9l3
$$ -33 -9 -36 -99 -22 14 -5 8 -34 10 -6 -17 -30 -11 10 -26 -35 -18 -4 -8 4 -51 16 -13 -16 -17 26 -11 -36 92 0 29 -4
3778dQK7l2K7rK8l4ML2p3M0lO7n7kk0KlKk1k3M1j3j5J9JJ2J3k4K0n1M9l8J9j0
$$ -4 4 31 -1 26 17 45 11 15 47 -26 14 11 78 21 19 -1 1 -2 0 -21 -44 -3 -16 -31 -12 -11 1 14 -10 10 -41 8 -30 -11 -21
3813b1KP6p1k4L3K0m7M7j7K0k1M7o6K9lKK7m8N2j4j8k7N3p7L7LJ5l1NN3j1k9L
$$ -21 -19 57 -14 -38 -5 15 -32 15 -2 18 -3 44 -22 7 4 6 33 -15 37 23 5 -22 31 -46 -9 -6 9 -22 -17 36 25 -4 -1
3846aj4l5P6L8m2l0M5n3l5N5j5J2K6J0K4n7l7L9K1m9KM5J1n4m3P6l5JM6n9k0M0
$$ -1 -15 -50 26 64 22 -8 37 -16 -51 4 -11 1 27 37 61 4 -33 6 27 -22 -20 25 36 -18 -61 15 -20 -19 27 -32 -52 -12
3878a2L4j6K0j4j6l7N1l8lL4j1Rj3J8m8L1j8QK2J6J1j5K9k1J8ppn8L1O7q3L2N
$$ -12 22 6 26 12 -4 -41 10 -28 -31 3 -8 1 -12 6 -42 -11 -29 -21 1 17 28 13 42 21 39 32 25 -33 -2 65 -18 14 19
3911A9m9O1ql1L6p1N5K7j8o9L6L1j7m9J9%pK3j3K2j4j4O4mp0M0J9kj7OM4j1nk7
$$ 19 -30 31 23 -8 28 -43 12 39 21 -48 -12 19 2 -47 -28 -28 -35 -12 -25 -3 -17 -31 33 29 -41 -1 18 16 -1 5 49 38 33 6
3945FJ6J6l1K1l5K5J6k3j9J9J9nr3Q5Mk5k0K9Jj9M8j14J4P5M2r1J2K0JL6k3RJ
$$ 6 22 38 7 28 -7 18 34 11 -8 11 30 25 -68 17 21 -4 -24 5 6 -13 35 -79 -65 10 52 -39 -27 -7 -6 30 7 16 17
3978A7l9N6m5N4k6L2j1p9Q2q7N2j7k4jN0Qm0oRK7onK3m2L6Lq3L7OK5k4M4m8j0
$$ 17 -22 34 -11 43 17 49 38 -41 41 -46 6 -11 -35 -36 14 22 -18 -24 -15 12 6 1 24 -18 18 21 -62 -25 -19 6 -18 26 -22 -32
4012c2Pk4N5n1K4k2P6J8K2p3mj06J20%j9MJ6J6l7M4J9r7l6J22m3JJ1k5Q0p4J6
$$ -32 -25 -49 6 -45 -21 -43 33 51 73 0 -4 -110 10 10 -9 -5 11 27 -10 34 53 -44 -80 42 -1 0 11 -14 66 -8 8
4043HL6p9J9l2L6L7m7J1k9N1Pj8k4K9o0M3J5J8m2L0j8J3J8r5J09l5QJ5l4LJ7q
$$ 8 44 -35 -16 -48 -12 25 -22 -11 -40 11 18 0 -24 5 -55 -12 3 21 -21 9 -9 4 22 -73 36 1 9 24 -10 -7 10 2
4075Bj4k0L6o4N7L7k1m6nN3k0J8mj6j0%k0L4L6k1N4j03MK4l1L5mL4m0L7j3j7K3
$$ 2 -12 -32 4 -60 -3 34 13 -33 -38 15 -5 13 9 -7 -17 -17 -37 -3 33 12 66 -37 -33 -9 -40 -5 -9 25 -15 22 9 -8 15
4108A5%J0k2LL7j3k1J3J0pl2K2n7J7O3l9l9K4Ml9N8J3K2o5K2j6ol0M3J5j2l5M5
$$ 15 15 25 3 6 43 30 9 22 32 25 -7 15 -42 -25 38 -1 -40 -16 -12 -51 7 20 42 -23 -1 -17 -23 -53 -10 5 -7 -42 3
4141Cn0K3L7jn9P0k2Qj5L0p0M7K2ol2K5Lj6JL2L8p5M8o5m4L2K6pJ02o1n1J7N0
$$ 3 -47 -24 13 12 -47 23 1 9 -6 24 -46 1 23 17 -15 10 13 -3 -2 30 68 -7 41 -24 -68 -36 -10 -17 85 24 -27 -10 40
4174D0j08J07m9nJk7J7N6Jo1K7l5O7l5l7M2NOk8j0O1n2L7k9K6pMl1m2Q8l8Qj7
$$ 40 -68 39 -10 -15 -14 -41 -24 32 33 -28 -1 -36 31 -4 -41 1 6 12 -16 -26 35 -17 20 -9 17 10 14 -17 -59 29 -9 -1 -18
4207a8j9J03n0J7n2j1R6l7q1k9O0OJ0Qm9P8m5M4o1KO1m0K4L5m2J6j9L4k9J0J1
$$ -18 -37 66 16 33 -19 -30 66 29 -52 -81 -21 -15 -5 3 -46 32 -13 31 -30 -28 33 -7 17 52 10 26 7 41 12 22 33
4238C3k6J2klq3R3l9K2O9j7l5J1k7Kq%o7M1K7l9R7m2o4J7l5L5J0J5nJ5L8m9K3
$$ 33 7 19 17 14 -69 24 -15 7 76 59 24 35 8 10 2 2 -65 -24 3 -36 61 19 -45 -28 -63 -28 -18 -3 -8 7 45 -4 19
4271A9Kn7L6m5O4o3P9j14O4jK2%k5j7N0J0k6O9m3oNJ9q5R9j9k5kl3o0P6o1Q2j0
$$ 19 21 -36 0 -45 19 -44 35 -79 -15 -16 6 6 -19 -36 14 24 -2 67 24 18 23 42 -43 56 37 12 10 -23 -83 -7 -68 14 4
4304Dl2J9k8P0l7jK9J5n1mk6K7L3j2l0J4JrPL3j7J6nkJ2Lj9j1J8l3K7o7P3mm1
$$ 4 -28 -9 -37 33 -4 -5 24 39 -12 -16 -42 -15 18 6 -24 -10 -9 -18 -11 22 5 21 16 14 26 29 10 -1 17 -16 11 -56 17 13 -28
4339b8K4n3O9j8K5n9mL2K3o4N4j1J2k9J1l7L1Oj0L6jl1%K0k6Q5j08R0K3k4o0K5
$$ -28 -4 -57 12 -6 19 -40 -44 -12 11 -53 1 -10 2 -27 -16 -53 -22 -16 -26 10 9 -22 -22 -2 -28 57 -51 39 62 38 -22 3
4371CmL5j0k9J7l4K2O%l0j6N0Ll2j7LmN%N3m2L6j5jq4M7J7P1k3J8o9M7m2JL3l1
$$ 3 -1 34 24 -5 12 -22 0 6 6 -24 -40 10 13 -19 -36 -33 -37 -32 -32 21 -21 15 0 -1 -85 -38 -21 50 27 45 -24 23 -19 -18 15 -16
4407a6Q1o1n0O2J2n8N4j3J9K1o7j4P0j7J0k4J8q2J3j1R4Jq9J07o5mNk9P1m2j4
$$ -16 65 4 -46 16 28 -30 24 11 30 51 -16 -30 40 23 33 9 27 -55 -42 -53 41 42 -47 60 -5 -9 -4 -33 38 -4 -18
4438a8qP0p5N2Nl5j4kJ2M2J7m5nJOJ9Pl1m9J06n6J6J8K2m8Jk8Rk2J2jj7N5J5l0
$$ -18 -26 44 -31 21 26 -9 -23 -25 -13 29 46 1 -4 -3 3 22 29 -2 -51 55 -1 15 33 55 7 8 -20 -11 -33 -21 -22 -39 16 31 1
4473An0J35p7n6J1M4j7k4j5L8o7M2N5mm2N1l2K2K2o2O4j9k1K3oK2l2k7kP8l9J
$$ 1 -49 86 9 -47 -36 8 -9 -33 -48 -10 -77 -35 20 16 -26 25 -7 15 37 -25 39 20 -1 22 16 38 6 -21 -23 55 16 17
4505A7ll5J5J3q5J18l5K3l5m3L7K7L5o7Lj2mM1m0qO1j0j9k8L9LnM8o8j2lL0K9
$$ 17 14 -21 -6 7 -78 40 5 28 -7 -50 -13 14 49 -18 -15 -27 -31 10 -30 -38 23 13 -6 -34 5 8 3 51 -17 -29 -32 -2 27
4538B7o7R1ll3J0j5l5J0P9No8m0J7L6j7%Ql1j8L6l3N3loj2l0M7K0m8k3j5N8Ql
$$ 27 -40 51 48 15 25 10 -25 -15 64 69 1 -39 -22 14 -3 -3 5 -26 -44 -8 -41 12 9 3 -9 -39 8 28 -20 -43 -58 0 8 5
4572ERk1J6q9J31o3k3L0M5m0N0q5L7%PK8k4k0j3jqj5k4N0O0m5k0J2lL2j1M4j5
$$ 5 14 -7 9 -80 51 -12 -35 -5 40 0 50 -35 2 2 9 37 13 -7 -20 -21 -29 -44 -68 -18 42 -3 -23 -11 -14 18 7 51 36
4605C6j05Q4J4k9L3k3j5J9K2m2RN9m4m5K7mJ6L0nRk6l3K1rM4Pj2p6L6k8N3Ol1
$$ 36 -69 15 29 0 33 10 -5 14 36 -6 3 62 18 -27 0 -4 12 42 37 46 20 -13 8 -1 43 50 38 -38 -2 -30 23 29 -2
4638bk6j9M5J3m5M7l9J8j2J4RK6o4N9k7k1l3k8J28n6O4o3J0J5k9K4L5k2k1K6r7
$$ -2 -28 -47 -2 11 -34 13 -26 -8 -20 -6 3 29 -35 24 -3 -24 -57 -85 43 -13 51 -12 -2 13 -16 8 43 21 0 26 -71
4669g1R3l2J3j7K6j8P0j09kN4PJ6o2mMJ1k1J02o9k9J3N7j6j5L5o1K4L4lk2J1Q
$$ -71 22 -10 3 -14 12 -6 64 -45 -47 7 14 30 -32 -36 -32 -21 -42 60 -9 -38 -25 32 16 1 36 -25 -1 33 30 8 19 27
4701B7l7m8P1k7M7j4M7p5k7M9m7M6lO7n1J9p4L9k8J8K5p8N1k6l9R1j1Pkp2N2k1
$$ 27 -10 -58 13 -14 33 19 66 -9 -36 13 -34 12 9 76 25 44 -30 9 -19 -1 24 -54 -3 -29 -68 23 12 19 17 -55 -3 -24
4733b4K8PlJ4l5k0N1k6K3j1o6L3N1j2j7K0L3l8L4n0l7M5l4N2l1j5PqP2K0r6P0
$$ -24 4 11 8 22 -13 -33 18 -8 15 4 -62 -29 22 10 -7 13 46 8 42 -8 -45 0 -34 18 -13 -28 -21 -29 43 63 -33 37
4765C7n8N0j7j3M0p8l0M8j5N7k7j7k9J01q7L8K0m8K1j9k4P2K8o7O9m6Qp1M7nJ2
$$ 37 -21 29 12 -1 39 -39 -69 -21 -36 21 -6 -23 -52 49 -38 0 20 -28 -7 -26 -50 22 50 -17 52 6 14 -57 -10 -15 -3
4796cJ1j7J4J2j4L4o0M2n1O4l1m9O5k5J2K5r7O5Kl3l3R7p1L1k8N5mk8K9pP0j04
$$ -3 8 -9 5 17 3 37 -23 19 -32 32 1 -48 17 -8 4 29 -68 -3 -1 -34 -67 30 -41 -10 -38 17 13 -15 14 7 77 -27
4828b7NK1L1n0M4jk6K0K6n9L3J7j0l1M2k9q9P7kL7K1o5K3j2k2mK5j0K5j2j4nm6
$$ -27 -22 -1 30 -20 24 23 -3 17 43 -16 17 34 24 -7 35 6 -83 -6 -8 29 50 -15 8 -4 -26 -30 -5 -15 10 -2 -16 -21 -67
4861f7L0O0k9k8K8j7J2MJ4l3j3Q8m7K6m7L0J5K3m6K6n1L6L4n8nM5J6o9J4j7P8
$$ -67 -37 23 -6 -34 -6 -23 -11 -7 7 -26 -39 49 2 28 -19 11 26 49 3 29 -22 14 48 -10 -15 30 46 -23 -9 -26 52
4892E2n8j3rL9Kj3JN8q0K9k2l4QJ6L0N3k6m9L3k6Qj6J5P7n3k2jm2P6o7J7J4K4
$$ 52 -6 -19 -28 11 13 0 1 59 -21 8 -14 -48 -40 -24 6 59 33 -16 17 -9 -1 -17 -2 75 22 0 -1 -43 33 -34 -17 -3 21
4925B1k1qNK1k4L9O1j74R5j3L5J9j5p1k8N0K9n9J7J2M3l7K9r1M4J8MQo1M0PM3
$$ 21 0 -8 -3 18 -6 33 94 -80 15 2 37 56 41 -30 -58 -8 21 -38 -21 -9 34 -3 26 -65 -21 -3 1 9 -52 -12 -5 38
4957C8k1rL3m9L6m7O4l9M0m7J3M7j08P5nq8O0j0J2l7nJ3L7Jj3K2n1P7n5j0o8J08
$$ 38 17 8 41 -8 28 -19 45 6 46 -1 12 59 -49 26 21 -67 -7 -17 -5 -42 -47 -34 3 4 -9 13 -38 39 -16 -26 -94 14
4989A4Mo6QM1K5k7n2K2J2k3O3L4j8o6M5l5K3l0L4n1P3m6L9o8N9j7kK7o3k6J32
$$ 14 18 -48 -40 1 26 -1 -53 -31 -19 -42 21 55 37 -29 16 -19 4 -26 8 -43 30 -16 23 -45 14 -3 -5 22 -41 -67 65
5020F5o4K3j4m7l1kR8qm4j8L7j6K4K8m9%J7k4N1m0K2p%n0Q1l9N9p8N0K7r2Km0
$$ 65 1 24 10 -37 -68 -70 28 20 -24 -42 -5 -21 3 31 -18 -18 -1 -25 26 -14 8 1 1 -49 32 -7 52 -26 24 51 -41 -39 -79
5053g9J01k8K7q9R0l4L9Jj4K0j23J14o6L6j1j7OK9mk1k4j4Q3L3j8k1J3m9J9M8
$$ -79 22 -6 21 -68 22 -12 27 28 14 34 -89 25 -41 -5 -16 -33 -27 2 -2 -23 -47 -61 22 55 37 16 29 -20 -1 47
5083D7j6l1j1ML0o5M0L1l1K2L9l9Mqoj2NJ3j8m1M8m1J15o6pl0K1kj5oMJ7qO1r3
$$ 47 31 0 -11 -7 23 -42 -2 29 -2 20 59 20 24 16 10 -2 3 16 -2 -43 5 -36 79 13 6 -24 -3 -5 -20 -26 -22 -5 -13 48 -45
5118d5M5j9mK9n6M5l2K2J7rJ9l6N6n0mQL1Nk5J1l4M1J6m6%P6q0RRj0l6Q9l8Pj
$$ -45 0 -19 -23 6 -50 -5 -37 -15 2 -7 12 -24 32 -18 -22 -14 17 22 -3 8 -26 15 31 -15 -15 61 -19 -10 -1 -11 -47 42 4 11 10
5153A0Nj9l6N2p0P9k1l1QJ3j3P7o9oK9JkJ8n5n2P5K0RJ2j0Pp3M0RmJ9J4l0k1K3
$$ 10 15 -4 -40 12 -58 21 0 -31 -23 -10 -23 54 -15 -21 8 9 7 25 -30 -82 -7 13 22 34 24 31 -42 -2 7 3 22 36 6 -15 8
5188HK8L0p6l1K9Ml0K5M2q9RM1L3n8ON3p3LQ9m6L8m8j3JPJ1p5J33jo7O4n1j2J5
$$ 8 36 66 -10 -41 -12 -8 -38 -13 29 -60 -51 -10 23 -35 -29 24 -49 -46 43 -3 35 -13 -26 -25 -18 -7 -82 51 50 -17 47 -4 -16 -1
5222aK1J3l3k4K9r9P8N0n6K2n0J3O2q6J07nqj5l2N6j24N7OQJ2qk7j3O4pm5Q7n7
$$ -1 20 33 0 -24 5 -94 -16 34 -22 0 -50 -37 25 -61 46 41 33 18 -14 42 -82 -25 -19 -11 1 -7 -34 -47 17 10 -35 52 -5
5255el7L9RkJ1O7o5k5J1l0K4Q0m1n0j2L3N0l8n2M2J8rm7M4K0j8Pl0Kk3K8J0J3
$$ -5 -42 -3 6 4 15 82 17 -8 3 -27 -3 77 36 -14 -26 7 57 19 -33 9 27 18 -29 15 35 17 24 -6 -4 -27 1 11 24
5288B4m7L2l5nmL2Oj7jj2MnR1q3K9l7M3N4o5qL8j9JJ2o4O7l5L5J3On4K9n1M9k7
$$ 24 -23 9 -26 -31 -35 -3 3 -14 -15 -27 -23 -28 63 -20 9 -28 15 69 4 -4 34 15 16 28 -36 31 -4 31 44 50 -4 25 -26 23 -4
5323dOp1O5K0o3L2J1lj5J2l8N1L0m2k8RkR2m0n7O4j4mj1l1N0k6nl1J6L6k4L9l0
$$ -4 2 -69 -4 16 -47 -15 -4 -7 -22 -10 -48 3 33 -9 -37 -28 -30 62 22 -35 29 15 11 0 -31 19 -7 -12 -43 -27 9 -15 24 -6
5357fmk6j6M4L2j2k8M3K7m2n9L9J2mk9k1O3lM6l3j2m2R7p0L4l0MM3m0l4J3M1q9
$$ -6 -10 -36 -52 -8 24 12 -16 27 54 12 -47 -8 4 0 -29 -50 13 10 56 23 11 -31 66 -4 30 0 4 47 7 -27 -14 27 -62
5390f2Q9Ln0K5K2o1N8k2L1rn9J9j2l0L1RL2l0L9j2j0lj3J3On4M9j9J4L7j3Nl7
$$ -62 27 30 -20 5 27 -34 24 2 33 24 -35 -16 -28 -58 -27 -18 14 -16 23 11 1 -2 -15 -2 4 -50 -1 -20 -6 31 18 23 -14
5423a4j2L5l0R7r2K0j5l5O4m0k3N7P6q3J0K0j03R3N2j15M0rO7q8%K1JJ6l8L4n3
$$ -14 -26 9 -21 76 -16 4 -11 -46 18 -22 -45 12 88 5 15 35 -68 25 77 -38 2 -7 60 -28 -28 -7 -6 10 -28 6 -47
5454d7O9j4k6J6jlN2m9JK4l3K7J9k0n3N4oM2l8K0J4m3L9l4jL8j7j4j5k3M1Nn8
$$ -47 22 8 -18 -2 -3 -6 46 -3 -2 22 -11 16 35 15 -38 16 10 52 14 34 48 5 44 10 9 47 30 16 1 -22 19 24 -34
5487c4P4l4o8M7m3L5j0k9L7K0l0N8n0J2M8p6P2l9j8J2J3k0j0M8kKQj0k4L2M0r6
$$ -34 40 6 -62 -15 -58 -23 -33 -62 -25 -5 -35 23 -27 -15 33 -43 29 -10 -28 -16 -3 -23 -33 15 13 15 23 13 -11 21 61 -35
5519c5M0Rl3Q3j24O9J6k2J9k1P3n3m4o6P4M8n6K8nOM8j10pM2P0l3r0Q9n8j5J21
$$ -35 5 14 -19 64 -60 9 25 3 22 1 74 21 -23 -89 -15 33 -23 5 0 6 54 -56 -63 -21 49 16 -74 15 -43 -58 63
5550F3n8j0j5jKK6j4M1j6K0l5J3k9J5K7l4j9J8MJ2M1j25J7K7kK6lj0n1%M6Mj8
$$ 63 5 -5 -20 -21 -19 7 -7 34 18 38 3 16 -13 2 29 -5 -24 -6 -2 10 51 -74 -57 -30 -32 -6 -9 -19 -70 -70 -24 -20 -38
5583c8K7%LJ8p1P2RJ6k2M7p9J5j0nk3M6N5p5K6k5o3R7m6O1k4M1q2O0n1l3N9J5
$$ -38 -11 -11 -8 10 -61 11 20 36 14 61 -18 -3 -13 -18 -41 5 60 -15 11 -14 -77 20 -26 35 11 52 -30 30 -21 -54 5 20
5615B0o6N0k3MoM4k5J1o1M5K2l6o9O8jN2Lm4R0o9n8Q3Km7L1M7p6J9J6k5j3M8n6
$$ 20 -46 4 -19 -15 -21 23 -2 9 -52 -7 15 -21 -90 -22 -23 29 32 -12 78 9 -49 34 36 -11 20 67 -9 10 26 1 -12 36 -20
5648b0kRM5j6nNk3K6k7N5q1M2%m8K2K4m5L5n4L3K8lo5M1m0M2J7J5oKrK2o1P7j9
$$ -20 -22 -13 32 16 11 16 -7 19 -8 47 -34 8 8 -40 -18 6 -39 -4 -58 -25 3 0 -65 -24 -64 -22 -5 10 4 6 -3 19 -42 35 16
5683A6k2rM6Mn7P5m6oK2j9l3M1m7K5M4m6k2K0j4l8O0n4O3p5P2K5k1oL5o5j2Mj
$$ 16 -6 -15 31 35 -22 53 7 1 23 4 -29 12 -35 -10 34 -12 -34 -14 -28 -66 -6 -60 3 -72 0 25 4 -2 33 -32 -44 -40 -41
5716d1pO0L5j2m9J8Pk7K0nRk7%K7j8N7l8o3O0j1JM4n4Mln1P6j1j6LN6r1L5O8p2
$$ -41 -48 12 47 35 -14 4 11 -16 4 -1 8 -19 -19 8 -10 47 9 -54 6 -5 -4 40 -14 -10 -13 -64 12 1 -15 -12 44 -47 -12 56 -16
5751a6%J9nKL4n4kJ7j4J4l6M9mmL6o2J00l7kn6N3k2P3n1n4J5m3M2j3M3k9QK1J5
$$ -16 -16 3 -2 0 34 -20 -22 -5 -19 -5 -41 8 4 0 36 -26 74 37 35 -21 32 10 83 32 -22 -7 -50 -8 -21 22 -7 1 22 37
5785C7m3j7K2j2J9Q%j2rj6j1nJ1N0k6J9l7J9M7Mm3K%k1M2K8p0L0j2O7l3j5j1j1
$$ 37 -6 -23 -1 -13 6 14 14 2 -7 -23 -34 -39 -28 22 -4 15 -22 -3 44 48 5 7 7 -14 28 56 -14 16 4 71 38 23 12 1
5819AkK6l4M5o2K8j6j1J7o4K5mJ8k4MJ00n1k1MM7q0K4P6o3Q6r8P3j5L1r1M0Lk1
$$ 1 -1 25 -9 36 -26 2 -14 -25 -8 -72 -47 -51 -33 -57 -53 47 -4 -25 -21 26 -54 -30 46 -17 69 -29 44 29 60 -31 9 12 -9
5852ik6K7l3M1rK7M1n8j9pL4NM1m9%j8k8J7K9m0O0j9j0mk3J0jJ3L4n8N6jm4K1
$$ -9 -35 -8 -41 0 -9 18 59 1 -18 -25 9 14 55 6 6 -12 -40 -23 6 -34 26 7 -3 -7 -30 -20 -21 -8 26 -32 24 23 -21 0
5886@n0M3Kn3O8K4q4L1PK3N4p1Po4L0K0oK2QL0j0o6L0J4oQn6K6L2loprk3K5k7
$$ 0 -50 -7 -5 -58 10 34 -50 -19 -12 11 65 -6 1 -63 -33 -13 -19 3 11 41 31 -35 -5 9 3 11 -45 -19 13 10 4 -3 -12 -35 -10 -37
$$ [...]
8191E9
##END NTUPLES=NMR FID
##END=
