##TITLE=1H_ES-C12OMe2
 CD3OD
 8 sc, 
 10.4.2024
##JCAMPDX= 6.0         $$ Bruker NMR JCAMP-DX V2.0
##DATA TYPE= NMR FID
##DATA CLASS= NTUPLES
##ORIGIN= UXNMR, Bruker Analytische Messtechnik GmbH
##OWNER= root
$$ XWIN-NMR		Version 3.5
$$ Wed Apr 10 13:52:13 2024 Russian Standard Time (UT+4h)  she@DPX200
##.OBSERVE FREQUENCY= 200.1309
##.OBSERVE NUCLEUS= ^1H
##.DELAY= (6, 6)
##.ACQUISITION MODE= SIMULTANEOUS
##.ACQUISITION SCHEME= undefined
##.AVERAGES= 8
##.DIGITISER RES= 18
##SPECTROMETER/DATA SYSTEM= spect
##.PULSE SEQUENCE= zg30
##.SOLVENT NAME= CDCl3
##.SHIFT REFERENCE= (INTERNAL, CDCl3, 0, 15.7039)
##AUDIT TRAIL= $$ (NUMBER, WHEN, WHO, WHERE, WHAT)
$$ ##TITLE= Audit trail, XWIN-NMR		Version 3.5
$$ ##JCAMPDX= 5.01
$$ ##ORIGIN= Bruker BioSpin GmbH
$$ ##OWNER= she
$$ F:/spectra/data/she/nmr/H-F/1/audita.txt
$$ ##AUDIT TRAIL=  $$ (NUMBER, WHEN, WHO, WHERE, WHAT)
(   1,<2024-04-10 13:50:39.25 +0400>,<she>,<DPX200>,
      <created by zg, POWCHK disabled, PULCHK disabled
       configuration hash MD5:
       00 E9 B6 7A A2 85 ED C7 34 08 36 98 17 FE 4E 26
       data hash MD5: 16K
       4F 22 92 89 FF E8 EA 9D 89 D1 84 87 CA 13 88 1F>)
$$ ##END=
$$ 
$$ hash MD5
$$ B9 DA 19 39 4C 8D F9 61 0A C9 86 6B 1B F3 EB 73
##$RELAX= 
##$RELAX= 
##$RELAX= 
##$RELAX= 
##$RELAX= 
##$RELAX= 
$$ Bruker specific parameters
$$ --------------------------
##$DU= <F:/spectra>
##$EXPNO= 1
##$NAME= <H-F>
##$PROCNO= 1
##$TYPE= <nmr>
##$USER= <she>
##$AMP= (0..31)
100 100 100 100 100 100 100 100 100 100 100 100 100 100 100 100 100 100 
100 100 100 100 100 100 100 100 100 100 100 100 100 100 
##$AQSEQ= 0
##$AQ_mod= 1
##$AUNM= <au_zg>
##$AUTOPOS= <>
##$BF1= 200.13
##$BF2= 200.13
##$BF3= 200.13
##$BF4= 200.13
##$BF5= 200.13
##$BF6= 200.13
##$BF7= 200.13
##$BF8= 200.13
##$BYTORDA= 1
##$CFDGTYP= 0
##$CFRGTYP= 5
##$CHEMSTR= <none>
##$CNST= (0..31)
1 1 145 1 1 1 1 1 1 1 1 1 1 1 1 1 1 1 1 1 1 1 1 1 1 1 1 1 1 1 1 1 
##$CPDPRG= <>
##$CPDPRG1= <>
##$CPDPRG2= <>
##$CPDPRG3= <>
##$CPDPRG4= <mlev>
##$CPDPRG5= <mlev>
##$CPDPRG6= <mlev>
##$CPDPRG7= <mlev>
##$CPDPRG8= <mlev>
##$CPDPRGB= <>
##$CPDPRGT= <>
##$D= (0..31)
0 1.2 0 0 0 0 0 0 0 0.06 0 0.03 0 0 0 0 0.0002 0 0 0 0 0 0 0 0 0 0 0 0 
0 0 0 
##$DATE= 1712742638
##$DBL= (0..7)
120 120 120 120 120 120 120 120 
##$DBP= (0..7)
150 150 150 150 150 150 150 150 
##$DBP07= 0
##$DBPNAM0= <>
##$DBPNAM1= <>
##$DBPNAM2= <>
##$DBPNAM3= <>
##$DBPNAM4= <>
##$DBPNAM5= <>
##$DBPNAM6= <>
##$DBPNAM7= <>
##$DBPOAL= (0..7)
0.5 0.5 0.5 0.5 0.5 0.5 0.5 0.5 
##$DBPOFFS= (0..7)
0 0 0 0 0 0 0 0 
##$DE= 6
##$DECBNUC= <off>
##$DECIM= 32
##$DECNUC= <off>
##$DECSTAT= 4
##$DIGMOD= 1
##$DIGTYP= 9
##$DL= (0..7)
0 120 120 120 120 120 120 120 
##$DP= (0..7)
150 150 150 150 150 150 150 150 
##$DP07= 0
##$DPNAME0= <>
##$DPNAME1= <>
##$DPNAME2= <>
##$DPNAME3= <>
##$DPNAME4= <>
##$DPNAME5= <>
##$DPNAME6= <>
##$DPNAME7= <>
##$DPOAL= (0..7)
0.5 0.5 0.5 0.5 0.5 0.5 0.5 0.5 
##$DPOFFS= (0..7)
0 0 0 0 0 0 0 0 
##$DQDMODE= 0
##$DR= 18
##$DS= 0
##$DSLIST= <SSSSSSSSSSSSSSS>
$$ [...]
##$SUBNAM2= <"">
##$SUBNAM3= <"">
##$SUBNAM4= <"">
##$SUBNAM5= <"">
##$SUBNAM6= <"">
##$SUBNAM7= <"">
##$SUBNAM8= <"">
##$SUBNAM9= <"">
##$SW= 18.0517689322627
##$SWIBOX= (0..15)
0 0 2 0 0 0 0 0 0 0 0 0 0 0 0 0 
##$SW_h= 3612.71676300578
##$TD= 16384
##$TD0= 1
##$TE= 0
##$TE2= 300
##$TE3= 300
##$TEG= 300
##$TL= (0..7)
0 120 120 120 120 120 120 120 
##$TP= (0..7)
150 150 150 150 150 150 150 150 
##$TP07= 0
##$TPNAME0= <>
##$TPNAME1= <>
##$TPNAME2= <>
##$TPNAME3= <>
##$TPNAME4= <>
##$TPNAME5= <>
##$TPNAME6= <>
##$TPNAME7= <>
##$TPOAL= (0..7)
0.5 0.5 0.5 0.5 0.5 0.5 0.5 0.5 
##$TPOFFS= (0..7)
0 0 0 0 0 0 0 0 
##$TUNHIN= 0
##$TUNHOUT= 0
##$TUNXOUT= 0
##$USERA1= <user>
##$USERA2= <user>
##$USERA3= <user>
##$USERA4= <user>
##$USERA5= <user>
##$V9= 5
##$VALIST= <valist>
##$VCLIST= <CCCCCCCCCCCCCCC>
##$VD= 0
##$VDLIST= <DDDDDDDDDDDDDDD>
##$VPLIST= <PPPPPPPPPPPPPPP>
##$VTLIST= <TTTTTTTTTTTTTTT>
##$WBST= 1024
##$WBSW= 4
##$XGAIN= (0..3)
0 0 0 0 
##$XL= 0
##$YL= 0
##$YMAX_a= 415873
##$YMIN_a= -414906
##$ZGOPTNS= <>
##$ZL1= 120
##$ZL2= 120
##$ZL3= 120
##$ZL4= 120
##$ABSF1= 10
##$ABSF2= 0
##$ABSG= 5
##$ABSL= 3
##$ALPHA= 0
##$AQORDER= 0
##$ASSFAC= 0
##$ASSFACI= 0
##$ASSFACX= 0
##$ASSWID= 0
##$AUNMP= <proc_1d>
##$AZFE= 0.1
##$AZFW= 0.1
##$BCFW= 1
##$BC_mod= 2
##$BYTORDP= 1
##$COROFFS= 0
##$CY= 11.3945322036743
##$DATMOD= 1
##$DC= 2
##$DFILT= <>
##$DTYPP= 0
##$F1P= 15.6554695791079
##$F2P= 12.8336369535428
##$FCOR= 0.5
##$FTSIZE= 0
##$FT_mod= 4
##$GAMMA= 1
##$GB= 0.15
##$INTBC= 1
##$INTSCL= 1
##$ISEN= 128
##$LB= 0.24
##$LEV0= 0
##$LPBIN= 0
##$MAXI= 10000
##$MC2= 0
##$MEAN= 0
##$ME_mod= 0
##$MI= 1.114404
##$NCOEF= 0
##$NC_proc= 0
##$NLEV= 6
##$NOISF1= 3.799351
##$NOISF2= 2.8
##$NSP= 1
##$NTH_PI= 0
##$NZP= 0
##$OFFSET= 15.70392
##$PC= 1
##$PHC0= -25460.42
##$PHC1= 11.58731
##$PH_mod= 1
##$PKNL= yes
##$PPARMOD= 0
##$PSCAL= 0
##$PSIGN= 0
##$REVERSE= no
##$SF= 200.130013532006
##$SI= 16384
##$SIGF1= 3
##$SIGF2= 2
##$SINO= 400
##$SIOLD= 16384
##$SREGLST= <1H.CDCl3>
##$SSB= 0
##$STSI= 0
##$STSR= 0
##$SW_p= 3612.71676300578
##$SYMM= 0
##$S_DEV= 0
##$TDeff= 0
##$TDoff= 0
##$TI= <>
##$TILT= no
##$TM1= 0
##$TM2= 0
##$TOPLEV= 0
##$USERP1= <user>
##$USERP2= <user>
##$USERP3= <user>
##$USERP4= <user>
##$USERP5= <user>
##$WDW= 1
##$XDIM= 8192
##$YMAX_p= 0
##$YMIN_p= 0
$$ End of Bruker specific parameters
$$ ---------------------------------
##NTUPLES= NMR FID
##VAR_NAME=  TIME,          FID/REAL,        FID/IMAG
##SYMBOL=    X,             R,               I
##VAR_TYPE=  INDEPENDENT,   DEPENDENT,       DEPENDENT
##VAR_FORM=  AFFN,          ASDF,            ASDF
##VAR_DIM=   8192,          8192,            8192
##UNITS=     SECONDS,       ARBITRARY UNITS, ARBITRARY UNITS
##FACTOR=    0.0002768,     1,               1
##FIRST=     0,             0,               0
##LAST=      2.2672688,     0,               0
##MIN=       0,             -414906,         0
##MAX=       2.2672688,     415873,          0
$$ Real data points
##PAGE= N=1
##DATA TABLE= (X++(R..R)), XYDATA
0@%%%%%%%%%%%%MmQj6J6j6K2l0L6m4M8n6P2q6R8j14J34j54J74k00K32k64K96l34
$$ 0 0 0 0 0 0 0 0 0 0 0 0 0 4 0 8 -8 8 -8 14 -16 20 -24 24 -32 40 -46 52 -62 72 -82 92 -108 124 -140 156 -178
36a78L80m28M77n32N96o65P38q18R08j005J108j223J349j487J639j803J986k191
$$ -178 202 -226 251 -281 315 -350 388 -430 478 -527 581 -642 707 -780 859 -944 1042 -1149
54a149K417k668K950l270L635m056M551n139N847o726P847r325J1355j4276J8528
$$ -1149 1268 -1400 1550 -1720 1915 -2141 2410 -2729 3118 -3608 4239 -5086 6269 -8007 10521
69A0521k7927M33279o1230n77512P0664L81900j45710m11836J90754M28053r5433
$$ 10521 -17406 415873 354643 -222869 -152205 229695 83985 -327851 -137097 290956 195523
80A95523l26853J24023J80424l00897k69937L64178L94340k40802l64039J83499
$$ 195523 -131330 -7307 173117 -127780 -397717 -33539 360801 119999 -244040 -60541
90f0541K75714k08553k73690J97159K83382q2190j49368P7215j1319k12958N093
$$ -60541 215173 6620 -267070 -69911 213471 131281 -18087 59128 47809 -165149 -160056
101a60056K71625K3480k50643J9829K80031n5386l59895k2089L33267Q7786j85165
$$ -160056 111569 135049 -115594 -95765 184266 128880 -231015 -253104 80163 167949 -17216
112a7216K9260J64892j48739k51595J36865K55881j32414j96490K37493K39127
$$ -17216 12044 176936 28197 -223398 -86533 169348 36934 -159556 77937 317064
122C17064l29358m02612K22073M26348r3192k90836J41887K45102k15792l00212
$$ 317064 -12294 -414906 -192833 233515 140323 -150513 -8626 236476 20684 -279528
132b79528J74820K87499j09466j53947K02300J13948l41914k42172L02579K96578
$$ -279528 -104708 182791 73325 -80622 121678 235626 -106288 -348460 -45881 250697
142B50697k03947k26749K03230J82827k46217k27436J94057K25834r2667q9987
$$ 250697 46750 -179999 23231 206058 -40159 -267595 -73538 152296 59629 -30358
152c0358J32821J2429k27241m9336K27988N9142j97687j0446K26506m941k77748
$$ -30358 102463 114892 -112349 -161685 66303 125445 -72242 -82688 143818 138877 -138871
163a38871o7896K14412P3247j21708K9734J46470p1521j84697M9731J49140p6369
$$ -138871 -206767 7645 80892 -40816 -11082 135388 63867 -120830 -71099 78041 1672
174A672j08383J74014J76877j94849k67628R2429K10984o9726j28176J46335J51643
$$ 1672 -106711 67303 244180 49331 -218297 -125868 85116 15390 -112786 33549 185192
185A85192j66629j95491J01241J36619q8358l3588K05365P1786k60257j66734
$$ 185192 18563 -176928 -75687 60932 -27426 -61014 144351 216137 -44120 -210854
195b10854J82867J43739j42121p1494J93529P7217k26824j42865J47401J07248
$$ -210854 -27987 115752 -26369 -97863 95666 172883 -53941 -196806 -49405 57843
205E7843r1968J798J62705r117k11441l9061J75726K8827j43186K9865J85382
$$ 57843 -34125 -32327 130378 121261 -90180 -129241 46485 75312 -67874 -38009 147373
216A47373k6978k18500l4696J50981R864j09093N6638J43744n7781j55573L3899
$$ 147373 120395 -98105 -132801 18180 28044 -81049 -24411 119333 61552 -94021 -60122
227f0122J12388o4000q8166J31137J48432j10117j70973N0800J01743q2647p5937
$$ -60122 52266 -11734 -99900 31237 179669 69552 -101421 -50621 51122 -31525 -107462
238a07462J36559J18587j18418j32822O1113N7736r1332j0118J78328P6771j60025
$$ -107462 29097 147684 29266 -103556 -42443 15293 -76039 -86157 92171 168942 8917
249H917j07798R2965M3363j05923M098J73603M0927j70693q7327Q7265J7849q8188
$$ 8917 -98881 -5916 37447 -68476 -64378 109225 150152 -20541 -107868 -20603 -2754 -90942
261i0942M6189J61306p614j63974l0506J05367r444q9706O9865J49634m0827j57690
$$ -90942 -44753 116553 108939 -55035 -85541 19826 10382 -79324 -9459 140175 99348 -58342
273e8342l583R2882l9856q4513Q2502J22845o4507j25081L6136P7020o8944o5616
$$ -58342 -61925 30957 -8899 -93412 -10910 111935 47428 -77653 -41517 35503 -33441 -99057
285i9057J12548J12260p8153r9190N5272M7782r7154n0507J25802Q8150r3396
$$ -99057 13491 125751 47598 -51592 3680 51462 -45692 -96199 29603 117753 24357
296B4357p9523N8465J3893j08298j4945J47915P0957r7312n3374O2341j1907j04816
$$ 24357 -55166 3299 17192 -91106 -106051 41864 112821 15509 -37865 24476 12569 -92247
308i2247K2401J54676L7525j11827m0178N3461l9608r8815N1685J49087N193j13331
$$ -92247 -69846 84830 122355 10528 -29650 23811 -15797 -114612 -62927 86160 91353 -21978
320b1978j5951N4965m8291p5133Q1654J34812k5262j04407R887M7393o7471o4906
$$ -21978 -37929 17036 -31255 -106388 -24734 110078 84816 -19591 -9704 37689 -29782 -94688
332i4688R1874J05531n6498r1622L3782L8824q0634m9719J03411Q8004o2107o0106
$$ -94688 -2814 102717 46219 -45403 -11621 27203 -53431 -103150 261 88265 26158 -33948
344c3948N5829K2880r2522l3250J06662O1753p0114l5312O0452j1261j13058j7108
$$ -33948 21881 44761 -47761 -81011 25651 87404 17290 -18022 42430 31169 -81889 -98997
356i8997J16212M8296o8270j2483O2700l0400j08925R137J20993L6382n7675N639
$$ -98997 17215 65511 -2759 -15242 47458 17058 -91867 -82730 38263 74645 16970 22609
368B2609M2866o6949j04519M0200J19229N462o6202J8008L7896q0210r2117O3052
$$ 22609 65475 -1474 -105993 -65793 53436 58898 -7304 10704 48600 -31610 -123727 -60675
380f0675J19732p27n4894K3433J9694q2839n7500Q2994Q6632l8165m6570M4753
$$ -60675 59057 58330 3436 26869 46563 -36276 -93776 -10782 75850 37685 -8885 35868
392C5868Q443j03586n1460R5997P9476m7639m0998M9036R627q2807k6049Q2839
$$ 35868 44311 -59275 -110735 -14738 64738 17099 -23899 25137 34764 -48043 -74092 8747
404H747M2682m4433J415O0322k8340j08247r245R5862K3755o3035O873P1184k3565
$$ 8747 51429 6996 8411 68733 40393 -67854 -77099 18763 42518 -20517 -13644 57540 33975
417C3975j02841j3255P7211K5580k0374L8312M2409o7402r1213L0294P8316j3883
$$ 33975 -68866 -82121 -4910 20670 296 38608 81017 13615 -77598 -47304 31012 17129
429A7129l6462N8170N2131q5427j11029K5544Q8273J0855j6479M0503J3005q1504
$$ 17129 -19333 38837 90968 5541 -105488 -79944 8329 19184 2705 43208 56213 -25291
441b5291n5137N6747N3275k7598J639P5550K278j21310o7611P8111P2969l2193
$$ -25291 -80428 -23681 29594 1996 3635 79185 81463 -39847 -107458 -29347 43622 11429
453A1429k5357M6031O156p4688l2088N1142K5202k0453L2897O2426l8131j02704
$$ 11429 -13928 32103 38259 -36429 -68517 -17375 7827 -12626 20271 82697 44566 -58138
465e8138k601Q5187J1147o2216J0500P4876o692q6226l0033L6942J0284k159N0171
$$ -58138 -60739 24448 35595 -26621 -16121 58755 52063 -34163 -64196 -27254 -16970 -19129 31042
478C1042L7598n6015o3007L0986M2317m1132k8058Q1901P3645o3977j04734l949
$$ 31042 68640 12625 -50382 -19396 22921 -18211 -46269 35632 109277 45300 -59434 -63383
490f3383M7110J550K429N1836J7037o3163m1422L0020O331l9560L2725J09271
$$ -63383 -16273 -14723 -12294 39542 56579 -6584 -48006 -17986 -11655 -51215 -18490 90781
502I0781J7179j16608p4526N3849N1777k7883p993N5106J2894o3868l8234J8328
$$ 90781 107960 -8648 -83174 -29325 22452 -5431 -13424 41682 54576 -9292 -47526 -29198
514b9198j514j2680N6635P2928l7348r8935l148P5237M812n9187J2137P7179R279
$$ -29198 -30712 -43392 13243 86171 48823 -50112 -53260 21977 26789 -32398 -20261 56918 66197
527F6197o8558l6925J1789j846J250M6694L0532m3843l9883L3823K3392n6519
$$ 66197 -2361 -39286 -27497 -29343 -28093 18601 49133 5290 -34593 -770 22622 -33897
539c3897l4019P7142Q3031l0380p6847j4445J6000j2830K244M6748K0468l4226
$$ -33897 -67916 9226 92257 61877 -14970 -29415 -13415 -26245 -24001 22747 43215 8989
551H989j6068J4794l2926o1243L3631J16313L5255q4225n8222L1196J8448l4727
$$ 8989 -7079 7715 -25211 -86454 -52823 63490 98745 14520 -43702 -12506 5942 -28785
563b8785L560O2851K4189m0525k8179n831l5641k3216O5531Q2191k6721q5268
$$ -28785 -25225 37626 61815 21290 -6889 -12720 -48361 -71577 -6046 76145 49424 -35844
575c5844l011N6220j0117n5511K0185P8900J6652n1273k9490O33j5960l848M4596
$$ -35844 -38855 17365 7248 -48263 -28078 50822 67474 16201 -13289 -12656 -28616 -32464 12132
588A2132K9281l7222l0382L3897J7394n9441m1127O0141P5630j0271m7629n778
$$ 12132 41413 4191 -26191 7706 25100 -34341 -75468 -15327 60303 50032 2403 -3375
600c375N983k3111p616L4220K0582j3024N055J6155m2849p3154J1164R1243M0506
$$ -3375 2608 -20503 -28119 6101 26683 13659 18714 34869 -7980 -81134 -69970 21273 61779
613F1779m4420k8407K0852o822m4800N18N5892L1251j0595m129j1236n6322m0139
$$ 61779 17359 -11048 9804 2982 -41818 -41300 14592 45843 35248 31119 19883 -36439 -76578
626g6578N1189P5171r567n4251L542L0780l1210n2641K4469P1008J8642k8277
$$ -76578 -25389 49782 40215 -14036 -10494 20286 -10924 -63565 -39096 31912 50554 22277
638B2277j0647n621l2751j1965M4520L2898k8458k2821L0326R984n7745l9432
$$ 22277 11630 6009 -26742 -38707 5813 38711 10253 -12568 17758 27742 -30003 -69435
650f9435M5583N6440p527k4942R962L994l1219j3577K8691J7989q631J3896K7264
$$ -69435 -23852 32588 25061 119 10081 14075 -17144 -30721 -2030 15959 7328 21224 48488
663D8488k9461o9080j0336N6314K9032k0876j557K5005j5650n1519r738L9552
$$ 48488 19027 -50053 -60389 -4075 24957 4081 2524 27529 11879 -39640 -49378 -9826
675i826K6039N610J9469M835n1450n1709K1908N3188L982k0232J6464J5947m3916
$$ -9826 16213 21823 41292 46127 -5323 -57032 -35124 18064 22046 1814 18278 34225 -9691
688i691n3009J5770N2030J6276n084J1514m286m3994k3849L5243L4142j2030p954
$$ -9691 -62700 -46930 5100 21376 16292 27806 23520 -20474 -44323 -9080 25062 13032 5078
701E078K6885J72n3923l2556L3153L5030r027o760K0982j448l8158j4212K7904
$$ 5078 31963 32135 -21788 -54344 -21191 13839 4812 -1948 19034 17586 -20572 -34784 -6880
714f880J4579j0547J4893L3672j3386n3065j5330L0050J0267j4373J4918L1815
$$ -6880 7699 -2848 12045 45717 32331 -20734 -36064 -6014 4253 -10120 4798 36613
726C6613j5189m9396j3524K3131Q665K264L2298K7024l1156n0387j427K7411L298
$$ 36613 21424 -27972 -41496 -18365 -9700 -7436 24862 51886 20730 -29657 -31084 -3673 -375
739c75J17L1814J8785m1225n1266J542K6854N275P593L1874P853m4301l6537J6371
$$ -375 -258 31556 50341 9116 -42150 -40608 -13754 -8479 -886 30988 38841 -5460 -41997 -25626
753b5626K6455L08Q898L1202l06m7446k9767J9038J7730p723Q008K8623n357m3115
$$ -25626 829 1137 10035 41237 40931 -6515 -36282 -17244 486 -7237 771 29394 24037 -19078
767a9078j7450K2861J0751r641J5206L3125n112l7706j0921J6910k140j2449K1324
$$ -19078 -36528 -13667 -2916 -12557 2649 35774 30662 -7044 -17965 -1055 -3195 -15644 5680
780E680L2481j2531l9491r387J1753q932q127L2017L6679j3308l7138p678P855
$$ 5680 38161 25630 -13861 -23248 -11495 -20427 -28554 3463 40142 26834 -10304 -17982 -10127
793a0127q207L155L9486K8162k5761l9218o246L000j2006Q201M3305K1515l3388
$$ -10127 -18334 -15179 24307 52469 26708 -12510 -18756 -15756 -27762 -19561 23744 45259 11871
806A1871l7595m51P554m362J6947M1641J1147l5421k8175M565J903q416J8113
$$ 11871 -25724 -26175 -18621 -22983 -6036 35605 46752 11331 -16844 -12279 -10376 -18792 -679
819f79L6897r54l9975k1013J0434M38j0277J8676L4881q38l0394r503J0512o309
$$ -679 36218 35264 -4711 -25724 -15290 -14852 -25129 -6453 28428 27590 -2804 -12307 -1795 -8104
833h104j0493K1927L0999o946k7648m489M319j8774j4219K6503L3698o113k3778
$$ -8104 -18597 3330 34329 27383 -265 -4754 -435 -19209 -33428 -6925 26773 20660 -3118
846c118k391N34j9627o297L4296L3766o545k0566n019j0803k5137J397M0501K6879
$$ -3118 -5509 -4975 -24602 -30899 3397 37163 30618 10052 5033 -5770 -30907 -29510 10991 37870
860C7870j6935k2877l896j1840k3058R144M5738K5916j7279k1121m969j1821j4407
$$ 37870 20935 -1942 -5838 -17678 -40736 -31592 14146 40062 22783 1662 -3307 -15128 -29535
873b9535J8218L9526R459k3516j4435j857j7800j8303K1177M0251M796k5813j0684
$$ -29535 -11317 28209 37668 14152 -283 -2140 -19940 -38243 -17066 23185 27981 2168 -8516
886h516M829r995j1667J8897K9667J851j3988o88l060k4257j3406K5031K7204
$$ -8516 -3687 -13682 -25349 -6452 23215 25066 11078 10390 7330 -16927 -30333 -5302 21902
899B1902p847j6589N983K568k5378j8398K1226L1373O546m543M55j3125k7636
$$ 21902 14055 -2534 3449 6017 -19361 -37759 -16533 14840 21386 16843 17298 4173 -23463
912b3463m044K8444J9788n885j112P975j8445m0940q896L6868L2229p73r275m649
$$ -23463 -27507 937 20725 14840 13728 21703 3258 -37682 -46578 -9710 22519 21746 12471 7822
926G822j7136k1395P010K9349J5308o18N025l170l3708l2014J5946M2116J1920
$$ 7822 -9314 -30709 -23699 5650 20958 20340 25365 22195 -11513 -43527 -27581 14535 26455
939B6455j7716p672J838j4826j8534Q892K5097J1669K387M820j0074k9933j1567
$$ 26455 8739 1067 2905 -11921 -30455 -21563 3534 15203 17590 22410 12336 -17597 -29164
952b9164K6317K3647j0015j2580J2828P283k5843k6816Q097K4558J1254L972L745
$$ -29164 -2847 20800 10785 -1795 11033 18316 -7527 -34343 -26246 -1688 9566 13538 17283
965A7283j1000k2023l410J6715N953n141J4492K4862j1234m5479k2976K1445K6468
$$ 17283 6283 -15740 -19150 -2435 3518 -1623 12869 37731 26497 -18982 -41958 -20513 5955
978E955N503Q66K825j2060k1876o312R386Q337J3993K6951Q122l6051m1484M640
$$ 5955 11458 12324 15149 3089 -18787 -25099 -15713 -7376 6617 33568 41690 5639 -35845 -31205
992c1205L4157J3671p725K210O624j5430k6461o408J3247J5232J7078J4806j1221
$$ -31205 2952 16623 8898 11108 17732 2302 -24159 -30567 -17320 -2088 14990 29796 18575
1005A8575l4448j4081K3529K0480r076o811J8976J2006k3677l0355j236J7015
$$ 18575 -15873 -29954 -6425 14055 4979 -1832 17144 29150 5473 -24882 -26118 -9103
1017i103J1592P189M675r531j6680l38J0230n007j0170J8326L4518M52l7322k5198
$$ -9103 2489 9678 14353 4822 -11858 -12196 -1966 -6973 -17143 1183 35701 36153 -1169 -26367
1031b6367R633J5480K681M227R610k004j4551j1733q203o707J2810L6899K1513
$$ -26367 -16734 -1254 1427 5654 15264 13260 -1291 -13024 -21227 -27934 -15124 21775 43288
1044D3288k4747l8415m522J9383O454k482J2856J6674p958k6377j8245l245Q167
$$ 43288 18541 -19874 -24396 -5013 1441 -1041 11815 28489 20531 -5846 -24091 -27336 -19169
1057a9169K2950K5001m182l2133j7409J4247J2046q727L42K5341J6269j9187k8695
$$ -19169 3781 28782 24600 -7533 -24942 -10695 1351 -7376 -7034 18307 34576 15389 -13306
1070a3306o873Q898Q865J0203P548q064j5067j15P023r895j4103J5248L3806O824
$$ -13306 -20179 -11281 -2416 7787 15335 7271 -7796 -7911 -888 -10783 -24886 -9638 24168 30992
1084C0992k5765j8680N400O420k663L624J2388M732n831p955j3640j8340J307
$$ 30992 5227 -13453 -8053 -1633 -4296 -672 11716 16448 10617 2662 -10978 -29318 -28011
1097b8011L1260K6603r917k5467o055O182m804m756J6635K4126L462j6650j8748
$$ -28011 3249 29852 19935 -5532 -11587 -5405 -10209 -14965 1670 25796 29258 12608 -6140
1110f140j4988n350J6597K8275O994k0334j5924L099o65j2357L410K8389K0024
$$ -6140 -21128 -26478 -9881 18394 25388 5054 -10870 -7771 -8436 -20793 -17383 11006 31030
1123C1030j0913k1750r631j102K845J2477J3968k764j3227k840K334j1877j4192
$$ 31030 20117 -1633 -11264 -12366 -9521 2956 16924 14160 933 -1907 427 -11450 -25642
1136b5642J1762K7695P046j6761j0775L487k28n543M786J3027N407j652j020q791
$$ -25642 -13880 13815 20861 4100 -6675 -3188 -3416 -8959 -4173 8854 14261 12609 11589 2798
1150B798k0252q618J8677K1941j152j1857j317k50j3488j0034J3301K3116R487
$$ 2798 -17454 -26072 -7395 14546 13394 1537 220 -30 -13518 -23552 -10251 12865 22352
1163B2352l687q347j5464j6454K958K2597J4812n469p802j652j0740j8763k70
$$ 22352 18665 10318 -5146 -21600 -18642 3955 18767 13298 5496 3844 -6896 -25659 -25929
1176b5929K4356K0746j224j0184p929j0137p371R582J9343O679o610l593k612
$$ -25929 -1573 19173 17949 7765 -164 -10301 -17672 -8090 11253 17932 11322 7729 5117
1189E117j4049j4170Q427K1584O746r012n183p1p290p544P177J4182M569j072
$$ 5117 -8932 -23102 -14675 6909 13655 4643 -540 -611 -7901 -15445 -8268 5914 10483 9411
1203I411K992k530j5925j1259R011J4218J208k889L668j897j6325j2373P621J5065
$$ 9411 12403 9873 -6052 -17311 -8300 5918 7126 4237 7905 6008 -10317 -22690 -15069 -4
1217dP402M591M367q056j9470q225J2341J4305M214K863K186j2356k2427p473
$$ -4 7398 11989 16356 8300 -11170 -19395 -7054 7251 11465 14328 16514 4158 -18269 -25742
1231b5742J4382J5493N282K748q07j3997j7888P58J7794J3253K726J966k243j5570
$$ -25742 -11360 4133 9415 12163 11356 -2641 -20529 -19771 -1977 11276 14002 15968 13725 -1845
1245a845j6391K680J5726Q016n41R70k660j4227j2118O047J4408N245M48N106
$$ -1845 -18236 -15556 170 8186 7645 8615 5955 -8272 -20390 -14343 65 5310 5758 10864
1259A0864M59j2446j0888M454R590K173J619O521j528j5068j1574L343O698J786
$$ 10864 11323 -1123 -12011 -7557 2033 4206 5825 12346 10818 -4250 -15824 -12481 -5783 -3997
1273c997O102J1437m91j6171j1926L630Q182N469R344R549o146j9426j1711L147
$$ -3997 2105 13542 13051 -3120 -15046 -11416 -3234 2235 11579 21128 14982 -4444 -16155 -13008
1287a3008O125N860J1444Q188j0695k1447q426Q321J0270P983J0898N006j2303
$$ -13008 -6883 -1023 10421 18609 7914 -13533 -21959 -13638 -3368 4615 15513 20519 8216
1300H216j8536m945P885P529O705R052K62j6146j6767k13R154M848M498R192K314
$$ 8216 -10320 -15265 -7380 149 6854 15906 16168 22 -16745 -16958 -7804 -2956 1542 10734 13048
1315A3048j2241j2110J474P144L153M758Q820M20j2282j0085L24J221j551N611
$$ 13048 807 -11303 -9829 -2685 468 5226 14046 14466 2184 -7901 -7577 -6356 -7907 -2296
1329b296J2314K103j2066r912K06J341N77R238J4390K322j1921j0939l718j945
$$ -2296 10018 12121 55 -9857 -9651 -8310 -7733 1505 15895 18217 6296 -4643 -8361 -10306
1343a0306K171J2966J3324l363j5908j0701k303p84M610J5962J4264m197j6424
$$ -10306 -8135 4831 18155 14792 -1116 -11817 -14120 -14904 -10294 5668 19932 15735 -689
1356f89j0226o83K602Q004J4587P536r364j5198p089j588m42P397J5268O300j1355
$$ -689 -10915 -11598 -8996 -992 13595 21131 11767 -3431 -10520 -12108 -12550 -5153 10115 16415 5060
1371E060j3957k461L121J667N848J1582M944p361r030l514k843j857P222J1773
$$ 5060 -8897 -11358 -8237 -6570 -722 10860 15804 8443 -587 -4101 -6944 -8801 -1579 10194
1385A0194J085j0026o276M56l247n642N322J5085P684n083p693n183n461j210
$$ 10194 11279 1253 -5023 -4567 -7814 -13456 -8134 6951 14635 9552 1859 -3324 -8785 -9995
1399i995R506J2244J955n994m740o585j1818m604J3713J8951L810j0264r805n398
$$ -9995 -489 11755 13710 7716 2976 -3609 -15427 -20031 -6318 12633 16443 6179 -3626 -9024
1413i024m048K412J2532J2619K112n810p808j1215r773N150J8677J1562o945j2266
$$ -9024 -13072 -10660 1872 14491 16603 10793 2985 -8230 -18003 -12853 5824 17386 10441 -1825
1427a825m766k116m025K216J2253J0879K40o310p429p941k574R286J2710J001
$$ -1825 -6591 -8707 -12732 -10516 1737 12616 12856 6546 -883 -8824 -11398 -2112 10598 11599
1441A1599q041l045J573n935j0411Q56J3323R856j260n355m742n239k057N503
$$ 11599 3558 513 2086 -3849 -14260 -13404 -81 9775 8515 3160 -1582 -6821 -8878 -3375
1455c375P169K511K010M271l710j6207j2264P331J6921O951m279m758m165p382
$$ -3375 3794 6305 8315 12586 8876 -7331 -19595 -12264 4657 11608 7329 2571 -1594 -8976
1469h976n256M142J0479R540O131j502j3602j6703j162J6051J3301j129n845j953
$$ -8976 -14232 -10090 389 9929 16060 14558 956 -15747 -16909 -858 12443 11314 5469 3516
1483C516m811j0696n329Q229J3590Q028n34q228j2425n737Q248J2620K651m212
$$ 3516 -1295 -11991 -17320 -9091 4499 12527 11993 3765 -8660 -14397 -6149 6471 9122 4910
1497D910J119K847p407j3477k519J1165J0232Q27m003m743m900j745L199K750
$$ 4910 6029 8876 1469 -12008 -14527 -3362 6870 7697 3694 -1049 -5949 -7694 -4495 -1745
1511a745K50M776R951J322j4144j3701K467J1774N243j412J65K38n885q827l963
$$ -1745 -1495 3281 13232 14554 410 -13291 -10824 950 6193 4781 4946 5184 -701 -9528 -13491
1526a3491K995Q840J2246O696q759j7133o385R008R774J894J353M568k057j3047
$$ -13491 -10496 -1656 10590 17286 8527 -8606 -14991 -5983 3791 5685 7038 11606 9549 -3498
1540c498j2161L61J0511J1623O426l919j2793r916K743Q914L509O23O209N534
$$ -3498 -15659 -15298 -4787 6836 13262 9343 -3450 -13366 -10623 -1709 1800 2423 8632 14166
1554A4166p182j4819n605P840R750L598j213m270n970l052J360N40j258M658J0859
$$ 14166 6984 -7835 -13440 -5600 4150 7748 6535 2265 -3705 -6757 -5397 -4857 -6115 -1457 9402
1569I402L830j0253j1335Q89P509K733o93K885L178k950p437o559l144L110J0882
$$ 9402 13232 2979 -8356 -7467 42 2775 2082 4967 8145 5195 -2242 -8801 -11945 -8835 2047
1584B047J0354k234j2294p264K651L470M81M964R990L221r675j3114n623L278
$$ 2047 12401 10167 -2127 -9391 -6740 -3270 -2789 2175 12165 15386 5711 -7403 -13026 -9748
1598i748Q952J0068L013p902j0730l375J951Q20K837J0035R157m184j3490p934
$$ -9748 -796 9272 12285 4383 -6347 -9722 -7771 -6951 -4114 5921 15078 10894 -2596 -10530
1612a0530K758O895N849L868p81o068n681j752j127j558M292R962M170p395q933
$$ -10530 -7772 -877 4972 8840 8059 1991 -3690 -5442 -6569 -8127 -3835 6127 10297 2902 -6031
1627f031k83M204J408R59M402L724j609m666m694m696j509O192R204J510o649
$$ -6031 -6314 -2110 -702 257 4659 8383 6774 2108 -2586 -7282 -8791 -2599 6605 8115 1466
1642A466n249n31j751k608M409J0981O440l770q360o651l397K373R049Q177o82
$$ 1466 -3783 -4314 -6065 -8673 -4264 6717 13157 9387 1027 -5624 -9021 -6648 2401 10578 9896
1657I896p107n799m021m421P61J0270J1334O10q713p832k887P25M817Q576N347
$$ 9896 2789 -3010 -7031 -11452 -10691 -421 10913 11523 2810 -5022 -7909 -7184 -2367 6209 11556
1672A1556k791o659m762l709k742L489R425N222m514p270k707q3k49K883O702
$$ 11556 8765 2106 -2656 -6365 -9107 -5618 3807 9029 4515 -2755 -5462 -5545 -5794 -2911 3791
1687C791M207j663l299k595l583k965K873P006K790k899l031j789m144m434K377
$$ 3791 7998 6335 3036 441 -3142 -6107 -3234 3772 6562 3663 632 -1157 -5301 -9735 -7358
1702g358Q202N746K97k257l810o142l280M793Q881M540j369l414n598q042l550
$$ -7358 844 6590 6887 4630 820 -5322 -8602 -3809 5072 9612 8243 4829 -769 -8811 -12361
1717a2361O157J0141M422k059m372o041o145J8Q890R653K583l184m617o019n729
$$ -12361 -6204 3937 8359 6300 1928 -4113 -10258 -10240 -1350 8303 10886 7702 3085 -2934 -8663
1732h663Q13Q126P181K5m141m368n205l946K452Q222N658l51k251j793l696l779
$$ -8663 -7850 276 7457 7482 3341 -1027 -6232 -10178 -7726 496 6154 5803 3552 1759 -1937 -5716
1748e716J498O231M102m52j509k046n017m900P11N125L612J304J385o88n728n950
$$ -5716 -4218 2013 6115 5663 4154 2108 -2909 -7809 -7098 -1973 1639 2943 4328 3640 -2088 -8038
1764h038J034O507N426K586R39k825p819o573R10N997N236L124O81n031r457n334
$$ -8038 -7004 -497 4929 7515 8454 5629 -2190 -8763 -7853 -1856 3380 6504 7185 2154 -7303 -12637
1780a2637M327Q615N875K313l96n313q514l664M810P524M632J030k518p412q187
$$ -12637 -8310 305 6180 8493 8097 2784 -5730 -9394 -4584 2940 7572 8602 6084 -1328 -9515
1795i515j167O166O345K478P17q70n069o050k15N781N402K005N70j200n028n421
$$ -9515 -10682 -4516 1829 4307 5024 4154 -915 -6965 -7180 -1399 4003 6008 6578 5378 350 -5071
1811e071n51K943K290J665K655M65m883n916p09L443L135L222M185J156m960o729
$$ -5071 -5622 -2679 -389 1276 3931 4396 -487 -6403 -7112 -3669 -534 2688 6873 8029 3069 -3660
1827c660k317J796L357M812M402j292p868p344j174K981M316N815N239j508q370
$$ -3660 -5977 -4181 -824 3988 8390 7098 -770 -8114 -9288 -6307 -1991 3824 9063 7555 -815
1842h15p160O7M832N835N407K372m447q851n580O69L655M602N198J952n184q406
$$ -815 -7975 -7908 -3076 2759 8166 10538 6091 -2760 -8340 -7671 -4016 586 5784 7736 2552 -5854
1858e854l276L420M824L648L543J364l629n987k860J065K178L156L578M49m710
$$ -5854 -9130 -5710 -886 2762 6305 7669 4040 -1947 -4807 -3742 -1564 1592 5170 5619 909
1873I09n255j001J069K78J852N359L687k287n433l126j01J476L713M865J610l482
$$ 909 -4346 -5347 -4278 -4000 -2148 3211 6898 4611 -822 -3948 -4049 -2573 1140 6005 7615 4133
1889D133m826l591k790m60N370Q240K593n565p181k955O42K748N749O154J344
$$ 4133 -693 -4284 -7074 -7534 -2164 6076 8669 3104 -4077 -7032 -6390 -3642 2107 8261 9605
1904I605m644o464m706j521L406Q018N783k782q074n180m20J235K520N314N240
$$ 9605 4961 -1503 -6209 -7730 -4324 3694 9477 6695 -1379 -6559 -6979 -5744 -3224 2090 7330
1919G330j91n416n279j947J518M562N417J147m067m290j236p87k081M95N400M843
$$ 7330 7139 1723 -3556 -5503 -3985 577 5994 7141 3074 -1216 -2452 -3239 -5320 -4825 575 5418
1935E418j073m651l036n56P61K302L467K180O3p78k329n445m209K665P825M291
$$ 5418 4345 -306 -3342 -3898 -3137 -835 2632 4812 4875 4097 1768 -3677 -7886 -5221 2604 6895
1951F895k540m724k789k018j435K098N954N537J204l344o419n890m8P297P595
$$ 6895 4355 -369 -3158 -5176 -6611 -4513 1441 6978 8182 4838 -1581 -7471 -7519 -222 7373
1966G373P47m577m127k644l329j435M330P630L884k725o001n020j075M131O503
$$ 7373 8120 3543 -584 -3228 -6557 -7992 -3662 3968 7852 5127 -874 -5894 -6969 -2838 3665
1981C665L045j790k512j002k529m313o34N430N708r3m388l610j131L50J563K275
$$ 3665 6710 4920 2408 1406 -1123 -5436 -6070 -640 5068 4975 587 -3023 -4154 -3804 -2241 34
1997C4J610J459J866m37m884n396Q69N947L733j191k001q04k164l827j735K763
$$ 34 1644 3103 4969 4532 -352 -5748 -4879 1068 4801 3610 1609 805 -1359 -5186 -6921 -4158
2013d158N451M582R93m294p026l127L942O375K652l66l11j816n759n395R04O649
$$ -4158 1293 5875 6868 2574 -4452 -7579 -3637 2738 5390 5024 4713 2897 -2862 -8257 -7353 -704
2029g04O246J171l730o149m213R70N139M222J257N71J98l349o180k277M643O378
$$ -704 5542 6713 2983 -3166 -7379 -6409 -1270 2952 4209 4780 4978 1629 -4551 -6828 -2185 4193
2045D193J705k783l608k699j203N73J717J615J836K604M10m027m710K10M602K844
$$ 4193 5898 3115 -493 -3192 -4395 -3822 -2105 -490 1346 3950 4360 333 -4377 -4167 435 3279
2061C279m11n12N43j260l748l022j8K941M302L056j286n322m041Q90L284K127
$$ 3279 2868 2356 2899 1639 -2109 -5131 -5149 -2208 2094 5150 3864 -1458 -5499 -4609 -1325 802
2077H02J995L069P09m644o668k313L377N441L774M8l983n631k657J451K966K851
$$ 802 2797 5866 6575 1931 -4737 -7050 -3673 1768 5542 5590 1607 -4024 -6681 -5230 -2264 587
2093E87L545K575k372o636m314K256N485L679N39j593l329l684j465R19J810K369
$$ 587 4132 6707 4335 -2301 -6615 -4359 1126 4805 5344 3751 422 -3262 -4727 -3808 -1998 371
2109C71K950P81l547m629n93L285K751P37P91R72j026l050k457o88R33K547L057
$$ 371 3321 4102 555 -4074 -4667 -1382 1369 2106 2897 3869 2843 -207 -2664 -3352 -2419 128 3185
2126C185M46l226l493p96O70N80K063M152K622k118m893l229l1K490L972L260
$$ 3185 3631 405 -3088 -3884 -3214 -2634 -571 3581 6203 4085 -808 -4037 -4068 -1578 2394 5654
2142E654m35m208m372j998K6J834M493M688O9n011n160j012K275L697L822K203
$$ 5654 5219 1011 -3361 -5359 -5333 -3499 994 5682 5751 740 -4420 -5432 -3157 540 4362 6565
2158F565j703m676l677r53Q57K617L833J940k454m816k412Q49J983K228K735J557
$$ 6565 4862 186 -3491 -4444 -3587 -970 2863 4803 2349 -2467 -4879 -4030 -2047 181 2916 4473
2174D473j227k940j934m17L36J506K729J313j843k987j621p25m05J287L401K749
$$ 4473 3246 306 -1628 -2045 -1709 -203 2526 3839 1996 -991 -2612 -3337 -3742 -2455 946 3695
2190C695l36k480k233j574l80K409M246K356j298l352l225k399o48K887M906K479
$$ 3695 3359 879 -1354 -2928 -3308 -899 3347 5703 4405 1053 -2172 -4571 -5219 -2332 2574 5053
2206E053j859l855l258j605J028M582N129J451k798l948k961j352J247M136L946
$$ 5053 3194 -661 -3919 -5524 -4496 86 5215 6666 3868 -80 -3041 -4393 -3146 990 4936
2221D936Ql541l942k307m14K153M173L136m53k773k123j034m35J378L268K407
$$ 4936 4944 1403 -2539 -4846 -5260 -3107 1066 4202 3749 976 -1147 -2181 -2616 -1238 2030 4437
2237D437o71k483k258j504j012O44K584K140J49r63j081j864j889P11L618L249
$$ 4437 3766 1283 -975 -2479 -3491 -2847 -263 1877 2026 1063 -18 -1882 -3771 -3060 558 3807
2253C807O40j080j962k974k429L63L355L241R41j156l112m081k048K267N091L614
$$ 3807 4447 3367 1405 -1569 -3998 -3635 -280 2961 3902 2746 -366 -4447 -6495 -4228 863 4477
2269D477M04j768l010l481j454K618M809K915n91k944m038l359k13L624M111J589
$$ 4477 4881 3113 103 -3378 -4832 -2214 2595 5510 4919 1975 -2063 -5422 -5635 -2011 2100 3689
2285C689j090j959k549k193K35L603L833J087j297k082k316j847N4K158J966N54
$$ 3689 2599 640 -1909 -4102 -3867 -264 3569 4656 3359 1277 -1039 -2886 -2832 -674 1292 1846
2301A846k38q60k052k447r1K400K570J184O68j15j913k910j237J573K514K036
$$ 1846 1608 748 -1304 -3751 -3842 -1442 1128 2312 2980 2865 952 -1958 -3195 -1622 892 2928
2317B928R90j106l712l691o42K347L114K469J400j082l947l682J0L584M009K204
$$ 2928 3918 2812 -900 -4591 -5233 -2886 228 2697 4097 3015 -932 -4614 -4604 -1020 2989 5193
2333E193p4k763m421k916O98L118L105J735k88k992m262j818K275L939K672P64
$$ 5193 5119 2356 -2065 -4981 -4283 -1165 1940 3675 3387 395 -3867 -5685 -3410 529 3201 3965
2349C965o47k175k948j288J298K395J742O66p64k547k766o56J414J556R94J283
$$ 3965 3318 1143 -1805 -3093 -1795 600 2342 3008 2244 -303 -3069 -3725 -2311 -755 239 1522
2365A522J082r47k563j585O00J653J845J607L99j777k807k031m18P60K323L206
$$ 1522 2604 1657 -906 -2491 -1891 -238 1607 3214 3613 1836 -971 -3002 -3420 -2660 -337 2869
2381B869J084k573m076j829J153K493K955K475K64k705l834k258M20K653L631
$$ 2869 3953 1380 -2696 -4525 -3372 -879 2076 4551 4815 2110 -1724 -3982 -3562 -909 2722
2396B722K149j463m506l571r9J947K405K585J736o27l239l018m04K088K865K253
$$ 2722 4871 3408 -1098 -4669 -4768 -2821 -416 2169 3905 3278 39 -2979 -3383 -1295 1570 3823
2412C823J80k344l007j279L52N48P22J747J673p10k587j724L37J419J342J309
$$ 3823 4003 1659 -1348 -2627 -2275 -1727 -1005 742 2415 1705 -882 -2606 -2269 -850 492 1801
2428A801R32k75j142j407j682j122J107L144K030j116k976j916n29K13J353K773
$$ 1801 2733 2458 1316 -91 -1773 -2895 -1788 1356 3386 2270 -706 -2622 -3151 -2938 -1585 1188
2444A188K645J00k321l342j995O07L537L709O29k611l322j853p46M02K341L617
$$ 1188 3833 3933 1612 -1730 -3725 -3118 419 4128 4757 2146 -1176 -3029 -3775 -3373 -1032 2585
2460B585J663j990l755k485L42K706L437J795r88k330j773q73p57M81K363K453
$$ 2585 4248 2258 -1497 -3982 -3640 -934 2503 4298 3310 980 -793 -1666 -2423 -1942 421 2874
2476B874l19k816k376l16J042J269J314Q13L20j61o84j519j526M75K453J914m62
$$ 2874 2555 -261 -2637 -2953 -1911 -642 672 1485 1805 1644 960 -559 -2085 -1610 843 2757 2295
2493B295j806j155p52j142n30J563K714J845l69k247k867j123J869L379J979l18
$$ 2295 489 -666 -1418 -2560 -3090 -1527 1187 3032 2663 416 -2451 -3574 -1705 1674 3653 3335
2509C335j344j637k403j942O99L494L247P6k686l389j708P82K835K985J040o58
$$ 3335 1991 354 -2049 -3991 -3292 202 3449 3525 839 -2550 -4258 -3476 -641 2344 3384 2726
2525B726j260j861k142m71K549L376Q22k097k783j519j10P45J504J326O61l2n38
$$ 2726 1466 -395 -2537 -3008 -459 2917 3739 1642 -1141 -2660 -2770 -2025 -521 805 1466 1434 896
2542H96j556j442L83K263J926k02j097n67n75j297j120L69J654J650P04r23k196
$$ 896 -660 -2102 -1719 544 2470 2268 1171 604 29 -1268 -2388 -2019 -365 1285 1989 1066 -1130
2559a130j746L68J942J797J032O08k50k112k962j011K013L074J709o45k415k884
$$ -1130 -2876 -2508 -566 1231 2263 2871 2621 509 -2453 -3464 -1451 1623 3332 2687 272 -2612
2575b612j414R02K347K271J231J77j615l037j860J417L367K430j15j742k280j890
$$ -2612 -4026 -3124 -777 1494 2725 2902 1287 -1750 -3610 -2193 1174 3604 3489 1747 -533 -2423
2591b423n65J049J881J424N00n64j900k031j49K062K228P85l70m66p89j255r26
$$ -2423 -2988 -1939 -58 1366 1866 1302 -598 -2629 -2778 -716 1512 2297 1927 1461 672 -583 -1509
2608a509K29J024J075O80k96j464j753m93P89J060J117J320Q42r66k368j593M07
$$ -1509 -1280 -256 819 1499 1203 -261 -2014 -2507 -1718 -658 459 1779 2621 1655 -713 -2306 -1899
2625a899J769K010J154m87k270k540j141O14J767K166J721l14k605k777n84J885
$$ -1899 -130 1880 3034 2547 277 -2263 -3404 -2790 -1023 1143 2864 2550 -55 -2832 -3416 -1531
2641a531K729J983N04j330k712k245k30J443J933J643K94j683k683j530P17K043
$$ -1531 1198 3181 3685 2355 -357 -2602 -2832 -1389 544 2187 2481 798 -1885 -3415 -2698 -655
2657f55J787J026R7j056j677r93K86J016J052R10J14j228j759r56J34N36Q16J219
$$ -655 1132 2158 2255 1199 -478 -1471 -1185 -169 883 1793 1907 679 -1080 -2036 -1902 -1366 -550 669
2675F69R37k16j330j262l50M23J294J899J006q29k133j852p48K88J537K237J082
$$ 669 1606 1390 60 -1202 -1552 -1129 165 2064 3070 2241 108 -1744 -2492 -2204 -667 1570 2652
2692B652j101k530j920l56J372K554K477N64j796k692j581p5J513K174J809k04
$$ 2652 1551 -979 -2899 -3255 -1883 671 3148 3712 1916 -776 -2357 -2432 -919 1255 3064 2860
2708B860k343k766j198N73J873K217J248m67j873j583l59P17J252J600R08n84
$$ 2860 517 -2249 -3447 -2874 -1001 1216 2464 1997 124 -1459 -1818 -1101 151 1751 2659 2075
2724B075j858j555l77K46P12J029P73j28q50q56o01k95O72J628J583K23r36j403
$$ 2075 217 -1338 -1715 -1469 -757 272 1045 917 67 -789 -1390 -1685 -1013 615 2198 2421 1485 82
2742H2j150p40L30J589J710M12j216k023j765n78J340K727K000L4j504j959j476
$$ 82 -1068 -1808 -1478 111 1821 2233 1017 -1006 -2771 -3349 -2009 718 2718 2752 1248 -711 -2187
2759b187j53J586K714J563o15k425k400j336M84K083K276P76j010j800j449n82
$$ -2187 -2340 -754 1960 3523 2908 483 -1917 -3253 -2769 -686 1590 2366 1356 -444 -1893 -2475
2775b475O82K179K057N42j372j677j199k25M69J180R83R7o27j006r62p29L41J303
$$ -2475 -1793 386 2443 2985 1613 -64 -1263 -1488 -1019 161 1144 1241 614 -392 -1354 -2083 -1742 -439
2793d39J449M90j99m44p20j127l19P94J456J014p0j000j786j571k36J396J899
$$ -439 1010 1500 1301 857 137 -990 -1309 -515 941 1955 1885 885 -901 -2472 -2708 -1312 587
2810E87J152J27q76j859j591M2K154K421J105o55j843k253j247N69K025J775N74
$$ 587 1739 1866 990 -869 -2460 -2418 -264 2157 3262 2607 764 -1489 -2736 -2167 -142 1633 2207
2827B207q53j853k038p43J530K498J633k6j095j458j157k94J005J554J035k62
$$ 2207 1354 -499 -2537 -3280 -1750 748 2381 2355 1260 -198 -1355 -1649 -644 910 1945 1683
2843A683r83j439j242m7R75J172O17L7k5m57r75n48L91J272R36L66k10r04j309
$$ 1683 700 -739 -1981 -2028 -1053 119 736 773 748 291 -684 -1232 -841 431 1367 1733 1523 619 -690
2862f90q90k4O94J102J135K30j209j950j024Q91J697J610R08k63j443j977r29
$$ -690 -1580 -1604 -910 192 1327 1557 348 -1602 -2626 -1735 -38 1572 2480 2217 774 -1203 -2132
2879b132N45J757J709O68j087k385j908k9J511J847J180L16p94j700j417M0J624
$$ -2132 -1587 170 1879 2547 1460 -925 -2833 -2862 -1351 496 1676 1992 1198 -502 -1919 -1879 -255
2896b55J810Q72l31j583j667o80M70R21O75M22K65n83j258p41M04J230R05K93
$$ -255 1555 2427 2096 513 -1154 -1834 -1364 -443 232 654 919 336 -922 -1663 -1259 -29 876 1169
2914A169J15l63o76o27l86r5N01J121P06n65j461j149j01N50Q48J221J025r0j269
$$ 1169 1284 921 245 -382 -768 -863 -362 759 1465 900 -561 -1710 -1811 -1261 -413 808 1833 1743 474
2933D74j566p06O96J700J703K44j442k064j142K0P13J389J516M54j209k104j171
$$ 474 -1092 -1798 -1102 598 2301 2545 1103 -961 -2103 -2083 -1370 19 1535 1989 780 -1324 -2495
2950b495O58J750J875P18p40j468j353l10L36P25J150O87m48j609j352m6J047
$$ -2495 -1837 -87 1788 2506 1766 298 -1055 -1365 -1029 -304 846 1533 1085 -524 -1876 -1922 -875
2967h75J096O10J76k12m10n50k32j28L71Q84O89m09j056p26k31p4j3O46J071O84
$$ -875 221 831 1007 795 385 -165 -397 -525 -154 730 1419 1010 -46 -772 -1003 -1077 -1090 -444 627 1311
2987A311l69j203j065j41Q98J587J082k32j017j198r78n28N90J665J396k7j765
$$ 1311 942 -261 -1326 -1467 -569 1018 2100 1868 851 -347 -1325 -1853 -1263 402 1798 1771 6
3004Fj855o26P36J726J599N42o63j167j174n95L73J381J589K71j355j810r42K85
$$ 6 -1849 -2475 -1739 -13 1586 2128 1465 298 -876 -1471 -1098 283 1872 2143 788 -1022 -1964 -1679
3022a679Q48J064O21J31n92o64n63j39N98J115Q29k37q98o73k22j76j93K52O70
$$ -1679 -831 233 854 985 393 -271 -834 -973 -375 740 1569 1332 434 -239 -461 -637 -830 -578 92
3041I2N70o0o22q28n46K87R91J042M89q1m74r69j050k60J023J462P77n61j551
$$ 92 662 602 -20 -848 -1394 -1107 -116 926 1415 1334 860 -109 -1159 -1419 -396 1066 1843 1282 -269
3060b69j381n86O66J384J387N12m26j244j309n31R15J893J291j58j439j523q36
$$ -269 -1650 -2236 -1570 -186 1201 1713 1287 43 -1266 -1797 -882 1011 2302 2144 705 -818 -1654
3077a654NQ82J185P68j84r14j076o77L06J252J377L21n11p50n03l57p6L14O22
$$ -1654 -1649 -767 418 1186 1002 88 -988 -1665 -1359 -107 1270 1591 1080 330 -173 -530 -606 -292 330
3096C30L77r6m56o87o29j40N55Q36N30K44O6m20q98o34K87J065R29L17n10j163
$$ 330 707 611 155 -532 -1161 -1301 -746 90 620 864 930 510 -388 -1022 -735 330 1259 1576 1066 -97
3116i7j192n26N01J126J062N30m60j361j258k13J245J652J037p8j042j496j023
$$ -97 -1289 -1815 -1314 -188 874 1404 944 -417 -1675 -1888 -643 1009 2046 1968 926 -570 -1593
3133a593P2J094J315N63l04j162j407p13O63J429J177L50m10q60q40l23M47R15
$$ -1593 -1521 -427 888 1451 1147 -15 -1422 -2135 -1472 -43 1134 1484 1074 214 -626 -949 -502 413
3151D13O70Q5m26p12q95l78K52O82M25K79K07k73n98n04J08L95O87P93J64m38
$$ 413 1083 1168 742 30 -865 -1243 -991 -309 116 395 602 329 -269 -773 -665 -270 417 1210 1374 936
3171I36r92r81k26M52P65R07L33o34j253j083J6J080J363J105R2j053j479q12
$$ 936 -56 -1037 -1263 -811 -46 861 1194 560 -693 -1776 -1760 -680 683 1788 1880 827 -652 -1464
3189a464K72J100J119P30l08j467j504n10N93J301J168L32m67j145q80n2P77J023
$$ -1464 -1192 -92 1027 1757 1449 -18 -1522 -2032 -1439 -138 1030 1362 895 -250 -1130 -1182 -405 618
3207F18P22K21n88j135q85k6N65N10M03R1k25n38m73o2J65M85O33O11j0n75o72
$$ 618 1340 1561 973 -162 -1047 -1073 -508 2 405 496 271 -267 -740 -802 -637 -152 481 1092 1082 507 -165
3228a65l53j14K10O39P73L6o85j167p27PP89J232R14%r47j067n58J47R72J257
$$ -165 -518 -632 -422 217 990 1026 341 -826 -1553 -1546 -757 475 1389 1389 442 -625 -1183 -1036 -64 1193
3248A193P55n11j467j298m80O11J116J111K56p23j157p84qP43J225R10J26r33
$$ 1193 1948 1437 -30 -1328 -1808 -1197 -81 1030 1286 563 -594 -1378 -1386 -643 582 1492 1618 685
3266F85j114m66J44N48O50L60j22n82p10l63o8M39P05O17P4l75l68j96k01L7L67
$$ 685 -429 -895 -751 -203 447 807 685 103 -607 -970 -1038 -599 106 723 797 422 54 -142 -343 -306 61
3287F1N29M25k08o45p95n60L6N88R37M97r3o32p82o05J72J133J239M68n21j174
$$ 61 590 1015 807 162 -633 -1193 -1157 -569 368 865 772 140 -642 -1247 -1075 58 1297 1765 1244 70
3307G0j009l93L91J098Q20K20o84j150q77j24Q97J365R04k84q22q98l48J58O36
$$ 70 -939 -1332 -941 157 977 1197 513 -637 -1514 -1638 -741 624 1528 1244 422 -476 -824 -666 -30
3326c0R21L12l69q22q09l61K25O21O97J02k46l05k23j32k3L49N18M10p1k49m51
$$ -30 891 1203 834 12 -797 -1158 -933 -312 385 487 241 -64 -287 -419 -442 -93 425 835 764 515 64
3347F4m70k60O1L68M91L29j50n01p49m32M33R22R12K08k55p63q29l78M42R41P38
$$ 64 -406 -666 -605 -237 254 583 433 -68 -817 -1249 -816 106 1018 1226 971 208 -621 -999 -557 384 1122
3368A122P0o57j223q81N8R33J142M76j49o37q21n73L34R28R68L92n21j009p92
$$ 1122 1192 535 -688 -1569 -1511 -578 564 1040 891 254 -567 -1140 -806 122 1090 1482 961 -48 -840
3387h40k68M91O84M28ml17m26m92j45M02P50N08k4k30l15k50j80L0R9K39K33J33
$$ -840 -1108 -617 67 495 491 174 -252 -744 -889 -487 263 771 747 517 202 -48 -228 -198 -99 140 373 506
3409E06l27o71m29QM71M03M92K93j34n73o64k01N72Q00O54n4p77j051n77K48N38
$$ 506 179 -492 -921 -913 -442 -39 453 746 612 39 -625 -826 -254 546 1200 1146 369 -682 -1259 -1011 -473
3430d73P69N17K4p41j020m56N68J063R26K50m80r91p45o3N15O16M40M4m64q88
$$ -473 296 813 837 96 -924 -1380 -812 251 1177 1427 947 -44 -789 -852 -337 279 719 763 299 -589
3450e89o73J42P79P60L36k11l66l08k04J25K37K76K59R8l37n62k94l5J10J90J63
$$ -589 -1262 -1120 -341 419 755 544 178 -130 -334 -209 28 304 563 661 324 -238 -532 -567 -457 -267 -104
3471a04L32J32j72m32l82J13N17O28M14j77o24o04l48p2M93O78N41k09r34r12
$$ -104 228 360 188 -244 -626 -513 4 632 1046 869 245 -359 -707 -779 -286 392 933 724 -210 -1122
3491a122j99N77Q96Q42K05n37q73n23mM41P74P11r4q42j058m62L38O83O41K47
$$ -1122 -1321 -744 152 994 1199 662 -211 -734 -738 -297 477 1188 1094 252 -806 -1268 -930 -247 394 641
3511F41j69n83m47p6K35N40N21K26k62n17m71r5J87J77J59P6J3j06l27k60m1L24
$$ 641 472 -111 -558 -634 -399 141 662 888 626 109 -362 -457 -270 -93 66 142 155 49 -278 -538 -579 -255
3533b55L54M72J02j28l65l50k88j7M87O23K94m48q59o22p4L42P82P41O0m38o39
$$ -255 99 571 673 545 180 -170 -458 -475 12 635 929 481 -378 -1000 -1074 -732 50 791 851 413 -226
3554b26o19J3O26R53N72j84r42q77l89K80N90P03K62l24o58o46o4M10P10O11J63
$$ -226 -845 -832 -206 747 1319 1135 193 -684 -1073 -793 -203 500 762 438 -220 -866 -930 -520 190 801 964
3575I64m10o50k36o0J83L49L05nk56l41m19j08J96L30K98J84K2j12k00k23j92
$$ 964 554 -96 -332 -392 -209 140 445 440 184 -157 -576 -684 -488 -158 140 324 346 234 34 -189 -381
3596c81K24M83M06pl46n62n88p9K88O24M73J33m12o07n70P1P12Q81M31k26o74
$$ -381 -157 326 732 725 379 -183 -771 -850 -562 62 535 668 256 -351 -921 -850 -138 743 1174 948 274
3617B74p33l75Q8P55O88J59m00p62o79j32M69Q26O47M7m71n98k94j1M45N49K49
$$ 274 -459 -834 -746 9 697 856 456 -306 -985 -1117 -648 178 825 872 401 -197 -491 -502 -57 492 741
3638G41j25m25m67l75qK87L82K56r3j68q6j86j20K21K77L33J39K2k63m52l81k1
$$ 741 616 191 -276 -651 -659 -372 10 266 173 5 -81 -267 -387 -166 111 444 583 605 342 -110 -491 -512
3660e12K80L98K59M3l76o19m33J70O36O88L70p4n89o59k98K38O78N43K35l93p74
$$ -512 -232 166 425 468 92 -527 -960 -790 -154 534 904 830 241 -418 -716 -478 200 743 978 585 -189
3681a89q13j35N61O98N46L2m75o43l14J51O08N54K99j09m80o22k84J19M14L50
$$ -189 -1002 -1137 -576 122 668 700 225 -418 -732 -581 27 581 880 771 291 -331 -615 -496 -82 268
3701B68L4r7l47k08j44K7L38L21J53J69j41k55k79q9J48Q9K06J97n9l15n11k70
$$ 268 302 205 -142 -350 -494 -467 -129 192 345 514 373 118 -161 -250 -102 -13 193 390 331 16 -495 -765
3723g65J63L70N25L95j59m41m60j99K28M85N73K22l05q01o41j01M93N16M88j9
$$ -765 -602 -232 293 688 529 88 -372 -571 -343 142 715 937 632 -169 -810 -911 -418 98 586 567
3743E67m62o41l44J85N81O09M24j39n49n93k18K95M48K80%j41n24l13j02K54K64
$$ 567 105 -536 -880 -695 -114 495 919 780 231 -362 -580 -285 163 443 443 302 -222 -535 -637 -383 -119
3764a19L10J13o5k45r6K8N6O1J44J20Q6j36l80k16j45R7J97L67J42q3k96k99j38
$$ -119 191 304 239 -6 -102 -74 -18 43 187 307 393 257 -123 -339 -484 -387 -190 177 319 236 -60 -359 -497
3787d97J49N34M85J62l39n99m47j1K54N03L66%m43o57l32J46M85P00K81j67n38
$$ -497 -348 186 671 833 494 -105 -552 -563 -309 194 560 560 117 -540 -872 -726 -241 459 740 573 35
3808C5m81l4K54M18M06Q5m06m30m33J3J81M48K52%k50k73o2P6J74J89J89N9j41
$$ 35 -446 -480 -226 192 598 683 277 -153 -586 -573 -392 56 308 308 58 -215 -277 -201 -27 162 351 410 269
3831B69j55j98p9QM0R7J12J4j01j77k37n8J38N36K49O5j72l77k53q0J93M00K99
$$ 269 114 -84 -163 -155 -115 -18 94 108 7 -170 -407 -465 -327 209 458 523 351 -26 -279 -359 -166 234 533
3854E33l3m51n34k92J32M47N60K14k11m36l64k2J87N08M69L3l98n31l36N7L45
$$ 533 500 49 -485 -777 -645 -198 362 576 365 -71 -435 -457 -270 238 707 740 342 -189 -525 -468 -123
3875a23L56J70j66k96k71j17Q9K58M31J31j16k37k06J0N4Q1R3n5rj35o8m4k11
$$ -123 233 403 237 -59 -330 -447 -358 -100 331 462 346 109 -97 -87 -33 48 141 86 77 -58 -126 -170 -381
3898c81O2J85J32J70P4q9j30k95P9K65K65J96j35k80m46k11J28L12L35J22j51
$$ -381 -319 -134 -2 168 242 153 23 -272 -193 72 337 533 398 118 -328 -539 -411 -99 236 358 207
3919B07l07l80j42L96M95M17Km45m12k90N9M16L08Q5q6m10l85j84J97M17L64L5
$$ 207 -100 -480 -622 -226 269 686 688 243 -169 -459 -400 16 324 409 323 -87 -472 -656 -459 -42 322 357
3941C57j12k52k45P8J39K39J12kr8k52j72r0R8R1O2LL4N6o2p2j00O8K22K54K5
$$ 357 245 -7 -252 -174 -35 204 316 314 216 -36 -208 -298 -200 -109 -47 -44 -10 46 -16 -88 -188 -120 102 356 381
3966C81j11k27k67q1N2K01K37J02j10l90l42j8L20M80K62Rl08l82k25J16K82M06
$$ 381 270 43 -224 -305 -253 -52 185 287 177 -213 -555 -573 -253 227 489 498 190 -192 -417 -301 -19 387
3988C87J89j28m59m82j54K35M63K49K2k28l19j95J14K23L71K15q4k08k51k42J23
$$ 387 576 448 -11 -493 -647 -412 51 300 322 94 -225 -420 -306 -83 288 503 419 211 -40 -282 -159
4009a59J23Q0N9k9j31r5r1k1Q6J63J58N9J16j37j52p4p6L5J64K48Qj93l50k64
$$ -159 -36 44 103 74 -57 -152 -243 -264 -178 -15 143 202 318 181 29 -45 -121 -86 78 326 334 141 -209 -473
4033d73j4J85L56K91L6k86l05j40R3L54L52J63j50m13m69j29K71L46K33J2j99
$$ -473 -487 -302 54 345 381 95 -210 -350 -257 97 449 612 462 49 -420 -549 -278 68 301 313 114
4054A14m20k44J28K42L66K83Pl47l07n6P9K48J46N6j98j86j92o7Q9J09J26J52
$$ 114 -306 -550 -422 -180 186 469 476 129 -178 -234 -155 93 239 295 97 -89 -281 -348 -259 -150 -24 128
4076A28Rr2l2p8O0k4J04J28M5L9k01k46j49L5R7K48J65Nk66k35j88J40L50L41
$$ 128 137 45 13 -65 -5 -29 75 203 248 287 86 -160 -309 -274 -177 71 236 241 -25 -260 -448 -308 42 383
4100C83J45j43k73l78j61K38K93K53kk85l26k81K4K61L83L06p5l01k75p9J47K69
$$ 383 528 385 112 -266 -427 -189 104 357 355 70 -256 -537 -513 -252 131 437 362 61 -214 -293 -146 123
4122A23K09L3j01k52k65n5O5J54J60P8j35r9p2M9N0M0J64J14m5m0j14j70o9NJ19
$$ 123 332 365 264 12 -253 -308 -243 -89 71 149 14 -85 -157 -108 -58 -18 146 260 215 175 61 -109 -178 -173 -54
4147e4P6J39o2j51j74k20J30K40L12J19n2k59j60j53O1L90J85Qj88l61k77j7J69
$$ -54 22 161 99 -52 -226 -446 -316 -76 236 355 303 44 -116 -269 -208 182 367 375 187 -174 -451 -468 -299
4170b99M59K03q8k42k92j44J98L11L06P4k20k76k16j15J47K77J29p7j62j50j37
$$ -299 160 363 275 33 -259 -403 -205 106 412 486 266 -10 -226 -341 -194 83 212 135 -27 -177 -314
4191c14L8J58J52J20L7l8j11k9j7K5k6L4M8O6q9p5k12n3Q2J55J87R3m0j96j33
$$ -314 -276 -118 34 154 191 153 42 13 -4 21 -5 29 77 143 54 -21 -233 -286 -204 -49 138 231 191 -5 -138
4216a38n4J22K00K26N5j50l19l10l0K26K13K07j7k57k81q7J43K40K84J09q7k47
$$ -138 -192 -70 130 356 411 261 -58 -368 -398 -172 41 248 231 -26 -307 -394 -251 -11 273 382 295 48
4238D8k70m8J85K21Q9k2j93j85j87N4J80J76Q5K5j23p8l7J38R1j1l1J0%m9q9j30
$$ 48 -222 -270 -85 136 225 203 10 -175 -362 -308 -128 48 133 158 35 -43 -80 58 149 138 107 117 117 68 -21 -151
4264a51nL6N0J12k4Jq0q0j1jK40J65P8j48k55j10LJ03J71J20K5k58k81m7J0L32
$$ -151 -156 -120 -70 42 18 19 -61 -141 -152 -153 87 252 330 182 -73 -183 -180 -77 94 214 239 -19 -300 -347 -337 -5
4290eK38Q5p3k73k30K9J75K47J34n8j87j55k52NK42J53P7o5j25j82P5J17J14J00
$$ -5 233 318 245 -28 -258 -229 -54 193 327 269 82 -73 -325 -320 -78 75 152 87 -38 -220 -145 -28 86 186
4314A86k1n4o6j07PQ5l3ml4J2p4oM3q4n4J37J18J01M6p4j45n1J3J6J81P1m7j91
$$ 186 165 111 45 -62 -55 30 -3 -7 -41 -29 -103 -109 -66 -150 -204 -67 51 152 198 124 -21 -72 -59 -43 138 209 162 -29
4342b9j57r8oK12K66Lj25j68j16m2K28K15J26mk15j60k10L5K66P2L3o4j73j95
$$ -29 -186 -284 -290 -78 188 191 66 -102 -218 -260 -32 183 309 305 90 -70 -280 -245 21 93 126 62 -111 -306
4366c06JJ69J74J21M6p9j39m1L4Q4O6k2k6j10n9L9n6K8mM6J4O9k0mm8K4l2P7Q4
$$ -306 -305 -136 38 159 205 126 -13 -54 -20 64 130 108 82 -28 -87 -48 -104 -76 -80 -34 -20 49 29 25 -23 1 -31 46 130
4395A30L7j4j53j63l3oJ89J30J4j37j33m2q5J78K00J63k2j65j59j26J06Q0J99
$$ 130 167 153 0 -163 -196 -202 -13 117 131 -6 -139 -181 -266 -88 112 275 253 88 -71 -197 -91 -11 188
4418A88K2j04j94k04J0J60J53J15k1n4j58m8L8J13J59KJ8j14j82n3O1M4R0m8k6
$$ 188 210 106 -88 -292 -282 -122 31 146 125 71 -87 -135 -97 16 175 177 195 81 -101 -154 -93 -49 41 -7 -33
4443c3n8K1l0J08o5M8N2Q3j7l4k5j38l5L1J57LK9j66n0j17k4J13K35J27K7j71
$$ -33 -91 -70 -100 8 -57 -9 43 126 109 75 50 -88 -123 -92 65 68 97 -69 -119 -236 -260 -147 88 215 242 71
4469G1j33r6O0J95J29M5j01k45j41r6J54J34J65n2q0j19j22J00J41J64N3l7j14
$$ 71 -62 -158 -98 97 226 271 170 -75 -216 -312 -158 -24 141 89 9 -110 -232 -132 9 173 226 189 75
4492G5j15p5M2J18P5k8q6p3o2J7K0P1N5K7PO0l0o8j1mLL0j4N0j3j47j14k4Q3R1
$$ 75 -40 -115 -73 45 120 92 6 -67 -129 -112 -92 -21 34 61 68 128 98 30 19 15 18 48 34 84 71 -76 -190 -214 -131 -40
4522d0R5P3j35q4p7M4J17J41R1k5j71j48q5N5J93N6M5r3j97p4qK36P3J39j0j41
$$ -40 55 128 -7 -91 -168 -124 -7 134 225 200 29 -119 -204 -149 44 100 145 52 -145 -219 -227 9 82 221 211 70
4548G0j16k9L6R1N3M1o6r4j42l0J04L8Q9n7M1m2M5p2M7L9k1K5O2l4j02j9n8L1
$$ 70 -46 -75 -39 52 105 146 80 -14 -156 -186 -82 -44 45 -12 29 -13 32 -40 7 46 25 50 112 78 -24 -43 -101 -70
4576g0n8J10L0K8j6r6n8k1J84J05O8n5j51q9n1M6J09J39l8nk38m1qJ01Q8J34l6
$$ -70 -128 -18 12 40 24 -72 -130 -151 33 138 206 151 0 -89 -140 -94 15 154 116 111 -127 -168 -176 -75 13 147 111
4603A11p9j00l0K3J31R8L3p4j22j21K1L2O8K9J4p4Rm2j2O1J6N6j8N6k4k5m7l3
$$ 111 32 -68 -98 -75 56 154 187 113 -9 -130 -109 -77 -9 20 34 -40 -31 -73 -85 -24 -8 48 30 86 62 37 -10 -43
4631d3L9m8M1M2No9n3pjJ3J22P8j0o4m7r4j3J61N3O0j31m4j36r0J08O1J81l7q6
$$ -43 -4 -52 -11 31 36 -33 -86 -93 -94 -81 41 119 109 45 -2 -96 -109 52 105 165 34 -10 -146 -236 -128 -67 114 77 -9
4660in1n4NQ9J38R2k9k02j08L5N3N0M4Mr6l7o0Q1K1P0L8l6k6K4mL3l7L5k9k6o7
$$ -9 -60 -114 -109 -20 118 210 181 -21 -129 -94 -41 9 53 57 -39 -76 -136 -55 -34 36 74 38 12 36 32 65 28 63 34 8 -59
4691e9O2On6k2o7J34n3J03K9m4r6K2m2Q5P7Q9m4j45j11k6P4N2J18k4n2m3j53N8
$$ -59 3 9 -47 -69 -136 -2 -55 48 77 33 -63 -41 -83 2 79 168 124 -21 -132 -158 -84 -32 86 62 10 -33 -186 -128
4719a28J08N8P0j6p4p4l5P8J26N7j06r0k3o3L2OJ10Ml2m6J9J1K0K1K3j6k9Kk9
$$ -128 -20 38 108 92 18 -56 -91 -13 113 170 64 -26 -49 -112 -80 -74 36 40 8 -38 -19 -8 12 33 56 40 11 13 -16
4748a6L2j3o4qK7l8M0L0pMk1n0J08O3O1L8j51q7L4n0L0J17J5q5o1q7O3M1J8R0
$$ -16 16 3 -61 -69 -42 -80 -40 -10 -17 -13 -34 -84 24 87 148 186 35 -52 -18 -68 -38 79 94 9 -52 -139 -76 -35 -17 73
4778G3jp7j17Q6N5O4K2l0m9n2p3m3K0J21qJ3j9n4M5o2J03N1l3J9J0n6n4M5M7r6
$$ 73 72 -5 -122 -36 19 83 105 75 26 -26 -99 -142 -122 -1 -9 4 -15 -69 -24 -86 17 68 35 54 64 8 -46 -1 46 -50
4808e0ML8p2O5jpNm1J4M3M6K5J3o3o5j4N9oP5m3k8p8k7L6P1J5J1k7j9m4K8J8J25
$$ -50 -46 -8 -80 -15 -16 -23 -18 -59 -45 -2 44 69 82 19 -46 -60 -1 -7 68 25 -3 -81 -108 -72 -1 14 25 -2 -21 -65 -37 -19 106
4841A06l4J0n6o0kL8j3M6j0k1o2nL3M4J3N4l5o6K7k8N2N8k9j03L9K6k6m6nJ8K5
$$ 106 72 82 26 -34 -36 2 -11 35 25 4 -58 -63 -30 14 27 81 46 -20 7 -21 31 89 60 -43 -4 22 -4 -50 -55 -37 -12
4872a2J8p5O1J0L3J2j7m7j9J24m2L7j12%m5qL4P6J8m2Mp2k3R2L2O9Kp8k5n0P4
$$ -12 6 -69 -8 2 35 47 30 -17 -36 88 46 83 -29 -29 -74 -82 -48 28 46 4 8 -64 -87 5 37 106 108 30 5 -45 29
4903B9J1L5K3p7j15k2L0J05r4J11M1r8k3L8n6R3M9lNn1j05K0N3L5n3K0k1j8P1
$$ 29 40 75 98 21 -94 -116 -86 19 -75 36 77 -21 -44 -6 -62 31 80 77 82 31 -74 -54 -1 34 -19 1 -20 -38 33
4932C3j1k3J0J2l7P3j3l8K9o3K2j1j9Q2m0o3Kl6nM3P2O2j8l4n1m3k8J18j7M1K8
$$ 33 22 -1 9 21 -16 57 44 6 35 -28 -6 -17 -36 46 6 -57 -55 -91 -96 -53 19 81 63 29 -22 -65 -93 25 8 49 77
4963G7j14m1m9M3P8M2J5o5lj5L2nR0j5J1k5m6L3q1O0j6j3J7l6LJ7k8J3L5m2K9
$$ 77 -37 -78 -127 -84 -6 36 51 -14 -17 -32 0 -5 85 70 81 56 10 43 -38 22 6 -7 10 -26 -23 -6 -34 -21 14 -28 1
4994AO9m2j1j1L4p3k5P3J7Oo7n4M8p0P8N7J0k8m6j6N0PN8N3l4p8m5n0M7NN2On5
$$ 1 70 28 17 6 40 -33 -58 15 32 38 -29 -83 -35 -105 -27 30 40 12 -34 -50 0 7 65 118 84 6 -39 -89 -42 -37 15 21 -34
5027c4l7m2J00N6l8R6L3j12o7M2l8N0j9N9m5p2nJ2jK8J5k3nL7N3LPm7J8l4K6L2
$$ -34 -71 -113 -13 43 5 101 134 22 -45 -3 -41 9 -10 49 4 -68 -73 -61 -62 -34 -19 -42 -47 -10 43 46 53 6 24 -10 16 48
5059D8Pr3j3Mk7Q1L0m3K1q4RL8k3J10qm6Pn3n8M2L1O0K0k4j24K5k7J7M1R4K1p8
$$ 48 55 -38 -51 -47 -74 7 37 -6 15 -69 -60 -22 -45 65 57 11 18 -35 -93 -51 -20 40 60 36 -88 -63 -90 -73 -32 62 83 5
5091El9J%N1kM2j2l7k8oo3P3kQL6p4O1k4k1K1J3l0O7QK7m2j0p0KNJ9L4n1%l2J5
$$ 5 -34 -33 -33 18 16 58 46 9 -19 -25 -88 -15 -17 -9 27 -47 14 -10 -31 -10 3 -27 40 48 75 33 23 -47 -45 -40 -21 13 -38 -38 -70 -55
5127e5O0j3M7J9m2n7l5lP2J1K1J4k5r2l3MO3R6Mmo6n2M7jO2L8j5n3p6L6pM1oR7
$$ -55 5 -8 39 58 16 -41 -76 -79 -7 4 25 39 14 -78 -111 -107 -44 52 56 52 -14 -66 -19 -20 42 80 65 12 -64 -28 -35 6 0 97
5161I7n7j02N2k7lm1J21k4j3QRj6J9m5L7o2Q6j0pl4l6J4K3m8J54l9O9j60j0N7
$$ 97 40 -62 -10 -37 -40 -81 40 16 3 11 20 4 23 -22 15 -47 39 29 22 -12 -48 -34 -11 -59 95 56 125 -35 -45 12
5191A2l4J2P3Pn3n4q7M2O4J07Mp6k1m1k8O1L2J9mpm8k4l0K2Q9mL3j24L6p8KQ7
$$ 12 -22 -10 63 70 17 -37 -124 -82 -18 89 93 17 -4 -45 -73 -12 20 39 35 28 -20 -44 -74 -52 37 33 66 -58 -22 -100 -98 -11
5223a1n1J02q4O5q2J2J0M6m0N3j2L3n8Kll2rJ01j8m1j0Kj3l8N1N5Jpnl1m1oN1
$$ -11 -62 40 -44 21 -61 -49 -39 7 -33 20 8 41 -17 -15 -18 -50 -59 42 24 -17 -27 -25 -38 -76 -25 30 31 24 19 -12 -53 -59 -8
5256hk2Q9j6o9n5k3L6P5N4j5M8r4m9k4M9Q5R4q6m6q4l6M4k0J04j4j9k1J6n4K1
$$ -8 -30 59 43 -26 -81 -104 -68 7 61 46 94 0 -49 -73 -24 61 155 69 23 -61 -97 -53 -73 31 17 -2 -23 -7 -61 -40
5286d0R6m1j7j1N2k9j2n0K0J1PK9l4J9Jq4L0K0K0N2oJ7n2m9pO6M8j10J20n0q9
$$ -40 56 15 -2 -13 39 10 -2 -52 -32 -21 -14 15 -19 0 1 -83 -53 -33 -13 39 33 50 -2 -51 -58 8 56 -54 66 16 -73
5317g3J1K4L8M0L4j0o6r8K2L6J04M6j6q4n4m1j5J15LP8j9j40lqkN1N2J16p5j06
$$ -73 -62 -38 0 40 74 64 -2 -100 -78 -42 62 108 92 8 -46 -87 -102 13 16 94 75 -65 -68 -76 -78 -27 25 141 66 -40
5347d0L4J8lOj4M5m8qk4mJL7k8N0l7K3Opj9oM1N4J6m3%p4rj8K0J12K2q5p1j3l5
$$ -40 -6 12 9 15 1 46 -2 -10 -34 -38 -37 0 -28 22 -15 8 14 7 -12 -18 23 77 93 50 50 -24 -33 -51 -31 81 103 18 -53 -66 -101
5382a01O4Q8N2r1%m0r9Q3KJ04Q1m8n8j32kM0M6O9Rk6k9m8J0QO5M8l3j9q0j2k4
$$ -101 -37 51 103 12 12 -28 -127 -44 -42 62 143 95 37 -95 -97 -57 -11 58 67 41 12 -36 -26 -18 47 95 62 43 -37 -49 -73
5413g3%N0M3j6J3n3M4n9K1j1L6J4J1K2p7j7l8N8J07Mlm0q7j9n3M2P7N3L1m4n8
$$ -73 -73 -23 20 4 17 -36 8 -51 -30 -41 -5 9 20 42 -35 -52 -90 -32 75 79 76 36 -51 -70 -123 -81 -4 49 80 36 -22
5444b2r7O9M8J07J2j9r5n6m0L8J00QN0m2r2k2k7qO9P4J1k7q6Kl4O2K5Q4l6q3N
$$ -22 -119 -50 -2 105 117 98 3 -53 -93 -55 45 53 103 61 -31 -53 -80 -88 -19 55 66 39 -47 -45 -79 -17 8 92 56 -27 -22
5475b2ojJ1N1p9L1M2p0l2O8qK3M4j1Mk0K4p8m0P8lJ2P0n2k3o0l4N5O4P6o6jj09
$$ -22 -28 -29 -18 33 -46 -15 27 -43 -75 -7 -15 8 52 41 45 25 49 -29 -69 9 6 18 88 36 13 -47 -81 -26 38 114 48 47 -62
5508f2o9R7K8J01J5oj33m2n3N6J11M3j6or6r1P2N8K8N1Po4n3p1M1J0Q2OM5l4q6
$$ -62 -131 -34 -6 95 110 104 -29 -71 -124 -68 43 86 70 64 -32 -123 -51 7 35 86 93 29 -24 -95 -54 -44 38 44 89 55 -31
5539c1L6j0j6K0mM8k3j4L0m3l5K4N2l0P2j04rl4J8L9K1R3n1k3r6J3n5P8L8J00
$$ -31 5 -5 -21 -1 -5 43 20 6 36 -7 -42 -18 34 4 76 -28 -37 -71 -53 -14 7 100 49 26 -70 -57 -112 -34 4 104
5569A04k2j36l7%L7Q1N2K0l3j04m2LR9N0LO0r4o7k4PP3J3Ll0k4n5J7lP0j2K1l0
$$ 104 82 -54 -91 -91 -54 27 79 99 66 -38 -80 -77 22 72 75 135 41 -26 -50 -43 30 43 46 16 -8 -63 -46 -49 21 9 30 0
5601@L4n9J8kqRM2K6Kk8q5N9n8lP3K0J8n2k0q7K6J02J08o1l6j3r0n%J06M2Lo5
$$ 0 34 -25 -7 -9 -17 -8 34 60 62 34 -51 8 -50 -53 20 40 58 6 -14 -101 -75 27 135 74 38 25 -65 -70 -70 36 78 81 16
5634A6q9o3RJ08O6M2k7o5o7QK6N9P0n3j2k2j01K2J1P3N1Jm6j2q3N7N1Pm7N6r2
$$ 16 -73 -136 -127 -19 47 89 62 -3 -70 -62 -36 23 93 40 28 6 -95 -73 -62 11 62 63 17 5 -78 -21 30 37 -10 46 -46
5665d6P6Rn2j1rM8n1K7K7n4nj7pQ4l8J23q2o3l5KK6N3L0N6o2p9j12P1L7J11P9
$$ -46 30 39 -13 -24 -33 15 -36 -9 18 -36 -41 -58 -65 19 -19 104 22 -41 -76 -74 -48 5 35 91 29 -50 -162 -91 -54 57 136
5696A36r1o8n8qK1P2P3k6O6j35o0k8O6J30K2p8k9m1q2N0L3J22l0p5l9N3k9M8M
$$ 136 45 -23 -81 -89 -68 4 77 51 117 -18 -78 -106 -40 90 112 34 5 -36 -118 -68 -35 87 57 -18 -57 -4 -33 15 19
5725A9Oj9M4r0O3o8mLpK0K6R0p6m8Nlj9J26MJ9Oq8j01MM2N0N5K9j28j02K0J05
$$ 19 25 6 50 -40 23 -45 -49 -46 -53 -33 -7 83 7 -41 -36 -39 -58 68 72 91 97 9 -92 -88 -46 4 59 88 -40 -142 -122 -17
5757a7jJ18p4O5j11n6j2Q5P2j7Pp4o2o2M2O8J21j5n7l1KpL9qM7k4l8mm4QN0j4
$$ -17 -18 100 26 91 -20 -76 -88 -3 69 52 59 -15 -77 -139 -97 -29 92 77 20 -11 -9 -16 23 15 62 38 0 -4 -48 -40 10 -4
5789dLj8L9Nok2m5K1K3L3O4j0l5r9j8L0OJ27p1K5j17j1qL1L3P7P9j62Mo4k0J06
$$ -4 -1 -19 20 25 19 -3 -48 -27 -4 29 93 83 48 -51 -69 -39 -33 94 23 48 -69 -80 -88 -57 -24 53 132 -30 -26 -90 -110 -4
5821dQ2M7K7j50n7r5Q4Q9O9L3q5j53L1k2R2O3N2j4k9j18J8K8L5nlJm3%K9n6N9
$$ -4 78 125 152 2 -55 -150 -66 23 92 125 40 -113 -82 -104 -12 51 103 89 60 -58 -40 -12 23 18 15 16 -27 -27 2 -54 5
5852Em9JQ0M0ok7k5ll4j7R7K2m6p1p9K9m6J23R5Mn7k6j65K8J07P2J17r1n1q9p5
$$ 5 -44 -43 37 77 71 44 19 16 -18 -35 62 84 38 -33 -112 -83 -129 -6 89 93 36 10 -155 -127 -20 52 169 78 27 -62 -137
5883a37M9O4J38j9r7n5q4L7j1J68O5j7o2l8q6J1P2J1O0p7L8n3p5P3oL4k4L3k1
$$ -137 -88 -24 114 95 -2 -57 -141 -104 -115 53 118 101 39 1 -85 -74 -2 9 69 -8 30 -23 -98 -25 -31 3 -21 12 -9
5912iL5np2J3Q2r4J19M8mp7o9k6N5lR6Nj4q6p2l4M1J45j1N7j29Pj47Q5K1J38O6
$$ -9 26 21 -51 -38 44 -50 69 117 113 36 -33 -59 -4 -7 89 94 80 -6 -78 -112 -71 74 63 120 -9 -2 -149 -64 -43 95 161
5943A61p4j15j27J7KK02K5lo6o4j02P5J06M6L3n5k0j16l1O4L2Q4J3o0nn0M8n5
$$ 161 87 -28 -155 -138 -136 66 91 88 22 -42 -144 -69 37 83 116 61 41 -75 -106 -42 -10 74 87 27 22 -28 20 -35
5971c5K7j8N0J1%J3m3q6K3pK3P8J5l9l0p6%MJ14P1M2r1q1q4O6O9R1K7n3m1j21
$$ -35 -8 -26 24 35 35 48 5 -81 -58 -65 -42 36 51 12 -18 -94 -94 -90 24 95 137 46 -35 -119 -53 16 107 134 81 40 -81
6002h1o1P6O5J06K0j08j08j8K2Q3J20M2j11n3k3m3M0L3Q0l7j00k1K6k5J8L8m1
$$ -81 -142 -66 -1 105 125 17 -91 -109 -87 -4 116 158 47 -6 -29 -72 -32 1 81 44 -56 -77 -51 -76 -58 -20 -61
6029f1J09m2Rn2NqN6K4PL2k1Jr9rl6J9P9L3J6m1j7j17N1K1R3K5N7j02j41k4L1
$$ -61 48 6 15 -37 -32 -40 16 40 47 79 58 59 -40 -49 -85 -66 13 46 62 21 4 -113 -62 -41 52 77 134 32 -109 -133 -102
6060a02J19R7jj10p1p5K9P6Q2N9O7j40j03l4P1P7O7m5J3j31J0n9O3P9L7m3q2M7
$$ -102 17 114 113 3 -68 -143 -114 -38 44 103 170 30 -73 -107 -36 41 108 63 76 -55 -45 -104 -41 38 75 32 -50 -3
6088cj5OM6L4r3N5k9pkN6j12O5n6l4Q5M5no7q6pN5R2M7J8r1ro3K4O8N7K0n3j07
$$ -3 -18 -12 34 68 -25 30 1 -6 -8 48 -64 1 -55 -89 -4 41 36 -31 -117 -124 -69 23 70 88 -3 -12 -75 -51 17 74 94 41 -66
6121f6p8O5O1N9O0oq9m8p3K8Q2R3N7n6j40j9j0j4J57L9m8p6j5r%Q2J1K3n5m2k5
$$ -66 -144 -79 -18 41 101 95 6 -42 -115 -87 -5 88 145 89 -51 -70 -80 -94 63 102 54 -22 -37 -46 -46 36 47 70 15 -27 -52
6152e2MR1pNrJ3k5%l1o4L3Rj1P6QP0q9n7NL2M3P2n2k1pj03p2J07P9L7N2j68o3
$$ -52 -48 43 36 41 32 45 20 20 -11 -75 -42 -33 -44 32 40 110 21 -36 -31 1 44 116 64 43 36 -67 -139 -32 47 84 136 -32 -95
6185i5p4Q8J10O3Q6j08q7p3mP0P2P7l3j15j02l7P6O8Q1K8k3j19j1RR5K4K7Jq9
$$ -95 -169 -81 29 92 178 70 -17 -90 -94 -24 48 125 92 -23 -125 -162 -86 -18 63 91 68 -51 -62 -53 42 66 93 94 5
6214El3k7N8J1m2J0j3N1M7n4k5K8k3n3P9K9pQp6n4J0J1M4Q2j6j29j16L3L6J01
$$ 5 -28 -55 3 14 -28 -18 -31 20 67 13 -12 16 -7 -60 19 48 41 49 -27 -81 -71 -60 -16 66 50 -79 -195 -162 -126 -25
6244b5J46L2r3p7j18K3Q6J41QJ3j49j05j0N6L1R9L6r5l7j00M6N8R6K4k3k1o8k6
$$ -25 121 153 60 -17 -135 -112 -26 115 123 136 -13 -118 -128 -72 -41 58 94 -1 -38 -138 -92 -34 62 86 63 42 -26 -52
6272e2l6Q8K0Kk7n7j5L4LOL4L7k1KP5m6l2j9m8O6L7J3m6%r1QJ6J8J26J9kj42q3
$$ -52 -88 0 20 22 -5 -62 -77 -43 -40 -34 0 37 16 18 93 47 15 -4 -52 14 51 64 18 18 -73 -65 -49 -31 95 114 112 -30 -113
6305a13j0J33J09M5n9o6j16l9M6J06M1R3j65o2n6l4O8J14J29l2r8j20M7lR1N4
$$ -113 -123 10 119 164 105 39 -77 -116 -70 36 77 170 5 -57 -113 -147 -79 35 164 132 34 -86 -39 -42 49 103
6331A03m0o7k6n6J8k2N0L7m5M1M0L8p2rRj1PN2N1n1m5p4r0O0J24N1k4K7j02j09
$$ 103 63 -4 -30 -86 -68 -90 -40 -3 -48 -7 33 71 -1 -10 -1 -12 -5 47 98 47 2 -72 -162 -102 22 73 49 76 -26 -135
6361a35J2Q0N1J42kq7j31q7M6J04J46K6m5k25o9k7J49Q9R8n8l6j20kk3P3J55K2
$$ -135 -123 -43 8 150 148 61 -70 -157 -111 -7 139 165 120 -105 -174 -201 -52 37 135 77 41 -79 -81 -104 -31 124 146
6388A46m1r5j07J2J1O0L3M7n5j4mn2L6oP0Mk4pL0n4Ro1J6K5K8N4o0j3j52P3J4
$$ 146 105 10 -97 -85 -74 -14 19 66 11 -3 -7 -59 -23 -29 41 45 21 14 44 -10 -1 -62 -46 -21 7 61 1 -12 -164 -91 -77
6419g7J44P4Nn9j25q6K3R6J37J9p2j10j11jL7J63N6L3j55l3q0K4Q8O1J12n2j36
$$ -77 67 141 146 87 -38 -124 -101 -5 132 151 79 -31 -142 -143 -106 57 113 146 -9 -42 -122 -98 -10 51 163 111 -25
6446b5q7Q5L9pJ4O0o9o6m1j6Q1P2k6m6Q0qo3P1l1J4o9N0J8KRp5Oq8L4J27nJ06
$$ -25 -112 -27 12 5 19 79 10 -56 -97 -113 -32 40 14 -32 48 40 -23 48 17 31 -38 12 30 32 41 -34 -28 -116 -82 45 40 146
6478A46q4p9m2m8J24M9J45m0k19l7p4O0J40L5Jo2j49l0l3J66J26K1k4n3j41Nk
$$ 146 62 -17 -59 -107 17 66 211 171 -48 -85 -159 -99 41 76 77 15 -134 -164 -197 -31 95 116 92 39 -102 -97 -99
6505i9J47QK9n3j66M9j3Q4j5N4o0nJ4nN8K9L8p3oj7M6n0J2n6l8%J07N6Qp9q6j1
$$ -99 48 56 85 32 -134 -85 -98 -14 -29 25 -35 -40 -26 -31 27 56 94 21 15 -2 44 -6 6 -50 -88 -88 19 75 83 4 -82 -93
6537i3J5LR8J24k3j50n2nJ1J03N0L5r5j12r5L5J40Q2PK0p4j07m3J01Q1K8M2q0
$$ -93 -78 -75 23 147 124 -26 -78 -83 -72 31 81 116 21 -91 -186 -151 -11 71 78 98 24 -83 -126 -25 56 84 126 46
6565D6n2j74O8J27nN0p2l7r3N8PJ16Q3o2q1OL8nLK4m1m3pqM3Lj3lj0j2Q6L9J9
$$ 46 -6 -180 -112 15 10 60 -12 -49 -142 -84 -77 39 122 60 -21 -15 23 18 21 45 4 -39 -46 -54 -11 -8 -21 -24 -34 -46 40 79 98
6598I8n1o1r3J1J04J07m2n3o9m6o3J23Q5K6n8n6p5l2O4J61K3R9q4j19j47J5J23
$$ 98 47 -14 -107 -96 8 115 73 20 -49 -95 -158 -35 50 76 18 -38 -113 -145 -81 80 103 202 118 -1 -148 -133 -10
6625a0Q6K5n5j78m5R6J3J31J7k2o7j0KM0KL4qj6o5n0L6L0k7K5k7k2M1R8k7k5m
$$ -10 76 101 46 -132 -177 -81 -68 63 80 58 -9 -19 -17 23 25 59 51 35 -30 -80 -44 -14 -41 -16 -43 -65 -24 74 47 22 18
6656A8l8M6lM1K1K7j30r4nM0R6P5K1q1j47r8J61Q0J29Rq2j73k9M3L6J70J2o4j29
$$ 18 -20 26 23 64 85 112 -18 -112 -117 -77 19 94 115 34 -113 -211 -50 30 159 168 86 -87 -116 -73 -37 133 145 81 -48
6685d8r4M1O1M6J51r2k0j30mL4N1J11J1q6Oj27LP0j7P1q5K1jn8N0L0K9qj7K1L4
$$ -48 -142 -101 -40 6 157 65 45 -85 -89 -55 -4 107 118 32 38 -89 -86 -16 -33 38 -47 -26 -27 -85 -35 -5 24 16 -1 20 54
6716E4O2k6o5j7q6J04j7L8J8p3j10k2L4J38P2Mn7j19m4N8K7J53K8k0p6j37o5P8
$$ 54 116 90 25 8 -78 26 9 47 65 -8 -118 -140 -106 32 104 108 51 -68 -112 -54 -27 126 154 134 58 -79 -144 -66
6744f6Q1O7K0m2j57o9K9J25J17J9l7p2p4J3qP5J9n4nOl1q4O7P2l9J5j3M7PJ6o1
$$ -66 15 82 102 60 -97 -166 -137 -12 105 124 87 15 -59 -46 -54 21 40 -14 -19 -13 -44 -128 -61 11 -28 -13 -26 21 28 44 -17
6775a7J3L2m2L4M6l6o4n1m8N7K7J58n2l1p6o6M4M9J28j9P2q3j30r0LJ37P9J4q7
$$ -17 -4 28 -14 20 66 30 -34 -85 -133 -76 -49 109 57 26 -50 -116 -72 -23 105 86 158 75 -55 -145 -142 -5 74 88 1
6804An7j01P5K7J31P0k6n2j20k3N1Q2O1p9Op8qp3J6J47L5n6l4p4L9K1J7l1MN7
$$ 1 -56 -157 -82 -55 76 146 120 68 -52 -75 -24 58 119 40 46 -32 -40 -113 -97 50 85 29 -5 -79 -40 -19 -2 -33 -29 28
6834B8kJ9L3m7m3r6PR7M3L3m5k9j14L6N4P7J22J5j27r6n7JQ1J75lq8j23j08k6
$$ 28 26 45 78 31 -12 -108 -101 -4 39 72 27 -2 -116 -80 -26 51 173 188 61 -35 -92 -91 -10 165 162 74 -49 -157 -183
6863a83J59N8R7j9q7j13j2J8J34O7J3k9j23q0k3P4N7L6m2nm1N1r7J24j8j4k5K8
$$ -183 -24 34 131 112 25 -88 -100 -82 52 119 132 103 -20 -100 -123 -49 8 44 2 -3 -44 7 -90 34 16 2 -23 5
6891EK4mMn8M9p0NK2M0j9K7j02m0M6M8J26J9m7j49o4P1M1J53M5p4j30r4OOO3J82
$$ 5 29 25 29 -29 20 -50 -45 -23 17 -2 25 -77 -117 -71 -23 103 122 75 -74 -138 -67 -26 127 172 98 -32 -126 -120 -114 -51 131
6922A31%o5j77J4k1J07J63Nq2q0o6p2P3J17R8j11l8o4n3M1P7M7N0j00j2j0N9m2
$$ 131 131 66 -111 -97 -118 -11 152 157 75 -5 -71 -143 -70 47 145 34 -4 -68 -121 -80 -3 44 94 -6 -18 -28 31 -11
6950a1M9mn6K2j8M5K3o9J1j05mQ3Q9J4qo9o8N2NO9R9p6j5j57m2K9R0J79jj73r2
$$ -11 38 34 -22 0 -18 27 50 -19 -8 -113 -117 -34 55 69 61 -8 -76 -24 -19 50 149 73 58 -99 -141 -112 -22 157 156 -17 -109
6981a09r8J21J06R4Mj04k0j07J5Q2J38M5n3j45o7MnR3P1m9Ko2n5O6L0N7L8n6p5
$$ -109 -207 -86 20 114 118 14 -6 -113 -98 -16 122 167 114 -31 -98 -94 -99 -6 65 16 18 -44 -99 -33 -3 54 92 36 -39
7010c9K7L0l%Ll3j7p4R2N0K2l1r4K2L2P4M6j4l7n3q5QR9N7j0J2j42j10R7K0J08
$$ -39 -12 18 15 15 18 -15 -32 -106 -14 36 58 27 -67 -45 -13 61 107 93 56 3 -82 -74 25 82 72 84 -58 -168 -71 -51 57
7041E7P7k6j04j08O1j5R7J51r8pj48p5L9J04O8J2p8o6nm8J43N9N1p7l9k8p0P7
$$ 57 134 108 4 -104 -43 -58 39 190 92 85 -63 -138 -99 5 73 85 7 -59 -64 -112 31 90 141 64 25 -3 -73 4
7069DM6O7o3l7p6j8M2kO1j9q3O3J4J5Rlm9j9O1J6O8J3j25k1p9K1N6N4P9k7p6r3
$$ 4 50 117 54 17 -59 -77 -35 -37 24 5 -78 -15 -1 14 23 20 -29 -48 13 29 97 110 -15 -36 -115 -94 -38 16 95 68 -8 -101
7101a01K2P8N4J02j2r6j23l4M2P4J18J5j11m3r3n7J05J47QJ7j25k5k8Q4LP6Lo1
$$ -101 -79 -1 53 155 143 47 -76 -110 -68 6 124 139 28 -15 -108 -165 -60 87 95 112 -13 -38 -66 18 21 97 100 39
7129C9j02o5R3k3P2J5o8j2k6O2P8j03N7k8J3KoM8K5r8o0j8M4Q6P1m5m6r6NO6N4
$$ 39 -63 -128 -35 -58 14 29 -39 -51 -77 -15 63 -40 17 -11 2 4 -2 46 71 -27 -87 -105 -61 25 96 51 5 -91 -86 -20 34
7160C4J17k3n1j54o1Q3P9P8N2m1j59j60J5J34J01N0K6j05n2j11OJ82O1O5o1p5
$$ 34 151 128 77 -77 -138 -55 24 102 154 113 -46 -206 -191 -57 44 94 120 15 -37 -148 -142 40 101 166 105 30
7186C0p5J5L0K8K1p6m3J8M0jK2M6n2N7j09J04oM8p8q1J2lJ41on3n4j04m2P4N9
$$ 30 -45 -30 0 28 49 -27 -70 -52 -12 -13 9 55 3 60 -49 55 49 97 19 -62 -50 -53 88 82 29 -25 -129 -171 -97 -38
7216c8J36kNj70o0K7O1J57Q0o0j52j61lM3J84j2O3j08l6q7N4J06P6K8p6n1r8L7
$$ -38 98 96 101 -69 -129 -102 -41 116 196 136 -16 -177 -180 -137 47 35 98 -10 -46 -133 -79 27 103 131 55 4 -94 -57
7244e7N2M9O0Jr9j06j9J7P1J03n5l7J6m6P4Jk3l0P9o4L9RJ0o5m1m0N1kQ7lmp7
$$ -57 -5 44 104 105 6 -100 -119 -102 -31 72 17 -20 -4 -50 24 25 2 -28 51 -13 26 35 45 -20 -61 -101 -50 -52 35 32 28 -49
7276d9k5j5J28J4J49m3j25p1r7K8J00J26j3p0j31q7L1J47N4O5pn0r2n0K2Q5J03
$$ -49 -74 -89 39 53 202 159 34 -37 -134 -106 -6 120 107 37 -94 -181 -150 -3 51 116 109 59 -33 -83 -61 24 127
7303A27m3m8j05o1K3J18N4n6K0o7J4k9Q4qL0ql9L2oM8n8m3kq4N1N6L5j9l5j23
$$ 127 84 36 -69 -130 -107 11 65 9 29 -38 -24 -53 31 23 53 45 6 38 32 80 22 -21 -23 -107 -56 0 35 16 -19 -142
7333a42M7Q1O8O5J7m9j35r4K7J17Q6%K6j77n4l8M0J81L8K3j20p8o2M1J16J08K
$$ -142 -95 -14 54 119 136 87 -48 -142 -115 2 88 88 114 -63 -117 -155 -115 66 104 127 7 -71 -133 -92 24 132 134
7360A34o4r4m7QM7L6L7o2p2mj9L0J14JL9r9LPN0rno8rj6N3mO8j07j9j%J0J49K
$$ 134 70 -24 -71 -63 -16 20 57 -5 -77 -81 -100 -70 44 45 84 -15 -12 -5 45 36 31 -37 -46 -62 -9 -13 55 -52 -71 -72 -72 -62 87 89
7394H9m3j09j7RJ04P2K2m6j01j19k8P0J17R7p2k0j03k8k7J48J38k2j8j35m9L6
$$ 89 46 -63 -80 -71 33 105 127 81 -20 -139 -167 -97 20 117 45 25 -78 -106 -133 15 153 131 113 -22 -71 -35
7420c5k7J25Ok5o2r8k0P9R1k1O7n6m6J5j2L5J9M6m4k8m0J8N5l7m4j8o4M6M0N6
$$ -35 -62 63 69 44 -18 -116 -136 -57 34 13 80 24 -22 -7 -19 16 35 81 37 9 -31 -13 42 5 -39 -57 -121 -75 -35 21
7450B1K8m4l6KJ4N7R3qq8j04k6L6MR7O7r0o3j24O9O8J28L1j01m0p7N0K0J01L1
$$ 21 49 5 -31 -29 -15 42 135 127 39 -65 -91 -55 -51 46 113 23 -40 -164 -95 -27 101 132 31 -9 -86 -36 -16 85 116
7479A16O7j61j15oL9P3R0l7m5q8m9R6L3J32j9p5o3RRkN3Qr3m8k4O3K2M7J4q7J9
$$ 116 183 22 -93 -99 -60 13 103 66 21 -67 -116 -20 13 145 126 51 -12 -3 6 4 57 65 -28 -76 -100 -37 -15 32 46 -41 -22
7510b2l2J40o4M7M0j30j9K6O3kO9r0j01l7j0P4R7N4nj16p4m6J12R5Q1p6n0j33
$$ -22 -54 86 22 69 109 -21 -40 -14 49 47 116 26 -75 -112 -122 -48 49 103 98 -18 -92 -138 -26 69 150 74 24 -109
7538a09LJ6J38R4o4n1r8m8oR6R1N3p2oj18M5L1Q2l7m0l4l5J0m9P0M3orn8R7k9
$$ -109 -106 -90 48 142 78 27 -71 -119 -125 -29 62 115 43 37 -81 -36 -5 77 40 0 -34 -69 -59 -108 -38 5 -1 -10 -68 29 0
7569@M9l4o1L9j5N2K3%k4Mj25oP6l3J08j5o1q1M2L7M5O4J6l4j28k4M3Q4Rk3k3
$$ 0 49 15 -46 -7 -22 30 53 53 29 33 -92 -98 -22 -55 53 38 -23 -104 -62 -25 20 84 100 66 -62 -86 -43 41 50 27 4
7600Dn4n7k4N5J19N3k2m5n6m7P4J5R7L5j12o8j49J40jOO7m6o5N2qK9O7j7o0L4
$$ 4 -50 -107 -131 -76 43 96 74 29 -27 -74 0 15 112 147 35 -33 -182 -42 -43 -37 30 -16 -81 -29 -37 -8 59 42 -18 16
7630A6J0J2K2k0j7j09L9K4L5O0l8l6r2k6L9J15O0Jj7q7j20N3J36M9qK0j98j9l6
$$ 16 26 38 60 40 23 -86 -47 -23 12 72 34 -2 -94 -120 -81 34 94 95 78 -9 -129 -76 60 109 101 121 -77 -96 -132
7659a32O1P4J12k8r9n0o2K9J10J50l9k0j06q4j8R8O0K2m8m8m9k9N4O7Ln6J8M3
$$ -132 -71 3 115 87 -12 -62 -124 -95 15 165 126 106 0 -84 -102 -4 56 78 30 -18 -67 -96 -42 25 28 -28 -10 33
7687C3pl4O1l8n4J2q9J36k8O2l3j08j5M7M1P1K6l7l5p3l9J17O6O6k8j03j20q5
$$ 33 26 -8 53 15 -39 -27 -116 20 -8 54 21 -87 -102 -55 -14 57 83 46 11 -62 -101 16 82 148 120 17 -103 -188
7715a88O3R6J19K0m6k15k6%J62J13L6l5j03l3r9J11Q5P2l4q6j14J2LN7J5M7r5
$$ -188 -125 -29 90 110 64 -151 -177 -177 -15 98 134 99 -4 -37 -136 -25 60 132 98 12 -102 -90 -87 -30 -15 32 -63
7742f3k2P7pQ7n9N0j9r0L4P0nn0l5l3K0m9J36k2qn5n6J0M3P8O8k1k0j58l3N4N3
$$ -63 -85 -8 -15 72 13 63 44 -46 -12 58 53 3 -32 -65 -45 -94 42 20 12 -43 -99 -89 -46 32 100 79 59 -99 -132 -78 -25
7773b5L2J05j04o2o7L5O3N0J06j13M0j81NO1R4R6m4n0j28j6J7P6K7L7l1j02k2
$$ -25 7 112 8 -54 -121 -86 -23 27 133 20 60 -121 -116 -55 39 135 91 41 -87 -103 -86 -10 17 54 23 -79 -101
7800a01P5M8P2o8J7j5n4R7m1l7J8j09P1k0N6M4o0K4q6M7qN5O2M3j1j09q9K1K7
$$ -101 -26 22 94 26 43 28 -26 71 30 -7 11 -98 -27 -47 9 53 -7 17 -69 -22 -30 25 87 130 119 10 -79 -58 -31
7829c1Q4L4o1o8q6K4Q2O1N3Mo1r3Nj8J36oP2l2j14r5J3J00N4l3Po2r6%N8J06M7
$$ -31 53 87 26 -42 -128 -104 -22 39 92 96 35 -58 -53 -71 65 59 131 99 -15 -110 -97 3 57 24 31 -31 -127 -127 -69 37 84
7860H4m9kn7j3O6K4K0r4Jn6L3Q0j9Jj9q7L1oJ07M9m7Rp7n7O1J02M5m2l3j11r4
$$ 84 35 33 -24 -37 29 53 73 -21 -20 -76 -43 37 18 19 0 -87 -56 -62 45 94 47 56 -21 -78 -17 85 130 88 55 -56 -150
7891a50P5M6J25l2r6j7r0J9O3J77k3k7m1j13K8O0JJ05k7j41k5J5MO5N4j2o1j8
$$ -150 -75 -29 96 64 -32 -49 -139 -120 -57 120 97 70 29 -84 -56 4 5 110 83 -58 -83 -68 -64 1 55 43 -18 -36
7919c6l1L9J05J1j8p7k9npO9K3j7lm6m2L1N4kj5m2%L2J4L8J4mq9j2q2R0N8oK9
$$ -36 -67 -28 77 88 70 -7 -36 -41 -48 21 44 27 24 -22 -64 -33 21 19 4 -38 -38 -6 8 46 60 56 -33 -45 -127 -37 21 15 44
7952D4j17q2PJ44R0J2m8n2l4J6P4j2L3M3j60n4J2O3M6R1n4n7o5m8K8P8R1J0p2
$$ 44 -73 -155 -148 -4 86 98 50 -2 -36 -20 54 42 75 118 -42 -96 -84 -21 25 116 62 5 -60 -108 -80 -2 89 99 27
7981B7l7j01O8N2P4m6l4m8m7O8j5P0j1nn0olJ46lk1m8q8K8M3J3O9l4r1k8j2J8
$$ 27 -10 -111 -43 9 83 37 3 -45 -92 -24 -39 31 20 15 -35 -41 -44 102 99 78 30 -58 -30 13 26 95 61 -30 -58 -70 -52
8012e2O3Q6j7j05o7K9J3J52L2o3l3j46l7N2R0J24r8J0q2j23O3R7R6K6j05K3j27
$$ -52 11 97 80 -25 -92 -63 -50 102 134 71 38 -108 -145 -93 -3 121 23 33 -49 -172 -109 -12 84 110 5 28 -99
8039i9nJ60KL5Jj12n5n4Q3L3L0M1j04JlK5O3N2n3L4n8q1J06N3p4j3j13J7ON0J04
$$ -99 -104 56 58 93 94 -18 -73 -127 -44 -11 19 60 -44 -43 -46 -21 42 94 41 75 17 -64 42 95 21 8 -105 -88 -82 -32 72
8070G2Nj12n0KQ8M2kj0Kr4j8OQ4M6Q1p3j26o2p3J58J13qj7n4j07qN0J10P9n5m2
$$ 72 77 -35 -85 -83 5 47 45 35 37 -57 -75 -69 15 61 142 69 -57 -119 -192 -34 79 71 54 0 -107 -115 -65 45 124 69 27
8101B7r0j7L9L2R4l3j02m3N2n1J38m2J9jk1l8L4J7P3l5j36J5M0L5O0j3l1j25J5
$$ 27 -63 -80 -41 -9 85 52 -50 -93 -41 -92 46 4 23 22 1 -37 -3 14 87 52 -84 -69 -29 6 66 53 22 -103 -88
8130h8O7nJ02m4K8n5m9q8J54R6m9pj35n0l2J14N5O6%r8k9o5O5N6J39J5j25r0l2
$$ -88 -21 -26 76 32 60 5 -44 -132 22 118 69 62 -73 -123 -155 -41 14 80 80 -18 -47 -112 -47 9 148 163 38 -52 -84
8159h4RL0R6Ql7q0mr1J56l9O8m4N7j03M9k3M3Q7j07J7KqmL9Pj51J7l3J05R6k8
$$ -84 -75 -45 51 59 22 -58 -62 -153 3 -36 32 -12 45 -58 -9 -32 11 98 -9 8 10 2 -2 37 44 -107 -90 -123 -18 78 50
8190E0M
8191E4
$$ Imaginary data points
##PAGE= N=2
##DATA TABLE= (X++(I..I)), XYDATA
0@%%%%%%%%%Qj6J6j6K4l2M0m8N6p2Q8j05J29j60J87k14K51k96L44l92M48n15N89
$$ 0 0 0 0 0 0 0 0 0 0 8 -8 8 -8 16 -16 24 -24 32 -40 48 -57 72 -88 99 -115 136 -160 184 -208 240 -275 314
32C14o69P58q56R67j088J217j362J522j695J884k092K317k563K834l130L452l806
$$ 314 -355 403 -453 514 -574 643 -719 803 -892 992 -1100 1217 -1346 1488 -1642 1810 -1996
49a996M193m615N085n606O184o830P555q382R330j0424J1709j3246J5115j7452
$$ -1996 2197 -2418 2667 -2939 3245 -3585 3970 -4412 4918 -5506 6203 -7043 8072 -9380
63i380K0477k4558L0393l9474N5665r3137L34206J06780p18072R8780M19098p2340
$$ -9380 11097 -13461 16932 -22542 33123 -60014 274192 380972 -337100 -238320 180778 108438
75A08438m06044K08043M12829j31596m11041R4581K25483j97301k06195L71874
$$ 108438 -297606 -89563 323266 191670 -219371 -124790 100693 -96608 -302803 69071
85F9071L40867l02603m03046K01874L10084j87114k66963K21034K85649j40377
$$ 69071 409938 107335 -295711 -93837 216247 29133 -237830 -16796 268853 128476
95A28476k39182N5677N0866j39961K3517K61133J6452k60238r505K55867m8167
$$ 128476 -110706 -55029 -4163 -144124 -120607 140526 156978 -103260 -112765 143102 94935
106I4935l20083K9678L70883P2997k58666m8307J50299j05723k09162J53098K68651
$$ 94935 -225148 -195470 175413 248410 -10256 -58563 91736 -13987 -223149 -70051 198600
117A98600j23573k24702J72440J95900l01582l19600K98950M45338j39389l61720
$$ 198600 75027 -149675 22765 218665 -82917 -402517 -103567 341771 202382 -159338
127a59338R9414K48301j89448k69950K09430L11885j31605k26818J33080J06990
$$ -159338 -59924 188377 -1071 -271021 -61591 250294 118689 -108129 24951 131941
137A31941k86107j70468L44762K90372k45809k68304J90596J93536k28446j98132
$$ 131941 -154166 -324634 20128 310500 64691 -203613 -13017 180519 -47927 -246059
147b46059K36733K44977j35054j66265R2511L1911j87609k5637K38827O3479k09661
$$ -246059 -9326 235651 100597 -65668 26843 58754 -128855 -154492 84335 147814 -61847
158f1847l8294K02535r197k59070k6551K62661Q9995j57335k4435J21608o4323
$$ -61847 -100141 102394 93197 -165873 -192424 70237 160232 2897 -21538 100070 35747
169C5747j73382O1128J74893n1827j20983J22551J27159k04881k34541J47811
$$ 35747 -137635 -76507 98386 46559 -74424 48127 175286 -29595 -264136 -116325
179a16325K56858o1692j58860J05951J28386j69883j80394J38955J81822p7115
$$ -116325 140533 78841 -80019 25932 154318 -15565 -195959 -57004 124818 47703
189D7703p6941J38543L1719k53673j27796K28558J70577j49324j04066J60572
$$ 47703 -29238 109305 141024 -112649 -240445 -11887 158690 9366 -94700 65872
199F5872O0837k22109j12307J98128J44168j03272m8465J18131k1092j99155j7294
$$ 65872 126709 -95400 -207707 -9579 134589 31317 -17148 100983 79891 -119264 -136558
210a36558J99942M3806j52362L27J55726m2095k13419o493J92872L6523j17680
$$ -136558 63384 107190 -45172 -44845 110881 68786 -144633 -151126 41746 78269 -39411
221c9411K8158J22832o5509j57235M3398J38564l9200r0459J01040J11526j35213
$$ -39411 -11253 111579 46070 -111165 -67767 70797 31597 -58862 42178 153704 18491
232A8491j74349P3594J40225n5598p7220J15104R3687j37779j36083Q6975J03408
$$ 18491 -155858 -82264 57961 2363 -74857 40247 133934 -3845 -139928 -52953 50455
243E0455o0258j8882J39822L5544j85118j06639J21788Q1881q7290r949J40028
$$ 50455 -9803 -28685 111137 146681 -38437 -145076 -23288 58593 -28697 -38646 101382
254A01382Q086j87567p5310J29178O4573p0508K6801J26422l5614j74965j9037
$$ 101382 109468 -78099 -153409 -24231 40342 -30166 -3365 123057 87443 -87522 -106559
265a06559J36273J9965q6018M5721J16045o7516j67974R852J25455r803p7803
$$ -106559 29714 49679 -36339 9382 125427 57911 -110063 -100211 25244 15441 -62362
276f2362O8346J03769p9575j31678M6225J03699m3705o0457R8167Q8934j03086
$$ -62362 5984 109753 30178 -101500 -55275 48424 4719 -55738 42429 131363 28277
287B8277j16940N7376P0498p2137m1004J18058O9511j16578r4284O8401M7050
$$ 28277 -88663 -31287 39211 -32926 -73930 44128 113639 -2939 -97223 -28822 18228
298A8228p4174m42J39577M5810j29439p3942P0532J9887p5696K8608J36801M730
$$ 18228 -55946 -56388 83189 128999 -440 -74382 -3850 16037 -59659 -31051 105750 110480
310A10480j45615n4109P3105J369o5172N9968J33068k4328j40586k1457P9623
$$ 110480 -35135 -89244 -16139 -14770 -79942 -19974 113094 88766 -51820 -73277 6346
321F346j0885n2434P7570J10125n8886j32253M673O9238l6251m7466Q8420Q8084
$$ 6346 -4539 -56973 20597 130722 71836 -60417 -55744 13494 -22757 -70223 18197 106281
333A06281p8832j07826L7172O3332n1268l3484J02653P4232q4807q1559N0620
$$ 106281 27449 -80377 -43205 20127 -31141 -64625 38028 112260 27453 -54106 -3486
344c486L6940p2785k2182J06089N0010r2247n7562N5082O167q4945N814J25812
$$ -3486 33454 -39331 -61513 44576 94586 2339 -55223 -141 6026 -78919 -73105 52707
356E2707M0351r2022l6884N6925j3644q3042K9139J25860J9192r3227k7496L6307
$$ 52707 93058 1036 -35848 21077 7433 -75609 -46470 79390 98582 5355 -22141 14166
368A4166m4320p1841O3559J22952j2377r6671l975M2170n1901n7941Q5300J18896
$$ 14166 -30154 -101995 -38436 84516 72139 -24532 -28507 13663 -38238 -96179 -10879 108017
380A08017k7098r2973m9K6275n6492l3613R2346P9084o0852p4308L0121J8599
$$ 108017 80919 -12054 -12103 14172 -42320 -75933 16413 95497 34645 -39663 -9542 9057
392I057p5595k2754J11469P5138o9332o4764M0961J9951o5853j2710R0530M0329
$$ 9057 -66538 -89292 22177 97315 27983 -36781 4180 24131 -41722 -54432 36098 76427
404G6427o3093k6593M2068k4421q8113J2902J09937K3892p6745j1139O0825k1271
$$ 76427 13334 -13259 28809 4388 -83725 -70823 39114 63006 -13739 -24878 35947 14676
416A4676q8936R879J00404L0110m4138J958K0439o3916p1406N2170R2969j4580
$$ 14676 -74260 -64381 36023 66133 21995 23953 44392 -19524 -90930 -38760 54209 39629
428C9629n5450L0510L3533q1926q4368O2909J13466M808m9136Q495M159o8550
$$ 39629 -15821 14689 48222 -33704 -118072 -55163 58303 63111 13975 22470 26629 -41921
440d1921l4237P6048O3859l5526k6690M2604j2780j08286l5631J08100Q1392m8568
$$ -41921 -76158 -110 63749 28223 1533 44137 31357 -76929 -112560 -4460 76932 28364
452B8364n0139L2639Q743o3578j6767P0352L8105k9000L646L3868m5991q9765
$$ 28364 -21775 10864 19607 -43971 -60738 9614 47719 18719 22365 56233 10242 -79523
464g9523J7457R8851J2792p0547j088O4074j5209q6283j2528O7635L1073j0252
$$ -79523 -62066 36785 49577 -20970 -22058 42016 26807 -59476 -72004 -4369 26704 16452
476A6452K2350J4917o1399n6468M2387N6535k9439k9346O2441M4470q4657r9509
$$ 16452 38802 53719 -7680 -64148 -21761 34774 5335 -24011 38430 82900 -1757 -101266
488a01266K7942Q3670J4885j3709K5671J097o5630l4187M7847L1477k3883K1007
$$ -101266 -73324 10346 25231 11522 37193 38290 -27340 -61527 -13680 17797 -6086 14921
500A4921P3676j8075j26516n4123Q6803P1752l2179k6713L8227L211o6969k9500
$$ 14921 88597 70522 -55994 -110117 -23314 48438 16259 -10454 27773 30984 -35985 -65485
512f5485M4114K7874m146L5630M0612n5632r4368J4169Q9929R279o2825N035O6045
$$ -65485 -21371 6503 2357 37987 78599 22967 -71401 -57232 32697 41976 -20849 -15814 50231
525E0231p759q1147k8978M0937K5005M076K9775J3996m9831l9963L6224L2294
$$ 50231 42472 -38675 -67653 -26716 -1711 2365 32140 46136 -3695 -43658 -7434 24860
537B4860m0651k1755P2796N8630o1423r1433j54M6388P760J271L4282Q111m5986
$$ 24860 -15791 -37546 35250 93880 32457 -58976 -59130 -12742 -4982 -3711 30571 38682 -7304
550g304k5409J9750o941k9141M5428R6617j174j10378n7660N2904M1448k5694
$$ -7304 -32713 -12963 -19904 -49045 -3617 93000 91826 -18552 -76212 -23308 18140 -7554
562g554q71N0931O375o0276l5654J2732L52K081O1274N6617n0330r1377O617P0632
$$ -7554 -8425 42506 48881 -11395 -47049 -34317 -33965 -31884 29390 86007 35677 -55700 -49083 21549
576B1549N70m9903K0366O8971n505p3586l2057K2115R868M825L5814J7919m3369
$$ 21549 22119 -27784 -7418 61553 56048 -17538 -49595 -27480 -17612 -12787 23027 40946 -2423
589b423l3712L2253K2420m4437k3112O7911O3179l7042o9286o194K2791p242j960
$$ -2423 -36135 -3882 18538 -25899 -49011 18900 82079 45037 -24249 -30443 -7652 -14894 -16854
602a6854L3553J6362k5518j3864O787k8680m2031L6702R3000J9932p0680m2339
$$ -16854 16699 33061 7543 -6321 466 -28214 -70245 -33543 59457 79389 8709 -33630
614c3630K5577Q572k9471J0468N7049J7510l7955k7907j0401k9681r427O3445
$$ -33630 -8053 519 -28952 -18484 38565 56075 18120 -9787 -20188 -49869 -59296 4149
626D149O5295k9215o9496J10L8471j6697l6439L5820O8503j680n5114k3621M383
$$ 4149 69444 40229 -29267 -29157 9314 -7383 -43822 -8002 60501 58821 3707 -19914 -15531
639a5531j1967J008M3944K5227l7424l1744K4411J2531m4527k0467N9202N4907
$$ -15531 -27498 -26490 17454 42681 5257 -26487 -2076 10455 -34072 -54539 4663 59570
651E9570k4411m3718L158R955k1643o522L4123J9571j7786n529J0727k9140n1222
$$ 59570 35159 -8559 -5401 4554 -17089 -23611 10512 30083 12297 6768 17495 -11645 -62867
664f2867J2950P0586K7006l5962j8004J7215j1825l9125P219N3204K4803j5360
$$ -62867 -49917 20669 47675 11713 -6291 10924 -901 -40026 -32807 20397 45200 29840
676B9840q919j0171m3521l0231M1383N9947m126l7168J000J1081l4573l3195L6780
$$ 29840 20921 10750 -32771 -63002 -21619 38328 34202 -2966 -1966 9115 -25458 -58653 -21873
689b1873O1700O559k8760q425o939l1876q633M4532L3954k1774k3486J3352k621
$$ -21873 39827 46386 17626 9201 2262 -29614 -38247 6285 40239 18465 -5021 8331 5710
702E710m4199j5346M9010M0553j6912k1016J1629j242l1626n143L7079J9248j6129
$$ 5710 -38489 -53835 -4825 35728 18816 -2200 9429 8187 -23439 -28582 8497 27745 11616
715A1616m07J7356k0963m8855k358M4727J8009j8092K990J9814k0152m4205J329
$$ 11616 11209 28565 7602 -41253 -43611 1116 19125 1033 4023 23837 3685 -40520 -39191
728c9191M1696J8837m511J2598P397l9278m4372J4293M3264Q459j0213J2445K715
$$ -39191 2505 21342 16831 29429 36826 -2452 -46824 -32531 10733 19192 8979 21424 24139
741B4139m4148l9273K3240M6220J0205m745J2334n539m4078k4454L3237L7897
$$ 24139 -20009 -59282 -36042 10178 20383 15638 27972 22433 -21645 -46099 -12862 25035
753B5035k320p271J1478j1928m6274j7757L5430K9070q327k875J6061j1105l9576
$$ 25035 22715 15444 26922 14994 -31280 -49037 -13607 15463 7136 4261 20322 9217 -30359
766c0359o481L6504J9829j1086M394J9559j4935m0544o013K7601P507j1091J3310
$$ -30359 -36840 -336 19493 8407 12801 32360 17425 -23119 -29132 -1531 5976 -5115 8195
779H195K0783k1446m0946q39K7382N623l414K4941K2454k6787m2339m59K3700
$$ 8195 28978 7532 -33414 -34253 -6871 -1248 -4662 20279 42733 15946 -26393 -26852 -3152
792c152M682L162K6143R440l9821m1109O091K3199L398R415L0848M419m4086l4836
$$ -3152 1530 4692 30835 40275 454 -40655 -34564 -11365 -7967 1448 32296 36715 -7371 -42207
806d2207J5594K7320N451J0914K4231p184m5882k5957J8132J7960j185J2088K2592
$$ -42207 -26613 707 6158 17072 41303 34119 -11763 -37720 -19588 -1628 -2813 9275 31867
819C1867j3787m4365j3789K5867J5473m013J4010K3752j2203l7075p861J9774
$$ 31867 18080 -26285 -40074 -14207 1266 -2747 11263 35015 22812 -14263 -22124 -2350
831b350L947o765J6787K0493j7986l4576l293J4327m957m574K7532K6489j7484
$$ -2350 1597 -5168 11619 32112 14126 -20450 -23743 -9416 -14373 -18947 8585 35074 17590
844A7590l2435j834J1166n668K094L1950K1578k3797l3729n747K017p840J1643
$$ 17590 -14845 -16679 -5513 -11181 -9087 22863 44441 20644 -13085 -18832 -16815 -24655 -13012
857a3012L7782J3949l2307l0955J832N602m445J8249M0507R535l5657l0288J142
$$ -13012 24770 38719 6412 -24543 -22711 -17109 -21554 -3305 37202 46737 11080 -19208 -18066
870a8066M354m84K0445L0006o028l7201j8528O897r69l238K5855L3389q279l6657
$$ -18066 -13712 -14196 6249 36255 30227 -6974 -25502 -18605 -19574 -22812 3043 36432 28153 -8504
884h504j1962J3498J948m045J8892K2824r644k6121o760J502j2492k397K8687
$$ -8504 -20466 -6968 -5020 -9065 9827 32651 23007 -3114 -9874 -8372 -20864 -23261 5426
897E426K3119j6490k4540L380P231j5096o762K8833K9585o235k1142q688r089
$$ 5426 28545 12055 -12485 -9105 -1874 -16970 -23732 5101 34686 28451 7309 -1379 -10468
910a0468j5211P446L2532J5001j7649j4629R58j3128k4718R646M6279K6059j8259
$$ -10468 -25679 -18233 14299 29300 11651 -2978 -2020 -15148 -39866 -30220 16059 42118 23859
923B3859k5048p540p206p058J6972L0833O860j6799j1092q276k3609j3523L0080
$$ 23859 -1189 -8729 -15935 -22993 -6021 24812 31672 14873 3781 -4495 -28104 -41627 -11547
936a1547M2895M16l1815j4309N906m297p452J7066K6893L872j2898q190j1546
$$ -11547 31348 31764 -51 -14360 -8454 -12751 -20203 -3137 23756 27628 14730 6540 -5006
949e006k0000L86L1705K0594j7611k0081P897O409k1232j6036K1134L1056N423
$$ -5006 -25006 -24620 7085 27679 10068 -10013 -2116 4293 -16939 -32975 -11841 19215 24638
962B4638j0344p066j1501j5159M551K2433Q138q796L379J0676j8817l9619n896
$$ 24638 14294 7228 -4273 -19432 -14881 7552 15690 6894 10273 20949 2132 -37487 -43383
975d3383L8121L0724m275j3658n314j0765j4065M782K0619J3039N523P781r016
$$ -43383 -5262 25462 21187 7529 2215 -8550 -22615 -17833 2786 15825 21348 29129 20113
988B0113l8362k8194K2253M3065Q841k0252q860K351j2806j7389P555K5535J6503
$$ 20113 -18249 -46443 -24190 18875 27716 7464 -1396 955 -11851 -29240 -21685 3850 20353
1001B0353M313k579j9218k8716j915L1885K0973j4204j4100J1429N176k5414k3011
$$ 20353 24666 22087 2869 -25847 -27762 4123 25096 10892 -3208 8221 13397 -12017 -35028
1014c5028J2931K7984J0762l176m887j1341j2788M408J5119P57o900J3654K1342
$$ -35028 -22097 5887 16649 13473 8586 -2755 -15543 -11135 3984 4741 -2159 11495 32837
1027C2837j3414m1483j6056K4430K4248L46m296J848o596j5477o449N123P734
$$ 32837 19423 -22060 -38116 -13686 10562 10908 6612 8460 1864 -13613 -20062 -14939 -7205
1040g205J6451K4997K382l6428l5281Q591L1614R944p822L164O187j5608k6136
$$ -7205 9246 34243 36625 197 -35084 -26493 5121 15065 7243 10407 16594 986 -25150
1053b5150o390J4823J9295J8199R312j6869l2987q904K4236J8331p684l500J6635
$$ -25150 -31540 -16717 2578 20777 30089 13220 -19767 -28671 -4435 13896 6212 2712 19347
1066A9347M788k7191k6655N394K1409J1720L105j293j1484j3847K823J1558k614
$$ 19347 24135 -3056 -29711 -24317 -2908 8812 11917 10624 -860 -14707 -11884 -326 -2940
1079b940o870J6072K5433o084l3819j6472J4535J4184j359N17P592j482j2528
$$ -2940 -9810 6262 31695 25611 -8208 -24680 -10145 4039 2680 3197 10789 9307 -3221
1092c221r901n322k877J2611K9772J4452k2875l0336j137J5849L414j585J3662
$$ -3221 -13122 -18444 -21321 -8710 21062 35514 12639 -17697 -18834 -2985 429 -1156 12506
1105A2506J4433j0113k5953j5908P6J0231K1013K0200n407k7799j5209J0185R155
$$ 12506 26939 16826 -9127 -25035 -24959 -14728 6285 26485 21078 -6721 -21930 -11745 -2590
1118b590l701O629K3200P735k3451k5651k292J0972R350R694O241r413j6563k834
$$ -2590 -6291 338 23538 31273 7822 -17829 -20121 -9149 201 9895 16136 6723 -9840 -12674
1132a2674O557l721n115J5767K3711k329k4502j1705Q656N953k464M623J0358
$$ -12674 -6117 -9838 -14953 814 24525 22196 -2306 -14011 -5355 598 -1866 2757 13115
1145A3115l58r896o955o739j0216K524K3381J8310r587j9041k984M101n414j823
$$ 13115 12757 2861 -4094 -10833 -21049 -18525 4856 23166 13579 -5462 -8446 -4345 -9759 -11582
1159a1582J7419J9461k027j7034j4021r428m048J2435K3338P729j5541j4767j843
$$ -11582 5837 25298 23271 6237 -7784 -17212 -21260 -8825 14513 22242 6701 -8066 -9909
1172i909l068o804R657K6317J3117j3878j9259p130j277K008J3210J5957j340
$$ -9909 -12977 -19781 -10124 16193 29310 15432 -3827 -10957 -12234 -10226 2984 18941 17601
1185A7601j5567r084j268o507m085J4690K1050M24j6489q237K607j008j815R953
$$ 17601 2034 -7050 -8318 -14825 -18910 -4220 16830 17254 765 -7472 -4865 -5873 -7688 2265
1199B265J3191p14r022l780m091j1303m019J4541J5110k715r369j073j905j0944
$$ 2265 15456 14742 5720 1940 -2151 -13454 -17473 -2932 12178 9463 94 -979 -2884 -13828
1213a3828l890J5307J7589K249n865m579r981j4035O73J8761J4136l093p672n104
$$ -13828 -17718 -2411 15178 17427 11562 6983 -2998 -17033 -16360 2401 16537 13444 5772 668
1227F68j1493j3773M476K2612J5561k819p956o401j1151q892J0051K1751R030
$$ 668 -10825 -24598 -20122 2490 18051 15232 7276 875 -10276 -19168 -9117 12634 21664
1240B1664p681q823o746j2070p729J1213J9247M930q168n850l754r111l942J3128
$$ 21664 13983 5160 -1586 -13656 -21385 -10172 9075 14005 5837 -13 -3767 -12878 -16820 -3692
1254c692J6744J842o824k012k756j0940o305R559J2204K77m135K34m368j2930
$$ -3692 13052 14894 8070 6058 3302 -7638 -13943 -4384 7820 8097 3962 4196 -172 -13102
1268a3102n414J0995J2197K236J089M032n673j6060o470J1374J2902L435R45m60
$$ -13102 -18516 -7521 4676 6912 8001 12033 6360 -9700 -16170 -4796 8106 11541 12486 12026
1282A2026j1743j7920l959J3064J2421M486L418q36j4369j7103J651J8160J3582
$$ 12026 283 -17637 -21596 -8532 3889 8375 11793 10957 -3412 -20515 -18864 -704 12878
1295A2878K724L7m573j5633j4567L634J5650R261R62m21o363j5961r925R274J6202
$$ 12878 15602 15639 11066 -4567 -19134 -15500 150 9411 10373 9952 3589 -12372 -22297 -13023 3179
1310C179O093k86J790l212j3096q445P560J1703K975m12J803m900j3456p060O366
$$ 3179 9272 8986 10776 7564 -5532 -13977 -6417 5286 8261 7849 9652 4752 -8704 -15764 -9398
1325i398P402J533M158P307l040j4119p381O554P878L109O021O892n757j6526
$$ -9398 -1996 -463 3695 11002 7962 -6157 -13538 -6984 894 4003 10024 16916 11159 -5367
1339e367r500L430O250N723R540N359j0735j7954n575P698Q350P547J0967M748
$$ -5367 -14867 -11437 -5187 536 10076 15435 4700 -13254 -18829 -11131 -2781 4766 15733 20481
1353B0481j2971j8913n020Q650R337P352O950k090j5647j4872m65Q109O588P801
$$ 20481 7510 -11403 -16423 -7773 1564 8916 15866 13776 -1871 -16743 -17208 -9099 -2511 5290
1367E290R332j435j5880j2371M237J0379M901L630N570k023j2346r707N94L563
$$ 5290 14622 13187 -2693 -15064 -10827 -448 4453 8083 13653 11630 -716 -10423 -9829 -6266
1381f266K709O984P578l920j2934n405M682K741n61O995J2057J016j2089j0427
$$ -6266 -3557 3427 11005 7085 -5849 -11254 -6572 -3831 -4392 2603 14660 15676 3587 -6840
1395f840j824J365L860R673P744m895j1809o428k038k792L878J6431J4121n446
$$ -6840 -8664 -7299 -3439 6234 13978 9083 -2726 -9154 -11192 -13984 -10106 6325 20446 15000
1409A5000j7332r593J418M348P041J1088N976p054j2742q513m373L68J1288J6958
$$ 15000 -2332 -11925 -10507 -6159 882 11970 17946 10892 -1850 -10363 -14736 -14368 -3080 13878
1423A3878L890j4648j4681q87N426K564N414J0633M970p621j1397o263j526L899
$$ 13878 17768 3120 -11561 -12448 -7022 -4458 956 11589 16559 8938 -2459 -8722 -10248 -6349
1437f349J0726Q909m587j2199m310L246j723m681N820J4339N695q038r417l493
$$ -6349 4377 13286 8699 -3500 -7810 -4564 -6287 -10968 -5148 9191 14886 6848 -2569 -6062
1451f062l56K420P206O307j124l817j682n719j1865l647J4363J7447J029j1604
$$ -6062 -6418 -3998 3208 9515 8391 4574 2892 -2827 -14692 -18339 -3976 13471 14500 2896
1465B896q158k016j626J168Q806J0636L728l690q892j3097q732P814J9229R258
$$ 2896 -5262 -7278 -8904 -7736 1070 11706 15434 11744 2852 -10245 -18977 -11163 8066 17324
1479A7324q873j1842l296j337m093J955J2705J2149L90q982j0907p638J766J2553
$$ 17324 8451 -3391 -6687 -8024 -12117 -10162 2543 14692 15082 6100 -4807 -12445 -10679 1874
1493A874J1270k046r421k946J158n953q358L995J4669Q060m995q483m387j123
$$ 1874 13144 11098 1677 -1269 -111 -6064 -14422 -10427 4242 12302 7307 -1176 -5563 -6686
1507f686K108N556M030l2J323L653m121j4371q583R279J4736K976o471l939j118
$$ -6686 -4578 978 5008 4976 6299 9952 5831 -8540 -17123 -7844 6892 9868 3397 -542 -1660
1522a660m588m665K536Q777R040N632k437j3367j4275R94J4925J0434k269m832
$$ -1660 -6248 -10913 -8377 400 9440 15072 12635 -732 -15007 -14013 912 11346 9077 4245
1536D245r76m513j0904n045Q921J4428P841k192r947j1939l830R092J1798K519
$$ 4245 3269 -1244 -12148 -17193 -8272 6156 13997 11805 1858 -10081 -13911 -4819 6979 9498
1550I498l334M61K02r218j1825J120J3096R595j363o490n720l682M43M643L557
$$ 9498 6164 6625 6827 -2391 -14216 -13096 0 9595 8232 1742 -3978 -7660 -7217 -2574 983
1565I83N93L348O083j717j2437r014N683J0570K184l467n19L96m703o669j943
$$ 983 1576 4924 11007 9290 -3147 -12161 -6478 4092 6276 2809 2290 2686 -2017 -8686 -10629
1580a0629L702P296R084L997q028j3287l701Q080P188R28J756M259l092j2678
$$ -10629 -6927 369 9453 13450 5422 -7865 -11566 -3486 3702 4630 6386 10645 7553 -5125
1594e125j0163K197J0322R852M638l898j1162q800J984P816M664K746N663K109
$$ -5125 -15288 -13091 -2769 7083 11721 7823 -3339 -12139 -10155 -2339 2325 5071 10734 12843
1608A2843r459j3621k820R084R380K935j630m968p001l892K092L438K066M528
$$ 12843 3384 -10237 -13057 -3973 5407 8342 6712 1744 -5257 -9149 -7057 -3619 -1553 2975
1622B975O577o00j0128p722L368P528K195o45J500M21m628o013k592L26K939P196
$$ 2975 9552 8952 -1176 -8898 -5530 1998 4193 3548 5048 5469 841 -5172 -7764 -7438 -4499 2697
1638B697O327k685r208m663K637K708Q35M995P790M43r442r800k773L039O349
$$ 2697 9024 6339 -2869 -7532 -4895 -2187 -1352 3643 11433 11876 2434 -7366 -10139 -7100 -751
1653g51P940L332o084r876m405J149K176N063R645O146n945j2271n933K780N815
$$ -751 7189 10521 4437 -5439 -9844 -8695 -6519 -1456 8189 14335 8390 -3881 -9814 -7034 -1219
1668a219N850N200l09p712q282k528J385K479N604P362Q88q077p672L04M253K759
$$ -1219 4631 9831 9522 1810 -6472 -9000 -7615 -5136 468 7830 8718 641 -7031 -6727 -2474 285
1684B85L163M316M43n407n432j829n11L38M492N828m0n867m274l35n19j27N072
$$ 285 3448 7764 8207 2800 -2632 -4461 -4972 -4634 -142 5686 5646 -221 -4495 -4830 -5349 -5476 -404
1701d04Q070K377m673n744l541k484R84P145P415k41o635o246l965k615K515R455
$$ -404 7666 10043 5370 -374 -3915 -6399 -5415 1730 9145 8904 2269 -3977 -7942 -10557 -8042 1413
1717A413Q649m81p305o262l216m10M873R702O011l749q484o023k864l06M937Q664
$$ 1413 10062 9581 2276 -3986 -7202 -7612 -2739 6963 12974 9225 741 -5282 -8146 -8452 -3515 5149
1733E149L997m652p366l746r77J313N796P926K504m805n449k167j347p24L574
$$ 5149 9146 4494 -2872 -6618 -7595 -6282 -486 7440 9944 5139 -310 -2477 -3824 -4548 -974
1748i74O090J549m000m265k291k467j069M150O543K568j686j733k141m518k509
$$ -974 5116 6665 2665 -1600 -3891 -6358 -7427 -3277 3266 5834 4148 2415 274 -4244 -6753
1763f753M603P808L099k299l790m826n952j995N647Q071L381j534l527n847n998
$$ -6753 -2150 5658 8757 6458 2668 -2158 -8110 -10105 -4458 3613 6994 5460 1933 -3914 -9912
1778i912N71R028R299J885l713n088n956n094J395Q132P244K86m487n602n992
$$ -9912 -9341 -313 8986 10871 7158 2070 -3886 -8980 -7585 547 7791 8077 3590 -2012 -8004
1793h004l173M292R248N604j155l460l198m129k659L313P367L951j906l551l459
$$ -8004 -11177 -6885 2363 7967 6812 3352 154 -3975 -6634 -3321 4046 7997 6091 2540 -919
1808i19m203k547K606N448K639q3r0j516m840l382K749O136L383O62Nk381o204
$$ -919 -5122 -7669 -5063 385 3024 2941 2851 1335 -3505 -6887 -4138 1998 5381 6043 6048 3667 -2537
1825b537n004J359N327M165K100J7m687p749l611M137P144M836K496q3n380q415
$$ -2537 -7541 -6182 -855 3310 5410 5427 740 -7009 -10620 -6483 661 5497 7993 7910 2530 -5885
1841e885l546N107P735M338M09l126p151p375r49N849O599L489J107k288o690
$$ -5885 -9431 -4324 3411 7749 8158 5032 -2119 -9494 -10443 -4594 2005 5494 6601 4313 -2377
1856b377o245J319P368N715J290p46k409n241m971R8M199L642J856N81k322n269
$$ -2377 -8622 -7303 65 5780 7070 6324 3915 -1326 -6297 -6199 -2000 1642 3498 4079 1757 -3512
1872c512l514J975M114K105J716K948M69m921n711r19L068L383K824J866j985
$$ -3512 -7026 -5051 -937 1168 2884 5832 6301 1380 -4331 -5250 -2182 1201 4025 5891 3906
1887C906n743m593n99J689L227N792N113j955q359o264J172N090M723L841J770
$$ 3906 -1837 -6430 -7029 -5340 -2113 3679 8792 6837 -1522 -7786 -6614 -1524 3199 7040 8810
1902H810l560p369n673m09L422N862O035J039o684q573k042M349M908L218L207
$$ 8810 5250 -2119 -7792 -8201 -4779 1083 7118 8157 1473 -7100 -9142 -4793 115 3333 6540
1917F540J271l993o914l464J843M452M441K313k374o002m054Q59K040N28J934
$$ 6540 7811 3818 -3096 -6560 -4717 -265 4176 6489 4115 -1887 -5941 -5082 -3042 -2514 -580
1932e80M774K315l773n700j575K190K897K355J936k68k595k877k477k713l62N344
$$ -580 4194 6509 2736 -2964 -4539 -2349 548 2903 4839 4571 1976 -901 -3378 -6091 -6453 -1109
1948a109P179J066o001n743r32J587J867L779M929J840l439o220n210j562M262
$$ -1109 6070 7136 1135 -4608 -5540 -3953 -2086 1693 6622 8462 5023 -1197 -6407 -7969 -3707
1963c707Q159M624l721p663m018K03R37K041N632N600m16o387o289j727L121O051
$$ -3707 4452 9076 5355 -2308 -6326 -6123 -5186 -3145 2487 8087 7671 1284 -5005 -6732 -3611 2440
1979B440M866n01n043m257q93n50j159J882N957L709l142n913k455J616K628K452
$$ 2440 7306 6805 1762 -2495 -3388 -3938 -5097 -3215 2742 6451 3309 -2604 -5059 -3443 -815 1637
1995A637J777M48n81o58k134m306k527L423O642J876l783l901q51m87j228J202
$$ 1637 3414 3862 3281 2623 489 -3817 -6344 -2921 3721 5597 1814 -2087 -2938 -3425 -4653 -3451
2011c451M788M754J049l142n924m882Q27O702N910k12m075k933k314l362j453
$$ -3451 1337 6091 7140 3998 -1926 -6808 -5981 721 6631 6419 2344 -589 -2903 -6265 -7718
2026g718M625P667L412l234o316m674l52M635O186K622j837k675j911l284l595
$$ -7718 -3093 4574 7986 4752 -1564 -6238 -6590 -1955 4231 6853 5016 2341 430 -2854 -6449
2041f449J141O413N251j586n446l778n11J513K460K687J329M03J35j537m147k837
$$ -6449 -5308 1105 6356 4770 -676 -4454 -4965 -3452 -992 1695 3024 3427 3562 2025 -2122 -4959
2057d959K457N350J867k504k387m93j179k478o79K740M257K816l9l546n132j654
$$ -4959 -2502 2848 4715 2211 -176 -669 -1848 -4326 -5005 -2265 1992 4808 4769 1223 -3909 -5563
2073e563L622M840J567l72j98j870n282m429J658O216M942M54l321n224l707Q22
$$ -5563 -1941 2899 4466 4094 3896 2026 -3256 -7685 -6027 189 5131 5585 2264 -2960 -6667 -5845
2089e845M707M313J768L98r48m325n582j032N264O012J200k903l876l181j532
$$ -5845 -1138 3175 4943 5341 4393 68 -5514 -6546 -1282 4730 5930 3027 -849 -4030 -5562
2104e562J259L233K791J482N70j338m028l095J709M757K430r27j292p31j788k709
$$ -5562 -4303 -1070 1721 3203 3773 2435 -1593 -4688 -2979 1778 4208 3281 1989 1258 -530 -3239
2120c239r68J506K472K336J181j431l856k456J344K880J769J420J990k12m258
$$ -3239 -4207 -2701 -229 2107 3288 1857 -1999 -4455 -3111 -231 1538 2958 4948 4736 478
2135D78m887q74K948L854K685K91l078m995k791J237L262L390L278J483l082n963
$$ 478 -4409 -5283 -2335 1519 4204 4495 1417 -3578 -6369 -5132 -1870 1520 4798 6281 3199 -2764
2151b764l269K266M739L510J094j281m156m721j507K118L312K857J868o06m085
$$ -2764 -6033 -3767 972 4482 5576 4295 139 -4582 -6089 -3971 -659 2198 4066 3460 -625
$$ [...]
8191b1
##END NTUPLES=NMR FID
##END=
