##TITLE=1H_ES-AkrN
 CDCl3
 8 sc, 
 4.7.2023
##JCAMPDX= 6.0         $$ Bruker NMR JCAMP-DX V2.0
##DATA TYPE= NMR FID
##DATA CLASS= NTUPLES
##ORIGIN= UXNMR, Bruker Analytische Messtechnik GmbH
##OWNER= root
$$ XWIN-NMR		Version 3.5
$$ Tue Jul  4 14:39:55 2023 Russian Standard Time (UT+4h)  she@DPX200
##.OBSERVE FREQUENCY= 200.13135
##.OBSERVE NUCLEUS= ^1H
##.DELAY= (6, 6)
##.ACQUISITION MODE= SIMULTANEOUS
##.ACQUISITION SCHEME= undefined
##.AVERAGES= 8
##.DIGITISER RES= 18
##SPECTROMETER/DATA SYSTEM= spect
##.PULSE SEQUENCE= zg30
##.SOLVENT NAME= CDCl3
##.SHIFT REFERENCE= (INTERNAL, CDCl3, 0, 15.7039)
##AUDIT TRAIL= $$ (NUMBER, WHEN, WHO, WHERE, WHAT)
$$ ##TITLE= Audit trail, XWIN-NMR		Version 3.5
$$ ##JCAMPDX= 5.01
$$ ##ORIGIN= Bruker BioSpin GmbH
$$ ##OWNER= she
$$ F:/spectra/data/she/nmr/H-F/1/audita.txt
$$ ##AUDIT TRAIL=  $$ (NUMBER, WHEN, WHO, WHERE, WHAT)
(   1,<2023-07-04 14:38:35.93 +0400>,<she>,<DPX200>,
      <created by zg, POWCHK disabled, PULCHK disabled
       configuration hash MD5:
       00 E9 B6 7A A2 85 ED C7 34 08 36 98 17 FE 4E 26
       data hash MD5: 16K
       E4 41 6D 9A C0 B5 F7 96 FE E2 3D 73 61 03 EB 28>)
$$ ##END=
$$ 
$$ hash MD5
$$ B4 EB 67 3B 61 61 63 DE 18 B8 65 17 85 BE 5E 89
##$RELAX= 
##$RELAX= 
##$RELAX= 
##$RELAX= 
##$RELAX= 
##$RELAX= 
$$ Bruker specific parameters
$$ --------------------------
##$DU= <F:/spectra>
##$EXPNO= 1
##$NAME= <H-F>
##$PROCNO= 1
##$TYPE= <nmr>
##$USER= <she>
##$AMP= (0..31)
100 100 100 100 100 100 100 100 100 100 100 100 100 100 100 100 100 100 
100 100 100 100 100 100 100 100 100 100 100 100 100 100 
##$AQSEQ= 0
##$AQ_mod= 1
##$AUNM= <au_zg>
##$AUTOPOS= <>
##$BF1= 200.13
##$BF2= 200.13
##$BF3= 200.13
##$BF4= 200.13
##$BF5= 200.13
##$BF6= 200.13
##$BF7= 200.13
##$BF8= 200.13
##$BYTORDA= 1
##$CFDGTYP= 0
##$CFRGTYP= 5
##$CHEMSTR= <none>
##$CNST= (0..31)
1 1 145 1 1 1 1 1 1 1 1 1 1 1 1 1 1 1 1 1 1 1 1 1 1 1 1 1 1 1 1 1 
##$CPDPRG= <>
##$CPDPRG1= <>
##$CPDPRG2= <>
##$CPDPRG3= <>
##$CPDPRG4= <mlev>
##$CPDPRG5= <mlev>
##$CPDPRG6= <mlev>
##$CPDPRG7= <mlev>
##$CPDPRG8= <mlev>
##$CPDPRGB= <>
##$CPDPRGT= <>
##$D= (0..31)
0 1.2 0 0 0 0 0 0 0 0.06 0 0.03 0 0 0 0 0.0002 0 0 0 0 0 0 0 0 0 0 0 0 
0 0 0 
##$DATE= 1688467115
##$DBL= (0..7)
120 120 120 120 120 120 120 120 
##$DBP= (0..7)
150 150 150 150 150 150 150 150 
##$DBP07= 0
##$DBPNAM0= <>
##$DBPNAM1= <>
##$DBPNAM2= <>
##$DBPNAM3= <>
##$DBPNAM4= <>
##$DBPNAM5= <>
##$DBPNAM6= <>
##$DBPNAM7= <>
##$DBPOAL= (0..7)
0.5 0.5 0.5 0.5 0.5 0.5 0.5 0.5 
##$DBPOFFS= (0..7)
0 0 0 0 0 0 0 0 
##$DE= 6
##$DECBNUC= <off>
##$DECIM= 32
##$DECNUC= <off>
##$DECSTAT= 4
##$DIGMOD= 1
##$DIGTYP= 9
##$DL= (0..7)
0 120 120 120 120 120 120 120 
##$DP= (0..7)
150 150 150 150 150 150 150 150 
##$DP07= 0
##$DPNAME0= <>
##$DPNAME1= <>
##$DPNAME2= <>
##$DPNAME3= <>
##$DPNAME4= <>
##$DPNAME5= <>
##$DPNAME6= <>
##$DPNAME7= <>
##$DPOAL= (0..7)
0.5 0.5 0.5 0.5 0.5 0.5 0.5 0.5 
##$DPOFFS= (0..7)
0 0 0 0 0 0 0 0 
##$DQDMODE= 0
##$DR= 18
##$DS= 0
##$DSLIST= <SSSSSSSSSSSSSSS>
$$ [...]
##$SUBNAM2= <"">
##$SUBNAM3= <"">
##$SUBNAM4= <"">
##$SUBNAM5= <"">
##$SUBNAM6= <"">
##$SUBNAM7= <"">
##$SUBNAM8= <"">
##$SUBNAM9= <"">
##$SW= 18.05172834244
##$SWIBOX= (0..15)
0 0 2 0 0 0 0 0 0 0 0 0 0 0 0 0 
##$SW_h= 3612.71676300578
##$TD= 16384
##$TD0= 1
##$TE= 0
##$TE2= 300
##$TE3= 300
##$TEG= 300
##$TL= (0..7)
0 120 120 120 120 120 120 120 
##$TP= (0..7)
150 150 150 150 150 150 150 150 
##$TP07= 0
##$TPNAME0= <>
##$TPNAME1= <>
##$TPNAME2= <>
##$TPNAME3= <>
##$TPNAME4= <>
##$TPNAME5= <>
##$TPNAME6= <>
##$TPNAME7= <>
##$TPOAL= (0..7)
0.5 0.5 0.5 0.5 0.5 0.5 0.5 0.5 
##$TPOFFS= (0..7)
0 0 0 0 0 0 0 0 
##$TUNHIN= 0
##$TUNHOUT= 0
##$TUNXOUT= 0
##$USERA1= <user>
##$USERA2= <user>
##$USERA3= <user>
##$USERA4= <user>
##$USERA5= <user>
##$V9= 5
##$VALIST= <valist>
##$VCLIST= <CCCCCCCCCCCCCCC>
##$VD= 0
##$VDLIST= <DDDDDDDDDDDDDDD>
##$VPLIST= <PPPPPPPPPPPPPPP>
##$VTLIST= <TTTTTTTTTTTTTTT>
##$WBST= 1024
##$WBSW= 4
##$XGAIN= (0..3)
0 0 0 0 
##$XL= 0
##$YL= 0
##$YMAX_a= 538653
##$YMIN_a= -563410
##$ZGOPTNS= <>
##$ZL1= 120
##$ZL2= 120
##$ZL3= 120
##$ZL4= 120
##$ABSF1= 10
##$ABSF2= 0
##$ABSG= 5
##$ABSL= 3
##$ALPHA= 0
##$AQORDER= 0
##$ASSFAC= 0
##$ASSFACI= 0
##$ASSFACX= 0
##$ASSWID= 0
##$AUNMP= <proc_1d>
##$AZFE= 0.1
##$AZFW= 0.1
##$BCFW= 1
##$BC_mod= 2
##$BYTORDP= 1
##$COROFFS= 0
##$CY= 11.3945322036743
##$DATMOD= 1
##$DC= 2
##$DFILT= <>
##$DTYPP= 0
##$F1P= 15.7292609196834
##$F2P= 12.9074282941183
##$FCOR= 0.5
##$FTSIZE= 0
##$FT_mod= 4
##$GAMMA= 1
##$GB= 0.15
##$INTBC= 1
##$INTSCL= 1
##$ISEN= 128
##$LB= 0.24
##$LEV0= 0
##$LPBIN= 0
##$MAXI= 10000
##$MC2= 0
##$MEAN= 0
##$ME_mod= 0
##$MI= 1.114404
##$NCOEF= 0
##$NC_proc= 0
##$NLEV= 6
##$NOISF1= 3.799351
##$NOISF2= 2.8
##$NSP= 1
##$NTH_PI= 0
##$NZP= 0
##$OFFSET= 15.70392
##$PC= 1
##$PHC0= -20788.28
##$PHC1= 9.65272
##$PH_mod= 1
##$PKNL= yes
##$PPARMOD= 0
##$PSCAL= 0
##$PSIGN= 0
##$REVERSE= no
##$SF= 200.130013532006
##$SI= 16384
##$SIGF1= 3
##$SIGF2= 2
##$SINO= 400
##$SIOLD= 16384
##$SREGLST= <1H.CDCl3>
##$SSB= 0
##$STSI= 0
##$STSR= 0
##$SW_p= 3612.71676300578
##$SYMM= 0
##$S_DEV= 0
##$TDeff= 0
##$TDoff= 0
##$TI= <>
##$TILT= no
##$TM1= 0
##$TM2= 0
##$TOPLEV= 0
##$USERP1= <user>
##$USERP2= <user>
##$USERP3= <user>
##$USERP4= <user>
##$USERP5= <user>
##$WDW= 1
##$XDIM= 8192
##$YMAX_p= 0
##$YMIN_p= 0
$$ End of Bruker specific parameters
$$ ---------------------------------
##NTUPLES= NMR FID
##VAR_NAME=  TIME,          FID/REAL,        FID/IMAG
##SYMBOL=    X,             R,               I
##VAR_TYPE=  INDEPENDENT,   DEPENDENT,       DEPENDENT
##VAR_FORM=  AFFN,          ASDF,            ASDF
##VAR_DIM=   8192,          8192,            8192
##UNITS=     SECONDS,       ARBITRARY UNITS, ARBITRARY UNITS
##FACTOR=    0.0002768,     1,               1
##FIRST=     0,             0,               0
##LAST=      2.2672688,     0,               0
##MIN=       0,             -563410,         0
##MAX=       2.2672688,     538653,          0
$$ Real data points
##PAGE= N=1
##DATA TABLE= (X++(R..R)), XYDATA
$$ [...]
2721c59m30J820p85j403J382m0j322J551O42k292R21K076k381j041K956n89k458
2738a752K218J031k480Q30J328k152L62K265k259j111L803q42l816K790K067m023
2754a741K60L345k009j188K775j323j969L321n06l866L049L008n060j83N152k422
2770F43l654L959N92l542K409J450l904K058L091n408l88O520l144n214O104K112
2786C684o774J553M503l949q82M072k882j359N464k773n330O567K345q689J973
2801b477P905n456m312O729j88n086L724P00m716M375K397p740K140Q391p244
2816h58n620R832R53r471L952N852o151l47M595m706K7O644n818m604J0483j32
2832D631j1907N880R026r762l528R774j920n701N049l41m473N920J88r021O037
$$ plain form
2721 -359 -789 1031 246 -1157 225 185 -1137 414 1056 -1236 -315 1761 -620 -1661 1295 706 -1752
2738 -1752 466 1497 -983 -153 1175 -977 -615 1650 -609 -1720 2083 1241 -2575 215 2282 -1741
2754 -1741 -1481 1864 -145 -1333 1442 119 -1850 1471 965 -2901 148 3156 -1904 -2087 3065 643
2770 643 -3011 948 1540 -2002 407 1857 -2047 11 3102 -2306 -2694 3826 682 -4532 1572 3684
2786 3684 -3090 -1537 2966 -983 -1865 2207 -675 -2034 3430 657 -4673 1894 4239 -4450 -2477
2801 -2477 5428 -28 -4340 2389 2201 -2885 839 1539 -3177 1198 3595 -4145 -2005 6386 -858
2816 -858 -6478 3354 4307 -5164 -1212 4640 -1511 -1858 2737 -1969 -1942 4702 -1116 -5720 4763 4631
2832 4631 -7276 -1396 7630 -2132 -5660 4114 2194 -3507 1542 1201 -3272 2648 2836 -6185 -148
2847a48Q012j1339l423J3506k705j1506P304N923q322N32N277n073J036N857p850
2862b919k575J2362m001j2135J0238Q184j3536j622J2071m342o595O768o70m309
2876c081O666j850q691R217N495j4376N87J5216p108j1142J1100M275j0575K163
2890b104N425n591K085M389q471J156J1270q295r626J3873M093j5552L003J2356
2904H011p735n875Q254j428m235O154k953o067J0057J696j4055N027J3286j1296
2918a159q333J4145J101j1595M642N392o490K180L242p701L466Q844j0169n498
2932g933J4766j115j4728P254J0150j0338l362R192k753l769N388l366l659Q972
2946D699j766j1084Q398Q796j3011l371J3804l032j0165O818M139o643K265K643
$$ plain form
2847 -148 7864 -3475 -6898 6608 3903 -7603 -299 5624 -2698 -2166 3111 -1962 -926 4931 -2919
2862 -2919 -5494 6868 2867 -9268 970 9154 -4382 -6004 6067 1725 -4870 1898 1228 -3081
2876 -3081 3585 1735 -6956 2261 7756 -6620 -6033 9183 2075 -9067 2033 6308 -4267 -2104
2890 -2104 3321 -2270 -185 4204 -4267 -3111 8159 -136 -9762 4111 8204 -7348 -4345 8011
2904 8011 276 -5599 2655 1227 -3008 3146 193 -5874 4183 5879 -8176 -3149 10137 -1159
2918 -1159 -9492 4653 5754 -5841 -1199 4193 -2297 -117 3125 -4576 -1110 7734 -2435 -7933
2932 -7933 6833 5718 -9010 -1756 8394 -1944 -5306 3886 1133 -2636 2752 -614 -4273 4699
2946 4699 2933 -8151 247 9043 -3968 -7339 6465 3433 -6732 86 4225 -2418 -153 2490
2960B490n995L628N377r333j469J2622m452j1315R551O436j1373m51Q896m263
2974C49l280N268k688k399O829k953p621Q474M427j1579P10J1255n526p461Q009
2989A814J688o537K757K371m614L154L026p266J143Q266n833o316R098K258r430
3004d421K381O574n095k289M966k235j812M781k691m105O444R99q314K913P176
3019E272o032l827P290j92n563L047J853l767K062K034m584J545M988n143k866
3034c883O788n22o373L492M158m821p65M158k157j705L216j679k113M078l58m642
3050c128L156L456n081r65N077j714l390L234J013k993J337J410k879J026K479
3065B038l140n34M004j521l410L086J507l642M45K835j775j024K200q98j358K138
$$ plain form
2960 2490 -3505 123 5500 -3833 -5302 7320 2868 -8447 1104 7540 -3833 -4284 4612 349
2974 349 -2931 2337 -351 -2750 4079 1126 -6495 1979 6406 -5173 -4463 6792 1266 -6195 1814
2989 1814 3502 -3035 -278 2093 -2521 633 3659 -3607 -2464 5802 -31 -6347 2751 5009 -4421
3004 -4421 -2040 4534 -561 -2850 2116 -119 -1931 2850 159 -3946 2498 3497 -4817 -1904 5272
3019 5272 -760 -4587 2703 2511 -3052 -5 1848 -1919 143 2177 -2407 -862 4126 -1017 -3883
3034 -3883 2905 2383 -3990 -498 3660 -1161 -1926 2232 75 -1630 1586 -93 -2206 1872 1514 -3128
3050 -3128 28 3484 -1597 -2562 2515 801 -2589 645 1658 -1335 2 1412 -1467 -441 2038
3065 2038 -1102 -1636 2368 847 -2563 523 2030 -1612 -1167 1668 -107 -1131 1069 171 -1187 951
3081I51n05k229K076J416l022L75K888j880j798K484J43k039J150J014j613M50
3097a39J266j753j72J884j036j307J953K80j988P33J373j540m34J508l56r58J295
3114F09j59j298R88M92j484M02J409j016p19J442k22j124O62O30j099K25R16p75
3132a21k23J013o62p95J065M1r52O35P18r19j82R17p00n37R49j3q09P23M41r19
3152c30J04O43o93j00Q83m03l51P45j88r81Q03L04q70m5J056m70n35Q51j56q50
3172e83O10K77p96N99N22j051J31J013o80r80J278J98j131O22N87r76K56N53p58
3191c09j26J358q10r51J556J45j766O12J163j260j18J141o79m92J102n93q83J370
3209D60R6j886J174J620j852p54K111n00j615J470J41j240J158N46j974R59J621
$$ plain form
3081 951 446 -1783 293 1709 -1313 -938 1950 70 -1728 756 899 -1140 10 1024 -589 -139
3097 -139 1127 -626 -798 1086 50 -1257 696 976 -1012 -279 1094 -446 -880 628 272 -686 609
3114 609 450 -848 140 632 -852 -450 959 -57 -776 666 444 -680 -18 612 -487 -262 654 -121
3132 -121 -344 669 7 -788 277 318 -634 1 719 -200 -382 535 -165 -702 247 234 -575 148 589 -330
3152 -330 -226 417 -276 -376 507 104 -247 498 310 -671 132 436 -434 -479 577 107 -428 423 267 -583
3172 -583 27 304 -492 107 629 -422 -291 722 42 -938 340 538 -593 29 616 -360 -104 449 -309
3191 -309 -435 923 113 -838 718 863 -903 -291 872 -388 -506 635 -44 -536 566 -27 -910 460
3209 460 556 -1330 -156 1464 -388 -1142 969 469 -1146 324 465 -775 383 929 -1045 -86 1535
3226A535k294o61K949q38k327K066J097k413N17J431j749K8J943j798q84L093
3242A695r32l137K576J831l452K3L263j650j655K324m77j765K340j95k901K609
3258D97J988m104k7M452k407l197L645R48l390J297J781k704J023K017l430q3
3274a694M632k668l659M970J131n417J348M138l284j225L217j464j314L276j677
3289C10l212M538J058o023J955N522m481l104N402p2m444K511J427l072K055J755
3305B125m705J673M837n023l153P197j37o836L365M565n078r61M211k414j079
3320a413L796k859k525O032q13o908M386N329o991j864P157j580n070L900Q63
3335A440l333K640P70m763L331M283o816j350Q286k542p201N560L959o332L5M582
$$ plain form
3226 1535 -759 -1420 1529 691 -1636 430 1527 -886 -369 1062 -687 -659 1284 -514 -1398 1695
3242 1695 763 -2374 202 2033 -1419 -1396 1867 217 -1438 886 409 -1356 984 789 -2112 497
3258 497 2485 -1619 -1646 2806 399 -2798 847 1795 -1595 -298 1483 -1221 -198 1819 -1611 -1694
3274 -1694 2938 270 -3389 1581 2712 -2705 -1357 2781 -503 -1728 1489 25 -1289 1987 310
3289 310 -2902 1636 2694 -3329 -1374 4148 -333 -3437 1965 1893 -2551 -40 1387 -1685 370 2125
3305 2125 -2580 -907 3930 -1093 -4246 2951 2814 -4022 -657 3908 -1170 -2131 2080 -334 -1413
3320 -1413 2383 -476 -3001 3031 2218 -4690 -304 5025 -1966 -3830 3327 1747 -3323 577 1440
3335 1440 -1893 747 1517 -3246 85 4368 -2448 -3798 4488 1946 -5255 305 4264 -2068 -2033 2549
3351B549l005o90L537l565j431O397k639o373O523M053q878J0Q026l590m945N227
3367A206O53l832L039O4m344M211K680p426J024Q297n084o150P668K062p392J659
3383a665M656l812k04L145l680L8N435m398m447P708J402q821K581P345n615l724
3399d056N988l77l824L155j03l344M312R31o943L128O465o617l937Q692j29p355
3415d014L276M017m570L0L171l354O02M194m553k392P253j233p640M832N350o765
3431a796j596O381j781l653L239k42k644L750j95m957L940L858o781r84P375k340
3447A574n744M636K739m835O45K717k751M66K783l727o94N600k463n177N268K805
3463C842o573L27N529k887k601L547l23k469K757m14l312L468J863n409R23N419
$$ plain form
3351 2549 -456 -1146 2391 -1174 -2605 3792 1153 -5220 1303 5356 -3522 -3512 4514 924 -4021 1206
3367 1206 1859 -1973 1066 1130 -3214 997 3677 -3749 -2725 5572 488 -5662 2006 4068 -3324 -1665
3383 -1665 2991 -821 -1025 2120 -1560 -1522 3913 -485 -4932 2776 4178 -4643 -2062 5283 -332 -4056
3399 -4056 1932 1555 -2269 886 783 -2561 1751 2682 -4261 -1133 5332 -1285 -5222 3470 3341 -4014
3415 -4014 -738 3279 -1291 -1261 1910 -1444 -842 3352 -1201 -3593 3660 2427 -5213 -381 4969 -1796
3431 -1796 -3392 2989 1208 -2445 794 552 -2092 1658 1463 -3494 446 4304 -2477 -3461 3914 1574
3447 1574 -4170 466 3205 -1630 -985 1732 -1019 -553 2230 -1497 -2191 3409 946 -4231 1037 3842
3463 3842 -2731 -2404 3125 238 -2363 1184 861 -1608 1149 735 -2577 891 2754 -2655 -1732 3687
3479C687l434l757M836R63m339J470K364k563M29J867k703J6L600k814k481M355
3495A496Q18m913J542L789l280j457L159o59j820K077l22j888K472M40l648J560
3511f34L245l277j605M126l85l439J889J575k356L88J563j702Q4K090j950j206
3527a594K920m72l012K055K145k828n44K782j074j580J767j75j307J387K70j751
3543a011J085J423k398l20K645r66j920J811Q97k011M10J056j128L0J195j091
3559b93l94J666p41j517J578P23j897K93J638r74r09J323j78r71P77K45j026P43
3577H6O83j279P2J342q08j085J267K71j190M71Q60r89p7Q71p00k51R59l22q63
3596f82R10K73j084J81J042q02l30R29k21n02M78J14p09L13N72q75J08P55m32
$$ plain form
3479 3687 253 -3504 1332 2295 -2044 -574 1790 -773 -344 1523 -1180 -1164 2436 -378 -2859 1496
3495 1496 2314 -2599 -1057 2732 -548 -2005 1154 495 -1325 752 430 -1458 1014 1454 -2194 -634
3511 -634 2611 -666 -2271 1855 1470 -1969 -80 1495 -861 -473 1090 -612 -528 1562 -388 -1594
3527 -1594 1326 854 -2158 -103 2042 -786 -1330 1452 378 -1202 565 390 -917 470 740 -1011
3543 -1011 74 1497 -901 -1221 1424 458 -1462 349 1246 -765 -355 701 -427 -397 798 -293
3559 -293 -687 979 238 -1279 299 1022 -875 -582 1056 82 -827 496 318 -653 124 369 -657 86
3577 86 769 -510 -438 904 96 -989 278 549 -641 -170 690 -299 -376 495 -205 -456 503 181 -682
3596 -682 228 501 -583 -402 640 -162 -492 437 216 -286 192 306 -403 -90 482 -393 -285 470 38
3615C8m16P25k84n77O22K71q02J48Q62n59m04O07j20o75P10J32n22K62L46o08
3635b44J9P08o16l26Q59j01q37P55L46q65J01N52l73k65O14k62m32P79j90q31
3655f09P33M09j024J82R81o12n84P32j37m79N48l9o15O27M04j017K52R78r11n95
3675g76J198J44j105N28N06p02J03L99o70J10J100j003n67J423o8j586P84J091
3693I09j224k49J070n02l65Q72m95o92J217m0j530J061J262j778l85J858o17j408
3711a036J201M70j192O16M09j247P40J188j820l62K382p09k221J856J086k187
3727h26J32J400q46l90J224r52n31K058r76k069K396J083k942J63K827j427j667
3744a343J931k8j444J171J96j691J660J103l018L22L267k104k287L126P47k897
$$ plain form
3615 38 -378 347 63 -514 108 379 -423 -275 587 28 -376 231 111 -564 146 278 -244 18 364 -244
3635 -244 -225 483 -133 -459 400 299 -538 217 563 -302 -201 351 -22 -287 327 65 -367 412 222 -609
3655 -609 124 533 -491 -309 672 60 -524 208 71 -408 140 101 -514 113 517 -500 -248 730 -181 -776
3675 -776 422 566 -539 -11 495 -207 -104 295 -375 -265 835 -168 -735 688 620 -966 -182 909
3693 909 -315 -564 506 4 -361 511 16 -676 541 501 -1029 32 1294 -484 -869 989 372 -1036
3711 -1036 165 635 -557 59 468 -779 -39 1149 -671 -1033 1349 640 -1581 275 1361 -826
3727 -826 -694 706 -140 -530 694 -258 -789 1269 293 -1776 620 1703 -1239 -1076 1751 324 -1343
3744 -1343 588 560 -884 287 483 -1208 452 1555 -1463 -1141 2126 22 -2265 861 1608 -1289
3760a289R25J600j762J23J421j840K98K343j975j958L521L98m023J379L151k615
3776c03j254K672m55j527J618o11j570K410K80l350J650L331l638j750M194k18
3792A479l651J896J762k300N78J254k046P12K397l172j246M593p53m446K968K879
3808B904l964p19L307j238j457K154r96j335K902p75l558L096K572m637n85N050
3824B721j609l737K985J345k870Q57J146k017J400J803l645p0M550k260l980M137
3840G56K121m738L53L622k019j422K172r71j100K921j353k930L832J377n249Q78
3856a750M828k950l053M031P08l301J319J125k152J596J035l355J022M085l623
3871d35k706M941N07m951J642L554k964q84K372j245n67K084j758j702L829l5
$$ plain form
3760 -1289 -364 1236 -526 -403 1018 -822 -524 1819 -156 -2114 1407 1805 -2218 -839 2312 -303
3776 -303 -1557 1115 660 -867 751 140 -1430 980 1260 -2090 -440 2891 -747 -2497 1697 1479
3792 1479 -2172 -276 1486 -814 -236 1018 -1028 -316 2081 -1091 -2337 2256 1503 -2943 25 2904
3808 2904 -1060 -1779 1528 290 -1167 987 -9 -1344 1558 783 -2775 321 2893 -1744 -2329 2721
3824 2721 1112 -2625 360 1705 -1165 -308 838 -1179 221 2024 -1621 -1691 2859 599 -3381 756
3840 756 2877 -1861 -1508 2114 95 -1327 845 -126 -1226 1695 342 -2588 1244 2621 -2628 -1750
3856 -1750 3078 128 -2925 1106 1814 -1487 -168 957 -1195 401 1436 -1919 -897 3188 -435
3871 -435 -3141 1800 2307 -2644 -1002 2552 -412 -1296 1076 -169 -736 1348 -410 -2112 1717 1682
3887A682m651K485L834m196j920M472m31l161K013R41j936J308N60k841J754K708
3903B621l765j191M739q52m356K697K633l486l70K696j509n07J890j740r05L142
3919A737j059l536L182K432m284l51M096j457k707K356M86j853J159M74j854J529
3935C50J425l333J65L761j926l027L282J329l335L20K324j472o93J786j480l64
3951h88K281j313k033K886Q79l633P59L134k041j725K662m3j968J231K06j321
3967i27J297O47k269Q51K371k253j708L085K03k833J130J769j774j84J381j041
3983b55l53J421r60j034K196r1k440J275J825k088p20K135k55j495J051L23j095
4000e60P25L70j329P24J293j696o16K248n73j953J280J067j548o9J402q45k78
$$ plain form
3887 1682 -2969 -484 3350 -846 -2766 1706 1275 -1886 127 1068 -868 440 1000 -1841 -87 2621
3903 2621 -1144 -2335 2404 1552 -2804 -107 2526 -960 -1330 1366 -143 -650 1240 -500 -1405 1737
3919 1737 678 -2858 324 2756 -1528 -1879 2217 760 -1947 409 895 -958 201 675 -1179 350
3935 350 1775 -1558 -1393 2368 442 -2585 697 2026 -1309 -989 1335 -137 -830 956 -524 -888
3951 -888 1393 80 -1953 933 1812 -1821 -1062 2072 31 -1694 968 925 -1043 188 394 -927
3967 -927 370 1017 -1252 -401 1970 -283 -1991 1094 1297 -1536 -406 1363 -411 -595 786 -255
3983 -255 -608 813 -147 -1181 1015 924 -1516 -241 1584 -504 -1224 911 656 -839 212 535 -560
4000 -560 165 535 -794 -70 1223 -473 -1089 1159 586 -1367 -87 980 -568 -637 765 -80 -358
4017c58R30p44n04J341l37j303J206R54j742j81J642o73j037J019J40p90N96K89
4035D48q20L90P85j195j08J249n48j066J100M82j214J68Q72p30j30P34n01k93
4053c77P92k83p07O12M96j101K85J053p32o07Q56Op31M85L77p31K92N71p57r8
4073b99P62m38n13P46R7p69L71M74o01j71O76m79k52P98k11n37M84K84r02L46
4093a34N45n34j83O69l78k80N07L0p44N13M43o41n2O55m66k35L76l7m21N22J78
4114C33o57L46M69o71k58Q00k88n26N07K97n88K70K14m86K94K63n08j96R05l88
4134A32o76O96K51p68J1O07k88j88M22k39j68N94l93n52Q20L21j013J86Q87o15
4154B7n60P95jo13M34J06l85N03K36j143N05R11r79o09J310K6j172M91O35o50
$$ plain form
4017 -358 572 -172 -676 665 328 -975 231 1185 -557 -738 904 231 -806 213 353 -437 159 448
4035 448 -372 18 803 -392 -500 749 201 -865 235 717 -497 -329 543 -187 -317 417 -84 -377
4053 -377 415 132 -575 37 533 -568 -283 770 38 -569 287 293 -438 47 424 -307 -15 556 -201 -299
4073 -299 463 25 -488 258 355 -414 -43 431 -170 -341 335 -144 -396 402 191 -346 138 422 -480 -134
4093 -134 411 -123 -306 363 -15 -295 212 242 -502 11 454 -187 -239 416 -50 -285 91 54 -367 155 333
4114 333 -324 22 491 -180 -438 362 74 -452 55 352 -236 34 248 -238 56 319 -189 -385 520 132
4134 132 -544 152 403 -365 -354 253 -35 -223 199 -40 -208 386 -7 -559 261 582 -431 -245 642 27
4154 27 -533 262 261 -352 82 188 -197 306 542 -601 -96 815 -164 -773 537 563 -609 -118 517 -133
4174a33j83N59n34J64P28r47l52J295k21j519J089J007j352k08J187l24o19O44
4192B81l03l61Q59l19j034J186R04j826k26J725n84j350J223M99r94L22L64r17
4210e51O67M31j365K09J833r92j589J722Q86k141J96J599q91m83Q89m66l01J137
4228G90o91j320J932L43k342O16K231j511j383J847J93j366O60M04j086J157L44
4245H18j835N94K013j922j315K708J01k434Q78J611j592k95J250q81NJ472j532
4262c56q56K453l92k760J636K146k485p94K474m90j655J210K28j200J301Q8j924
4279a376J482J730k851n46L194q78k646J965J392k096N1J433j157L0J238j598
4295f33l77K626j046k749K594J693l309j86K869j151j638J696P5j224J396l72
$$ plain form
4174 -133 -316 243 -291 -127 601 -346 -698 597 376 -1143 -54 953 -399 -607 580 256 -363 281
4192 281 -22 -383 476 157 -877 309 1213 -613 -839 886 302 -1048 175 674 -320 2 366 -551
4210 -551 116 547 -818 -609 1224 232 -1357 365 1251 -890 -694 905 14 -469 420 -46 -347 790
4228 790 99 -1221 711 1054 -1288 -672 1559 48 -1335 512 705 -661 -1 403 -683 474 818
4245 818 -1017 -423 1590 -332 -1647 1061 1162 -1272 -394 1217 -375 -670 580 -301 -296 1176 -356
4262 -356 -1212 1241 849 -1911 -275 1871 -614 -1408 1066 576 -1079 131 359 -841 460 548 -1376
4279 -1376 106 1836 -1015 -1561 1633 755 -1891 74 1466 -630 -579 854 -303 -273 965 -633
4295 -633 -1010 1616 570 -2179 415 2108 -1201 -1387 1482 331 -1307 389 464 -760 636 264
4311B64j723K069R15l044M63L192j890k391K804O84k397M92J509j310K61R11j732
4328i23J79K336j756j948L203N85l417R86K690k085j320K221l88j177J475m82
4344A79j322J948K67k922J425K598k680j378L159r6k640J253J273j618L54Q98
4360F98j601O40J829k180r81L130m87l208J882K222k520o49K203o79j064J185
4376D20m28q52J822l40k233J844J692l006m09L063r00k310J922P73j698M73P67
4393F00j271N28J176j879j48K622j346k151K266J152k656J59K177j073q25J126
4409D57m93o23J495p54j314J763R11k650L87K524j578j699K063L79j629O07P78
4426F24r97N04O36j621L29J841j397j351K299L21k349N68J711j291o26J179k60
$$ plain form
4311 264 -1459 610 1525 -1519 -1056 2136 246 -2145 659 1343 -1054 -562 947 -363 -102 809 -923
4328 -923 -744 1592 -164 -2112 1091 1676 -1741 -755 1935 -150 -1470 751 363 -814 661 179
4344 179 -1143 805 1072 -1850 -425 2173 -507 -1885 1274 1178 -1462 -209 1064 -554 -200 698
4360 698 -903 -263 1566 -614 -1595 1535 1048 -2160 -278 1944 -576 -1225 978 299 -765 420
4376 420 -8 -860 962 622 -1611 233 1925 -1081 -1490 1573 673 -1637 285 1058 -640 -167 600
4393 600 -671 -143 1033 -846 -994 1628 282 -1869 397 1549 -1107 -948 1229 156 -669 457
4409 457 -36 -659 836 82 -1232 531 1442 -1208 -821 1703 125 -1574 489 868 -761 -154 624
4426 624 -373 131 767 -854 -525 1316 -81 -1432 867 1188 -1161 -593 1118 -173 -799 380 120
4443A20m92Q40l54j020J432L01k052R94J741j674j001J927j19j516Q47M98r24
4460d52N03M53j046L78J070j369n96J868k00j774R56J247j257m39J187n48l76
4477c95P94l52m87J102l05j265R25R47j421l54J631m25j034P74M07q71K28L18
4495B17n91L97M83q01j71J175n11j117Q88O78j046J7R16n60l64P01j85n11P61
4514C76k09p57P31M90j053N2R72n04p47Q17K11o92K70L30o67K66M19n54l0O73
4534C94k95o41P58R8p23P9O77l92j82N89k57l33M81k8n82L70K84n47M2O65m45
4555A2m03N88k3n03M32P1m71K45M20o09o2M78q7l94M63J03n85L72K40n69J34N21
4577C73n22j62O87j10n25L05K06m07NK95k33n7L78k23k90O04q3o88L41M93o33
$$ plain form
4443 120 -372 468 114 -906 526 827 -1225 -231 1510 -164 -1165 762 643 -873 -26 472 -452
4460 -452 51 504 -542 -164 906 -463 -1059 809 609 -1165 -209 1038 -219 -658 529 -19 -395
4477 -395 399 47 -440 662 357 -908 17 964 -457 -811 820 395 -639 135 542 -329 -101 217
4495 217 -374 23 506 -295 -466 709 198 -919 -31 647 -399 -382 534 -26 -390 311 126 -385 376
4514 376 167 -590 141 631 -422 -370 602 98 -649 168 379 -313 -43 287 -380 -114 305 -249 -279 394
4534 394 99 -542 216 314 -409 -330 347 -45 -227 362 105 -228 253 225 -357 13 297 -250 -208 457 12
4555 12 -391 197 174 -329 103 174 -297 -52 368 -241 -303 175 88 -306 157 260 -325 47 287 -282 -148 373
4577 373 -149 -311 376 266 -259 46 252 -155 -150 145 -88 -145 233 10 -280 324 241 -447 -106 387 -246
4598b46L8M79j78m78M37P4l96M68j35k82M22J77p01oQ63m38o34O42K61n61J58
4619c6J74l95K25J93n38L35O39n76n32P65J75q83J26Q03m49k76M27j50j32M19
4639C14m20k87P86O8j024M05Q97q93l94Q56O2o87K61K10l15L06k8n86M79N51r92
4660d31j84J320k85j147N66O79p01k71N94k18J33L09o16k3J003n67j082J056P55
4679H90j412j6J240n06p11M69J20k99N32k47o57R63M33j577J94J517q22j181J372
4698C02K65q89J30M43m25J99L35q03L37J030r84r06J542J28j577L59J358p48o40
4717e44Q25m9m90N46n14m33J326j19j539P84J565j586r10J748l8j364N98P23p32
4736b03L30J43r64O20J020j495m61K067l12j905J018J260j433m45J236l89l24
$$ plain form
4598 -246 -208 271 93 -385 52 126 -270 198 63 -219 203 380 -321 -327 536 98 -536 106 367 -194 -36
4619 -36 138 -257 -32 161 -377 -42 597 21 -511 254 429 -454 -328 475 26 -250 177 27 -105 314
4639 314 -106 -393 393 461 -563 -158 739 -154 -548 308 370 -317 -56 154 -161 145 117 -469 10 561 -431
4660 -431 -615 705 420 -727 -161 518 -183 -454 140 -78 55 364 -252 -275 728 161 -921 135 890
4679 890 -522 -538 702 196 -515 -46 74 -225 307 60 -597 366 799 -778 -584 933 111 -1070 302
4698 302 567 -322 -192 251 -174 25 360 -443 -106 924 -60 -966 576 704 -873 -514 844 96 -544
4717 -544 281 232 -258 288 -226 -659 667 548 -991 -207 1358 -228 -1138 610 572 -792 -194 529 -203
4736 -203 127 270 -694 -74 946 -549 -1010 1057 745 -1160 -142 1118 -315 -760 476 87 -237
4753b37N42n25k64J182m04j529J348J086j848k54K034o78j410R74N74q92M00J98
4771B97q11P66N86j652K4J992r21j792J796R69k005J79J303p55l59P50p01J0J245
4790I21q91j283J741N72k210L43K186j281j179J462K79j126M61J53o34P98M01
4807G13j689O85J737j627j261K187L14k127O55J399j045l48P92o58J8R29q46p47
4825i19J805j99k036J105J576j643r21J885r1j110N89K63o66P99j1j301Q09J214
4843A148j564p27K192m76j850J074J259j281k51Q64m18p9O26q71l46J595o60j517
4861a282J424J101j819k48J666m34j090Q97J61o81N72mr24J025M97j620Q0J649
4879I70p65j366J404P51j452O4Q48n21j26O03o40q4J277j053r75J460N90j707
$$ plain form
4753 -237 305 -220 -484 698 294 -1235 113 1199 -649 -903 1131 453 -957 17 591 -301 99 297
4771 297 -514 252 838 -814 -790 1202 281 -1511 285 1254 -751 -572 731 -24 -383 367 -334 -324 921
4790 921 30 -1253 488 1060 -1150 -807 1379 98 -1081 381 660 -466 -5 148 -486 312 713
4807 713 -976 -291 1446 -181 -1442 745 1059 -1068 -413 986 -59 -407 385 -273 -255 674 -172 -919
4825 -919 886 687 -1349 -244 1332 -311 -1232 653 562 -548 41 304 -362 437 426 -875 -66 1148
4843 1148 -416 -1143 1049 573 -1277 -203 1056 -225 -476 388 -30 -109 517 -354 -700 895 235 -1282
4861 -1282 142 1243 -576 -824 842 408 -682 215 376 -305 267 263 -661 364 861 -759 -679 970
4879 970 205 -1161 243 994 -458 -394 454 -67 -193 410 -230 -314 963 -90 -1065 395 985 -722
4897g22J54J591q49q87Q55J42n84N34j69n70Q21L32j469N41J510j339r37J452
4915D06L58j310K47Q00o68p2M38m64J21Q23q93m13J248jj515M81J252r77n20J032
4935C73N4p47M10r5k60N83j90p28O45P50j055m35J291j48j074M93O64p32L9M91
4955C29m53P3M52n84l32J013j47j073O75P95q95m51J031k52n54M51J0k81M98j17
4975A88o35M69M90q16k29J034k75p50O19L29o97NN30l40J4L54m49j49N80j26p54
4996f08O78M54q63K3P62l41n10M87m2l37M29O0l83K43K46n34rN98k96m54N49J80
5018C32m83J54J96l77lM84l70j46N42j46n08M43J15o30K65N43m87j90O30m24k63
5039c23M54Q8m70K12L00m32N1L00k49j46L14j49k84M60O6m61K09M18m83j23M86
$$ plain form
4897 -722 -568 1023 174 -713 142 284 -300 234 65 -505 316 648 -821 -280 1230 -109 -1046 406
4915 406 764 -546 -299 501 -167 -239 199 -265 -144 679 -214 -627 621 620 -895 -414 838 -139 -659 373
4935 373 427 -320 90 -5 -265 318 128 -600 45 795 -260 -695 596 448 -626 -133 531 -201 -162 329
4955 329 -124 -51 401 -183 -515 498 351 -722 -47 748 -147 -598 433 181 -373 78 88 -193 305 188
4975 188 -447 22 512 -304 -533 501 226 -524 95 424 -273 -268 262 -78 -64 290 -159 -308 272 146 -608
4996 -608 70 524 -339 -316 446 105 -405 82 40 -297 132 192 -191 52 298 -236 -245 353 57 -397 152 332
5018 332 -151 3 199 -178 -181 303 -67 -213 329 183 -325 118 233 -397 -132 411 -76 -266 364 -60 -323
5039 -323 131 219 -251 -39 261 -171 -120 180 -69 -215 99 -50 -334 126 192 -269 -60 358 -125 -248 238
5060B38j85l20L61J32l51J21J70l91K08L52m27j79O08q3m59O7L99l75n8M03k55
5081b4l3J71l21o0N47j90m97M89L47p64O5M33n6l97L33R4k33J71Pl10L66L15q26
5104c73O7P56l96m53N53K55n58J01J96j78m0M1j74J70L26l97m31Q26N5q87K77
5125b64P54m06l89L47O4q3J5j86MN34k83n58M66O65q59l18Q76Np24K72L23k03
5147E2Jp2l30M59L01p52j06J066l40r44O67M02o13j64P06n7m13L11l29J08O02
5168E55o79n58R52L05j061RJ100l17r10N10M38m42R8J1j24M92k3r56L15J043p91
5189c3q34J110M12j129J60P57l42j79K2q8K92L94q96k01J009J7j409P25J038q93
5209f8o08Q29K24o46K09n8o3N11j69q45P30P30j218l56J577l14j249O42P61n21
$$ plain form
5060 238 53 -267 94 226 -125 -4 166 -225 -17 335 -92 -271 337 254 -205 -138 261 -114 -172 231 -24
5081 -24 -57 114 -207 -267 280 90 -407 82 429 -335 -270 163 107 -290 43 137 -96 75 82 -228 138 453 -373
5104 -373 -306 450 54 -399 154 409 -149 -48 148 -30 -70 -29 -203 -33 293 -104 -535 291 346 -541 -264
5125 -264 490 84 -305 42 106 23 38 -148 -144 390 107 -451 15 680 -179 -497 379 384 -340 -68 255 52
5147 52 53 -19 -349 110 411 -341 -447 619 279 -665 2 404 -209 -373 333 276 -137 174 -155 -47 555
5168 555 -124 -682 270 575 -486 -477 623 306 -604 -94 344 -98 0 11 -113 379 356 -600 -285 758 -33
5189 -33 -867 243 655 -474 -314 443 101 -78 -56 -144 148 542 -354 -555 454 471 -938 -213 825 -68
5209 -68 -676 153 377 -269 -60 -118 -181 330 161 -684 46 776 -442 -798 779 465 -784 -142 619 98
5229I8k94L05k36J07L20o59%J202o70j217J069R73j479l30J377k96p72M37Q4o9
5249e0L33l82m99J019K90j405J50J525q23j172J090N99q17k35O13k33J48n0o41
5268e40M01R92j058p68J501K53j561K86J270p92o06O59J27j89K55l93k23R14o5
5287D63j334N56J429j180r06J447J41j146K23O56m05J11N9n18M26N59r19n61J610
5306G11j35j486P22J058j041m83R01j1l39J29j93K0N47r8j148R20R08j377m07
5325h02J509k63j089M16P75o87pJ39l51O15K73j040N7J330o77j222J090P85j260
5344d09j23R36j13o05M24j28j31N37l73p21J063M21j390L4J333m00j078Q55L41
5363D73n80J8K54l16K98K07r81M69R20p60r36J186M66j314P6J035m06l82L96j15
$$ plain form
5229 98 -196 109 -127 -20 300 -359 -359 843 173 -1044 25 998 -481 -811 566 270 -502 -65 19 -50
5249 -50 283 -99 -598 421 711 -694 -544 981 158 -1014 76 675 -142 -377 236 3 151 101 -540
5268 -540 -139 853 -205 -973 528 781 -780 -494 776 -16 -622 37 164 -25 230 -163 -386 528 463
5287 463 -871 -315 1114 -66 -972 475 616 -530 -307 349 -56 55 114 -404 22 581 -338 -899 711
5306 711 576 -910 -188 870 -171 -654 247 236 -103 26 -167 -147 400 302 -846 74 982 -395 -802
5325 -802 707 444 -645 -229 546 -141 -148 -9 -360 255 528 -512 -455 875 198 -1024 66 851 -409
5344 -409 -532 404 291 -314 110 -18 -149 388 15 -706 357 778 -612 -578 755 355 -723 132 473
5363 473 -107 -89 165 -151 147 354 -627 -158 762 2 -934 252 718 -596 -520 515 109 -273 123 8
5383Hm5L20m64k66R53O1j200L58J112p96p33R76J32o85J95K20k62K01J27o39M00
5404b7O75q10n05J012J12r96L56O12m34l28M32j50R5J72l68k39P31or24N37P57
5425G04p65m85Q44R0o54J48K62k66J23R7l73L69M29p66j83P28r0p85N10N32n20
5446e1l28O34k62j78L55j78k75M92l6n54M76M34p36k67P70r8o23M00J74l29K94
5467A14j7l34J38K79l71k5N11j16o05L53M76n87K9L93k77l3K91k48k27M32n0l83
5489b57L49K26n71j4N13l44k22M61M0l83K49J77l53N5K92m04J1K73p5k97M16k2
5511A20l77K95J84l68L1M54l09k50L70K0m17J60J95l00J04L56l65o4N11l02l25
5532b77L38R3m02K56L82l59k08K03M9j64J65q6k19L37R3m37K55K38k94l97O30
$$ plain form
5383 8 -37 283 -181 -447 506 567 -633 -275 837 41 -692 284 416 -269 -74 146 -116 85 212 -427 -27
5404 -27 648 -162 -667 345 457 -539 -183 429 -5 -333 99 -51 44 216 -152 -391 340 334 -590 -53 704
5425 704 -61 -546 298 388 -266 -118 144 -122 1 98 -275 94 523 -243 -426 302 212 -573 -63 469 -51
5446 -51 -379 255 -7 -185 170 -8 -283 209 173 -381 95 529 -207 -474 296 198 -425 -25 149 -180 114
5467 114 97 -237 -99 180 -191 -216 295 179 -426 -73 403 -184 -155 238 -39 -72 219 -29 -256 176 126 -257
5489 -257 92 318 -253 -267 246 -98 -320 141 181 -202 47 224 -129 -74 218 -186 -175 98 23 -274 142 120
5511 120 -257 38 222 -146 -115 339 30 -220 150 170 -247 -87 108 -192 -88 268 -97 -161 350 48 -277
5532 -277 61 154 -248 8 390 31 -177 26 75 -89 76 -10 -229 108 201 -236 19 257 -37 -434 196
5553A96j2m57J69K22k38J71k7j73K19J96m18m1N13j72n90L48L81l49j64M07q0
5574A01q0j4j75J29K36j91k78M51J34n74o3O81j62m74J93M18l62L2p7rJ89m6m42
5597c83L10N86o44l50N76L92o63k30N19n2j24P3o9J20K39o24O9O71j73p10L97
5618g0O48n30n20N72J61m68R1M9L1K61k29l63N54K41q23r9R64j74p29K52L33n2
5640A00l09J4K71O7L4n61K82N26m27o15O48N59q48j46P59j22l07j22K87k1ml20
5662b55j9O58O0j067L06R90n46q47Q05M22n64k04L86L0Mk23k37K78N70p45m33
5683f31J045P6j153K72R54m24n92L89L16j43j11l23J26O42m51o60P22P00r49m46
5703f41R45J36p55M2N51j41j19q6j95N18P3q14M5J119l47j141P55P60r63k37N89
$$ plain form
5553 196 184 -273 -104 118 -120 51 24 -149 70 266 -152 -193 320 148 -442 -94 287 -62 -226 181 101
5574 101 21 7 -168 -39 197 6 -272 179 313 -261 -324 357 195 -279 -86 332 -30 2 -75 -84 105 59 -383
5597 -383 -73 513 -131 -481 95 487 -176 -406 113 61 -63 10 -59 61 300 -324 -255 416 243 -467 -70
5618 -70 578 48 -472 100 261 -207 -116 -67 -36 225 -4 -367 187 428 -395 -494 470 296 -433 -181 152 100
5640 100 -209 -195 76 143 177 -384 -102 424 -3 -618 30 589 -259 -405 354 232 -75 -197 90 69 65 -255
5662 -255 -274 384 444 -623 -317 673 127 -720 85 507 -57 -261 125 155 159 -64 -301 -23 547 -198 -631
5683 -631 414 490 -663 -391 563 139 -453 -64 252 109 -2 -325 -199 443 -8 -668 54 754 -195 -641
5703 -641 304 440 -315 -273 278 137 18 -68 -263 255 328 -486 -441 678 331 -810 -55 705 -258 -495 94
5724I4R8j47j98m4K97L81o47m72R99J92j071J3J233l27r51N58L85m20oj5p3M33
5746C12p3q51M41Q83r12p06J155M74j083n0Q32l28l07Q4j09L35K55o03l12J105
5766E42r8j257N84R65o20q03P93L54n70n0K16j00L16k92n43O46O91j019n53J366
5786E68p3j154L72Q19l87n22L13J28L3J25p07K31R10m61r25P49O89q62m91J031
5806C86Q7p27J05J98kJ80l06l18O35K96j017P9J131l54j083O55O34n90m41N45
5826I3M5q9l7k61R1P53o32o43R21M27j116k5J047k07q84L55M04k63J24j74k04
5847b75N09K75j099L07R82n89q14Q10L92o15j72M62j22n0k8k06K86M12n06n33
5867e74Q27L10j041J52P46k15n98N44R4k88K09k02j75M81P1p74L55O22o60m95
$$ plain form
5724 94 192 45 -153 -197 100 481 -166 -638 361 553 -518 -505 728 401 -550 8 393 -27 -33 -48 -121 312
5746 312 239 -612 -171 712 -200 -906 249 723 -360 -410 422 94 -213 -129 -238 97 352 -251 -563 542
5766 542 444 -813 -229 736 116 -687 106 460 -110 -160 56 -44 272 -20 -563 83 774 -245 -798 568
5786 568 495 -659 -287 532 145 -377 -64 64 97 222 -485 -254 656 195 -730 19 708 -154 -645 386
5806 386 473 -254 -149 49 47 227 -79 -397 238 534 -483 -404 727 373 -710 -55 579 -11 -452 93
5826 93 138 49 12 -249 -158 595 -37 -680 241 668 -448 -473 574 367 -517 -162 242 -21 103 -71 -275
5847 -275 234 509 -590 -283 699 110 -704 106 498 -117 -289 173 51 1 -27 -233 53 465 -41 -574
5867 -574 253 563 -478 -326 420 205 -393 151 245 -43 166 -36 -211 270 341 -433 -78 544 -116 -611
5887f11P89J67p51J86M03j02r2K3j95J45L06m42k57P68j6q33L88N61m54l08M20
5908I5L5k36J63q8j66M64j93m70L53M46o58j47P55k15n39L20K67j88j71K62j96
5929a07J40J77l98r8M97n5m87L78K86m84p2M25m9k44J50j9k03L49p4l93K28L70
5951C17n54q4N63j06m84M76O8l83J54J86l53Q9L53l28j54M64k08k86K78K46m73
5972b19J42K88k67m3K59j55k76L94j7k88J49K07l39m3L91j59k52K86J05m02K98
5993E9J23l33L2K68j96j41L42k7k29R8J30l45L24J15m25M0N31l61l13L88Q3m07
6015b44J77K63j91o3J53j83M0K18k28j50L46P2n36L16L45l22k17L48j01r0O4O7
6037H4j25K72j92l61M08K18n50J7O48k09n40K12M10l32r2J15m5J05M5j67L6L91
$$ plain form
5887 -611 178 345 -406 -220 183 81 -11 12 -183 -38 268 -174 -431 337 321 -512 -124 437 -17 -325 95
5908 95 130 -106 57 -31 -197 267 74 -396 -43 403 -255 -402 353 138 -401 -81 186 -2 -173 89 -107
5929 -107 33 210 -188 -286 211 156 -331 47 333 -151 -223 202 153 -91 59 40 -163 186 112 -281 -53 317
5951 317 -237 -321 242 136 -348 128 196 -187 -33 153 -200 -111 242 -86 -240 224 16 -270 8 254 -219
5972 -219 -77 211 -56 -99 160 5 -271 123 106 -182 -33 174 -165 -208 183 24 -228 58 163 -239 59
5993 59 182 -151 -119 149 -47 -188 154 127 -102 -4 126 -219 105 220 -205 -165 366 5 -308 80 163 -244
6015 -244 -67 196 5 -58 95 -88 -48 170 -58 -208 138 210 -326 -10 335 13 -204 144 43 -47 17 84
6037 84 -41 231 39 -322 86 304 -246 -229 419 210 -330 -118 292 -40 -132 -17 -62 43 88 -79 -43 348
6059C48m07l76N16L20m64l35O81r3k81J00N8J6J19m43LM34O9o60J77N95l12m85
6081d20N04M09n55j54J62J77r4L2l81M59K97n92k77O35J86p94J78N53j60m14K00
6102d9J00R8k47k13K08L61j62n13L95O93q56l04O80K14o15q1N12p9p8k15j10M49
6124A88J24o46J05O64k36p43N04N96o80k86M40J69j08k11N7J65K27m81l50P30
6144B28K02q82L9R14l37n66J97M98k05l59J11K17K59l43m70M79N87o34n72R04
6164B67L20q42p4N72J52n10r9J54L51k5m86J5P27l42q01M84Q03o90n70O89L45
6185D40n23j96J79L06n0l36j63O23K22p96k75J083k25q70L21P87l95m17J54K47
6205A16rj95l17L67O38m97p87Q12N36j048j80R33K9o80P0L64J43k32k71j18P79
$$ plain form
6059 348 -59 -435 81 401 -63 -398 283 190 -91 9 67 83 202 -241 -238 196 265 -395 -218 377 65 -420
6081 -420 84 493 -62 -216 -54 123 29 61 -320 139 436 -156 -433 202 388 -406 -228 325 165 -249 -49
6102 -49 51 149 -98 -311 -103 258 96 -417 -22 671 -185 -489 191 405 -210 -291 221 142 64 -151 -261 188
6124 188 312 -334 -229 435 199 -544 -40 556 -124 -410 30 199 91 -120 -63 102 329 -152 -502 228
6144 228 430 -452 -413 501 164 -402 -205 293 88 -271 -160 57 316 -27 -497 -18 569 -65 -637 267
6164 267 587 -255 -329 243 395 -115 -214 -60 291 266 -220 -205 522 180 -621 -137 666 -24 -594 95 440
6185 440 -83 -279 -100 206 156 -180 -343 280 502 -294 -569 514 289 -581 -260 527 132 -285 -131 116
6205 116 107 -88 -405 -38 600 103 -684 128 664 -384 -564 369 398 -282 -212 152 295 63 -208 -326 453
6226D53j43q29M03P56n18q59P28N71o58m20N36J97j28j77k15L75L85p25l09J068
6246D91L6j040R7J024m54o52L61M50j57j44k29K18N01m70n82N05P46q09m73P99
6266B18L57r09l6O08L5l62j35M7M51Q3p07j49J046k21r65N30P23n99m66N48J09
6287B06j91r6k7J80L89m98m62P52K34q65k33J027J54r93J78N00j45j81q7P0L37
6308B49k4p13J35R52n61o20O85N21p97k00O33ql20J7k1J64J23m11k14O34K27q89
6330d38jR21j99p22L76M65m68p4J72r1J68J7m87J68O77n96m56P61L28q38NN79
6352B67k11j75J41o4J63M2k99k26O10J76q59J78P70m29m97M91J51l30k6J88p0
6373ij4J33l90K61L98m96k97P29J10p23J26N06l71j65K58p4N7J57k20j50N11r8
$$ plain form
6226 453 310 -519 -116 640 122 -737 -9 562 -96 -516 20 217 89 -88 -303 72 457 -268 -577 491
6246 491 527 -513 -416 608 154 -498 -137 313 156 12 -217 1 502 32 -550 -45 701 -108 -581 218
6266 218 575 -334 -370 238 273 -89 -224 -177 274 357 -350 -499 547 326 -639 -109 614 15 -451 97 206
6287 206 15 -81 -108 72 461 -37 -499 253 487 -378 -611 416 570 -423 -245 255 110 -71 -158 -88 249
6308 249 225 -488 -353 599 38 -582 103 624 -173 -373 260 252 -68 -51 -72 92 215 -196 -410 224 451 -438
6330 -438 -439 482 283 -439 -63 402 -66 -140 32 -59 109 126 -361 -193 484 -112 -568 193 521 -317 -312 267
6352 267 56 -119 22 -42 121 163 -136 -362 248 424 -435 -257 513 84 -413 78 229 -101 -127 61 -9
6373 -9 -23 110 -280 -19 379 -117 -414 315 425 -298 -172 334 -37 -202 56 -18 39 196 -24 -174 337 239
6395B39n87K22N50m56l73N66N2l50J22L2j75K35rl73K61L61n13o5M38J4n60K57
6417a12L35k28l1K49j71j98L59l11J1K66j05l33K93K65m72m9M37r4l04L18qk94
6439a77J82J15l39J73K92m39m0L81q4k52J61J75l82J09K00k09J8L02q6l67M33
6460A66rl73K40J73k85k3M31l56j34M36j68k63J87K01l67J08K32j78l15M07n6
6481E4k01L73q0l94L49J02l21J8M28l81k60M69L1m27J04K33r0q9J54k21Q0L41
6503B72l86j18M52J21o87N3N03j64k57K57L6j49J86n3j99L31k1m60K21N62n28
6524b8l00M14J33m02M1K34j03J33j10k69K92J86n15j7O46j24n78K89L84l64k08
6545b66L68M4j38O2j89J46J91l15k56N58K53o91J7M82n4n01J33M31j42k05P0o3
$$ plain form
6395 239 -348 -126 424 -32 -405 161 213 -137 -15 17 -158 77 68 -305 -44 317 -196 -261 177 191 -369 -112
6417 -112 223 -5 -36 213 42 -156 203 -108 -97 169 64 -269 24 289 -183 -232 205 111 -193 125 117 -177
6439 -177 5 120 -219 -46 246 -193 -233 148 64 -188 -27 148 -234 -125 75 -134 -116 186 100 -267 166
6460 166 157 -216 24 197 -88 -111 320 -36 -170 266 98 -165 22 223 -144 -36 196 18 -297 110 54
6481 54 -147 226 146 -248 101 203 -118 -100 328 -53 -313 156 187 -240 -136 97 7 -82 72 -149 -69 272
6503 272 -114 -232 220 341 -346 -293 210 46 -211 46 82 -67 119 66 -133 198 177 -283 -62 500 -28
6524 -28 -328 86 219 -183 -142 92 -11 122 12 -257 35 221 -294 -311 335 211 -367 -78 306 -58 -266
6545 -266 102 146 8 70 -119 27 218 -97 -353 205 458 -233 -216 266 212 -289 -156 275 133 -72 -2 -65
6567f5K20j39l35K53N28n02m08N64L39o09j02M22J4l46K7J85J48J3l79r5N47J1
6589B91p22K04Q41n28m93L82L42k96j94J90K1J38j28l37M06K78o30j86Q69J1q26
6610c67J06P12k88n14K47K29O1j98k83K39M31l90n32O06N13p01l49Q15J24p66
6630c05R3K71J23j59k77J98L79n0o67J81Q94m77p78N57M67n30k19L62K25k94j52
6651a58l7K76J80m95j86P88Q8r12Q2R38l32o45L05L57j13l10L6J02L83m73m62
6672e88O95M96q33m00R70J86p58j4N98m5m15o4K33J97j48m93J17Q16l30q42O26
6693DO72p58m01O26J67l94k26K29K86R8o65p6P78M7q78l0R87j36q66M25N86l90
6715H5m72K79K01K78l67m29L82N34n55n77R11L91r76j64R40n1o81M6L11J33o9
$$ plain form
6567 -65 155 16 -319 -66 462 -40 -448 116 455 -154 -256 166 180 -166 -139 46 194 207 -172 -267 280 291
6589 291 -431 -227 614 86 -407 -25 317 21 -173 17 38 176 48 -289 117 395 -235 -421 448 459 -367
6610 -367 -261 451 163 -351 -104 125 186 -12 -295 -56 375 -15 -547 59 572 -129 -478 337 461 -305
6630 -305 -212 59 182 23 -254 -56 323 273 -394 -213 681 204 -574 -17 450 -80 -299 63 288 -6 -158
6651 -158 -195 81 261 -234 -420 368 456 -456 -374 564 232 -413 -108 249 136 -174 -138 -36 347 -126 -588
6672 -588 107 603 -230 -630 340 526 -232 -246 352 307 -108 -172 61 258 110 -383 -266 550 220 -622 4
6693 4 676 -82 -483 143 310 -84 -310 -81 205 303 -362 -438 340 387 -491 -521 466 330 -536 -111 475 85
6715 85 -387 -108 93 371 4 -425 -43 491 -64 -641 270 661 -315 -479 461 410 -271 -225 86 219 150
6736A50m41K8O12J2q33K43Q95o08n87N19M55n11k87M24J36o9k50k50N97K40p49
6757b74k70R50N4r25M4Q73l22m64L03K05n4q4l30J60M99j89o50N04N85q44l69
6778e98P34L01n97l6K79Q8q0k34q4M81Q8o02r4Q70k49o84K85N60m14m07M10J53
6800A70oj48j73K19K91l79m91O89L87p85k08P07K4m56R1K16j8r3r9j18L63J61
6822C44o95J11O00k20o02M73L26m02k90M68j00k5Nk27K65L41m54l78O25K38p04
6843c01J5O48k52l85L54R3k55K48j97n7J63J39m93K09M56l76m46M77J92m08M5
6864a31L60j48j83J72j93J45L03k56m43N29N5n16K44K53j03m13M90q4k72J87l6
6885d0j43K53Q6m46K12M17l70j97M92K9n29J70K32k73K0J95j81jK27k23j63L98
$$ plain form
6736 150 -291 -263 349 361 -472 -229 666 58 -529 -10 445 -66 -353 71 207 138 -112 -362 235 475 -274
6757 -274 -544 406 460 -465 -421 452 130 -334 -31 174 120 36 -294 -134 365 176 -474 30 615 -229 -598
6778 -598 136 437 -160 -196 83 171 91 -143 -227 254 342 -260 -354 516 267 -417 -132 428 14 -393 17 170
6800 170 164 16 -157 62 353 -26 -517 172 559 -226 -434 273 297 -159 -68 148 130 37 -62 -180 183 344
6822 344 -351 -240 360 140 -462 11 337 -65 -355 113 13 -12 -7 -234 31 372 -82 -460 165 403 -301
6843 -301 -286 362 110 -275 79 172 -83 165 -32 -89 74 213 -280 -71 385 9 -437 40 232 -176 -131
6864 -131 229 81 -102 70 -123 22 325 69 -374 155 210 -306 -62 191 88 -325 165 81 -191 -4 -40
6885 -40 -183 70 156 -290 -78 339 -31 -228 264 293 -236 -66 166 -107 -87 108 -73 -74 153 -70 -233 165
6907A65m0m55K25M56m12j39L45j00l19L97r2l47M29J2l66J51K37k80j30M02r1
6928D8j76K12Q6k71LL42l75l1L45j37k37L19m6k00K34m5k07Q3K12k11k60M64m2
6951A10l30K40J71l51k7L03j87P4J06k04r4L98k08l69M35K22l39j58M96k48l34
6972b94K88N0j42J11O4j88K03J07l43kM52j35m51L49K08m52j1K28j08J6J48j35
6994c7jK91l50k64N47mn13K56M34k27m48L25K20l44L6K5k5K41K0m87K73M38n35
7017a29k08N60J29o39J46M50j93k30P5J4J25N7m29L7O48k83o82N56M06n22k46
7038c58O70M6m91o3K34l9J31k54j00M28Om89M6O58l99n73M58N13m90j76L26jN5
7061A38k20j86K52L77m96k90O13K06p90P8O95k07n39L60K33k32n5j33J19L96k75
$$ plain form
6907 165 125 -330 -105 351 -61 -200 145 45 -274 123 31 -316 113 125 -241 -90 147 -133 -263 139 48
6928 48 -128 84 170 -101 -98 244 -131 -162 183 46 -191 128 82 -118 116 71 -136 -53 159 -52 -312 152 110
6951 110 -220 20 191 -160 -187 116 -71 3 109 -95 -189 209 1 -368 67 289 -50 -208 288 40 -294
6972 -294 -6 44 -98 13 77 -111 92 199 -144 -146 306 171 -280 69 277 -175 -186 42 -66 -50 98 -37
6994 -37 -38 253 -97 -361 186 182 -331 -75 359 132 -316 9 229 -115 -79 -54 -79 162 182 -305 -32 406 -129
7017 -129 -337 223 352 -287 -141 309 116 -114 -39 -25 100 157 -272 -235 413 130 -552 4 410 -112 -358
7038 -358 312 358 -133 -196 38 -1 130 -124 -224 204 210 -279 -233 425 26 -547 -89 424 -66 -242 84 83 138
7061 138 -82 -268 -16 361 -135 -425 188 394 -396 -318 377 170 -369 -9 224 -8 -63 -196 -77 319 44
7082D4m47L67N17n88n10Q63J61p07n5M96J03j77k17QL32K5m71J5O28j78p81N07
7104f5O26n92m32M57L69m51n6J83P2Oj17k89M71K43r37J67R59l28p87L71N37l80
7126B7l25J75K73R9k84l16L41M84m58n98P49M59q62j68Q28j00o58J31K91J7p4
7147C1l93J94N96j46q29L80P45n39o27P44K74o13k09N13Q8j19l14j09M95J50o62
7168c50j39R43j32r16L63Q14m03o25K86M19j69k29j85K89M08m67m98O87M96r45
7188c53k38R51J42r01J33N84o3k94j79J29N32j52p50J87R09m45q23O59N64p25
7208a33k92M66K33l54j34j9K98K14n43k60Q55M7q88O3J017l26o91J95O28l69j65
7229a58k5K15K28j53n48N28M88p36m67Q77K58p02j91O26l4k73q9J69J07R2m29
$$ plain form
7082 44 -403 -36 481 -107 -617 246 407 -300 -355 141 244 67 -150 -142 190 215 -256 -241 387 209 -572 -65
7104 -65 561 -31 -463 -6 363 -88 -144 39 111 117 0 -289 182 425 -512 -345 614 286 -501 -130 407 27
7126 27 -298 -123 150 249 -35 -351 -10 474 16 -582 167 626 -236 -404 424 324 -334 -203 88 105 31
7147 31 -362 -168 428 282 -547 -167 578 39 -588 156 430 -183 -392 121 209 90 -224 -333 162 312 -350
7168 -350 -489 454 322 -594 -231 583 180 -445 -159 260 91 -138 -323 -34 374 -93 -591 96 592 -353
7188 -353 -591 360 502 -399 -266 318 255 -39 -218 -89 443 291 -459 -272 637 192 -631 28 592 -133
7208 -133 -425 41 274 -80 -214 -233 65 279 -264 -524 331 378 -510 -447 570 244 -447 -252 376 7 -158
7229 -158 -183 32 260 107 -441 87 575 -161 -628 249 507 -195 -386 240 206 -67 -156 13 120 212 -217
7250b17k3P33l29o23K05P07m70m53M37L23l16l9rJ26J42k44m04N12M07o42k78
7271d55P41R7p75J87M43j12k02L2lJ83J1m64K07N26k80n42L55N78o87k20M73J02
7293A95k33m8N2J4J57j47j96L71K13o62PN99k45m00K44L33l22K5k9K5Q6Pk87O3
7317a78M02k78l38N54K09n11j14L85o3j87J50m3QJ64j26k44L19J43m59q5O03j76
7339A35m99M73J18l96P4J35j67K20R4l78K3M36l18k27M44O4l38ML54k34j97K69
7361H9o9r2K64j61k09L88Qn11J72M30l29j77L26J7l11J18J39k10J48N5k10JL84
7384B60m17k03M91l8l51K43K38l13j3K54o1k62L72k06j57L02j0k34K5L45l90J6
7406a09L01j63k17K55L9m08L51J89k76j11L29j68j25K52j43j86K89J43m14J02
$$ plain form
7250 -217 -240 493 164 -459 -254 453 -17 -470 -33 290 -26 -65 -74 52 194 -50 -454 58 465 -177 -455
7271 -455 286 383 -392 -205 238 126 -76 -44 -47 136 147 -317 -110 416 136 -406 -51 527 -160 -380 93 195
7293 195 -38 -86 -34 -20 137 -10 -206 165 378 -284 -277 322 77 -323 -79 254 -68 -43 -72 -47 39 46 -241 -178
7317 -178 224 -54 -392 162 371 -140 -254 131 68 -119 31 -12 -4 160 34 -210 109 252 -207 -292 311 135
7339 135 -364 109 227 -169 -95 40 -127 93 187 -191 -168 268 -50 -277 167 231 -107 -103 251 17 -180 89
7361 89 20 -72 192 31 -178 210 218 -293 -121 309 -20 -197 129 146 -165 -47 92 -118 30 85 -125 -124 260
7384 260 -157 -360 131 93 -258 -15 223 -90 -103 151 90 -172 200 -6 -163 139 129 -105 -80 265 -125 -109
7406 -109 192 29 -188 67 106 -302 49 238 -38 -149 180 12 -113 139 -4 -190 99 242 -172 -70
7426g0K95l14r7M38j11l10J93J01k26PJ57k25J96K26l80r0N47l56k03K80J45l51
7448a48N9K74k47j39K53p2k9K32j95j33L11K33o43j1O06l54k90L71P0k54P5J18
7470H7k38N9J81k97K05L76l92l92O04R8o34J90M20j21l57K30%QN7j71k5K98K3
7493B09n34K64N51n67l20N64O9m99K27K21k26R2Nk89K91K11n79%P83k87n86K90
7515a10N32n10k65M68n9j04J46j95J01K33k35l78M83L53q16j2P99k71n26L36K48
7536B18j20j30r7J14PR4m54L29M56l82m87O32K44o39p7N27o5l90K13J24K6L1k86
7559a12j70M59k8o65L48O79n30m76O02K59n18j5J70N3J9q2k77L61K44o64n8Q45
7581D44k78n56K26O00m08l16K89J11j6j36j94L45L98n19n05O08L90p60j37P64
$$ plain form
7426 -70 225 -89 -186 252 141 -169 24 125 -101 -94 63 -162 34 260 -120 -210 337 -19 -222 58 203 -148
7448 -148 -89 185 -62 -201 52 -20 -49 183 -12 -145 166 399 -244 -255 351 -3 -293 78 148 -106 -31 87
7470 87 -151 -92 89 -208 -3 373 -19 -411 193 291 -343 -153 267 146 -211 19 19 27 84 -87 -112 186 209
7493 209 -325 -61 490 -77 -397 167 236 -263 -36 185 -41 51 56 -233 58 269 -310 -310 473 186 -400 -110
7515 -110 422 -88 -353 115 56 -48 98 -97 4 237 2 -376 107 460 -356 -368 431 160 -366 -30 218
7536 218 98 -32 -129 -15 -8 86 -368 -39 417 35 -452 180 424 -215 -292 235 170 -220 -7 117 143 174 -112
7559 -112 -282 177 149 -516 -168 511 -19 -495 107 366 -152 -167 3 56 75 -7 -284 77 321 -343 -401 444
7581 444 166 -390 -164 436 28 -288 1 112 96 -40 -234 111 509 -10 -515 93 483 -277 -414 350
7601C50p9n74K01L89k28q2j25N0L98j00o73L80N65m42o07O68M38p27j53N57Q0
7622B86m26%J07L14N5o23q7Q06j17q44K47Q44m06q03O86L87l92k19K1K02Q7k09
7644h4l57N90L56o67l93R59N6q72J70N23k04k08RR6K73k23l10J37O00m04o62N58
7666e7N74o31l68N74J36l56r0J79K82j67k24j25O50m2p36N2O92j09q58N23O18
7687E17n07l97M09J28N9j73l12K07N15n06m37Q26J64q15j63Q41j17o03K74K17
7707A27j7N3m06L4N61j24o29L19N74m03o35O70K13m08j01J81J4l8m1k11L88J69
7729B90n14j99P18On53N7N75l44k68J75K14k13O7j63l5M01k8o20M00N15n96k85
7751d00O84k9m30J23J98j29p6J5j51K21K01l87j84O79n8p15K16O09m69j40L19
$$ plain form
7601 350 271 -303 -102 287 59 -23 -148 -98 300 200 -473 -93 472 30 -577 91 529 -198 -351 206 286
7622 286 -140 -140 -33 281 336 -287 -374 432 315 -529 -282 562 156 -647 39 426 34 -185 -164 38 125 -84
7644 -84 -441 149 505 -162 -555 404 460 -412 -242 281 77 -131 -122 -26 247 24 -286 -149 451 47 -615 -57
7666 -57 517 -114 -482 92 228 -128 -218 -39 243 76 -148 -273 377 335 -401 -349 343 234 -624 -101 517
7687 517 10 -387 22 150 209 36 -276 -69 446 -60 -497 329 493 -322 -485 356 239 -364 -90 127
7707 127 110 163 -243 -209 352 228 -401 -82 492 89 -546 124 337 -71 -172 9 23 -15 -56 -267 121 290
7729 290 -224 -423 295 301 -252 -195 380 36 -232 -57 157 -56 11 -152 -187 214 186 -434 -34 481 -115 -400
7751 -400 284 255 -175 -52 146 17 -59 -44 -195 26 227 -160 -344 335 277 -438 -222 387 -82 -222 97
7772I7J4p5pj74K7M03k64l07K95M25m71j79M35j20l56J82J11j20J52L1k79K62
7794H2J55m42m4N58k20m39L18L21k38j33K45r2j02K09k50j23M64k62l16K97L69
7815C57o73J37M06k17k73K78N4k44J27L8j54J85K37l55k8M46m45j50L21J30l48
7836a71O3K88j94%J59j46j46L90j55l57L38J72n31J16L92l30j16L93j81k04K94
7857G4K9l10J77J94l84P7M09k51k48M38k00k09K07K40m66J52K59k46j72M41k39
7878b8j77K61L5l98K90J95l69J23L57l60p2K55nl25J56K64m30J50K20k20jM03
7900C24m08j83M51n6m81L17L09l90n3M04k62k34M18N1k84J86j3k40J90J84m14
7921a84j17O25k33m94L86K61l77O0K27k59K9K73l22j05N51k89l41M52J33m80K3
$$ plain form
7772 97 111 36 29 -145 -118 285 21 -286 9 434 -37 -216 219 99 -257 -75 36 -84 68 99 -180 82
7794 82 237 -205 -249 309 89 -350 -32 289 51 -82 163 71 -31 178 -72 -195 269 7 -309 -12 357
7815 357 -316 -179 227 10 -263 15 69 -175 -48 -10 -164 21 258 -97 -125 321 -124 -274 47 177 -171
7836 -171 -108 180 -14 -14 145 -1 -147 243 88 -269 69 241 -290 -174 218 -112 -228 165 -16 -220 74
7857 74 103 -207 -30 164 -220 -143 266 15 -233 205 5 -204 3 243 -223 -71 188 -58 -230 211 -28
7878 -28 -205 56 91 -307 -17 178 -191 -68 289 -71 -143 112 107 -218 -62 202 -228 -78 142 -78 -79 324
7900 324 -84 -267 184 128 -353 -36 273 -117 -170 234 -28 -262 156 207 -77 109 96 -144 46 230 -184
7921 -184 -301 324 91 -403 -17 244 -133 -73 154 -105 -76 197 -125 -230 321 32 -309 143 276 -204 -181
7942a81L73j55k05K58pk38L20j05l06L58P9n44K54N24l99m17N32J58m81K8K75
7963A21j41l9K09l25K04K69l57k67O10L3o39J38N63m65k70M36P0k78J91j30j87
7984b54L53Om53M20L15o66k05P76j09n22K22M34k91j18K66j75J14J51l84J00L92
8005C72k58n43N68K93p47k8N62n4l55J98l4r7J46Jl20N85n0o66K82N68m07m69
8027d53M85L20m93n9L85j84J28j37k29K66L08m59k32P12j8p98J88P42m40m48M25
8048IJ81k41pO5QL69k86n33M73L53o10j83P17Ro83J74M34k63j55K32q9K34l9n16
8072c47J27O60m36n84P19L11p45j21O65n3k40o2J06N4J86k84j63M76N0p38J69
8093b50P64l45o70O03L25m65j91K36P4J2j09k99M67K23n89l40Q06J53p95M2O80
$$ plain form
7942 -181 192 37 -168 90 83 -155 165 60 -246 112 191 -353 -99 425 26 -391 141 299 -182 -154 121
7963 121 -20 -59 150 -175 29 298 -59 -326 284 317 -322 -184 379 -86 -356 80 150 -128 63 -67 -254
7984 -254 99 105 -348 72 387 -279 -484 292 183 -339 -117 317 26 -92 174 -1 113 264 -120 -20 372
8005 372 114 -429 139 432 -315 -343 219 165 -190 8 -26 -123 23 24 -296 289 239 -427 -145 423 16 -453
8027 -453 32 352 -141 -200 185 1 129 -8 -237 29 337 -122 -354 358 340 -458 -270 472 32 -416 9
8048 9 190 -51 -58 7 15 384 98 -435 38 391 -219 -402 315 324 -359 -185 249 -14 -169 63 -26 208 169 -347
8072 -347 -220 440 4 -580 139 450 -295 -416 249 196 -44 -106 0 54 240 -44 -207 269 319 -419 -250
8093 -250 514 169 -501 102 427 -38 -229 7 81 93 -16 -315 152 375 -214 -554 252 405 -390 -348 332
8114C32j39n76L22K09q4r5k92J84N58l28m90L99N44n86n08P46J34n02K5L38q9
8135A02q0j25r4L83Q2n98K1P81l96n84M57N34m61l37M09L1r4j59mJ59K01k54l31
8158c57N31K97p93j02Q85j26o03J94K64j38j98k5J06L50j24n26L48M59m50m29
8178d37N21K86o15j08N50k4k14o8l5J63K51l86k42
$$ plain form
8114 332 193 -383 -61 148 64 -31 -323 -139 419 91 -399 0 544 -42 -550 196 330 -172 -147 191 102
8135 102 22 -103 -197 186 268 -330 -309 472 76 -508 -51 483 22 -315 94 125 31 -128 -132 27 228 -26 -357
8158 -357 174 471 -322 -424 461 335 -268 -74 190 52 -146 -171 -65 285 161 -365 -17 442 -8 -437
8178 -437 84 370 -245 -353 197 173 -41 -109 -144 19 270 -116 -358
8191c58
$$ Imaginary data points
##PAGE= N=2
##DATA TABLE= (X++(I..I)), XYDATA
0@%%%%%%%Qj4J4j6J6k4L2m0M9n7P3r1J09j32J62j94K28k63L04l59M20m84N54o35
31c40P25q23R35j057J189j336J500j679J874k086K318k574K854l157L487l851
47b021M249m684N161n684O258o898P613q409R299j0309J1470j2811J4383j6257
61h640J8535k1378K5036k9939L6891m7561O6145j07346L50303j79060o66396P50283
73A86873J59808n87171P8961L53820k57074P4483J23123l41188J38864M65393
83C95892n09107l26314P22021N8432p61101K65343N67548m30574k58065M10184
93A34259o6565j82971K28724j39084j97209M43538j7972n76527L09528N13326
103D49047n54416k85876O21463L629m97102K06144K31074k35173O2748Q0819k59551
$$ plain form
0 0 0 0 0 0 0 0 0 8 -6 8 -8 8 -16 16 -24 25 -32 41 -50 59 -73 89 -105 123 -140 164 -195 225 -259 295 -340
31 -340 385 -438 497 -560 629 -707 793 -886 988 -1098 1220 -1354 1500 -1657 1830 -2021
47 -2021 2228 -2456 2705 -2979 3279 -3619 3994 -4415 4884 -5425 6045 -6766 7617 -8640
61 -8640 9895 -11483 13553 -16386 20505 -27056 39089 -68257 282046 102986 -563410 186873
73 186873 346681 -240490 -161529 192291 -64783 9700 132823 -208365 -69501 395892
83 395892 -113215 -439529 282492 340924 -420177 -154834 412714 -17860 -275925 134259
93 134259 67694 -115277 113447 -25637 -222846 220692 202720 -373807 -64279 449047
103 449047 -105369 -391245 230218 233847 -263255 -57111 173963 -61210 1538 82357 -177194
114a77194J88220K68817m58308j06299O07509j46801n67735L76381L72615m70839
124a13634j11577L84738j04477j65571J79415r1117q3958K84551j19270l31235
134b72135L36343K20403m75824k3451M69418j68492l20978K74185J06342k39327
144i3516Q4074P6703j81920J31059J42954k99919R321L69849j90471l09288L20196
155E9042J50630l48587K0987K57421j29054q4527J36202q2202l4546J75162j29612
166i084j66332K72160O0611l32873R1188K95222k10105j74803K44208K3020j88424
177i5212Q5657O4434j11095P4178N4959j63169N4404J71354j66278j06829K24875
188H7278J542k06568R6316J26298j38026j6241J09980p6596k7926J12133p3150
$$ plain form
114 -177194 11026 279843 -178465 -284764 322745 175944 -391791 -15410 357205 -113634
124 -113634 -225211 159527 55050 -110521 68894 -22223 -106181 178370 59100 -272135
134 -272135 64208 284611 -191213 -214664 254754 86262 -234716 39469 145811 -93516
144 -93516 -9442 67261 -114659 16400 159354 -140565 -131244 238605 48134 -261154 59042
155 59042 209672 -138915 -117928 139493 10439 -74088 62114 -20088 -54634 120528 -9084
166 -9084 -175416 96744 157355 -175518 -84330 210892 787 -174016 70192 93212 -95212
177 -95212 -9555 54879 -56216 17962 72921 -90248 -35844 135510 -30768 -137597 87278
188 87278 88820 -117748 -21432 104866 -33160 -49401 60579 -16017 -43943 68190 -4960
199d960q3011J50299Q192j70526P8003J32175j35296n8427J37495j9764r0883
210e6703O4365J7859n7245N0680R631q3285N4767O7167j09556j8043J27842l9683
222B7796j01383Q5342N0799r5940L480O8153m3600k2266N2201k1581k7563N1264
234B6702r649n3031M1087K6280n9212P857N2070l3731k2135M5574j1809l6431
246b6428L4584P564m3884K2257L5392l9895j0472M5259j2974l6261K5108J6029
258A6279k6285K077J7906q349k006O225r754J625J1143j3727o234K1286k435k0787
272a3036J2537J4971j9360p879J9724n20j7136O534J3096q634q377Q734N564p766
286a548l673P207L090p027k969P236K677p424j058R059k53r397J272P875m006
$$ plain form
199 -4960 -87971 62328 70520 -100006 -22003 110172 -25124 -83551 53944 34180 -56703
210 -56703 7662 25521 -31724 18956 28587 -54698 69 67236 -42320 -60363 67479 27796
222 27796 -73587 11755 62554 -33386 -29906 38247 -5353 -27619 24582 3001 -24562 26702
234 26702 17053 -35978 5109 31389 -27823 -19966 32104 -1627 -23762 21812 10003 -26428
246 -26428 8156 15720 -28164 -5907 29485 -10410 -20882 24377 11403 -24858 250 16279
258 16279 -10006 -7929 9977 1628 -378 5847 -3907 -2282 8861 -4866 -11100 10186 7751 -13036
272 -13036 -499 14472 -4888 -12767 6957 6437 -10699 -4165 8931 297 -8080 654 6218 -1548
286 -1548 -5221 1986 5076 -1951 -4920 2316 4993 -2431 -3489 5570 5317 -4080 -2808 5067 1061
301A061p770N512P587n703n611O908L675r354l991R304J823q956K045J0623l153
316D000r949M341P225p843o234J0243N936r704j574J1333k697j2291M342Q461
330E589o970m090Q852J974n479m52MQ4J467n765j067J2901k113j5499J1168J3225
346A3829k1452o373K5309n933k1497J9485J1865k4818L949K0199j9172p825K5475
359A3041r029j9541K4136M854k7993J2382J7571k5433K139K4275k2896p151L4955
372B1310k0167l1363M5877R394n9472K2528N4134m9894k9507O1090m143n0429
384c0642L0529K0810l5878J6786J7952m2799J8282M4498n9327k0448Q4592k0351
396B4004q0272O1517M8190q2591j527O8996m2032k6533O0171k7912m1301P4165
$$ plain form
301 1061 -6709 -1197 6390 687 -4924 1984 5659 -3695 -7686 1618 3441 -5515 -3470 7153 4000
316 4000 -5949 -1608 5617 -2226 -8460 1783 7719 -1985 -3559 7774 5077 -7214 -2872 5589
330 5589 -1381 -5471 3381 5355 -124 -576 -572 -488 979 -4786 -5853 7048 4935 -10564 604 13829
346 13829 -7623 -13996 11313 5380 -16117 3368 15233 -9585 -5636 14563 -4609 -12434 13041
359 13041 4012 -15529 8607 13461 -14532 -2150 15421 -10012 -7873 16402 -6494 -13645 21310
372 21310 1143 -30220 15657 25051 -34421 -11893 42241 -7653 -37160 23930 19787 -30642
384 -30642 -113 20697 -15181 1605 19557 -23242 -4960 39538 -19789 -40237 44355 24004
396 24004 -56268 5249 53439 -29152 -30679 38317 -3715 -30248 29923 2011 -39290 34875
408C4875p199r1124O3649O7770j05068j6050J12902l8324p8263P1663J7276o6207
420c4100M1148J8385p1348N3241N9374j15525n484J42820o7849j24428J25049
431B1283O5294j41060Q212J08147o0019l7973O4865m1680k0313R3223n8050r2602
443i0673J38094M1438j82096L8720J68513j11799j03260J42188J4806j10072N9153
454E012K7837q3390P1061M2901j45445M4536J63392j39421j16302J99853K6240
465I6274j98299O1655J32107j06555k9797Q5062o1108l280J00457j06744p1731
476a01959J96004j3033k25311J17313J85371j91804r3840K01017q632j40153P4598
487d29L4336p0568P3614j558j37247J10794J26910k11508n0237K58856n6010k28983
$$ plain form
408 34875 27676 -63448 201 67971 -37097 -53147 59755 21431 -56832 14831 32107 -34100
420 -34100 7048 25433 -45915 7326 66700 -48825 -54309 88511 20662 -103766 21283
431 21283 86577 -54483 -46271 61876 1857 -36116 28749 -12931 -33244 59979 1929 -90673
443 -90673 47421 88859 -93237 -54517 113996 2197 -101063 41125 55931 -54141 5012
454 5012 32849 -50541 20520 63421 -82024 -37488 125904 -13517 -129819 70034 96274
465 96274 -102025 -40370 91737 -14818 -44615 40447 -20661 -23941 76516 -30228 -101959
476 -101959 94045 81012 -144299 -26986 158385 -33419 -127259 73758 65126 -75027 -429
487 -429 33907 -36661 36953 35395 -101852 8942 135852 -75656 -125893 132963 76953 -152030
499a52030J43164J33924j69799j7861J16698o8901m055Q8507j19296k9033K01790
510A23108q2870k10548J94024J42976k53554l0342K35803p0607j45861J12017
520A4146K1727p5028Q0639k6703j16163J51278P3416k43838K5998K63847j38725
531C0594k06579K10537R9826k07278J0179J29395p3760j0587O0324j00946K3316
542c4979J58962j38206j38454K35332N1951k71097N7204K28149j38241j23643
552a13022J53048O110r0220P3312k5589q2188J43350J6682k13039R2280K08168
563A68892j93122j34051K37450K5494k07035O5214J14450r4637J200N1045q9759
574e4859M5571J13323j54140o5930K28230k6281k34158J21709J72771j76402p4422
$$ plain form
499 -152030 -8866 125058 -44741 -62602 54096 -14805 -18860 69647 -49649 -78682 123108
510 123108 40238 -170310 23714 166690 -86864 -117206 118597 47990 -97871 14146
520 14146 35873 -39155 41484 14781 -101382 49896 123312 -120526 -94528 169319 30594
531 30594 -175985 34552 134378 -72900 -62721 66674 -7086 -17673 42651 -58295 -34979
542 -34979 123983 -14223 -152677 82655 134606 -136491 -79287 148862 10621 -113022
552 -113022 40026 46136 -44084 29228 3639 -78549 64801 81483 -131556 -39276 168892
563 168892 -24230 -158281 79169 104663 -102372 -37158 77292 -17345 -16145 34900 -54859
574 -54859 -9288 104035 -50105 -116035 112195 85914 -148244 -26535 146236 -30166 -104588
585a04588J63991j8544q8759O6787j5251m8475J04088k6664j44041J21674J18370
596A28588j94103m1093K12356m8130j68015J07064P8548j09901J4686N4024p0373
607c6349L8280O8595j25527j2624J69719p1152j55074J42728R2512j66984j0539
618f6415J35305n3203o2759O8237k0391l0180P8717m1276q7774J14626M6656j59195
630g7652K0952J54525q4560j04167J16322L3272j01182K7457M5610n4056K4143
641F64L6869p7841J5639R6176p6416p2755J16855J9585j20099L6192Q6286o7979
653f824k8765O2802k6112k5578N4182k9236m6606P7089J0173r6523L7420Q1548
665F3570p4977m2971Q4008j659o1858L3794K1385l8529K0352J5393m7037K2456
$$ plain form
585 -104588 59403 40859 -47900 18887 3636 -44839 59249 32585 -111456 10218 128588
596 128588 -65515 -106608 105748 57618 -110397 -3333 75215 -34686 -20000 34024 -36349
607 -36349 1931 70526 -55001 -67625 102094 30942 -124132 18596 111108 -55876 -66415
618 -66415 68890 15687 -47072 21165 774 -29406 49311 8035 -79739 34887 81543 -77652
630 -77652 -56700 97825 13265 -90902 25420 58692 -42490 -15033 30577 -23479 664
641 664 37533 -40308 -24669 71507 -4909 -77664 39191 58776 -61323 -25131 61155 -6824
653 -6824 -35589 27213 1101 -24477 29705 469 -46137 30952 41125 -55398 -17978 63570
665 63570 -11407 -54378 29630 27971 -33887 -93 21292 -17237 3115 18508 -28529 -6073
677f073M7849n7224k3041P5844j2671o9870M2462M1775n5344o009M6217k1438
689B477j8637L1300j3911k1937L5467k707l9791K9117K7494m3906l880M1641j9222
702C505k5628K9719K709k4660J8218Q994k6343J0746K0738k7016o652L2280r069
715G541k5221K1249J1944k3885J012J6177j0351m207J1558o177m554J2425o002
728A509j2560J4049N065j7806M931J6463j2045q985J4775l73j3103O339P642p989
742b088k39O994l613l090L565j672j947L436p66j715L728o15m429K131K154m199
758b365m65M955l84l751J867K726l325k845L028K121k967j40M260m54m087P99
774a027K699k117j763K828J947j822j290J722M17k812j038K776R62k555O45K876
$$ plain form
677 -6073 41776 -15448 -38489 37355 24684 -45186 -2724 39051 -16293 -22302 23915 2477
689 2477 -16160 15140 1229 -20708 14759 12052 -27739 1378 28872 -15034 -18914 22727 3505
702 3505 -22123 7596 10305 -14355 3863 12857 -13486 -2740 17998 -9018 -15670 16610 7541
715 7541 -17680 3569 15513 -8372 -7360 8817 -1534 -5741 5817 -360 -4914 7511 1509
728 1509 -11051 2998 8063 -9743 -4812 11651 -394 -9379 5396 5023 -8080 -1741 5901 -2088
742 -2088 -2327 4667 1054 -2036 1529 -143 -2090 1346 580 -1135 2593 1978 -2451 -320 1834 -2365
758 -2365 -2830 2125 1741 -2010 -143 2583 -742 -3587 -559 1562 -1405 -1545 2715 2261 -1826 -1027
774 -1027 1672 -445 -2208 620 2567 745 -545 1177 1594 -1218 -2256 520 1482 -1073 -428 2448
790B448j455l098R29J462j179q44J588K000p97k604O90K516k412k989M406L187
806C848n083q43O254k191o606M257M099o054J25O696l245m106N170j031o090N113
822C13K596o717L440N728p879o80P973o987m579J2584l366j1680J3526O099k0218
837i847L919J9235j5282j1538K1811O20j8956J0587Q807j5689L963J0210j5456
850g616L189J9258j8228j1783K9515m261l1983K0265K1740l0237l148K9616j4476
863A851j5701K3797o869k0508K6888M134l5747K0378L0927m0264j2685M6419j1976
876A0644l6562L0049J3745l1210J3557J4724l1712J3373L0204m3618j0168O1628
888C4654k0357n7694M9308L3825o3193j725N2993k5494k2637L4948j3386j9244
$$ plain form
790 2448 993 -2105 -1176 286 -893 -1737 -149 1851 1054 -1550 -860 1656 -756 -3745 661 3848
806 3848 -1235 -2078 4176 1985 -4621 -364 3735 -2319 -2194 4502 1257 -2849 2321 1290 -4800 313
822 313 2909 -3808 -368 5360 -2519 -3199 4774 -2213 -6792 5792 2426 -9254 4272 10371 -9847
837 -9847 -5928 13307 -1975 -13513 8298 8918 -10038 549 9356 -6333 -2370 7840 -7616
850 -7616 -4427 14831 -3397 -15180 14335 10074 -21909 -1644 20096 -10141 -13289 16327 1851
863 1851 -13850 9947 3078 -17430 9458 13592 -22155 -1777 29150 -11114 -23799 22620 10644
876 10644 -25918 4131 17876 -13334 223 14947 -16765 -3392 26812 -16806 -26974 34654
888 34654 14297 -43397 5911 39736 -23457 -25182 27811 2317 -20320 14628 1242 -18002
900a8002M1142j5918m8237N4392K9366p9274P574Q0944m4167n6288O3477J5186
912C0195n7051K2694K4309l9515K2276K8434o2108O731P7548n3532o3198Q9211
924B5994K5929r6810J8784P3155m8861k8472M8062j9453j5457M9450l5376m5403
936d8458Q4573R863j11147M0951J01509q4608o0107J01531P044q0775L3726K9377
948B3479m3908K8577J6500o9001L8044P5579r5246m4390J28076j0347j24000O2099
960a4538Q3649q5241k3168O9012k8723j8858M8179m5666k7811R7479k3243j12772
972h1701Q3454Q7630j25932l4851J28995k1792r1493N6127L0253m9812K9109M078
984A4065o2122O0655N2765j17692n516J42988n6136j24710J03909P0350j15659
$$ plain form
900 -18002 23140 7222 -41015 13377 42743 -36531 -28957 51987 7820 -48468 15009 30195
912 30195 -26856 -4162 20147 -19368 2908 31342 -30766 -24035 53513 -19 -63217 25994
924 25994 51923 -44887 -26103 47052 -1809 -30281 17781 -1672 -17129 32321 -3055 -48458
936 -48458 36115 45978 -65169 -24218 77291 -7317 -67424 34107 41151 -39624 -5898 23479
948 23479 -20429 8148 24648 -44353 -6309 69270 -25976 -70366 57710 47363 -76637 -14538
960 -14538 69111 -16130 -39298 29714 991 -17867 30312 -15354 -43165 54314 31071 -81701
972 -81701 1753 89383 -36549 -71400 57595 35803 -55690 437 30690 -19122 9987 14065
984 14065 -48057 12598 65363 -52329 -57845 85143 29007 -95703 8206 78556 -37103
995c7103o536Q4145l7391k0358M2537m6559n933Q8262n7981q7766J19129M7420
1007H1866j48885J4632J34810o8377q3872Q6386J7048o0586L5645K133n0238O5130
1019B5692K2058j14043L4384J22614r4253q8861J30813L1227j25821K4181Q1034
1030D9025n2895j6641M0443l9488R130O5762p3052n0408J22975J035j38962N7534
1042b5542J14078r7447n8579J00479j224o4985L7301M210l5743N5382j875q7228
1054f1173N9263P9519j09758l9194J29612j5473j09876N9114O0949o9533l406
1065a9956M2045l8403J0159M6413o5191j7971J00775l0935j02016P7989O8697
1076G1606j02536j9169R3120k4059n2973M2658K60k8647M1493j2669n6454O1739
$$ plain form
995 -37103 -43639 40506 3115 -17243 25294 -21265 -27198 61064 3083 -84683 34446 81866
1007 81866 -67019 -52387 82423 14046 -69826 16560 33608 -26978 8667 10800 -39438 25692
1019 25692 47750 -66293 -31909 90705 -3548 -92409 38404 69631 -56190 -32009 49025
1030 49025 -3870 -20511 19932 -19556 -10426 55336 -17716 -68124 54851 55886 -83076 -25542
1042 -25542 88536 -8911 -67490 32989 31765 -33220 4081 8291 -27452 27930 26055 -61173
1054 -61173 -1910 77609 -32149 -71343 58269 42796 -67080 -7966 52983 -16550 -19956
1065 -19956 22089 -16314 -6155 40258 -24933 -42904 57871 26936 -75080 2909 71606
1076 71606 -30930 -50099 43021 18962 -34011 8647 8907 -19740 21753 9084 -47370 14369
1088A4369M0055r6018L01J01705m4383p7765P0704L4413o8017R395L8704l2934
1100i471N766K7691m6476J386O5139m1146n5119P3643K4112q3316J3170O5598
1112D0977m0845l0275M5330p666k4365L2971j1046l5466M5061J4648o4835J8050
1124a7461O2356m6273l8742N9063O188n0739J9561K4418k8250P811J7920l0582
1136a4730P231L5855l5503k3821N2798k58n2566K5051L6721l8271j2392L4488
1148A4603j1008j7303K2070n394j7171K4845J313l2570J7739K5592l2346q971
1160a8601L5791q323k5907K0410Q503k1909Q098J1724j8364M571J9089j9057r092
1173a3067K6223n995k4410J7495J3811k1893M62J7776j0086p532J2267n018p661
$$ plain form
1088 14369 54424 -41594 -41293 60412 16029 -61736 8968 43381 -24636 -15241 23463 -9471
1100 -9471 -3705 23986 -22490 -21104 44035 2889 -52230 21413 45525 -37791 -24621 40977
1112 40977 132 -30143 15187 7521 -16844 16127 5081 -30385 14676 29324 -35511 -17461
1124 -17461 44895 -1378 -40120 18943 25131 -25608 -6047 18371 -9879 -2068 15852 -14730
1136 -14730 -7499 28356 -7147 -30968 21830 21572 -30994 -5943 30778 -7493 -19885 14603
1148 14603 3595 -13708 8362 2968 -14203 10642 11955 -20615 -2876 22716 -9630 -18601
1160 -18601 17190 8867 -17040 3370 11873 -10036 -1938 9786 -8578 -4007 15082 -3975 -13067
1173 -13067 13156 7161 -17249 246 14057 -7836 -7374 10402 316 -7216 5051 33 -7628
1186g628J2826j580j2880J1762P497j7095J015J5350r143r266J3206J862j0856
1199d930M826N435q043J82O117n018j777P212k371n308N341J020o655K235M693
1214B959m696m05N563k744l723M576k49m924K955L613m028j80M308k045l283K562
1230B59P13k249R85J489o19lQ4j103K69J85j300P58J616n68j071R44L63j894o46
1249a788J593N36j059N27J695p20j877P40P87j219j63J670N60o89o29M44K47j322
1267f67p60J961O11j737P46J855k166j551J968m18j556J906Q64j604J131L70k498
1284a545P92J644k364M91L508k024k109L833j027m699L557L060n585O93O865m199
1300H91n157O424R27p631L203N230n516J78N356n021k205P278m559o284J0644
$$ plain form
1186 -7628 5198 3618 -9262 2500 9997 -7098 -6083 9267 124 -9142 4064 5926 -4930
1199 -4930 -104 5331 -2712 -2530 3587 -1431 -3208 4004 1633 -3675 1666 2686 -3969 -1734 2959
1214 2959 -1737 -2142 3421 677 -3046 1530 1281 -3643 -688 2925 -1103 -1283 3025 980 -2303 259
1230 259 972 -1277 -292 1197 578 575 659 -444 -175 10 -1290 -532 1084 516 -555 389 752 -1142 -1788
1249 -1788 -195 341 -718 -191 1504 784 -1093 -353 434 -785 -948 722 1282 593 -36 408 655 -667
1267 -667 -1427 534 1145 -592 154 2009 -157 -1708 260 -158 -1714 192 1056 -548 583 953 -1545
1284 -1545 -753 891 -1473 -982 2526 502 -1607 2226 1199 -3500 57 3117 -2468 -1775 5090 891
1300 891 -4266 2158 3085 -4546 -1343 3887 -1629 -1451 3905 -1116 -3321 3957 -602 -6886 3758
1315C758J712j2653O139J0171j2317m040J3311m521q794J1273N09j1110R186M790
1329G414j5905M881J5037j4636p481K0591l210j8022J2325P698j5938M242J0812
1342G808j3486J756J6271j5933r680K5503m475k7176J8939J9559k7252m252K6483
1355A4065j0419j5676J7375j964j3458J7831j27k4083J9174J8601l5383l071L9231
1368B2096j5836l0528K9847J2363l0388P631J6812k0688M670J9373k6273l379
1380a4300L8834j9511l5486L9647J7656m8346N435M0784k3281j8589K7744o934
1392C653j5326K4566j0405k7142L7669J2788n4546J3809N3914l9590l6557N1844
1404A4677Q837m5368J5742K2763k5139P986J4622l3343J0845M1365m1551k8972
$$ plain form
1315 3758 5470 -7183 -1044 9127 -3190 -7230 6081 1560 -7234 4039 4548 -6562 2624 7414
1329 7414 -8491 -3610 11427 -3209 -10690 9901 6691 -11331 994 8692 -7246 -3004 7808
1342 7808 -5678 -3922 12349 -3584 -13264 12239 7764 -19412 -473 19086 -8166 -12418 14065
1355 14065 3646 -12030 5345 3381 -10077 7754 7627 -16456 2718 21319 -14064 -17135 22096
1368 22096 6260 -24268 5579 17942 -12446 -4815 11997 -8691 -4021 15352 -10921 -14300
1380 -14300 24534 5023 -30463 9184 26840 -21506 -16071 24713 1432 -17157 10587 3653
1392 3653 -11673 12893 2488 -24654 13015 25803 -28743 -14934 38980 -610 -37167 14677
1404 14677 23514 -21854 -6112 16651 -8488 -502 14120 -19223 -8378 32987 -8564 -37536
1416c7536O4470K720o7735K6022N0049m4043k0042M1625r651j8084K6471j5788
1428a522k1709M6116l248o1191L6546N3638o3207k6412P1055o482n6550K9193
1440c773K4133l1775J1633J1784l4009K3778L4081n9092j2353P8143k1916p3269
1452e2635N3255M7371o5212j1807N2665j7782k0985K6626j7266j0670M6535k2312
1464G783n3501N8225L5446q2094k458Q1923k9827n7856M7616K0810m1296J2647
1476b582J1848k8886K7507K0956n9731Q479P2358m4880o0684P1390K9251p5681
1488c0655O655N5856k8825j9756K8094j7724m500L9021l2700l5827O7371J1052
1500C8062q3414K3898P3731n2982m4692O1785Q716m5442J8671J1779k4483K5046
$$ plain form
1416 -37536 26934 29654 -38081 -12059 37990 -6053 -26095 15530 5879 -12205 14266 -1522
1428 -1522 -23231 22885 19637 -41554 -5008 48630 -14577 -40989 30066 23584 -32966 -3773
1440 -3773 20360 -11415 218 12002 -22007 1771 35852 -23240 -35593 42550 20634 -52635
1452 -52635 620 47991 -17221 -29028 23637 5855 -15130 11496 -5770 -16440 30095 7783
1464 7783 -45718 12507 47953 -34141 -36599 45324 15497 -42359 5257 26067 -15229 -2582
1476 -2582 9266 -19620 7887 28843 -30888 -22409 49949 5069 -55615 15775 45026 -30655
1488 -30655 -24000 31856 3031 -16725 11369 -6355 -10855 28166 -4534 -40361 27010 38062
1500 38062 -45352 -21454 52277 -705 -45397 16388 25104 -20338 -1667 10112 -14371 10675
1512A0675O145n0387K7141N3285n9447l3226P7965P14p3837K8355M7997m1145
1524e765j2586L2167j6771l512K8054l1933j7963N8307r484o5364M0910N1331
1536D7391o1231k2344O0808p855m0937K4997R364k1399K1046k93l6296L0850L0426
1549C4527n6986q045O6727j9875n5802M1332L0169m5634j885L0246j7730k630
1561e586K0046k4610m328M1191k1707m0670M5004K2995n5517K067M9591k2620
1573E856k8672K9550K215k0416J7460q43k2742K5437J3245m1713O454M3576k7838
1586A569l1270L9652J1066l6949Q823K1662j8550j135J4243j7158P89K5279j9785
1599a764j9395L4245M265l8756J2878L0137k4535j3437K6146l268j5929J3478
$$ plain form
1512 10675 16820 -33567 -6426 46859 -12588 -45814 32151 32865 -40972 -12617 35380 -5765
1524 -5765 -18351 13816 -2955 -6467 21587 -10346 -28309 29998 20514 -44850 -3940 47391
1536 47391 -13840 -36184 24624 16769 -24168 829 10193 -11206 9840 9547 -26749 4101 34527
1549 34527 -22459 -30504 36223 16348 -39454 1878 32047 -13587 -15472 14774 -2956 -5586
1561 -5586 14460 -10150 -14478 26713 5006 -35664 9340 32335 -23182 -21115 28476 5856
1573 5856 -22816 6734 8949 -11467 5993 5150 -17592 7845 21090 -20623 -14169 29407 1569
1586 1569 -29701 9951 21017 -15932 -7109 14553 -3997 -5132 9111 -8047 -7258 18021 -1764
1599 -1764 -21159 13086 17351 -21405 -8527 21610 -2925 -16362 9784 6516 -9413 4065
1611D065n56j3892J5703M127k3545J1008K2105k3626j1390K7983l217k3538J4235
1624e38J1649j6535K498J0768j2450L71J3789j2887p574K0327k542j9612J2538
1637a98J2584j7872l037J5783n857p983J0114q49p573Q304N58j1492P287Q454
1651H223j2766j469J4372n493j0793R767L798j0660K820O847o487k26O660n482
1665h89l176P655k561o885P148L251q145K012O213n619k617N826j636l734M739
1680A582Q01m692K882K378m960j18M690k372k612L931O43l609J054J697k418k52
1696a375K192r14n92J991p38k029J601M48k298J030K270j667p67K231m40k381
1712a438J110J017j454L95J455o65l47N51p88m23N27j34k38J036O7j078M94K10
$$ plain form
1611 4065 3509 -10383 5320 9447 -14098 -3090 19015 -4611 -16001 11982 8765 -14773 -538
1624 -538 11111 -5424 -2926 7842 -4608 -4237 9552 -3335 -10909 9418 6876 -12736 -198
1637 -198 12386 -5486 -8523 7260 1403 -6580 3534 2685 -4888 3416 3974 -7518 -231 8223
1651 8223 -4543 -6012 8360 2867 -7926 1841 5639 -5021 -2201 4646 -1841 -2067 4593 -889
1665 -889 -4065 3590 1029 -5856 1292 4543 -3602 -1590 4623 -996 -3613 2213 577 -3157 1582
1680 1582 2383 -2309 573 2951 -2009 -2127 2563 191 -2421 1510 2153 -1456 -402 1295 -1123 -1375
1696 -1375 817 -97 -689 1302 564 -1465 136 584 -1714 -684 1586 -81 -848 1383 943 -1438
1712 -1438 -328 689 -765 -370 1085 420 73 624 -164 -587 -60 -194 -432 604 671 -407 87 297
1730B97j171P1R99j40n76R32L51r94j58N01n37j28Q04R0M5L33l54p88O33j02j153
1751a045J073J130j500L18J487j821j248K425p64k012K655J167l182Q04K201k692
1767a004p84L008j517j163L296j027k775L274N41m921K062M397m181j613N680
1782C273j732m682L979J031m956K814L484n365N39O182n212m234P657k10p905
1797e337N088N154p221J84O279n680k107P781m196n910J0384P79j2321O208R524
1812H609j2055l443J3017l657q625Q860R55q535O589K483j1334O075J0404j3924
1826d581l597J8042n644j5909J2926P511j5178K513J1181r531j067J0816j0285
1839b803n267J7407n514j7951J7018J1566k3255KK1255j0846j2420J5235k88j1066
$$ plain form
1730 297 -874 -803 196 56 -520 412 763 -231 -389 112 -425 -553 251 341 386 719 365 -423 210 108 -1045
1751 -1045 28 1158 -342 -24 1463 -358 -1606 819 55 -1957 698 1865 -1317 -513 1688 -1004
1767 -1004 -1788 1220 -297 -1460 1836 809 -1966 1308 1849 -3072 -1010 3387 -794 -2407 3273
1782 3273 1541 -3141 838 1869 -3087 -273 3211 -2154 -1615 4567 -645 -4879 2778 2568 -5337
1797 -5337 -249 4905 -2316 -2132 4147 -1533 -3640 4141 -55 -5965 4419 5198 -7123 -915 8609
1812 8609 -3446 -6889 6128 2471 -6154 2706 3661 -4874 1715 4198 -7136 -1061 9343 -4581
1826 -4581 -8178 9864 4220 -11689 1237 8748 -6430 -3917 7264 -2267 -3334 7482 -2803
1839 -2803 -8070 9337 3823 -14128 2890 14456 -8799 -8797 12458 1612 -10808 4427 4139 -6927
1853f927J1647j62j5664J4230R904k5401K055K8051j5420k1005K5097P643k5181
1866a1133N924J4848j3679N74J1814j4572J03K1876j6403j8875K9829O230l5038
1879a8502R956K9429k1691j4352K3376k783j4557J4006k629j4631K1000M111l1805
1892a9072J3302L0743l0246j8870L8250J034l3058J4316J7822j9441J656J1561
1904G997j7386N971K1990k5907j2876M0147m834m2188K3041L0551l3944j1430
1916a8868L2004o486j6979J5712m517j1851K2783m353l0943K5735K5458m1982
1928a4287q624M6418j1816l7031K5362J7429k5713L931J2983j6973Q707J5932
1940A6318l0242j722M1567j9222l7889L7771K1736m4627j028L6251j5531j6585
$$ plain form
1853 -6927 4720 4558 -11106 3124 13028 -12373 -10318 17733 2313 -18692 6405 14048 -11133
1866 -11133 -5209 9639 -4040 -3466 8348 -6224 -6121 15755 -648 -19523 10306 16536 -18502
1879 -18502 -8546 20883 -808 -15160 8216 5433 -9124 4882 2253 -12378 8622 12733 -19072
1892 -19072 -5770 24973 -5273 -24143 14107 15141 -17917 -3601 14221 -5220 -3564 7997
1904 7997 -9389 -3418 18572 -7335 -20211 19936 15102 -27086 -4045 26506 -7438 -18868
1916 -18868 13136 6650 -10329 5383 866 -10985 11798 7445 -23498 2237 27695 -14287
1928 -14287 -22911 23507 11691 -25340 22 17451 -8262 -4331 8652 -8321 386 16318
1940 16318 -13924 -15646 25921 6699 -31190 6581 28317 -16310 -17338 18913 3382 -13203
1952a3203J9516n730q532K1687j2390k4568L3565J2930m6694P242M6305k6013
1964D115l1741L5111J0297l0652Q259J3110j5679R815R507k7549P821L3673k9188
1977c101k5979M4074P991m5811J1940L4189k4268j3808K2557o795q148J8037j2845
1990a967j5093L2045K83m0990J9266L5420l4913j8948L9548l34l0054J4451J0726
2003I440j6498R172N410k1925J3784K2570l1708j1092M1097o972l8671K2728K4678
2016B2013k8769n552K2722r410p201J4096j1885p323K5469p482k8320K4404K0029
2029B2791l4886n020L4438j0536k3339J9032O961j6227Q417L855j5711J1900J2295
2042A3970k5391j17L0548j4521k4752K4861J1523k7073K741J8921j1584m664J2066
$$ plain form
1952 -13203 6313 583 -7949 13738 1348 -23220 10345 23275 -23419 -16177 30128 4115
1964 4115 -27626 7485 17782 -12870 -4611 8499 -7180 2635 12142 -15407 -7586 26087 -3101
1977 -3101 -29080 14994 22985 -22826 -10886 23303 -965 -14773 7784 989 -7159 10878 -1967
1990 -1967 -17060 14985 15268 -25722 -6456 28964 -5949 -24897 14651 14317 -15737 -1286 9440
2003 9440 -7058 2114 7524 -14401 -617 21953 -9755 -20847 20250 13278 -25393 -2665 22013
2016 22013 -6756 -12308 10414 1004 -6197 7899 -3986 -11309 14160 6678 -21642 2762 22791
2029 22791 -12095 -17115 17323 6787 -16552 2480 9441 -6786 1631 5486 -10225 1675 13970
2042 13970 -11421 -11538 19010 4489 -20263 4598 16121 -10952 -8211 10710 -874 -5538 6528
2055F528r231l488J6865j0071j6135K2040P416k7039N394K3810j5615j3730J8534
2068E278R85j3540Q544L062j0636Q853N328j6934M359J7516j4521j1280K0346
2081G360J864j9148P298J1570j1976j942R978o628k262J0535o873p883J3686P49
2095F328j6198P446J2663j2661n039J3612k823r230P263J530p269N825K768r248
2109e033M254Q124j0241l518J2145k947j0034P819N293q986P87O321n193j654
2123b863N907l560l142P078j130o993N285M002p786N0P176l511l812N338N7m661
2139b565K953J595m516J932L632m389o96N224k383m263M160J398m430J373L382
2154B407k844p82K680j652j568K752n06k267K533J251l310O57K634k492j275K730
$$ plain form
2055 6528 -2703 -6191 10674 603 -15532 6508 13924 -13115 -7721 16089 474 -13256 5278
2068 5278 6263 -7277 1267 4329 -6307 2546 7874 -9060 -4701 12815 -1706 -12986 7360
2081 7360 9224 -9924 -2626 8944 -3032 -4974 5004 -1624 -3886 6649 -224 -8107 5579 6328
2095 6328 -9870 -2424 10239 -2422 -7461 6151 3328 -5902 1361 2891 -4378 1447 4215 -5033
2109 -5033 -779 7345 -2896 -6414 5731 2784 -7250 569 5862 -3124 -2337 3984 -1209 -2863
2123 -2863 3044 -516 -3658 3420 2290 -4703 582 4584 -3202 -3152 4024 513 -3299 2039 2096 -2565
2139 -2565 388 1983 -2533 -601 3031 -1358 -2054 3170 787 -3476 684 2082 -2348 -975 2407
2154 2407 -437 -1219 1461 -191 -1759 993 487 -1780 753 2004 -1306 -649 1985 -507 -1782 948
2170I48j64j926J504J058k022J92J111j359j49J540o02p21J283j05j557O60Q08
2187D99j253N5J587n51r26J183m5j539Q21Q57j131N4J413p85n66Q24m99q44Q73
2206B7L18q51P80N83j081j74R80j030l71J121j54o54J060l8j279N84O96j356R2
2225g47J670o47r07J294M7j519P67K81r27P11J109j634J02J881j580j679K493
2242G15J78k488J458J797k339r6K001k040p25K821j081k141L213M86l878J589
2258e30K847l422p55L945j766j997L481q31l358L380J084n064J984M821m674k303
2274c158O095j403n062L781J940m391J995L003m960J066N068n385l062Q044j040
2289B531p837N732N032p942m17O750m242k748O222k689m186P543o81r201O180
$$ plain form
2170 948 784 -1142 362 1420 -602 -410 701 -658 -807 733 131 -590 693 588 -969 -309 499
2187 499 -754 -699 888 337 -589 594 549 -990 -169 688 -443 -389 1024 239 -327 497 -2 -846 27
2206 27 345 -506 274 857 -224 -398 582 -448 -819 302 148 -506 554 516 -763 -179 517 -839 -747
2225 -747 923 276 -631 663 710 -809 -42 239 -688 23 1132 -502 -400 1481 -99 -1778 715
2242 715 893 -1595 -137 1660 -679 -775 1226 -814 -1539 1282 201 -1940 1273 1759 -2119 -530
2258 -530 2317 -1105 -1860 2085 319 -1678 1803 972 -2386 994 2078 -2986 -1002 3819 -855 -3158
2274 -3158 2937 1534 -3528 253 2193 -2198 -203 2800 -2160 -1094 3974 -1411 -4473 3571 2531
2289 2531 -5306 426 5458 -2484 -2901 3849 -393 -3141 3081 392 -3794 3749 3068 -6133 47
2304D7O689j0631j400J1358m152p845P890J560p539M250K672p659M680O662j0646
2319d064j372J3485n926j1799J1633N858j3145J774R847o918k764P516n675k946
2333d496J0914n136j0735J3513N481j7913K565J6311j0346r526J3169R31r972
2346e240O744J694r310Q062M813j5232L897J7153j3183j2183J9381K953j9374
2359i825O061J2473j0705k046R156p346j066J1792j0235r439J9384Q69k2701J0027
2373c601J8919j7846r513J8870j587j2770Q977J502q609J0290R59j6964J0376
2386i97J5822k1139p662K6308l672k2631J2864J2597j5810o10J0212q401J373
2399a746J0452j3748m338K2001p123k2803J8302J5673k4528l868K2774o588j3717
$$ plain form
2304 47 6736 -3895 -5295 6063 1911 -5934 1956 3516 -4023 227 2899 -4760 -80 6582 -4064
2319 -4064 -5436 8049 2123 -9676 1957 7815 -5330 -3556 6291 -627 -3391 4125 -1550 -4496
2333 -4496 6418 1282 -9453 4060 9541 -8372 -5807 10504 158 -9368 3801 4732 -5240
2346 -5240 1504 3198 -6112 1950 6763 -8469 -4572 12581 -602 -12785 6596 9549 -9825
2359 -9825 -3764 8709 -1996 -4042 5114 -2232 -3298 8494 -1741 -11180 8204 9073 -13628 -3601
2373 -3601 15318 -2528 -12041 6829 5242 -7528 1449 2951 -5658 4632 5591 -11373 -997
2386 -997 14825 -6314 -13976 12332 8660 -13971 -1107 11490 -4320 -4930 5282 -3119 -1746
2399 -1746 8706 -5042 -9380 12621 5498 -17305 997 16670 -7858 -11726 11048 4460 -9257
2412i257J1396P26q242J0214k007j4315J5134J0541k5250j7K7332j1969k1581
2425a7295K0191J0089j9934K165J1551r416J296Q036j3652J225J9862j3629j7449
2438a6960K4087P781k8054M136K3093j2964j1632J4770r67p959R384m306j0413
2451a0004J6528L464k3576Q186K3052j8767j5060K3519L173k0579O839J0764j0201
2464b662J707O152j1617L956J4262j5775r669K4113j30k5167J1120J8510j7683
2477b883p668J6532l029q101Q765l419o809J3618j596j8309J2400J5230k0631
2490e900o221K2953l911j8022J0733P740j1418K697N367r060M986R010j4474l034
2504h554J9359o683j7745J4696J0835j7625j287J4311o045o507Q252l147m236
$$ plain form
2412 -9257 2139 2865 -5377 4837 2830 -11485 3649 14190 -11060 -11077 16255 4286 -17295
2425 -17295 2896 12985 -6949 -4784 6767 -2649 -1353 6683 -6969 -5744 14118 489 -16960
2438 -16960 7127 14908 -13146 -9010 14083 1119 -10513 4257 3290 -4669 4715 409 -10004
2451 -10004 6524 9988 -13588 -5402 17650 -1117 -16177 7342 10515 -10064 -3225 7539 -2662
2464 -2662 -955 5197 -6420 -2464 11798 -3977 -13646 10467 10337 -14830 -3710 14800 -2883
2477 -2883 -10551 5981 2952 -5149 3616 197 -6612 7006 5410 -12899 -499 14731 -5900
2490 -5900 -12121 10832 6921 -11101 -368 7372 -4046 -1349 4018 -5042 -56 8954 -5520 -8554
2504 -8554 10805 4122 -13623 1073 11908 -5717 -7004 7307 1262 -5245 3007 -140 -4376
2517d376J0032l494j1337J1937P121j7699O88J7349q196j1738J2328L829j0990
2530d546L452M757p193L469N248r945P86J2626q265r935J3328L395j4234L449
2544c608J0543p478l619P473l063l406O631l100o121R036K115j1669L910J0032
2558G676q711n586J0109o6p872M594L099n715K497K934o323J618O665o221l720
2573e022R195o55q933M581N656o905r73N983k606k476M465j794l456M948m5n866
2589c903L671M590o024j337O358k149m676M012J366l968J897K212l493Q12K974
2604B342l589j157M745j413l893L662K076m402L29L168k245j196K796q19j552
2619a148K309k00k663J812J547l164L51L220j781j981K603K05k450Q13J407j614
$$ plain form
2517 -4376 5656 2162 -9175 2762 9883 -7816 -7128 10221 2025 -9713 2615 6444 -4546
2530 -4546 -1094 3663 -3530 -61 5187 -4758 -3972 8654 389 -9546 3782 7177 -7057 -3608
2544 -3608 6935 -543 -4162 3311 248 -3158 3473 373 -5748 3288 5403 -6266 -2356 7676
2558 7676 -1035 -6621 3488 3422 -4450 144 3243 -2472 25 2959 -3364 -1746 4919 -1302 -5022
2573 -5022 4173 3518 -5415 -834 4822 -2083 -3056 2927 321 -2155 2310 516 -2940 2008 1963 -3903
2589 -3903 -232 4358 -1666 -3003 3355 1206 -3470 542 1908 -2060 -163 2049 -1444 -632 2342
2604 2342 -1247 -2404 2341 928 -2965 697 2773 -1629 -1300 1868 -377 -1573 1223 404 -1148
2619 -1148 1161 961 -1702 110 1657 -1507 -1156 2064 283 -1698 905 1110 -1340 -527 880 -734
2635g34J79J697j343n83J813q39j661J665O99j853P63J491j389p63J530n57j098
2652i83J309J59r80P42P71j403L1R58p46o23J206O5j060O68M86j165J55Q78p58
2671b90l27J110k89o49P34J11j137N42O87q21J06J026p04n57R07j75j111Q62N73
2690E98q57K50O10q32j34P45p25k86J252l32r99J042M49j512J92J200r66m65J305
2709E35j87q26R82j69j197R39P38j654M78J706j262j108J758l2j786J053P85j641
2727h88Q30J302k027LK207j679j588K799K62k854J574J715k419j46J993j586n57
2744a059K561j320k004L188J60l883J957K896l534q46L933j322k431K595p9k677
2760a865K420J015l885J810L711m251j809N375j213m668L558K248m121J091K716
$$ plain form
2635 -734 -555 1142 -201 -784 1029 190 -1471 194 893 -960 -197 1294 -95 -858 672 115 -983
2652 -983 326 485 -495 247 1018 -385 -354 604 -142 -765 441 506 -554 114 600 -565 -410 468 -290
2671 -290 -617 493 204 -445 289 400 -737 -195 492 -329 -223 803 99 -458 449 274 -837 25 598
2690 598 -259 -9 601 -231 -365 380 -345 -631 621 289 -710 332 781 -731 -539 661 -305 -770 535
2709 535 348 -478 504 335 -862 77 815 -839 -361 1345 83 -1025 733 701 -1085 -32 753 -888
2727 -888 -58 1244 -783 -780 1427 -252 -1840 959 1221 -1633 -59 1656 -763 -909 1084 -502 -1059
2744 -1059 1502 182 -1822 1366 1526 -2357 -400 2496 -1038 -1884 2049 727 -1704 891 812 -1865
2760 -1865 555 1570 -2315 -505 3206 -1045 -2854 2521 1308 -3360 198 2446 -1675 -584 2132
2775B132l423L84L727m006j910O261j243o244M931L819o806m21O016k971k880
2790b634M380j088l009M620o70n985M942L996p971k19Q770l793o380O279K139
2805C377o378K279L171m606J940M080o480m79Q577m695p602R037L517j0199J686
2820b775P890n327l318N873k526k522O151k884n963Q440K340j1599L069J0753
2834G602q092o440J0193P98q115L843K965n520L425K789p979K921R046q937o142
2849g643J2850L83j3023N319R171q522k684P430l238k484N933m482m550J0540
2863E000n43j2884P358J0580j2444m999J3281j488r692O153L055o049L941J450
2877B719q256N553P750j2159k666J5397m036j3753R545P889j1391r95Q478m226
$$ plain form
2775 2132 -1291 -907 2820 -1186 -3096 3165 1922 -4322 609 4428 -2378 -2799 3217 246 -2634
2790 -2634 1746 658 -2351 2269 1599 -4386 556 4552 -3419 -3638 5132 1339 -5041 1238 3377
2805 3377 -3001 -722 2449 -2157 -217 3863 -2617 -3096 5481 786 -6816 2221 5738 -4461 -2775
2820 -2775 5115 -212 -3530 2343 -183 -2705 3446 562 -5401 3039 5379 -6220 -3151 7602
2834 7602 -490 -6930 3263 4061 -4054 -211 2754 -2766 659 3448 -4531 -1610 7436 -1501 -7643
2849 -7643 5207 5590 -7433 -2114 7057 -1465 -4149 3281 43 -2441 3492 -990 -5540 5000
2863 5000 4457 -8427 -1069 9511 -2933 -7932 5349 3861 -5831 322 3377 -2672 1269 2719
2877 2719 -5537 16 7766 -4393 -7059 8338 4302 -9451 94 7983 -3408 -4403 4075 -151
2891a51j820N537n610k029J0489m747j1038J1370P319j5239m41J4394n660r481
2905g107Q447K083o599M295Q87o625O806M157j2733J567J4371q571j1172J3292
2919C098M874j3433J897Q835o019j737N429n259k82R084o965p726J2960K394j5448
2934h298M256J3302r452o920J0490n7o948M621J95m986O638J140j0513N062J0349
2949H879j1025o345J3919O5j2521N431P331p313o98N075m673L16O212o604l862
2964e813J1625j691j2207P297R048j1046l333J0695k126o443N358K07m287M958
2978B242k0p785N914O345j0377j848J1779l400r644P019M732p555O26M734m002
2993a240M30M077n382j286Q311l644p644P865M470r651J83Q317m132m556N556
$$ plain form
2891 -151 -1971 3566 -2044 -4073 6416 1669 -9369 2001 9320 -5919 -6360 8034 2374 -7107
2905 -7107 1340 3423 -3176 1119 2006 -4619 2187 6344 -6389 -4822 9549 978 -10194 3098
2919 3098 7972 -5461 -3564 5271 -748 -2485 2944 -2315 -2597 6487 -478 -8204 4756 7150 -8298
2934 -8298 -4042 9260 -192 -7112 3378 3321 -3627 994 1189 -3797 2841 3981 -6532 -1470 8879
2949 8879 -2146 -8491 5428 5493 -7028 -1597 5734 -1579 -2277 2798 -1875 -1559 4653 -1951 -5813
2964 -5813 5812 4121 -8086 -789 8259 -2787 -6120 4575 2449 -3994 1364 1571 -2716 2242
2978 2242 2222 -5563 351 6696 -3681 -5529 6250 2850 -6794 225 4957 -2598 -1972 2762 -1240
2993 -1240 -810 3267 -2115 -3401 4910 1266 -6378 1487 5957 -3694 -3511 4806 674 -3882 1674
3008A674l15l623L860k16m878M597K910p752Q67Q184m772n663P022J804o779J715
3024a365L807l672K97L177l609k84N112l583m037O211J132o839K207N439m454
3039d61k454M834r55k981K848o5k842L280R16m649J661M313m383k283N460n29
3055A710m427K623K221l348L52K236k247n2K785k160j580L812m74l990K344K693
3071B498l490o70L559j363j931K063Q7k104J827L91k336J339J995k671n28K840
3087A506j088k432K305J092k394N21J599j367m19J576j241o82J963l88j656J564
3103D59P89k147J10J849j059j095J733n7j292R66K19j272O45R43j226j20J482
3120I27o79j144J243K12j429O57Q90j004qJ039o20o59J110l81r19R24M77j066
$$ plain form
3008 1674 1359 -2264 1596 1380 -3498 1099 4009 -3743 -2876 5308 536 -5127 1895 3699 -3080 -1365
3024 -1365 2442 -1230 -933 2244 -1365 -1649 3463 -120 -4157 2054 3186 -3653 -1446 3993 -461
3039 -461 -2915 1919 964 -2017 831 766 -2076 1204 2120 -2529 -868 3445 -938 -3221 2239 1710
3055 1710 -2717 -94 2127 -1221 -869 1367 -880 -932 1853 -307 -1887 1925 1451 -2539 -195 2498
3071 2498 -992 -1662 1897 534 -1397 666 753 -1351 476 867 -1469 -130 1865 -806 -1334 1506
3087 1506 418 -2014 291 1383 -1011 -490 1109 -258 -677 899 -342 -1024 939 551 -1105 459
3103 459 1248 -899 -789 1060 1 -1094 639 582 -710 256 475 -797 -152 791 -435 -555 927
3120 927 248 -896 347 559 -870 -213 677 -327 -335 704 84 -575 535 154 -765 159 636 -430
3138d30K67Q45p38n15J083n41n45P88L73j018L62O88r84j36Q79l91m17P30o1o49
3158d10O12J51q99K10Q93q00j43R91k71q70P44J86r09M80N18p83K43O91q47l16
3178e29J018l09j140J140N28j204K90Q42q33l01Q29m98k95J140m03j201J305M96
3196H75j810M08J420r81o53J343k27r09Q57j6j114R71P13j732M15J883j540j146
3214a243K008m7j915J049R88j443N36R95j710J86J859j672j187K753Mk753J450
3231a42J833k360l64K151j272p35K102j102j533K651o4l227J736K546l044r55
3247a779L594j053k605K243M50k268J694R36k802J388K516l342j223M641j257
3262A133m056L195K121l685L36K789k419l23K455k258j136M185j384m187L971
$$ plain form
3138 -430 -163 682 -56 -571 512 -29 -574 214 587 -431 -69 619 -365 -501 378 -13 -430 300 239 -410
3158 -410 202 353 -546 -336 557 -243 -386 605 334 -536 208 394 -515 -35 483 -300 -57 634 -213 -529
3178 -529 489 180 -960 180 708 -496 -206 636 -197 -498 331 -167 -462 678 275 -926 379 875
3196 875 -935 -527 893 -88 -741 602 375 -534 323 307 -807 164 877 -855 -440 1443 -97 -1243
3214 -1243 765 718 -1197 -148 840 -603 -67 928 -782 -596 1263 -409 -1596 1157 1161 -1592 -142
3231 -142 1691 -669 -1033 1118 -154 -889 1213 111 -1422 1229 1165 -2062 -326 2220 -824 -1779
3247 -1779 1815 762 -1843 400 850 -1418 276 1212 -1590 -202 2314 -1028 -2251 2390 1133
3262 1133 -2923 272 2393 -1292 -956 1833 -586 -909 1546 -712 -1848 2337 953 -3234 737
3277G37K367n357R8M891k441k597L459k08k650K778j11l577L229K241n359L45
3293b155O157l429m532N250J589n165J366L147l179L46K664l634M1M822l271m269
3309d252O416J468p302J906N864m500k648M769r05k737L413r42l427M696R61o853
3325d073K610O366n864l594P445K3o319L003K958l958R53K373m005J307M756n248
3341a267k960P809o60q159M337N906o309j884N739j731k837L442j481k624N277
3356B598n69o707M833N435q000k077Q694j995o617M726K858m954J416K247m222
3371b334K135L854o043j006Q217l244p415O706M080p851j7O359l118k521L839
3386A641j892j747M736k036n235O255L025q612O82Q470m378n892O408J486n278
$$ plain form
3277 737 3104 -2253 -2155 2736 295 -2302 1157 949 -1701 1077 966 -2611 618 2859 -2500 -2155
3293 -2155 4002 573 -3959 1291 2880 -2285 -919 2228 -951 -605 2059 -1575 -1534 3288 17 -4252
3309 -4252 2164 3632 -3670 -1764 4100 -400 -3048 1721 816 -1921 1492 550 -2877 1819 2780 -4073
3325 -4073 -1463 4903 -961 -4555 2890 2913 -3406 -403 2555 -1403 -450 1923 -2082 -775 3981 -1267
3341 -1267 -4227 3582 2922 -5237 -900 5006 -1303 -3187 2552 821 -2016 1426 -55 -2679 2598
3356 2598 2029 -4678 155 5590 -2410 -4487 4207 2212 -4405 321 3179 -1775 -359 1888 -2334
3371 -2334 -199 3655 -2388 -3394 4823 1579 -5836 870 4950 -2901 -2918 3441 323 -2198 1641
3386 1641 -251 -1998 2738 702 -4533 1722 4747 -3865 -3183 5287 909 -4983 1425 2911 -2367
3401b367K059K014l603K297K354n849R20O992n009n299P898J989q403K000N904
3416C897m394k035M235j833j410M134k662l704O289O50p736L155O714o103l425
3431d228O796k99n224L007J549l186K144J234m541K100M780n592k614P277o40
3446B563o923L840M387n044r91M029j929j346L126k105j916M891q51n595L940
3461G6M058o130j300O326j600m323L431J019l112J857Q47l219K084K805m681n05
3477b367N556k161m661M130K488m876M99L491k321r98K568j809j027L411j470
3492D53l152L761J720m862L36M636k705k704L485L98k845J566P52k136J520J372
3508A595l247N38L613k513k458L708O68l865J227K426k130n28K123j199p49K042
$$ plain form
3401 -2367 -308 1706 -1897 400 2754 -3095 -2175 4817 -192 -5491 2407 4396 -4007 -2007 3897
3416 3897 -497 -2532 1703 -130 -1540 2594 -68 -3772 2517 3167 -4569 -1414 5300 -803 -4228
3431 -4228 2568 2269 -2955 52 1601 -1585 559 1793 -2748 -648 4132 -1460 -4074 3203 2563
3446 2563 -4360 -520 3867 -1177 -2168 1861 -68 -1414 1712 -393 -2309 2582 1731 -3864 76
3461 76 4134 -1996 -3296 3030 1430 -2893 538 1557 -1555 302 1149 -2070 14 2819 -1862 -2367
3477 -2367 3189 1028 -3633 497 2985 -1891 -1392 2099 -222 -1220 1348 -461 -1488 1923 453
3492 453 -2699 1062 2782 -2080 -1744 2892 187 -2517 968 1366 -1479 87 839 -1297 223 1595
3508 1595 -1652 -1114 2499 -14 -2472 1236 1904 -1961 -734 1692 -438 -966 1157 -42 -791 1251
3524A251j139j871K775L19l101J291K702k593j305K775l41k155J465O98j594R86
3540A63P85j890M78J866j881r55K607l22k281J539J252k032k12J672q43n40J227
3557F33n34q22J460j04j782J115J250j699l78J957o62j472J258M37j326N32O79
3574E42j063L79J028j206l59J410n13j132J047O81j237J79R88p94m39R13k66o75
3592e17P89O2p68N49O47j322J38J088o54n63R00O2r35M75M24p88K17O65o40j69
3612c40Q38m29o13P61K03j017N75N19o72q7P98n05n73P83Op07N21M40p21O4N85
3633D29o04k52Q00m24n02Q87O1q58M29O45q94j33P97k82m41O80q7m92M22N0p05
3654d74M81N53q32j16R92k91q65O10K70p18L60L44n38K93M24p60k31J102n01r34
$$ plain form
3524 1251 112 -1759 1016 1335 -1766 -475 2227 -366 -1671 1104 763 -1392 73 771 -823 163
3540 163 948 -942 -464 1402 -479 -1434 1173 851 -1430 109 1361 -671 -883 789 -54 -594 633
3557 633 99 -723 737 633 -1149 -34 1216 -483 -861 1096 434 -1038 220 657 -669 -137 542
3574 542 -521 -142 886 -320 -679 731 218 -914 133 814 -423 -244 744 -50 -489 424 158 -517
3592 -517 272 334 -434 115 762 -560 -422 666 12 -551 349 411 -524 -49 375 -413 -196 469 -171 -340
3612 -340 498 69 -544 217 420 -597 -22 497 -175 -262 536 31 -542 241 247 -460 61 501 -220 -156 429
3633 429 -175 -427 373 -51 -553 334 395 -463 -34 611 -283 -416 381 99 -342 338 251 -241 181 231 -474
3654 -474 7 560 -272 -388 604 313 -552 58 328 -390 -30 314 -224 69 493 -267 -498 604 103 -831
3674h31J113M77j161J74Q25o65k58N70m36j15J025o29r21J324K67j630M35J430
3692I94r26q05J243j75q45P78m7r66R57M42j525N40J578j495q52J819k3j762R20
3711a50Q99j111K65P99j090J71J239j279q83K242k39k327J447J503j980n30J831
3728H07o32r47J426n23j034J635j22k215J611J747k666m71K955q43k347J832P30
3745I43j698O09R10j710Q71J546k473l09L128j309k735K703J496l164K77K306
3761A391j621p12J716j073o44K241j015k257K711J276l942N67L690j901k371K766
3777H22L53k240J293M50j799J526J139l226P66L579k713k690M041P68m064J057
3793i38K887k381n08J988j489m16K549k033k086M259J45m643J858L868l718j759
$$ plain form
3674 -831 282 759 -402 -228 597 -68 -326 244 -192 -307 718 89 -832 492 759 -871 -436 994
3692 994 68 -737 506 331 -514 264 217 -749 208 650 -875 -335 1243 -252 -1104 715 692 -1070 -150
3711 -150 749 -362 -97 702 -388 -217 1022 -257 -1140 1102 863 -1464 -17 1486 -494 -1024 807
3728 807 175 -772 654 131 -903 732 610 -1605 6 1753 -913 -1384 1571 728 -1619 213 943
3745 943 -755 -146 764 -946 -75 1471 -1002 -1311 1817 508 -2227 476 1972 -1192 -915 1391
3761 1391 -230 -942 774 -299 -943 1298 283 -1974 737 2013 -1929 -1362 2328 427 -1944 822
3777 822 1175 -1065 228 678 -1121 405 1544 -1682 -916 2663 -50 -2740 1301 2069 -1995 -938
3793 -938 1949 -432 -940 1048 -441 -857 1692 -341 -2427 1832 1977 -2666 -808 3060 -658 -2417
3809b417L951l69k492J767L36j982K086K65l391J982L239m019j809N262p14m535
3825b840K465K595l083j91K167j638J09K161k724j052M270j116m432L381L247
3840C319m674q96M397j178k853K356K12j754K057j36l114K789K218m712l29N412
3856C114k185m188L899J879l892L23K472k044J71J937k575j44L855k393l546M547
3872A230J642n284P75M386k427k278K783k24j782K005o43j993K955Q68m449J219
3888a217M511l550k838M472O64m014J357K164k088K57J345k124K98L089k797k156
3904b627M551J62m840J987L525l302j409L341q05j563J696m23j575K413N2l561
3920b378K043L246l838j456M305n67l658K198J665k337M24J340j781O18J816k595
$$ plain form
3809 -2417 1534 1165 -1327 440 776 -1206 880 1145 -2246 -264 2975 -1044 -2853 2409 1695 -2840
3825 -2840 -375 2220 -863 -1054 1113 -525 -416 1745 -979 -2031 2239 1123 -3309 72 3319
3840 3319 -1355 -2251 2146 968 -1885 471 683 -1071 986 850 -2264 525 2743 -1969 -2298 3114
3856 3114 929 -3259 640 2519 -1373 -1050 1422 -622 -451 1486 -1089 -1233 2622 229 -3317 1230
3872 1230 2872 -2412 -1637 2749 322 -1956 827 603 -1179 826 183 -1810 1145 2013 -2436 -1217
3888 -1217 3294 -256 -3094 1378 2042 -1972 -615 1549 -539 -282 1063 -1061 -763 2326 -471 -2627
3904 -2627 1924 2086 -2754 -767 2758 -544 -1953 1388 583 -980 716 293 -1282 1131 1183 -2378
3920 -2378 -335 2911 -927 -2383 1922 1355 -2303 -105 1560 -777 -353 987 -794 -176 1640 -955
3936i55p39L578q27l602K723K168l440m27L045j257j387J684l89j023J877n57
3952D72k299K125J577l401j1L597j501k537K413Q43k256N38J250j373M52J171
3968A060j800j62K687j653k219K827R23l074O52K463j607j279J736m12q72J444
3984G14m79j354J850L64k456O92K317j838j389K348J18j914Q99Q64j231L84O75
4001E64j106K44J470j344r32J966p5k040R98J501j434n72J450m52o41O82j63q51
4019g35J248M2j536Q08J294j440p28J835k90j402R87O14j055J80P26p55p6Q07
4037E24p28l26J269l04j235Q57P13j154j33J031m44m82O64j60n18O43o3q25N26
4056a45P79j017q1J117m51q38O77M28q65K66M98n82J19N59o26k55P63j69o13O74
$$ plain form
3936 -955 -1694 1884 1057 -2545 178 2346 -1094 -1521 1524 267 -1120 564 175 -848 1029 472
3952 472 -1827 298 1875 -1526 -1537 2060 559 -1978 435 1278 -978 -440 810 -563 -111 1060
3968 1060 -740 -902 1785 132 -2087 740 1663 -1411 -759 1704 97 -1182 554 142 -730 714
3984 714 235 -1119 731 1095 -1361 -669 1648 -190 -1579 769 887 -1027 -128 736 -495 -111 564
4001 564 -542 -298 1172 -172 -1104 862 787 -1253 -255 1246 -188 -760 690 238 -403 279 116 -735
4019 -735 513 555 -981 -173 1121 -319 -1047 788 498 -904 83 697 -358 -178 548 -207 -283 524
4037 524 -204 -530 739 435 -800 57 770 -384 -517 514 70 -412 252 92 -426 217 154 -671 -145
4056 -145 634 -383 -464 653 202 -636 41 469 -396 -130 368 -214 -95 464 -162 -417 346 177 -436 238
4076B38K20q22J43P84o96l68P71k67l14M86J64o99L69L98p61jP11m97k77Q09k71
4097A20o00N05L35p28J84N58m58j37N75k25m72M61l6m08L18M33o25lP25o56l46
4118d80P83n0p30N24M57p09L6L90m05L2N23m80k38Q40j21q81N53M56p57j91Q33
4139C85k03l71M70k66k22M22k23n41N84M86r38J07R42n18p91P44K97o08N6L62
4159A74l78L86K64q54R6J037p43p37J115L42j352K82R89p10l39O68k76k01O94
4178D57n28o01J140O3j370N65J412j292o43J264j30r40O26K01p27P30J32j000
4196f41O71J091j646m80J861k05j706J048R36j157p8P06p59J62Q09r46l25J676
4214A017o32j735J441J217k021k47J806o10r87J003k5p86R62k51j189J338R53
$$ plain form
4076 238 458 -364 -221 563 -133 -501 270 3 -311 175 339 -360 9 407 -354 -355 356 -141 -418 391 120
4097 120 -480 25 360 -368 -184 374 -84 -221 354 129 -343 118 82 -326 -8 425 -200 -203 522 -134 -480
4118 -480 303 253 -477 47 504 -205 -169 221 -184 -152 371 -109 -347 493 372 -509 44 500 -257 -448 385
4139 385 182 -189 281 15 -207 215 -8 -549 35 521 -417 -310 632 114 -677 67 364 -244 -188 174
4159 174 -204 182 446 -408 -312 725 -18 -755 360 702 -650 -368 621 -89 -428 240 -36 -237 457
4178 457 -71 -672 468 531 -839 -274 1138 -154 -797 467 337 -603 23 224 -503 227 359 -641
4196 -641 30 1121 -525 -1005 856 651 -1055 -7 929 -228 -306 400 -359 -197 612 -334 -659 1017
4214 1017 385 -1350 91 1308 -713 -960 846 236 -751 252 227 -559 403 152 -1037 301 1254
4231A254k171O8K278j087j820J753P22j636L68R80j153L45Q38j586J30K028j242
4248F9j806K413Q80k894N47K072j346r22J412k44n60J068n66j277J923L65k699
4265a565R61K543k033j591K589J88k147Q49R04j164N02O41j654P27J812k061j318
4282a817L119m2l136J413K123k043o58J836p71n87J337j079p51K286l33k808J925
4299A4K101l087p04L201o50k467J818O30j486P94L62j611J132J579k662l70L301
4316A895j169k919K296J678k624j24K018r88n68J301j194m54K173j080k091K552
4332G02J231l378J18L264j657j995K298L94j739Q96M65j554J283R10k721O25K949
$$ plain form
4231 1254 -917 -849 1429 342 -1478 275 997 -639 -271 709 -444 -99 739 -847 -717 1311 69
4248 69 -1737 676 1556 -1338 -791 1281 -65 -987 425 181 -379 689 123 -1154 769 1134 -1565
4265 -1565 -604 1939 -94 -1685 904 1092 -1055 -206 698 -466 36 677 -977 -250 1562 -499 -1817
4282 -1817 1302 1260 -1876 -463 1660 -383 -1041 795 24 -563 774 -305 -1056 1230 897 -1911 14
4299 14 2115 -972 -1676 1525 875 -1592 226 856 -630 164 526 -1085 47 1626 -1036 -1406 1895
4316 1895 726 -2193 103 1781 -843 -967 1051 63 -505 796 -398 -852 1321 241 -1850 702
4332 702 1933 -1445 -1327 1937 280 -1715 583 977 -762 134 599 -955 328 1238 -1483 -858 2091
$$ [...]
8191A89
##END NTUPLES=NMR FID
##END=
