##TITLE=1H_ES-AkrN-200
 CDCl3
 8 sc, 
 5.7.2023
##JCAMPDX= 6.0         $$ Bruker NMR JCAMP-DX V2.0
##DATA TYPE= NMR FID
##DATA CLASS= NTUPLES
##ORIGIN= UXNMR, Bruker Analytische Messtechnik GmbH
##OWNER= root
$$ XWIN-NMR		Version 3.5
$$ Wed Jul  5 14:41:56 2023 Russian Standard Time (UT+4h)  she@DPX200
##.OBSERVE FREQUENCY= 200.13135
##.OBSERVE NUCLEUS= ^1H
##.DELAY= (6, 6)
##.ACQUISITION MODE= SIMULTANEOUS
##.ACQUISITION SCHEME= undefined
##.AVERAGES= 8
##.DIGITISER RES= 18
##SPECTROMETER/DATA SYSTEM= spect
##.PULSE SEQUENCE= zg30
##.SOLVENT NAME= CDCl3
##.SHIFT REFERENCE= (INTERNAL, CDCl3, 0, 15.7039)
##AUDIT TRAIL= $$ (NUMBER, WHEN, WHO, WHERE, WHAT)
$$ ##TITLE= Audit trail, XWIN-NMR		Version 3.5
$$ ##JCAMPDX= 5.01
$$ ##ORIGIN= Bruker BioSpin GmbH
$$ ##OWNER= she
$$ F:/spectra/data/she/nmr/H-F/1/audita.txt
$$ ##AUDIT TRAIL=  $$ (NUMBER, WHEN, WHO, WHERE, WHAT)
(   1,<2023-07-05 14:40:52.70 +0400>,<she>,<DPX200>,
      <created by zg, POWCHK disabled, PULCHK disabled
       configuration hash MD5:
       00 E9 B6 7A A2 85 ED C7 34 08 36 98 17 FE 4E 26
       data hash MD5: 16K
       BB AD 89 B8 9B 5A 32 A7 BD A2 CD 9D 1F 15 FD 3E>)
$$ ##END=
$$ 
$$ hash MD5
$$ 88 86 FD 43 A2 80 F9 8C 71 2E EC 4C 7C 4A C4 5C
##$RELAX= 
##$RELAX= 
##$RELAX= 
##$RELAX= 
##$RELAX= 
##$RELAX= 
$$ Bruker specific parameters
$$ --------------------------
##$DU= <F:/spectra>
##$EXPNO= 1
##$NAME= <H-F>
##$PROCNO= 1
##$TYPE= <nmr>
##$USER= <she>
##$AMP= (0..31)
100 100 100 100 100 100 100 100 100 100 100 100 100 100 100 100 100 100 
100 100 100 100 100 100 100 100 100 100 100 100 100 100 
##$AQSEQ= 0
##$AQ_mod= 1
##$AUNM= <au_zg>
##$AUTOPOS= <>
##$BF1= 200.13
##$BF2= 200.13
##$BF3= 200.13
##$BF4= 200.13
##$BF5= 200.13
##$BF6= 200.13
##$BF7= 200.13
##$BF8= 200.13
##$BYTORDA= 1
##$CFDGTYP= 0
##$CFRGTYP= 5
##$CHEMSTR= <none>
##$CNST= (0..31)
1 1 145 1 1 1 1 1 1 1 1 1 1 1 1 1 1 1 1 1 1 1 1 1 1 1 1 1 1 1 1 1 
##$CPDPRG= <>
##$CPDPRG1= <>
##$CPDPRG2= <>
##$CPDPRG3= <>
##$CPDPRG4= <mlev>
##$CPDPRG5= <mlev>
##$CPDPRG6= <mlev>
##$CPDPRG7= <mlev>
##$CPDPRG8= <mlev>
##$CPDPRGB= <>
##$CPDPRGT= <>
##$D= (0..31)
0 1.2 0 0 0 0 0 0 0 0.06 0 0.03 0 0 0 0 0.0002 0 0 0 0 0 0 0 0 0 0 0 0 
0 0 0 
##$DATE= 1688553652
##$DBL= (0..7)
120 120 120 120 120 120 120 120 
##$DBP= (0..7)
150 150 150 150 150 150 150 150 
##$DBP07= 0
##$DBPNAM0= <>
##$DBPNAM1= <>
##$DBPNAM2= <>
##$DBPNAM3= <>
##$DBPNAM4= <>
##$DBPNAM5= <>
##$DBPNAM6= <>
##$DBPNAM7= <>
##$DBPOAL= (0..7)
0.5 0.5 0.5 0.5 0.5 0.5 0.5 0.5 
##$DBPOFFS= (0..7)
0 0 0 0 0 0 0 0 
##$DE= 6
##$DECBNUC= <off>
##$DECIM= 32
##$DECNUC= <off>
##$DECSTAT= 4
##$DIGMOD= 1
##$DIGTYP= 9
##$DL= (0..7)
0 120 120 120 120 120 120 120 
##$DP= (0..7)
150 150 150 150 150 150 150 150 
##$DP07= 0
##$DPNAME0= <>
##$DPNAME1= <>
##$DPNAME2= <>
##$DPNAME3= <>
##$DPNAME4= <>
##$DPNAME5= <>
##$DPNAME6= <>
##$DPNAME7= <>
##$DPOAL= (0..7)
0.5 0.5 0.5 0.5 0.5 0.5 0.5 0.5 
##$DPOFFS= (0..7)
0 0 0 0 0 0 0 0 
##$DQDMODE= 0
##$DR= 18
##$DS= 0
##$DSLIST= <SSSSSSSSSSSSSSS>
$$ [...]
##$SUBNAM2= <"">
##$SUBNAM3= <"">
##$SUBNAM4= <"">
##$SUBNAM5= <"">
##$SUBNAM6= <"">
##$SUBNAM7= <"">
##$SUBNAM8= <"">
##$SUBNAM9= <"">
##$SW= 18.05172834244
##$SWIBOX= (0..15)
0 0 2 0 0 0 0 0 0 0 0 0 0 0 0 0 
##$SW_h= 3612.71676300578
##$TD= 16384
##$TD0= 1
##$TE= 0
##$TE2= 300
##$TE3= 300
##$TEG= 300
##$TL= (0..7)
0 120 120 120 120 120 120 120 
##$TP= (0..7)
150 150 150 150 150 150 150 150 
##$TP07= 0
##$TPNAME0= <>
##$TPNAME1= <>
##$TPNAME2= <>
##$TPNAME3= <>
##$TPNAME4= <>
##$TPNAME5= <>
##$TPNAME6= <>
##$TPNAME7= <>
##$TPOAL= (0..7)
0.5 0.5 0.5 0.5 0.5 0.5 0.5 0.5 
##$TPOFFS= (0..7)
0 0 0 0 0 0 0 0 
##$TUNHIN= 0
##$TUNHOUT= 0
##$TUNXOUT= 0
##$USERA1= <user>
##$USERA2= <user>
##$USERA3= <user>
##$USERA4= <user>
##$USERA5= <user>
##$V9= 5
##$VALIST= <valist>
##$VCLIST= <CCCCCCCCCCCCCCC>
##$VD= 0
##$VDLIST= <DDDDDDDDDDDDDDD>
##$VPLIST= <PPPPPPPPPPPPPPP>
##$VTLIST= <TTTTTTTTTTTTTTT>
##$WBST= 1024
##$WBSW= 4
##$XGAIN= (0..3)
0 0 0 0 
##$XL= 0
##$YL= 0
##$YMAX_a= 438386
##$YMIN_a= -470520
##$ZGOPTNS= <>
##$ZL1= 120
##$ZL2= 120
##$ZL3= 120
##$ZL4= 120
##$ABSF1= 10
##$ABSF2= 0
##$ABSG= 5
##$ABSL= 3
##$ALPHA= 0
##$AQORDER= 0
##$ASSFAC= 0
##$ASSFACI= 0
##$ASSFACX= 0
##$ASSWID= 0
##$AUNMP= <proc_1d>
##$AZFE= 0.1
##$AZFW= 0.1
##$BCFW= 1
##$BC_mod= 2
##$BYTORDP= 1
##$COROFFS= 0
##$CY= 11.3945322036743
##$DATMOD= 1
##$DC= 2
##$DFILT= <>
##$DTYPP= 0
##$F1P= 15.7292609196834
##$F2P= 12.9074282941183
##$FCOR= 0.5
##$FTSIZE= 0
##$FT_mod= 4
##$GAMMA= 1
##$GB= 0.15
##$INTBC= 1
##$INTSCL= 1
##$ISEN= 128
##$LB= 0.24
##$LEV0= 0
##$LPBIN= 0
##$MAXI= 10000
##$MC2= 0
##$MEAN= 0
##$ME_mod= 0
##$MI= 1.114404
##$NCOEF= 0
##$NC_proc= 0
##$NLEV= 6
##$NOISF1= 3.799351
##$NOISF2= 2.8
##$NSP= 1
##$NTH_PI= 0
##$NZP= 0
##$OFFSET= 15.70392
##$PC= 1
##$PHC0= -20791.39
##$PHC1= 17.25272
##$PH_mod= 1
##$PKNL= yes
##$PPARMOD= 0
##$PSCAL= 0
##$PSIGN= 0
##$REVERSE= no
##$SF= 200.130013532006
##$SI= 16384
##$SIGF1= 3
##$SIGF2= 2
##$SINO= 400
##$SIOLD= 16384
##$SREGLST= <1H.CDCl3>
##$SSB= 0
##$STSI= 0
##$STSR= 0
##$SW_p= 3612.71676300578
##$SYMM= 0
##$S_DEV= 0
##$TDeff= 0
##$TDoff= 0
##$TI= <>
##$TILT= no
##$TM1= 0
##$TM2= 0
##$TOPLEV= 0
##$USERP1= <user>
##$USERP2= <user>
##$USERP3= <user>
##$USERP4= <user>
##$USERP5= <user>
##$WDW= 1
##$XDIM= 8192
##$YMAX_p= 0
##$YMIN_p= 0
$$ End of Bruker specific parameters
$$ ---------------------------------
##NTUPLES= NMR FID
##VAR_NAME=  TIME,          FID/REAL,        FID/IMAG
##SYMBOL=    X,             R,               I
##VAR_TYPE=  INDEPENDENT,   DEPENDENT,       DEPENDENT
##VAR_FORM=  AFFN,          ASDF,            ASDF
##VAR_DIM=   8192,          8192,            8192
##UNITS=     SECONDS,       ARBITRARY UNITS, ARBITRARY UNITS
##FACTOR=    0.0002768,     1,               1
##FIRST=     0,             0,               0
##LAST=      2.2672688,     0,               0
##MIN=       0,             -470520,         0
##MAX=       2.2672688,     438386,          0
$$ Real data points
##PAGE= N=1
##DATA TABLE= (X++(R..R)), XYDATA
0 0 0 0 0 0 0 0 0 0 0 0 0 0 0 0 0 -1 5 -8 8 -8 9 -13 16 -21 24 -25 32 -38 44 -51 59 -68 77 -87 101 -114 127
37 127 -144 162 -182 202 -225 250 -282 309 -343 380 -419 463 -511 562 -617 680 -749 826 -907
56 -907 1000 -1104 1224 -1357 1507 -1680 1881 -2114 2374 -2652 2867 -2667 6 31171 438386
71 438386 -18128 -400975 168763 223411 -185625 -50705 96091 -94744 72540 119188
81 119188 -243443 -41251 360797 -107332 -367282 245286 270444 -321635 -112726 294353
91 294353 -23816 -165666 98610 -5599 -67676 154446 -49232 -226737 206581 202463 -329312
102 -329312 -94733 373421 -45520 -325102 144974 197927 -169274 -52433 101025 -54276
112 -54276 27499 75765 -171402 -16211 263507 -99452 -271104 219033 199812 -282223 -78198
123 -78198 264620 -36249 -168584 99057 38880 -76674 82817 -10343 -144216 126794
133 126794 127345 -224686 -49307 262253 -51382 -227736 125887 134938 -146620 -32979 95051
144 95051 -44368 -362 61911 -101812 -17601 169267 -67902 -179042 154374 131417 -201839
155 -201839 -44765 197110 -33918 -135120 78553 47315 -67512 34652 11687 -74984
165 -74984 67889 65180 -134538 -14753 158409 -54542 -136763 104455 75538 -116977 -6946
176 -6946 81095 -45520 -18657 55388 -50982 -24708 98400 -30873 -105367 88534 75664
187 75664 -121468 -22323 120841 -25490 -83049 54410 32243 -47389 15049 13355 -38550
198 -38550 32579 31482 -70181 -504 83354 -40668 -71276 68485 34793 -77155 4123
209 4123 58316 -34087 -23597 41013 -15354 -26731 41929 -1842 -47293 33685 35244 -50955
221 -50955 -8855 52359 -14505 -34761 28971 11243 -24386 12094 7771 -22720 14414 17407
233 17407 -34498 -1983 40527 -19108 -35379 33249 17332 -39943 29 32113 -15310 -18250
245 -18250 20267 2766 -15398 8699 5488 -11528 5889 8485 -10533 1387 11980 -7604
257 -7604 -4978 11959 -2879 -9467 10391 3289 -13325 4820 11167 -12336 -7124 13732 -906
270 -906 -14542 5253 9981 -9136 -6597 8404 2041 -7532 -479 5516 626 -3517 127 4618
284 4618 1388 -4299 -8 6136 -13 -5446 2977 6117 -3825 -4741 5203 3305 -6542 -2431 6198
299 6198 209 -7177 265 5748 -3098 -6763 2941 4927 -5205 -4265 5761 2808 -6376 -1150 6899
314 6899 77 -6104 2530 7050 -2576 -4919 5458 4759 -5935 -2260 7400 620 -6886 2048 5696
329 5696 -4126 -4591 3573 1496 -4212 -1653 1537 960 -1289 -3807 482 5252 -3494 -7101 7442
344 7442 6490 -11281 -1789 14487 -3390 -12495 10709 8534 -13422 678 13617 -7544 -7141 13047
358 13047 -1412 -12476 9656 6361 -14647 1784 11963 -10129 -5765 11141 -5642 -7340 12080
371 12080 -4822 -13509 17706 5614 -27748 8601 29076 -23996 -20133 35616 5596 -35312
383 -35312 12063 25990 -21158 -7330 20750 -9915 -6940 20813 -12926 -18442 31460 3247
395 3247 -41371 16702 35269 -35115 -18183 39589 -6350 -29959 23767 4810 -28745 23358
407 23358 15323 -44942 11756 50872 -41031 -37051 62446 11603 -63764 17653 47913 -33236
419 -33236 -17170 31043 -11987 -7956 28478 -26342 -23738 57789 -1519 -74097 35278 65546
431 65546 -65759 -38552 75208 801 -61252 27839 25114 -36526 17404 18295 -50394 19980
443 19980 60612 -62191 -42211 93273 6487 -96067 33463 72557 -55345 -29346 50701
454 50701 -12118 -16809 35116 -33044 -28600 77834 -7042 -101657 54634 91711 -96571 -56028
466 -56028 110704 6815 -93554 30682 48321 -41617 5552 19142 -46285 28578 58399
477 58399 -80786 -35776 118365 -7782 -121781 55631 93594 -82079 -42531 76250 -7038
488 -7038 -35989 34799 -23006 -27899 77507 -12752 -107757 67644 99456 -116944 -60526 135959
500 135959 6328 -117975 36060 68062 -48333 -7621 23075 -38017 31748 51747 -91370
511 -91370 -26067 133928 -23751 -138761 78039 107339 -108375 -50691 102540 -4643 -59503
522 -59503 35170 -4657 -28723 63091 -13912 -95671 71763 87896 -123211 -49044 143015
533 143015 -5431 -125493 47633 76011 -58831 -16291 32378 -28694 22927 42073 -83196
544 -83196 -16132 127195 -33247 -134142 87354 105131 -119135 -51334 115269 -1808 -75306
555 -75306 31928 14068 -26565 42003 -13917 -73868 69190 67221 -118375 -30217 137396
566 137396 -21382 -120894 61234 74080 -71637 -17043 46873 -25337 5529 38223 -62210
577 -62210 -14836 103907 -30256 -111926 79915 87716 -109883 -41631 108133 -4805 -75269
588 -75269 30853 23647 -26673 23776 -7717 -51320 54796 45840 -97523 -14887 115342 -28782
600 -28782 -102856 63545 64788 -73805 -17330 54813 -18693 -11983 31249 -35113 -13180 70988
612 70988 -23202 -79304 64108 60995 -89112 -24278 88543 -12944 -62591 33531 21123
623 21123 -29869 16474 1536 -38142 36551 32926 -70998 -7912 85397 -27019 -76188 54790
635 54790 47693 -63634 -11806 50450 -14947 -19381 24456 -14309 -11380 40127 -14229 -46077
647 -46077 43009 33359 -61025 -8104 60497 -17439 -42914 31123 14441 -28942 11017 9120
659 9120 -26084 16972 22934 -41300 -6317 51901 -16979 -46942 36226 29205 -42599 -5980 35332
672 35332 -10789 -15865 17212 -4804 -8631 20720 -7305 -23658 25180 15483 -36006 181 35365
685 35365 -16460 -24943 24647 7432 -23802 7549 12163 -16975 2341 15448 -16350 -6984 22945
698 22945 -5329 -21050 15773 12977 -19299 -1633 16469 -6036 -6962 9538 -2202 -5024 10006
711 10006 -2464 -11108 11322 7081 -16706 383 16672 -8431 -12592 12406 4543 -13295 1753
724 1753 8836 -6751 -3486 6565 -2162 -4102 4825 78 -4433 3617 2303 -4268 1776 3653 -3498
739 -3498 64 4627 -2624 -2535 5257 153 -5459 2824 4295 -4892 -2344 5248 -325 -5216 1433 3403
755 3403 -2865 -2713 2202 1188 -2445 -1055 1830 756 -1787 -673 2152 719 -2018 78 2782
770 2782 172 -2055 1279 2643 -1284 -1876 2119 1844 -2316 -1241 2542 312 -2910 -182 2465 -1136
786 -1136 -2842 1007 1962 -1850 -2095 1714 1387 -2315 -1198 2683 907 -2781 310 3712 -931 -2716
802 -2716 2900 2777 -3297 -677 4226 -405 -3384 2147 2459 -2665 -906 2092 -702 -1003 151 -1117
818 -1117 434 1437 -3322 -1424 4826 -1552 -6224 4312 4810 -7470 -1413 8521 -2713 -6347 6933
833 6933 2456 -7673 3663 6374 -7522 -719 9628 -4590 -7056 9133 2015 -9833 3632
846 3632 6082 -7487 -40 6114 -7264 -1056 10266 -8191 -9290 15658 2034 -20270 7270
859 7270 18169 -15756 -10504 19599 557 -15899 8614 7186 -10954 5207 7266 -14057 3697
872 3697 17337 -15673 -11934 24508 965 -25798 10907 17843 -18598 -4815 16475 -9604 -6371
885 -6371 16939 -10835 -15646 26053 3612 -35087 12917 32526 -27822 -20016 34496 3377 -28499
898 -28499 11339 13506 -15019 6451 7689 -21184 10651 25630 -30695 -16656 44921 -1325
910 -1325 -47042 20673 34776 -32737 -14570 30335 -6989 -15252 18551 -9335 -16917 31880 638
923 638 -44800 22521 42256 -43010 -25709 52126 3246 -43987 15987 23319 -20672 3691 9879
936 9879 -23644 14810 29763 -42333 -18168 62022 -5750 -65491 31050 50428 -47418 -24398
948 -24398 44961 -3155 -25577 17896 -5364 -15547 33933 -5014 -49654 34273 46140 -59449
960 -59449 -25185 70264 -2406 -60068 25290 34597 -30640 -2066 17064 -21785 12610 29119
972 29119 -45681 -16025 69557 -11523 -74544 40447 58825 -59377 -30672 57260 618 -36271
984 -36271 15869 2470 -13119 29097 -9596 -46665 41789 43394 -69844 -20807 82202 -9435
996 -9435 -71776 34628 44179 -41031 -8906 26774 -17381 5232 25741 -40990 -11956 66617
1008 66617 -17141 -72640 47723 56235 -67250 -27110 65098 -3425 -43126 19568 8565 -15698
1020 -15698 23498 -7914 -40839 41542 37239 -70214 -14512 83262 -15402 -73919 40287 48018
1032 48018 -47304 -14686 34119 -10593 -4432 18792 -29237 -6547 53749 -20352 -60146 48781
1044 48781 45626 -67246 -19193 65674 -8974 -45525 24208 13661 -20547 16234 -1386 -32609
1056 -32609 32446 29617 -59377 -8987 72109 -18257 -64329 41065 41583 -47668 -12159 36141
1068 36141 -9615 -9983 15996 -19260 -4785 40194 -19264 -45258 44039 32311 -60315 -9632
1080 -9632 59070 -14226 -42574 27002 16153 -24133 8680 6459 -22366 18960 20856 -40966
1092 -40966 -4666 52247 -16467 -47107 34882 30126 -40452 -7559 31978 -9495 -12031 14586
1104 14586 -10720 -5956 26969 -12739 -31405 32287 21485 -45471 -4105 45297 -14478 -33122
1116 -33122 24698 13449 -23058 5021 10522 -15085 8138 14109 -24062 -2107 32253 -12931
1128 -12931 -28356 26094 16547 -29751 -974 23960 -10551 -10427 13781 -5293 -7839 16177 -5055
1141 -5055 -19424 18100 13001 -27489 -1939 27795 -10011 -20948 16937 9178 -16341 2274
1153 2274 9139 -8273 2052 8110 -11368 -812 16378 -7914 -13834 15952 7016 -18126 2435
1166 2435 14789 -9311 -6856 11238 -2277 -8159 8440 558 -10780 6549 7409 -12119 -1646
1179 -1646 12447 -4816 -9404 8307 3667 -8069 1835 4766 -4538 726 4296 -4684 -603 7245
1193 7245 -3391 -5726 7419 2855 -8517 1433 7270 -4666 -4334 5877 388 -5394 2030 2417
1207 2417 -3809 -193 2633 -2288 -1205 2418 -844 -1765 1928 214 -1899 1599 1075 -2050 954
1222 954 2336 -1846 -854 3027 -208 -2462 1865 1967 -2472 -668 2552 -168 -2161 882 1413 -1404
1238 -1404 -1124 843 396 -1161 -424 518 235 -705 -491 798 464 -818 -172 1341 263 -1317 631
1255 631 1599 -566 -1011 1478 1005 -1328 -153 1445 -229 -1149 516 829 -619 -921 94 434 -281
1272 -281 -1143 25 1031 -719 -1559 1171 1013 -2081 -257 2583 -848 -2114 2380 1539 -2747 366
1288 366 3187 -1443 -1782 2547 458 -2016 1035 782 -1444 1018 636 -2502 1018 2545 -3593 -1558
1304 -1558 4818 -1310 -5156 3559 2972 -5653 -21 5178 -3318 -2724 5528 -1107 -4884 5190 2761
1319 2761 -7159 1897 7158 -5336 -3605 7423 -440 -5658 4295 1642 -5203 3727 2614 -8100
1333 -8100 2516 8657 -9200 -6040 13220 -359 -14156 6540 9983 -11000 -3353 10411 -3566
1346 -3566 -5173 7857 -2588 -6804 10498 1653 -14302 7086 13374 -13914 -6763 17232 -1485
1359 -1485 -13792 8387 5689 -10284 4324 5440 -12313 3856 13957 -15304 -9780 22890 -259
1372 -259 -24681 10534 18588 -17365 -8051 16894 -2791 -8667 9298 -3631 -7552 15921 -1147
1385 -1147 -21946 14366 20211 -25220 -10168 29973 -2548 -25151 13148 12965 -15923 1725 9090
1398 9090 -13313 4597 16167 -20761 -10099 31572 -3736 -33895 17691 25914 -26435 -11754
1410 -11754 25406 -2456 -14330 10567 -2212 -8019 18393 -3384 -26617 20594 24715 -35100
1422 -35100 -12501 41554 -3499 -36448 16699 21715 -20972 -3725 13034 -10801 3263 14788
1434 14788 -22809 -7679 36337 -8393 -39539 25071 30177 -35804 -13399 34516 -3462 -21458
1446 -21458 13009 1799 -9976 17456 -4021 -27033 24367 24742 -41508 -10870 49087 -7560
1458 -7560 -43516 22180 27322 -26509 -7661 17496 -7941 571 11826 -21805 -3798 36464
1470 36464 -13645 -39855 31869 30108 -43195 -12484 42240 -5125 -28330 15465 7984 -12426
1482 -12426 12047 -1616 -22595 22624 20870 -40309 -7350 48745 -11057 -43752 25895 27760
1494 27760 -30406 -8307 21479 -7020 -3283 10513 -17892 -2223 32653 -15692 -35841 33971
1506 33971 26337 -45337 -8809 44685 -8311 -31526 18023 12184 -15095 6817 1613 -16443
1518 -16443 18080 14819 -34669 -2160 42430 -14716 -38225 28004 23859 -32139 -6567 24130
1530 24130 -7287 -7893 10672 -11376 -3435 24700 -12376 -28322 28847 20755 -39490 -5642 39900
1543 39900 -9153 -29244 18201 13017 -16143 3229 4947 -11743 11745 10291 -26190 416
1555 416 33058 -15038 -29478 26600 17419 -30491 -2890 23706 -8666 -10379 11470 -5455 -5443
1568 -5443 16588 -7516 -19534 21138 13625 -29813 -1880 30416 -9620 -22293 16770 10087
1580 10087 -15164 2306 6648 -8573 6032 7598 -16981 474 22251 -11527 -20096 20263
1592 20263 11321 -23744 -768 19361 -8002 -10051 10296 -1281 -6462 9286 -2509 -11677 12121
1605 12121 7782 -18352 436 19084 -8405 -13583 13366 5223 -12153 3049 6455 -7104 2154
1618 2154 6183 -9598 -771 13273 -6795 -11970 12619 6224 -15301 299 12732 -6153 -7265
1631 -7265 7572 305 -5405 4400 284 -5880 5416 3824 -9150 971 9837 -5425 -6649 8610
1645 8610 2165 -8058 2689 5037 -5169 -294 4998 -3864 -2264 6060 -1779 -5866 5036 2910
1659 2910 -6948 47 5936 -3140 -3397 3984 182 -3056 2197 577 -2785 2111 1840 -3825 693
1674 693 4218 -2738 -2625 4379 824 -4185 1533 3169 -2706 -1220 2939 -663 -2106 1598 491
1689 491 -2012 701 953 -1527 -151 1235 -1086 -781 1219 -425 -961 1099 382 -1240 865 1158
1705 1158 -1239 -205 1763 -274 -1286 1226 1007 -1382 -37 1355 -366 -1002 689 486 -826 -351
1721 -351 328 -235 -384 -119 -185 55 -118 -548 158 579 -650 -502 1054 235 -1094 380 1336 -700 -564
1740 -564 1244 329 -1049 457 882 -431 -146 516 -175 -82 198 -661 -30 577 -855 -711 1160 -158
1758 -158 -1557 816 887 -1736 -155 1913 -1077 -1610 2153 552 -2402 1062 2038 -1671 -610 2242
1774 2242 -529 -1131 1662 -221 -1345 1959 278 -2819 1585 2348 -3464 -963 4041 -1500 -3557
1789 -3557 3055 1286 -4000 1204 2646 -3714 -354 4297 -2793 -3064 5228 519 -5702 2591 4434
1804 4434 -4358 -1181 4626 -1782 -2082 3857 -1476 -3345 5199 555 -7347 3669 6606 -7590 -3529
1819 -3529 9303 -1188 -8246 4816 3959 -6322 956 4236 -5125 373 6393 -5993 -4170 10244
1833 10244 -468 -10833 6153 8123 -9351 -2614 9274 -2752 -4740 6067 -1758 -5236 8070
1846 8070 351 -11652 6456 10632 -12895 -5949 15552 -1205 -13825 6690 7680 -8834 -183
1859 -183 5513 -5866 1321 7749 -9477 -4493 15647 -2377 -16687 10472 12923 -15131 -5002
1872 -5002 15101 -2884 -9223 7706 93 -6685 8854 38 -13875 9206 12771 -18037 -6606
1885 -6606 21635 -2705 -19416 9859 11377 -12333 -1668 7931 -6075 1339 8141 -11918 -3650
1898 -3650 19818 -5358 -21194 15537 16407 -21316 -6620 21306 -2840 -13867 8629 2953 -7455
1911 -7455 7659 -186 -13768 11289 12627 -21471 -5384 25964 -5082 -23574 13473 14481 -16395
1924 -16395 -3374 11601 -5679 -992 8230 -11232 -3263 20705 -6933 -22564 18405 17321 -25601
1937 -25601 -6691 25744 -3719 -18176 9953 6071 -8493 5551 33 -11841 11978 10531
1949 10531 -23001 -2558 27633 -8703 -25003 17435 15398 -20373 -3717 15111 -5501 -3813
1961 -3813 8015 -8730 -2865 18247 -7573 -20321 19077 15346 -26487 -4934 26666 -5317
1973 -5317 -19353 11275 7792 -10131 3362 1831 -9796 9852 8229 -20941 -567 25654 -10444
1986 -10444 -23274 19219 14240 -22156 -3140 17591 -5495 -7051 7862 -4792 -3036 13633
1998 13633 -6659 -15603 17577 11114 -24230 -1601 24576 -7766 -17864 13022 7358 -11554
2010 -11554 2446 3964 -8028 6588 6733 -16424 73 20861 -9828 -19140 17598 11572 -20416
2023 -20416 -2098 16889 -5363 -8244 7784 -1632 -3768 9123 -4224 -11075 13421 7464 -19273
2036 -19273 430 19726 -8230 -14597 12993 6087 -12128 2048 5890 -6742 2617 5534 -10665
2049 -10665 -143 14393 -7739 -13194 13817 7241 -16281 -46 13506 -5493 -6825 7351
2061 7351 -532 -4041 6048 -2196 -7312 9118 4590 -13376 1622 13850 -7373 -10127 10713
2074 10713 3922 -10395 1821 5913 -5375 -74 4601 -5626 -1029 8288 -4331 -7604 8763
2087 8763 3918 -10555 1166 9050 -4817 -4731 6187 -150 -4039 3934 137 -4743 4676 3028
2101 3028 -7600 894 8161 -4902 -6020 7201 2087 -7192 1364 4623 -3773 -1011 3352 -2478
2115 -2478 -1346 4025 -2013 -3570 4548 1353 -5712 1371 4992 -3419 -2368 4346 -302 -3332 2527
2130 2527 1228 -3067 1687 2365 -3340 -228 3945 -1834 -2920 3314 1185 -3564 603 2331 -1973
2145 -1973 -928 1853 -820 -1069 1542 -514 -1700 1720 661 -2421 780 2288 -1852 -1174 2478
2160 2478 138 -2025 1263 1311 -1609 -79 1364 -740 -690 1221 -213 -1062 748 372 -1249 252
2176 252 696 -876 -334 737 -556 -640 924 -52 -882 652 706 -922 -45 1154 -397 -755 1080 467
2194 467 -858 298 915 -532 -243 650 -73 -419 399 67 -401 153 -152 -407 247 116 -881 81 566
2213 566 -860 -568 1026 3 -1069 530 916 -940 -203 1072 -167 -482 558 147 -487 533 229
2230 229 -566 561 653 -956 -104 1007 -782 -711 1013 -190 -1214 860 400 -1615 447 1473 -1643
2247 -1643 -821 2064 -96 -2029 1218 1229 -1587 59 1509 -962 -205 1562 -989 -763 2285 -295
2263 -295 -2329 1893 1749 -2921 -264 2867 -1582 -1844 2323 -276 -2495 2013 842 -3303 1182 2921
2279 2921 -3403 -1543 4260 -623 -3772 2410 2042 -3028 526 2191 -2322 292 3065 -2967 -1746
2294 -1746 5071 -693 -5464 3616 4083 -5494 -1356 5490 -1621 -3711 3393 204 -3365 2996 786
2309 786 -5136 2628 4557 -6000 -2196 7580 -1421 -6693 4351 3784 -5385 300 3780 -3309 165
2324 165 4378 -4630 -2305 8108 -1455 -8685 5818 6598 -8674 -2551 8621 -1809 -5830 4112
2338 4112 858 -3733 3780 241 -6547 4679 5832 -9364 -2275 11533 -2543 -10127 6707 6149
2352 6149 -7865 -516 5797 -3569 -663 5031 -5233 -2549 9766 -2493 -11033 8091 8276 -12046
2366 -12046 -3306 12007 -2166 -8474 5180 2232 -4837 3480 170 -6890 6082 6093 -11955 -1754
2380 -1754 14734 -4140 -13207 9254 8218 -10823 -1590 8323 -3300 -1963 5011 -4907 -1883 10251
2394 10251 -3786 -11599 10395 8476 -14736 -2665 14624 -3303 -10614 6631 3680 -5987 2759
2407 2759 957 -6579 6103 5787 -12691 -1074 15876 -5551 -14491 11077 9309 -12954 -2374
2420 -2374 10478 -2999 -4059 4726 -3363 -1740 8963 -4428 -10524 11398 7504 -16010 -1372
2433 -1372 16128 -4863 -11936 8267 4889 -7555 1754 2357 -5588 4968 4754 -11564 -26 14865
2447 14865 -6473 -13448 12050 8363 -13731 -1656 11309 -3305 -5031 4901 -2063 -1901 7161
2460 7161 -4154 -8721 10650 5721 -15180 -150 15360 -5843 -11718 9342 5205 -8786 867
2473 867 4140 -4334 2583 3896 -8567 340 11850 -6189 -10708 11508 6317 -13200 -502 11026
2487 11026 -4100 -5523 5334 -699 -2728 5338 -2609 -6654 8485 4073 -12545 792 12847
2500 12847 -6017 -9853 8818 4406 -8556 681 4674 -3662 796 3164 -5868 410 8445 -5149
2514 -5149 -7424 9519 4120 -10899 811 9392 -4369 -5039 5541 200 -3583 3569 -546 -4622
2528 -4622 5180 2908 -8644 901 9068 -5087 -7015 7358 3009 -7235 862 4536 -3149 -495
2542 -495 3041 -3214 -227 5309 -3448 -4828 6792 2243 -7850 1342 6958 -3845 -3822 4950 459
2557 459 -3658 2290 652 -3315 2595 1905 -5043 550 5367 -3374 -4125 5113 1433 -5168 1087 3464
2573 3464 -2850 -891 2538 -1684 -784 3184 -1559 -2903 3829 1273 -4722 970 4378 -2821 -2560
2588 -2560 3621 522 -2929 1353 1313 -2101 726 1258 -2388 81 2602 -1918 -1974 2935 389 -3252
2604 -3252 1156 2169 -1999 -646 2107 -785 -1147 1796 -125 -1518 1582 920 -2115 497 2180
2619 2180 -1314 -1307 2011 240 -1785 748 879 -1266 54 752 -834 -218 1165 -758 -950 1336 140
2636 140 -1578 514 1273 -1131 -547 1351 -140 -877 884 523 -870 222 740 -572 -147 854 -306
2653 -306 -580 711 48 -680 237 269 -653 -27 529 -472 -307 663 -319 -691 618 258 -857 155 713
2672 713 -594 -375 698 -53 -567 460 341 -512 147 500 -442 -201 543 -211 -249 476 -165 -389 399
2691 399 -98 -782 192 618 -779 -248 924 -288 -918 613 445 -744 6 555 -337 39 641 -407
2709 -407 -283 890 -111 -698 709 477 -892 119 910 -677 -372 962 -574 -745 1180 -98 -1436
2726 -1436 878 1032 -1604 -445 1596 -418 -1321 1093 404 -1006 519 466 -1030 647 1158 -1533
2742 -1533 -452 2124 -612 -1847 1683 1055 -2012 267 1689 -1357 -511 1600 -1066 -1111 2143 -200
2758 -200 -2625 1631 1883 -2768 -736 2878 -994 -2022 1738 272 -1543 1393 454 -2232 1526 1990
2774 1990 -3158 -605 4118 -1039 -3601 2872 1972 -3346 82 2640 -1785 -704 2203 -1782 -1256
2789 -1256 3340 -798 -3917 2967 2879 -4617 -855 4488 -1477 -3139 2686 609 -2389 1857 587
2804 587 -3054 2300 2884 -4622 -859 6091 -1729 -5467 4094 3333 -4880 -338 3783 -1893 -1028 2375
2820 2375 -2169 -1150 4500 -1649 -5083 4535 3574 -6721 -751 6690 -2067 -4613 3767 1388 -3188
2835 -3188 1953 758 -3527 2841 3111 -5968 -498 7545 -2691 -6679 5605 4063 -6450 -704
2849 -704 5041 -2090 -1854 2710 -2110 -1092 4969 -2382 -5537 6122 3908 -8508 -619 8544 -2846
2864 -2846 -6257 4950 2412 -4322 1332 1510 -3323 2650 2834 -6327 -17 8278 -3753 -7467 6933
2879 6933 4385 -7885 -559 6167 -2416 -2516 3028 -1691 -1135 4596 -2664 -5450 6613 3467 -9264
2894 -9264 -19 9365 -3678 -7035 5597 3079 -5083 765 2435 -2835 2063 2404 -5809 665 7748
2909 7748 -4297 -6928 7575 4029 -8826 -228 7163 -2890 -3623 3585 -713 -1839 3735 -2044
2923 -2044 -4647 6022 2703 -8883 590 9066 -4053 -6777 6280 3216 -5674 739 3038 -2526
2937 -2526 1100 2139 -4841 847 6578 -4464 -5657 7572 3008 -8638 593 7224 -3459 -3917
2951 -3917 3853 47 -2391 2775 -1150 -3634 4715 1954 -7189 1226 7603 -4350 -5610 6304
2965 6304 2429 -5871 898 3494 -2587 84 2085 -3301 419 4983 -3591 -4487 6490 2118 -7451
2980 -7451 934 6402 -3333 -3711 4092 398 -2850 1910 -146 -2715 3189 1218 -5442 1288 5512
2995 5512 -3888 -3948 5526 1432 -5136 1148 3409 -2477 -401 2261 -1908 -239 3341 -2270 -2896 4563
3011 4563 1090 -5465 1096 4667 -3172 -2858 3596 310 -2659 1452 587 -1953 1698 884 -3372 836
3027 836 3728 -2960 -2409 4277 627 -4105 1275 2806 -2119 -694 2203 -843 -714 2008 -1020 -1933
3043 -1933 2802 611 -3447 940 2838 -2354 -1760 2668 -197 -2202 1164 747 -1544 672 880 -1864
3059 -1864 397 2104 -1679 -1374 2664 324 -2552 1027 2085 -1763 -655 1746 -482 -912 1208
3074 1208 -154 -1052 1214 300 -1676 484 1470 -1551 -846 1818 -211 -1551 873 685 -1219 119
3090 119 923 -926 -65 1240 -676 -739 1375 331 -1408 605 1193 -972 -448 1139 -210 -609 562
3107 562 33 -702 400 253 -879 190 818 -878 -513 972 -168 -1042 605 617 -862 -39 684 -370
3125 -370 -294 675 -1 -608 451 248 -528 125 478 -484 -270 607 -176 -360 520 38 -606 256 207 -522
3145 -522 10 545 -396 -394 588 -77 -652 388 227 -559 80 612 -404 -194 600 -106 -495 438 328 -384
3165 -384 137 372 -194 59 359 -416 -167 713 -171 -645 411 411 -786 -125 644 -393 -422 382 -50 -484
3185 -484 358 -22 -642 398 523 -821 -123 880 -377 -671 713 207 -575 359 260 -487 205 658 -828
3204 -828 -81 1165 -408 -1069 944 585 -1344 -80 1036 -624 -584 673 -288 -430 958 -297 -954
3221 -954 1042 660 -1572 101 1468 -819 -1008 1238 142 -1142 706 452 -1024 433 835 -1413
3237 -1413 -154 1911 -804 -1811 1640 855 -1885 18 1444 -892 -475 1113 -754 -509 1524 -593
3253 -593 -1663 1836 1165 -2493 73 2661 -1177 -1828 1854 473 -1497 905 638 -1468 875 1153
3269 1153 -2257 -127 2694 -1429 -2516 2438 1172 -2846 326 2120 -1327 -756 1486 -1030 -661
3284 -661 2162 -1028 -2365 2647 1460 -3559 236 3615 -1721 -2370 2570 803 -2174 869 796 -1576
3300 -1576 1184 1232 -2878 134 3508 -2181 -3098 3444 1510 -3909 354 2861 -1780 -1142 1850 -1102
3316 -1102 -897 2414 -1184 -2639 3279 1613 -4489 384 4400 -2162 -3088 3218 1158 -2694 762
3331 762 1109 -1810 1221 1266 -3174 441 3870 -2615 -3261 4295 1519 -4803 511 3760 -2093 -1621
3347 -1621 2164 -583 -969 2306 -1177 -2477 3524 1320 -4899 789 4906 -2737 -3411 3871 1216
3362 1216 -3456 918 1524 -1803 898 1297 -3112 637 3856 -2913 -3285 4700 1377 -5364 849 4103
3378 4103 -2404 -2154 2565 -205 -1219 1972 -918 -2137 3203 1028 -4729 1237 4689 -3195 -3344
3393 -3344 4278 1082 -3856 884 2061 -1833 314 1253 -2468 495 3394 -2847 -2874 4499 1102 -5203
3409 -5203 983 4284 -2599 -2314 2778 72 -1757 1604 -418 -1713 2737 678 -3914 1419 4060
3424 4060 -3293 -2748 4245 764 -4030 1128 2405 -1915 -135 1495 -1796 104 2535 -2127 -2114 3740
3440 3740 502 -4369 1321 3586 -2660 -1961 2880 -17 -1841 1272 11 -1429 1895 618 -2972
3455 -2972 1203 3206 -2840 -2085 3869 466 -3542 1190 2327 -1924 -595 1568 -1033 -206 1789
3470 1789 -1497 -1445 2796 166 -3425 1356 2937 -2487 -1433 2684 -85 -1954 1248 516 -1363 1012
3486 1012 555 -2010 814 2212 -2142 -1245 2969 185 -2783 1087 1830 -1615 -564 1386 -474 -589
3502 -589 1023 -699 -837 1838 25 -2216 1033 1906 -1850 -938 2348 -158 -1685 934 790 -1133
3518 -1133 437 606 -1161 232 1293 -1185 -737 1906 -19 -1916 835 1219 -1317 -388 1192 -372
3534 -372 -712 661 -292 -739 978 86 -1379 593 1077 -1150 -558 1522 -121 -1236 755 736 -819
3551 -819 82 615 -495 -38 694 -502 -407 1096 -34 -1021 611 780 -901 -332 940 -363 -622 654
3569 654 -24 -605 454 262 -733 250 671 -687 -317 874 -79 -669 346 642 -535 -59 497 -227
3587 -227 -172 470 -237 -253 454 34 -546 362 561 -600 -125 596 -244 -494 404 88 -575 148 247 -524 62
3608 62 343 -238 -331 444 71 -479 240 308 -388 67 371 -187 -38 491 -188 -394 260 67 -456 122 292
3629 292 -412 -89 380 -240 -420 413 -109 -483 365 268 -441 -157 536 -150 -202 327 -6 -168 193 8 -402
3650 -402 363 266 -540 -63 645 -209 -541 489 204 -573 7 322 -236 -58 214 -324 -118 525 -202 -535
3670 -535 482 325 -632 -14 542 -291 -263 519 19 -205 410 12 -416 496 327 -715 36 956 -520
3689 -520 -733 676 281 -788 170 349 -380 123 88 -635 83 815 -643 -687 786 296 -1035 208 862
3708 862 -576 -349 647 -155 -318 642 -282 -710 901 514 -1199 324 1433 -799 -826 1035 298 -874
3726 -874 199 410 -677 118 365 -962 194 1117 -893 -1000 1493 324 -1666 218 1218 -760
3742 -760 -639 786 -141 -414 760 -330 -853 1136 439 -1650 321 1663 -1178 -1181 1440 428 -1281
3759 -1281 357 621 -804 318 403 -1291 256 1478 -1312 -1269 1980 463 -2169 456 1799 -1173
3775 -1173 -806 1053 -231 -477 956 -488 -958 1601 165 -2153 687 2037 -1611 -1374 2043 438
3791 438 -1764 466 801 -939 418 498 -1415 326 1688 -1431 -1382 2383 490 -2667 779 2114
3807 2114 -1364 -1021 1404 -147 -713 919 -473 -847 1737 180 -2499 974 2291 -1970 -1440 2544
3823 2544 384 -2218 509 1187 -1022 -4 677 -1183 357 1601 -1632 -1295 2509 274 -2848 913
3839 913 2250 -1689 -1214 1659 -111 -944 896 -293 -829 1571 97 -2433 1134 2245 -2231 -1502
3855 -1502 2731 232 -2579 729 1484 -1184 -171 762 -956 221 1414 -1527 -1021 2454 -51 -2750
3871 -2750 1222 2167 -1922 -1080 1948 -15 -1197 771 14 -726 1249 39 -1918 1117 1927 -2143
3887 -2143 -1263 2778 63 -2378 825 1487 -1292 -310 900 -592 100 1160 -1326 -768 2189 -207
3903 -207 -2399 1338 2034 -2036 -980 2193 -157 -1479 880 332 -825 776 270 -1578 871 1523
3919 1523 -1807 -764 2385 -182 -2163 972 1454 -1368 -303 1102 -541 -254 843 -923 -447 1691
3935 1691 -212 -1868 1269 1557 -1865 -641 1948 -113 -1391 807 600 -730 293 283 -877 626
3951 626 881 -1430 -532 1790 -333 -1772 1004 1183 -1349 -423 1068 -363 -334 687 -461 -469 1169
3968 1169 -83 -1339 871 1107 -1367 -402 1581 -286 -1267 711 603 -790 121 274 -466 205 597
3985 597 -921 -278 1337 -365 -1259 848 854 -1154 -239 1003 -261 -551 507 55 -460 492 -30 -880
4003 -880 566 709 -994 -335 1109 -297 -923 668 427 -610 -37 387 -354 26 357 -529 -123 669
4021 669 -275 -703 640 471 -832 -137 877 -169 -514 425 123 -321 231 159 -347 276 500 -604 -186
4040 -186 686 -133 -669 406 320 -462 -41 402 -288 -129 331 -235 -312 469 9 -501 335 319 -500 -168 598
4061 598 -158 -416 341 171 -413 28 97 -194 109 244 -293 -182 445 -28 -275 183 212 -513 39 203 -413
4082 -413 -200 374 -122 -300 296 95 -501 35 251 -250 -72 357 -109 -111 287 11 -334 211 246 -267 -34
4103 -34 369 -183 -164 339 12 -253 190 147 -345 73 315 -278 -54 368 -172 -243 283 192 -255 -9 208 -252
4125 -252 -41 241 -171 -116 316 -197 -371 396 205 -457 75 437 -259 -198 316 79 -154 204 -72 -201 208
4146 208 47 -503 37 531 -335 -318 342 71 -277 -12 249 -133 -1 191 -222 39 394 -432 -329 595
4166 595 32 -735 183 601 -344 -252 406 95 -245 141 -124 -192 406 41 -597 255 659 -543 -397 685
4186 685 -115 -537 202 355 -321 136 280 -393 164 543 -545 -395 837 121 -969 294 742 -643
4204 -643 -415 539 45 -280 329 -129 -244 455 -96 -950 462 791 -877 -471 1076 -106 -848 401
4222 401 514 -487 71 127 -476 130 513 -751 -286 1117 105 -1095 612 1011 -773 -420 812 -45
4240 -45 -420 482 -180 -220 768 -22 -1141 671 936 -1187 -529 1373 -2 -1279 539 633 -598 8
4258 8 267 -517 273 556 -812 -297 1411 -297 -1370 846 1029 -1161 -483 1093 -127 -634 579 -114
4276 -114 -416 681 -50 -1055 788 892 -1486 -499 1524 -192 -1413 663 833 -861 -48 436 -423
4293 -423 152 618 -968 -235 1541 -344 -1435 1004 1159 -1394 -424 1341 -187 -792 540 36 -439
4310 -439 684 -213 -1070 839 828 -1584 -401 1748 -292 -1463 743 862 -1044 -48 604 -317 232
4327 232 613 -920 -236 1392 -454 -1347 1019 1125 -1576 -431 1439 -350 -893 796 167 -523 537
4344 537 -146 -966 689 731 -1385 -222 1574 -502 -1514 1013 777 -1046 -109 764 -463 -65 591
4361 591 -550 -168 1224 -483 -1264 1276 879 -1654 -164 1454 -283 -920 749 403 -551 389 -46
4378 -46 -736 795 568 -1321 -153 1472 -519 -1264 1099 681 -1224 -45 837 -361 -270 494 -354 -138
4396 -138 1010 -381 -948 1203 666 -1368 -99 1301 -450 -1017 693 246 -664 120 290 -507 446
4413 446 465 -959 -88 1206 -607 -1116 1060 753 -1115 -98 949 -329 -399 407 -85 -186 641 -351
4431 -351 -674 845 323 -1174 45 1053 -483 -774 741 274 -721 138 346 -440 247 358 -740 9
4449 9 864 -384 -765 913 460 -974 9 791 -276 -468 360 143 -208 398 -70 -484 486 206 -862
4468 -862 21 845 -393 -643 598 288 -714 165 362 -383 143 292 -417 0 607 -294 -508 595 255
4487 255 -815 81 674 -363 -478 377 88 -230 244 8 -307 301 244 -657 24 608 -343 -466 429 197
4507 197 -644 114 334 -287 -98 272 -196 -71 303 -146 -262 425 227 -419 109 485 -241 -265 373 99
4527 99 -299 106 89 -286 128 237 -285 45 441 -232 -268 354 97 -390 54 228 -173 -132 312 -154 -193 190
4549 190 46 -258 265 153 -391 91 280 -144 -220 301 -68 -209 221 80 -189 96 301 -164 -68 259 -60
4570 -60 -151 257 109 -274 110 77 -138 108 325 -114 -220 263 199 -247 135 224 -127 43 237 -122 -17 308
4592 308 -99 -186 260 164 -433 91 259 -243 -208 290 92 -202 79 59 -172 177 85 -252 135 336 -237 -174
4614 -174 390 91 -470 219 288 -291 -94 210 -130 -4 265 -198 7 354 -32 -462 137 426 -385 -343 221
4635 221 107 -264 179 -77 -123 179 -100 -513 134 347 -483 -195 522 43 -466 154 379 -232 -105 134
4655 134 -109 34 105 -272 -79 591 -149 -594 356 377 -482 -184 392 -31 -323 217 -103 -199 195 -174 -390
4676 -390 287 433 -719 -118 759 -119 -697 372 412 -302 -71 270 -117 121 131 -484 53 724 -323 -761
4696 -761 628 509 -752 -275 560 -80 -273 108 22 -93 297 -182 -507 547 366 -725 50 891 -189
4715 -189 -661 491 478 -484 39 329 -61 71 305 -599 75 774 -387 -801 788 572 -971 -175 752
4734 752 -289 -554 298 131 -89 299 -192 -303 661 295 -910 42 1102 -538 -769 727 390 -589
4752 -589 -37 400 -226 53 184 -389 74 721 -453 -789 915 463 -1044 -38 861 -352 -506 523
4770 523 4 -235 265 -153 -435 555 241 -1025 96 1090 -634 -870 824 447 -836 43 534 -249
4788 -249 -86 239 -334 20 653 -562 -662 967 417 -1171 207 938 -514 -760 463 193 -427 214
4806 214 -67 -379 550 61 -868 322 1028 -672 -795 1019 437 -1085 110 577 -357 -221 254 -281
4824 -281 60 568 -461 -533 903 260 -1072 216 1048 -535 -708 651 316 -495 177 130 -299 437 7
4843 7 -702 192 941 -736 -644 1118 446 -1018 69 703 -407 -199 332 -197 -50 380 -430 -382 850
4862 850 70 -947 220 941 -616 -709 750 167 -509 46 153 -153 232 52 -649 219 725 -613 -479
4881 -479 983 242 -869 82 730 -315 -427 363 -26 -73 247 -266 -269 677 81 -849 259 869 -579
4900 -579 -729 718 143 -632 -7 307 -201 133 86 -332 290 556 -516 -467 703 198 -872 157 825
4919 825 -333 -346 398 -36 -248 158 -145 -191 426 -25 -773 196 513 -490 -498 534 216 -621 101 519
4939 519 -196 -74 192 -172 -10 283 -343 -174 563 127 -659 187 511 -305 -320 352 40 -377 105 92 -199
4960 -199 246 51 -560 229 354 -470 -409 528 172 -440 151 284 -249 -191 220 -28 19 403 -248 -139 497
4981 497 87 -464 112 525 -226 -312 318 43 -265 128 128 -266 68 66 -266 -27 327 -256 -215 262 218 -342
5003 -342 59 227 -132 -29 201 -82 -166 248 -10 -39 170 138 -333 69 335 -131 -59 342 37 -274 163
5024 163 180 -156 -51 36 -188 -6 233 -79 -206 177 147 -315 101 224 -116 55 259 -187 -120 240 136
5045 136 -224 95 254 -133 -5 199 -29 -75 252 10 -203 98 125 -289 81 276 -156 -72 374 -92 -100 118
5067 118 -5 49 168 49 -150 30 289 -200 -179 328 51 -345 108 158 -192 -75 151 -68 -70 116 -169 -204
5089 -204 242 -22 -338 227 291 -174 -164 285 84 -338 104 56 21 31 -12 -184 170 195 -341 -145 437 131
5111 131 -380 128 359 -154 -171 78 33 -45 71 -289 4 290 -92 -400 229 304 -331 -189 385 26 -298
5132 -298 -4 131 12 11 -186 -135 344 254 -364 74 547 -36 -461 153 318 -277 -52 181 -45 -25 27 -297
5154 -297 58 342 -280 -471 489 270 -628 -211 587 -36 -433 5 105 -51 59 4 -215 442 120 -451
5174 -451 50 603 -286 -619 362 348 -499 -157 303 56 -110 15 -156 249 390 -393 -414 498 174 -665 54
5195 54 583 -143 -469 184 166 -89 -43 -93 -133 378 49 -576 200 705 -394 -607 602 298 -725 -210 402
5216 402 -96 -161 136 -87 127 249 -393 -406 615 148 -841 129 759 -272 -562 482 164 -281 -69 56
5236 56 -58 283 -33 -550 244 743 -643 -559 777 211 -774 43 403 -162 -200 200 -119 36 147 -449
5256 -449 -238 698 9 -808 192 799 -453 -620 635 213 -387 -12 100 26 64 129 -468 286 599 -496
5276 -496 -445 704 271 -761 -23 747 -265 -388 166 53 -2 99 -261 -107 632 0 -910 332 678
5295 678 -637 -572 721 179 -587 128 304 -93 88 -35 -257 310 461 -575 -359 793 58 -781 173
5314 173 712 -407 -446 374 -69 -193 -36 -204 0 578 -68 -717 354 665 -464 -508 701 185 -552
5333 -552 -9 339 -145 -40 62 -254 350 324 -592 -121 810 17 -838 66 670 -441 -429 353 40 -325
5353 -325 73 -66 -92 369 200 -533 353 514 -594 -248 752 197 -478 63 388 -204 -158 52 -130 92
5373 92 310 -385 -205 647 -10 -615 182 645 -534 -370 494 163 -339 41 13 -144 233 46 -372 224
5393 224 417 -487 -257 672 175 -558 -30 480 -157 -157 109 -71 45 94 -273 -181 474 36 -499 163 514
5414 514 -334 -202 275 88 -379 22 131 -139 199 33 -300 272 231 -325 -323 460 95 -523 122 471 -160
5435 -160 -157 183 -19 -121 99 -108 -59 313 -19 -417 140 354 -114 -290 281 54 -276 40 78 -11 -53 136
5457 136 -194 151 340 -191 -181 360 135 -416 75 259 -61 -222 177 38 -130 118 3 -124 230 18
5477 18 -299 55 187 -234 -247 352 161 -128 68 203 -200 2 92 -189 70 261 -213 -145 344 -6 -115
5498 -115 48 206 -117 -136 240 -136 -32 59 -40 -143 23 173 -216 -51 216 -106 -189 65 -81 -222 104
5519 104 129 -247 19 263 -155 -109 310 95 -238 88 138 -217 -4 93 -147 -5 166 -103 -91 166 98 -285
5541 -285 -11 212 -274 -61 96 -1 -164 83 -64 -88 194 28 -231 59 183 -281 -209 301 132 -129 60
5562 60 55 -57 3 -11 -122 134 265 -266 -145 472 -14 -262 64 360 -199 -161 90 110 -88 80 -52 -70 231
5585 231 -151 -195 265 240 -309 -128 273 -19 -272 15 156 -72 -29 -70 -37 206 185 -333 -35 406 -77 -353
5607 -353 143 431 -236 -290 213 -22 -117 -52 -132 114 44 -161 -282 479 288 -395 -186 469 -17 -415 96 324
5629 324 -46 -207 -96 5 110 -20 -466 25 395 -228 -574 356 398 -295 -355 301 133 -134 4 29 238
5650 238 67 -216 -157 341 135 -479 33 630 -173 -369 162 319 -145 -100 88 91 152 -143 -422 164 425 -427
5672 -427 -456 410 252 -590 -90 400 -27 -317 -5 130 106 -44 -218 -95 415 -4 -552 144 504 -313 -562
5693 -562 287 393 -323 -88 118 112 45 -149 -240 214 271 -418 -300 638 199 -642 62 453 -70 -459 171 59
5715 59 38 -137 -327 72 298 -63 -533 295 654 -477 -608 467 295 -498 -154 298 35 -182 44 -128
5735 -128 224 162 -551 -177 680 112 -742 136 595 -202 -431 262 118 -147 -98 -186 79 339 -160 -406 136
5756 136 492 -506 -399 603 224 -594 -156 374 -93 -176 -121 -26 199 174 -513 -95 579 17 -600 202 724
5777 724 -227 -418 305 209 -251 12 37 147 354 -135 -330 419 449 -562 -299 673 280 -487 -22 495 -70
5798 -70 -238 -43 -7 120 49 -343 -60 542 -31 -579 227 519 -287 -398 560 319 -293 -16 187 77 124
5819 124 -109 -371 275 335 -407 -324 569 119 -559 72 410 -183 -264 122 -15 55 58 -137 -27 317 -76 -564
5841 -564 311 586 -338 -348 391 171 -252 13 199 -6 14 -17 -111 257 226 -334 -301 546 29 -612 82 414
5863 414 -205 -276 123 96 -51 -102 -170 -88 323 -20 -414 293 382 -393 -272 399 159 -234 -15 163 -41 -26
5885 -26 -56 -182 129 214 -336 -253 369 20 -479 36 413 -251 -198 220 182 32 14 -114 -76 284 -199 -422 44
5908 44 314 -173 -365 365 38 -383 103 221 -56 -16 56 -75 95 204 -206 -153 290 16 -316 90 277
5929 277 -179 -253 220 22 -52 57 -65 -87 69 81 -265 68 251 -241 -82 355 42 -284 -21 176 -134
5950 -134 -77 137 -220 -10 178 -9 -278 291 26 -274 156 254 -189 -141 262 14 -149 173 11 -134 95
5971 95 95 -254 -60 256 -32 -153 240 139 -210 122 136 -109 48 137 -68 -129 164 -72 -179 104 93 -12
5993 -12 67 69 -158 58 169 -39 -129 209 17 -224 -9 238 -108 -69 252 55 -26 132 80 -49 22 106 -237
6016 -237 150 267 -71 -224 134 56 -333 72 168 -146 -65 -27 -64 -74 111 -176 -132 263 78 -310 17 357
6038 357 -198 -211 123 94 -81 -111 -29 36 45 88 -184 149 215 -244 -191 242 185 -330 -10 304 -94 -19 87 23
6062 23 86 11 -181 -25 321 24 -420 42 354 -248 -175 191 236 -174 -114 34 42 19 -36 -160 261 174 -236 -107
6086 -107 435 -28 -322 4 223 -85 -228 47 81 18 11 -152 -49 163 -248 -384 332 396 -267 -257 351 204
6108 204 -273 3 216 62 -3 -188 -114 198 68 -327 41 429 -119 -543 200 348 -77 -165 -1 176 -95
6129 -95 5 -176 138 300 -214 -226 419 146 -438 -64 367 73 -292 5 375 19 -5 -191 9 277 -67
6150 -67 -337 83 457 -183 -344 149 352 -308 -235 294 156 -159 -175 -38 114 127 -128 -157 399 171 -548 -121
6172 -121 613 -52 -437 178 359 -47 -94 -38 219 195 -106 -260 203 422 -429 -460 451 305 -427 -192 473
6193 473 -23 -206 -106 80 150 -16 -289 1 408 -28 -547 125 518 -212 -454 225 383 -305 -162 112
6213 112 84 90 -299 -274 212 409 -368 -315 457 259 -551 -125 408 -38 -322 37 122 194 -23 -189 22 380
6235 380 -97 -524 289 488 -408 -445 371 214 -412 -250 159 80 -41 -154 -63 235 173 -280 -203 629 237 -562
6257 -562 -1 511 -55 -422 167 204 -22 8 2 43 268 -147 -430 326 507 -305 -321 418 235 -415 -104 183
6279 183 61 -121 -115 -145 279 194 -469 -135 417 90 -502 9 467 -156 -434 131 142 -67 -50 -138 57 282
6301 282 -195 -400 258 447 -310 -322 407 209 -448 -190 371 131 -152 -24 15 156 114 -374 -120 322 -1
6322 -1 -474 -48 406 -89 -432 171 243 -89 -92 -92 -12 265 -151 -366 115 293 -239 -249 375 298 -410 -154 321
6345 321 13 -181 -1 -47 184 79 -302 -155 312 93 -425 172 315 -127 -277 116 136 -150 -19 13 12 182
6367 182 -74 -211 163 313 -270 -192 356 262 -271 -133 361 -198 -92 102 -31 21 137 -54 -45 293 153 -322
6389 -322 -8 322 -179 -185 186 176 -225 52 76 -41 84 122 -231 3 216 -135 -251 353 114 -264 51 135
6411 135 -113 -66 28 -100 -61 -14 -95 -106 214 68 -271 -25 212 -101 -216 236 105 -178 66 122 -173 68
6433 68 214 -30 -18 146 -2 -147 181 245 -215 39 129 -119 -54 146 -89 -98 33 -53 -228 22 19 -220 55
6456 55 97 -120 -144 302 45 -223 180 126 -175 17 207 -149 -56 156 0 -109 26 48 -105 0 228 -163
6478 -163 -20 239 -172 -183 134 67 -204 -43 102 -112 -42 139 -168 -87 112 -62 -257 169 66 -247 20
6499 20 242 -127 -224 34 91 -161 -97 -4 -4 10 29 -129 45 218 -133 -185 215 154 -330 -70 242 14 -124 87
6523 87 128 -71 102 -98 -54 117 13 -304 36 254 -83 -264 284 260 -286 -206 44 -18 -40 13 -178 20 82
6546 82 -154 -187 319 120 -348 -82 395 -28 -232 56 209 36 -72 -163 48 201 -55 -195 37 322 -198
6567 -198 -299 331 226 -374 -100 169 13 -95 1 -10 154 63 -196 -40 332 43 -457 -20 341 -159 -290
6588 -290 183 178 -121 -69 -6 31 76 -154 -159 180 270 -296 -207 358 103 -397 -77 151 24 -118 -56 41 -4 58 -200
6613 -200 -73 373 -64 -333 146 343 -251 -366 258 221 -149 -110 57 146 76 -172 -58 298 127 -470 -106
6634 -106 426 -79 -540 75 482 -103 -302 118 210 -53 -99 -196 167 203 -152 -239 295 277 -283 -134 380 158
6656 158 -386 -131 219 79 -114 -61 -37 221 -19 -306 74 453 -241 -470 214 408 -343 -317 169 129 -144
6677 -144 -251 -51 236 156 -362 -187 432 179 -513 -140 488 73 -454 35 335 20 -71 -110 117 278 -129
6698 -129 -398 140 512 -165 -461 318 340 -200 -347 296 238 -149 -202 17 183 -4 -333 -66 430 147 -575
6719 -575 63 464 -94 -438 101 339 -27 -166 -138 10 107 -6 -272 188 347 -288 -328 293 301 -295 -210 335
6741 335 3 -274 -105 152 132 13 -151 -58 427 109 -388 -53 514 -97 -456 196 343 -239 -212 15 186
6762 186 76 -89 -126 141 278 -237 -229 331 259 -317 -168 360 -17 -197 -10 144 149 59 -179 -58 330 67
6784 67 -433 -7 449 -148 -295 218 215 -200 -228 91 61 -40 -40 -270 100 249 -343 -250 257 234 -275 -119 302
6807 302 -12 -246 4 84 -51 -45 -113 -60 237 150 -376 -25 383 -35 -256 96 242 -91 -151 70 169 -10 -105
6830 -105 -155 82 97 -200 -222 259 226 -284 -103 254 -26 -255 46 -17 -19 41 -67 -88 120 8 -245 48 306
6853 306 -111 -193 181 230 -198 -142 202 24 33 44 -69 57 178 -21 -184 65 232 -165 -72 151 -133 -159 131
6876 131 33 -193 44 43 -31 77 113 -220 -26 254 1 -234 162 117 -165 -37 233 -25 -8 77 -121 -94 96
6899 96 -87 -158 119 111 -165 13 157 -177 -137 108 182 -29 201 -17 -95 -58 199 -92 -120 200 -39 -212 114
6922 114 84 -133 -35 122 -97 -51 165 -73 -250 50 -45 -172 84 193 -171 11 52 -84 -159 125 17 -191
6944 -191 175 107 -163 -26 229 -146 -147 181 114 -211 128 47 -187 153 77 -207 -15 204 -17 -245 75 207
6966 207 -219 -15 146 -90 -123 82 -141 -81 171 -152 -186 214 131 -190 -16 252 -46 -235 161 89 -89 114
6988 114 16 -43 198 157 -135 -113 229 -79 -205 153 153 -233 -119 256 51 30 16 39 165 138 -183 -110 209 217
7012 217 -272 -95 400 -90 -162 48 230 -1 13 -67 48 95 -70 -209 -18 270 -198 -209 182 267 -208 -65
7034 -65 270 41 -118 -13 57 114 132 -79 -134 258 129 -301 -66 304 -136 -338 63 159 -163 -105 65 89 100
7057 100 36 -218 126 149 -265 -226 274 147 -465 -129 417 7 -289 54 65 10 -59 -216 21 201 27 -334
7079 -334 49 428 -213 -232 249 216 -270 -172 228 -78 24 -119 -78 235 251 -278 -119 473 172 -422 64 331
7101 331 -106 -382 106 208 -58 -46 -61 49 172 -121 -287 218 354 -476 -278 301 121 -352 -171 402 35
7122 35 -182 25 41 49 79 -292 -51 381 -43 -438 136 368 -252 -288 259 204 -134 -20 18 115 25 -173 -181 254
7146 254 209 -369 -254 520 157 -408 50 429 -6 -186 58 175 49 -138 -143 75 273 -194 -324 255 403
7167 403 -317 -443 340 207 -322 -84 26 112 42 -160 -122 228 54 -495 -144 455 -72 -569 9 434 -128
7188 -128 -225 144 201 -1 -55 -200 133 293 -197 -325 214 247 -361 -224 385 248 -387 -122 200 176 100 -187
7210 -187 15 228 0 -399 88 367 -52 -407 137 410 -134 -275 131 49 -117 -46 -64 96 108 -202 -278 266
7232 266 233 -370 -157 435 172 -195 -56 138 29 -128 -52 38 299 82 -348 -37 436 -56 -364 144 396
7253 396 -267 -247 139 -17 -82 -73 -7 105 182 -256 -250 243 223 -281 -151 244 -25 -341 6 208 -74 -122 -77 -24
7277 -24 106 78 -210 29 373 -148 -270 205 285 -172 -176 122 133 -98 -72 -60 28 79 -121 -79 333 155 -391 -26
7301 -26 291 54 -244 22 135 -113 27 -18 -24 3 9 -181 -127 287 -47 -261 91 194 -363 -49 180 15 -57
7324 -57 3 -103 -41 222 -20 -227 112 329 -243 -35 307 -38 -182 147 86 -51 -72 -5 -101 43 107 -157 24
7347 24 210 -96 -291 161 161 -225 -125 96 -111 -196 77 -45 -117 89 5 -220 120 117 -116 -139 218 53 -320
7370 -320 141 25 -82 -91 129 -233 49 117 -80 -139 239 51 -112 9 151 -164 -70 108 -170 -117 87 131
7392 131 -30 109 64 -117 122 175 -169 -94 161 -14 -204 152 102 -134 80 104 -102 -27 196 -55 -307 130
7414 130 163 -168 -20 110 -155 -34 255 -156 -138 233 50 -256 185 156 -129 -44 136 -48 -60 107 -58 -85
7436 -85 128 108 -192 63 191 -90 -33 209 -18 -189 26 35 -15 -66 115 -134 -22 28 -146 -96 170 -20 -171
7459 -171 143 295 -266 -74 163 12 -54 212 -26 10 167 -50 -164 100 99 -354 -123 333 118 -207 65
7480 65 94 -61 8 43 47 88 41 -36 23 320 -115 -346 167 131 -306 -48 318 99 -328 78 -27 -55 46 -153
7504 -153 -124 189 188 -318 -46 236 23 -280 195 209 -39 -60 17 14 -41 -44 -77 7 151 -210 -193 276 237 -293 -151
7529 -151 266 45 -178 64 182 -31 -47 -113 -104 159 20 -289 54 283 -138 -287 235 291 -206 -134 272 101
7551 101 -45 -31 -53 -17 144 -35 -259 301 156 -302 -104 371 -109 -191 196 239 -87 -104 -32 -31 116 -114 -250
7574 -250 169 169 -305 -273 343 160 -310 -83 387 30 -74 51 57 -31 39 -162 -30 360 -33 -334 94 424
7596 424 -137 -234 289 284 -159 31 177 6 -30 21 -264 123 166 -278 -260 303 70 -363 -4 362 -105 -384
7618 -384 76 -27 60 20 -87 87 244 -2 -251 243 391 -230 -344 394 179 -231 -48 214 60 -44 -73
7639 -73 -127 252 78 -272 -149 354 75 -511 -29 382 -103 -184 140 220 -188 -119 -130 159 284 -119 -194 231
7661 231 245 -272 -253 382 119 -386 4 197 -18 -174 -148 84 57 32 -285 -3 395 -55 -507 65 306 -239
7683 -239 -242 184 143 -45 -71 43 108 118 -125 -135 264 219 -246 -283 371 148 -248 -30 226 -73 -169 -35 24 71
7707 71 -69 -244 47 176 -13 -456 12 301 -182 -290 219 122 -132 -23 66 114 140 -95 -97 228 261 -200 -129
7730 -129 286 110 -294 4 223 -34 -124 71 57 34 95 -162 -51 273 11 -237 155 338 -258 -192 149 111
7752 111 -25 -10 12 153 72 -77 -51 176 54 -216 -87 330 -71 -202 66 119 15 -125 54 -24 -5 43 -164
7775 -164 -48 253 5 -193 127 203 -93 -16 120 39 -152 66 103 -21 153 -44 -241 132 136 -172 -139 164
7797 164 19 -335 55 205 -98 -25 105 26 25 108 -211 -75 125 2 -159 65 258 -135 -67 72 -18 -103 37
7820 37 41 -87 73 7 -104 -34 196 -141 -120 159 29 -113 42 121 -162 6 158 -155 -2 141 -22 -53 240
7843 240 114 -229 134 233 -293 -171 169 -59 -94 159 18 -100 39 146 -70 66 242 -121 -211 146 71
7864 71 -143 81 201 -182 -102 147 -208 0 130 -116 -23 64 53 -132 38 175 -216 -87 84 -156 -151 181
7886 181 82 -269 12 38 -179 -99 117 41 -71 111 13 -210 111 93 -118 42 196 -97 -87 204 102 -91
7908 -91 5 85 -104 58 158 -154 -89 42 -77 -90 90 78 -268 113 209 -188 -104 129 26 -104 5 -25 -123
7931 -123 57 -42 -111 118 199 -79 -96 247 12 -335 21 147 2 -21 108 -2 101 -19 -200 -46 137 -26
7953 -26 -218 21 245 -226 -155 298 41 -174 33 91 -82 90 -32 -254 57 136 -186 -136 144 76 -146 117
7975 117 164 -238 21 233 132 -11 85 15 -98 121 -98 -262 120 333 -186 -139 362 -50 -158 56 38 -89
7997 -89 -22 23 -16 50 40 -207 0 283 -83 -185 210 265 -234 -104 207 34 -133 64 -44 -25 229 -23 -122
8020 -122 171 171 -265 -2 276 -19 -276 62 105 -133 -16 70 -7 -26 3 -143 72 222 -161 -276 285 200 -287
8043 -287 -122 218 -24 -128 67 28 93 -22 -37 -46 208 116 -201 107 240 -143 -253 172 125 -184 -95 212 -80
8066 -80 -5 32 -57 58 217 -215 -82 275 140 -252 3 336 1 -241 225 96 -47 -38 -44 26 144 8 -207
8089 -207 118 224 -197 -190 246 166 -248 -83 174 -21 -50 23 -15 126 90 -118 -128 270 -39 -307 115 320 -75
8112 -75 -229 193 166 -94 -88 33 -27 114 -78 -62 37 171 -197 -120 337 111 -238 17 223 -12 -106 57 16
8135 16 82 47 -50 -7 232 -25 -324 -26 268 -63 -223 65 213 -160 -183 91 87 11 -12 -225 131 176 -330 -123
8159 -123 294 33 -230 37 288 -110 -114 129 107 118 -14 -236 -60 145 -62 -250 39 194 -203 -170 209 155
8181 155 -247 35 146 52 1 -3 -27 110 115 -276
8191b76
$$ Imaginary data points
##PAGE= N=2
##DATA TABLE= (X++(I..I)), XYDATA
0 0 0 0 0 0 0 0 0 0 0 0 -8 8 -9 16 -16 24 -25 33 -41 49 -57 72 -83 98 -114 132 -156 181 -210 238 -273 311
32 311 -354 401 -452 508 -572 640 -718 799 -887 988 -1096 1213 -1340 1480 -1635 1801 -1986
49 -1986 2186 -2408 2653 -2927 3231 -3567 3951 -4386 4890 -5473 6162 -6988 8009 -9296
63 -9296 10977 -13278 16631 -21974 31813 -55763 232051 100896 -470520 128259 302445
74 302445 -178543 -146457 163280 -40875 -10396 115224 -156713 -98160 316101 -35210 -377213
85 -377213 176146 331762 -298341 -192613 318829 39941 -242170 74193 79990 -94339
95 -94339 86345 19953 -201813 130187 227642 -273552 -155983 364602 24620 -359102 104027
106 104027 269349 -168456 -123523 144883 -9802 -42952 75312 -103510 -56364 225384
116 225384 -38594 -279697 161587 242700 -261262 -142870 283736 16676 -224076 77087
126 77087 105898 -97302 27534 40553 -121860 69055 146541 -179756 -92478 253746 -385
137 -385 -253168 94482 186092 -144578 -82809 128390 -11988 -52034 60373 -53706 -47933
148 -47933 140479 -23704 -183188 112652 160972 -184780 -90842 206273 2253 -171680
158 -171680 62790 93141 -79146 -2170 45314 -60049 28683 77567 -103989 -43137 153378
169 153378 -19001 -152611 83846 109364 -116807 -41081 103725 -24151 -53012 55124
179 55124 -18411 -45543 77961 -2151 -108087 60238 93711 -109716 -50556 125995 -3185
190 -3185 -105008 44034 58681 -54453 -5770 34109 -29449 10459 39632 -52648 -17324 80962
202 80962 -19765 -80355 57030 54913 -75973 -15209 69998 -22152 -43059 39610 2460 -37348
214 -37348 30002 12587 -48060 17835 42814 -44756 -23168 53838 -3546 -44961 24279 24153
226 24153 -28033 2094 18171 -18339 4182 22633 -24733 -10064 39871 -8153 -39267 27285
238 27285 26916 -38593 -8977 37029 -9011 -26621 17994 9335 -19810 2960 10118 -11963 -129
251 -129 10431 -9274 -3688 12253 -4834 -8721 10927 1664 -10521 8013 7595 -11671 1522
264 1522 13509 -8265 -8932 14023 3279 -14434 3400 12374 -7843 -8846 8220 3276 -8771
277 -8771 -1713 5812 -281 -5315 -889 3417 181 -4572 -987 5186 244 -5366 1925 6410 -2763
292 -2763 -4998 5144 4795 -4992 -1968 7180 1874 -6358 193 6613 -1658 -6563 2658 5576 -4686
307 -4686 -5050 4884 2571 -7082 -2692 5932 38 -7067 834 6280 -2790 -6028 4109 5111 -5332
322 -5332 -3070 7391 2210 -6412 1570 7150 -2515 -4705 4490 3413 -3553 -1108 3002 997 -1565
337 -1565 -2587 124 3857 -2398 -7176 4634 6553 -10113 -5273 12584 -1150 -14352 7017 10965
351 10965 -12303 -3898 14581 -3948 -10468 11590 3675 -12829 6642 10742 -12264 -1846 14514
364 14514 -6124 -9339 11568 188 -10143 8991 1289 -14386 10756 9965 -24237 131 29056
377 29056 -17160 -26393 30468 13121 -37302 3350 31991 -17579 -16800 23043 -1268 -14645 17318
390 17318 -1790 -20691 23460 12739 -37465 7046 40642 -26688 -27875 39292 5715 -36969
402 -36969 15965 18100 -28894 8874 23425 -36429 -3592 49592 -27381 -46651 53087 25088
414 25088 -65786 3703 58279 -27311 -33168 35199 2238 -20884 23274 -7941 -28222 43987
426 43987 13609 -68141 18411 73107 -52120 -53962 73335 19578 -71688 14987 44469 -36049
438 -36049 -4243 29995 -36788 -1427 58362 -42204 -54983 80011 25607 -98472 14578
449 14578 87768 -46998 -51749 57418 7818 -36159 27492 -6636 -35120 57721 13966 -93091
461 -93091 30769 101002 -77725 -76765 107388 31228 -106635 13996 72985 -40885 -21787
472 -21787 33744 -29367 1999 56090 -55789 -51241 102546 15620 -124505 33035 111749
483 111749 -72089 -69116 84182 16690 -59069 25505 8108 -35501 52671 11437 -96575
494 -96575 39770 108491 -94872 -83375 130806 33362 -132036 17327 95293 -47645 -38032
505 -38032 39641 -19012 1424 49339 -62647 -43484 116342 3053 -141338 52458 127657
516 127657 -96874 -80095 111057 21899 -84479 24862 29130 -36305 36422 11258 -83666
527 -83666 42429 96723 -100214 -71880 137554 21606 -139348 28748 103055 -58515 -46554
538 -46554 49480 -9947 -7532 39787 -54192 -33664 108766 -6490 -135393 61883 124161
549 124161 -106762 -79318 122711 23840 -98597 21437 46298 -33518 16282 9911 -61924
560 -61924 41011 75170 -96453 -51878 131923 4162 -134104 43539 99556 -71508 -45808
571 -45808 62949 -7618 -23207 36002 -34701 -30577 86394 -5742 -112157 56568 103900
582 103900 -97929 -65645 113768 17618 -94541 21847 50852 -32423 2027 12616 -41008
593 -41008 30727 52476 -78378 -33367 109764 -7247 -113381 47886 85481 -72902 -41415
604 -41415 67539 -3526 -35553 28471 -12316 -25629 55948 -3200 -78468 44841 73730 -78797
616 -78797 -43201 92890 5069 -77829 26488 43002 -34705 -589 18120 -30093 16924 38431
628 38431 -55693 -22885 80671 -9852 -84262 42254 63136 -62469 -30062 59276 -3672
639 -3672 -36405 22309 2198 -20199 29230 4 -45378 29704 42297 -53485 -21032 63613
651 63613 -5014 -53131 26695 29491 -32148 -747 20666 -20642 3541 26470 -30589 -16523
663 -16523 47982 -5667 -51805 27315 38666 -41734 -17880 40414 -3740 -26719 15527 5320
675 5320 -14290 14153 1680 -23355 17220 21198 -31421 -7512 37702 -8482 -31050 21978
687 21978 16744 -25244 610 18854 -13531 -5320 16982 -10319 -12490 20282 472 -23662 10705
700 10705 17256 -18730 -7544 18518 -3045 -12222 8615 2344 -7795 6910 1839 -10896 7617
713 7617 10232 -14088 -3055 17823 -4246 -14929 11231 8930 -13381 -1275 11411 -4865 -6505
726 -6505 6770 -2 -5998 3526 1703 -5343 1500 3129 -4538 -475 4000 -2864 -1851 4376 -1264
741 -1264 -3541 4418 1796 -5127 1847 5478 -3641 -3033 5626 1256 -5079 1202 4448 -2143 -3046 2425
757 2425 1642 -2666 -1415 1767 462 -2253 -1080 1533 272 -2522 -582 2344 -188 -2534 590
772 590 2577 -1076 -1964 1996 2125 -1797 -1002 2827 1098 -2362 70 3002 -284 -2483 1059 2273
788 2273 -1590 -2189 1578 1473 -2329 -1721 2158 704 -3077 -702 2984 -931 -3603 1810 2830 -3046
804 -3046 -1778 4047 427 -3773 1678 3252 -2275 -1134 2851 412 -1312 791 56 5 1556 -1873
820 -1873 -1818 4033 -89 -6092 2557 5506 -6443 -3838 7922 -1030 -8239 4756 4436 -7803 369
835 369 7312 -5735 -3594 9268 -1604 -8595 7639 5115 -9805 1247 8904 -5613 -3114 7727
849 7727 -3537 -4016 9230 -3399 -10609 12123 5974 -19032 2123 19691 -12410 -15313 18233
862 18233 5234 -18952 4248 11894 -10763 -1063 9919 -10010 -2012 16793 -9327 -15156 21324
875 21324 7321 -25904 5535 23126 -15362 -11429 18967 -2621 -12392 14429 -1945 -17863
887 -17863 18791 10407 -32078 4013 34929 -21357 -27526 32172 11444 -33298 4666 21804
899 21804 -14696 -3390 13035 -14697 960 25217 -20616 -22286 39364 8727 -47294 11779
911 11779 42736 -27710 -25183 33532 3309 -24295 14251 3287 -19833 21111 9870 -40344
923 -40344 10354 45116 -34098 -35593 49190 14421 -50169 7333 34866 -20304 -9776 17530
935 17530 -14778 1593 29131 -28658 -25525 54168 7603 -65736 19319 60354 -40909 -37990
947 -37990 48615 10063 -37200 12345 10552 -19490 20291 6656 -44368 18950 50020 -48453
959 -48453 -37626 67021 11228 -67776 15177 48843 -30401 -18269 26473 -11295 -3271 28311
971 28311 -29179 -24664 59884 3709 -74489 26865 69284 -51865 -45614 60950 14753 -49087
983 -49087 9679 19822 -17482 14069 3479 -40619 24948 47529 -57629 -34131 78543 5587
995 5587 -79947 23594 59641 -40553 -26369 36637 -5877 -11846 24651 -23085 -21002 56192
1007 56192 -961 -72190 33256 66980 -59673 -42487 68970 10901 -56479 13688 26308
1018 26308 -20564 8338 5476 -34981 24055 41491 -57644 -27853 79170 -541 -81394 29418
1030 29418 62715 -46294 -31086 43393 572 -20331 17719 -12491 -14650 43712 -5367 -59404
1042 -59404 35292 55239 -60062 -33221 69098 4249 -57869 18411 29984 -25159 1932
1053 1932 11186 -26800 16263 33356 -47538 -21315 67947 -4606 -70772 31204 54551 -46705
1065 -46705 -26673 44382 55 -24044 15530 -4626 -12081 31780 -6166 -44761 32355 40825
1077 40825 -53927 -21783 61850 -3068 -52685 22276 29584 -27944 -3235 16509 -17623 5628
1089 5628 23283 -31223 -14271 48446 -5856 -51578 26838 39888 -39323 -18609 38213 -1800
1101 -1800 -22660 14151 746 -11586 20441 -2509 -30818 23092 27963 -40382 -13415 46942
1113 46942 -5969 -40677 20600 23292 -25831 -3913 17618 -11641 -1536 15814 -17062 -9217
1125 -9217 29350 -5338 -31559 20456 23319 -29071 -8422 28258 -5434 -17390 13633 2602
1137 2602 -11663 11826 2059 -18800 11980 17231 -23606 -8109 28618 -4602 -25451 14104
1149 14104 14965 -17909 -3236 13161 -6410 -3831 8944 -7107 -5102 14622 -3350 -15765 12611
1162 12611 11134 -17618 -1972 17481 -6101 -10923 11157 2514 -9947 6017 4637 -10178 3205
1175 3205 9426 -9882 -4739 12775 -1829 -11521 6680 6385 -8944 -985 6529 -3682 -2428 4612
1189 4612 -2992 -2740 6410 -1336 -6722 5886 4803 -8070 -482 8476 -2982 -5673 5786 2553
1203 2553 -5598 1153 4111 -3162 -1324 3360 -1352 -2210 2416 -198 -2495 1336 788 -2489 502
1218 502 1349 -2125 -202 2174 -1481 -1556 2594 440 -2689 1477 2549 -1981 -1252 2768 331 -2123
1234 -2123 865 1926 -1008 -1098 1152 720 -1046 -455 674 151 -707 -593 438 255 -1184 -713 846
1251 846 68 -1482 -4 1394 -687 -1327 1167 1090 -1345 -298 1858 181 -1110 657 1201 -324
1267 -324 -638 368 738 -122 -667 123 970 -398 -1465 779 1162 -1914 -930 2054 -479 -2674 1523
1284 1523 1737 -2833 -626 3056 -1002 -2472 2222 1221 -2310 562 1744 -1174 275 1516 -1585
1299 -1585 330 2860 -2290 -2077 4413 261 -5219 2543 4002 -4978 -1826 5435 -2033 -4449 4453
1314 4453 674 -5754 2982 3945 -6541 -427 7629 -3703 -5600 6870 1807 -6843 2913 4283
1328 4283 -5088 1447 4581 -5986 -88 8991 -5744 -7772 11623 3045 -14366 3414 12425 -9421
1342 -9421 -7135 11025 -630 -8510 6132 1378 -8184 6717 4550 -13094 2741 14478 -10743
1355 -10743 -10492 16397 2865 -16050 5596 10474 -10016 -443 8880 -8706 -1145 14069 -9661
1368 -9661 -12724 19712 5078 -24728 5530 22249 -15058 -13883 17842 2068 -13816 6749
1380 6749 2585 -9666 10037 3839 -19934 7504 22232 -20141 -15793 28861 3997 -28542 8797
1393 8797 20111 -15345 -5369 13864 -8192 -2646 16050 -12963 -14108 26975 3512 -34236 10795
1406 10795 30807 -23383 -19521 26968 4039 -21126 7413 6079 -10752 10678 3278 -23684
1418 -23684 11925 27079 -28501 -19453 39885 4745 -40247 11197 30195 -20015 -12497 18491
1430 18491 -4503 -5447 14408 -13167 -12745 30599 207 -39546 16950 35928 -32017 -22653 36685
1443 36685 4237 -29492 9372 11859 -13197 8405 4025 -23626 13946 27674 -33570 -18675
1455 -18675 47040 1949 -47679 16010 36561 -25703 -17090 23654 -1144 -9235 11529 -11444
1467 -11444 -9275 30327 -4394 -40002 22914 36181 -39062 -22188 44069 2923 -36768 11648
1479 11648 18531 -15639 2643 6648 -18804 11857 23581 -32041 -15130 46196 -1437 -47622
1491 -47622 19630 36992 -29565 -17855 27522 -340 -13038 10337 -7526 -7918 26188 -6195
1503 -6195 -35972 25001 32105 -41267 -18298 46372 -435 -39579 14297 22117 -18255 -2096
1515 -2096 9595 -12879 8133 17271 -27050 -9277 40324 -6079 -41680 22433 32049 -31419
1527 -31419 -15089 29594 -1312 -16723 10326 -1861 -8413 19000 -4098 -28151 20586 25510
1539 25510 -35490 -13906 40830 -2375 -35727 14789 21383 -18416 -4206 11603 -8493 3419
1551 3419 12435 -19407 -5547 31087 -7463 -32271 21687 24341 -29627 -10028 28447 -3643
1563 -3643 -17628 11142 2081 -9592 11618 -633 -19413 14381 17420 -26656 -8321 31073
1575 31073 -4378 -27279 13882 16483 -16845 -3402 11704 -6035 -300 9261 -11834 -4041 20764
1588 20764 -5615 -21994 16642 16473 -22798 -5983 22419 -4241 -15271 9979 4316 -9356
1600 -9356 5650 2164 -11492 7190 10125 -16123 -4131 19244 -4788 -17146 11415 9735 -13584
1613 -13584 -722 9976 -5438 -2162 7480 -6001 -4000 12174 -2742 -12986 10190 9569 -14431
1626 -14431 -2947 14533 -3633 -10278 7231 3480 -7196 2169 2871 -5913 2567 5127 -7719
1639 -7719 -1744 9761 -3365 -8710 7475 4557 -8809 443 6867 -4220 -2608 5647 -1818 -3723
1653 -3723 5502 472 -6165 3758 4749 -6212 -1539 6591 -1746 -4892 3769 1548 -3907 1082 1659
1668 1659 -2865 626 2344 -3292 -735 4181 -1774 -3611 3703 1827 -4248 476 3900 -2106 -2068
1683 -2068 3115 431 -2333 1328 1488 -1802 178 1671 -1198 -633 1369 -510 -1224 944 47 -1325
1699 -1325 585 550 -1402 39 1150 -1070 -766 1495 -72 -1515 864 1205 -1250 -294 1506 37
1715 37 -1019 674 838 -580 -76 668 25 -284 79 117 101 38 -436 -84 409 -485 -707 729 137 -1259
1735 -1259 -13 1012 -783 -1037 1007 492 -1100 106 1097 -320 -449 616 222 -108 376 12 55
1752 55 828 -340 -658 1036 427 -1328 411 1229 -1462 -702 1893 -646 -2000 1512 1040 -2660 97
1769 97 2266 -1536 -1491 2109 123 -1684 1215 655 -1465 1281 1064 -2353 851 2953 -2478 -1612 4078
1786 4078 -70 -3867 2412 2539 -3773 -35 3520 -2631 -1804 4050 -1532 -4037 4027 1878 -5800
1801 -5800 883 5315 -3823 -2981 4854 -287 -3629 3155 573 -3854 3557 2321 -6459 1629 7403
1816 7403 -5691 -5180 8835 1249 -9183 3164 6384 -5969 -1734 5691 -3354 -2329 6052 -3375
1830 -3375 -5955 8204 1817 -11030 3359 9960 -8073 -5657 9703 -233 -7235 5032 1741
1843 1741 -6064 5250 3404 -10226 3051 11937 -9793 -8613 14692 2373 -15240 4289 11246
1856 11246 -8472 -3980 7633 -3366 -2782 7270 -5690 -6780 12870 1269 -16954 6402 15413
1869 15413 -13421 -9255 15942 1033 -12641 6007 4989 -7704 4742 4088 -11916 4554 14168
1882 14168 -13885 -10154 20709 1927 -21247 6715 15797 -12092 -6616 10845 -2863 -3949 7840
1895 7840 -6791 -6848 16373 -499 -21412 10591 19486 -19196 -11800 22362 1698 -18271 6616
1908 6616 8916 -8832 2706 4338 -11414 5721 14167 -16736 -9553 24670 229 -25636 9781
1921 9781 19634 -15952 -9073 14704 -1980 -6953 7791 -5350 -6798 16392 -1591 -22610 12816
1934 12816 20823 -22721 -12493 26612 1215 -22571 7803 12439 -10228 201 5186 -9521
1946 -9521 5772 12345 -17884 -7250 26261 -3015 -27370 13591 20824 -20011 -9599 18482
1958 18482 -1676 -10214 7617 -2595 -6499 13952 -2052 -20311 13529 18800 -23578 -10469
1970 -10469 27617 -458 -23633 9302 13965 -11667 -1743 6785 -7208 4038 9951 -15713 -5133
1983 -5133 24137 -4900 -25436 15492 19313 -21774 -8827 20652 -1956 -12935 7493 971
1995 971 -6386 9780 -1461 -15598 12305 14257 -21610 -6665 25393 -3217 -21804 11259 12964
2008 12964 -13105 -2018 8484 -5967 1368 8254 -12011 -3811 19366 -4976 -20872 14135
2020 14135 15683 -19879 -6910 19236 -2282 -13047 7306 3194 -6520 5832 107 -10942 8982
2033 8982 9952 -16874 -3594 20281 -4487 -17644 11427 10607 -13080 -1540 9561 -4786 -1784
2046 -1784 6919 -7026 -3360 13050 -3649 -14465 11174 10522 -15857 -3716 15313 -3422 -10755
2059 -10755 6935 3046 -6227 3728 1121 -7248 5835 6304 -11600 -1564 14234 -4421 -12271
2072 -12271 9631 7211 -11008 -754 8606 -3890 -3154 5439 -2966 -3150 7295 -1809 -8525 6802
2086 6802 5834 -10192 -1518 10233 -3313 -7196 5885 2149 -5463 2217 2227 -4814 2311 4236 -6332
2101 -6332 -1097 8415 -2782 -7191 6480 4269 -7340 -126 6187 -2848 -2913 3859 -859 -2530 3379
2116 3379 -358 -4227 3370 2636 -5621 -190 5355 -2711 -3972 4102 955 -4175 1549 2300 -2996
2131 -2996 353 2971 -2536 -1197 3787 -725 -3328 2809 2089 -3475 -7 3174 -1450 -1723 2062
2146 2062 -144 -1696 1300 282 -1981 1046 1104 -2485 36 2285 -1469 -1823 2091 689 -2321 548
2162 548 1786 -1331 -629 1579 -475 -1082 1244 327 -1001 633 826 -879 12 1029 -437 -517 850
2179 850 -164 -766 594 139 -971 276 705 -883 -424 1183 -424 -1116 753 652 -974 -36 993
2196 993 -331 -525 689 275 -465 447 351 -151 205 216 -245 140 233 -539 -17 664 -489 -700 766 120
2216 120 -1262 206 823 -881 -677 881 -60 -908 343 301 -541 163 471 -648 294 808 -727 -178
2234 -178 1148 -362 -898 1004 324 -1259 675 914 -1360 -96 1606 -984 -1392 1810 185 -2201
2250 -2201 661 1617 -1505 -685 1605 -654 -876 1331 -413 -1162 1872 379 -2448 1289 2389 -2422
2266 -2422 -961 3168 -500 -2371 2065 808 -2434 1248 1720 -2882 64 3246 -2430 -2540 3734
2281 3734 422 -4342 1500 2937 -3048 -764 2861 -1613 -1142 2891 -1681 -2552 4235 579 -5587
2296 -5587 2361 5127 -4825 -2636 5777 -114 -4749 2838 2155 -3717 1451 2241 -4192 742 5068
2311 5068 -4532 -3712 6989 340 -7504 2935 5292 -5174 -1704 4788 -2042 -1903 4203 -2393 -3762
2326 -3762 6566 750 -8741 3874 8074 -7520 -4605 9245 461 -7533 3371 3467 -4562 1614
2340 1614 2240 -5515 2132 6347 -7368 -4432 10810 -268 -11350 4805 8424 -7811 -3279 7323
2354 7323 -1789 -3536 4768 -2298 -4141 7897 475 -10737 5484 10187 -10383 -5859 12590 563
2368 563 -10720 4172 5591 -5529 742 2763 -5655 2875 7014 -9302 -4379 13721 -1264 -14585
2382 -14585 6985 10926 -10631 -4999 9946 -1146 -5349 4687 -1450 -3795 8033 -616 -11283
2395 -11283 7422 10650 -12906 -5776 15278 -469 -13131 5520 7373 -6857 -259 3887 -5207
2408 -5207 2395 6672 -9785 -3920 14627 -2257 -15770 8523 12080 -12666 -5884 12299 -635
2421 -635 -7641 4420 454 -3791 6657 -978 -10274 8078 9583 -14013 -4650 16759 -1864 -14420
2435 -14420 7176 8568 -8501 -1319 5332 -4262 1019 5598 -8448 -2845 13604 -3195 -14664
2448 -14664 9507 11156 -13468 -5064 12947 -1091 -8390 4712 1410 -3794 5034 -778 -8518
2461 -8518 7550 7721 -13264 -3195 15823 -3032 -13916 7935 8590 -9597 -2030 6881 -3252
2474 -3252 -1012 4599 -5832 -2137 10608 -3358 -11828 9145 8904 -12789 -3352 12640 -2153
2487 -2153 -8485 5202 2524 -4478 3370 341 -6481 5872 5906 -11008 -1818 13210 -3604 -11674
2501 -11674 7887 7119 -9099 -1728 6827 -2728 -2083 3843 -3582 -1834 7372 -2758 -8399 7487
2515 7487 6001 -10598 -1664 10557 -2684 -7366 5354 2701 -5010 2117 1761 -4491 3084 4172
2529 4172 -7150 -1164 9254 -2964 -8419 6521 5024 -7835 -1024 6176 -2277 -2641 3323 -1701
2543 -1701 -1873 4552 -1722 -5397 5145 3640 -7616 -412 7789 -2818 -5448 4795 2117 -4541
2557 -4541 1297 2354 -2955 1104 2938 -3828 -699 5436 -2076 -4929 4427 2793 -5405 -169 4393
2572 4393 -2218 -2178 2791 -614 -1879 2493 -460 -3251 2869 2203 -4563 -207 4836 -1961 -3572 3496
2588 3496 1683 -3383 539 2426 -1727 -235 1974 -1631 -596 2712 -1028 -2411 2475 1213 -3147
2603 -3147 329 2615 -1729 -1480 2097 -145 -1759 1255 339 -1836 1036 1282 -1975 -228 2333 -847
2619 -847 -1852 1816 952 -1809 284 1398 -964 -373 1106 -536 -599 1022 -261 -1122 1028 464 -1654
2636 -1654 148 1296 -1066 -1033 1330 22 -1193 576 715 -914 -26 865 -601 -360 851 65 -698
2653 -698 643 469 -658 238 634 -568 -163 641 -259 -337 691 -98 -782 502 436 -929 -113 720 -516
2672 -516 -651 723 188 -758 256 351 -677 -53 615 -267 -351 428 -8 -375 398 150 -392 356 443 -616
2692 -616 173 788 -560 -553 868 21 -951 354 585 -773 -202 585 -396 -260 444 -310 -544 671 43
2711 43 -837 417 773 -788 -185 983 -471 -573 841 -69 -713 812 420 -1259 484 1277 -1152
2728 -1152 -878 1709 -9 -1573 690 710 -1226 69 793 -960 -31 1206 -1064 -904 2002 -111
2744 -111 -2028 1298 1641 -1912 -334 2098 -759 -1012 1709 -195 -1438 1789 562 -2458 888 2384
2760 2384 -2217 -1392 2962 -205 -2511 1464 1166 -1984 474 1072 -2017 526 2310 -2480 -1447 3711
2776 3711 -294 -3965 2223 2939 -3133 -899 3231 -977 -1651 2089 -488 -1801 2663 367 -3848
2791 -3848 1983 3488 -3911 -1987 4721 -456 -4059 2154 1963 -2822 589 1550 -2699 705 3186
2806 3186 -3672 -2046 5657 -357 -5877 3049 4572 -4658 -1769 4611 -773 -2487 2451 -562 -2023
2821 -2023 3577 -133 -5052 3142 4556 -5989 -2340 6901 -737 -5886 3084 3005 -3905 302 2202
2836 2202 -3007 878 3487 -4476 -2004 7050 -1104 -7389 4337 5672 -6164 -2280 6037 -855
2850 -855 -3477 2779 -136 -2099 3784 -501 -5714 4313 4950 -7605 -2369 8835 -1351 -7664
2864 -7664 3974 4400 -4905 -457 3173 -2673 592 3576 -4634 -1687 7576 -1682 -8079 5432 6276
2879 6276 -7556 -2378 7433 -970 -4517 3199 516 -2479 3517 -548 -5330 4750 4660 -8259 -1946
2894 -1946 9512 -2030 -8448 4784 5044 -5810 -889 3956 -2152 -237 2840 -3965 -1043 7034
2908 7034 -2421 -7594 6296 5640 -8390 -1857 8346 -1554 -5535 3540 1525 -3106 2422 -19
2922 -19 -4579 4146 4076 -7624 -1337 9132 -2550 -8299 5479 4941 -6380 -1135 4573 -1950 -1057
2937 -1057 2632 -3084 -855 5964 -2571 -6479 6223 4746 -8374 -1089 8171 -2080 -5710 4027
2951 4027 1957 -3352 1649 692 -3435 2956 2950 -6269 -428 7729 -2872 -7007 5626 4066 -6485
2966 -6485 -609 4962 -1917 -1688 2622 -1847 -955 4386 -1949 -4918 5115 3388 -7170 -430 7297
2981 7297 -2368 -5213 4038 1927 -3600 920 1284 -2662 1569 2082 -4391 -69 5556 -2636 -4945
2996 -4945 4983 2701 -5587 10 4393 -1947 -1996 2621 -859 -1299 2965 -1086 -3203 3590 2226 -5117
3012 -5117 198 5349 -2199 -3759 3544 1533 -3414 566 1868 -1882 579 1569 -2718 -55 3610
3027 3610 -2106 -3191 3677 1552 -4361 313 3648 -1978 -1963 2396 -221 -1644 1664 -10 -2017
3042 -2017 2055 1282 -3013 252 3348 -1707 -2297 2694 971 -2614 571 1597 -1419 -74 1129
3057 1129 -1534 -428 2044 -1237 -1820 2233 849 -2742 311 2459 -1407 -1384 1955 332 -1427 904
3073 904 477 -1135 686 805 -1451 98 1720 -1015 -1220 1631 427 -1767 484 1258 -1078 -386
3089 -386 1045 -641 -584 1007 -259 -1073 1038 472 -1392 120 1329 -840 -924 1161 183 -870 419
3106 419 456 -693 203 453 -624 2 838 -455 -579 865 91 -1151 280 727 -718 -288 769 -302
3124 -302 -766 482 185 -644 316 422 -632 -64 628 -434 -397 598 91 -441 319 227 -485 101 453 -325
3144 -325 -143 686 -161 -419 597 226 -660 231 355 -599 -164 467 -284 -586 431 54 -591 233 414
3163 414 -364 -130 479 -156 -104 376 -203 -289 660 98 -639 478 656 -590 -259 763 -271 -597 335
3182 335 165 -438 189 144 -426 85 507 -710 -326 842 -193 -687 558 535 -711 79 640 -429 61
3201 61 731 -479 -303 1051 -66 -1266 761 850 -1149 -264 1155 -347 -820 655 7 -598 589
3218 589 139 -1043 583 817 -1372 -323 1585 -513 -1381 973 680 -1278 192 779 -874 65 1047
3235 1047 -1066 -531 1846 -268 -1765 1315 1411 -1674 -436 1737 -551 -1194 975 -88 -878 1100
3251 1100 -8 -1819 1313 1427 -2241 -540 2741 -773 -2206 1749 1194 -1900 295 1320 -1262
3266 -1262 81 1568 -1638 -700 2655 -590 -2688 2046 1913 -2676 -444 2513 -966 -1524 1512 -297
3282 -297 -1164 1693 -148 -2343 1863 1983 -3335 -656 3832 -893 -3241 2231 1720 -2464 145 1599
3298 1599 -1319 262 1603 -2072 -663 3385 -1074 -3434 2882 2433 -3750 -610 3633 -1169 -2080
3313 -2080 1871 -22 -1552 1709 -210 -2768 2219 2269 -4050 -570 4669 -1374 -3912 2847 2151 -3213
3329 -3213 37 2037 -1419 125 1701 -2194 -439 3760 -1585 -3867 3599 2615 -4742 -661 4494
3344 4494 -1382 -2866 2257 415 -1792 1579 5 -2650 2279 2097 -4374 -438 5149 -1901 -4308
3359 -4308 3390 2470 -3680 -98 2674 -1404 -369 1779 -2040 -327 3807 -1813 -3829 3903 2520
3374 2520 -5129 -384 5009 -1715 -3176 2640 824 -2111 1250 143 -2308 2117 1687 -4069 119
3389 119 4873 -2229 -4129 3890 2263 -4207 35 3103 -1502 -859 1736 -1499 -469 3176 -1659
3404 -1659 -3316 3820 2085 -4994 -30 4737 -1880 -3443 2795 1040 -2465 857 681 -1825 1477
3419 1477 1327 -3614 322 4297 -2408 -3639 3938 1779 -4249 236 3308 -1668 -1312 1981 -921
3434 -921 -694 2288 -1208 -2478 3064 1353 -4239 308 4060 -2078 -2830 2882 878 -2559 749 1007
3450 1007 -1576 978 957 -2670 368 3284 -1953 -2842 3486 1279 -3805 407 3065 -1484 -1536 1770
3466 1770 -312 -910 1563 -611 -1665 2241 923 -3215 555 3116 -2070 -2226 2699 555 -2457
3481 -2457 638 1236 -1333 238 1017 -1539 64 2103 -1434 -1782 2630 742 -2906 513 2444 -1567
3497 -1567 -1326 1700 -106 -1000 852 -69 -988 1275 523 -2158 424 2202 -1598 -1465 2075 428
3513 428 -2106 586 1328 -1292 -151 900 -822 -170 1231 -803 -1092 1658 487 -1888 565 1596
3529 1596 -1096 -989 1337 40 -855 633 244 -801 623 390 -1203 212 1278 -1116 -953 1326
3545 1326 181 -1530 444 1000 -864 -408 759 -348 -399 763 -298 -604 803 182 -1020 420
3561 420 956 -743 -582 927 9 -753 487 407 -714 122 323 -719 -30 715 -519 -564 859 184
3579 184 -887 145 713 -535 -269 524 -171 -301 353 -51 -420 378 144 -541 175 558 -430 -234 674
3598 674 -170 -553 359 412 -492 54 446 -344 -183 420 -173 -324 268 104 -451 120 355 -290 -3 317
3618 317 -154 -197 440 -8 -386 261 258 -368 17 433 -259 -228 370 -91 -374 238 132 -437 210 425 -423
3639 -423 -246 375 -87 -443 204 44 -314 71 35 -253 81 331 -341 -181 560 -103 -534 372 415 -495 -76
3660 -76 506 -234 -176 320 -137 -334 436 -43 -533 337 430 -549 -76 600 -267 -511 386 133 -269 241 84
3681 84 -435 329 361 -695 -185 946 -308 -775 661 471 -726 -9 490 -263 -98 363 -380 -165 706
3700 706 -275 -917 800 436 -1137 -41 1005 -511 -676 604 123 -568 373 87 -654 629 602 -1115
3718 -1115 -53 1293 -515 -1143 957 554 -968 130 702 -346 -106 593 -580 -154 1019 -607
3734 -607 -1150 1216 771 -1670 -78 1449 -653 -985 872 172 -798 523 25 -913 884 658 -1431
3751 -1431 -68 1679 -748 -1574 1447 661 -1466 137 1036 -716 -58 678 -798 -111 1428 -851
3767 -851 -1528 1723 865 -2141 -50 1942 -904 -1267 1191 224 -941 545 175 -898 1075 650 -1922
3784 -1922 236 2192 -1192 -1818 1929 883 -2065 275 1442 -929 -342 778 -888 -280 1653 -1020
3800 -1020 -1620 2011 889 -2647 92 2505 -1194 -1547 1549 460 -1192 588 214 -1044 1237 679
3816 679 -2064 422 2472 -1521 -2000 2365 968 -2352 142 1630 -1051 -581 969 -727 -276 1475
3832 1475 -1149 -1433 2162 815 -2898 245 2701 -1351 -1817 1609 552 -1416 498 368 -968 1102
3848 1102 652 -1993 557 2451 -1725 -1849 2579 985 -2652 217 1972 -1159 -813 1069 -504 -368
3864 -368 1390 -941 -1451 2037 588 -2730 548 2541 -1523 -1736 1983 428 -1705 571 613 -864
3880 -864 593 553 -1565 443 2063 -1608 -1656 2546 698 -2702 369 2104 -1139 -865 1119 -214
3896 -214 -562 1009 -650 -949 1737 319 -2435 769 2357 -1728 -1551 2161 437 -1800 607 917
3912 917 -880 179 618 -1249 408 1590 -1426 -1187 2200 274 -2404 771 1807 -1210 -977 1237
3928 1237 -111 -532 629 -417 -819 1143 82 -1871 786 1758 -1582 -1231 2028 251 -1690 477
3944 477 1028 -867 45 616 -649 218 1083 -1034 -682 1706 135 -1862 661 1366 -1203 -797 1221
3961 1221 -110 -738 618 -54 -654 780 284 -1368 548 1250 -1194 -712 1666 100 -1563 486
3977 486 951 -823 -87 667 -328 -67 694 -562 -409 1115 -34 -1331 588 1144 -1088 -578 1068
3994 1068 -66 -845 550 285 -449 222 193 -718 316 731 -854 -450 1090 -42 -1054 475 728
4011 728 -722 -276 642 -222 -221 442 -238 -306 733 46 -784 438 709 -727 -347 806 -14 -784 273
4030 273 277 -453 48 146 -358 71 388 -480 -124 690 -69 -624 461 433 -487 -167 580 -160 -306 344 49
4051 49 -299 317 80 -606 140 433 -445 -264 438 -51 -501 205 349 -322 -5 186 -126 -56 262 -201 -239
4072 -239 388 56 -383 247 316 -292 -138 335 -198 -206 427 82 -456 130 280 -337 40 328 -340 -207 275
4093 275 -120 -189 245 158 -383 103 194 -173 -95 304 -90 -289 358 41 -208 226 206 -295 86 325 -296 -102
4115 -102 483 5 -325 138 274 -333 -91 265 -35 -105 292 -114 -246 70 -114 -397 266 231 -474 -133 420
4136 420 -83 -303 277 193 -295 158 141 -273 159 123 -266 23 577 -227 -397 363 267 -513 -22 467 -137
4157 -137 -60 245 -83 6 359 -183 -358 553 283 -617 18 671 -343 -491 468 66 -266 145 111 -193 227
4178 227 102 -455 -18 643 -399 -648 745 179 -791 91 529 -247 -145 138 -204 -113 529 -414 -436 635
4198 635 244 -950 243 851 -458 -574 624 7 -409 154 164 -81 506 246 -661 381 792 -772
4216 -772 -681 1053 289 -1117 173 740 -393 -289 350 -304 -36 632 -572 -547 901 118 -1163 291
4234 291 992 -832 -772 795 150 -718 335 170 -477 459 94 -1011 323 1110 -1003 -854 1246 196
4252 196 -1313 304 957 -712 -336 487 -318 -65 598 -575 -629 1237 202 -1498 575 1261 -938
4269 -938 -772 1172 188 -835 409 231 -313 521 121 -1091 338 1121 -1150 -786 1604 163 -1516
4286 -1516 458 1069 -844 -407 706 -287 -208 647 -556 -599 1316 -67 -1553 802 1381 -1166 -899
4303 -899 1436 79 -1025 463 475 -563 371 162 -943 494 987 -1194 -724 1633 46 -1615 638
4320 638 1052 -938 -444 797 -252 -337 552 -563 -529 1189 -98 -1486 850 1359 -1325 -732 1631
4337 1631 114 -1253 463 503 -547 325 270 -700 288 997 -1077 -503 1594 -76 -1692 748 1211
4354 1211 -1181 -561 1077 -154 -496 540 -387 -419 1003 -176 -1351 925 1039 -1388 -544 1660 -47
4371 -47 -1370 553 724 -660 163 373 -580 413 705 -911 -351 1514 -314 -1442 850 987 -1194
4388 -1194 -481 1126 -110 -684 367 -100 -442 623 -147 -846 824 897 -1173 -363 1474 -225 -1370
4405 -1370 646 707 -713 4 401 -375 75 496 -775 -229 1064 -331 -1314 920 768 -1143 -443 1087
4423 1087 -133 -639 400 58 -371 474 24 -700 633 556 -1087 -244 1186 -271 -854 725 577 -757
4441 -757 -40 488 -352 -15 362 -508 -152 786 -238 -861 683 662 -1070 -150 1070 -192 -582 462
4459 462 285 -419 194 55 -427 381 463 -620 -120 876 -264 -925 611 573 -761 -165 506 -131 -215 326
4479 326 -165 -191 420 -201 -621 444 424 -749 -141 785 -216 -570 364 274 -313 176 144 -290 200 277 -460
4500 -460 -81 544 -183 -469 279 366 -536 -70 501 -76 -286 184 -99 -279 284 -21 -316 255 277 -406 -96
4521 -96 494 -97 -489 436 225 -306 23 173 -224 87 326 -228 -100 431 67 -327 251 182 -411 -35 337
4542 337 -89 -151 96 103 -305 98 33 -215 104 250 -290 -128 385 -82 -352 278 98 -259 119 194 -207 -144
4564 -144 289 -114 -227 301 39 -192 92 254 -269 103 116 -179 -183 222 -145 -298 200 132 -372 -51 318
4585 318 -132 -130 252 -117 -164 196 -49 -196 212 173 -273 -13 389 -135 -250 207 -27 -206 25 58 -119 90
4607 90 150 -309 25 371 -207 -273 278 59 -363 -33 384 -120 -233 275 -7 -99 177 -173 -142 241 144 -379
4629 -379 79 397 -213 -309 394 212 -343 14 87 -60 129 70 -332 205 340 -332 -328 522 94 -642 133 526
4651 526 -179 -277 95 10 -9 108 -275 -119 476 -16 -590 331 433 -394 -372 512 81 -386 138 111 -94 126
4673 126 -134 -373 281 376 -587 -300 693 28 -687 176 489 -359 -301 322 42 15 104 -306 -69 558 -168
4694 -168 -753 421 646 -715 -396 730 -29 -573 66 222 -254 99 -13 -322 456 525 -664 -335 909
4713 909 -97 -903 358 597 -407 -143 406 40 -64 193 -212 -67 704 -151 -856 574 633 -832 -287
4732 -287 885 -51 -639 272 321 -308 126 -18 -373 392 257 -787 -239 1040 -243 -1067 562 730 -679
4751 -679 -210 568 -155 -166 128 -330 -62 694 -344 -801 778 599 -1024 -185 1064 -116 -833 472
4769 472 393 -409 209 86 -273 418 380 -787 -36 1016 -341 -891 788 637 -947 -250 777 -148 -396
4788 -396 283 -191 -112 594 -313 -842 683 538 -1078 -77 1129 -264 -840 590 394 -567 -40 165
4806 165 -280 240 157 -789 -13 998 -463 -886 941 592 -1062 -185 871 -120 -438 379 -161 -47 411
4825 411 -228 -600 692 436 -969 68 1067 -347 -805 632 418 -639 104 261 -267 188 239 -611
4843 -611 31 749 -485 -761 935 550 -1050 -99 929 -294 -453 503 -46 -224 311 -138 -400 644
4861 644 261 -1043 27 1125 -458 -779 679 496 -821 -135 370 -263 -12 191 -440 18 649 -530
4879 -530 -687 684 452 -960 -50 959 -321 -352 421 202 -239 94 32 -307 496 96 -813 102 1016
4898 1016 -446 -814 584 458 -711 -2 492 -237 -167 144 -222 -39 502 -405 -563 682 322 -848
4916 -848 54 859 -296 -588 353 217 -350 150 -18 -313 261 101 -555 67 730 -379 -640 541 268
4935 268 -624 -60 407 -206 -254 155 -40 -40 233 -197 -367 453 199 -589 86 571 -202 -509 469 179 -289
4956 -289 149 74 -62 111 74 -312 124 475 -340 -448 411 206 -500 -61 423 -119 -248 241 -88 -86 181
4977 181 -63 -222 397 185 -498 -39 433 -239 -328 303 342 -288 -41 275 -261 18 213 -260 -65 454 -181
4998 -181 -305 353 168 -327 -124 275 -229 -211 308 87 -139 217 -56 -233 238 271 -327 -82 476 -152 -337
5019 -337 210 117 -242 171 221 -87 60 180 -95 -114 255 -68 -172 150 139 -231 3 299 -215 -110 299
5040 299 2 -229 89 134 -239 3 340 -117 -96 212 -24 -100 112 -8 -170 80 117 -212 25 277 -120
5061 -120 -207 254 74 -158 51 115 -238 22 156 -180 -33 314 -220 -222 201 258 -287 79 341 -27 -181 190
5083 190 42 -193 60 -18 -240 176 57 -389 66 396 -180 -199 362 98 -302 -89 139 -209 -4 59 -149
5104 -149 106 167 -151 -103 360 -54 -419 35 415 -153 -264 110 -16 -22 -29 -98 -51 238 -53 -390 150 497 -364
5127 -364 -373 283 90 -385 -122 281 -66 -46 -18 -123 102 157 -515 -77 478 -53 -417 138 413 -256 -150 228
5149 228 46 -52 48 -114 0 264 -149 -422 321 403 -488 -179 505 33 -492 27 317 -169 -127 -57 -68 182
5171 182 190 -434 -49 568 -45 -570 492 465 -387 -248 426 23 -224 46 -72 -46 231 -164 -481 477 325
5192 325 -667 -213 704 -12 -619 192 441 -107 -89 -6 -98 294 36 -427 -28 778 -356 -564 531 422
5212 422 -655 -200 523 -30 -336 30 130 -115 290 -202 -201 553 177 -696 47 806 -245 -610 390 401
5232 401 -428 -170 263 -95 231 -57 -442 130 675 -458 -604 741 409 -804 -81 794 -4 -473 101
5251 101 116 -69 35 -239 -251 444 166 -832 191 725 -262 -729 503 373 -598 -168 238 -12 -81 49
5271 49 -382 110 515 -399 -478 743 376 -787 -100 732 -175 -536 257 212 -117 50 -178 -321 461 -24
5291 -24 -744 142 809 -521 -652 566 422 -575 -114 351 -22 -148 48 -202 102 370 -412 -427 683 274
5311 274 -845 -7 767 -237 -479 350 233 -137 114 -122 -75 400 28 -666 185 665 -504 -630 651
5330 651 385 -645 -137 625 -154 -184 90 -41 131 299 -455 -336 665 186 -839 76 805 -320 -499
5349 -499 400 185 -376 -53 -29 -162 271 31 -473 175 685 -447 -456 719 218 -537 -64 532 -240 -331 219
5370 219 -90 -19 240 -190 -147 385 158 -742 118 643 -240 -536 372 212 -433 -62 170 -72 107 17 -334
5391 -334 131 513 -333 -473 578 308 -681 33 484 -51 -294 128 29 -47 200 -77 -150 427 117 -408 151
5412 151 570 -371 -491 485 256 -337 -33 215 -105 154 -79 -247 29 336 -247 -247 529 250 -587 -73 444
5433 444 -191 -263 254 58 -218 61 -31 -270 240 19 -403 44 364 -130 -371 342 235 -279 -49 206 -85
5454 -85 -69 82 -219 10 221 -111 -286 321 118 -493 123 498 -32 -257 181 73 -169 174 61 -195 94
5475 94 268 -223 -60 322 -76 -263 222 182 -208 89 219 -199 -37 130 -58 -22 165 -98 -229 204 122
5496 122 -196 -61 311 -91 -251 196 75 -205 178 96 -69 -16 138 -92 -63 287 -54 -205 154 66 -345
5517 -345 152 225 -246 -79 193 -61 -148 137 99 -127 -2 101 -35 -5 178 -106 9 237 -58 -166 246
5538 246 119 -305 -89 208 -77 -172 130 -73 -139 26 -56 -83 113 73 -249 38 357 -182 -236 213 160 -142
5560 -142 -56 279 -69 -25 22 -132 29 99 -115 -191 371 -14 -361 17 311 -92 -279 202 147 -179 -6 -50
5582 -50 -30 84 42 -243 149 330 -227 -211 308 171 -274 -120 221 -22 -88 -7 -74 88 121 -215 -100 356 -76
5605 -76 -400 113 419 -208 -384 170 186 -129 -107 62 11 61 -111 -265 329 145 -384 -157 417 31 -344 69
5627 69 246 -118 -194 -7 90 163 54 -314 72 335 -108 -391 189 311 -419 -287 282 111 -317 -182 76
5648 76 11 10 -188 -162 256 203 -550 -14 579 -138 -559 128 401 -246 -261 56 67 128 -70 -176 116 361 -264
5671 -264 -424 421 452 -445 -309 534 73 -345 16 110 -3 -90 -86 -75 273 124 -468 84 542 -345 -573 314
5693 314 441 -335 -206 260 163 -157 -140 -249 269 218 -323 -317 429 184 -647 -52 580 -16 -376 119 225 25
5715 25 -4 -20 98 271 70 -595 207 541 -298 -507 477 436 -579 -170 377 73 -147 -42 -72 134 205 -303
5737 -303 -234 553 166 -664 35 721 -170 -548 229 269 -86 -190 -10 138 245 -134 -499 276 513 -460 -344
5758 -344 591 255 -562 -130 398 57 -262 -16 -31 82 135 -297 -174 564 64 -597 138 730 -180 -545 345
5779 345 414 -314 -122 170 -70 106 -153 -279 324 499 -520 -454 613 278 -576 -107 510 -36 -322 38
5799 38 71 12 -16 -196 -227 484 -38 -598 68 542 -466 -573 285 278 -297 -206 270 -7 69 -109 -190 167 442
5822 442 -430 -258 532 110 -477 21 606 -146 -386 67 256 -52 -58 -159 -149 368 73 -415 38 432 -325
5843 -325 -404 372 335 -391 -74 199 90 25 -16 -203 161 197 -284 -169 399 164 -441 -47 499 -157 -371 270
5865 270 117 -149 14 -32 -84 267 36 -369 186 493 -271 -333 385 197 -459 -140 323 36 -34 83 -29
5886 -29 114 249 -220 -258 444 60 -481 54 354 -107 -351 231 135 -148 -32 -27 -31 130 54 -333 -8 351 -285
5909 -285 -393 264 309 -382 -43 273 -79 -110 96 -87 25 203 -170 -166 398 117 -325 -14 418 -138 -130 192
5931 192 194 -181 4 100 -43 14 31 -272 -26 242 -179 -296 228 119 -321 -76 278 30 -156 147 2 -130
5953 -130 89 -51 -193 132 146 -218 -28 251 -114 -121 170 126 -299 78 29 -188 20 128 -152 -150 150 -134
5975 -134 -204 99 269 -243 51 179 -116 -69 238 -91 -61 182 64 -254 158 221 -160 -142 198 -74 -85 140
5997 140 12 -161 76 190 -340 -23 318 -30 -281 185 16 -115 120 79 -66 25 102 -50 -50 246 -59 -80
6019 -80 218 99 -86 40 236 -127 -30 39 -52 -74 141 -183 -91 164 66 -271 -36 306 -147 -256 180 116 -146
6042 -146 -41 31 24 137 20 -188 142 149 -136 -189 376 141 -317 9 300 -31 -159 105 -14 -39 -11 -88 -69
6065 -69 244 -35 -286 75 313 -116 -360 199 153 -214 -117 106 32 47 -79 -167 225 265 -251 -96 392 235
6087 235 -416 -30 370 -160 -128 50 134 65 -123 -134 -4 345 -149 -332 231 381 -298 -170 364 111 -287
6108 -287 -200 220 -37 35 -74 20 242 -16 -361 -159 353 74 -518 183 388 -216 -434 100 251 -53 -141
6129 -141 -121 44 174 -206 -346 280 270 -329 -258 487 105 -309 35 386 23 -114 -43 162 105 15 -337 -22
6151 -22 474 -225 -555 280 418 -339 -290 320 218 -251 -149 108 121 63 -256 -213 381 39 -501 -141 577 -77
6173 -77 -610 155 370 -138 -135 92 81 180 -190 -284 162 325 -205 -361 395 372 -440 -237 422 125 -299 -123
6195 -123 179 140 -85 -263 -49 350 -8 -524 -21 492 -115 -547 145 386 -245 -217 198 109 -53 -183 -162
6216 -162 241 240 -402 -273 453 340 -578 -144 511 34 -368 -63 247 41 -42 -158 32 287 -17 -482 112
6237 112 545 -247 -579 301 402 -393 -178 208 117 -29 -196 80 200 311 -279 -268 487 56 -557 -112 431
6258 431 33 -458 -36 382 -41 -183 -118 55 329 -54 -381 219 500 -281 -396 418 354 -341 -178 340 151
6279 151 -166 -149 -15 115 126 -313 -188 448 81 -515 -110 583 -35 -410 51 253 -81 -78 58 87 73 -80
6301 -80 -344 224 432 -304 -388 289 311 -350 -155 312 63 -103 66 -42 38 76 -220 -171 276 111 -454 -184
6323 -184 455 -159 -366 215 239 -289 -253 28 23 115 -21 -280 108 327 -300 -221 321 223 -342 -142 388 -33
6345 -33 -135 47 10 28 69 -85 -216 224 188 -501 18 483 -100 -418 242 229 -217 -77 174 62 110 -12
6367 -12 -330 73 289 -163 -308 335 196 -331 -36 283 4 -119 27 88 88 160 -105 -149 269 168 -317 51
6389 51 387 -157 -344 186 265 -326 -47 65 -66 132 -38 -249 51 241 -81 -221 173 201 -342 -96 368
6410 368 63 -163 74 212 -101 142 -87 4 101 87 -255 16 266 -134 -356 61 200 -183 75 165 -115
6431 -115 -53 143 -62 -36 235 24 -152 130 223 -287 -44 309 -141 -114 168 96 -249 34 153 -178 32 219
6453 219 -164 -74 205 -89 -235 94 73 -258 -10 54 -187 -176 201 -7 -220 164 120 -57 80 36 -141 1
6475 1 39 -175 15 173 -35 -259 166 122 -266 41 283 -90 -21 62 -15 -108 3 -47 -253 92 100 -353 -164 196
6499 196 -93 -197 98 94 -231 -108 74 -127 -9 112 -152 -57 156 -118 -432 147 116 -239 -73 210 17
6520 17 -214 87 52 31 65 22 0 139 20 -294 -24 318 -127 -282 234 287 -156 -110 131 18 -55 30 -22 2
6544 2 130 -183 -127 324 33 -309 -194 321 23 -397 6 126 -40 3 -107 11 72 -6 -214 121 417 -190
6566 -190 -396 236 201 -216 -114 307 -11 -171 -58 -16 118 -7 -204 -74 307 120 -303 -13 418 -142 -403
6587 -403 219 227 -141 -194 -93 66 26 -74 -125 250 214 -288 -257 337 186 -370 -15 302 18 -142 -98 128 83
6610 83 -79 -264 116 353 -10 -415 261 465 -291 -346 251 261 -222 -103 175 37 16 -150 -116 219 144 -357
6632 -357 -143 583 69 -443 -15 383 -86 -409 43 260 15 -193 -51 140 146 -261 -262 184 300 -385 -321 524
6654 524 313 -437 -161 243 49 -90 -85 -19 173 -3 -332 80 463 11 -525 234 421 -312 -353 274 259 -123
6676 -123 -129 -49 133 94 -312 -187 235 222 -512 -182 484 81 -518 53 275 -5 -262 7 102 138 -98 -203
6698 -203 153 475 -147 -414 300 537 -290 -259 373 88 -303 -207 105 161 27 -270 -99 371 60 -478 -123
6719 -123 515 -69 -479 21 464 -35 -303 15 147 13 -229 -243 185 229 -237 -264 296 334 -312 -259 386 100
6741 100 -230 -172 267 -16 32 -222 -80 303 40 -336 57 543 -68 -458 164 464 -203 -303 33 118 4
6762 4 -181 -284 137 261 -140 -301 399 256 -448 -221 421 48 -402 -142 261 -66 -119 -137 -56 257 14 -362
6784 -362 13 314 -153 -374 150 298 -214 -233 224 106 -110 -107 40 36 212 -172 -260 294 174 -373 -259 219
6806 219 15 -335 -17 206 -38 -59 -103 -4 250 36 -276 25 362 -81 -377 93 371 -99 -209 165 -2
6827 -2 -59 5 -13 150 265 -102 -220 172 239 -197 -99 378 8 -225 -46 125 -92 -9 -10 -45 178 104 -240 -93
6851 -93 254 -5 -282 130 385 -153 -78 223 47 37 76 -5 -41 166 110 -261 152 216 -195 -144 274 -9 -179
6874 -179 57 223 -91 20 -7 -153 103 148 -148 -145 278 43 -240 106 110 -227 -142 144 -11 -57 156 -23 10
6897 10 149 -28 -208 26 192 -92 -214 75 -19 -193 133 133 -134 0 75 -62 -8 102 -7 -55 47 -28 -168
6920 -168 110 126 -208 -123 118 -140 -96 202 -11 -174 89 9 -104 -62 214 -147 -116 200 -37 -136 137 104 -189
6943 -189 128 158 -88 -115 167 -84 -83 115 103 -230 109 133 -203 140 175 -127 -156 260 -73 -223 51 214 -200
6966 -200 -8 101 -122 -156 17 -67 -123 172 -36 -254 60 261 -309 -72 245 34 -227 -70 17 -93 19
6987 19 36 -107 47 117 -238 39 212 -12 -267 184 254 -188 -148 110 14 -152 36 32 -9 68 2 -163 161 166
7011 166 -245 -166 298 5 -241 82 221 -93 0 120 44 50 22 -181 25 443 -128 -289 143 429 -301 -165
7033 -165 276 33 -181 -34 -41 94 65 -84 -72 136 199 -401 -72 312 -28 -280 247 279 -163 -178 94 23 -95
7056 -95 -40 -128 51 163 -126 -211 273 191 -419 33 210 -32 -368 16 105 56 25 -30 25 237 49 -273 102
7079 102 200 -102 -294 249 330 -227 -77 256 153 -65 11 18 122 74 -189 -185 314 83 -474 8 417 -41 -292
7102 -292 80 253 -95 -169 -99 63 -8 -157 -287 104 281 -193 -314 420 233 -404 10 288 166 -144 14
7123 14 73 56 6 -193 -57 419 -52 -368 148 380 -190 -377 324 242 -262 -222 95 91 74 -205 -73 64 185
7146 185 -272 -127 369 69 -398 -81 466 56 -290 -9 193 1 -91 -140 83 303 12 -382 149 406 -227
7167 -227 -286 327 273 -474 -184 262 232 -51 -110 -21 198 126 -303 -73 371 39 -522 13 453 -109 -285 169
7189 169 237 -185 -233 -27 102 238 -129 -373 277 450 -353 -246 385 208 -294 -11 237 66 -231 -42 -12
7210 -12 191 58 -261 54 464 -15 -327 200 358 -62 -223 238 240 -49 -192 -96 203 154 -86 -238 253 277
7232 277 -409 -246 404 32 -417 -45 245 -40 -111 -102 133 126 -16 -205 3 364 11 -372 184 414 -122 -220
7254 -220 223 161 -22 -50 -2 41 147 -77 -222 138 270 -318 -95 375 -31 -322 28 193 -96 -116 -42 133
7276 133 46 56 -208 -66 329 -43 -125 161 296 -114 -203 220 119 -32 -78 41 94 146 -102 -152 209 200 -144
7299 -144 -53 356 131 -302 -13 233 -255 -117 136 -39 -26 136 -97 10 243 129 -182 52 196 -230 -123
7320 -123 179 33 -214 70 44 -138 150 52 -217 76 127 -163 -68 277 120 -279 63 191 -22 -167 170
7341 170 43 -58 79 -85 -43 215 51 -216 145 242 -69 -111 215 -25 -190 93 42 -125 67 53 -43 23
7363 23 168 -60 -128 205 -59 -154 1 238 -108 34 90 -100 -122 133 -21 -162 174 -17 -224 110 146 -231
7385 -231 -13 268 87 -228 167 62 -100 145 70 -53 -185 124 -145 -51 203 -14 -221 117 -20 3 19
7406 19 207 -14 -94 131 -81 -153 6 107 -168 -45 88 -89 -38 133 -70 -175 80 78 -198 46 118 -202
7428 -202 -68 173 -94 -155 148 80 -94 187 193 -147 69 209 -156 -13 213 39 -202 120 155 -47 -107 170
7450 170 -43 -27 64 -259 -196 203 -28 -274 44 212 -160 -168 264 89 -107 7 16 -141 123 8 -186 75
7472 75 315 -94 -173 420 27 -240 -25 219 -37 -174 178 31 44 100 -140 -68 68 -103 -261 50 238 -228
7494 -228 -238 230 33 -244 -91 124 -109 56 -22 -159 179 207 -270 -91 362 112 -274 183 255 -116 -111 9
7516 9 104 -124 75 -82 94 212 -108 -190 251 73 -351 -269 303 -56 -320 51 273 -160 -30 -25 -156 54
7538 54 -18 -105 -225 348 22 -283 362 312 -126 -177 107 113 -32 -56 62 -40 84 -41 -215 259 138 -366 -204
7561 -204 324 -71 -399 227 278 -67 -65 77 76 103 -2 -187 24 227 -170 -159 176 218 -286 -242 300 -11 -287
7584 -287 36 140 -108 -15 -35 -114 149 -16 -236 -39 392 -152 -298 227 247 -215 -114 174 109 -108 -13 -17 125
7607 125 271 -275 -146 329 234 -493 -128 367 -79 -325 -46 170 -104 -208 -33 25 238 -50 -268 97 360
7628 360 -196 -283 235 219 -265 -65 202 144 -194 -5 90 259 104 -167 -11 313 -12 -440 -8 408 2
7649 2 -319 122 285 -188 -200 55 43 133 -154 -170 187 312 -339 -310 358 162 -323 -5 290 64 -197 31
7671 31 151 36 -26 -162 20 310 -11 -358 3 430 -94 -400 205 213 -108 -133 48 39 -32 -110 -216 166 149
7694 149 -172 -126 397 150 -359 9 273 -39 -283 19 78 33 68 -123 0 237 15 -280 155 269 -124
7715 -124 -312 168 191 -226 -240 74 -39 89 -50 -269 132 188 -198 -103 235 92 -346 63 377 65 -163
7736 -163 47 75 -38 94 -2 -115 107 -56 -270 171 186 -182 -186 402 243 -213 47 24 -32 4 -50 -94 76
7759 76 118 -336 -159 226 31 -295 -13 270 -86 -159 62 42 -131 55 -56 -51 207 50 -230 -39 211 -130
7781 -130 -159 191 101 -108 4 108 -24 73 -17 -150 151 204 -120 -204 205 5 -247 26 186 -29 -187 102
7803 102 30 -73 99 -110 -119 54 69 -180 -36 112 -136 -181 317 78 -290 18 124 26 -3 193 -51 5 210
7826 210 -106 -187 140 16 -225 94 195 -108 -58 106 37 -32 128 60 -220 226 96 -186 -27 155 -155 -140
7848 -140 201 -19 -102 33 46 -152 5 206 -118 -147 133 -16 -116 183 141 -161 -36 125 -136 -147 129 -91
7870 -91 4 81 69 -138 46 59 -78 -73 191 -61 36 184 -105 -127 53 153 -187 20 156 -160 -57 116 73
7893 73 -49 19 57 -113 67 83 -127 11 176 -53 -174 41 148 -165 -35 57 -194 -116 11 -142 -47 55
7915 55 -50 -38 227 100 -299 -19 212 -40 -152 268 10 -118 -19 103 -15 26 91 -155 57 277 -139 -121
7937 -121 334 66 -268 -16 256 -110 -107 208 -23 -53 149 -159 -59 220 -19 -183 105 346 -197 -205 221 97
7959 97 -251 40 131 -144 -8 4 -112 -76 126 -61 -162 228 108 -332 30 227 -81 -212 151 114 -150 9
7981 9 20 -54 85 -13 -145 108 238 -119 -69 299 104 -164 5 96 -21 36 37 -46 82 74 -93 -125 271 83 -281
8006 -281 146 210 -180 -238 130 27 -170 -26 116 -143 137 -18 -111 97 203 -271 -108 305 -47 -257 31
8027 31 254 -107 -106 82 -72 -119 34 -194 -2 125 -83 -174 186 123 -315 -125 257 -46 -192 128 60 -21 5
8050 5 22 -38 -6 77 -234 94 396 -47 -294 187 251 -183 -173 194 83 -98 -28 -45 24 130 -141 -98 246 72
8074 72 -278 -18 287 59 -193 104 180 -152 -118 33 -114 121 40 -196 77 278 -158 -228 244 207 -384 -157
8096 -157 208 -10 -238 3 28 -54 -11 -169 -20 173 -29 -306 -29 293 -65 -171 140 200 -158 2 103
8117 103 71 143 -53 -84 98 204 -105 -144 314 50 -285 -40 321 -90 -296 69 52 -48 5 -143 -99 213
8139 213 -86 -209 -9 257 -103 -293 135 181 -232 -119 18 23 66 -42 -115 184 262 -138 -91 246 134 -311
8161 -311 16 306 -40 -181 75 188 74 -130 34 -19 88 -25 -219 16 223 -103 -300 195 136 -99 -160
8182 -160 163 -42 -69 62 26 46 118 -214 -48
8191d8
##END NTUPLES=NMR FID
##END=
