##TITLE=1H_ES-APTMS
 
 8 sc, 
 9.8.2023
##JCAMPDX= 6.0         $$ Bruker NMR JCAMP-DX V2.0
##DATA TYPE= NMR FID
##DATA CLASS= NTUPLES
##ORIGIN= UXNMR, Bruker Analytische Messtechnik GmbH
##OWNER= root
$$ XWIN-NMR		Version 3.5
$$ Wed Aug  9 15:53:28 2023 Russian Standard Time (UT+4h)  she@DPX200
##.OBSERVE FREQUENCY= 200.13135
##.OBSERVE NUCLEUS= ^1H
##.DELAY= (6, 6)
##.ACQUISITION MODE= SIMULTANEOUS
##.ACQUISITION SCHEME= undefined
##.AVERAGES= 8
##.DIGITISER RES= 18
##SPECTROMETER/DATA SYSTEM= spect
##.PULSE SEQUENCE= zg30
##.SOLVENT NAME= Acetone
##.SHIFT REFERENCE= (INTERNAL, Acetone, 0, 15.7039)
##AUDIT TRAIL= $$ (NUMBER, WHEN, WHO, WHERE, WHAT)
$$ ##TITLE= Audit trail, XWIN-NMR		Version 3.5
$$ ##JCAMPDX= 5.01
$$ ##ORIGIN= Bruker BioSpin GmbH
$$ ##OWNER= she
$$ F:/spectra/data/she/nmr/H-F/1/audita.txt
$$ ##AUDIT TRAIL=  $$ (NUMBER, WHEN, WHO, WHERE, WHAT)
(   1,<2023-08-09 15:52:18.45 +0400>,<she>,<DPX200>,
      <created by zg, POWCHK disabled, PULCHK disabled
       configuration hash MD5:
       00 E9 B6 7A A2 85 ED C7 34 08 36 98 17 FE 4E 26
       data hash MD5: 16K
       31 2E EB 2D F9 3C FB A9 4D A4 C4 EF DB A8 40 D5>)
$$ ##END=
$$ 
$$ hash MD5
$$ 84 2C 18 9C ED 76 E2 5C D0 FF 32 06 46 73 D1 11
##$RELAX= 
##$RELAX= 
##$RELAX= 
##$RELAX= 
##$RELAX= 
##$RELAX= 
$$ Bruker specific parameters
$$ --------------------------
##$DU= <F:/spectra>
##$EXPNO= 1
##$NAME= <H-F>
##$PROCNO= 1
##$TYPE= <nmr>
##$USER= <she>
##$AMP= (0..31)
100 100 100 100 100 100 100 100 100 100 100 100 100 100 100 100 100 100 
100 100 100 100 100 100 100 100 100 100 100 100 100 100 
##$AQSEQ= 0
##$AQ_mod= 1
##$AUNM= <au_zg>
##$AUTOPOS= <>
##$BF1= 200.13
##$BF2= 200.13
##$BF3= 200.13
##$BF4= 200.13
##$BF5= 200.13
##$BF6= 200.13
##$BF7= 200.13
##$BF8= 200.13
##$BYTORDA= 1
##$CFDGTYP= 0
##$CFRGTYP= 5
##$CHEMSTR= <none>
##$CNST= (0..31)
1 1 145 1 1 1 1 1 1 1 1 1 1 1 1 1 1 1 1 1 1 1 1 1 1 1 1 1 1 1 1 1 
##$CPDPRG= <>
##$CPDPRG1= <>
##$CPDPRG2= <>
##$CPDPRG3= <>
##$CPDPRG4= <mlev>
##$CPDPRG5= <mlev>
##$CPDPRG6= <mlev>
##$CPDPRG7= <mlev>
##$CPDPRG8= <mlev>
##$CPDPRGB= <>
##$CPDPRGT= <>
##$D= (0..31)
0 1.2 0 0 0 0 0 0 0 0.06 0 0.03 0 0 0 0 0.0002 0 0 0 0 0 0 0 0 0 0 0 0 
0 0 0 
##$DATE= 1691581938
##$DBL= (0..7)
120 120 120 120 120 120 120 120 
##$DBP= (0..7)
150 150 150 150 150 150 150 150 
##$DBP07= 0
##$DBPNAM0= <>
##$DBPNAM1= <>
##$DBPNAM2= <>
##$DBPNAM3= <>
##$DBPNAM4= <>
##$DBPNAM5= <>
##$DBPNAM6= <>
##$DBPNAM7= <>
##$DBPOAL= (0..7)
0.5 0.5 0.5 0.5 0.5 0.5 0.5 0.5 
##$DBPOFFS= (0..7)
0 0 0 0 0 0 0 0 
##$DE= 6
##$DECBNUC= <off>
##$DECIM= 32
##$DECNUC= <off>
##$DECSTAT= 4
##$DIGMOD= 1
##$DIGTYP= 9
##$DL= (0..7)
0 120 120 120 120 120 120 120 
##$DP= (0..7)
150 150 150 150 150 150 150 150 
##$DP07= 0
##$DPNAME0= <>
##$DPNAME1= <>
##$DPNAME2= <>
##$DPNAME3= <>
##$DPNAME4= <>
##$DPNAME5= <>
##$DPNAME6= <>
##$DPNAME7= <>
##$DPOAL= (0..7)
0.5 0.5 0.5 0.5 0.5 0.5 0.5 0.5 
##$DPOFFS= (0..7)
0 0 0 0 0 0 0 0 
##$DQDMODE= 0
##$DR= 18
##$DS= 0
##$DSLIST= <SSSSSSSSSSSSSSS>
$$ [...]
##$SUBNAM2= <"">
##$SUBNAM3= <"">
##$SUBNAM4= <"">
##$SUBNAM5= <"">
##$SUBNAM6= <"">
##$SUBNAM7= <"">
##$SUBNAM8= <"">
##$SUBNAM9= <"">
##$SW= 18.05172834244
##$SWIBOX= (0..15)
0 0 2 0 0 0 0 0 0 0 0 0 0 0 0 0 
##$SW_h= 3612.71676300578
##$TD= 16384
##$TD0= 1
##$TE= 0
##$TE2= 300
##$TE3= 300
##$TEG= 300
##$TL= (0..7)
0 120 120 120 120 120 120 120 
##$TP= (0..7)
150 150 150 150 150 150 150 150 
##$TP07= 0
##$TPNAME0= <>
##$TPNAME1= <>
##$TPNAME2= <>
##$TPNAME3= <>
##$TPNAME4= <>
##$TPNAME5= <>
##$TPNAME6= <>
##$TPNAME7= <>
##$TPOAL= (0..7)
0.5 0.5 0.5 0.5 0.5 0.5 0.5 0.5 
##$TPOFFS= (0..7)
0 0 0 0 0 0 0 0 
##$TUNHIN= 0
##$TUNHOUT= 0
##$TUNXOUT= 0
##$USERA1= <user>
##$USERA2= <user>
##$USERA3= <user>
##$USERA4= <user>
##$USERA5= <user>
##$V9= 5
##$VALIST= <valist>
##$VCLIST= <CCCCCCCCCCCCCCC>
##$VD= 0
##$VDLIST= <DDDDDDDDDDDDDDD>
##$VPLIST= <PPPPPPPPPPPPPPP>
##$VTLIST= <TTTTTTTTTTTTTTT>
##$WBST= 1024
##$WBSW= 4
##$XGAIN= (0..3)
0 0 0 0 
##$XL= 0
##$YL= 0
##$YMAX_a= 73545
##$YMIN_a= -22547
##$ZGOPTNS= <>
##$ZL1= 120
##$ZL2= 120
##$ZL3= 120
##$ZL4= 120
##$ABSF1= 10
##$ABSF2= 0
##$ABSG= 5
##$ABSL= 3
##$ALPHA= 0
##$AQORDER= 0
##$ASSFAC= 0
##$ASSFACI= 0
##$ASSFACX= 0
##$ASSWID= 0
##$AUNMP= <proc_1d>
##$AZFE= 0.1
##$AZFW= 0.1
##$BCFW= 1
##$BC_mod= 2
##$BYTORDP= 1
##$COROFFS= 0
##$CY= 11.3945322036743
##$DATMOD= 1
##$DC= 2
##$DFILT= <>
##$DTYPP= 0
##$F1P= 15.7292609196834
##$F2P= 12.9074282941183
##$FCOR= 0.5
##$FTSIZE= 0
##$FT_mod= 4
##$GAMMA= 1
##$GB= 0.15
##$INTBC= 1
##$INTSCL= 1
##$ISEN= 128
##$LB= 0.24
##$LEV0= 0
##$LPBIN= 0
##$MAXI= 10000
##$MC2= 0
##$MEAN= 0
##$ME_mod= 0
##$MI= 1.114404
##$NCOEF= 0
##$NC_proc= 0
##$NLEV= 6
##$NOISF1= 3.799351
##$NOISF2= 2.8
##$NSP= 1
##$NTH_PI= 0
##$NZP= 0
##$OFFSET= 15.70392
##$PC= 1
##$PHC0= -21202.44
##$PHC1= 8.252722
##$PH_mod= 1
##$PKNL= yes
##$PPARMOD= 0
##$PSCAL= 0
##$PSIGN= 0
##$REVERSE= no
##$SF= 200.130013532006
##$SI= 16384
##$SIGF1= 3
##$SIGF2= 2
##$SINO= 400
##$SIOLD= 16384
##$SREGLST= <1H.CDCl3>
##$SSB= 0
##$STSI= 0
##$STSR= 0
##$SW_p= 3612.71676300578
##$SYMM= 0
##$S_DEV= 0
##$TDeff= 0
##$TDoff= 0
##$TI= <>
##$TILT= no
##$TM1= 0
##$TM2= 0
##$TOPLEV= 0
##$USERP1= <user>
##$USERP2= <user>
##$USERP3= <user>
##$USERP4= <user>
##$USERP5= <user>
##$WDW= 1
##$XDIM= 8192
##$YMAX_p= 0
##$YMIN_p= 0
$$ End of Bruker specific parameters
$$ ---------------------------------
##NTUPLES= NMR FID
##VAR_NAME=  TIME,          FID/REAL,        FID/IMAG
##SYMBOL=    X,             R,               I
##VAR_TYPE=  INDEPENDENT,   DEPENDENT,       DEPENDENT
##VAR_FORM=  AFFN,          ASDF,            ASDF
##VAR_DIM=   8192,          8192,            8192
##UNITS=     SECONDS,       ARBITRARY UNITS, ARBITRARY UNITS
##FACTOR=    0.0002768,     1,               1
##FIRST=     0,             0,               0
##LAST=      2.2672688,     0,               0
##MIN=       0,             -22547,          0
##MAX=       2.2672688,     73545,           0
$$ Real data points
##PAGE= N=1
##DATA TABLE= (X++(R..R)), XYDATA
0@%%%%%%%%%%%%%%%%%%jNrJ2j5J6j8K1k3K7l4L9m3N0n8O7p5Q6r8J09j22J38j56
$$ 0 0 0 0 0 0 0 0 0 0 0 0 0 0 0 0 0 0 0 -1 4 -5 7 -8 8 -10 11 -12 15 -19 20 -23 27 -31 36 -39 47 -51 58 -64 74 -82
41h2J74j95K16k39K67k97L28l64M03m44M93n46O03o69P40q18R08j009J122j254
$$ -82 92 -103 113 -126 141 -156 172 -192 211 -233 260 -286 317 -352 388 -430 478 -531 591 -663
61f63J411j595J816k092K444k917L604m760j7117J5589Q859j6661M3236m6088
$$ -663 748 -847 969 -1123 1321 -1596 2008 -2752 -19869 -4280 4579 -12082 31154 -14934
75a4934J3595L321n599Q623j4900Q929N346j146m590j1119K0318j2302P597n794
$$ -14934 -1339 1982 -3617 5006 -9894 -965 4381 3235 -1355 -12474 7844 -4458 3139 -2655
89b655N812j0949K3070j5564p731J1465o849O540o046L486k482R515j2668Q835
$$ -2655 3157 -7792 15278 -286 -8017 3448 -3401 3139 -2907 579 -1903 7612 -5056 3779
103C779j1083J1263o249M415n165k218j3123P570J2868k616o38M200p846K3028
$$ 3779 -7304 3959 -2290 2125 -3040 -5258 -18381 -10811 2057 -559 -1197 3003 -4843 18185
117A8185p895j8070J1695k254k907l991J0767r782Q301j1234J1202J6559j3994
$$ 18185 10290 -7780 3915 1661 -1246 -5237 5530 -4252 4049 -7185 4017 20576 6582
130F582r406N062k461R44n930O406o000M939r51L70p41J208n999P496l575M452
$$ 6582 -2824 2238 -223 721 -5209 1197 -4803 136 -815 -445 -1186 22 -5977 1519 -2056 2396
146B396m946J902J1803k0509J3873p443M815J554j696m981Q48L824j979Q21o62
$$ 2396 -2550 -648 11155 -9354 4519 -2924 1891 3445 1749 -3232 -2384 1440 -539 282 -380
161c80j139J424lk43r40J492j37Q0o2N85j694J265K76j159l67K754k972J926r44
$$ -380 -1519 -95 -98 -341 -1281 211 74 154 92 677 -1017 248 524 -635 -1002 1752 -1220 706 -238
180b38P88j54n06J92K47j20j539J926j630J026j727L141j821L61R29l694P278
$$ -238 550 396 -110 82 329 209 -1330 596 -1034 -8 -1735 1406 -415 -54 875 -2819 4459
197D459o516J300J595l052L650k891o25J856Q92j980K123J26l721K712j346J087
$$ 4459 -2057 -757 838 -2214 1436 -1455 -2080 -224 668 -1312 811 937 -2784 -72 -1418 -331
213c31N65r1q66n66L347k967J566j185J139r92P91J168k191M55o35r6Q39m94J102
$$ -331 234 143 -723 -1289 2058 -909 657 -528 611 -381 410 1578 -613 -158 -793 -889 -50 -544 558
232E58j700J075J83j39l6k75O78o75N98j409J669R0j341Q78K69k54J194j249j378
$$ 558 -1142 -67 116 -23 -59 -334 344 -331 267 -1142 527 617 -724 154 423 169 1363 114 -1264
251a264Q59L40J62N08M38l93J29m03j402K05P37j60Q47j605J821j431J68R83n15
$$ -1264 -405 -65 97 605 1043 650 779 376 -1026 -821 -84 -244 603 -1002 819 -612 -444 539 24
270B4O50M17r32j57R4L3k77n0J363o73oL20j540J658j884L69P84l34L79n52N52
$$ 24 674 1091 159 2 96 129 -148 -198 1165 492 486 806 -734 924 -960 -591 193 -141 238 -314 238
291B38j58j76R4K5N4K4k14K4k8J90o6j76K14J0n1O8M7j89J04p9k62J491j626M76
$$ 238 80 -96 -2 23 77 101 -113 -89 -117 73 7 -169 45 55 4 72 119 -70 34 -45 -307 1184 -442 34
315C4p86J642n99Q6P24p00j806M04O63J030l97j221j74J104N11k09j45k47J29
$$ 34 -752 890 291 377 1101 401 -1405 -1001 -338 692 295 -926 -1100 4 515 306 161 -86 43
334D3J65j72J12Q0l49N8O31Q4q2j80k54k50M04j53Q3l90j62K82K36k86K58j2n62
$$ 43 208 36 148 228 -121 -63 568 652 570 390 136 -114 290 137 220 -170 -332 -50 186 -100 158 146 -416
357d16M78R2j88J07qk50J89p3j17K49k65L23j02O6J40k22j9l0R6j75L76k25j37
$$ -416 62 154 -34 73 65 -185 4 -69 -186 63 -202 121 19 85 225 3 -16 -46 50 -125 251 26 -111
380a11n9P79q10K87k66J71Q38m84l05j58K05R2l3J95Q1p59j40P94l99j19P99p54
$$ -111 -170 609 -201 86 -180 -9 829 345 40 -118 87 179 146 341 422 -337 -477 317 -82 -201 598 -156
402a56N6o2J38j46l5J33J68k24k11M25k07k0J64l9m9J51j1p4m9J78j83Q5r1jL04
$$ -156 -100 -162 -24 -170 -205 -72 96 -128 -339 86 -121 -141 23 -16 -65 86 75 1 -48 130 -53 32 -59 -60 244
427B44l33J80k34j5K15j80L22j67j4m7n9K11l51J65m6J25J8O8n21N15j80K73k49
$$ 244 -89 91 -143 -158 57 -123 199 32 18 -29 -88 123 -228 -63 -109 16 34 102 -419 96 -84 189 -60
450f0j68J44N0On7j78K71k41J39J15l69J27N3M75o75M68m20K02J21l2J63k3P1
$$ -60 -228 -84 -34 -28 -85 -263 8 -233 -94 21 -348 -221 -168 307 -368 100 -320 -118 3 -29 134 111 182
473A82m4L0k35J53j64J13J17k41K85l04L60l04j2M9M5J40j26l06L83j41o7JJ68
$$ 182 138 168 -67 86 -78 35 152 -89 196 -108 252 -52 -64 -15 30 170 44 -262 121 -20 -87 -86 82
496H2j22j06J8L47j60k47K89K0q2r2L5J33n29L87j52K61Q9l78K51j79L39j92k8
$$ 82 -40 -146 -128 219 59 -188 101 121 39 -53 -18 115 -414 -27 -179 82 171 -207 44 -135 204 12 -16
519a6j11K11p1j9j06J22j66R4J13K03k65M8k02J36J00j52J24m3j12L03j63j34
$$ -16 -127 84 13 -6 -112 10 -156 -62 51 254 -11 37 -165 -29 71 -81 43 0 -112 191 28 -106
541a06K46j37m4j27K16j7K36k49J44j82N0m2j16K17Nk74R3J11N1k33K22j04K42
$$ -106 140 3 -41 -168 48 31 267 18 162 -20 30 -12 -128 89 94 -180 -87 24 75 -158 64 -40 202
564B02k81J76k48j9M3K51m9M7N7k1lr4k76M32k25j53J96pk52L59j08J30j68j92
$$ 202 -79 97 -151 -170 -127 124 75 122 179 158 155 61 -215 217 -8 -161 35 28 -224 135 27 157 -11 -203
588b03K75j91K41j24J61q0%l0J2J94l68m0P1J69Q2k13J94k26P4k79O6J24K67m58
$$ -203 72 -119 122 -2 159 79 79 49 61 255 -113 -153 -82 87 169 -44 150 -76 -2 -281 -215 -91 176 -282
612b82J89J4O7J20N1n0k72J90Q2j0k03J12q2nR2p9rQ1l31L36j65K17l1k01j02
$$ -282 -93 -79 -12 108 159 109 -163 27 109 99 -104 8 -74 -79 13 -66 -75 6 -325 11 -154 63 32 -169 -271
637b71L05n6k7J01j56J12r0j53JJ85J62L2j22J41k1k4L0o5l59K80K2K4n5r7k20
$$ -271 34 -22 -49 52 -104 8 -82 -235 -234 -49 113 145 23 164 143 119 149 84 -275 5 27 51 -4 -101 -321
662c21N26j96j59L77m48J70O2J3k53J71J71r1Q2K4Q4k02J91n0j06n6R9k02K10
$$ -321 205 9 -150 227 -221 -51 11 24 -229 -58 113 22 104 128 212 10 201 151 45 -11 88 -114 96
685I6j60J15l2M3l19K49j22K03K49l00K5j41Q6j47R8M1j46L01l2p5j11J52j21
$$ 96 -64 51 19 62 -257 -8 -130 73 322 22 47 -94 -8 -155 -57 -16 -162 139 107 32 -79 73 -48
708d8N2J03j83l6j61O1K01k90K19o5K45j86K28j91J43o7k37L72j71l37M8L60k75
$$ -48 4 107 -76 -112 -273 -212 -11 -301 -82 -147 98 -88 140 -51 92 25 -212 160 -11 -348 -300 60 -215
731b15K57J2J76k63M1o3J57l08L87j97j26K58ml42M77q6j08j43J34N9J44j77k08
$$ -215 42 54 230 -33 8 -55 102 -206 181 -16 -142 116 112 -230 247 161 53 -90 44 103 247 70 -138
754a38o4J02K58j46p1J50k03k17M53p2J44l28o0O9l3J11K17k75J55L2O5j62J6
$$ -138 -202 -100 158 12 -59 91 -112 -329 124 52 196 -132 -192 -123 -156 -45 172 -103 52 84 149 -13 3
777CJ03q9k01J84J46j61k44K74l4R9K32l56J45J33k23l5k4P0k21K35n2Q8Q2k29
$$ 3 106 17 -184 0 146 -15 -259 15 -19 80 312 -44 101 234 11 -24 -48 22 -199 36 -16 72 154 -75
801g5K11l36K99J64j07q1o6J43j50J40l10K44m08L01o5M8RJ50j18Q7K1j45K31
$$ -75 136 -200 99 263 156 75 9 152 2 142 -168 76 -332 -31 -96 -48 -39 111 -7 80 101 -44 187
824A87r9p3N1k9n9K6j43M4J90k28K4L05j35P6j48l4J56k2k32R1k18J76J21o9j3
$$ 187 88 15 66 37 -22 4 -139 -95 95 -133 -109 196 61 137 -11 -45 111 89 -143 -52 -270 -94 27 -42 -55
849e5K2K46j72q5J07l33K37k4k8M3j65K24k9K24p6J77k43J44m7j98L5k14P3L8
$$ -55 -33 213 41 -44 63 -270 -33 -57 -85 -42 -207 17 -12 212 136 313 70 214 167 -31 4 -210 -137 -99
873i9J00q0q1K41qp2K85k59q9J57O7m19M5J39N2j04J07Q8j96j02J70K74j54r5
$$ -99 1 -79 -160 81 73 1 286 27 -62 95 162 -257 -212 -73 -21 -125 -18 70 -126 -228 -58 216 62 -33
897c3k18L24j06pkk13L50j68N8j53l4L8K49P2j82P2k80J25L01l65L5p9J67K1K5
$$ -33 -251 73 -33 -40 -42 -255 95 -73 -15 -168 -202 -164 85 157 -25 47 -233 -108 193 -172 -137 -216 -49 -28 -3
922cj3jn6K5M1j74J59O5j7j22K15k16J45l57K66J20O6k03J47m9Q3k93nK0L00R9
$$ -3 -16 -17 -73 -48 -7 -181 -22 43 26 -96 119 -97 48 -309 -43 77 143 -60 87 38 121 -172 -177 -157 143 242
948B42j67j8O2P6k21p3J39j95k2K20R4j68%M2j97Q0J78K8O7j94o5J33r3J13j53
$$ 242 75 57 119 195 -26 -99 40 -155 -177 43 137 -31 -31 11 -186 -106 72 100 167 -27 -92 41 -52 61 -92
973i2m1K22j12J4k71K32J20j44J01j27q9P7Q3p7P4J5j08oJ98j75j0L01l27J20
$$ -92 -133 89 -23 -9 -280 -48 72 -72 29 -98 -187 -110 -27 -104 -30 -15 -123 -129 69 -106 -116 185 -142 -22
997b2J4r1K60j59p4k01L7J25M0K77Q3k12pj46K1J00j49j13N7P5j43L25N0j25m3
$$ -22 -8 -99 161 2 -72 -273 -236 -111 -71 206 289 77 70 -76 -55 45 -104 -217 -160 -85 -228 97 147 22 -21
1022b1Q8n1j50M09k17n0K15k03n9J55j88q5j03K54M7L2O8P2k60%K21k77Q1M3l80
$$ -21 67 16 -134 275 58 8 223 20 -39 116 -72 -157 -260 -6 41 73 141 213 -47 -47 174 -103 -22 21 -359
1047c59M84k53K43J56k62n4R1j38K1j3l1L01l87J10N2l4J12mj02J67n9q7L20j51
$$ -359 125 -128 115 271 9 -45 46 -92 -71 -84 -115 186 -201 -91 -39 -73 39 35 -67 100 41 -46 274 123
1071A23j61Q2J29j0j54j57J21J65j46K47j76Jn9j88J36p1J84j40q7O2j2K91k45
$$ 123 -38 44 173 163 9 -148 -27 138 -8 239 63 64 5 -183 -47 -118 66 -74 -161 -99 -111 180 -65
1094f5Q4O4j62J41j40J56l26K14m9J99o5l58M51l18j20K25n3K04k41K51k29L21
$$ -65 19 83 -79 62 -78 78 -248 -34 -83 116 51 -307 144 -174 -294 -69 -122 82 -159 92 -137 184
1116A84k13k3J99J69k04l8m1k55K00l6j4N2o0K3P4j4M1k4oL4k8j10J33p9o2j87
$$ 184 -29 -52 147 316 112 74 33 -222 -22 -58 -72 -20 -80 -57 17 3 44 20 14 48 20 -90 43 -36 -98 -285
1142b85K46j14K04j23j6m1J54m3O7j09K1L7j16L35k54n6M43j58l10K5L46j15k24
$$ -285 -39 -153 51 -72 -88 -129 25 -18 49 -60 -39 -2 -118 217 -37 -93 350 192 -118 -93 253 138 -86
1165h6K14j0N5k73j38K28J02L8k10r5K68j27k7M1K97j99J27j49P7q7j5M1P9M4
$$ -86 128 118 173 -100 -238 -10 92 130 -80 -175 93 -34 -61 -20 277 78 205 56 133 46 31 72 151 195
1189A95l92J68K78l72J92oJ52l14J4L67l22O2n5M4p2J85j41j18K75k0P2L8l53
$$ 195 -197 -29 249 -123 69 63 215 -99 -85 282 -40 22 -33 11 -61 124 -17 -135 140 120 192 230 -123
1212a23J27l0r1k6L12j9l55K67Q4m07J59L4J3K0n3K19k17J57j73J85q9KJ58O2
$$ -123 4 -26 -117 -143 169 150 -205 62 146 -261 -102 -68 -55 -35 -88 131 -86 71 -102 83 -6 -4 154 216
1236B16k71j32J94J17k73J46RR6J93m06K53j38k1J40k88N9mJ36k9n9JK0q7J38
$$ 216 -55 -187 7 124 -149 -3 6 102 295 -111 142 4 -17 123 -165 -106 -110 26 -3 -62 -61 -41 -128 10
1260A0j39J46n2K03j08J83k21M5m9j78J38R8k33L06q5K37l74K89l56r4L13p0j10
$$ 10 -129 17 -35 168 60 243 22 67 18 -160 -22 76 -157 149 64 301 -73 216 -140 -234 79 9 -101
1283a01J29j20L10k1j09j18L2Q1j90Q5j55L37k42P0l4K40n4M6k30J50r7J29j42
$$ -101 28 -92 218 197 88 -30 2 83 -107 -22 -177 160 -82 -12 -46 194 140 186 -44 106 9 138 -4
1306dK00j78Kn8O6k39L5J75kM0k25M4O2J27k92K78lj77J7N2J71k13L24k73J42
$$ -4 196 18 20 -38 28 -211 -176 -1 -3 37 -188 -144 -82 45 -247 31 28 -149 -132 -80 91 -122 202 -71 71
1331G1j22oJ4K7r8L29j50k38J98j51J72o7m6m3J88l9j91K22j38q4J37j3N6l1J
$$ 71 -51 -57 -43 -16 -114 215 65 -173 25 -126 46 -21 -67 -110 78 39 -152 70 -68 -152 -15 -28 28 -3 -2
1356bl2M4k48j9M18k91K44J43l94j39J60kL9J04p8J77n9j8l09M42j82K7J24j30
$$ -2 -34 10 -238 -257 161 -130 114 257 -137 -276 -116 -118 -79 25 -53 124 65 47 -262 180 -2 25 149 19
1380A9j18K51Jj65R7q6m4K78k08m5pJ51J0j25p4n2m6L24k28Q8o5K07J15l10q3
$$ 19 -99 152 153 -12 85 -1 -45 233 25 -20 -27 124 134 9 -65 -117 -163 161 -67 21 -44 163 278 -32 -115
1405a15K03k6j34P0L8N6j1r3K32j20j47J36L4k46J54j59m5K27j92J20J23m9n2
$$ -115 88 62 -72 -2 36 92 81 -12 220 100 -47 89 123 -123 31 -128 -173 54 -138 -18 105 56 4
1428DR7l80L68j18o2J30n7k7qJ31k90Q4J11k4L7r3r5K06l6q5K08j32j70K93j25
$$ 4 101 -279 89 -29 -91 39 -18 -45 -53 78 -212 -128 -17 -41 -4 -97 -192 14 -22 -107 101 -31 -201 92 -33
1453c3R6k34J94l9k3j23k9L99k54M1k05K80j32j91M98j25j47J89j50Pj03L0j9
$$ -33 63 -171 23 -16 -39 -162 -191 208 -46 -5 -210 70 -62 -253 245 120 -27 162 12 19 -84 -54 -73
1476g3m2J18%j66K80J54q1m10L19L0j52K3j00J25J25k17P0K26j58j5r8O0j03N6
$$ -73 -115 3 3 -163 117 271 190 -220 99 129 -23 0 -100 25 150 -67 3 229 71 56 -42 18 -85 -29
1500b9Q9j60R0J25j4L2K7o4L24m74J40k45L10p0J0j43L0J70j49M4J33l54J69j98
$$ -29 60 -100 -10 115 101 133 160 96 420 -54 86 -159 151 81 91 -52 -22 148 -1 43 176 -178 -9 -207
1524b07l7J14K07moo8Om7M8J1j82K90q7P3k4k28o5K22j54J31P0l51K73k0n1l6
$$ -207 -244 -130 77 73 67 -1 5 -42 6 17 -165 125 38 111 87 -141 -206 16 -138 -7 63 -288 -15 -35 -86 -122
1550a22J39o8N3j25P3l8P3k5R1j81J36J19k89J08pR8J6J97l83L52k45R7j60J21
$$ -122 17 -51 2 -123 -50 -88 -15 -40 51 -130 6 125 -164 -56 -63 35 51 248 -135 217 -28 69 -91 30
1574C0k37J44n1L5lN9P1J8j86M52l37k01J87J18J96l06o0lJ87k13Nr5L46k37J49
$$ 30 -207 -63 -114 -79 -82 -23 48 66 -120 332 -5 -206 -19 99 295 -11 -71 -74 113 -100 -95 -190 156 -81 68
1599F8oo9J6j48R8O9J92k55L0J21k00o8J92J04P1k27q6J54K9l68J83K82j12o0
$$ 68 62 -7 9 -139 -41 28 220 -35 -5 116 -84 -152 40 144 215 -12 -98 56 85 -283 -100 182 70 10
1623A0k5Q6j02R6l8n4o4L60M1k71j75P1k63J45N1J30mq6L8P3K29j32l75M14k70
$$ 10 -15 71 -31 65 27 -27 -91 269 310 39 -136 -65 -328 -183 -132 -2 -6 -92 -54 19 248 116 -259 155 -115
1648a15J28m2k12L35j11n8m8j4l0O0J25j1J59q9k9L1j69rq2K67m49N11jk2l17
$$ -115 13 -29 -241 94 -17 -75 -123 -137 -167 -107 18 7 166 77 48 79 -90 -99 -181 86 -363 148 147 125 -192
1673a92J28J31j95n8J96Q6M0M0j56N7l5lN7k1j84K70k42M3P6k7J39l28K36kmO5
$$ -192 -64 67 -128 -186 10 96 136 176 20 77 42 39 96 75 -109 161 -81 -38 38 11 150 -178 58 56 52 117
1699A17m3Rj46L7L6K05j17q7j96K49l28L03J61k45Q9j20q1K2L33k76O4k43K98
$$ 117 74 83 -63 -26 10 215 98 11 -185 64 -264 39 200 -45 44 -76 -157 -135 198 -78 -14 -257 41
1722D1J01l46J67J34J52l55L54m42K22K09k50J63m5J40k29j1j16k0Q4K75j48j5
$$ 41 142 -204 -37 97 249 -106 248 -194 28 237 -13 150 105 245 16 5 -111 -131 -47 228 80 65
1744F5k4j31J13K9J64L1l70K51k19p2K5J48j8l2jm2J94k28J27J42o2Q2k00J11
$$ 65 41 -90 23 52 216 247 -123 128 -91 -163 -138 10 -8 -40 -41 -83 111 -117 10 152 90 172 -28 83
1768H3j39J69q5L0o2J89k59P0j6O2j32J26jj28N2K82j59k02J08J05J05k10N7m4
$$ 83 -56 113 28 58 -4 185 -74 -4 -20 42 -90 36 35 -93 -41 241 82 -120 -12 93 198 -12 45 1
1792AM7K04k60j64K29J6r8j42K12p4q7L23l54J40J9J94k47J59k93L04k85K7J00
$$ 1 48 252 -8 -172 57 73 -25 -167 45 -29 -116 207 -147 -7 12 206 -41 118 -175 129 -156 -129 -29
1815b9k9J08n3p7J18L3l44M89j12J6j37J32j86J16P0l90M28j89Q5j67K34J20j62
$$ -29 -58 50 -3 -80 38 71 -273 216 104 120 -17 115 -71 45 115 -275 153 -36 49 -118 116 236 74
1838G4R5j52j22O5q7R9J8J47k58L4L38k76j5K58m44K21N6o8K61l5l46L78j66p8
$$ 74 169 17 -105 -40 -127 -28 -10 137 -121 -87 251 -25 -40 218 -226 -5 51 -17 244 209 -137 241 75 -3
1862cn1J00L05l82qk6R0l24L75k45J79j45J39J52m10M20k57j91M47k04K23j59
$$ -3 -54 46 351 -31 -39 -65 25 -299 76 -169 10 -135 4 156 -254 166 -91 -282 165 -39 184 25
1884B5N9k08M29m13j81K61J0p2q0J82K9k05P0J66r5k07K78j91J5L85j34j32k13
$$ 25 84 -124 305 -108 -289 -28 -18 -90 -170 12 41 -164 -94 72 -23 -230 48 -143 -128 257 123 -9 -222
1907b22L7M41n12L77l8j37l5K16j13J40m5j69J7K15j70j18K19lj43P1K8N3j33
$$ -222 -185 256 -256 121 83 -54 -89 127 14 154 109 -60 -43 172 2 -116 103 100 -43 28 56 109 -24
1930b4j22K86O8q8j26m9K17j56Q1j37J49j49j26J34O2R6o0r8o6J04R6j27J47k86
$$ -24 -146 140 208 120 -6 -55 162 6 87 -50 99 -50 -176 -42 20 116 56 -42 -108 -4 92 -35 112 -174
1954a74P8N6J1J9n3l2J6N3N6p2M7l1J97r7k9qj47J80J44k39Jj13Pj8K71K3J47
$$ -174 -96 -40 -29 -10 -63 -95 -79 -26 30 -42 5 -26 171 74 45 37 -110 70 214 -25 -24 -137 -130 -148 123 146 293
1981B93k31j22J35j18LJ30j33j11J91k29J66J14j80J40l8M3o6J07j58k8R7l3n1
$$ 293 62 -60 75 -43 -40 90 -43 -154 37 -192 -26 88 -92 48 10 53 -13 94 -64 -92 5 -28 -79
2004g9k2L2m0j7LK79j30oK3pp2R9j6j20j06L65j1k19N9O7J7k11J53N2k53Q8j69
$$ -79 -101 -69 -109 -126 -123 156 26 20 43 36 -36 63 47 -73 -179 186 175 -44 15 82 99 -112 41 93 -160 -72 -241
2031b41J91m2K26j40M2J30j74Q1l7j03l3J48n9j53M6J66Q3p8k19J05R0J32l17
$$ -241 -50 -92 134 -6 36 166 -8 73 36 -67 -100 48 -11 -164 -118 48 131 53 -166 -61 29 161 -156
2054a56k5M00r4l9k30j6J17r3J44m1j37J34J52P3j84l87O75o5l20j03L13k94L37
$$ -156 -181 219 125 86 -144 -160 -43 -136 8 -33 -170 -36 116 189 5 -382 293 228 -92 -195 118 -176 161
2077A61k90Q7j20L37j80k13L06K26m84k16K58nR0M35j49n34N72j05l76J02Q7K8
$$ 161 -129 -42 -162 175 -5 -218 88 314 -170 -386 -128 -133 -43 392 243 -291 281 176 -200 -98 -11 17
2099A7P5j45J8K43j68k50L46j96o9L13M3k71K45r6k48L75k69L26k53k01J74Lk22
$$ 17 92 -53 -35 208 40 -210 136 -60 -129 184 227 -44 201 105 -143 232 -37 289 36 -165 9 12 -210
2122b10P1P7J10J11k95L78j20k66l9L09o3P0m04K84j26j43M77l89J14j34J83k68
$$ -210 -139 -62 48 159 -136 242 122 -144 -183 126 63 133 -271 13 -113 -256 221 -168 -54 -188 -5 -273
2144b73J45M7L09k94j22J34L1J57%k90P3n1K88j62K22O6k83j15k38K71M71o32
$$ -273 -128 -81 228 -66 -188 -54 -23 134 134 -156 -83 -134 154 -8 214 280 -3 -118 -356 -85 386 -246
2166b46L40j26N7n7m6Q8p8K64r8l5q6o7J50l20L18j18q7k4J71L6o3n8J96j33j9
$$ -246 94 -32 25 -32 -78 10 -68 196 98 63 -23 -90 60 -260 58 -60 -147 -171 0 36 -27 -85 111 -22 -41
2191d1J76j15J61o8j35M1n7J44M6k64Q1K15k70K12Q5l67J96R6j36M2rj85O8N9
$$ -41 135 20 181 113 -22 19 -38 106 152 -112 -31 184 -86 126 211 -156 40 136 0 42 33 -152 -84 -25
2215b5K75k65l9J00j59O8k24N48k90j10j7K62m04K90o0P8K4J02j52M2pL5l5o5
$$ -25 250 -15 -54 46 -113 -45 -269 279 -11 -121 -138 124 -280 10 -50 28 52 154 2 44 37 72 37 -28
2239b8KR0j03j66J87%Q4j11J47N3o1r9k9k3k9j59M22j73J1j90J1J93j0OO3nj06
$$ -28 -26 64 -39 -205 -18 -18 66 -45 102 155 94 -5 -34 -57 -86 -245 177 4 15 -175 -164 29 19 25 88 83 -23
2266b3k6K7m7R3N1Kj96K36k34K01J2l73L82n1j04Lo8Q8o5J36mj05J34L5j37j40
$$ -23 -49 -22 -69 24 75 77 -119 117 -117 84 96 -277 105 54 -50 -47 -115 -27 -92 44 40 -65 69 104 -33 -173
2292a73K04Ll9O0k10L6n2rM18l8j25NO6j60k32J71j61L11oo2J52J07k79J68J48
$$ -173 31 34 -5 55 -155 -119 -171 -180 238 200 75 80 146 -14 -246 -75 -236 75 69 7 159 266 -13 155 303
2317C03m58K38ok01l9K05N5o7j18J73m9k4m64O09k4j24O0j0N0k14J54j54K71k08
$$ 303 -155 83 77 -124 -163 42 97 30 -88 85 36 12 -452 157 133 9 69 59 109 -105 49 -105 166 -42
2341d2k5r8J29J05j25j97M21l04J76j26J74j37Q1p6Q0l4j52K25j09M5J66j57k16
$$ -42 -67 -165 -36 69 -56 -253 168 -136 40 -86 88 -49 32 -44 36 2 -150 75 -34 11 177 20 -196
2364a96J96N3q8K2j23K87M3k86O5K65k65J27l44K51k52kK64j30L4n3L49l24N4
$$ -196 0 53 -35 -13 -136 151 194 -92 -27 238 -27 100 -244 7 -245 -247 17 -113 -79 -132 217 -107 -53
2387e3J31l2k56r2J79Q4Q5J00p1j15Q5j36K44j06j11j7o5J46O8Q0p2M9j07o0K2
$$ -53 78 46 -210 -302 -123 -39 46 146 75 -40 45 -91 153 47 -64 -81 -146 0 68 148 76 125 18 -42 -20
2412b0Ll2m0J67J58j89Q7k16J27R1m70N07k38J26q9pj75K41L1j68R7j44k0K34
$$ -20 -17 -49 -89 78 236 47 134 -82 45 136 -334 173 -65 61 -28 -35 -210 31 62 -106 -9 -153 -173 61
2436F1j33J17J42j80L0j92K86m50K90j8M3k19K22J06k11l5J25K4j48L02r4K1k5
$$ 61 -72 45 187 7 37 -155 131 -319 -29 -47 -4 -223 -1 105 -106 -141 -16 8 -140 162 68 89 64
2459F4r0k72M14l5k8P1j88Q8Q1l34K31N7k74K47N2k93J34K79k0k02j60p8N27l51
$$ 64 -26 -298 116 81 53 124 -64 24 105 -229 2 59 -215 32 84 -209 -75 204 184 -18 -178 -256 271 -80
2483h0j8L30m21J02K27j17n6K72k03k82R6J21j2J24k41M13l1m21Q6J76j20N2p7
$$ -80 -98 232 -189 -87 140 23 -33 239 36 -246 -150 -29 -41 83 -158 255 224 -197 -111 65 -55 -3 -80
2506h0J77n0k48K54j26K12k90J09L55m43J97m5q9J70m6R9j19o4j60L60k89P0O4
$$ -80 97 47 -201 53 -73 139 -151 -42 313 -130 67 22 -67 103 57 156 37 -27 -187 173 -116 -46 18
2529A8J04P1k87J18m9K19j80n6R6J1j09J1J3Q5J43m10L45q8J1k96J21J6r0K20
$$ 18 122 193 -94 24 -25 194 14 -42 54 65 -44 -33 -20 65 208 -202 143 55 66 -230 -109 -93 -183 37
2553C7k88M32j12k5j99N6J8J0j51Q2J22k39J91k9p3K4k4J03K21j63q7N5Q4j70
$$ 37 -251 181 69 44 -155 -99 -81 -71 -222 -140 -18 -257 -66 -95 -168 -144 -168 -65 156 -7 -94 -39 45 -125
2577a25L15m5j91J7R5J78m1k03J5N4l16J57k6jK66M8m30K55L0l30L30qk4n9R3
$$ -125 190 145 -46 -29 66 244 203 0 15 69 -247 -90 -116 -117 149 197 -233 22 52 -278 52 44 20 -39 54
2602E4Oj02o6K79l11J99j20o7P8r3K16R7m05J32L56j50l38K82k76J42N9l1k9K12
$$ 54 60 -42 -108 171 -140 59 -61 -128 -50 -143 73 170 -235 -103 253 103 -235 47 -229 -87 -28 -59 -88 124
2626A24r8j47N5n2J66J6P3l60K35K3M7L2n8k19J84J70j48P8P6j56l65K62K75j97
$$ 124 26 -121 -66 -118 48 64 137 -223 12 35 82 114 56 -163 21 191 43 121 197 41 -324 -62 213 16
2650A6PR5k28R4M2O7P2k13p1K95k25k5j18K29J54k69J20j05j03J04l1n6J62J07
$$ 16 23 118 -110 -16 26 93 165 -48 -119 176 -49 -74 -192 37 191 -78 42 -63 -166 -62 -93 -149 13 120
2674A20p0k81R3J32L1J58j93J04j14p4K17n1j50k8K4J05j09J90k28J85j74J91
$$ 120 50 -231 -138 -6 25 183 -10 94 -20 -94 123 72 -78 -106 -82 23 -86 104 -124 61 -113 78
2696G8J96j92j87J87K1p9j71K01k26k6J84J9n4j82J59n1j31K28j85J34O8o1Q1
$$ 78 274 82 -105 82 103 24 -147 54 -172 -198 -14 5 -49 -231 -72 -123 -254 -26 -211 -77 -9 -70 11
2719A1k03L16k43J78J85m07J94k5KM6p1O6k32J80j07O2J93q6j02K26k46o2n2K65
$$ 11 -192 124 -119 59 244 -163 31 6 8 54 -17 49 -183 -3 -110 -48 145 59 -43 183 -63 -125 -177 88
2743H8R0j37j32n8Q9k17K95L0M9r7o5j2J93j78J52j94qR7L0J8p8M5k0jp0R8K34
$$ 88 178 41 -91 -149 -60 -277 18 48 97 0 -65 -77 116 -62 90 -104 -112 -15 15 33 -45 0 -20 -21 -91 7 241
2770B41m21P6k50M20o6j33L50m9n5l02K11l1k2K85m54Q0J60j35K93O6j77l79M02
$$ 241 -180 -104 -354 66 0 -133 217 168 113 -189 22 -9 -31 254 -200 -120 40 -95 198 264 87 -292 110
2793A10m2Nl4n1m6L2m9N6K1k40K18l4K53j81Oj58j83L45k40L1J17J56l30M85l06
$$ 110 68 73 39 -12 -58 -26 -75 -19 2 -238 -20 -54 199 18 24 -134 -317 28 -212 -181 -64 92 -238 247 -59
2818e9j72K08p8J2J04J10j31L6K79m70Q6j63J78J40j06J45L1k13l0j20k9J88Q5
$$ -59 -231 -23 -101 -89 15 125 -6 30 309 -161 -75 -238 -60 80 -26 119 150 -63 -93 -213 -242 -54 31
2841C1J27k38K20K28n02K61m4k2p7J04K2k47K45j07j3j18P6N5K2mk04J58Q0J25
$$ 31 158 -80 140 368 -134 127 83 61 -16 88 110 -137 108 1 -12 -130 -54 1 23 19 -185 -27 53 178
2865A78P0k57J31J7k49M7j69J52p2K84M3l99m1P4L40k06K33M0j33p4l3k85J84
$$ 178 248 -9 122 139 -110 -63 -232 -80 -152 132 175 -224 -265 -191 149 -57 176 216 83 9 -24 -309 -125
2888a25J20Q0j46K4j07jO8O3K45l17K80j20j92J09J04j36N3jO8j10Q9k0j3P9k71
$$ -125 -5 75 -71 -47 -154 -155 -87 -24 221 -96 184 64 -128 -19 85 -51 2 1 69 -41 48 28 15 94 -177
2913a77QJ45Pjj2N0k96J67K21j21k2K13l04P8K37l80L83k18K5j6k69L06J93j88
$$ -177 -169 -24 -17 -18 -30 20 -276 -109 112 -9 -31 182 -122 -44 193 -187 196 -22 3 -13 -282 24 217 29
2937B9j65J64r2n4j04n4K13O3k42K15j97M08Kj52K0m4K0jMk26J41J66o7j0l06
$$ 29 -136 28 -64 -118 -222 -276 -63 0 -242 -27 -224 184 186 34 54 10 30 29 33 -193 -52 114 47 37 -269
2962b69J06O1k7J35k6K26j96J64l44K17r6O9MJ1j98L11j39lJ28l63J93p9K12j19
$$ -269 -163 -102 -129 6 -20 206 10 174 -170 47 -49 20 24 35 -163 148 9 6 134 -229 -36 -115 97 -22
2986b2K69k92K31m98J76L00o3l84M35P6k35j02J62j33P0QRn5J60LR8l88j9L42
$$ -22 247 -45 186 -312 -136 164 101 -283 152 228 -7 -109 53 -80 -10 -2 7 -48 112 115 213 -175 -194 148
3010A48k38K63Nk14J23j32j01J34o5R6l20M72k04M8n2L2QK27l27jr4k7J96j02
$$ 148 -90 173 178 -36 87 -45 -146 -12 -77 19 -301 171 -33 15 -37 -5 3 230 -97 -98 -192 -219 -23 -125
3034a25lM93m31j01M35k15J59P7m26J09Q8j32L32k34j67J91j27J91j78J28K4%
$$ -125 -128 365 -66 -167 268 53 212 289 -137 -28 60 -72 260 26 -141 50 -77 114 -64 64 88 88
3056H8j21J34o7j92K53j0r9Q9p4K50k11j18M15l62p2R5J95k48L4j28K31nj34r2
$$ 88 -33 101 34 -158 95 85 -14 75 1 251 40 -78 337 -25 -97 -2 193 -55 -21 -149 82 77 -57 -149
3080a49K92j58K5L2N1k04k7p5K80j37K18pl24L00O1j59J69m9k90M79l17J41j43
$$ -149 143 -15 10 42 93 -111 -138 -213 67 -70 148 141 -183 117 178 19 188 139 -151 328 11 152 9
3103IJ84j58p5N5N0j25n7P9O6n1mJ71l37M00l29QR1J9j69J16K06j72L09l19r8
$$ 9 193 35 -40 15 65 -60 -117 -38 28 -23 -27 144 -193 207 -122 -114 -23 -4 -173 -57 149 -23 286 -33 -131
3128a31J65K40j95j28J07k51K27Pj64mj27J69J43K9k31M3J20l8K6q0K76q4j91
$$ -131 34 274 79 -49 58 -193 34 41 -123 -127 -254 -85 58 87 -144 -101 19 -19 7 -73 203 119 -72
3151g2M9n0j8J81k43J05j05K95k21O7l7K01nj50J23p4k04R0q9M78l00rj8n4q5
$$ -72 -23 -73 -91 90 -153 -48 -153 142 -79 -12 -49 152 147 -3 120 46 -158 -68 -157 321 21 12 -6 -60 -145
3176a45Q8k4K02kk04m8J34R3k01J20k83L47Rl33L99k77K77j09p8N9K6M8j23r1
$$ -145 -57 -81 121 119 -85 -133 1 94 -107 13 -270 77 86 -247 152 -125 152 43 -35 24 50 98 -25 -116
3200a16Q3q6J24kKn1J67M7N4j72j5j95L58O3k67k1J09mP0l52L89k72L8J43l33
$$ -116 -33 -119 5 3 5 -46 121 168 222 50 35 -160 198 261 -6 -27 82 78 148 -204 185 -87 -49 94 -239
3225b39K50j28p1R9J78J90r2k95l2K58Ol30M0K20l5J09J11m30J70J99k05K74m26
$$ -239 11 -117 -188 -89 89 279 187 -108 -140 118 124 -206 -166 54 19 128 239 -191 -21 178 -27 247 -179
3248a79L47j93J33k50K32p0RLR5j37p6p3J5J95J09o5n3J19l99Q4L64k32K09l11
$$ -179 168 -25 108 -142 90 20 29 32 127 -10 -86 -159 -144 51 160 95 42 161 -238 -154 210 -22 187 -124
3272a24K20j00J73j94m5K1q4J81q8J5K9j24J07L26m19R0l0m6J14N7J23j7m71M30
$$ -124 96 -4 169 -25 -70 -49 -133 48 -40 -25 4 -120 -13 313 -106 -16 -46 -92 22 79 202 185 -286 144
3296A44J39j73k20J39j36K62j91K32k27n7n5J05p4r5K83q6J85n8k31J72M4J02
$$ 144 283 110 -110 29 -107 155 -36 196 -31 -88 -143 -38 -112 -207 76 -10 175 117 -114 58 102 204
3318B04k57J94k17mK3m7O0k5j19L59j44l63M38N0Lo2k31K01j97P7J11p2K23k50
$$ 204 -53 141 -76 -80 -57 -104 -44 -69 -188 171 27 -336 102 152 155 93 -138 63 -134 -57 54 -18 205 -45
3342d5L9N7J94Jk69q9L80k40k19k9M34n70M14K33l70j26K02P4j34K73j76J47P6
$$ -45 -6 51 245 246 -23 -112 268 28 -191 -220 214 -356 58 291 -79 -205 -3 71 -63 210 34 181 257
3365B57l62MJ19L0j34L0K66j89p9j2M6n9K6Q7O1k40M8J10M3J78k9j79J3r0R6j25
$$ 257 -105 -101 18 48 -86 -56 210 21 -58 -70 -24 -83 -57 30 91 -149 -101 9 52 230 201 22 35 -55 41 -84
3391h4K32j26J44l64L54k36J19q5j44J40r5K17JO2l03J41J8l8nJ93k41J55p9j20
$$ -84 148 22 166 -198 156 -80 39 -46 -190 -50 -145 72 73 135 -168 -27 -9 -47 -52 141 -100 55 -24 -144
3415a44K59N2j7K7k59M6Q1OK7q8J01j29J68N8L7l19M4K09m7j08Jq4J00j10J78
$$ -144 115 167 150 177 -82 -36 45 51 78 -10 91 -38 130 188 225 -94 -50 159 112 4 5 -79 21 -89 89
3440H9N1m18M28j87j8K26j49j05p8K18j58K34j34j50J08K94l17J01k28K97k75
$$ 89 140 -278 150 -37 -55 171 22 -83 -161 57 -101 133 -1 -151 -43 251 -66 35 -193 104 -171
3461a71q4L34r3j45K41L9J1k60k04L89l1K20k85n7R1K2j08K85j3r4J4J9j02N4
$$ -171 -255 79 -14 -159 82 121 132 -128 -332 57 26 246 -39 -96 -5 17 -91 194 181 87 101 120 18 72
3485G2k01L0K85j21Q5k08P9J41jo9j29J88m6m59M11p6J86l5k22m7L0Q1K63k12
$$ 72 -129 -99 186 65 150 -58 21 162 161 92 -37 151 105 -354 57 -19 167 132 -90 -137 -107 -26 237 25
3509B5p3K00j81k11L27r2k47K82j07K02lk9n2J40j75Q3J07l41M47j30m22J80K86
$$ 25 -48 152 -29 -240 87 -5 -252 30 -77 125 122 93 41 181 6 89 196 -145 302 172 -250 -70 216
3532B16o7j45J39k80O5J95n7k73K36N9j04J85R2k53J20j08K5k1J13l21K68L8K0
$$ 216 149 4 143 -137 -72 123 66 -207 29 88 -16 169 261 8 128 20 45 24 137 -184 84 122 142
3555A42k03K08O9j67q8R4j82O2J11j45J45l50M77k21R6j24o5o6J02K30K2J9j62
$$ 142 -61 147 216 49 -39 55 -127 -65 46 -99 46 -304 173 -48 48 -76 -141 -207 -105 125 147 166 4
3578Dj9M6J0R0p0lj55N1J55n1j3k14L32r7rm81L07R8k4J39q1K63k34J39l14J74
$$ 4 -15 31 41 131 61 58 -97 -46 109 58 45 -169 163 66 57 -424 -117 -19 -43 96 15 278 44 183 -131 43
3604D3j67K32M8l58K27QP9j35j41R4J51j95MJ1K73k85JJ93l38J33K03Jk31k33
$$ 43 -124 108 156 -202 25 33 112 -23 -164 -70 81 -114 -110 -99 174 -111 -110 83 -255 -122 81 82 -149 -382
3628c82L14l9L7k2J66j90K27m60K62K3k18L89m00K22P2Nj81K70j05l7o2J72o3
$$ -382 -68 -107 -70 -92 74 -116 111 -349 -87 -64 -282 107 -293 -71 1 6 -175 95 -10 -47 -109 63 0
3651@J9j6p8l8k6n5K63o4K2j01K7j00L76m37LJ13N9J62k45rM3J92j20l4Q1j06
$$ 0 19 3 -75 -113 -139 -194 69 5 27 -74 -47 -147 229 -208 -205 -92 -33 129 -116 -125 -82 110 -10 -44 37 -69
3677f9J7J8q2K47M9j85P0j83r3J70R0Q9l47J29K4Q3K37k20j83K29P0k54J61k24
$$ -69 -52 -34 -116 131 180 -5 65 -118 -211 -41 49 138 -209 -80 -56 27 264 44 -139 90 160 -94 67 -157
3701a57L04l38K09k9K5Qj48J65k38K06J5L36l96j74O1K01j37J3J04q4O2k4o9K8
$$ -157 147 -191 18 -11 14 22 -126 39 -199 7 22 358 -38 -212 -151 50 -87 -74 30 -54 8 -16 -85 -57
3725e7k19L18J45j71k10PM1K56P5l68L02k87K03j55J84K0k1j67R2P6j40R8l4m0
$$ -57 -276 42 187 16 -194 -187 -146 110 185 -183 119 -168 35 -120 64 84 63 -104 -12 64 -76 22 -12 -52
3749e2J10j05J31k21P9K82j55l61K69l8j19j4L26J24k49J8J83j95j43L77j10l
$$ -52 58 -47 84 -137 -58 224 69 -292 -23 -61 -180 -194 132 256 7 25 208 13 -130 247 137 134
3771A34j01J40j70M7k28LN29l59O6j71L35k61m2n9K38m2j63J60j14j7Q8k0J89
$$ 134 33 173 3 50 -178 -175 354 -5 61 -110 225 -36 -78 -137 101 59 -104 56 -58 -75 13 -7 182
3794A82k75K21p8kk27L9J54K8k12L61n5j85M7l65L86j25K8K38j95j38K28j42P6
$$ 182 -93 128 50 48 -179 -140 14 42 -170 191 136 -49 -2 -367 19 -106 -78 160 -35 -173 55 -87 -11
3817a1p8R6N4n2K0p3J45l19K70l30l9M19k8j44J09q2J88j17j73K89J18j67n0k36
$$ -11 -89 7 61 9 29 -44 101 -218 52 -278 -317 102 74 -70 39 -43 145 28 -145 144 262 95 45 -191
3841a91L64M6k83K06k48J62j10P9l3L4P7r9K2k18R8mJ4Q0JJ76l28j8J60L6p3J01
$$ -191 173 219 -64 142 -106 56 -54 25 -8 26 103 4 26 -192 -94 -98 -84 -4 -3 173 -155 -173 -13 23 -50 51
3867E1l3m4j11J94l41K24P7R3j64o3K07j30kJ40J19j07n3J25k69K30L2n9k6J03
$$ 51 18 -26 -137 57 -284 -60 17 110 -54 -117 90 -40 -42 98 217 110 57 182 -87 143 175 116 90 193
3891A93J63l75J43k2j49N1K28l28J25j35J64j9n1p4J7j3q9L96J4k13r8Q9n5q2
$$ 193 356 -19 124 102 -47 4 232 -96 29 -106 58 39 -12 -86 -69 -82 -171 225 239 26 -72 17 -38 -120
3915a20J10p3J41J3j06n8K03J07j63m8J16l87L1M10r6l1j42L40r5k60K67k39K15
$$ -120 -10 -83 58 71 -35 -93 110 217 54 6 122 -265 -234 176 80 49 -93 247 152 -108 159 -80 135
3938A35j72n6L65j55j32K34k84K29k55k9K51J90l21q8J22L2p3K34k68k26P8L5
$$ 135 -37 -93 272 117 -15 219 -65 164 -91 -120 131 321 0 -88 34 66 -7 227 -41 -267 -189 -154
3960a54j03L16r7J28l1j00L30L4l39N7j34K40j18j15O8J16o8k35K28J3j03k03
$$ -154 -257 59 -38 90 59 -41 289 323 -16 41 -93 147 29 -86 -18 98 30 -205 23 36 -67 -270
3982b70K50K76N7l92L02k13j35K48j50p8j63K26j54P7L72J64l49k24K00k00J40
$$ -270 -20 256 313 -79 223 10 -125 123 -27 -105 -268 -42 -196 -119 253 417 68 -156 44 -156 -16
4003a6kl6L65l13l52K38R6J36m6Pk40N0J22j88K87k30J79J1P0j48k4M1j50J27
$$ -16 -18 -54 311 -2 -354 -116 -20 116 70 77 -163 -113 9 -179 108 -122 57 68 138 -10 -34 7 -143 -16
4027a6n9K2J77R8j57k16J41J51j68J4l44M22j91J64j91J80J7J82j46m0j52L0j1
$$ -16 -75 -53 124 222 65 -151 -10 141 -27 -13 -357 65 -126 38 -153 27 44 226 80 40 -112 -82 -93
4050i3j59K58l39M60k58P2j3R5k05L2L55j91J33J83k41k42K56Jn1Lj63J7j1p9
$$ -93 -252 6 -333 127 -131 -59 -72 23 -182 -150 205 14 147 330 89 -153 103 104 53 56 -107 -90 -101 -180
4074a80J55J95k99l4J88k85L69r0j95J22J5J19J31l83K70Rn5kq4J08j60q9J82
$$ -180 -25 170 -129 -163 25 -260 109 19 -176 -54 -39 80 211 -172 98 107 52 50 -34 74 -86 -175 7
4097GK0n6m5P2K2R9k69M7p2M4N6J14J13p9o5k1k36L01J03N6k41j22k11N05j95
$$ 7 27 -29 -74 -2 20 119 -150 -103 -175 -131 -75 39 152 73 8 -13 -249 52 155 211 -30 -152 -363 142 -53
4122e3j28J13J25n3J4L0j17L2J54j08j82J88j53J39j91K01LP1k2k98Q7J90K58
$$ -53 -181 -68 57 4 18 48 -69 -37 117 9 -173 15 -138 1 -190 11 14 85 63 -235 -148 42 300
4145C00j36j84nj27M4j29K16R9p5k8O3K6J52j09j90K06k98K19j01o9N0L19k40
$$ 300 164 -20 -25 -152 -108 -237 -21 78 3 -25 38 64 216 107 -83 123 -175 44 -57 -126 -76 243 3
4168CK74k83p0L8L9J97j99J4j0L9l0K7k9J63k65M1J43J18k38k7k04L90k58Q2j5
$$ 3 277 -6 -76 -38 1 198 -1 13 3 42 12 39 10 173 -92 -51 92 210 -28 -55 -259 131 -127 -45 -60
4193f0m9R2J50o7J65n90L26j1N6l5J05k87O6l7M06r4j79L4n3N4L8J08l12L79j52
$$ -60 -109 -17 133 66 231 -359 -33 -44 12 -23 82 -205 -139 -176 230 136 -43 -9 -62 -8 30 138 -174 205 53
4218E3n5o7q8J52j62Q7J82j85K53M4Q2l64J28L4k7j05R5q2Q0j3j5r1j21J65j98
$$ 53 -2 -69 -157 -5 -167 -80 102 -83 170 214 296 -68 60 94 67 -38 57 -25 55 42 27 -64 -185 -20 -218
4243b18J06K4Q7j10J3J21j1j36K51j64M3p9P8j6K0j45K14j39J86j82k20J64j1
$$ -218 -112 -88 -1 -111 -98 23 12 -124 127 -37 6 -73 5 -11 9 -136 78 -61 125 -57 -277 -113 -124
4266a24o5J35J54j8j25J52k12L07k12j35J41j37J41j21J25J17j20n2QJ5j95L13
$$ -124 -189 -54 100 82 -43 109 -103 204 -8 -143 -2 -139 2 -119 6 123 3 -49 -41 -26 -221 92
4288I2J59l78J30j3OJ02J77l03L56l76J65R4j25o4j20o5L18l17N2L4j31J95j44
$$ 92 251 -127 3 -10 -4 98 275 -28 328 -48 117 211 86 22 -98 -163 155 -162 -110 -76 -207 -12 -156
4311a56Q2J26j28j09M25j91m9l08L84n2k78M39j13k68L8n2L47k43j2J77p8k62
$$ -156 -74 52 -76 -185 240 49 0 -308 76 24 -254 185 72 -196 -158 -210 137 -106 -118 59 -19 -281
4333b81J41Q3m9R0m5Q7J92j87K0J41q6R5r5l0r3P7j11r1J91Q4k39K06l11K96N3
$$ -281 -140 -57 -106 -16 -61 26 218 31 51 192 106 201 106 76 -17 60 -51 -142 49 133 -106 100 -211 85 138
4358A38r9l05K81k37K40N6j15K14r7N8k08K83l80K85k49J6K55k72j1J43K56l09
$$ 138 39 -266 15 -222 18 74 -41 173 76 134 -74 209 -171 114 -135 -119 136 -136 -147 -4 252 -57
4380e7J51k53L69l33J61l59K39J38m9l8p8L10l3m36J20m4K10j70n5L16p7j17j95
$$ -57 94 -159 210 -123 38 -321 -82 56 7 -31 -109 201 168 -268 -148 -192 18 -152 -207 109 32 -85 -280
4403b80L13n2Q9K7j68K13j92J44o6l7J79n0j2j49j41k2L16j86J77j4K71k50j50
$$ -280 33 -19 70 97 -71 142 -50 94 28 -9 170 120 108 -41 -182 -204 112 -74 103 89 360 110 -40
4426d0P3j45m3n9L9P3L3j33J34Q5R3p7j30J63m5K1j20m2L5R7Q8j44J9l28L18J8
$$ -40 33 -112 -155 -214 -175 -102 -69 -202 -68 17 110 33 -97 66 21 42 -78 -120 -85 12 100 -44 -25 -353 -35 -17
4452a7L3j02R5J19J35k66L54k47k09J93J22j12n4O5j90K76k75N7N2qP7p8J07n9
$$ -17 16 -86 9 128 263 -3 351 104 -105 88 210 98 44 109 -81 195 -80 -23 29 21 98 20 127 68
4476F8J59k69P9M0m3j10R8J48k30J55p4o2K08m06L49k23pp4K79l06K99k5k59L20
$$ 68 227 -42 37 77 34 -76 22 170 -60 95 21 -41 167 -239 110 -113 -120 -194 85 -221 78 53 -206 114
4500A14l76P3K23J03m4K2j41l7N6P5j59K52j37l3j17K71k1k2j15K9K25k66J10
$$ 114 -262 -189 34 137 93 115 -26 -63 -7 68 -91 161 24 -9 -126 145 124 102 -13 16 241 -25 85
4523H5J2m8l35J8J97M04k24j43j82J4K51j73J79m22N52j60k25J7K02L6n2q0mP7
$$ 85 97 49 -286 -268 -71 333 109 -34 -216 -202 49 -124 55 -367 185 25 -200 -183 19 55 3 -77 -81 -4
4547dm8k09M22j50K52j96K0j32m6K57j08k16J81Q6k19J05k66M55k63j10K17j51
$$ -4 -52 -261 161 11 263 67 87 -45 -91 166 58 -158 23 109 -110 -5 -271 184 -79 -189 28 -123
4569a23K90j92m4O9J33j36m7pO6j66K07j14k33K47K93k03j01P8j18J36RJ21k10
$$ -123 167 -25 -69 0 133 -3 -50 -57 9 -157 50 -64 -297 -50 243 40 -61 17 -101 35 44 165 -45
4592d5nJ13q7M2j47p9Q9L5P7J55l54J40K5J65j68m7J65j43M9J20q0k62L97j56
$$ -45 -50 63 -24 18 -129 -208 -119 -84 -7 148 -206 -66 -41 124 -44 -91 74 -69 -20 100 20 -242 155 -1
4616aJ09J8j35m8J1k81N93l88j1L41k40J37j63K21k82J38Kk22K56J00M2J06l34
$$ -1 108 126 -9 -57 -46 -327 266 -122 -133 208 -32 105 -58 163 -119 19 21 -201 55 155 197 303 -31
4639c1k59J76O3J54k61J79J16l76K39p5J75j65J31L7k03L5l3K60l21k8M42j89
$$ -31 -290 -114 -51 103 -158 21 137 -239 0 -75 100 -65 66 103 -100 -65 -98 162 -159 -187 255 66
4661F6k40J58L16k37k3L10l35M3J58o3r0Q2j43m5J68j07j86K0J36J54k65O0J12
$$ 66 -174 -16 300 63 40 350 15 58 216 153 63 145 2 -43 125 18 -168 -148 -12 142 -123 -63 49
4684D9k00M26l36j8J94o3K58k27j63n4J17j44K36j55J16P8J03j88Q6j99J94k52
$$ 49 -151 275 -61 -79 115 52 310 83 -80 -134 -17 -161 75 -80 36 114 217 29 115 -84 110 -142
4706a42R0P7Lq0J52k11k03M17l15K04Q7j88j4K55J8k58J37R6J06k21pn0O1J4K9
$$ -142 -52 25 28 -52 100 -111 -314 103 -212 -8 79 -109 -123 132 150 -108 29 125 231 10 3 -47 14 28 57
4731E7L3J20j30j16J09p2L5j17k0J8J48p0O5R3j96q4kJ72kk06J26L08l15j19Q7
$$ 57 90 210 80 -36 73 1 36 -81 -101 -83 65 -5 60 153 -43 -127 -129 43 41 -165 -39 269 -46 -165 -78
4756g8K05j64rk01M38p6M7k35J64l37K66j3k00M3J03K8j46K30k5q5j54J23j47
$$ -78 127 -37 -46 -247 191 115 162 -73 91 -246 20 7 -193 -150 -47 -19 -165 65 40 -45 -199 -76 -223
4779b23K60p9k1KJ43k69K91J8o8l1o5L6m9j4J38k00k0K77o1k61j9Q5J50Q1l4j02
$$ -223 37 -42 -63 -61 82 -187 104 122 54 23 -42 -6 -55 -69 69 -131 -151 126 65 -196 -215 -130 20 101 67 -35
4805c5J06j42K46j83q3K08m08m8L72K3J26j64kj20J82j08Ml6J45l08Q6K44n3J4
$$ -35 71 -71 175 -8 -91 117 -291 -339 33 56 182 18 16 -104 78 -30 -26 -62 83 -225 -139 105 52 66
4829F6J27p9j93L85j64j37j56J48J13J7q6J8L1K85m21J4m4N7j80K22p4J37q5n4
$$ 66 193 114 -79 306 142 5 -151 -3 110 127 41 59 90 375 -46 -32 -76 -19 -199 23 -51 86 1 -53
4853e3J00J2l3M1O9m35L34N7k36J77k70K16j10J95K11l09Q0j1j13M3K34j12k71
$$ -53 47 59 26 67 136 -299 35 92 -144 33 -237 -21 -131 64 275 -34 46 35 -78 -35 199 87 -184
4876a84K42k8j49J02k4m1J41m4k27L30m07L34J34N5k27j52J81k7k52M38n75M33
$$ -184 58 30 -119 -17 -41 -82 59 15 -212 118 -289 45 179 234 7 -145 36 9 -243 195 -380 53
4898E3k48L48l14p3L90l39K91Qm0R0l47O8j17L77j00j8k52L97j24J68l38j1R1
$$ 53 -195 153 -161 -234 156 -183 108 116 76 166 -181 -113 -230 147 47 29 -223 174 50 218 -120 -131 -40
4921d0K26q9l06J55R5k91N8M23m19J95o1J22j96J79r3o8L69Jk71Q4j40R1K10l50
$$ -40 186 97 -209 -54 41 -250 -192 231 -188 7 -54 68 -128 51 -42 -110 259 260 -11 73 -67 24 234 -116
4945a16qK20l01Q6K71j55P9k25n5L50l11N4q3J04K42j21j17m0K24M9l67M88l68
$$ -116 -124 96 -205 -119 152 -3 76 -149 -204 146 -165 -111 -194 -90 152 31 -86 -126 98 147 -220 268 -100
4968a00l7J56n0N4j69J95J19j46L3M9l06P4J04O1J15k17k80J65J47Q1k89K68k99
$$ -100 -137 19 -31 23 -146 49 168 22 55 104 -202 -128 -24 37 152 -65 -345 -180 -33 48 -241 27 -272
4991b72K32O4k38K01Q6j52O0m8Q2K53l32J60l13K88Q7L7l06j02K82o1k6Q6K6j51
$$ -272 -40 24 -214 -13 73 -79 -19 -67 15 268 -64 96 -217 71 158 195 -111 -213 69 8 -18 68 94 -57
5015e7J24M37n27J64K2k75J71P9j49K7L5P3j90j3K06r1j1j54M26k87k21L36j44
$$ -57 67 504 -23 141 163 -112 59 138 -11 16 51 124 -66 -79 127 36 25 -129 297 10 -211 125 -19
5038a9%n0L9j0q9J07J17j89J5K06L8r2l0K5m57M62J34k81l7L2J54k13J07q7L78
$$ -19 -19 -69 -30 -40 -129 -22 95 -94 -79 127 165 73 43 68 -389 73 207 -74 -111 -79 75 -138 -31 -118 260
5063B60m79K90j69K08k13J23j84L%J67K3p5L7p1r8Q5J78m1J26j13m2l6n4J6l53
$$ 260 -219 71 -98 110 -103 20 -164 -161 -161 6 29 -46 -9 -80 -178 -93 85 44 170 57 15 -21 -75 -59 -412
5088d12J71K39l78K90J41Q1l55L78k60J38j8Qj82n5L52n5m07L16K37J7k88j42
$$ -412 -241 -2 -380 -90 51 132 -223 155 -105 33 15 23 -159 -214 138 83 -324 -8 229 246 -42 -184
5110a84J82N2Nk26M01j99P3j58j1M5J51k48J51J08J7r7Q6m6j25L3o1j78J39J92
$$ -184 -2 50 55 -171 230 31 104 -54 -65 -20 131 -117 34 142 159 62 148 102 -23 10 -51 -229 -90 102
5134A02Kp3o0j3P7j41J91l6j61o3j9j7L41k58N0r3L25j65%J0rjP8j49j22M57l92
$$ 102 104 31 -29 -42 35 -106 85 49 -112 -175 -194 -211 130 -128 -78 -171 154 -11 -11 -1 -10 -11 67 -82 -204 253 -139
5161a39L29k93k9K38k08J31j70J25k61K63R9j56J03j04p2M58k44n6q0j97K04j16
$$ -139 190 -103 -132 106 -102 29 -141 -16 -277 -14 85 -71 32 -72 -144 314 70 14 -66 -263 -59 -175
5183a75J89j93N6O8J05j11m6K41j90j36j9NL39o3j2k34l2L3L4J02J03R7j01k6
$$ -175 14 -179 -123 -55 50 -61 -107 134 -56 -192 -211 -206 133 70 58 -176 -208 -175 -141 -39 64 161 60 34
5207C4Q2k93K94P7l08L21k51J33k87L64n3j03P6J96l57K7K32k03j30L83o6l45
$$ 34 116 -177 117 194 -114 207 -44 89 -198 166 113 10 86 282 -75 -48 184 -19 -149 234 168 -177
5229a77K58P7j45r1J75K21l03k1J02j08o8j06J81J60m65J88J0p1K58j0j60K77
$$ -177 81 158 13 -78 97 318 15 -6 96 -12 -80 -186 -5 155 -310 -122 -112 -183 75 65 -95 182
5251A82k36J28k38J48J00j14K73r0r3j61K39j53M9N3j40K47j15q8r1K13m9O8j57
$$ 182 -54 74 -164 -16 84 -30 243 153 60 -101 138 -15 34 87 -53 194 79 -9 -100 113 64 132 -25
5274b5nK7n9J03J08j96k30J72J47m0l3l5M0O5J3J59J25l9k17l00J75PQ6Lj53L2
$$ -25 -30 -3 -62 41 149 -47 -277 -105 42 2 -31 -66 -26 39 52 211 336 297 80 -220 -45 -38 48 51 -102 -70
5300g0J08kk6J05j53k8K43j02k67K54j22M5Q3J48k78K61j74J01l93K51q8M9J24
$$ -70 38 36 10 115 -38 -66 177 75 -192 62 -60 -15 68 216 -62 199 25 126 -267 -16 -104 -55 69
5323F9J57j51K6L0k2O0j74J16n5N4q0M5N0k03j07J92j47L66j46j9L6l3l04J54
$$ 69 226 75 101 131 109 169 -5 111 56 110 30 75 125 -78 -185 7 -140 226 80 61 97 64 -240 -86
5347h6K8k%Q7K7J90l38j04K68k24q5J34K77k24j54K8K18J6q9K12k07J26r0J60
$$ -86 -58 -60 -60 27 54 244 -94 -198 70 -154 -239 -105 172 -52 -206 -178 40 56 -33 179 -28 98 8 168
5371A68n05K26J46p5J70k13J74k20K23j05P6j38o2R7k15L88q0j23m3P7J08n5k11
$$ 168 -337 -111 35 -40 130 -83 91 -129 94 -11 65 -73 -135 -38 -253 135 55 -68 -111 -34 74 19 -192
5394a92J90n1K30j10L1j69j6J46j46%M3j10N2M4J21o1k08K17K11j81j24k1J89
$$ -192 -2 -53 177 67 98 -71 -87 59 -87 -87 -44 -154 -102 -58 63 2 -206 11 222 41 -83 -104 85
5417H5j37J56k20J85j11J4j39L32J35m15M9Mr2K6R2N6M2l22K53k18J63L08k52
$$ 85 -52 104 -116 69 -42 -28 -167 165 300 -115 -66 -62 -154 -128 -36 20 62 -260 -7 -225 -62 246 -6
5440fj69nM9n2J01L9J36k65L27k5j99M2j26l0L85k18j9j31K63L3O7k25J22j07
$$ -6 -175 -180 -131 -183 -82 -43 93 -172 155 130 -69 -27 -153 -183 202 -16 -35 -166 97 130 197 -28 94 -13
5464a3j1J04k19J05m9J4J92mP2n78J28N05n26K12O6K61j54j25j66K07M2p8q4R3
$$ -13 -24 80 -139 -34 -83 -69 123 119 191 -387 -259 246 -280 -68 -2 259 105 -20 -186 21 63 -15 -99 -6
5488fK1r3J97k36R3J20r1L54l77J92k28j65K97l6jk93K29R7j89K5Q7J39k55M32
$$ -6 15 -78 119 -117 -24 96 5 359 -18 174 -54 -219 78 42 41 -252 -23 74 -115 -90 -3 136 -119 313
5512C13l56k4k6J31J58j44ko7K41l38Q5K4J19j99J87rj97q3J24Q8j42J43q6L5
$$ 313 -43 -67 -93 38 196 52 50 -17 224 -114 -29 -5 114 -85 102 93 -104 -187 -63 25 -117 26 -60 -25
5536b5NMR6p6l0K78k99J50k05j79K79o4p2J05J69N9m37K87j06m3O5J20k26J55
$$ -25 -20 -16 80 4 -26 252 -47 103 -102 -281 -2 -66 -138 -33 136 195 -242 45 -61 -104 -39 81 -145 10
5560A0J07l1m8k35J9K55j77J50j04J1O6K76r7O5k69K9o6k1LM5J44m2j54k4L83
$$ 10 117 86 38 -197 -178 77 -100 50 -54 -43 23 299 202 267 -2 27 -39 -60 -57 -12 132 90 -64 -88 295
5585B95j2k89J03j64L86k69o4O1M4j95J28K69K6l68K0j5J21P5Mk7j34K28j81N0
$$ 295 283 -6 97 -67 319 50 -14 47 91 -104 24 293 319 -49 -29 -44 77 152 156 129 -5 223 42 92
5609I2j68J12j43m9K23j48K1J0L44m14P4n9K67r1J34k78k8N40m09k26L06j0j09
$$ 92 -76 36 -107 -156 67 -81 -60 -50 294 -120 -46 -105 162 71 205 -73 -101 439 30 -196 110 100 -9
5632iJ23j20k6L30p4k64K32k0k50N18m78R3k68K32j61L44k01m1M47m29P0k7O3
$$ -9 114 -6 -32 298 224 -40 192 172 -78 440 -38 55 -213 19 -142 202 1 -40 407 -22 48 21 84
5655H4j55k19L09K3k3k18K30P4j25k23L40l95L65J10m3j65p9J13K86l16j80P7
$$ 84 -71 -290 19 42 19 -199 31 105 -20 -243 97 -298 67 177 134 -31 -110 3 289 -27 -207 -130
5677a30K66P7j37j31j13J11o1L66l51J68J48k55j87L24l05O5K04l77N46m45PM47
$$ -130 136 213 76 -55 -168 -57 -118 248 -103 65 213 -42 -229 95 -210 -145 59 -318 228 -217 -210 237
5699B37j46o2o4J82j30k05Q4K60n75M92P8l11N2J65j14L8k46L95k14j43K59P7
$$ 237 91 29 -35 147 17 -188 -104 156 -419 73 151 -160 -108 57 -57 -19 -265 130 -84 -227 32 109
5721A09J3j42p2J70n5p8O2J37j59J93k47j4p1K54K26k06k28J97O2M1o3r0j18N7
$$ 109 122 -20 -92 78 23 -55 7 144 -15 178 -69 -83 -154 100 326 120 -108 89 151 192 129 39 -79 -22
5745b2l0l2r6L0K30J20j12k13K17q0Nj71K88j34J43j46j11k54L85K3Q3k05k98
$$ -22 -52 -84 -180 -150 80 200 88 -125 92 12 17 -154 134 0 143 -3 -114 -368 17 40 123 -82 -380
5768c80L62J18j06J42p9ok2l5J70k38L8R4L7r7J75j70Mk35J26J03p8J6K1j4j3
$$ -380 -18 100 -6 136 57 51 29 -6 164 -74 -36 58 95 -2 173 3 7 -228 -102 1 -77 -61 -40 -54 -67
5793f7o7J24j02M6n0J33j5j09L62m49L96q2O8M2l94R6J69P5l81J10lK10j56j06
$$ -67 -134 -10 -112 -66 -116 17 2 -107 255 -194 202 120 188 230 -164 -68 101 176 -205 -95 -98 112 -44 -150
5817a50J52J20N3l71q0L56q5N3k43K12k8j0L03k04j89J82l9j4J93l83J86L0L3
$$ -150 2 122 175 -196 -276 80 -5 48 -195 17 -11 -21 282 78 -111 71 32 18 211 -172 14 44 77
5840G7J24k78K67l89N21j87L1j9j84j58J88J18q3j15j1O3R2J9J48n7j52o6r4J05
$$ 77 201 -77 190 -199 322 135 166 147 -37 -195 -7 111 28 -87 -98 -35 57 76 224 167 15 -51 -145 -40
5864d0J13J37l32R0q2J76j75J18M9Nk23J42K6J8n2l7M9m2j67J79j44L3J72m2o
$$ -40 73 210 -122 -32 -114 62 -113 5 54 59 -164 -22 4 22 -30 -67 -18 -60 -227 -48 -192 -159 13 -29 -35
5889c5j99K18j04K25j66q0J84j60P7po3l6J26k1k30K92j67O0M8m9N9k1N3Oo4j59
$$ -35 -234 -16 -120 105 -61 -141 43 -117 -40 -47 -110 -146 -20 -41 -271 21 -146 -86 -38 -87 -28 -49 4 10 -54 -213
5915b13R0P0p7J38J58l68L46k57J00J66k44O1j26K28mJ61K4j79PO9j26J96k33
$$ -213 -123 -53 -130 8 166 -202 144 -113 -13 153 -91 -30 -156 72 68 229 253 74 81 150 24 220 -13
5938a3%L06n67K37J24n1J45p7m3L2k61J42P1J10j72J0k6J46q6P8M7l23M60j71
$$ -13 -13 293 -274 -37 87 36 181 104 61 93 -168 -26 45 155 -17 -7 -33 113 27 105 152 -171 289 118
5962A18m58N09k84J21J63j03J84j64k0N6k44R7J50k84J60J02j37J19j70K09j22
$$ 118 -340 169 -115 6 169 66 250 86 66 122 -122 -25 125 -159 1 103 -34 85 -85 124 2
5983BJ04l60J49M09k05j24o0K45j34j9M56n72K19J86j54l04O6k2K83l04J48J18
$$ 2 106 -254 -105 304 99 -25 -85 160 26 7 463 -109 110 296 142 -162 -96 -118 165 -139 9 127
6005A27Rl75Q0R7J77J66m05N6o0K00r8r2K74j17j55J08M9K4r3PJ26j30J78n3O0
$$ 127 136 -239 -159 -62 115 281 -124 -68 -128 72 -26 -118 156 39 -116 -8 41 65 -28 -21 105 -25 153 100 160
6030A60l0r6kj4k09L08Nj35J17j3j58m1L29j63k72K85k2k47J61q3K27k4r8rk1
$$ 160 130 34 32 18 -191 117 122 -13 104 91 -67 -108 221 58 -214 71 49 -198 -37 -120 107 83 -15 -24 -45
6055d5m7K30rj90k19M33m63M04j34j1p2J56J72m51M43j15j02q3J62m2K02k19q5
$$ -45 -92 138 129 -61 -280 153 -310 94 -40 -51 -123 33 205 -246 197 82 -20 -103 59 17 219 0 -85
6078h5K18m07O2L42k44j4J1J87o1Q7J2j29P5p7oj17L08k73P6R3rJ27j50Q2l12
$$ -85 133 -274 -212 130 -114 -128 -117 70 9 96 108 -21 54 -23 -29 -146 162 -111 -35 58 49 176 26 108 -204
6103b04L26m04K63l8K20l85J09l7J17j36L09q6k41K93k08J23O6j20J84rj78J24
$$ -204 122 -282 -19 -57 163 -222 -113 -150 -33 -169 140 54 -187 106 -102 21 87 -33 151 142 -36 88
6125H8n6j52K31q6M3k33J41J37k36J43j81L43oj60p4L1J53j8l10J70J05QN5o1
$$ 88 32 -120 111 25 68 -165 -24 113 -123 20 -161 182 176 16 -58 -27 126 108 -202 -32 73 81 136 75
6149G5j11j09K54r5L3J45j15k92K71m4Rj59J53j4j27K6k29K86ko0LJ81j25J77
$$ 75 -36 -145 109 14 47 192 77 -215 56 12 21 -138 15 1 -126 -100 -329 -43 -45 -105 -102 79 -46 131
6173A31j96J6n2J72j14J1j39L75k09k05J55m9n0K11K83k70k41J51k11K32L1k31
$$ 131 -65 -49 -101 71 -43 -32 -171 204 -5 -210 -55 -104 -154 57 340 70 -171 -20 -231 1 32 -199
6195a99J40J75m30N30l26k00M90k26J32p2J03j77mJ55j85n7M3OJ33J01j90R1k6
$$ -199 -59 116 -314 216 -110 -310 180 -46 86 14 117 -60 -64 91 -94 -151 -108 -102 31 132 -58 33 7
6218Gq6J38K07o7j71k14j3J51J6J75j58l3j2L78o0k24M5j84J4N2k33M21N0k29
$$ 7 -79 59 266 199 28 -186 -199 -48 -32 143 -15 -48 -60 318 258 34 79 -105 -91 -39 -272 149 199 -30
6242c0o3K12n2o4n0J25n1p0Mo2J01j03J82L3k53Q5k1Q5lj59K69j20l6J62k76K04
$$ -30 -93 119 67 3 -47 78 27 -43 -39 -101 0 -103 79 112 -141 -56 -77 8 5 -154 115 -5 -41 121 -155 49
6268D9o7L26K8N3m9Kk54j9m1l06Q8J67j30K12l9o5K05m9k37n2K17N2p5L37k67
$$ 49 -18 308 336 389 340 342 88 69 28 -278 -190 -23 -153 59 20 -45 160 111 -126 -178 39 91 16 353 86
6293H6j91J81M9q0J56jk83J9K40l5j68j07n3L09j22p9P0K06l70J18KQ3n0J6j55
$$ 86 -105 76 125 45 201 200 -83 -64 176 141 -27 -134 -187 122 0 -79 -9 197 -173 -55 -53 30 -20 -4 -159
6318a59k5k5K99j95Q4j20K4J4k6R6J90m72N85k55j62J59j8j25M4L33n76J19K41
$$ -159 -184 -209 90 -105 -21 -141 -117 -103 -129 -33 157 -315 270 15 -147 12 -6 -131 -87 246 -330 -211 30
6341C0rj89Q6J59j16j10O8O3OK1J34k40J87J1q9J11p2j26J44j13O6j44P4M8K11
$$ 30 21 -168 -82 77 -39 -149 -81 -18 -12 9 143 -97 90 101 12 123 51 -75 69 -44 22 -122 -48 0 211
6366B11Qk05j10J96j51j10J92N6l47K54j73m4J71K0r2M4m4R5N9J03l51k3M8q5
$$ 211 219 14 -96 100 -51 -161 31 87 -260 -6 -179 -223 -52 -32 -124 -80 -124 -29 30 133 -218 -241 -193 -278
6390b78N5J10pJ5j96K14L34k27n1J53k58K8L05J1n26M0L09J12j60k7o5J44Jm18
$$ -278 -223 -113 -120 -105 -301 -87 247 20 -31 122 -136 -108 197 208 -318 -278 31 143 -17 -44 -109 35 36 -382
6414c82L77J2K59k78m1L29l45jK6L31N5k92r0J67J22l19N2J09j7j45J3rM9k0K0
$$ -382 -5 7 266 -12 -53 276 -69 -70 -44 287 342 50 -40 127 249 -70 -18 91 74 -71 -58 -67 -18 -38 -18
6439a8J21k72J56Q8P4P4l23L9r3J89j66K53K1K23m36R9J45j24J95j42m41K89K14
$$ -18 103 -169 -13 75 149 223 -100 -61 -154 35 -131 122 143 366 -70 29 174 50 245 103 -338 -49 165
6462A65k74K69L7j50j21K18l51K05l8K75m55K64p4j74K36k58Q1kJ69j48K43l40
$$ 165 -109 160 197 47 -74 144 -207 -2 -40 235 -220 44 -30 -204 32 -226 -145 -147 22 -126 117 -223
6484b23J43O1K5o8J78l53N9J19j55L06p7j22R6M6k1n4M7l8J26r3J73l2O8O5Ok61
$$ -223 -80 -19 6 -62 116 -237 -178 -59 -214 92 15 -107 -11 35 14 -40 7 -31 95 2 175 143 211 276 282 21
6510B1l9K9R0kr5J16r5o4Lk0P8J26k43J10q4jj20j19K88j9M5O7R8l37K29k1m7
$$ 21 -18 11 101 99 4 120 25 -39 -36 -56 22 148 -95 15 -69 -70 -190 -309 -21 -40 5 72 170 -167 62 41 -6
6537fj34OJ59R9j66J04j77J4J01K36k10j70m8J67J76k13K67Nl66K14j56Q63j173
$$ -6 -140 -134 25 124 -42 62 -115 -101 0 236 26 -144 -192 -25 151 -62 205 210 -156 58 -98 765 -408
6560d08n00J091N04j372P19N60n87J76q99P31k09O10m39L73j2q28P39J8m46N27
$$ -408 -908 183 687 -685 34 594 7 183 -716 15 -194 416 -23 350 338 -490 249 267 -179 348
6580C48r00J215l84m50M34m13p28O59J55M68m74M96m93n7J01L70j57k19J24K63
$$ 348 -552 663 279 -171 263 -150 -878 -219 -64 404 -70 426 -67 -124 -23 347 190 -29 95 358
6600C58O4r18P49K62k94m20K68K91m52J75j34M32k69k58K13j82N05k55k92j1J0
$$ 358 422 -496 253 515 221 -199 69 360 -92 83 -51 381 112 -146 67 -115 390 135 -157 -168 -158
6621a58P9J06l14M94k52K36J24j58j3m87N00m1l02J18J49J45j72n5K2p3l3j21
$$ -158 -79 27 -287 207 -45 191 315 157 144 -343 157 116 -186 -68 81 226 54 -1 21 -52 -85 -206
6643b06J91qk0m3O2J43k29L21p9j00J84k93q2J97J18k50J06J92j04n1M5l8o2j0
$$ -206 -15 -23 -43 -86 -24 119 -110 211 132 32 216 -77 -159 38 156 -94 12 204 100 49 94 56 -6 -16
6667a6q6L22j86r6J06j63J75Mj1R2k7k50M0J58n1L0j24o2rO1K16k75K69J62k07
$$ -16 -102 220 34 -62 44 -119 56 60 49 141 114 -136 -96 62 11 41 -83 -145 -154 -93 123 -152 117 279 72
6692G2j83J30lN5k13R9J34j7k4K1o7MK40j41j80K3J2J16O5J8k52r2K80j86K40
$$ 72 -111 19 16 71 -142 -43 91 74 50 71 4 8 248 107 -73 -50 -38 78 143 161 -91 -183 97 -89 151
6717A51j66J75j91M9J53j28K05o29L53NJ68k82j32J17L52k71J54J32o2l60L30
$$ 151 -15 160 -31 18 171 43 248 -381 -28 -23 145 -137 -269 -152 200 -71 83 215 153 -207 123
6738A23j47j99J91L1J39j99R2J22o8J32l32J96k83K14j14J29J95L4k15J06l54
$$ 123 -24 -223 -32 -1 138 -61 31 153 85 217 -115 81 -202 12 -102 27 222 256 41 147 -207
6759b07K86l9j66K61k23K32j99j34K19Q1k86J92l5J26j42p2J94ol8j86J69K2J8
$$ -207 79 40 -126 135 -88 144 -55 -189 30 111 -175 17 -18 108 -34 -106 88 82 44 -142 27 49 67
6782F7k81L21J75j80oj21J62l92J21J1K49l34K57l8J13k2q7p8J34k42P5J82k17
$$ 67 -214 107 282 102 96 -25 137 -255 -134 -123 126 -208 49 11 124 102 15 -63 71 -171 -96 86 -131
6805a31J48M6j60n3K59j03K02j20j70P2J32j33j01O7K02j18j55K83m0j98lP5r7
$$ -131 17 63 -97 -150 109 6 208 88 -82 -10 122 -11 -112 -45 157 39 -116 167 127 -71 -74 1 -96
6828i6O5J38j54q3j97M70k11K10l81J46N4mR4j96K95k77J05k2rk0L30k19K14l44
$$ -96 -31 107 -47 -130 -327 143 -68 142 -239 -93 -39 -43 51 -145 150 -127 -22 -44 -53 -73 257 38 252 -92
6852i2N2k5R1P5k19J58p3J48J23l09o9K48J15m88K95Q4k34j16L14j81%L15k77
$$ -92 -40 -65 26 101 -118 40 -33 115 238 -71 -140 108 223 -265 30 114 -120 -236 78 -103 -103 212 -65
6875f5P4q4J76k46J57J06m8r2k6O0J4J06k38J95n4J31r7j96J46l64L36n2R3j29
$$ -65 9 -75 101 -145 12 118 70 -22 -48 12 26 132 -106 89 35 166 69 -127 19 -345 -9 -61 32 -97
6899i7Q6J4O9J4j92j66P7J68L1j15M1j34J37n6oK7J67K55l70q1J81r3np0K01j50
$$ -97 -11 3 72 86 -106 -272 -195 -27 4 -111 -70 -204 -67 -123 -129 -102 65 320 -50 -131 50 -43 -48 -118 83 -67
6925f7J62Jo2R8k14M02l85K12p3l12J76K84l54L96m05J79j68J00J15k53R4K6k62
$$ -67 95 96 34 132 -82 320 -65 147 74 -238 -62 222 -132 264 -141 38 -130 -30 85 -168 -74 -48 -310
6948c10N57j87k19n7O7J91n8q6J24r1r9J72LJp3l4J02q3J80k56K80k16J64j94
$$ -310 247 60 -159 -216 -149 42 -16 -102 22 -69 -168 4 7 8 -65 -99 3 -80 100 -156 124 -92 72 -122
6972a22J54j02J81Q8M9m08J21p3J09o6J11J18j0k55O5K48k66Q6K58k28l3J63k81
$$ -122 32 -70 111 199 248 -160 -39 -112 -3 -69 42 160 150 -105 -40 208 -58 28 286 58 25 188 -93
6995i3p3K12j84J4J75j9n7N5P7k13J44j46K31o1l0k21K70MJ7j95L5N7o2J11k47
$$ -93 -166 46 -138 -124 51 32 -25 30 107 -106 38 -108 123 62 32 -189 81 85 102 -93 -58 -1 -63 48 -199
7020a99Q0J70Rk91K2j8K45j83l5M67q3j15J94k90l6M2J90k08Kl0j06J44R7r6R9
$$ -199 -119 51 60 -231 -209 -227 18 -165 -200 267 184 69 263 -27 -63 -21 169 -39 -37 -67 -173 -29 68 -28 71
7045G1l88L76j4J6j28K5K6K38j54k29J21M2J25M1n6k92P0K40Pk76K80k48j30K84
$$ 71 -317 59 45 61 -67 -42 -16 222 68 -161 -40 2 127 168 112 -180 -110 130 137 -139 141 -107 -237 47
7069D7j87L2Q8J24L6j02k48J29O8NR0j59L9Q3l9Q7k41j5J2J84o9j89K99j12j75
$$ 47 -140 -108 -20 104 140 38 -210 -81 -13 -8 82 -77 -38 45 6 93 -148 -163 -151 33 -36 -225 74 -38 -213
7094b13J44j46K78Kj13O0nj8j3l7J90k0o5j16J77k80K20oj34J46J6k46J62K0J42
$$ -213 -69 -215 63 65 -48 12 7 -11 -24 -61 129 109 44 -72 105 -175 45 39 -95 51 67 -179 -17 3 145
7119A45j22K53k17L0j8j91L49k42N2J08r9N0m6j71K10j48J22j51N6P0K9J39l24
$$ 145 23 276 59 89 71 -120 229 -13 39 147 48 98 52 -119 91 -57 65 -86 -30 40 69 208 -116
7142a16jj08K05n5K48k37J43O2l30L29lk81m5J48J74n6k97L83j58K17l41k0N7
$$ -116 -117 -225 -20 -75 173 -64 79 141 -189 140 137 -144 -189 -41 133 77 -220 163 5 222 -119 -139 -82
7165h2J95Lo1K1Q3p0r5R6r9n3J11M0q9J0J25m1J5P6j22M3k10N9q8K61m4j87n9
$$ -82 113 116 55 76 159 89 -6 90 -9 -62 49 89 0 10 135 94 109 185 63 106 -104 -45 -133 128 84 -103 -162
7192a62K33J65k92Lp3K46l04J53l3R9r3MJ26j74j85K71K7J08M1j55J40n58K96
$$ -162 71 236 -56 -53 -126 120 -184 -31 -64 35 -58 -54 72 -102 -287 -16 11 119 160 5 145 -413 -117
7215a17J39K4q3J27j75j0P5L9jm0K4L9p5P9m7p6j17J43q7J01J14k72O2j29J47
$$ -117 22 46 -37 90 -85 -95 -20 19 18 -22 2 41 -34 45 -2 -78 -195 -52 -139 -38 76 -196 -134 -263 -116
7240a16J16n3R0K60j63j98k36L73p4p0J76j62m0O8J08J78l38J13Q5k66J77Q2l83
$$ -116 0 -53 37 297 134 -64 -300 73 -1 -71 105 -57 -97 -29 79 257 -81 32 117 -149 28 110 -273
7263b73K45Q6l50K74nn1K14K38l31k3M7o5n3J36N2j50J45q1N7j0j33o6J68p3M6
$$ -273 -28 58 -292 -18 -23 -74 140 378 47 24 71 6 -47 89 141 -9 136 55 112 102 -31 -97 71 -2 44
7288D4l31L48L6k93J7N5J1j75K24O8r3m3K88k36K5o3J3Q1K63l62J3M32j96j69
$$ 44 -287 61 97 -196 -179 -124 -113 -288 -64 4 -89 -132 156 -80 -55 -118 -105 -24 239 -123 -110 322 126 -43
7312d3j45K77r0nN1j93J41K06j14L1P7l71J78P6p3k38K00PJ08k54J62Oj6j34J9
$$ -43 -188 89 -1 -6 45 -148 -7 199 85 116 193 -178 0 76 3 -235 -35 -28 80 -174 -12 -6 -22 -156 -137
7337a37m1J50K5L12k12j84j91J36j7O2L4qm3m6k4K50n2j06K4J77j82K22n73M38
$$ -137 -178 -28 -3 309 97 -87 -278 -142 -159 -97 -63 -71 -114 -160 -184 66 14 -92 -68 109 -73 149 -424 14
7361A4j17m2L76o2m01K45o3L2J49k55L00r6l22L74j56o5K13K20k89KJ07R8m46
$$ 14 -103 -145 231 169 -232 13 -50 -18 131 -124 176 80 -242 132 -24 -89 124 344 55 57 164 262 -184
7384a84K72pj65N2O4j2J7j9K00j18m02M43j16P6L4O9l02N05n50O5O5j66qJ75j65
$$ -184 88 81 -84 -32 32 20 37 18 218 100 -302 141 25 101 135 204 -98 407 -143 -78 -13 -179 -187 -12 -177
7409a77K57N7j75L6J3q6N3k60K96k2j53J26R7O2l03J00j21R1n2J90K34k54k03
$$ -177 80 137 -38 -2 11 -75 -22 -282 14 -8 -161 -35 62 124 -179 -79 -200 -109 -161 29 263 9 -194
7432a94J23j71L18j3M8j67L78l29K43n6k36R0j75J17K93l52J07k34j33K44k08
$$ -194 -71 -242 76 63 111 -56 322 -7 236 180 -56 34 -141 -24 269 -83 24 -210 -343 -99 -307
7453c07N52j82j9N6n0k09J36k3j13K28J8j58NK11k27J13k7K87l99K19l1J1J23
$$ -307 245 63 44 100 50 -159 -23 -46 -159 69 87 -71 -66 145 -82 31 4 291 -108 111 80 91 214
7476B14k38N9nr6m8l4K25L9J0k85K36n6J43k96J79K57l64Q7N0p2J9j49J20M4M2
$$ 214 -24 35 30 -66 -114 -148 77 116 126 -159 77 21 164 -132 47 304 -60 27 77 5 24 -125 -5 39 81
7501H1l05J80rJ18r2J78j34J7O9j83k57L79k20J14j44jR8J61j70K66j91O2k6J0
$$ 81 -224 -44 -53 65 -27 151 17 34 103 -80 -337 42 -178 -64 -208 -209 -111 50 -120 146 -45 17 -9 1
7525AP5J07n6k02P3k21J09o0K13J11k20k23O6L34J54l53K10j70J29J36k46m7K12
$$ 1 76 183 127 -75 -2 -223 -114 -174 39 150 -70 -293 -227 107 261 -92 118 -52 77 213 -33 -80 132
7548A32L0r7j15K67l00J2K17R2m83qJ21L5J61r9o7J09p2ML95l09K3Q1k30j3J7
$$ 132 162 65 -50 217 -83 -71 146 238 -245 -253 -132 -97 64 -35 -102 7 -65 -61 334 25 48 129 -101 -114 -97
7573i7J2L29k57l5J15O9j67O4j25N6k1j07J58J43j7j07j6J70j23j3N6k6M0j94
$$ -97 -85 244 -13 -48 67 136 -31 33 -92 -36 -57 -164 -6 137 120 13 -3 167 44 31 87 61 101 -93
7597i3k1M1L01k32j60J23Jj55J11J47j2J1j25K13k98J74j68P0o8J41k01J31M0
$$ -93 -114 -73 228 -4 -164 -41 -40 -195 -84 63 51 62 -63 150 -148 26 -142 -72 -140 1 -200 -69 -29
7620b9j6J7n6R7L7j3Q8K2j25%o3J30k03J97j3k7Jk18J11L3j43K07N5j38P2k34
$$ -29 -45 -28 -84 13 50 37 125 147 22 22 -41 89 -114 83 70 43 44 -174 -63 -30 -173 34 89 -49 23 -211
7646b11q4L93j12m8m6O5M3r6K08k41J10J20j73%K61j37N4j49R9j04J48l59%L66
$$ -211 -295 98 -14 -62 -108 -43 0 -96 112 -129 -19 101 -72 -72 189 52 106 -43 56 -48 100 -259 -259 107
7670A07m72J80L12lk38M4J41j16m2Ll1J94Rr4K08j0j68J15k43p9P8J74k90K51
$$ 107 -365 -185 127 124 -114 -70 71 -45 -87 -84 -115 79 88 -6 202 192 24 139 -104 -183 -105 69 -221 30
7694C0K04k95L22l44J81j23j11K3K2J35L1r7q1J14K8j29m9K50k12L34K3k03j64
$$ 30 234 -61 261 -83 98 -25 -136 -113 -91 44 75 -22 -103 11 39 -90 -139 111 -101 233 256 53 -111
7717a11K68J49j54J69j30j31N1j37k2J39j46J27k80m8J64J94j11q3R9K35l05K4
$$ -111 157 306 152 321 191 60 111 -26 -48 91 -55 72 -208 -256 -92 102 -9 -92 7 242 -63 -39
7739c9k9J46l38K69J20K3O0p3R3l81K20m%j05p8MK7K56lj82P0O0k65K00k93J64
$$ -39 -68 78 -260 9 129 152 212 139 232 -149 71 67 67 -38 -116 -112 -85 171 168 -14 56 116 -149 51 -242 -78
7765g8k30J06m5P8j40M23k13J87r2m42K42J38J30p5J8qj21N3J85L4M9l70Q4J28
$$ -78 -308 -202 -247 -169 -309 114 -99 88 -4 -446 -204 -66 64 -11 7 -1 -122 -69 116 150 199 -171 -87 41
7789D1rk3k98K60J50l9j46m7J02J09l73J55k4k7K93o7Q8k76Q8R8j82Q0R0L2j08
$$ 41 32 9 -289 -29 121 82 -64 -111 -9 100 -273 -118 -142 -169 124 57 145 -131 -43 55 -127 -47 43 75 -33
7814c3NK42j76q0J19P2p2m0j34J49J34j65l58L20l4K2j6r2J83j32P9j09N3j4J46
$$ -33 -28 214 38 -42 77 149 77 37 -97 52 186 21 -337 -17 -51 -29 -45 -137 46 -86 -7 -116 -63 -77 69
7839F9L4O5p3l8j52k3j02J65K84o9j80J14j1k71M14l33K24k63l8J96k21M21j17
$$ 69 103 168 95 57 -95 -118 -220 -55 229 160 -20 94 83 -188 226 -107 117 -146 -184 12 -209 212 95
7862I5O5k01J01j27L12k53M3J21k70O2L6r5J37J33k56M1r2K49k05Q0K3K5J54l4
$$ 95 160 -41 60 -67 245 -8 35 156 -114 -52 -16 -111 26 159 -97 -56 -148 101 -104 -24 -1 24 178 144
7886A44k56j35J89K8J51p0k38L12oj04k12K42K6%l1j35J90k90R6j40L03P3j38
$$ 144 -112 -247 -58 -30 121 51 -187 125 119 15 -197 45 71 71 40 -95 95 -195 -99 -239 64 137 -1
7909aQ7N6k89N8j00K85j78m8J10N5n2K37l43R5l8J49k03R5R3mk12j35K55J06n4
$$ -1 86 142 -147 -89 -189 96 -82 -130 -20 35 -17 220 -123 -28 -66 83 -120 -25 68 64 -148 -283 -28 78 24
7934B4R5J0k55L47j58j82J67j43K7M9J05r2n2j45J26mN5j09J03n8K58k74J85j74
$$ 24 119 129 -126 221 63 -119 48 -95 -68 -19 86 -6 -58 -203 -77 -81 -26 -135 -32 -90 168 -106 79 -95
7958i5M8j01J89j9j7J10j59J2J19L6j69K5j5p7j42K78j18R9N3M9K93l48l2q8K92
$$ -95 -47 -148 41 22 5 115 -44 -32 87 123 -46 -21 -36 -113 -255 23 -95 4 57 106 399 51 19 -69 223
7983B23m20K92k3Q5k16J86j8n2k22K23o0K28l13K1Q8L4m2J49j51jr3K06j16j83
$$ 223 -197 95 72 157 -59 127 109 57 -165 58 -2 226 -87 -66 22 56 14 163 12 11 -82 124 8 -175
8007a75L40p4Oj02K6j84J29j21J23N0Qj29r2K53P0k02Q9o2m7K63k81J31j09N0
$$ -175 165 91 97 -5 21 -163 -34 -155 -32 18 26 -103 -195 58 128 -74 15 -47 -94 169 -112 19 -90 -40
8031d0K31k65m3k8J04J64k73J19R1l7j02j85K31q0J34Rk09L21p3pn8M0l9J95k4
$$ -40 191 -74 -117 -145 -41 123 -150 -31 60 23 -79 -264 -33 -113 21 30 -179 142 69 62 4 44 5 200 176
8056A76l27J38j70J59j15J73r2O9ol9K75m33M01L9l85k1J86J52k12mJ09J57j65
$$ 176 -151 -13 -183 -24 -139 34 -58 11 5 -34 241 -192 209 248 -137 -158 28 180 -32 -36 73 230 65
8079F5K0L9j22q6J45J25j50j27m9Q3K23k73PR5o4N1J98k45K12j08K9j50K23L8
$$ 65 85 124 2 -84 61 186 36 -91 -140 -57 166 -107 -100 -5 -69 -18 180 -65 147 39 68 -82 141 179
8103A79n3k39kR5Q5j11J09K3O2o2J15j03k6j7j55L25n40L37M2N4m6j23o3J45K23
$$ 179 126 -113 -115 -20 65 -46 63 86 148 86 201 98 72 55 -100 225 -315 22 64 118 72 -51 -114 31 254
8128B54l77J20J11k41K7K7J58o6l25K85p5L18m88L42JL2p2k9j44K7P4Q5K7j55
$$ 254 -123 -3 108 -133 -106 -79 79 13 -312 -27 -102 216 -272 70 71 103 31 2 -142 -115 -41 44 71 -84
8152h4J20k6J20J4j97L21m15K62MK6j11m2J6k48J20M27m8j66J22k03m1q3J69J31
$$ -84 36 10 130 144 -53 268 -147 115 119 145 34 -8 8 -240 -120 307 259 93 215 12 -29 -112 57 188
8176A88p9l5ok36L20k94n1L35j60M5Q1j40QL9k3
$$ 188 109 74 68 -168 152 -142 -193 142 -18 27 108 -32 -24 15 -8
8191h
$$ Imaginary data points
##PAGE= N=2
##DATA TABLE= (X++(I..I)), XYDATA
0@%%%%%%%%%%%%%%%%%%JmPrJ1j5K0k3K7l2M0m9N6o7Q0r2J07j25J43j62J85k12
$$ 0 0 0 0 0 0 0 0 0 0 0 0 0 0 0 0 0 0 0 1 -3 4 -5 6 -9 11 -12 15 -17 23 -26 30 -37 43 -49 58 -67 76 -86 99 -113
40a13K39k70L04l39L83m29M79n36N95o61P34q13Q98r91J094j205J325j457J600
$$ -113 126 -144 160 -179 204 -225 254 -282 313 -348 386 -427 471 -520 574 -631 694 -763 837
59H37j757J930k116K317k530K743k931L014k728P25P4041o3126k0006K2856j7706
$$ 837 -920 1010 -1106 1211 -1319 1424 -1507 1507 -1221 -496 73545 10419 -9587 13269 -4437
74d437j8110L8098k4055J4016p994n937P946L945k294j874K597J23m512M704l738
$$ -4437 -22547 15551 -8504 5512 -2482 -8419 -473 3472 1178 -696 1901 2024 -2488 2216 -1522
89a522K047P54J1272l2294K4479n839K858m026L205l810O609n789J297K147p252
$$ -1522 525 1279 12551 -19743 4736 -1103 1755 -2271 934 -2876 3733 -2056 -759 1388 -5864
104e864L722L522k87n528J5934l489n545l95l675L893m597O276P10k4245J9862
$$ -5864 -2142 1380 1093 -4435 11499 8010 2465 2070 -1605 2288 -2309 3967 4677 -19568 294
119B94q75j53k380R956p743R66N85k490J6887j294j9812Q503m385L245k947L37
$$ 294 -581 -734 -3114 6842 -901 65 650 -1840 15047 13753 -6059 2444 -1941 1304 -1643 -1306
135a306J720j16O03k516M045q615O067q15P74k355N212q537J8424k0037P146J452
$$ -1306 414 298 901 -1615 2430 -6185 -118 -933 -159 -2514 2698 -5839 12585 -7452 -306 1146
151A146k060Q16K011j817k70J070l75n01K02j556J574n17N31Q7o66K82K94N54
$$ 1146 -914 -98 1913 96 -174 896 521 20 222 -1334 240 -277 254 341 -325 -43 251 805
169H05j424J816k688K470k081J379j012Q57K67P1j856J047J044p88j09k0Q13m93
$$ 805 -619 1197 -1491 979 -1102 277 -735 122 389 460 -1396 -349 695 -93 -202 -222 591 98
187I8j046K016j472K093o65k339K862l812M441j962m429N925k342K434j996K794
$$ 98 -948 1068 -404 1689 1024 -1315 1547 -2265 2176 214 -4215 1710 -632 1802 -194 2600
203B600l176o91J057L43j582L710k563q49J000j120k66J371j499N718k880j864
$$ 2600 -576 -1267 -210 133 -1449 2261 -302 -1151 -151 -1271 -1537 -166 -1665 4053 1173 -691
219f91P73l87P64p05Q66q72j08P42k44n06N1P60p39l2P19q73N89m25M98k97O33
$$ -691 82 -305 459 -246 620 -252 -360 382 138 -368 -317 443 -296 -328 391 -482 107 -318 180 -117 516
240E16n85M87J791l183J465k02R61j263N09J236j109r08K89k85O06P86M21m54
$$ 516 -69 418 2209 -974 491 289 1250 -13 496 1732 623 -285 4 -281 325 1111 1532 1078
258A078p86l94J297q96O55j503M80N38j645K105p21J09R26q61K46o99l4r7M75
$$ 1078 292 -102 1195 299 954 -549 -69 469 -1176 929 208 317 1243 382 628 -71 -105 -202 273
277B73j055P23R40n15l97j58L29q55J481j178O66n00O32q56O54m89K10J15Q2k15
$$ 273 -782 -59 881 366 -31 -189 140 -715 766 -412 254 -246 386 -470 184 -305 -95 20 102 -113
297a13L57m62J74k64M11n00K82k37M34m54L50j84N80p29J553r79q13J018l60M71
$$ -113 244 -218 -44 -308 103 -397 -115 -352 82 -372 -22 -206 374 -355 1198 219 -594 424 64 535
317E35N4r06M82J364p90j383p63M88N48O37k57J5m04R60l63J03Pk14k29J41p0
$$ 535 589 -317 165 1529 739 -644 -1407 -919 -371 266 9 24 -380 580 217 320 327 113 -116 25 -45
338d5m52M67K96l94K85K82K92n35k72J74k87m28R23n30PL32k16J19M1j75j36L28
$$ -45 -497 -30 266 -128 157 439 731 196 -76 98 -189 -617 306 -224 -217 115 -101 18 59 -116 -252 76
360G6l8j15q0J79k21L06j60o0k10J88K24O9j29k24L28k26o8L00l3l8j09K31n61
$$ 76 38 -77 -157 22 -199 107 -53 -113 -323 -135 89 158 29 -195 133 -93 -161 139 106 68 -41 190 -371
383c71M16L22k53l49R01n25j60l63N68m39j96J59L23J37j19k88K72r1j0M5O5m1
$$ -371 45 367 114 -235 666 141 -19 -382 186 -253 -449 -290 33 170 51 -237 35 -56 -66 -21 44 3
405Ck91M44j71j95L95k60K03k34K34m3k8n8J57k66k51L58j7J30m38J29q3L15k40
$$ 3 -288 156 -15 -210 185 -75 128 -106 128 85 57 -1 156 -110 -361 -3 -20 110 -328 -199 -282 33 -207
428b07L33k70M0P3k07Q7O6j31M19j27K10m37K95j74J50MK90m45P6r3l8p9L22m28
$$ -207 126 -144 -104 -31 -238 -151 -85 -216 203 76 286 -151 144 -30 120 124 414 -31 45 -48 -86 -165 157 -271
452b71N36N7o19N13j9j68J9M13k21k64K00j46oj3j20J43N6J2k31K42j30N5K2L2
$$ -271 265 322 -297 216 197 29 48 461 240 -24 176 30 24 11 -109 34 90 102 -129 113 -17 38 60 92
476I2K3M6k92J80j40J40K6r6J43L5o1R0j23k36M03k73J10J56j67o0k36K08J90
$$ 92 115 161 -131 49 -91 49 75 -21 122 157 96 186 63 -173 230 -43 67 223 56 -4 -240 -32 158
499A58l51K80P7j02r6k28L24r3R0mq5o1K33l10M35j74k39L47k98K19j27k46J20
$$ 158 -193 87 164 62 -34 -262 62 -31 59 55 -30 -91 142 -168 267 93 -146 201 -97 122 -5 -251 -131
522a31j50J51O9n5J28M3j03R0j02J41R6k26J1j73L09J16j00k08L69k49J3j33R2
$$ -131 -281 -130 -61 -116 12 55 -48 42 -60 81 177 -49 -38 -211 98 214 114 -94 275 26 39 -94 -2
545bL0Q9j95J38k01K24j15R7j90m0J63J82k18K61m9j64k5k37K65J94m6j02k38
$$ -2 28 117 -78 60 -141 83 -32 65 -125 -165 -2 180 -38 223 174 10 -15 -252 13 207 161 59 -179
568a79J65Q9R7j80k5J78q9nj39L39l91K59P3k99pJ11oJ09j93J52J69k63J68p5
$$ -179 -14 75 172 -8 -33 145 56 51 -88 251 -140 119 192 -107 -114 -3 -9 100 -93 59 228 -35 133 58
592E8k00J35m6k9K73k41r8j18O0K04lRl2j1m3L68n10M9L45k07m0m0J34m6P1J98
$$ 58 -142 -7 -53 -82 191 -50 -148 -266 -206 -2 -5 4 -28 -39 -82 286 -224 -175 170 -37 -77 -117 17 -29 42 240
618B40l59M36k23k89K49j74J68j90L35k02O3j6J95l17r5L83l41j09J04N18k74
$$ 240 -119 317 94 -195 54 -120 48 -142 193 -9 54 38 233 -84 -179 204 -137 -246 -142 376 102
639A02k12L9K29k46J30Jr1K99k97P7p0j9P6l9J58j0q8l8j28R7J29j08j13O0J84
$$ 102 -110 -71 158 -88 42 43 -48 251 -46 31 -39 -58 18 -21 137 127 39 1 -127 -30 99 -9 -122 -62 122
664A22J8M3m26O6J25j96N50k25N1n4j39o4K06J28j48o6Q6k64M29l67QR1k2q9J15
$$ 122 140 183 -243 -177 -52 -248 302 77 128 74 -65 -129 77 205 57 -9 77 -187 242 -125 -117 -26 -48 -137 -22
689b2K27l65K4K57L6k88K31l7k32K68K6l24M3j28L73j85J30J60l80J02J43J35
$$ -22 205 -160 -136 121 157 -131 100 63 -169 99 125 -199 -156 -284 89 -96 34 194 -186 -84 59 194
711A94p6R2j05J89j02M0k93M7q9n5J65O3j77j43M42k1p4n7r2Q0J14J5l07J9J51
$$ 194 118 210 105 294 192 232 -61 -14 -103 -158 7 70 -107 -250 192 171 97 40 -52 28 142 157 -150 -131 20
736B0q1O3j92N0K07j30j6m9l6J23K31k32P3J36o1k08J95M9K8k51K67j56n9J22
$$ 20 -61 2 -190 -140 67 -63 -79 -128 -164 -41 190 -42 31 167 106 -102 93 142 170 -81 186 30 -29 93
760I3j83P6l3j22K10j04M6J21l4j78J04K2n4l3J24k11K98k55M14l35j08J05k68
$$ 93 -90 -14 -47 -169 41 -63 -17 104 70 -108 -4 18 -36 -69 55 -156 142 -113 301 -34 -142 -37 -305
783c05N80k04j22M21o5l07r6R3M9m3J19k12K36k24R1q2J94k08J48l9K22k71o1
$$ -305 275 71 -51 370 305 -2 -98 -5 44 1 120 -92 144 -80 11 -71 123 -85 63 24 246 -25 -86
806h6K03r6P3k56P7J25j0j36r3R5n0R8N8Nn2ML87l09k03J90k96N28k62l4J33J1
$$ -86 117 21 94 -162 -85 40 30 -106 -199 -104 -154 -56 2 7 -45 -41 346 37 -166 24 -272 256 -6 -40 93 104
832A04o4m2n4J11j49O0j32P7J15Q1l36J83j02K54j70j67K75j08P5J59r6qN7r9
$$ 104 40 -2 -56 55 -94 -34 -166 -89 26 107 -229 -46 -148 106 -64 -231 44 -64 11 170 74 66 123 24
856B4N9p8P3p5j89K50j58J01j64N9L5J68J14j85N6L1j02M5j24j08J05K9K11k25
$$ 24 83 5 78 3 -186 64 -94 7 -157 -98 -63 105 219 34 90 121 19 64 -60 -168 -63 -34 177 -48
880d8k0k11L20J34l30J85n5K0p4L29K2m09k05N25k04R7m0K0K66k55N4j59J66m5
$$ -48 -68 -279 41 175 -155 30 -25 -5 -79 250 272 -137 -342 183 -21 76 36 56 322 67 121 -38 128 83
904H3j92J26p3Q4l0J85j08k82J94j44K38p7R0O7j19k24O3J6K46k40J98j04n3J46
$$ 83 -109 17 -56 28 -2 183 75 -207 -13 -157 81 4 94 161 42 -182 -119 -103 143 -97 101 -3 -56 90
928I0K8j4j90np0L8J41l1Q4j02j08R1K72k00K10j64k58J29J04l6J79q7m10K24
$$ 90 118 104 -86 -91 -161 -123 18 -13 71 -31 -139 -48 224 24 234 70 -188 -59 45 9 188 101 -309 -85
952h5K25k09m3j24J49J34j33K4K32k11O1rl8rj81M7n0J39L21k63LO5J36j34k1
$$ -85 140 -69 -112 -236 -87 47 -86 -62 170 -41 20 11 -27 -36 -217 -170 -220 -81 240 -23 -20 45 181 47 26
977B6P8r0Q2L7P3l23K9R7J35r1j55N7J20O2K0o6j62NjR6oj34K98k96R3p9q9O3
$$ 26 104 14 96 133 206 -117 -88 9 144 53 -102 -45 75 137 157 91 -71 -66 -67 29 23 -111 187 -109 -16 -95 -184 -121
1005a21J50P2k37K24r2o2J30j80K2J18k76L72J99j51j99N4k70K20JK0l18J62J64
$$ -121 29 101 -136 88 -4 -66 64 -116 -94 24 -252 120 319 168 -31 23 -247 -27 -26 -6 -324 -162 2
1028BL07j55q8j45j34J32n7K49j05K87k28m9k94K48Q9j97Q5J76O2ol88K56J53
$$ 2 309 154 66 -79 -213 -81 -138 111 6 293 65 16 -278 -30 59 -138 -53 123 185 179 -209 47 200
1051B00j91J2j48J65k4j0J79j04L9j92J88K08k96O7j0k61K36L15l01M9l43J92
$$ 200 9 21 -127 38 14 4 183 79 118 -74 114 322 26 93 83 -178 58 373 72 121 -222 -30
1073c0J15M3Q7l46O2J97l8r9l2J79n1j37j23J71j22K99j87J76j1k01N7j52Q1n5
$$ -30 85 128 215 -131 -69 128 90 -9 -41 138 87 -50 -173 -2 -124 175 -12 164 153 -48 9 -143 -62 -117
1097a17j0J07K58k49n8J34J60l33j13Q5J58M0o6L8j56o1PJ3P7J68j32K23p8q6
$$ -117 -127 -20 238 -11 -69 65 225 -108 -221 -136 22 62 -4 34 -122 -183 -176 -163 -86 82 -50 173 95 9
1121Ip7o8j15K16J50k07J07j37J92M4k5q5J39k03J0o2J74k7J89l01J87k86K5N5
$$ 9 -68 -136 -251 -35 115 -92 15 -122 70 114 89 4 143 -60 -50 -112 62 35 224 -77 110 -176 -151 -96
1145i6K58r1j42J22j23P1J9k71J45P1N7m1M7J93j60P3l21M04Lj33J9J2j90K2K32
$$ -96 162 71 -71 51 -72 -1 18 -253 -108 -37 20 -21 26 219 59 132 -189 215 218 85 104 116 -74 -52 180
1170A80j74r3r5N7J19J81J19l22j02K13N7k46K08k17L75l08p5J12q7J76J05j74
$$ 180 6 -87 -182 -125 -6 175 294 -28 -130 83 140 -106 102 -115 260 -48 -123 -11 -98 78 183 9
1192INj90P0P8l6J46j21J86j01OnJK77l76Nk1J6J87P3M1j27J1l07mK81j35k4J75
$$ 9 14 -176 -106 -28 -64 82 -39 147 46 52 47 48 325 -51 -46 -67 -51 136 209 250 123 134 -173 -177 104 -31 -55 120
1220A20k09K34j90K51k19j16%P1J25l26M60j88O1j48J3nJ21P9k79J99j54K52k54
$$ 120 -89 145 -45 206 -13 -129 -129 -58 67 -259 201 13 74 -74 -61 -66 55 134 -145 54 -100 152 -102
1243a02l0J81n5q8K06j39j5j52M59k32k42J09J79j5k30J38K01n9o5j28R3J54j92
$$ -102 -132 49 -6 -94 112 -27 -42 -194 265 33 -209 -100 79 64 -166 -28 173 114 49 -79 14 168 -24
1266b4J01j98j09L60j41n1J5m6M9j76J77J5m1M4O7q2J62m3k2K4j42K11j9j50N5
$$ -24 77 -121 -230 130 -11 -62 -47 -93 -44 -220 -43 -28 -69 -25 42 -40 122 79 57 81 -61 150 131 -19 36
1291C6K1j06m4R2j8L0J7j35K27m6p0o6k9L6L84l85PM2p3L58k56nq6K12j35oJ03
$$ 36 57 -49 -93 -1 -19 11 28 -107 120 74 4 -62 -91 -55 329 -56 -49 -7 -80 278 22 17 -69 143 8 2 105
1318A05k40O3R2l0o0m8J18l1J36J28l76L4K13J92l15o7J46P2n34L11M5r9M89l97
$$ 105 -135 -72 20 -10 -70 -118 0 -31 105 233 -143 -109 104 296 -19 -86 60 132 -402 -91 -46 -145 344 -53
1342e3J70R7j90p3K10O9j50j9j28l8K87m22J20J87k91K81M8j1j7k07N6K03J15
$$ -53 117 214 24 -49 161 230 80 61 -67 -105 182 -240 -120 67 -224 57 105 94 77 -130 -74 129 244
1365B44j51j90L4Ml5J72q5J47n6kj56j13L37k33J56O4p9k0K01l91lN0Q3N7l00
$$ 244 93 -97 -63 -59 -94 78 -7 140 84 82 -74 -187 150 -83 73 137 58 38 239 -152 -155 -105 -22 35 -265
1390b65M06j89l11L25l9%P8o0Q5O7p0J2Q5p7k32O6k0J00j92K18J38o9J07k06J81
$$ -265 141 -48 -359 -34 -73 -73 5 -55 30 97 27 39 124 47 -185 -119 -139 -39 -231 -13 125 56 163 -43 138
1415A38l25M48m31J11j2J46r4J98l4k36pK4j54M26l33K01o3j17K69j53K8J19o0
$$ 138 -187 261 -170 -59 -71 75 -19 179 145 -91 -98 -74 -228 198 -135 66 3 -114 155 2 30 149 89
1438H9N8j77R3j06J22r5q6q2K35k9k55L32OpK2k09J45J00j96o1n4J48N8q5o3J31
$$ 89 147 -30 63 -43 79 -16 -102 -184 51 22 -233 99 105 98 120 -89 56 156 -40 -101 -155 -7 51 -34 -97 34
1464C4K17k09j26J6O5J27l3p7J4n3j58J98k9K9J16j19L26m07K95J7j77n2q2J02
$$ 34 251 42 -84 -68 -3 124 91 14 28 -25 -183 15 -14 15 131 12 338 -69 226 243 66 14 -68 34
1488C4rJ36j74MN2q7R0J23k77j95N4L53k00n0K08j1o1n1O5j00MK35k35m0P5j2
$$ 34 25 161 -13 -9 43 -44 46 169 -108 -303 -249 104 -96 -146 62 51 -10 -61 4 -96 -92 143 -92 -132 -57 -69
1514f9J11n5o4K0P1J4n0j1K52k20N7j66J8J79j72J93Q5k35P7O3l28K80k01K44
$$ -69 42 -13 -77 -57 14 28 -22 -33 219 -1 56 -110 -92 87 -85 108 193 -42 35 98 -230 50 -151 93
1538I3P0j79j09J97p7m7m4J31p3K1K4k7p3mJ3J25j56O9Q0j88O4J94m5n2Oj75J78
$$ 93 163 -16 -125 72 -5 -52 -96 35 -38 -17 7 -20 -93 -97 -84 41 -115 -46 34 -154 -90 104 59 7 13 -162 16
1565A6l9J81K39l92J34N8k85L8pk1q2o6J61L8J10j00P2o5j13K7k08O14l37l30
$$ 16 -23 158 397 5 139 197 -88 -50 -57 -78 -160 -226 -65 -27 83 -17 55 -10 -123 -96 -304 310 -27 -357
1589c57K60K06l9LK30j89j53J63j72N1j50R3pJ01J90Jk36N9k25K90j80J51j19
$$ -357 -97 109 70 73 303 114 -39 124 -48 3 -147 -54 -61 40 230 231 -5 54 -171 119 -61 90 -29
1612b9O8K5J14m06P4p2K31J78k43J51j80K17l5q7J07N8M1k56q2K02r4n7J05or7
$$ -29 39 64 178 -228 -154 -226 5 183 -60 91 -89 128 93 6 113 171 212 -44 -126 76 -18 -75 30 24 -73
1637g3Q8j33L55k80M6r7J16M3j85J34J58l32K35p5Ml4k7k17L42J33l80L37k2j93
$$ -73 15 -118 237 -43 3 -94 22 65 -120 14 172 -160 75 0 4 -30 -57 -274 68 201 -179 158 136 -57
1661e7p3p9J26j4J14J22k52p0K72k40M30R9m51O3J47K5k02J94J13m81K34k9pj62
$$ -57 -130 -209 -83 -97 17 139 -113 -183 89 -151 279 378 -73 -10 137 162 -40 154 267 -214 20 -9 -16 -178
1685a78J80m0j44K73l19M07k8l77M86j10l61P3K20P3j74j69L06k7p4l8J79R3l93
$$ -178 2 -38 -182 91 -228 179 151 -226 260 150 -211 -138 82 155 -19 -188 118 91 17 -21 158 251 -142
1708a42L00j86k02O6J51R9k69N28j7l04K17l19M8j06J34K30k20J06p5k2p9L18
$$ -142 158 -28 -230 -164 -13 86 -183 345 328 24 241 -78 -30 -136 -2 228 8 114 39 17 -62 256
1730B56l56l8J99l87L33o4R2J27j94k06M59j78j00q6J14L7j17L67l28J74j15p3
$$ 256 -100 -138 61 -326 7 -57 35 162 -32 -238 221 43 -57 -143 -29 8 -109 258 -70 104 -11 -84
1752h4J06J8k47L5K29l2o1M3L8ml2K74l49j7P0N2m10L98p4R1l39L72q8j14J68
$$ -84 22 40 -207 -172 57 25 -36 7 45 41 9 283 -66 -83 -13 39 -371 27 -47 44 -295 77 -11 -125 43
1777D3o3J53l2k32J98P6j93QK41k31J02r7J5j13K10J55k06q7r1K19k66L13kj22
$$ 43 -20 133 101 -131 67 143 -50 -42 199 -32 70 -27 -12 -125 85 240 34 -53 -144 75 -191 122 120 -2
1801bj0r7J6K0R2OP0k69L57l77L86k18n5J93k14M0L23l89Q8j23L82j18o3j38J20
$$ -2 -12 -109 -93 -73 19 25 95 -174 183 -194 192 -26 -81 112 -102 -62 261 -128 -40 -163 219 101 38 -100 20
1826B0j10J13K11l94K84l07K54p0j7rpj02N4M3L4m2r7p3J61N7J71k28r9L46K9
$$ 20 -90 23 234 -160 124 -183 71 1 -16 -25 -32 -134 -80 -37 -3 -45 -142 -215 -54 3 174 -54 -153 193 222
1851B22N9k31j18K00j87J66j8q8r6r4O2L7Jn5KK10k86K43o0l1j39L13Lk42M31
$$ 222 281 50 -68 132 -55 111 93 5 -91 -185 -123 -86 -85 -140 -138 72 -214 29 -31 -62 -201 112 115 -127 304
1876C04l83J89k9j01mQ2n7K4k2m9p7M32l35j09L4M0L40l85J6K01j14J55k13K44
$$ 304 -79 110 81 -20 -24 58 1 25 3 -46 -123 309 -26 -135 -101 -61 279 -106 -90 111 -3 152 -61 183
1900A83j59J2rj2J34j18N3j13N9J9n9k2m8K3K25l19P2L5J16k27J17P7K0Q4J1k84
$$ 183 24 36 27 15 149 31 84 -29 30 49 -10 -32 -80 -57 168 -151 -79 -44 72 -155 -38 39 59 143 154 -130
1926a30j27J78K41j07j14p8j15N03j22k97K22j47L07m10J63p8k7J54P0j3mM0p6
$$ -130 -257 -79 162 55 -59 -137 -252 251 129 -168 54 -93 214 -196 -33 -111 -138 16 86 73 69 109 33
1949C3pL6p3J30k49J55J4M6k27L27r2r9j7o2p8P2j51J36K64j60j72J43L05j08
$$ 33 26 62 -11 119 -130 25 39 85 -142 185 93 -6 -23 -85 -163 -91 -242 -106 158 -2 -174 -31 274 166
1973A66j44K22j16k54J90j49J86j65L85n11L09k88L30k95K33j49J69j31l85M98
$$ 166 22 244 128 -126 64 -85 101 -64 321 -190 119 -169 161 -134 99 -50 119 -12 -397 101
1993A01o0J61K2j59j67J37J21Lj32J3j95L31l72M16k84L5J08j20j6j47o0K61J21
$$ 101 41 202 224 65 -102 35 156 159 27 40 -155 176 -196 220 -64 -29 79 -41 -57 -204 -264 -3 118
2016A18k65L03k65Q3R5R6k04K39k19K80k08R6k74J81N2k26J78q8J57l18L45k79
$$ 118 -147 156 -109 -26 69 165 -39 200 -19 261 53 149 -125 56 108 -118 60 -28 129 -189 156 -123
2038a23J46n1l3n4M5N8O5k58K58j9k20K41p1k47J58M4K79l85J84k89L61o4J67
$$ -123 23 -28 -61 -115 -70 -12 53 -205 53 34 -186 55 -16 -263 -105 -61 218 -167 17 -272 89 25 192
2061A92j58M5J88k38j37J87l9j6qk17M02k22m6L26l92K48qj77p0K62J27l29j3
$$ 192 34 79 267 29 -108 79 40 24 16 -201 201 -21 -67 259 -133 115 107 -70 -140 122 249 -80 -93
2084i3L4J34n6j45l4J94k36K18j07j24K01j80L75r2l0j06K67j94l43M69l11J99
$$ -93 -59 75 19 -126 -160 34 -202 16 -91 -215 -14 -194 181 89 59 -47 220 26 -317 152 -159 40
2106D0l0l0j7K75j67P0L0l59M40k79k07O2K04M0j17m6K50j30k43r1K02O1j69K71
$$ 40 10 -20 -37 238 71 141 171 -188 252 -27 -234 -172 32 72 -45 -91 159 29 -214 -305 -103 -42 -211 60
2130F0l6j41J16j04l3L57j02mPj21j23M2J4j21k4J18j00J04K22k06p1K32j50m3
$$ 60 24 -117 -1 -105 -138 219 117 113 120 -1 -124 -82 -68 -189 -213 -95 -195 -91 131 -75 -146 86 -64 -107
2154a07J17n4K38k29J7J18P5j94j04K08j7j81K31j81r8J28O6j15j98M74j82R4
$$ -107 10 -44 194 -35 -18 100 175 -19 -123 85 68 -113 118 -63 -161 -33 33 -82 -280 194 12 106
2176A06M2m15K25k5N5q6J32j8O9j14m0J58q8k0J78k22J28J00k06K85m61L46J04
$$ 106 148 -267 -42 -67 -12 -98 34 16 85 -29 -69 89 1 -19 159 -63 65 165 -41 244 -217 129 233
2199B33l69L6J63k48R8n3L39k61%J22j1Q7o0j22j08L02N5l51P7k48J52J93p4j90
$$ 233 -136 -100 63 -185 -87 -140 199 -62 -62 60 49 136 76 -46 -154 148 203 -148 -71 -319 -167 26 -48 -238
2223b38J88j27J02l9M8N2l3J18M5m1P8j01o0J5p4j22P4K04k07N2L4K62k67M3P5
$$ -238 -50 -177 -75 -114 -66 -14 -47 71 116 75 153 52 -8 7 -67 -189 -115 89 -118 -66 -32 230 -37 6 81
2248H1j44N1k6k11M77k41n3O3M9J11l25N2r7L61k41K34q3j32k46N11n2j36lO0
$$ 81 -63 -12 -38 -249 228 -13 -66 -3 46 157 -168 -116 -213 148 -93 141 58 -74 -320 191 139 3 0 60
2272F0%k43p7K26k42L38r0M6k4l1J13k20M17j79j58R7J97l09P1k9J2p8K64l22
$$ 60 60 -183 -260 -34 -276 62 -28 18 -6 -37 76 -144 273 94 -64 33 230 -79 -8 -37 -25 -103 161 -161
2296a61J54j22J34j99L48l36Q4J05P5q1%L9j34K30j19J85l25K49o8n3j27L83k10
$$ -161 -7 -129 5 -194 154 -182 -98 7 82 1 1 40 -94 136 17 202 -123 126 58 5 -122 261 51
2319E1k63J49K10j08k45R0kJ76j03J88k6j38Q9O8J24l46J46k38L09M8k1k73K52
$$ 51 -212 -63 147 39 -206 -116 -118 58 -45 143 117 -21 68 136 260 -86 60 -178 131 179 158 -115 137
2342A37J8l8k49J14j23P9M8m2j60K21pk17J44N0J46k97J7M2M0J46j57mJ92L0k26
$$ 137 155 117 -132 -18 -141 -62 -14 -56 -216 5 -2 -219 -75 -25 121 -176 -159 -117 -77 69 -88 -92 100 130 -96
2367i6K0R4L59k34P3k38J39j70N4J44k90J09J2RP1k41M74l75L34m41M28J31m80
$$ -96 -76 18 377 143 216 -22 117 -53 1 145 -145 -36 -24 -15 56 -185 289 -86 248 -193 235 366 -114
2390a14mJ74K45l47k00O4K23j93R6m2J24J12k78J49Q2j62K60j61o6J55m14L58
$$ -114 -118 56 301 -46 -246 -182 41 -152 -56 -98 26 138 -140 9 91 -71 189 28 -38 117 -297 61
2412F1l19L60O7j04j06J53j04k6J07j36Ml8N35n92j49J08L87l95K00j66J77k50
$$ 61 -258 102 169 65 -41 112 8 -18 89 -47 -43 -81 454 -138 -287 -179 208 -187 13 -153 24 -226
2434b26M61l43k8J11L7K0L0k67M18j07l3o5l9J28m1J75k74j8P8j5o8K35k02J93
$$ -226 235 -108 -136 -25 12 32 62 -205 213 106 73 8 -31 97 56 231 -43 -61 17 2 -66 169 -33 160
2458A60k91L45j11k26Q7k03L17l33L16p1n3J99j9p4k40J00kK00k64J58N1j25J94
$$ 160 -131 214 103 -123 -36 -239 78 -255 61 -10 -63 136 117 43 -197 -97 -99 101 -163 -5 46 -79 115
2481A15O4k03r1J38l12K92k25o3K44p3K02oj45k46L14j9J17m9j61J7J91k0j30
$$ 115 179 -24 -115 23 -289 3 -222 -285 -41 -114 88 82 -63 -309 5 -14 103 54 -107 -90 101 81 -49
2504d9n6J30q4J17m3j66K28j15J01Mj07J19j00L53m06Q5r3K27L0q9j23P6p2J05
$$ -49 -105 25 -59 58 15 -151 77 -38 63 67 -40 79 -21 332 -74 11 -82 145 175 86 -37 39 -33 72
2528G2J9k60L90k41M8o4mL27m44m9J79J52m8l7l6K27j13l42J75o6l1K59k43j3
$$ 72 91 -169 221 -20 28 -36 -40 287 -157 -206 -27 125 77 40 4 231 118 -224 -49 -115 -146 113 -130 -143
2552a43P9K0J14P7j91J0j36J5J55j22K00O6r2j12P8J9M8J0l01L68j89n9L35k63
$$ -143 -64 -44 70 147 -44 -34 -170 -155 0 -122 78 144 52 -60 18 37 85 95 -206 162 -27 -86 249 -14
2576a4j00l7L7K14j98K01km1L1r4m2K21p6j94J43R8k12K64j43j67J31J72n5k95
$$ -14 -114 -151 -114 100 -98 103 101 60 91 -3 -45 176 100 -94 49 147 -65 199 56 -111 20 192 137 -158
2600a58L15j01J50j17k8P6k17K44j18j35K19lk88p1M63k74J54l84L20n5R7K5j17
$$ -158 157 56 206 89 61 137 -80 164 46 -89 130 127 -161 -232 231 -43 111 -273 47 -8 89 114 -3
2623co5J69M4l19N51l76k1Qq2J38J28k76J47P1j10K9p4J32J1j69L82n19l7K24
$$ -3 -68 101 145 -174 377 1 -20 -12 -94 44 172 -104 43 114 4 33 -41 91 102 -67 315 -204 -241 -17
2647a7M9j0l96N07N2m68N53l86K78k50K60l01K45k43J41J38l52J73k0J35R8j01
$$ -17 32 22 -374 133 185 -283 270 -116 162 -88 172 -129 116 -127 14 152 -200 -27 -47 88 186 85
2669H5j01O6o7r6J67r5J00k2j13J89j67K4m7L12k17l9J9L77n63J74J07k00J19
$$ 85 -16 50 -17 -113 54 -41 59 37 -76 113 -54 -30 -77 235 18 -21 -2 375 -188 -14 93 -107 12
2692A2jJ69l13K03J07k41R5J54Op9J98j06l93L1L90l10O0J10j25p8J11L2o3K24
$$ 12 11 180 -133 70 177 -64 31 185 191 112 310 204 -189 -158 232 -78 -18 92 -33 -111 0 32 -31 193
2716A93k13J91j57j0O3M7j18O0m3Q6J21l10J65q4J08j10K11j46k75K40k29J69
$$ 193 -20 171 14 4 67 114 -4 56 13 99 220 -90 75 -9 99 -11 200 54 -221 19 -210 -41
2738d1J2J19K8K1q7k0k29J39m7J66k40J17r7K72j02j99J27M6l0k9K48Rj02p6q7
$$ -41 -29 90 118 139 52 32 -197 -58 -105 61 -179 -62 -159 113 11 -188 -61 -15 -45 -74 174 183 81 5 -82
2763h2m8J65j57J48m7J41j48k39M48l07J7k0O2K20j57j48J89r1K1K50l21P9J34
$$ -82 -130 35 -122 26 -21 120 -28 -267 181 -126 -109 -129 -67 153 -4 -152 37 -54 -33 217 -104 -25 109
2786A09K3j28L3J61k85K24j34j0J87m15M47k20J98k34l9k97N20j19j70J79M5j38
$$ 109 132 4 37 198 -87 137 3 -7 180 -235 212 -8 190 -44 -83 -380 140 21 -149 30 75 -63
2808f3q1K43l68J67r1J25J47j90J9n0K27j20l7R0r1J21r5J07l4jJ28J2l70R0P8
$$ -63 -144 99 -269 -102 -193 -68 79 -111 -92 -142 85 -35 -72 18 -73 48 -47 60 26 25 153 165 -205 -115 -37
2833c7J37j30k7j20J82r1K09l60J08K98rk61k34L88j36K38j77K5r0J51R0j41J40
$$ -37 100 -30 -57 -177 5 -86 123 -237 -129 169 160 -101 -335 53 -83 155 -22 3 -87 64 154 13 153
2856A53k56J43j51O9N1j80M7N6RO0q6J6Pm4J53%j59J54Q6J26j40l13O4K39n4j10
$$ 153 -103 40 -111 -42 9 -171 -124 -68 -59 1 -85 -69 -62 -106 47 47 -112 42 128 254 114 -199 -135 104 50 -60
2882f0j30K36J88l77K92k72K2k4N1Q4j73J08K35j89q7J59p9J02j35k04J99O0P6
$$ -60 -190 46 234 -143 149 -123 -101 -125 -74 10 -163 -55 180 -9 -96 63 -16 86 -49 -253 -54 6 82
2905H2J27r3j24j07L44j57l0q4k11K90o1l5M6j11J08j51R9L20k70k46K00L4p7
$$ 82 209 116 -8 -115 229 72 42 -42 -253 37 -24 -59 -13 -124 -16 -167 -68 252 -18 -264 -64 -30 -107
2928a07J07OL6j88K53O5k72L23l02J03j20j07M82l73J85J10k94R1j2q0j06pN30
$$ -107 0 6 42 -146 107 172 -100 223 -79 24 -96 -203 279 -94 91 201 -93 -2 -14 -94 -200 -207 323
2951C23j37k46m1L4M1K27j48j06L92k99K6J88n22K01L35m02j8L59L9l64M5K16
$$ 323 186 -60 -101 -67 -26 201 53 -53 339 40 66 254 -268 -67 268 -134 -152 207 246 -118 -73 143
2973A43n0%J68l66J35j50J31j3J7Kj4J91j78Q9l2o7M4J81j86p5J24k35L44j39
$$ 143 93 93 261 -105 30 -120 11 -2 15 17 3 194 16 105 73 6 50 231 45 -30 94 -141 203 64
2997F4j0R8k39L67j03K0l38nJ50J21j53L7N7l4p6l0k27R2M08j55l1o3K90l22P3
$$ 64 54 152 -87 280 177 197 -141 -146 4 125 -28 9 66 32 -44 -74 -301 -209 199 44 13 -50 240 -82 -9
3022il6K35l21J41j59n4M10j80n9J8J10l7R3j55j66J19j96J16J68j35j46P3K30
$$ -9 -45 190 -131 10 -149 -203 207 27 -32 -14 96 59 152 -3 -169 -50 -246 -130 38 -97 -243 -170 60
3045F0j83K47l35K51J9j20J15j1k08J31N1N6j27J97j28J59j13j60K37o5j14L11
$$ 60 -123 124 -211 40 59 -61 54 43 -165 -34 17 73 -54 143 15 174 61 -99 138 73 -41 270
3067B70j56m24N69k28K03k73l1n8M9L32r0k62J69j22K26k82J62r2kO9m4L2j19
$$ 270 114 -310 259 31 234 -39 -70 -128 -79 253 163 -99 70 -52 174 -108 54 -38 -40 29 -15 17 -102
3090a02J21J12j58p9j09L56k29j56K64n5O3N3j25J8L1j28J70p0J1p3R8l9k47K69
$$ -102 19 131 -27 -106 -215 141 -88 -244 20 -35 28 81 -44 -26 5 -123 47 -23 -12 -85 13 -26 -273 -4
3114dk3j8L05l22J56J12j25J25j47J07n8j95Q0J54k4k02p4J95J28k20l7K15k60
$$ -4 -27 -45 260 -62 94 206 81 206 59 166 108 -87 -7 147 123 -79 -153 42 170 -50 -87 128 -132
3137a32K48q8j04K75k34m3J67j04ok34K59N9j69K00k15L18Jl34k72L33Q6k21l5
$$ -132 116 28 -76 199 -35 -78 89 -15 -21 -255 4 63 -106 94 -121 197 198 -136 -408 -75 11 -210 -245
3160b45M88k25k89L15p5L7L9J04l14L58j74J00J83n14L92j89J3j72K31j69K81
$$ -245 243 18 -271 44 -31 6 45 149 -165 193 19 119 302 -212 180 -9 4 -168 63 -106 175
3181A75r3k53K74j25p5J96p2l4k8K3J25k88L10m36L01j55Q9l2K34l72L56k33K87
$$ 175 82 -171 103 -22 -97 99 27 -7 -35 -12 113 -175 135 -301 0 -155 -66 -98 136 -236 120 -113 174
3204A74Lj09j38K48j37k28K4l9M37j98j90Q4J71j61j28J26J01q3R8q0O7k07K53
$$ 174 177 68 -70 178 41 -187 -163 -202 235 37 -153 -69 102 -59 -187 -61 40 -43 55 -25 42 -165 88
3227H8j88K35j04N4n4k45K44J48m3k71L9O9K2j22O9l8K40j86J62j57K9K39k06
$$ 88 -100 135 31 85 31 -214 30 178 135 -136 -97 -28 -6 -128 -59 -97 143 -43 119 -38 -9 230 24
3250B4J16k10rj40L83k09J59k18K87j40k99L68j69K46n0k30Q8J63r1j67p3N7J16
$$ 24 140 -70 -79 -219 164 -45 114 -104 183 43 -256 112 -57 189 139 -91 -3 160 69 -98 -171 -114 2
3273BQ2k09K00j00K74j97k07K17J42j01l68J97K26l8O8j60q7n6l2J11k1J70k2
$$ 2 84 -125 75 -25 249 52 -155 62 204 103 -265 -68 158 120 188 28 -59 -115 -147 -36 -57 113 91
3296I1p9R5r7J48rj40k18L22j7j9l05j3L98k58j14k5K71J1l9j20r1K04j47P8p6
$$ 91 12 107 10 158 149 9 -209 113 96 77 -228 -241 157 -101 -215 -240 31 42 3 -117 -208 -4 -151 -73 -149
3321a49J43k0L96l67N3l9n0Q0k19K13L2J02k18j8p6K96j67N8l4N5P1j67m1l0K19
$$ -149 -6 -26 370 3 56 17 -33 47 -172 41 73 175 -43 -61 -137 159 -8 50 16 71 142 -25 -66 -96 123
3346A23j81r9K52j69K30k41L9j24K4n4K59j12P2L16l19k8k56J11K98l00L59k51
$$ 123 -58 -157 95 -74 156 -85 -46 -170 -146 -200 59 -53 19 335 16 -12 -268 -157 141 -159 200 -51
3368e1J26j21J5J62p8N6j67j69J72ML5j80L01l43J96j6MJ38j49K99m78N27m66
$$ -51 75 -46 -31 131 53 109 -58 -227 -55 -51 -16 -196 105 -238 -42 -58 -54 84 -65 234 -244 283 -183
3391a83JM3J69Q2l12M5O2j8N5J13j75l9M4K4K39l63L94R7l92K72k07J82o3J15
$$ -183 -182 -139 30 112 -200 -155 -93 -111 -56 57 -118 -157 -113 -89 150 -213 181 278 -114 158 -49 133 70 185
3415A85m71L92j74O5R6r8k73K90J86m6m23K61K66ql26j07M41k59j6q6J05l9p4
$$ 185 -286 106 -68 -3 93 -5 -278 12 198 152 -271 -10 256 248 -78 -185 256 -3 -19 -105 0 -39 -113
3438a13M7J61J40Rn9j68R3j99J76j92M3K01l04L18k4k7Q1p8n4j51k3K09k23pJ10
$$ -113 -66 95 235 244 185 17 110 -89 87 -105 -62 139 -165 153 129 102 183 105 51 -100 -123 86 -137 -144 -34
3463c4K8K0k13L15k61L3j90M42k10J03Q7j71K56l71K84j31R0N9k27K52l05J04
$$ -34 -6 14 -199 116 -145 -112 -302 140 -70 33 120 -51 205 -166 118 -13 77 136 -91 161 -144 -40
3485d0J29j18J42j17j55K95j21L79n65RJ36j40K57j55J87j42m8R9k17r3L53j49
$$ -40 89 -29 113 -4 -159 136 15 394 -171 -162 -26 -166 91 -64 123 -19 -67 32 -185 -278 75 -74
3507g4P6r5J38q7P2j3n0p7J34j5M7J75l15j70M74k50J50Q4j55O5p9L9k2q9M1j46
$$ -74 2 -93 45 -42 30 17 -33 -110 24 9 56 231 -84 -254 220 -30 120 204 49 114 35 74 52 -37 4 -142
3533a42K85r4l9K28j26j87K57j84K9M7L4J02m03K97R4o5k68J38j54J36Q4J10k26
$$ -142 143 49 10 238 112 -75 182 -2 27 74 108 210 -193 104 198 133 -135 3 -151 -15 69 179 -47
3556d7k2j83J12J6J18K64N2j19k8k13J05l3k4J82J30j46n7j98K30Q7l90L60l96
$$ -47 -69 -252 -140 -124 -6 258 310 191 163 -50 55 22 -2 180 310 164 107 -91 139 226 -164 196 -200
3579b00J43P6m1J63k85J34M8m6q3k11K61J36M9n9l10K36k5j31J8L83k72n5J16
$$ -200 -57 19 -22 141 -144 -10 38 -8 -91 -302 -41 95 144 85 -225 11 -14 -145 -127 256 -16 -71 45
3602D5r3N2j2j2N4k2J32j53p7o5L87j75n5kK01k53K7k3k1l8n2K0J94n8o3O3N3
$$ 45 -48 4 -8 -20 34 12 144 -9 -86 -151 236 61 6 4 205 -48 -21 -44 -65 -103 -155 -135 59 1 -62 1 54
3629E4j12j6K2k09N18Qn2j75M7l61K48J97p3k24K81j32j45L55l57J15J04r8m00
$$ 54 -58 -74 -52 -261 257 265 213 38 85 -276 -28 169 96 -128 153 21 -124 231 -126 -11 93 -5 -405
3652d05M01J4k51J71k6J08j81J63O0j19o4j42J01K86j35J67p4n8m4K6k5%n0J06
$$ -405 -4 10 -241 -70 -96 12 -169 -6 54 -65 -129 -271 -170 116 -19 148 74 16 -28 -2 -27 -27 -77 29
3676B9k17K4K79N0l09K81j19j10J9n8J89j28K05r2j51K41j30PR3oo8K07l01K15
$$ 29 -188 -164 115 165 -144 137 18 -92 -73 -131 58 -70 135 43 -108 133 3 10 103 97 29 236 -65 150
3700A50j80J98L3j39j74R3j31R1o4J8r8L14M3r1mN4N2m04K92N6k75K14j8r8o6
$$ 150 -30 168 201 62 -112 -19 -150 -59 -123 -105 -203 111 154 63 59 113 165 -239 53 109 -166 48 30 -68 -134
3725a34J50n0K44j39k02M52m75J3J4K30m9n3J53k31j05J16j37K70J78l01k03J44
$$ -134 16 -34 210 71 -131 321 -154 -141 -127 103 54 1 154 -77 -182 -66 -203 67 245 -56 -259 -115
3747a15J08O8N8j1n0pj35J51k1l58K10KL06m93K81J13k05L16l51P9N4k47K45j08
$$ -115 -7 61 119 108 58 51 -84 67 46 -312 -102 -100 206 -287 -6 107 -98 218 -133 -54 0 -247 -2 -110
3771a10K40l54K13k47K67K07j1k25l0P8J8j80J70K36j79k83O8R0j41J86k3J46
$$ -110 130 -224 -11 -258 9 216 205 -20 -50 28 46 -134 36 272 93 -190 -122 -32 -173 13 -10 136
3793A36j54j1J40n6j52J16J5j32j91J16M4J9l4P1K2J88j71n1j53K59k03J46q7
$$ 136 -18 -29 111 55 -97 19 34 -98 -289 -173 -129 -110 -144 -73 -51 137 -34 -85 -238 21 -182 -36 -123
3816a23M3J37j83j13K90p4Q6l73J33L43j99P4Q2j1R4j98j51rK38m2L9R5m85O14
$$ -123 -80 57 -126 -239 51 -23 63 -310 -177 166 -33 41 123 112 206 8 -143 -152 86 44 83 178 -307 307
3840C07n8q4j78J89j34n7n0K11q4q5K50j87L0k55J06M8J12k08K88j57j18M17m65
$$ 307 249 165 -13 176 42 -15 -65 146 62 -23 227 40 70 -185 -79 -31 81 -127 161 4 -114 303 -162
3863a62O2J56l3N8k14p9L25k22o1J56k78J57K93j30j5r8K35k0j46n8M7k6J35J24
$$ -162 -100 56 23 81 -133 -212 113 -109 -170 -14 -292 -135 158 28 13 -85 150 130 -16 -74 -27 -53 82 206
3887B06l70O5J77K38k15j63J12N5LJ08j91n8K6j14J56l05K23M0k17K67L3Nk00
$$ 206 -164 -99 78 316 101 -62 50 105 108 216 25 -33 -7 -121 35 -270 -47 -7 -224 43 76 81 -119
3910a19K08q6K34L7k12n1j98J83K50l10J07j15K32j22J04k11n6O5J43J39n87J14
$$ -119 89 3 237 274 62 11 -187 -4 246 -64 43 -72 160 38 142 -69 -125 -60 83 222 -365 -251
3932b51K00n3j53M14o7j05J95k96J59J43k78j0J66k70K17j46NK31J26Nj78j65
$$ -251 -51 -104 -257 157 90 -15 180 -116 43 186 -92 -102 64 -206 11 -135 -130 101 227 232 54 -111
3954a11J26J83k51L2K03n1m31N06o5m6j08j05m9K45j95K17l19J94j00M25k33j65
$$ -111 15 198 -53 -21 182 131 -300 206 141 95 -13 -118 -167 78 -117 100 -219 -25 -125 300 67 -98
3976i8q8R0K7J50j1Nj15K02j03j29J5L16r1l83J26N1j09J13j57J66J88q5k16J61
$$ -98 -186 -96 -69 81 70 75 -40 162 59 -70 -55 261 170 -213 -87 -36 -145 -32 -189 -23 165 80 -136 25
4000B5K6p0J20k9Ok33l4j87O61n7l73P0k2K45k15K67k63P5J18q6L2j66o3J67j8
$$ 25 51 -19 101 72 78 -155 -189 -376 285 228 -145 -75 -97 148 -67 200 -63 12 130 44 76 -90 -153 14 -4
4025dJ62n7K6l32K78l6J18n7k32L36j70n9L86j74l24J09J86j39j54J16R1j69O2
$$ -4 158 101 127 -205 73 37 155 98 -134 202 32 -27 359 185 -139 -30 156 17 -137 -21 70 -99 -37
4048c7NJ5l4J37j39j39R1K08j79J08qJ20l17K3L28j33L7k56K95k22K68l57J40
$$ -37 -32 -17 -51 86 -53 -192 -101 107 -72 36 28 148 -169 -146 182 49 86 -170 125 -97 171 -186 -46
4071d6q5Q6j7j7j4J10j63K25J1o5P2J93n03J19N3Qqo3K58J64j39j90J63j39j72
$$ -46 -131 -45 -62 -79 -93 17 -146 79 90 25 97 290 -213 -94 -41 -33 -41 -104 154 318 179 -11 152 13 -159
4096a59p3K95l59K05J06r4J44n4j12J25j38N0Pj46J90o1Q0m7P5l68O66k33k74
$$ -159 -232 63 -296 -91 15 -79 65 11 -101 24 -114 -64 -57 -203 -13 -74 6 -41 34 -334 332 99 -175
4119a75R3Q2k69K92o0K55l21r3L75l44J98j18N7K34j81p5N9J82l20J79q9o0p6
$$ -175 -82 0 -269 23 -37 218 -103 -196 179 -165 33 -85 -28 206 25 -50 9 191 -129 50 -39 -99 -175
4142a75J37KN0l3nj38l6J88j04m9J76j7p2Q8M3K71o09L90O2k18J60Pj63j19K56
$$ -175 -38 -36 14 -19 -24 -162 -198 -10 -114 -163 13 -4 -76 12 55 326 -283 107 169 -49 111 118 -45 -164 92
4167I2j55R4m31L99J47k51J34J6j01Q8nK36l04J70r6l2J42k44K48j67j61K2J53
$$ 92 -63 31 -400 -1 146 -105 29 45 -56 32 27 263 -41 129 33 1 143 -101 147 -20 -181 -159 -6
4190fj37J54m12L23N0J50K70l92j6n4L02k07j24K53j22n5p1K85q9k48J29j72L51
$$ -6 -143 11 -401 -78 -28 122 392 0 -16 -70 232 25 -99 154 32 -23 -94 191 102 -146 -17 -189 162
4213A62o6P4j52m01L97l3j37L27j13r6j9J06Q5J93r7k69M13m44J07k44N0N2J41
$$ 162 96 170 18 -383 14 -19 -156 171 58 -38 -57 49 134 327 230 -39 374 -70 37 -207 -157 -105 36
4236C6L75j4n2l38n0K20l11J89j09P3r0J05m1K8p8J73J2n9o8n2j35M42m77q9L55
$$ 36 411 397 345 7 -43 177 -134 55 -54 19 -71 34 -7 21 -57 116 128 69 1 -51 -186 256 -221 -310 45
4261D5j66K51j59J08jk74N14l34j06P9K03j27j90K52Mj42L7Nk04M55m20k1L20
$$ 45 -121 130 -29 79 78 -196 318 -16 -122 -43 160 33 -157 95 99 -43 -6 -1 -205 250 -170 -191 129
4284A29j10Q8m3R3l66K24J76o5M2j36j76J81r5J0J05J28q5q7J08k0O9p4j76M1
$$ 129 19 107 64 157 -209 15 191 126 168 32 -144 37 -58 -48 57 185 100 13 121 101 170 96 -80 -39
4308c9rj03J89N7L00p28M48j46k1r7J69k16K93lj71L54j85n9P7j70K29m65J15
$$ -39 -48 -151 38 95 395 -333 115 -31 -52 -149 20 -196 97 94 -77 277 92 33 110 -60 169 -296 -181
4331a81M20j90p7L5m3M78k98k92L28Nj10J80k85M0l4J21j43R2j14K87j96k1L0
$$ -181 239 49 -28 7 -36 442 144 -148 180 185 75 255 -30 10 -24 97 -46 46 -68 219 23 2 32
4354C2J95l39L77m27L18r6rk29J64r1J74r4j80L43k46q5J43K44k12L7O8k43J34
$$ 32 227 -112 265 -162 156 60 51 -178 -14 -105 69 -25 -205 138 -108 -193 -50 194 -18 19 87 -156 -22
4377b2k20K37K40j96m4J39J05l90J98r2J25j58J03j35K69j77k78N0J84J60K7n2
$$ -22 -242 -5 235 39 -5 134 239 -151 47 -45 80 -78 25 -110 159 -18 -296 -246 -62 98 125 73
4399G3k27M20l44P8j9K05N3l05J67J0k85L89k56K7k0j00J23M1k7O2j74m8J3M9
$$ 73 -154 266 -78 0 -19 186 239 -66 101 111 -174 215 -41 -14 -34 -134 -11 30 3 65 -109 -157 -144 -95
4423i5O4J29J28k12J99k0k15q2L7l53M43J5M13m20J92k12l3k1K09j74j10k13L12
$$ -95 -31 98 226 14 213 193 -22 -104 -67 -420 23 38 451 31 223 11 -22 -43 166 -8 -118 -331 -19
4446a9P8j72M32l48q3J26m5OJ6j10J03l9J40l35J37J86j27n7Q7K44m31M06k41
$$ -19 59 -113 319 -29 -112 14 -31 -25 -9 -119 -16 -55 85 -250 -113 73 -54 -111 -24 220 -211 195 -46
4469d6j45L68l23Q6K10o9P2j14j37K47k01J92j02J7k37K26j53K86l07L39j76K5
$$ -46 -191 177 -146 -60 150 81 153 39 -98 149 -52 140 38 55 -182 44 -109 177 -130 209 33 58
4491E8K33l84K82j62j2l13J98J05J79l09K3O2J33L8l8j5jJ52l84J36k01L71m03
$$ 58 291 -93 189 27 15 -298 -100 5 184 -125 -102 -40 93 131 93 78 77 229 -155 -19 -220 151 -252
4514b52L70J9k15K40l45J12K98j32k71M33m07J12N2j9j48M98l69K7N0j16M0j14
$$ -252 118 137 -78 162 -183 -71 227 95 -176 257 -150 -38 14 -5 -153 345 -24 3 53 -63 -23 -137
4536a37J00L3l8m4O3J99k68J28l99K04L72l51r7L85k60q3M37j92j3j83J87r5L1
$$ -137 -37 -4 -42 -86 -23 176 -92 36 -363 -159 213 -138 -235 150 -110 -193 244 52 39 -144 43 -52 -21
4559b1m5q2K18n0j3n0K8R0j59J40r0J10r1j07l3M0L33l38l6J93m8L7L04k36k64
$$ -21 -66 -148 70 20 7 -43 -15 75 -84 56 -34 76 -15 -122 -155 -115 218 -120 -156 37 -11 26 330 94 -170
4584a70J70k9Rj17K38j26j10L6k7Q2l8J49Q3p4Lj13K14j01k40N7J35J32j29j23
$$ -170 0 -29 -20 -137 101 -25 -135 -99 -126 -44 -82 67 150 76 79 -34 180 79 -161 -104 31 163 34 -89
4608h9L74m84L43j86l12K96j83M12k09K37j65o8l94K45M27j80q3k31J49J50j45
$$ -89 285 -199 144 -42 -354 -58 -241 171 -38 199 34 -34 -428 -183 244 64 -19 -250 -101 49 -96
4629i6P9K14j15k53J7L71j86K1J31j72K22k62J11p5J05q0k59j86K42J71p2K1J08
$$ -96 -17 197 82 -171 -154 217 31 52 183 11 233 -29 82 7 112 32 -227 -413 -171 0 -72 -51 57
4652E7J26O2m05J22J06Lj11J0n7J68P8l24J95J8J8L2L3L7k74J36l96M65k49K32
$$ 57 183 245 -160 -38 68 71 -40 -30 -87 81 159 -165 30 48 66 98 131 168 -106 30 -366 99 -150 82
4676H2r1K3l50K92l0K70j37J9j09Q0K24m46K38p4K9O8l14J76Lo1J90N5l4l59L59
$$ 82 -9 14 -336 -44 -74 196 59 78 -31 49 273 -173 65 -9 20 88 -226 -50 -47 -108 82 137 103 -256 103
4701A03j56P0Q8o0j40J47M3J61j15o6r7P4k25J04j75Q8K94k57K16m6j01J32j92
$$ 103 -53 17 105 45 -95 52 95 256 141 75 -22 52 -173 -69 -244 -156 138 -119 97 51 -50 82 -110
4724a10L14l7n1q3r8J09L86m65K41l56K33j17R1PN0j10k31K42j12q0K19M3j81
$$ -110 204 167 116 33 -65 44 430 -35 206 -150 83 -34 57 64 114 4 -227 15 -97 -177 42 85 -96
4747i6P4j4j95J68Q5k03K8K9J51nJ31r3N4J12k65j5N1j1K7P6n1p1j10L27l53K09
$$ -96 -22 -36 -231 -63 22 -181 -153 -124 27 22 153 60 114 226 -39 -54 -3 -14 13 89 38 -33 -143 184 -169 40
4773D0M1Kk38p6j18K94K07l43K48L14k31j06q6K44q5Q7j58l2K6j42k77K71L44
$$ 40 81 83 -155 -231 -349 -55 152 -191 57 371 140 34 -52 192 107 194 36 4 30 -112 -389 -118 226
4796B26k42K23k13J04j6l5l51L70r9J20m6k40K24l7p0k6j32L39m3J5o4R1k53K14
$$ 226 -16 207 -6 98 82 47 -304 66 -33 87 41 -199 25 -12 -82 -108 -240 99 56 71 7 98 -155 59
$$ [...]
8191A72
##END NTUPLES=NMR FID
##END=
