##TITLE=1H_ES-APTMS-70%
 D2O
 8 sc, 
 9.4.2024
##JCAMPDX= 6.0         $$ Bruker NMR JCAMP-DX V2.0
##DATA TYPE= NMR FID
##DATA CLASS= NTUPLES
##ORIGIN= UXNMR, Bruker Analytische Messtechnik GmbH
##OWNER= root
$$ XWIN-NMR		Version 3.5
$$ Tue Apr  9 14:33:40 2024 Russian Standard Time (UT+4h)  she@DPX200
##.OBSERVE FREQUENCY= 200.1309
##.OBSERVE NUCLEUS= ^1H
##.DELAY= (6, 6)
##.ACQUISITION MODE= SIMULTANEOUS
##.ACQUISITION SCHEME= undefined
##.AVERAGES= 8
##.DIGITISER RES= 18
##SPECTROMETER/DATA SYSTEM= spect
##.PULSE SEQUENCE= zg30
##.SOLVENT NAME= CDCl3
##.SHIFT REFERENCE= (INTERNAL, CDCl3, 0, 15.7039)
##AUDIT TRAIL= $$ (NUMBER, WHEN, WHO, WHERE, WHAT)
$$ ##TITLE= Audit trail, XWIN-NMR		Version 3.5
$$ ##JCAMPDX= 5.01
$$ ##ORIGIN= Bruker BioSpin GmbH
$$ ##OWNER= she
$$ F:/spectra/data/she/nmr/H-F/1/audita.txt
$$ ##AUDIT TRAIL=  $$ (NUMBER, WHEN, WHO, WHERE, WHAT)
(   1,<2024-04-09 14:32:40.73 +0400>,<she>,<DPX200>,
      <created by zg, POWCHK disabled, PULCHK disabled
       configuration hash MD5:
       00 E9 B6 7A A2 85 ED C7 34 08 36 98 17 FE 4E 26
       data hash MD5: 16K
       B4 14 03 88 3E B1 BB 3A 28 79 B2 F6 0C CA 7E B1>)
$$ ##END=
$$ 
$$ hash MD5
$$ 06 EC 63 3B C5 AB 03 D8 A3 18 3E DD 7B 2A 54 8A
##$RELAX= 
##$RELAX= 
##$RELAX= 
##$RELAX= 
##$RELAX= 
##$RELAX= 
$$ Bruker specific parameters
$$ --------------------------
##$DU= <F:/spectra>
##$EXPNO= 1
##$NAME= <H-F>
##$PROCNO= 1
##$TYPE= <nmr>
##$USER= <she>
##$AMP= (0..31)
100 100 100 100 100 100 100 100 100 100 100 100 100 100 100 100 100 100 
100 100 100 100 100 100 100 100 100 100 100 100 100 100 
##$AQSEQ= 0
##$AQ_mod= 1
##$AUNM= <au_zg>
##$AUTOPOS= <>
##$BF1= 200.13
##$BF2= 200.13
##$BF3= 200.13
##$BF4= 200.13
##$BF5= 200.13
##$BF6= 200.13
##$BF7= 200.13
##$BF8= 200.13
##$BYTORDA= 1
##$CFDGTYP= 0
##$CFRGTYP= 5
##$CHEMSTR= <none>
##$CNST= (0..31)
1 1 145 1 1 1 1 1 1 1 1 1 1 1 1 1 1 1 1 1 1 1 1 1 1 1 1 1 1 1 1 1 
##$CPDPRG= <>
##$CPDPRG1= <>
##$CPDPRG2= <>
##$CPDPRG3= <>
##$CPDPRG4= <mlev>
##$CPDPRG5= <mlev>
##$CPDPRG6= <mlev>
##$CPDPRG7= <mlev>
##$CPDPRG8= <mlev>
##$CPDPRGB= <>
##$CPDPRGT= <>
##$D= (0..31)
0 1.2 0 0 0 0 0 0 0 0.06 0 0.03 0 0 0 0 0.0002 0 0 0 0 0 0 0 0 0 0 0 0 
0 0 0 
##$DATE= 1712658760
##$DBL= (0..7)
120 120 120 120 120 120 120 120 
##$DBP= (0..7)
150 150 150 150 150 150 150 150 
##$DBP07= 0
##$DBPNAM0= <>
##$DBPNAM1= <>
##$DBPNAM2= <>
##$DBPNAM3= <>
##$DBPNAM4= <>
##$DBPNAM5= <>
##$DBPNAM6= <>
##$DBPNAM7= <>
##$DBPOAL= (0..7)
0.5 0.5 0.5 0.5 0.5 0.5 0.5 0.5 
##$DBPOFFS= (0..7)
0 0 0 0 0 0 0 0 
##$DE= 6
##$DECBNUC= <off>
##$DECIM= 32
##$DECNUC= <off>
##$DECSTAT= 4
##$DIGMOD= 1
##$DIGTYP= 9
##$DL= (0..7)
0 120 120 120 120 120 120 120 
##$DP= (0..7)
150 150 150 150 150 150 150 150 
##$DP07= 0
##$DPNAME0= <>
##$DPNAME1= <>
##$DPNAME2= <>
##$DPNAME3= <>
##$DPNAME4= <>
##$DPNAME5= <>
##$DPNAME6= <>
##$DPNAME7= <>
##$DPOAL= (0..7)
0.5 0.5 0.5 0.5 0.5 0.5 0.5 0.5 
##$DPOFFS= (0..7)
0 0 0 0 0 0 0 0 
##$DQDMODE= 0
##$DR= 18
##$DS= 0
##$DSLIST= <SSSSSSSSSSSSSSS>
$$ [...]
##$SUBNAM2= <"">
##$SUBNAM3= <"">
##$SUBNAM4= <"">
##$SUBNAM5= <"">
##$SUBNAM6= <"">
##$SUBNAM7= <"">
##$SUBNAM8= <"">
##$SUBNAM9= <"">
##$SW= 18.0517689322627
##$SWIBOX= (0..15)
0 0 2 0 0 0 0 0 0 0 0 0 0 0 0 0 
##$SW_h= 3612.71676300578
##$TD= 16384
##$TD0= 1
##$TE= 0
##$TE2= 300
##$TE3= 300
##$TEG= 300
##$TL= (0..7)
0 120 120 120 120 120 120 120 
##$TP= (0..7)
150 150 150 150 150 150 150 150 
##$TP07= 0
##$TPNAME0= <>
##$TPNAME1= <>
##$TPNAME2= <>
##$TPNAME3= <>
##$TPNAME4= <>
##$TPNAME5= <>
##$TPNAME6= <>
##$TPNAME7= <>
##$TPOAL= (0..7)
0.5 0.5 0.5 0.5 0.5 0.5 0.5 0.5 
##$TPOFFS= (0..7)
0 0 0 0 0 0 0 0 
##$TUNHIN= 0
##$TUNHOUT= 0
##$TUNXOUT= 0
##$USERA1= <user>
##$USERA2= <user>
##$USERA3= <user>
##$USERA4= <user>
##$USERA5= <user>
##$V9= 5
##$VALIST= <valist>
##$VCLIST= <CCCCCCCCCCCCCCC>
##$VD= 0
##$VDLIST= <DDDDDDDDDDDDDDD>
##$VPLIST= <PPPPPPPPPPPPPPP>
##$VTLIST= <TTTTTTTTTTTTTTT>
##$WBST= 1024
##$WBSW= 4
##$XGAIN= (0..3)
0 0 0 0 
##$XL= 0
##$YL= 0
##$YMAX_a= 128002
##$YMIN_a= -116206
##$ZGOPTNS= <>
##$ZL1= 120
##$ZL2= 120
##$ZL3= 120
##$ZL4= 120
##$ABSF1= 10
##$ABSF2= 0
##$ABSG= 5
##$ABSL= 3
##$ALPHA= 0
##$AQORDER= 0
##$ASSFAC= 0
##$ASSFACI= 0
##$ASSFACX= 0
##$ASSWID= 0
##$AUNMP= <proc_1d>
##$AZFE= 0.1
##$AZFW= 0.1
##$BCFW= 1
##$BC_mod= 2
##$BYTORDP= 1
##$COROFFS= 0
##$CY= 11.3945322036743
##$DATMOD= 1
##$DC= 2
##$DFILT= <>
##$DTYPP= 0
##$F1P= 15.7292609196834
##$F2P= 12.9074282941183
##$FCOR= 0.5
##$FTSIZE= 0
##$FT_mod= 4
##$GAMMA= 1
##$GB= 0.15
##$INTBC= 1
##$INTSCL= 1
##$ISEN= 128
##$LB= 0.24
##$LEV0= 0
##$LPBIN= 0
##$MAXI= 10000
##$MC2= 0
##$MEAN= 0
##$ME_mod= 0
##$MI= 1.114404
##$NCOEF= 0
##$NC_proc= 0
##$NLEV= 6
##$NOISF1= 3.799351
##$NOISF2= 2.8
##$NSP= 1
##$NTH_PI= 0
##$NZP= 0
##$OFFSET= 15.70392
##$PC= 1
##$PHC0= -25462.73
##$PHC1= 13.58731
##$PH_mod= 1
##$PKNL= yes
##$PPARMOD= 0
##$PSCAL= 0
##$PSIGN= 0
##$REVERSE= no
##$SF= 200.130013532006
##$SI= 16384
##$SIGF1= 3
##$SIGF2= 2
##$SINO= 400
##$SIOLD= 16384
##$SREGLST= <1H.CDCl3>
##$SSB= 0
##$STSI= 0
##$STSR= 0
##$SW_p= 3612.71676300578
##$SYMM= 0
##$S_DEV= 0
##$TDeff= 0
##$TDoff= 0
##$TI= <>
##$TILT= no
##$TM1= 0
##$TM2= 0
##$TOPLEV= 0
##$USERP1= <user>
##$USERP2= <user>
##$USERP3= <user>
##$USERP4= <user>
##$USERP5= <user>
##$WDW= 1
##$XDIM= 8192
##$YMAX_p= 0
##$YMIN_p= 0
$$ End of Bruker specific parameters
$$ ---------------------------------
##NTUPLES= NMR FID
##VAR_NAME=  TIME,          FID/REAL,        FID/IMAG
##SYMBOL=    X,             R,               I
##VAR_TYPE=  INDEPENDENT,   DEPENDENT,       DEPENDENT
##VAR_FORM=  AFFN,          ASDF,            ASDF
##VAR_DIM=   8192,          8192,            8192
##UNITS=     SECONDS,       ARBITRARY UNITS, ARBITRARY UNITS
##FACTOR=    0.0002768,     1,               1
##FIRST=     0,             0,               0
##LAST=      2.2672688,     0,               0
##MIN=       0,             -116206,         0
##MAX=       2.2672688,     128002,          0
$$ Real data points
##PAGE= N=1
##DATA TABLE= (X++(R..R)), XYDATA
$$ [...]
2358C624m11j558k113j850j067K4J198J987K074J350J22q70j797k025j599o47
2374c558O92J649K043J767Q62l19j387k092j794j237J8J193J891J931J407L79
2390C445q09j871k067j589n24N25J560J963J809R65k53j299k041j881j153n5R45
2407b330J934K034J419L68q72j703j877j634p53N08J523K030J712R45k02j219
2423A883j856j958j224j82J077J889J820J381N06o92j577k059j576p41M56J386
2439a467J834J867J018r3j229j904j808j169k39Q81J653K016J430N00o44j523
2455A123j899j624q92L83J266K018J708J063n4j120j780j853j285k55Q44J634
2471g23J930J395O25n82j393j949j705p96L27J250J831J726J073J56j075j790
$$ y = [3624, 3213, 1655, -458, -2308, -3375, -3351, -2153, -166, 1908, 3258, 3380, 2510, 713, -1312, -2911, -3558, -2866, -1217, 826, 2593, 3455, 3136, 1749, -343, -2137, -3374, -3356, -2163, -272, 1659, 3066, 3445, 2636, 765, -1302, -2891, -3415, -2890, -1330, 633, 2442, 3407, 3154, 1855, -186, -2067, -3220, -3275, -2330, -396, 1638, 3057, 3425, 2553, 850, -1027, -2661, -3414, -2906, -1383, 647, 2359, 3304, 3102, 1883, 27, -1931, -3155, -3337, -2260, -371, 1449, 2830, 3336, 2644, 1067, -992, -2568, -3309, -2853, -1467, 367, 2234, 3252, 3159, 1930, 26, -1782, -2951, -3190, -2309, -656, 1360, 2790, 3290, 2646, 1123, -776, -2400, -3292, -2909, -1643, 375, 2083, 3146, 3092, 1972, 192, -1661, -2946, -3201, -2357, -723, 1207, 2602, 3227, 2645, 1252, -697, -2402, -3198, -2871, -1621, 210, 1936, 3009, 3165, 2090, 300]
2487C00j839j259l54P75J550J953J477O21n50j409j841j643r09J72J211J824J771
2504A850J117O9r63j607j874j360l63P08J541J823J554O21m32j281j878j707q60
2521c042J33J180J686J736J148J83q75j654j804j231n25O80J365J820J633O16
2537C049l54j305j779j564r03o1J091J714J751J078K80q55j518j783j398m95N15
2554b537J515J773J480P23k63j205j622j769j028Q9R72J597J708J242K73o76j586
2571F86j776j326n04M85J248J797J498Q20j92j163j675j625j041r5R37J627J698
2588A399J186K86o84j408j686j394o66M12J333J742J466Q09j33j046j609j679
2604a672j024j40R26J509J586J243M61n51j474j689j405o50M16J227J622J529
$$ y = [300, -1539, -2798, -3152, -2377, -827, 1126, 2603, 3224, 2674, 1265, -576, -2219, -3128, -2956, -1745, 79, 1850, 2967, 3036, 2073, 466, -1408, -2768, -3131, -2423, -882, 941, 2495, 3116, 2684, 1403, -475, -2182, -3042, -2909, -1729, -43, 1693, 2841, 3024, 2149, 495, -1309, -2540, -3065, -2385, -1020, 800, 2433, 3049, 2695, 1390, -389, -1953, -2856, -2917, -1826, -112, 1639, 2717, 2997, 2142, 624, -1159, -2557, -3052, -2537, -1022, 751, 2231, 2954, 2691, 1486, -136, -1905, -2933, -2844, -1872, -275, 1433, 2675, 2948, 2272, 686, -1090, -2416, -2920, -2435, -1187, 610, 2108, 2928, 2736, 1573, -102, -1727, -2768, -2863, -1926, -299, 1399, 2585, 2871, 2187, 779, -907, -2301, -2967, -2555, -1222, 520, 1986, 2795, 2662, 1616, 7, -1672, -2696, -2836, -1910, -401, 1185, 2428, 2889, 2338, 864, -825, -2230, -2880, -2464, -1237, 385, 1914]
2620A914R05j29j021j597j567j146j79P82J507J694J269L67n39j322j613j446
2636b121o74K84J157J671J470R08q5r20j503j697j108j15P55J412J562J292N31
2653B819m40j327j730j412o09K43J033J604J501R58Oq92j527j550j116k84O67
2670b056J342J673J309M89m48j284j517j390q38K38J007J608J477Q73J36q37j439
2687C43j593j177k33N93J370J553J217N94l27j206j556j489o78J26R62J449J544
2704A492J033N5p61j430j574j110l64N64J248J581J284O53m01j130j540j354p45
2721b499k0R48J538J493R78P0o79j363j513j170m16N71J260J474J277O04k70j032
2739A251j513j396q50J07Q58J361J432J104K50p33j336j481j113m62L62J217J552
$$ y = [1914, 2819, 2690, 1669, 72, -1495, -2641, -2820, -2038, -531, 1163, 2432, 2799, 2260, 938, -675, -2121, -2795, -2511, -1354, 317, 1787, 2695, 2610, 1690, 187, -1510, -2618, -2733, -1978, -566, 996, 2288, 2819, 2379, 1052, -678, -2090, -2699, -2456, -1423, 181, 1682, 2640, 2646, 1754, 227, -1323, -2439, -2723, -2056, -714, 959, 2268, 2757, 2309, 1025, -492, -1882, -2720, -2482, -1475, 133, 1610, 2483, 2619, 1782, 343, -1250, -2427, -2660, -2067, -697, 856, 2073, 2667, 2340, 1134, -422, -1911, -2589, -2463, -1501, -52, 1492, 2525, 2580, 1819, 389, -1185, -2295, -2659, -2095, -847, 734, 2018, 2671, 2270, 1140, -400, -1754, -2499, -2519, -1571, -33, 1460, 2438, 2508, 1829, 466, -1047, -2217, -2633, -2062, -802, 672, 1949, 2553, 2283, 1251, -262, -1658, -2508, -2401, -1543, -182, 1250, 2354, 2604, 1871, 535, -946, -2059, -2521, -2159, -942, 610]
2756F10J294O42k52r96j495j307r56RQ60J339J491J043J86n87j248j457j225n19
2774b568M31J183J420J325O62j38q97j452j450q86n8Q39J264J430J061L53n44
2791A975j236j434j235m97K93J036J460J315P59r5r38j437j318r37j05O43J352
2808c99J484J014K37m36j138j416j253n88L39J029J453J274P41m7q09j364j468
2825a347q97j18O43J254J381J185L04m37j116j409j240n34K03R19J403J365Q16
2842B375r7q22j290j330r61k43N74J235J390J109M25m04j094j339j204p06K17
2859b165R88J276J304P38P4o29j324j403r41k16N15J167J318J116N31l50r98j362
2877c61j208o24Q9Q40J238J324Q47R2p16j213j251r55l98M79J109J405J102M71
$$ y = [610, 1904, 2546, 2294, 1298, -197, -1504, -2460, -2451, -1591, -252, 1239, 2282, 2468, 1881, 633, -824, -2049, -2568, -2137, -954, 466, 1791, 2453, 2315, 1418, -34, -1484, -2370, -2428, -1589, -325, 1105, 2166, 2519, 1975, 739, -695, -1930, -2427, -2134, -1098, 362, 1677, 2436, 2341, 1403, -34, -1352, -2289, -2394, -1751, -399, 1085, 2099, 2336, 1900, 762, -654, -1907, -2495, -2156, -1127, 326, 1600, 2341, 2294, 1485, 121, -1347, -2244, -2362, -1719, -465, 916, 2101, 2405, 1968, 852, -557, -1797, -2331, -2128, -1209, 194, 1559, 2375, 2278, 1456, 166, -1164, -2125, -2368, -1794, -559, 831, 1940, 2365, 1961, 867, -472, -1676, -2382, -2165, -1177, 99, 1403, 2141, 2215, 1586, 262, -1141, -2082, -2298, -1783, -616, 702, 1818, 2349, 1999, 1001, -361, -1569, -2193, -2104, -1264, -26, 1298, 2145, 2237, 1521, 308, -943, -1898, -2296, -1817, -708, 697, 1799, 2270]
2895B270l62r02j290j222p21P8Q05J325J251Q44R2n33j238j285r93l67M52J081
2913g15J283J123N59k17r04j344j192o88Q3O53J200J318Q71J52n96j145j331q95
2931a785m23L47J082J298J125M48j43q63j146j215q52l2P61J215J300P99K31n80
2949A567j003j299j057l91L65J012J167J133O47j37q40j263j181p39j8O56J075
2966c06J270R37K30m65j069j252r66m99K66R10J276J107O44j48p18j227j171p65
2984a946j22O10J162J221Q80K99m74r40j213j057m79K11R06J217J083O76o2p30
3002A242j121j292o63j97N08J137J207R17L39l69j003j175j073m43J35P96J192
3019A37J173O74m1p15j063j164q20j38M05J081J216Q61M47l28r39j210r86o22
$$ y = [2270, 1908, 1006, -284, -1506, -2227, -2149, -1344, -19, 1232, 2076, 2168, 1635, 397, -888, -1881, -2248, -1796, -715, 568, 1691, 2250, 2033, 1129, -215, -1407, -2095, -2012, -1359, -159, 1159, 2030, 2182, 1586, 441, -890, -1785, -2208, -1861, -779, 519, 1644, 2092, 1949, 1086, -60, -1275, -2127, -2159, -1398, -183, 1117, 1916, 2147, 1567, 564, -735, -1792, -2183, -1818, -806, 361, 1494, 2141, 2004, 1164, -99, -1280, -2019, -2037, -1381, -306, 964, 1901, 2131, 1666, 597, -655, -1621, -2120, -1854, -944, 332, 1439, 2083, 1935, 1217, -10, -1181, -1946, -2068, -1458, -296, 925, 1805, 2104, 1630, 690, -523, -1580, -2059, -1848, -942, 275, 1358, 2034, 1972, 1242, 121, -1171, -1834, -2031, -1523, -386, 821, 1738, 2077, 1708, 705, -470, -1543, -1986, -1851, -1055, 137, 1310, 1984, 1943, 1228, 165, -999, -1819, -1957, -1552, -471, 745, 1606, 2053, 1725, 786, -424, -1410, -2032]
3037b032J86Q57J090J122O60N8n79j104j247q32r9M14R83J178R69M10k92r63j104
3056c25j025n51R7O80J124J105P34L4n58j022j141q16l14L95R50J177J003L38
3074A885k53p06j192j038o43J59O19J147J057P00J76n37r57j167q79k70L47R41
3092f11J084R28M93j30p49j191j019n34l9N70J084J070Q08J13n31r36j090q86
3110a566l22L51Q24J094R62N00k03o82j032j047o53m5O13J000J096P18L28n14
3128A422q28j132r26l63L11Q17J005R30N62j02o57j076j015o35p3N27R67J052
3146G86P95K18m27q43j088q01m11K37O85J097R93N06p3o10r89r76p70o8N24Q89
3166c26J015Q29K99l34q19j115q69m19J70P14J052R34N66j2n86r89j042o40j51
$$ y = [-2032, -1846, -989, 101, 1223, 1883, 1941, 1362, 258, -989, -1821, -1920, -1506, -523, 655, 1624, 2034, 1742, 779, -325, -1350, -1901, -1804, -1124, 0, 1105, 1839, 1873, 1315, 293, -848, -1664, -1978, -1583, -633, 544, 1547, 1885, 1632, 926, -266, -1304, -1947, -1788, -1169, -22, 1035, 1735, 1911, 1374, 417, -750, -1629, -1899, -1552, -611, 473, 1401, 1894, 1764, 1015, -176, -1195, -1729, -1768, -1198, -114, 956, 1764, 1877, 1346, 410, -680, -1566, -1888, -1537, -713, 381, 1343, 1843, 1640, 958, -74, -1121, -1774, -1819, -1206, -206, 890, 1608, 1936, 1422, 594, -538, -1464, -1827, -1516, -699, 306, 1236, 1798, 1696, 1039, -37, -1052, -1687, -1760, -1233, -266, 786, 1581, 1799, 1372, 529, -559, -1360, -1771, -1534, -849, 248, 1241, 1747, 1674, 1064, 75, -901, -1671, -1739, -1215, -326, 689, 1518, 1817, 1483, 664, -451, -1320, -1739, -1569, -855, 197, 1131, 1697, 1685, 1099, 110, -932, -1572, -1723]
3185a723M33Q52J024Q37L09k97q09r99r09m39J95O33J017R34N39P1n89q92j026
3204h39o92j75M72Q38R73P69L10j69p42j001r07m84J23N87J009R09O03P0m82r00
3224B72j089o45k27L86P72J019Q17L84k53o95r57r33m74J20N55Q70J018N89Q6
3243A615m82q17r51p13l08L58P33R96P83M29j65o53r20r76n12N9N85Q26Q79P21
3263A487J52m77p61j003o83l14K46P55R22Q58M14j90n81q96r18n64J6M84Q24J021
3283G92O34J18l65p33r55p11m26L13O87R58Q41L87j25n28r40q65n81l6N02P40
3303b93R63O91J83k65q15r00p91k95J81O43R11Q64M72j62n62q13q50n81l8L99
3323a058P82Q97O98L02l68p83q29q13l61J79O34Q94Q00M53mn03q11q51o41r7M33
$$ y = [-1723, -1290, -438, 586, 1423, 1732, 1435, 626, -373, -1282, -1721, -1526, -893, 124, 1058, 1597, 1668, 1079, 187, -839, -1531, -1706, -1234, -396, 577, 1346, 1656, 1487, 745, -256, -1163, -1647, -1524, -937, 72, 981, 1584, 1654, 1172, 272, -817, -1462, -1689, -1303, -531, 488, 1305, 1689, 1436, 741, -216, -1149, -1623, -1503, -948, -78, 940, 1529, 1615, 1133, 316, -635, -1348, -1656, -1298, -565, 431, 1214, 1643, 1478, 825, -95, -1071, -1583, -1524, -939, -113, 766, 1487, 1639, 1162, 401, -602, -1285, -1599, -1353, -598, 324, 1182, 1596, 1406, 825, -71, -989, -1553, -1537, -1053, -229, 792, 1426, 1544, 1179, 446, -509, -1220, -1646, -1333, -646, 312, 1153, 1540, 1415, 887, -53, -918, -1499, -1535, -1033, -293, 670, 1361, 1544, 1279, 464, -436, -1227, -1522, -1341, -698, 213, 1077, 1549, 1387, 825, 12, -838, -1419, -1457, -1058, -276, 621, 1319, 1621, 1253, 470, -359, -1172, -1533, -1354, -720, 174, 974, 1427, 1423, 920, 109, -742, -1383, -1480, -1047]
3344a047P74P92P59K44k46o74r34p30m01J60N40Q14Q18N04J23n81q27p55o22j76
3364a465L21P52Q70P79K23k84n71q32q59l61Q9N28Q16Q14N94Lm73p22q28o65k29
3385a500M07P05P98O72M16j79o49r15p32m10lO12P16Q52N48Q4m34q02p71o31k32
3406a448L19O08Q54P73K62j16o27p62q00m09l5N05Q57P43N55R4l43o39q52p00
3426a161j44J43O86Q24O50M02j10n89q13p33m37mM22O98P76O19J74l57p23p67
3446d44o33k30J53N64Q12P02M04j18m94p05p92m68j12M04P73Q15N65Q7k28o37
3466D18p97o72l10K32N94P50P14L33l2m28p79p49n07n5L32P36P12O58J35k04o68
3487D13p53o33l30J40N36P34O81M74q1l78o83p92m92r5L06O99P36N46K83k50n86
$$ y = [-1047, -273, 519, 1278, 1522, 1276, 602, -332, -1062, -1463, -1303, -763, 51, 869, 1373, 1496, 915, 88, -667, -1289, -1465, -1144, -392, 478, 1257, 1480, 1196, 625, -207, -1066, -1427, -1338, -810, 6, 820, 1414, 1417, 944, 222, -606, -1271, -1500, -1093, -388, 410, 1082, 1498, 1319, 670, -245, -977, -1387, -1390, -778, -62, 790, 1338, 1422, 988, 186, -585, -1216, -1448, -1129, -521, 333, 1106, 1368, 1252, 625, -137, -937, -1346, -1381, -876, -19, 724, 1279, 1373, 1030, 391, -461, -1161, -1305, -1162, -476, 348, 998, 1400, 1290, 701, -112, -845, -1282, -1286, -864, -166, 610, 1229, 1403, 1046, 323, -444, -1077, -1307, -1154, -590, 222, 924, 1328, 1210, 716, 11, -781, -1249, -1361, -957, -184, 631, 1196, 1283, 1055, 418, -379, -1051, -1361, -1129, -535, 215, 929, 1262, 1230, 802, 23, -726, -1233, -1288, -956, -220, 492, 1150, 1285, 1081, 413, -340, -973, -1303, -1163, -627, 107, 788, 1262, 1181, 803, 120, -672, -1164, -1259, -953, -254, 482, 1028, 1311, 1061, 475]
3508D75p59o63k91J09N36O64P10M56j1l88p04p17n95o5K60P06O99N90K42j94n44
3529E16p74o61k99O3M18P67P34M21kl30o84p50m81k21L37N46P54O27K72j97n51
3550E05o61o56l73J2M18P56O29M66J18l48o50p40m71k00K98M89P15O36K64o8n96
3571E43p19o08l94M2L91O63P69M08P3l45n70p05n68j47K27N15P28N42L83j89m18
3592F21p17o37l84j1L91O45O79M70P4k27n89p14n65k13J92N73O42N66L87j25m10
3613F48p20o72l16k4K84O60O36M94J29k44n54o79n45k48J93N16O32O04M16j98
3633A012l13o48o60l94j16L30O15O87M48K30k45n85o50n80k42J24M71N85O37L26
3653A032L0l82n93o88m37q0K98N85O05N52J65j78n60o03n80k37O2M13O79O06L96
$$ y = [475, -284, -947, -1238, -1129, -593, 71, 781, 1237, 1226, 838, 134, -583, -1178, -1243, -983, -277, 422, 1012, 1254, 1060, 516, -258, -919, -1218, -1155, -737, 30, 764, 1185, 1183, 853, 169, -581, -1062, -1283, -946, -400, 354, 981, 1253, 1056, 505, -156, -812, -1185, -1173, -755, 1, 630, 1096, 1214, 866, 216, -524, -995, -1195, -897, -408, 307, 943, 1207, 1139, 543, -176, -784, -1178, -1136, -745, -82, 687, 1095, 1168, 823, 253, -452, -1020, -1167, -940, -425, 303, 845, 1228, 1039, 621, -96, -733, -1117, -1128, -737, -92, 587, 1057, 1131, 904, 315, -399, -964, -1177, -985, -412, 230, 796, 1183, 1058, 648, -72, -744, -1060, -1084, -800, -140, 496, 990, 1119, 875, 321, -358, -903, -1151, -958, -442, 190, 794, 1210, 1012, 699, 51, -609, -1003, -1119, -789, -174, 513, 961, 1191, 946, 361, -289, -869, -1111, -987, -516, 69, 706, 1032, 1062, 680, 87, -601, -1038, -1118, -820, -235, 370, 922, 1087, 909, 349, -254, -834, -1071, -1009, -596, 83, 689, 1085]
3674A085k1l40o19o10m63j14K49O20N90N46J09r1m55o89o12k80J11M41O25N08
3694E90M17Ol28n47o27m31j36K75M94O05M78K52p9n13o12n39l27J5L68N94N90
3715E45L99J40l17n76o31m83j41J92O01O02M88K84j70m20o06n39l54L5L66O06
3735B1N37L24J18k25n60o67m30j40J54N03N58N21K82p4m62n64m86l71PL38N20
3756i6N80M28J13l04m42o24m82k04K12M10O07N42K49q8l53n72n47l74K9L24M92
3777a00N70L82J24j91m54o50m73k08J69M18N66M92L22n2l88n88m80l40j3J94N36
3798a64O26L60J48j98m25o33m08j96M2M45N40N35K40Kl66m70n88m09qK72M64N93
3820D02L62J58j04m75n84m52k61J29L42N32M99L67l1k58n64m40m12j66K50M43
$$ y = [1085, 1064, 724, 105, -505, -968, -1082, -833, -213, 377, 923, 1032, 941, 486, -203, -815, -1095, -984, -543, 82, 590, 1007, 1013, 685, 138, -489, -920, -1056, -781, -287, 318, 796, 1048, 969, 456, -156, -695, -1022, -1007, -639, -45, 545, 944, 1084, 767, 191, -440, -923, -1064, -872, -271, 331, 819, 1103, 933, 513, -93, -632, -986, -951, -585, 21, 558, 882, 1000, 775, 215, -452, -882, -1022, -868, -365, 193, 714, 996, 922, 460, -104, -590, -961, -954, -616, -96, 484, 912, 1025, 721, 279, -345, -827, -1031, -819, -409, 198, 740, 989, 901, 548, -24, -571, -945, -916, -592, -100, 470, 852, 976, 785, 331, -319, -792, -1000, -831, -413, 153, 645, 967, 915, 527, -61, -541, -881, -894, -700, -164, 462, 822, 970, 772, 347, -286, -694, -890, -848, -403, 137, 672, 912, 914, 548, 78, -510, -919, -927, -655, -191, 402, 764, 922, 818, 343, -241, -693, -954, -825, -483, 49, 548, 915, 884, 626, 62, -378, -790, -956, -706, -263]
3840b63O15L91K10j63l94n72m79j82N1K91N51N14L24K6l34m80n23l15j45K58L16
3861c03O26M51R9j09m11n11m23k68K3L06N59M33L40N4k82m23n17l55j58J81L85
3882c03N14M74J86j35l49m29n06l17P0K83M82M64L82j2k20l53o27l02k03K34L87
3903b80M84M55J44k3l46n06m94k36J9K69L74N38L62P0j97m33n00m00j40J36L31
3924c73M86M71K70j22l07l92n29l21J7K86L92M85L67J37j77m56m56l90j65N3L42
3945c82M87M58K15n2k01n18m63k97j4J78M36M42L70J39j45m27m60m26j46%M20
3966c86M41M29L31o0k88l80m58l78l0J26M93N03L24J45r5l94m60m55j89N1L49
3987c81M38M57K05m4j54m08m59l19j03J38L71M13M19K42j26l94l84m36k08J1K76
$$ y = [-263, 352, 743, 953, 790, 396, -176, -655, -837, -786, -495, 56, 570, 894, 920, 586, 106, -417, -732, -877, -619, -303, 323, 774, 873, 764, 353, -158, -581, -849, -826, -520, 39, 472, 812, 866, 584, 161, -356, -711, -869, -688, -303, 211, 685, 871, 736, 387, -42, -548, -865, -795, -512, -30, 434, 816, 804, 584, 231, -396, -698, -901, -667, -280, 204, 659, 803, 780, 434, -72, -566, -802, -783, -514, -140, 398, 760, 830, 633, 200, -300, -700, -840, -704, -373, 113, 584, 854, 732, 425, 33, -496, -817, -800, -514, -122, 363, 730, 867, 690, 234, -222, -612, -777, -724, -382, 105, 563, 778, 726, 525, 7, -456, -753, -767, -589, -153, 289, 659, 798, 653, 226, -234, -660, -806, -806, -386, 55, 484, 815, 755, 467, 87, -371, -749, -779, -653, -160, 343, 667, 812, 717, 323, -137, -592, -781, -730, -381, 57, 514, 719, 675, 521, 113, -346, -665, -768, -630, -259, 154, 573, 815, 689, 295, -89, -525, -733, -722, -446]
4008d46M75L64L06R3k76l86l83l65j45J42L69M31L48K54j17l10m37l89k50%K64
4029d58M18M57K67mr4m28m37k96j67J23L50M74L24K08l9k94m08m99k20nK29L74
4051a25N06K42J00j42l84m23l41j76J42K96M44L62L05q2k95m02m51k09j11K39
4071e05L98M40K51J39k15k99l62m40j64J27K82M65L13K15Nj92m28m47k39o1K03
4092e14L84L88L47J48k07k98m05l67j54L9L34L78L66K15jk32k99l93l48j03K46
4113d76L46L68L20J67j30l37l41m04j62N6K01L76M47K01L1k65l47l73k69o6J01
4134e56L54M04K99K37j86k48l54l24k90M9K27L64L75K72O2k62k53m49k56j26J45
4155e16K70L80L78J73n7l36l88l18k36M8K28L30L65K40Q7j36l44m21l07o7J16
$$ y = [-446, 29, 393, 699, 792, 516, 130, -253, -618, -763, -621, -252, 179, 527, 781, 664, 354, -83, -472, -722, -722, -458, -40, 417, 684, 680, 586, 158, -279, -575, -742, -619, -269, 205, 529, 737, 698, 404, -4, -503, -723, -728, -499, -125, 381, 623, 723, 581, 197, -226, -567, -743, -601, -305, 139, 501, 806, 724, 429, 27, -424, -633, -744, -505, -107, 333, 584, 723, 508, 209, -153, -593, -757, -630, -348, 117, 430, 645, 650, 458, 30, -417, -656, -717, -514, -130, 258, 605, 753, 546, 248, -157, -524, -678, -639, -305, 73, 439, 654, 653, 421, 122, -271, -619, -722, -476, -130, 238, 558, 725, 595, 258, -83, -487, -649, -593, -392, -16, 431, 632, 663, 398, 51, -322, -591, -657, -556, -202, 202, 501, 738, 552, 304, -50, -374, -664, -615, -388, -24, 351, 623, 685, 423, 170, -279, -535, -661, -516, -246, 134, 512, 685, 628, 292, -96, -414, -650, -602, -374, -44, 321, 561, 648, 512, 168, -253, -560, -627, -511]
4176e11K47L97L11J93m9l35l04l82j96oJ97L60M41K31P3j39l25l77k42k28O2L41
4198b41L76K95J73j8k19l84l47k58j5J89L30M06K68Q7j16l10l89l40j31K3K90
4219c31L80L70K66n9k68l75l10k85l8K02K76L93K82J43p2k94m29k49k34kL22M26
4241A14L11K05l2k09k76l67k94r8J54L50L65K98J46q6l51l84l20j52L6K14L81
4262EL02L23J8k56k92l64k25j33J45K55L83L21J74q5k57l51l26k29JK47L44L11
4284C11K50L1j34k83m18k57j69J39L05L88K93J39nl10l54l35k18RJ87L74L38K74
4306E55N0j34l38k88l46j24R6K39L93L57J45k2k26l74k96k24n1J52L42L93K60
4327E59P5j60k72l69l31j02L5K70L13M03J17P4k02m18l49k11r2J90K92M03K85
$$ y = [-511, -264, 133, 444, 637, 588, 253, -51, -433, -629, -635, -438, -78, 363, 594, 667, 528, 203, -174, -416, -644, -582, -241, 135, 430, 603, 585, 366, -18, -365, -623, -638, -449, -119, 287, 555, 642, 526, 216, -173, -513, -644, -621, -331, 49, 419, 685, 626, 358, -17, -327, -612, -650, -448, -172, 221, 503, 646, 574, 280, -149, -398, -632, -634, -312, 114, 425, 630, 598, 389, 113, -254, -548, -646, -492, -142, 223, 521, 667, 581, 230, -154, -474, -626, -590, -376, 5, 307, 630, 648, 392, 100, -264, -489, -622, -477, -222, 161, 482, 656, 571, 314, -37, -363, -592, -591, -344, 0, 311, 561, 592, 458, 175, -243, -500, -669, -530, -225, 163, 456, 595, 590, 280, -74, -409, -627, -618, -431, -57, 281, 555, 605, 471, 133, -155, -501, -625, -529, -290, 103, 460, 605, 583, 357, -17, -313, -537, -588, -436, -94, 299, 559, 634, 474, 202, -167, -498, -600, -565, -295, 18, 421, 538, 612, 410, -8, -357, -568, -660, -470, -178, 225, 510]
4348E10R8q1k95l52l29j11K6J93L40L57J93L3k54k53l21k86n3J32K69L66K90J15
4370E87r0k58l77k58k30N5K20L44L51J78M8j69k94l44l15l8R9L33K97K74J66l7
4392E42k36l81k96j74J9J79L43L23J93O6j74k63l33k56j14P0K99L54K82J35j8
4413E60k78l31l36j92M6J63K47M70J22J09r7l46l52k68r1M8L32K40L74J28Nj98
4435C55l86k99k20j4J65L18L49K55L8n9k91k90l67j36J13K49K96K34K96k7k26
4456C53l45l11k15o5J55L51K80K91R0j15k80l23k73j99R2K79L01K71K27M5l03
4477C06k86k87k95kJ42L23L00K70R8q2k67l61k84j21j0J81M17L13J89Jj52k99
4499I4l58k60o8J67L32K80K72J44j00l58k31l20j68R1K02K71L03K35P4k37k95
$$ y = [510, 608, 527, 232, -120, -449, -560, -534, -341, -1, 356, 549, 582, 328, 75, -246, -532, -585, -453, -184, 182, 472, 587, 497, 239, -138, -396, -626, -571, -351, -7, 344, 522, 570, 401, 107, -237, -552, -590, -491, -158, 139, 413, 579, 542, 306, -75, -371, -545, -526, -347, -4, 319, 512, 578, 404, 141, -192, -448, -562, -492, -193, 161, 443, 578, 560, 282, -49, -385, -577, -531, -368, -121, 349, 471, 580, 483, 137, -215, -483, -574, -526, -194, 46, 420, 548, 553, 355, -31, -330, -550, -564, -399, -81, 268, 523, 561, 502, 211, -79, -446, -582, -469, -220, 76, 310, 606, 579, 353, 8, -303, -518, -583, -428, -77, 203, 494, 584, 469, 189, -134, -407, -606, -514, -235, 66, 337, 564, 609, 306, 20, -267, -562, -564, -422, -99, 201, 471, 569, 487, 220, -141, -425, -546, -556, -375, 42, 355, 544, 545, 393, 94, -264, -524, -592, -425, -93, 187, 459, 603, 503, 145, -86, -406, -574, -483, -281, -10, 293, 528, 602, 365, 70]
4520G0l31k61m9J03K70L51K82J36p1k36k95l59j21p9K54L12K92K53M4j88k52l41
4542b16k85q5J02L07L00K83J80j09k25k80m18q3k1J71L12L56J89J08j55l15l23
4563b07k87n5N9L14K41L81J02l7k06k96l61j49k9J41L03L51K18J18j69k79l24
4584a71k77j53J52K13L06L35J25k2k37k62l24k27k8J75K81L39K20R8r9l05l24
4605a85k70j53Q2K74L36K70J79j8j94k58l12k71k8J43K49L54K40J08r3k30l35
4626a12k98j24M8J59L29L66J79m9j36l03l20k79n9K16K54L64K73J9p8k05l61k89
4648d06j77P6K09L09L10J83j2p9l22k96k88q1J37K98K96K54J23j4k88k89k67j75
4670d99m6K35K47M04J60N3j85k83k95k92l0R0K12L76K22J25o4k03l39k47j59j1
$$ y = [70, -261, -522, -571, -468, -198, 153, 435, 571, 500, 264, -31, -390, -511, -590, -336, -24, 268, 521, 565, 377, 125, -216, -501, -586, -484, -177, 123, 406, 586, 477, 252, -28, -446, -529, -550, -379, -67, 289, 478, 586, 431, 116, -207, -494, -549, -490, -176, 65, 446, 548, 511, 305, 9, -352, -501, -530, -389, -86, 265, 483, 601, 432, 153, -171, -448, -601, -449, -236, 70, 405, 530, 508, 271, 9, -315, -542, -570, -395, -114, 225, 445, 543, 444, 139, -185, -455, -608, -526, -252, 84, 354, 533, 515, 321, 63, -249, -520, -548, -405, -156, 198, 438, 546, 453, 223, -112, -410, -534, -486, -327, 2, 368, 547, 498, 362, 59, -261, -540, -599, -383, -129, 235, 508, 527, 449, 244, -117, -406, -583, -507, -298, 11, 321, 504, 492, 413, 91, -205, -493, -574, -437, -139, 157, 411, 534, 520, 232, -57, -324, -499, -545, -310, -63, 341, 501, 554, 369, 86, -209, -501, -531, -441, -229, 147, 369, 494, 430, 227, -112, -359, -518, -529]
4692e29K27K47L02K12O8j72k54k61l19o7N0K75L21L14J48n7j84l44l16k00oJ79
4714c66L11L19K38L7o3l83k24l54j34J31K03L82K53J75l4k26k81k24k57m4J96
4735c45K55K77K80J26j37k70l09l01r0lK66L23K46J86L6k25l09k73j98n0J20L28
4757f7L14K49M1j21j73l67k30k08O2K25L06L23J11L2j45l03l45k05p9K06K52L30
4779B08K78K8j12k06k68k87j15j8K04L45L04J79l7j05l02l46k18o8J22L08K49
4800A43L11N4q4k33k96k52j28j5J69L18L18K15Rj80k80k95k41n7R6K78L56K09
4822D15J20j10k04k98l29j20N2J69K70K78K63N1k36j87l85j68o7R7K09L20K88
4843D28J29p6j92l65k92j57N6J65K22L39K34N9j56k46l60k51p8Q5K58K88K19J84
$$ y = [-529, -302, -55, 247, 459, 527, 355, 101, -160, -479, -546, -496, -221, 100, 414, 562, 505, 321, -23, -339, -539, -545, -366, -55, 264, 502, 539, 476, 93, -131, -485, -619, -488, -285, 97, 350, 525, 491, 265, -16, -240, -497, -541, -345, -90, 187, 467, 593, 456, 186, -123, -424, -514, -517, -251, 72, 318, 504, 540, 315, 6, -267, -465, -515, -395, -67, 247, 496, 537, 416, 243, -124, -354, -562, -500, -275, 31, 354, 465, 497, 352, 49, -296, -501, -580, -374, -122, 208, 486, 514, 402, 196, -72, -359, -474, -492, -288, 57, 361, 540, 503, 398, 96, -250, -468, -536, -414, -106, 143, 454, 508, 424, 191, -105, -357, -485, -500, -331, -13, 305, 520, 529, 349, 69, -226, -467, -524, -428, -150, 206, 415, 535, 425, 221, -77, -406, -526, -474, -305, -35, 243, 506, 557, 321, 134, -251, -419, -486, -389, -180, 140, 428, 557, 481, 289, -76, -368, -525, -469, -304, -82, 257, 491, 550, 394, 148, -212, -463, -541, -456, -198, 90, 309, 493]
4865D93L6k77k82k80j77qJ53K80L21J84M7p7l01l48j62j66P2K92K53L48J34l6
4887D99j73l21k33k92L5J07K60K85L08K6j18j88l40k74j19N4K10L80J90K22l4
4908D84j47l09l90j03k0R0K56L14L07O6p8k73l06k71j47K1K32K80L39J33L3j77
4930C34k31l51k16j29J49K48L81K08J23o5k69l02l08n7QJ56L53J94L00J1j48l83
4952Fk67j98l2R8K55L03K99Q8q8k43l18k79j08rJ86L02K26K66K6k06k25k80k50
4975d48o7O2K65L36L10N6o8k01k69k75k22mJ59L21L32J51J09j86k53k69l08o3
4997e32R7K43K55K97J17l3j90k81l04j83K1J30L10L38J98l2q3k17l58k12j13J03
5019d29J81L26K66J48k8k08k60l34j43l7J71K63K70K07J38r9k89k73k99q6M5K12
$$ y = [493, 529, 252, -30, -310, -487, -495, -342, -62, 259, 443, 490, 413, 112, -236, -398, -564, -492, -200, 53, 401, 535, 499, 326, 5, -228, -520, -485, -378, -118, 167, 475, 501, 383, 195, -145, -419, -538, -484, -274, 106, 296, 518, 484, 337, 28, -362, -465, -485, -395, -139, 175, 482, 548, 470, 197, -109, -380, -527, -506, -274, 6, 345, 478, 511, 334, 103, -248, -464, -593, -444, -196, 185, 393, 516, 451, 182, -120, -428, -485, -477, -321, 32, 226, 526, 537, 389, 6, -261, -459, -491, -393, -138, 165, 464, 552, 464, 221, -97, -376, -484, -493, -307, -5, 221, 487, 513, 307, 82, -198, -448, -515, -453, -188, 148, 458, 514, 446, 245, -24, -299, -521, -525, -366, -45, 287, 438, 547, 361, 108, -161, -469, -532, -435, -192, 63, 360, 477, 444, 254, -27, -331, -514, -493, -363, -53, 285, 483, 451, 368, 151, -207, -419, -532, -429, -248, 78, 344, 492, 464, 256, -4, -338, -481, -518, -347, -84, 186, 393, 531, 432, 143, -130, -429, -515, -470, -258]
5041b58L60K58J46k4j90l34k35k08m6J97K32K75K56N8j05k13l16k76p2M9J82L14
5063E0K42J91J4j75k91k96k66L7J27K88K05K97J06r9k26l39k32j86J47J87K07
5084a2K92K08l9j09k70l85j34n6J01K91L15K07Q5n3k74k78k02j96K0K09K61K83
5106B64J90K3j28k93k72k55n0J51J99L46K14J11qk93k42l39j55N4J81L07L60J48
5128E13M8k44k21l45k04lRL22K19L25O7l5j04m06k72j50oJ32L27L53J18O0j78
5151C25k59k53k41j28J15K98K56K89O6N0k52l28k06k02m9K17K32L24J52J15j38
5172C83k34k88k60p7J00J59L00L23J16j7k37k69l22j33q7J60K84L77J77N1j27
5193C79k66k96k43j3m0K78K83K68Q9K9k16j57l91k13J7J23L36K17K56J7n5k27
$$ y = [-258, 102, 360, 506, 482, 292, -42, -277, -485, -531, -334, -102, 173, 429, 487, 382, 169, -147, -423, -495, -446, -264, 50, 292, 483, 497, 322, 31, -265, -531, -494, -367, -79, 126, 423, 529, 430, 204, -135, -367, -553, -406, -219, -12, 280, 488, 449, 340, 70, -315, -449, -505, -404, -113, 202, 409, 494, 441, 167, -111, -313, -509, -489, -280, -19, 264, 454, 477, 349, 56, -216, -471, -521, -370, -171, 175, 389, 500, 492, 199, -43, -382, -537, -483, -302, 5, 365, 513, 561, 317, 96, -249, -453, -456, -447, -125, 94, 419, 486, 451, 347, -59, -331, -481, -487, -355, -28, 325, 443, 503, 325, 66, -187, -428, -556, -441, -143, 113, 402, 468, 518, 266, -62, -268, -470, -519, -302, -70, 254, 406, 521, 383, 149, -139, -399, -476, -376, -217, 83, 406, 522, 505, 268, -1, -323, -456, -543, -383, -99, 278, 455, 506, 379, 113, -183, -426, -439, -479, -201, 82, 350, 439, 468, 252, 95, -296, -509, -492, -369, -33, 184, 440, 457, 402, 175]
5215A75l33k10p5J5J76L20K69J69m0k38k20k52j79o4J53J95L23K07J18j14k33
5236A62l00k34j47N9K47K40K87J47O7j79l26k81j98J7J10J79K78K57J14l3k70
5257A96k69l07q9J6K14K55K38K02K6j67k91k75k06q7J70K24K98K36J22p3k38k97
5279a02k15j85J9K33L02K37J93k7j33k60l00j96l2P8K69K75K45Q8l8j83l19l21
5301c72r0O7Q1L11K73J32L9j14k48k89j79j12P6K33L14K05J68r5k16k42l00r6
5323d54j8K20K42K77J73O4j32k73k70k99OJ20K28K19K44J39q1j25l34k22j61O
5345d31J45J99K97K29O5j48k42k60k85n4M8K56K92K25J27kk42k24k67j69n1J48
5367c44K40L56J58M2m8k75l03j66j73L8K66K68K75J43J5k77j97k89j70m0J75K19
$$ y = [175, -158, -368, -443, -428, -252, 68, 337, 506, 466, 228, 8, -244, -423, -487, -334, -139, 184, 391, 509, 395, 162, -138, -372, -519, -460, -213, 27, 314, 461, 528, 349, 23, -258, -456, -439, -329, -150, 128, 385, 499, 466, 196, -73, -380, -469, -453, -239, 16, 254, 456, 482, 315, 24, -251, -457, -544, -374, -150, 148, 384, 506, 433, 195, -102, -317, -502, -483, -250, 52, 289, 482, 455, 322, 62, -238, -434, -466, -388, -119, 156, 401, 489, 451, 268, -51, -372, -462, -395, -314, -3, 270, 402, 441, 327, 79, -210, -389, -501, -425, -192, 122, 327, 495, 400, 184, -58, -358, -454, -472, -252, -10, 267, 440, 504, 372, 99, -171, -470, -464, -344, -116, 103, 347, 486, 405, 280, -54, -276, -437, -431, -286, -87, 210, 439, 504, 356, 114, -146, -431, -485, -437, -181, 111, 336, 463, 461, 219, -5, -272, -441, -492, -344, -104, 252, 410, 452, 404, 129, -174, -340, -513, -475, -209, 59, 334, 477, 492, 215, 18, -271, -441, -481, -306, -87]
5389h7K79K29J09j19k72k99k14j07Q2J89K29K95J35m7j38k00l52j27o8J63K48
5410g2K76J82M3q0j71k84k14j70P9K07K34K48K31l3j54k96k29k57K2R1K15L06
5432A74J38J89q9j85l22k47j13j9J96K77K97J47j0j86k40k35k17K6Q7J71L11K22
5454C72R4n9k17k57k49j54J8K41K04K86J26L6j31k51l13j26j14J38K88K34J92
5475C58J14l6k38k85k44j21k4K21K51K65K13rj40k37l25j71j3O7J88K71K13J71
5497D89p7j91k80k79j07M7J17K76K80J61j8n0l26k17k32p9J34K27K19K43J40p7
5519D00j84k03k99j72j3J90K36K71J77L9j52k54k52j45k0m5K06K84K43J71kk40
5541B36k27k52j88j4K12J94J88K32P6m0k84l09j48q5O2R9L47J82J19M6j80k95
$$ y = [-87, 192, 421, 530, 411, 139, -160, -374, -481, -399, -210, 19, 314, 449, 402, 264, 64, -288, -415, -483, -320, -72, 204, 386, 429, 349, 178, -106, -320, -490, -411, -204, 30, 278, 509, 476, 322, 26, -203, -460, -438, -347, -132, 174, 312, 501, 412, 227, -95, -342, -455, -474, -278, -1, 296, 443, 433, 247, 7, -228, -445, -419, -332, -161, 150, 372, 466, 407, 190, -67, -316, -470, -452, -211, -7, 279, 405, 441, 310, 59, -254, -380, -494, -356, -68, 166, 358, 472, 436, 198, -87, -331, -452, -476, -255, -4, 261, 474, 465, 325, 88, -237, -408, -421, -354, -166, 105, 318, 489, 412, 221, -59, -338, -445, -398, -281, -5, 275, 436, 418, 368, 42, -175, -407, -486, -352, -125, 94, 337, 477, 400, 216, 13, -286, -458, -471, -281, -45, 226, 403, 442, 290, 36, -216, -361, -381, -426, -220, 64, 307, 478, 476, 236, 9, -243, -431, -445, -233, -39, 149, 381, 457, 417, 133, -176, -324, -409, -347, -248, 99, 281, 400, 446, 266, -29]
5563b9k61j03l5Q5L17K85J49K7j01k60j92k75rk1J93K32K68J27N7j37k93k88j66
5586d30K3J01K75K72J27M6p4k21k20k22j37R0J67K69K35R7%j23k71k58j54n3J61
5609c00J88K81K62no3k61k28k61p2P2J75L06R5J86M4j40k42k25j99k7M8L11K04
5632A49K26M4o2j49k44k33j55M5J80K14K25K22p4r3k89k28j22n9J32J65K23K53
5654C70M5j5j99k89j73j74L8J64K26J80J62J37j66k31j83k49j6N3K04K37K27R5
5676D43r6j62k84j73j18j4J61K23K29J31J01k00j44k94j92J9L0K18J99K78k4O7
5698C98k47k04j83j29nN2L47K38R3Q6j34k85j93j47p6KK57K33K20J27r5j66j99
5721a0k32j27n5K06J84K99R8O4j18k10k36k13j09R7J59K49K27R6k9j42k69j49
$$ y = [-29, -290, -393, -428, -343, -26, 259, 408, 435, 334, 74, -118, -393, -402, -423, -230, 2, 270, 397, 454, 317, 24, -264, -430, -407, -306, -31, 241, 368, 414, 340, 119, -101, -323, -460, -370, -203, 66, 301, 398, 398, 275, 4, -254, -408, -461, -300, -112, 169, 431, 426, 363, 102, -126, -387, -459, -387, -212, 94, 189, 375, 419, 279, 37, -188, -387, -414, -366, -55, 149, 375, 419, 357, 208, -36, -269, -424, -379, -199, 15, 240, 462, 388, 295, 6, -222, -344, -403, -271, -106, 117, 370, 415, 400, 201, -88, -261, -435, -397, -233, -7, 173, 335, 472, 306, 75, -108, -357, -373, -320, -116, 121, 348, 443, 347, 185, -99, -272, -390, -404, -243, -20, 209, 340, 441, 241, 97, -197, -389, -370, -340, -122, 77, 355, 331, 398, 151, -53, -236, -365, -370, -318, 29, 267, 360, 446, 312, 27, -166, -313, -389, -387, -130, 103, 323, 450, 355, 189, -10, -242, -369, -424, -218, -34, 265, 363, 427, 309, 99, -137, -350, -459, -362, -203, 46, 273, 369, 340, 198, -71, -220]
5743b20j85MJ06K66J89J56O1p9j86k31k33l4JK35K11J99J35l4j57j88k28j24l1
5766c67O5K48K07J78J07j41k20k13j51q5J8J47K27K62P9K4k03j73k73o4p5J05
5788b98J99K42J64Q6m3k53j56k15j31L0J34K65K25J96r6j38j87k45j47m1J68K08
5810c3J87K12N8r1j92k54k11p9Q2J43J95J95J54m1j7k37k76j44n6R9J99K26J89
5833C08Q8p7j79j99j95j58P5J52K06J99J89n9n4k13k89j41n3J12J76K20K51L8
5855C97m0j89k09j89j45oJ25K41K48J33K1j15k35j85j69r0J23J59K39J37J27k2
5877C56k07j91j84j93NJ74K08K29J31O7j71j26k41j27m8M6J80J83J91Q2n0j39
5899A75j56j93j34j9J06J71K13J55N2o2k68j46k09r5P7K01K16J91R0j6j99j50
$$ y = [-220, -405, -401, -295, -29, 160, 316, 377, 298, 112, -119, -352, -386, -385, -150, 61, 260, 395, 361, 204, 16, -212, -336, -367, -302, -54, 153, 331, 438, 297, 77, -136, -287, -372, -354, -207, 20, 282, 361, 385, 182, 9, -264, -328, -403, -298, -99, 143, 307, 393, 350, 97, -59, -274, -405, -375, -241, 24, 249, 445, 349, 211, 24, -221, -368, -409, -241, -33, 154, 366, 424, 333, 141, -113, -324, -403, -321, -178, 17, 212, 366, 325, 308, 71, -205, -349, -405, -306, -107, 119, 308, 396, 319, 140, -59, -254, -412, -337, -185, 21, 220, 409, 350, 296, 83, -206, -347, -400, -288, -112, 108, 359, 397, 357, 168, -41, -230, -375, -381, -256, -15, 233, 366, 387, 272, 37, -148, -317, -407, -284, -125, 114, 251, 378, 356, 149, -42, -226, -419, -414, -240, -32, 197, 328, 395, 224, 98, -143, -270, -318, -272, -92, 91, 282, 364, 314, 175, 19, -174, -308, -327, -221, -50, 163, 318, 370, 308, 40, -106, -315, -410, -333, -132, 84, 275, 365, 349, 150, 0]
5921@k44j49QJ65K02K22J55K9j18j63j70k23p8M5J56K00K38N3Lj55r1k91j81O0
5945c27P7J65K61R7N9l9j76k47j85m5P5J19K04J91P9J9j67j87j42j37m7R4K11
5968d8J13K61P1r9j44j98k16p0p7K30K00K77Q2l3j01k05k33j40n1J22K08J38K26
5991C13K8q5j16k93j13l0k5J24K34J62J38l0n2k07k24j14o9R1J62K19J83R8n9
6014C35j75j92j82j27LJ25K34J66J46qj05j24j80k15l6N2J58J91J80J22n5j84
6036A29j56k08j19k2J57K34J77P1Q5q7k09k01j30o5K9K00K31J40J13q4j12j88
6058a5j81j20n6J89J94J70P9J14j59r2l03r8p1R8J64J46J93O8k0j30j04k64j18
6081c16J7J30J28J99J48N7k2k55j99k08l8K7J95K25J54J14Lk09j16k32j42M7Q6
$$ y = [0, -244, -393, -385, -220, -18, 204, 359, 388, 270, 107, -63, -286, -364, -319, -163, 37, 275, 328, 331, 176, 85, -206, -387, -327, -250, -85, 176, 273, 332, 293, 117, -130, -315, -360, -285, -166, 38, 229, 308, 327, 160, -27, -169, -306, -353, -259, -48, 65, 326, 397, 298, 154, -44, -260, -330, -407, -177, 23, 300, 382, 349, 248, 43, -190, -330, -381, -259, -51, 87, 313, 341, 256, 140, -153, -266, -296, -321, -197, 37, 199, 337, 307, 255, 48, -176, -290, -359, -268, -106, 113, 296, 394, 335, 160, -32, -214, -341, -338, -213, 21, 187, 333, 325, 220, 96, -84, -299, -335, -283, -125, 66, 246, 368, 313, 129, -27, -235, -354, -376, -219, 15, 192, 263, 348, 261, 52, -149, -279, -344, -315, -115, 116, 256, 369, 285, 173, -15, -196, -316, -372, -183, 11, 181, 260, 374, 215, 123, -180, -278, -349, -251, -87, 59, 252, 320, 300, 170, 66, -198, -316, -299, -169, -41, 158, 306, 363, 341, 86, -113, -321, -359, -332, -137, 88, 242, 356, 359, 150, 34, -198, -340, -293, -207]
6104b07J27K05J97mj02q7k91j30o0R5J55J37K01R0Rj46k34j38r8p4R3J82J98J72
6128B90M8Lk26j98j91p4P4J19K07J63J04k6q1j47k44j63J3N6K07J75J74M1jk06
6152A17j34k42p2M2J04J69J54K04oj19k21j82r7j04J51R7K12J83Q7Jk58j22j76
6175b12q3j2R0J91K57J25k4r4j84k00j00o2NJ89K33J20O3Pj71j92j47j12lJ40
6199a76J54J50J89M8j50j38j93j64o2J04J12J92J79N1L5j22j31k78p3lJ03J37
6221c6K38P0J3lj52k53j61l4Q0P7K20J68O1j9j47j24j90q6l0P4K31J24J22J09
6245C52j22j22k37r8q5N8J32J64J73R4L1j66j29k16j55P0O2P6K64J38L2pk27j28
6269d6j83r4O8J26K16J32P4l9k8j59k63j08K2O7J45J81J67O4p6j19k84j76o8R3
$$ y = [-207, -80, 125, 322, 318, 216, 129, -162, -292, -352, -257, -102, 35, 236, 326, 335, 189, -45, -183, -281, -355, -262, -80, 118, 290, 338, 341, 115, -83, -274, -348, -274, -155, 52, 215, 319, 293, 212, 65, -179, -342, -329, -273, -66, 109, 283, 324, 323, 117, -17, -259, -331, -289, -185, -16, 138, 342, 336, 217, -4, -186, -283, -387, -236, -139, 73, 256, 343, 344, 86, -36, -212, -295, -307, -217, -26, 231, 356, 332, 238, 54, -146, -246, -308, -303, -114, 119, 239, 302, 309, 138, -54, -201, -313, -316, -176, -22, 128, 317, 365, 215, 77, -116, -280, -342, -238, -126, 66, 245, 296, 331, 209, 78, -200, -273, -276, -173, -36, 202, 272, 285, 282, 130, -123, -284, -318, -238, -161, 59, 227, 288, 269, 122, -2, -192, -278, -308, -234, -3, 121, 243, 352, 230, 108, -129, -227, -312, -254, -122, 42, 215, 309, 340, 174, 45, -171, -326, -256, -194, -118, 146, 284, 316, 309, 82, -46, -229, -323, -255, -129, 87, 219, 293, 254, 226, 67, -196, -304, -282, -215, -70, 111, 278, 342, 266, 147, -137, -313, -381, -288]
6293b88J21J93J77P9M5j21k36j04j61OP2J26K00J29P6n1j08k06k22p7N1J36J57
6316fJ80R8J3r8j93j27p6j09Q9J72J13J94M3l9j05j99j50q8N5N6K04J82R4n7k6
6341B20j88j66j50j0Q1J11J98J86N6n8j52j61j82o2M9M1J51K23J26j3q9j02k44
6364a35q0p6L6J19K16J58Q0l0r1j89j81j40L3J73J03J71M7Q6q4j48k11j21l3O3
6388b34J14J65J21J51l1r9k03j84p1o4R6K30J91J08jq8j01k08j59j5L8J10K10
6411G6J11N5Op5k08j19j77P6J07J33J13J81K6m7j59j44j90j26Q5J77J70O6J76
6434C13pr6k14q8j77mJ05J32J43J11R4l8j48k02r5j10L4R5J91J60P1Lj26j19k05
6459a77r0oR6J24J88P8L5l5j02q7k35o1KJ22J99Q3J64o4l0j58j82j17QM9J09K03
$$ y = [-288, -167, 26, 203, 282, 327, 206, -30, -134, -295, -289, -217, -91, 109, 238, 314, 263, 155, -51, -273, -350, -299, -163, -6, 174, 272, 285, 187, -6, -133, -209, -318, -229, -57, 56, 250, 293, 254, 149, -50, -200, -288, -233, -177, 27, 209, 303, 246, 220, 32, -134, -284, -294, -213, -102, 96, 282, 338, 280, 128, -33, -215, -277, -228, -187, -36, 187, 313, 300, 211, 109, -135, -215, -291, -255, -136, 80, 238, 318, 288, 197, 8, -173, -313, -280, -107, -4, 167, 214, 300, 216, 68, -143, -264, -297, -234, -120, 45, 166, 317, 286, 187, -16, -200, -271, -335, -239, -9, 182, 290, 289, 201, 100, -108, -267, -282, -244, -134, 76, 187, 242, 248, 173, -35, -154, -331, -255, -148, -15, 98, 279, 305, 258, 99, -45, -235, -361, -276, -99, 71, 137, 313, 306, 210, -4, -92, -269, -273, -168, -36, 107, 218, 312, 274, 126, -76, -171, -281, -247, -152, 39, 199, 270, 273, 147, 28, -177, -267, -273, -177, -53, 135, 213, 248, 213, 111, 24, -211, -272, -270, -148, 51, 134, 298, 234, 204, 46, -136, -253, -245, -196, -87, 116]
6485A16J34K7l3j00j46j56j55L0J14J78J58J02K3j09j26k01j25l0P7J28J15K11
6507B32Ol6r4j34j55j03M7K8J60K00P6Lk0j51j18j36p5N6J09J92J64J8k9q9j84
6532c3j38j39j2J15J76J29J32L2o2j61j38j06q5O1J07J78J33P5o7l9j77q6j58
6555b63j6P1J79J28Q7J21l0k03j52j33j13J27J7K45J43N7j2o1k10j42j03K6M7
6578a90J35K02J02Q6j24j62j73r3n6L4J27J62J05J22m3p7j18j91l9r3P1J33K30
6601A50N6J09r7j05j31j50r4k3J40J96J07J32p4r9r8j85q0l3Q2J50J25J64L8r1
6625A89j24j62q4j09OJ09K19R3J37l9p1j04j84j58J3O7P3K15Q4J16n6j31j38j72
6649b11l2k6J49J79J29P6M6j78j01j55j66j0J13P8J33J65J05r0o5j64j72r5M9
$$ y = [116, 250, 277, 244, 144, -2, -158, -313, -283, -169, 9, 167, 269, 292, 183, 57, -144, -269, -299, -222, -94, 21, 232, 238, 202, 108, -26, -181, -284, -237, -209, -49, 151, 227, 230, 210, 59, -59, -195, -270, -214, -105, 87, 251, 269, 240, 151, -33, -171, -310, -322, -207, -31, 98, 230, 262, 200, 39, -99, -205, -290, -229, -122, 56, 189, 264, 197, 158, -19, -105, -263, -279, -208, -29, 99, 186, 307, 277, 74, -78, -211, -324, -197, -180, 65, 208, 265, 253, 192, -18, -160, -263, -237, -190, -55, 147, 249, 335, 211, 49, -124, -217, -273, -239, -112, 50, 155, 277, 234, 157, 39, -152, -191, -284, -213, -80, 150, 206, 315, 218, 113, -18, -168, -262, -285, -145, 51, 158, 290, 216, 117, 19, -166, -246, -279, -197, -47, 78, 242, 280, 189, 65, -97, -181, -290, -284, -175, 44, 137, 274, 235, 164, 60, -124, -282, -269, -202, -129, 86, 170, 286, 230, 99, -39, -211, -243, -269, -120, 59, 188, 264, 310, 132, 31, -124, -290, -300, -187, -109, 24, 189, 294, 204, 139, -25, -197, -292, -243]
6672b43M7J41K02J15o1lj36k13q0k8J7J53J44J49R6o8q2j49k02o2N8MJ72J81J11
6697B63j4o8j38j24k08pL3K33J06J14J31q7k0k56j24m7m3Q8J07J54J55K0n1j72
6721D5j46j33p2O2J18K03J43M5j4j48p8j71r6K3N7R9J79O6P6r4o9j60j20n9N2
6746a92M4K24J39Q2l1r3j94r8r9m1N5J53J71J85m8m7j07j71r9p6K5Q5J96Q7O6
6771B16Rm8j54j49j38J1O4J58J04J64P9j51q6j91j42n4Q4Q9J17J59J18j2q0j47
6795B0j47r6o2R4J40J32J20K3k1j10k02q4o4P0L2J89J80O2J5j34j43j41j51J6
6819b62L2J68J09J57M6j0r4k23l8j30K0Q1J49J23J34k2m5j23k00m3j07N6J53R7
6843B8J54K7k9l4j59j21r2mO5J64J84P4Oq6j58j43j22L1j1J23J64J08R9k5j13
$$ y = [-243, -196, -55, 147, 262, 201, 198, 62, -151, -231, -259, -242, -89, 55, 204, 300, 232, 150, 1, -201, -263, -205, -201, -29, 152, 263, 249, 181, 43, -81, -289, -296, -263, -30, 76, 190, 321, 234, 214, -42, -166, -213, -256, -168, -61, 93, 248, 268, 217, 45, -101, -234, -306, -244, -126, 77, 220, 265, 251, 103, 25, -146, -242, -219, -162, -63, 116, 182, 258, 164, 95, -65, -185, -244, -192, -148, 76, 215, 297, 266, 173, -21, -119, -218, -259, -204, -51, 120, 305, 257, 210, 103, -68, -167, -243, -218, -133, 63, 150, 216, 225, 177, 23, -126, -264, -253, -189, -31, 73, 237, 316, 165, 79, -112, -254, -308, -224, -135, -18, 141, 259, 247, 167, 20, -127, -223, -285, -191, -51, 81, 201, 224, 203, 93, -109, -193, -257, -187, -155, 34, 214, 276, 291, 157, 14, -127, -278, -262, -230, -62, 47, 204, 250, 240, 146, -77, -115, -245, -225, -144, 5, 128, 262, 240, 195, 72, -128, -171, -278, -222, -69, 28, 182, 209, 180, 146, -13, -134, -226, -230, -165, -1, 183, 257, 263, 177, 19, -124, -246, -215, -226, -103, 61, 169, 268, 243, 130]
6868A30j25j61j38O2M5J58J97J00n7k5j66j23r3o4P3N0J66R4J33l1j33j36j10
6891a54r3n0J57J60R2J34L6j10p1j09k13k0L5R3K05J6J33K1j00j47j80o5o3Q7
6915b06J19J97J49Pp9j04j48j52p6N6R1J77J21N0M3j23r9j55j32OJ18N4J77J08
6939A99P9m9j06j86j37q5O5R6J81J15R3L9j59r9j80p8m9J16N8J85J08Noj29k53
6964a77j6p5K4J16J59J21R3pp7j49j16r2p7P5J07J77J27N0l8j04j33j54p9rJ00
6989a54K37N1P4M8j37j18j18r2lK6R6J64J30P9j06p6j13j57q3k3R9J63J35J34
7013B56%j35p6j54j15m8mJ49J95J13N7n1l4j03k36n6K1N7J70J38R7Ko1q1j99j00
7039a98r6J30Q6J31J07N9L4r3j84j34r4nJ41J76J09O6j5m1q6k03q3m8L0R9J77
$$ y = [130, 5, -156, -294, -232, -187, -29, 168, 268, 211, 186, 20, -103, -196, -260, -187, -137, 29, 123, 256, 225, 92, -44, -154, -247, -297, -140, 20, 112, 246, 282, 172, 101, -8, -221, -241, -206, -113, 92, 108, 241, 262, 162, 15, -165, -230, -293, -206, -87, 110, 259, 266, 187, 83, -65, -217, -293, -237, -146, 31, 152, 202, 245, 122, 23, -132, -264, -258, -140, -86, 91, 199, 278, 229, 123, -63, -200, -285, -220, -124, 57, 172, 265, 304, 145, 46, -134, -212, -261, -145, -87, 98, 206, 211, 205, 76, -177, -193, -268, -244, -128, 31, 152, 245, 238, 161, 12, -104, -196, -273, -198, -91, 86, 213, 263, 225, 121, -12, -166, -245, -254, -154, 83, 134, 208, 256, 119, 1, -117, -209, -212, -186, -90, 74, 204, 283, 177, 101, -12, -169, -252, -275, -176, -13, 122, 256, 256, 121, 45, -109, -224, -272, -276, -127, 68, 181, 238, 187, 153, 50, -186, -242, -221, -164, 6, 144, 241, 243, 182, 101, -98, -198, -294, -164, -78, 53, 160, 219, 253, 160, -24, -158, -252, -257, -116, 60, 169, 235, 220, 179, 93, -110, -193, -241, -211, -112, 65]
7064F5K4K17q0j10j41j40p2m8J15R6K24Q2j7M6j83j71r9k9OP8J72J38P5N1j59
7089A40j28j90rm3L1J06K09J11j8mj20j42k12j8M9J70R0J39R7N3j87j35j39q6
7113b36p3J04J89J29P9N8l5j26j38j15j15R5J19J03J17P0L9j05j27j46j02m0R8
7136a58J12J43J24N9m3j18j79r0m6l2J21J08J62J12k4p0j63j39o7o6P1R8J46J86
7160B47J7k9n8k30j33l3QP8J71J70K3l2j8j66j19j24l2J19O2J30J61N0j12m4j77
7185g1j14o7m7J13K20J11J08j5r8j47q8j06o5M6J96P8J26Q9m6p4j43j65p3ON4
7210a72K18O1J08Pn3j12j75j37l5N3J63Q6K10j1M2j19q8j85n5j15J33J30K05L6
7234A95J25j69j8k89l0j23J31N3J42J95jJ13k80O6l89J32j23J00J89L3K33j10
$$ y = [65, 89, 306, 226, 116, -25, -165, -237, -285, -170, -74, 150, 232, 215, 261, 78, -93, -192, -221, -215, -137, 35, 173, 248, 299, 140, 12, -178, -187, -230, -199, -93, 116, 227, 209, 205, 85, -57, -269, -287, -238, -68, 22, 161, 258, 311, 124, -11, -150, -236, -309, -205, -16, 113, 192, 250, 215, 89, -49, -164, -279, -184, -65, 38, 155, 225, 264, 159, 32, -114, -216, -256, -158, -46, 97, 221, 280, 237, 119, -60, -150, -196, -228, -107, 1, 163, 275, 251, 181, 18, -121, -188, -254, -183, -85, 61, 247, 264, 235, 177, -53, -186, -219, -211, -133, 38, 208, 231, 199, 181, 15, -104, -228, -260, -141, -79, 51, 212, 262, 150, 106, -71, -185, -252, -299, -186, 34, 145, 253, 238, 140, -7, -95, -201, -266, -220, -24, 54, 180, 269, 223, 149, 6, -159, -232, -226, -172, 46, 107, 215, 222, 169, 57, -118, -255, -290, -237, -74, 12, 222, 211, 253, 134, 46, -139, -194, -309, -176, -46, 159, 195, 320, 151, 133, -156, -186, -309, -178, -125, 17, 212, 211, 324, 44, 110, -279, -147, -270, -170, 19, 52, 285, 175]
7256A75K4j30k17O3j99J40J7R8K62q9Q6j1l53J4j24p1K49oJ55K43j61J5k7k74
7280a21j00J42k52J90L41j68J57J27j64k35J3j32k03K58K16kJ24K24k21k00m4
7301e0r7j81L9K95M3j3J70J04j67k80o6J31j50nJ39K82k1J6j5O5k23k74j06K06
7325a58J62j11K02J83Q6j80k92j30L8L9L6o6K17J61J44n8k70j49k0O9j07N3N1
7348a00K17J85P0j80k48j86K7PQ6N6O6L7J57J13j33k21k12o9K7J66K53R1Qk6r7
7373I4q6o2q4K2k7k5J83J06J51L6q5j81j88j59k2O9J96K17K03o1p0k53j76q9l
7398b94M5K21K10O7Q6j09j68k05q5n6L2R6K00J49P6K0j63j09k36p4m8J41K01J63
7422A60J22P6n4q1k46k02m0J0M8P9K19J15N4j1n8j47j38r8L9M5J08J15J08j48
$$ y = [175, 199, 69, -148, -85, -284, -144, -127, -29, 233, 144, 230, 219, -134, -120, -244, -315, -66, -72, 83, 326, 165, 180, 153, -121, -221, -79, -331, -141, 200, 32, 189, 316, 152, -83, -70, -202, -405, -147, 69, 67, 191, 415, 194, -6, -50, -147, -328, -289, 6, 49, 36, 206, 310, 143, -137, -203, -72, -222, -227, -88, 194, 173, 189, 174, 239, 16, -258, -364, -158, 4, -107, 95, 278, 364, 184, -108, -238, -200, -161, -125, -191, 26, 187, 331, 273, 3, -146, -166, -97, -204, -151, -100, 117, 302, 372, 192, -56, -242, -215, -208, -122, -66, 0, 37, 194, 307, 174, -47, -259, -328, -301, -135, 118, 209, 217, 191, 94, 8, -54, -138, -116, -143, -168, 15, 121, 272, 308, 223, 42, -146, -305, -327, -258, -62, 155, 358, 297, 227, -26, -202, -291, -294, -249, -28, 182, 249, 335, 226, 58, -147, -232, -288, -256, -160, 40, 189, 265, 285, 122, 13, -223, -297, -345, -204, -3, 160, 282, 358, 304, 223, -23, -225, -265, -255, -207, -128, 91, 206, 260, 249, 191, 44, -94, -192, -153, -108, 0, 115, 223, 75]
7446G5n3j11j16k0K9L1K53J43L2J08j15m2k29j35j13L9M0J15J60K7L3r9j10j60
7470b18n8m0J56J27J53J32qL0p2k55j8o8N1P5J11J57K5L1j16j49j40j16k6L4J34
7495f8J46O8J4k5j01j92j43p0J10O5O6K23QJ7o6j17j82p7l1J02O1K10L7J07n2
7520A10j12j23j58n2Q0N6J04J17J87j03j6k23j28o1j9P9O4K39K7O2j8j20k18J6
7544b10j53MJ75R7J48Q1J8J9k15q0j42n8M9J49J31J83J8k3m7j91n0j16O3J26R3
7569F9J70K1M3k6j54j86o8%J0P4J46J81K5q7j25j70j05j39O9O1J08J16N6Q1j10
7594F0o8j83r1l5J30P7K01J59N8qq7j46j69k7P0oJ27J29K9N4j21j80j21j21k8
7619b97K7N7J45J53Q0J0q4j68r7j5M8O7J99M5J02N7j38p6j39j83n7k7J57R2O9
$$ y = [75, 22, -89, -205, -225, -196, -165, 88, 231, 263, 371, 256, 214, -15, -150, -263, -224, -184, -69, 91, 118, 151, 52, -58, -218, -276, -316, -160, -33, 120, 252, 244, 274, 202, -53, -71, -139, -88, -13, 98, 255, 280, 311, 195, 46, -94, -210, -236, -202, -68, 78, 146, 160, 135, 34, -158, -301, -371, -261, -196, -130, 93, 101, 118, 52, -65, -247, -324, -355, -253, -192, 18, 55, 162, 110, -2, -125, -283, -335, -255, -199, -95, 22, 209, 106, 90, -133, -261, -322, -341, -262, -198, 41, 68, 130, 112, -8, -226, -210, -363, -359, -184, -87, 61, 142, 160, 179, -36, -116, -258, -316, -267, -118, 13, 196, 214, 191, 144, -47, -97, -213, -150, -24, 69, 239, 260, 303, 277, 123, -63, -131, -131, -121, -47, 99, 280, 305, 218, 93, -77, -182, -321, -252, -191, -83, 33, 89, 170, 60, -8, -191, -282, -317, -187, -110, 91, 250, 308, 300, 213, 67, -102, -129, -59, -65, 62, 191, 220, 274, 153, -27, -148, -269, -297, -270, -213, -68, 85, 165, 175, 91, -77, -174, -189, -141, -74, 125, 170, 272, 329, 191, 115, -24, -207, -264, -291, -134, -42, 27]
7644B7R6L2q7j54lj16M3Q6J23J31J09J6l0j15k42r0n7j8M7J64R3J14Nj30k7j63
7670a46K2O3l5J23J92ON3Kk04j67j24j04RJ41J01J37J03O7n7j32j45o4l7Q9R6
7695a1P2R2O6o6j60j14p5p3O8R1J73J52R4o1k3j64j69m8r1J2R9J25J40K2L1q7
7721I5j07n4p5N0L3J55J31L3j06o2j62j36o0ON8J48J78J18R9n7j57p0k34j03O
7746b73J14P5J58P5R2n3q6j44r0J5LR6O2R9P9p0j57p1j10k0KJ04J69J09O6L7j25
7773A56j28k03o5r8Q6J32J69J34R6kn5k02j13j12n5Q6Q3J14J08O9J0j84o1j09
7797a44L3j7J11R4J18o2m2n9j02q6l0L7J10N3J47R0k9j02j42j37j16l6Q2J75J79
7822A25J45P6l6j49j61k14m2m0J17O3K11O7J16m8j29r1j33r0LJ16J08J02P2pr3
$$ y = [27, 123, 155, 68, -86, -89, -205, -162, -76, 47, 178, 287, 303, 273, 158, -84, -174, -231, -249, -202, -38, 55, 169, 174, 44, 17, -146, -124, -61, -96, 27, 219, 225, 278, 280, 76, -91, -215, -319, -310, -169, -68, 69, 172, 239, 182, 50, -95, -159, -196, -107, -11, 61, 153, 219, 153, -7, -121, -196, -269, -201, -110, 63, 215, 309, 248, 225, 61, -108, -156, -247, -235, -136, -11, 129, 151, 182, 95, -12, -66, -141, -91, -58, 97, 228, 261, 155, 93, -69, -205, -265, -259, -201, -53, 125, 243, 342, 285, 128, 58, -176, -279, -273, -159, -84, 74, 149, 241, 188, 102, -42, -132, -117, -114, -18, 44, 143, 222, 152, -5, -76, -186, -206, -204, -100, 69, 178, 244, 281, 156, 28, -175, -240, -338, -252, -120, 49, 183, 279, 277, 222, 20, -93, -205, -260, -174, -91, 23, 131, 200, 210, 26, -35, -144, -111, -128, -17, 77, 195, 133, 91, 32, -70, -156, -186, -149, -39, 14, 161, 251, 222, 120, -22, -159, -275, -311, -229, -54, 125, 270, 346, 310, 161, 0, -214, -256, -296, -179, -116, 95, 162, 278, 230, 101, 10, -123, -213, -210, -94, 14, 116, 188, 181, 88]
7847H8J4k10J5m0L0M6J62QJ3qr1r0o0p1R0J16J14P8k0n6r2j48n9q7M8J27J77P5
7875A69O3L0j14j47j21j30q8J44J03J56J81Q5l5j38r9k55p9J2M5Q6K03J45O7k0
7899B63q2j79k07n6K4L5J07K20J3Q5p9o5j30r2m7j4J00R9R7J00n8K5j58j13J7
7924i5j04J51O0L9J12m7j7j14r9k4K5pQ0J24NP1l4j42m5q6r0O2R5J28J02L1j4
7951A67o8j48j18r8PJ74Q2J46J07qm5j85q1j71mR8O6J19J61k1L6p0j17j55j10
7976b36m5Q3J32J62J08P6o1j12k17r5j51P4J44J23J37J51Nn8j33j80j02j04P0
7999b29R2J71R9J31o4k4j63j50q3m1R1O4J53J59P3j20o2j11j63l9kL1J15J98P
8024A33Q1p4j35m6r3n2N4K1J14J06O0K5j22r8p6n8K3O1L5Q1J17qj2j14j18k0j7
$$ y = [88, 102, -108, -93, -133, -103, -57, 105, 113, 126, 118, 27, -63, -123, -194, -104, 12, 126, 204, 184, 128, 36, -112, -171, -258, -210, -83, 94, 169, 232, 262, 148, 1, -120, -250, -338, -194, -91, 65, 246, 331, 296, 158, 59, -196, -275, -263, -218, -132, 71, 216, 283, 263, 181, 2, -205, -261, -237, -202, -95, 125, 138, 223, 144, 79, -51, -143, -190, -204, -104, -5, 92, 192, 134, 159, 1, -112, -95, -199, -48, 12, 51, 163, 116, 99, -15, -114, -138, -113, -120, -40, 84, 89, 160, 126, -16, -61, -147, -237, -175, -80, 48, 150, 181, 167, 99, -49, -167, -265, -258, -84, -2, 144, 251, 243, 198, 13, -68, -239, -243, -145, -79, 40, 201, 180, 216, 146, 29, -126, -236, -281, -198, -66, 96, 204, 280, 219, 107, -110, -205, -356, -282, -138, -15, 122, 273, 278, 220, 87, -93, -195, -299, -229, -137, 34, 133, 264, 200, 176, 13, -137, -220, -261, -170, -106, 47, 206, 279, 159, 97, -14, -177, -216, -218, -187, -72, 126, 133, 214, 140, 5, -41, -134, -186, -132, -111, 3, 109, 169, 194, 72, -26, -102, -160, -137, -76, -41, 40, 157, 149, 137, 23, -95, -115, -132]
8051a32P0MJ28J00p6j0q3m9n9m6L0P8O8J05l7Km0l3j34m5%P5O5J12KL0l9j53L
8080f4o5m2N1J12O5P7M7l1r4n0j63n4J13M0J25J13L0l3n5j07j07j11M0M8J06J48
8106A39m1P6o5o8o2j39p5QJ26J37J45M2Rp8j64j17r8m0O3J34K11N4K5kj01k37
8132a18n2n4qJ35J42R6J13J5n7j95j31j22jJ7J08J78J43N5pj34j32k58K4L5K7
8157a81J44J06J89KJ8j77k11j36J4q9J93J98J27Q7Kj18j72j10j22n1J12J27J16
8180F8J17J00o1j23j19j43j41J3J33J57J19
$$ y = [-132, -62, -58, 70, 170, 94, 84, 1, -48, -107, -153, -123, -45, 23, 128, 91, 93, 53, 20, -114, -159, -159, -84, -19, 93, 95, 125, 86, -67, -64, -129, -171, -120, -8, 57, 134, 181, 150, 56, 6, -157, -211, -98, -58, 67, 180, 210, 177, 122, 15, -92, -203, -163, -115, -9, 139, 98, 174, 109, 41, -21, -160, -235, -227, -101, 36, 181, 223, 232, 154, -10, -127, -225, -265, -202, -68, 143, 197, 222, 220, 119, -118, -170, -224, -232, -97, 45, 141, 254, 269, 212, 17, -114, -236, -237, -220, -112, 66, 209, 264, 257, 123, -9, -267, -243, -208, -181, -37, 69, 258, 260, 278, 101, -110, -246, -232, -321, -128, 70, 197, 284, 286, 168, -4, -114, -236, -287, -175, -48, 68, 185, 285, 224, 101, -18, -161, -302, -289, -156, 1, 120]
8191A20
$$ Imaginary data points
##PAGE= N=2
##DATA TABLE= (X++(I..I)), XYDATA
0@%%%%%%%%%%%%%%%Lj1J6j6J6j7K5l2L4m2M9n7O6p5Q7r7J10j26J44j63J84k07
37a09K33k61K89l22L60m00M44m92N42n98O59p26Q01q83R73j073J184j308J446
56G59j602J783j992K237k530K887l332L908m685N798p538J0660j8053O9934O9768
71A28002o4469m6724p0349m5289j7377K7472N1123P4268N3518K4886j7128n0974
83D6959o4935m9213l9244l662M4393O6926N6286M1164O508l0305n3232o0434n0000
96h8789j5916J7766M8948O5254M9920J8767m708l6667o2277n5467l0417k292L2762
109f3116N5323N4902L9070R215k4231m5279n6228m8771j6145J7831L9249N4184
121A6004N0097K3460o156l2231n1826n1848l2993k802K9874M7682M7388L8084
$$ y = [0, 0, 0, 0, 0, 0, 0, 0, 0, 0, 0, 0, 0, 0, 0, 0, 3, -8, 8, -8, 8, -9, 16, -16, 18, -24, 25, -32, 34, -41, 46, -51, 59, -67, 77, -86, 98, -109, 124, -137, 152, -170, 190, -210, 234, -258, 284, -314, 345, -381, 420, -463, 510, -563, 621, -687, 759, -843, 940, -1052, 1185, -1345, 1542, -1790, 2118, -2567, 3231, -4307, 6353, -11700, 58234, 128002, 63533, 16809, -53540, -98829, -116206, -88734, -37611, 36657, 90175, 115061, 97933, 46959, -17976, -67189, -106433, -110095, -65702, 1224, 57510, 98674, 105182, 74877, 21645, -38789, -88789, -104705, -86939, -37991, 27263, 77183, 95950, 91242, 54575, -7702, -63169, -93586, -95878, -63116, -7793, 47109, 86179, 95394, 71163, 25884, -30344, -79115, -95260, -77429, -38180, 16004, 66101, 89561, 83405, 51174, -652, -52500, -85493, -88295, -58421, -10739, 36649, 74733]
133G4733J4243k0124m3220n0069m3609j8360J4030L5710M6473M4701K6754j232
145H0030l0525m9265m6001k7699n198K0944M2032M6676L6596J3697j6925l9423
157B4939m5168l7321j8136O533K9802M5824M4060K3223k809k5156m0714m2286
169c7209k9093p535J8306L9352M4086L2572J1395j2653l1954m1314l7994j9425
181g1466O981K8859L9952L8369K3184O98k1586l7776m0559k8013o521J7009L4196
194a6673L9051L1657J3591j0794l0790l8553l4119j8223M484K5327L7074L6628
206C8660K2736J006k0234l4264l6997k7023p680J4783L2181L7257K9400J2394
218F2219q653k7110l6515l3288j7765M163K3626L4211L3643K2189K782j7911l2964
$$ y = [74733, 88976, 68852, 25632, -24437, -68046, -86406, -72376, -36666, 9807, 54508, 81262, 80030, 49505, 240, -45761, -73460, -78658, -57714, -15682, 30994, 67590, 81287, 64362, 24939, -20229, -57550, -75686, -69153, -39351, 6473, 50533, 73756, 70947, 45791, 5077, -37209, -66302, -73837, -55531, -16179, 27907, 60479, 71874, 59221, 27267, -14047, -52041, -71466, -64485, -35626, 4326, 42695, 65879, 66577, 44991, 7215, -33344, -61357, -67878, -50869, -16673, 22378, 54035, 67626, 56832, 26042, -12511, -46630, -64853, -60369, -35042, 2032, 38660, 61396, 62402, 42168, 7904, -29093, -56116, -63796, -49013, -16832, 20425, 49825, 62219, 53566, 26456, -10059, -43347, -61112, -56949, -33323, 888, 34531, 56720, 59502, 41591, 8627]
231H627l5825k5395o716J3027K8360L4797K9467J3453q055k6274l4504l0424j6755
244e6217J780K0351L2859L3515K1860K368j7110k9939l2656k5111q972J1123K7817
257a8332L3964K7808J2289o439k2893l2090l0589j8122J380K0097L0965L0862
269B8900K0966M447j4412k8623l2586k4917q263J0558K4983L1190K7509J4074
281E3826n101k2333l1184k8971j6935J13J7068K9087L0929K1571M323j3968k6727
294A1698l0001k4176r924Q448K4043L0950K6695J3027m271j9766k8807k8744j8077
307d8905o25J6748K7902K8881K0460N599j1448k5264l0119k3993r304Q029K2054
320a9985K8435K6007J4387k802j9186k8390k7285j6832j509J4278K5837K8646
$$ y = [8627, -27198, -52593, -59309, -46282, -17922, 16875, 46342, 59795, 51740, 25466, -9038, -39462, -56217, -54437, -34086, -1227, 32288, 54148, 56516, 39406, 9467, -23189, -48300, -57272, -46149, -18332, 15632, 43440, 55729, 49290, 26397, -5693, -36282, -54404, -53024, -32927, -1962, 28900, 49866, 54313, 39901, 11278, -21308, -46225, -54488, -43930, -18947, 12243, 39752, 53826, 48725, 26392, -4792, -33763, -50698, -50585, -33517, -4430, 26499, 48070, 52393, 38425, 11698, -18303, -42479, -52403, -43955, -19912, 11038, 37733, 50760, 46489, 26723, -2084, -30828, -48905, -49530, -32782, -4880, 24001, 44461, 50060, 38612, 13348, -16771, -40764, -50068, -42039, -19985, 8450, 34457, 48844, 46042, 26856, -1534, -28819, -45651, -47160, -32882, -7045, 21601]
332B1601K1183N842j1363k3809k7787k2922j0606N932K0832K8316K5416J3560
344D6195k268j7020k5998k6675j8106k508J3914K5013K6966K0023O619q876k1983
357A5296k7647k3279j0413N765J9218K6049K4444J4628m86j6162k5744k5727j7089
370d1147l028J1864K2927K6451K0792P193q742k1011k5775k2105j1151L665J7911
383b2156K5817K4253J4094m20j4403k3552k4957j8010m175J1449K2460K5096J9635
396C5131P693o773j9267k5565k2468j1033L719J6606K3933K3160J4873J220j3505
409B7724k3586k4314j6789m269R577K0279K4531K0581Q297o817j8648k3860k1268
422b8562j1446J819J5026K3832K3444J4363R45j2391k1291k3042j7764n901R114
$$ y = [21601, 42784, 48626, 37263, 13454, -14333, -37255, -47861, -41929, -21097, 7219, 32635, 46195, 43927, 26907, 909, -25766, -43872, -46380, -32466, -7453, 19513, 39536, 46155, 37279, 15296, -12351, -35630, -46043, -40278, -21060, 4989, 29433, 44061, 43575, 27413, 1669, -24058, -41147, -44175, -32311, -9384, 17067, 37859, 45052, 36310, 15299, -10476, -32581, -43732, -40067, -22156, 3661, 27914, 42008, 41588, 27185, 3633, -21324, -39334, -43509, -32060, -9600, 15496, 35131, 42824, 36051, 16784, -8781, -31249, -42282, -38563, -21957, 1976, 25136, 40009, 41229, 27724, 4138, -20176, -36965, -41234, -31657, -11378, 13153, 33734, 42031, 35214, 16566, -7294, -28562, -40008, -38189, -23163, 669, 24113, 38476, 39421, 27030, 5739, -17303, -35067, -40968, -31854]
435c1854K0326K3643J9223Q402n144j6594k3009k1971j2201J942J4619K2138K1873
448B1393J4561K785j0756k1137k3072j7080n737P853J8509K2333J9515R634m418
461C4383j6144k2150k0890j2023N12J2637K1327K2202J4603K795r575j9386k2155
474a3864j7331o744O744J7666K1748J8892R625l023j4414k1110k1292j2507N04
487c5106J1919J9341K1108J5205M195q612j9074k1755j6452o660N418J5862K0499
500E888J9276J0890k726j4598j9921j9227j2524j441J0207J9057K1328J5086L689
513C4984q095j7205j9909j6547q283M071J5939K0765J7938R764j608j2245j8647
526I22j9681j3539j442J0240J8126J9772J4453M531o117j5983k0449j6906p387
$$ y = [-31854, -11528, 12115, 31338, 39740, 34596, 18002, -5007, -26978, -39179, -37237, -22618, -480, 21393, 35954, 38739, 27983, 6846, -16226, -33306, -39043, -31190, -12681, 9652, 29167, 38801, 34383, 18239, -3911, -24801, -36824, -36312, -23675, -2348, 19854, 34457, 37252, 27677, 8291, -13864, -31195, -37939, -31195, -13529, 8219, 27111, 36736, 33713, 19299, -1811, -23103, -35610, -35106, -23187, -3846, 17262, 32467, 36662, 28050, 8976, -12779, -29231, -35891, -30473, -14611, 5888, 25164, 36054, 33328, 18730, -1191, -20418, -32942, -34383, -24176, -5119, 16209, 31295, 34984, 26889, 9684, -10225, -26772, -35055, -30984, -15045, 5720, 23658, 33422, 31814, 19569, 922, -18759, -32298, -33740, -23500, -5374, 14398, 28851, 33382, 27265, 11282, -9167, -26073, -33460]
539c3460M017J4120J9050J7784J0741o56j1783j8320j8981j2909j917Q859J6667
552f788J9351J5007N051o021j5100j9107j6429q149K941J3420J8573J7193J0567
565C0509K93j0627j7545j8466j3106k584Q357J5920J8110J4700O082m816j4640
578A2187j8971j5955p732K255J1764J7416J7402J1367O90j0463j7057j7371j2286
591b6754l530O637J4973J8544J5099N735n142j3432j7120j5609q967J146J1523
604a6897J7592J7069J0372O60q896j5321j7311j3355m073O835J4979J7368J3982
617B3004O039l392j2354j7392j6060q697J560J0757J6181J6234J0982J747q169
630B0440j5488j7172j2551l947N649J3633J6992J4389O673l219j2173j6379j5243
$$ y = [-33460, -29443, -15323, 3727, 21511, 32252, 31596, 19813, 1493, -17488, -30397, -32314, -23455, -6788, 12563, 27570, 32621, 26600, 11500, -7607, -24036, -32185, -29244, -15824, 2749, 19942, 30509, 30802, 20175, 2630, -15836, -28942, -31526, -23169, -7249, 10861, 25561, 31643, 26827, 12187, -6784, -22739, -30471, -28216, -16452, 964, 18366, 29733, 30423, 19960, 2903, -14468, -26754, -30284, -23647, -8674, 9870, 24969, 30704, 25562, 12130, -4990, -20599, -29566, -28420, -16897, 695, 17764, 28136, 28796, 19900, 4579, -12732, -26087, -30160, -23325, -8346, 9022, 23004, 29043, 25651, 13297, -4095, -20155, -28852, -27292, -16535, -354, 15880, 26862, 28609, 20440, 4952, -12220, -24771, -28718, -23069, -9436, 7556, 21945, 28618, 25399, 13226, -3153, -18396]
643a8396r107L95R940J5837J6206J0957J878p415j4301j6595j3035m611N271J3243
657i733J6182J3846P211k076j1396j6114j5329r088J57R236J4542J5590J1754
670B4782K810p051j4197j6079j2378m722L998J1792J6189J4397P348k121j0855
683A3913j5061j4503r429j081Q286J4684J5713J1188K483o161j2482j5607j3047
696b1104n504L789J1854J5561J3534P167r65r443j4875j4836r690r41Q025J3619
710c809J4570J1367L893n491j2604j5385j2581n329L132J0484J4831J3815P849
723B4742o95r318j4205j3891r553k052O967J3205J4744J1326L755n014j1451j4329
737e769j2842o264K671J0228J4359J3338P682J9p934j3695j4175r844k028O569
$$ y = [-18396, -27503, -27108, -17168, -1331, 14875, 25832, 27710, 20295, 5994, -10601, -23636, -28247, -22976, -9733, 6449, 20295, 27506, 25430, 14034, -2080, -17409, -26497, -26340, -17104, -2562, 13028, 24782, 27592, 20541, 6344, -9735, -22113, -26835, -22837, -11045, 5144, 19541, 26889, 24768, 13913, -1148, -15651, -25080, -26161, -17875, -3191, 12522, 23710, 26193, 20032, 7550, -8057, -21104, -26608, -22819, -10965, 4596, 18130, 25297, 24332, 14889, 14, -14822, -24512, -25453, -17428, -3809, 10761, 22128, 26021, 20530, 7926, -7459, -20040, -25369, -22237, -11753, 3078, 16893, 24742, 24047, 14729, 524, -13367, -22920, -24972, -18005, -4800, 9944, 21270, 25025, 20011, 8560, -5769, -18611, -24875, -22204, -11976, 2383, 15721, 23403, 23422, 15488, 1793, -12382, -22226, -24254, -17685]
751a7685J2281J3925J1320M560m060j1267j4329j2422n937J998R096J3599J3434
764A4513Q402J81p829j3019j3502r575k663N399J1989J4035J1247M391l807j0347
778I415j3340j2426o702J429R070J3432J2767P950P48o743j2446j3581r865k733
792b3025N430J1279J3163J0876N194k967j0088j3449j2070o399J123Q170J2334
805d29J2867Q687J091o813j1914j2892r547l272M306J0668J3335J1186M890k855
819A9308r264j2415j1882p150L62P915J2404J2401Q271J362n616j1059j2988j0113
833a8464l424M265J0221J2506J0766N420j752q766j2618j1813o872J99P095J1473
847a764J2137Q904K035n656j0992j2272r629l756L312R463J2538J1028N383j763
$$ y = [-17685, -5404, 8521, 19841, 24401, 20341, 9074, -5255, -17677, -23614, -21616, -12520, 1079, 14513, 22915, 23096, 15267, 2248, -11254, -20829, -23492, -18093, -6104, 7931, 19178, 23569, 19762, 9415, -3925, -16351, -23053, -21624, -12554, 878, 13645, 21595, 22343, 15600, 3154, -10427, -20292, -23025, -17595, -6316, 6847, 17723, 22917, 19950, 9862, -3587, -15657, -22056, -20933, -12763, -429, 12438, 21125, 22216, 15403, 3489, -9403, -18950, -22222, -17916, -7248, 6087, 17273, 22163, 19308, 10044, -2371, -14253, -21403, -21041, -13126, -722, 11679, 19950, 21312, 15696, 4637, -8351, -18464, -21888, -17623, -7402, 5104, 15870, 21290, 19538, 10772, -1846, -13659, -20531, -20332, -13237, -1764, 10373, 19277, 21312, 15656, 4664, -7608, -17237, -20993, -17681, -8218, 4320, 15348, 20731, 18968]
861A8968q213j1792j1331p340o07O774J1481J1939Q471K163m903j0060j2112j0117
875a6679m025L429R089J1800J0473N789r58p610j1709j1562p012n64O086J0609
889b844J1512Q842K809m633j0016j1671r563m211K502Q386J1634J0821N741r14
903A8395p128j1000j1004p319j322N533J0609J1426Q462K769l939r048j1330j0043
917a4939m555K443Q149J0974J0308O123j81o518j0856j1094p352j245N068R758
931c917J0981Q752L454l636r237j0981r300m658J643P368J0808J0660O206l47
945A7796o288j0099j0504p420k007M437R785J1196Q262L228l063q220j0588r679
959a3164n264J587P407J0379J0049O105L95n408r871j0803p591j709M220Q957
$$ y = [18968, 10755, -1037, -12368, -19708, -20315, -13541, -2060, 9879, 18350, 20513, 15610, 5550, -6562, -16679, -20704, -17275, -8186, 3614, 14087, 19876, 18918, 11308, -401, -11963, -18975, -19539, -13453, -2844, 8668, 17510, 20319, 15686, 5670, -6001, -15564, -19775, -17273, -8887, 2747, 13568, 19309, 18395, 11267, 267, -10737, -18056, -19378, -13845, -3236, 8190, 16652, 19421, 15482, 6434, -4896, -14939, -19494, -17051, -8902, 2072, 12380, 18503, 18322, 11804, 948, -10146, -17498, -18743, -13675, -3917, 7064, 15816, 19270, 15634, 6397, -4584, -13884, -18542, -16899, -9531, 1277, 11937, 18143, 17796, 11508, 1409, -9095, -16515, -18522, -14085, -4300, 6896, 15158, 18386, 15323, 7103, -3485, -13164, -18428, -16841, -9434, 945, 10994, 17099, 17494, 12086, 2215, -8588, -16179, -17888, -13668, -4711]
973d711J0397Q622L768k558q170j0521r274n077J163O529R885J0176O631M25n418
988A1867r354j0236p602k273L724Q658J0450Q415L855k186p587j0054r287n507
1002a7117P10O529R613R628O501J137m701r235j0288p538k327L403P997J0023
1016D335Q502M252j722p385r995q998n136R5N598R335R859O921J068m777q564
1031C388r620p596k901K698P849J0170Q531L972j662o584r133r151n960k27N821
1046a0405R246R350O427J588l918q068r874p924k957K884P485R320Q254M590r89
1061A5009o336r383r022n559k06M913Q553R302O875J934l828p946r366p585l226
1076a5871K172O896R346Q455M489q14n819q850q892n846o72M729Q345R082O599
$$ y = [-4711, 5686, 14308, 18076, 15518, 7348, -3173, -12447, -17524, -16361, -9832, 53, 10229, 16860, 17285, 11867, 2513, -7723, -15325, -17598, -13874, -5216, 5234, 13649, 17504, 15318, 7731, -2323, -11610, -17117, -16407, -9878, -265, 9363, 15864, 17001, 12300, 3065, -7223, -14761, -17088, -13685, -5688, 4335, 12837, 17089, 15367, 7982, -2013, -11011, -16147, -16052, -10454, -1119, 8740, 15661, 16729, 11952, 3388, -6232, -13828, -16729, -14031, -6182, 3988, 12519, 16491, 14829, 8245, -888, -10039, -15999, -16226, -10405, -1159, 8191, 14618, 16206, 12288, 4220, -5654, -13578, -16535, -13651, -6166, 3154, 11408, 15998, 15009, 8673, -710, -9732, -15291, -15497, -10584, -2031, 7271, 14146, 16080, 12252, 4306, -5060, -12645, -15871, -13699, -6803, 2543, 10998, 15487, 14673, 8854, 4, -8888, -14734, -15406, -10677, -2332, 6750, 13349]
1091A3349K180l047p606r329p655l381J989O572Q785Q203M920k92n644q748q650
1106h354n654q83M039P748R083P030K362l094p312q673p443l715J228O238Q829
1121A429Q289M815l77n139p958q399o142j413L890P792Q781O741K346k381o607
1136E667q717p782l862J401N977Q224P832N055K94m635q025q542n932j254L521
1151a0778P085Q438O970K774k227o610q451p266l882P42N428Q139Q077N053L06
1166A3798m484p530q071o104j795L216P077Q350O637K847j815n985q191p618m088
1181a3756P41N248P845P545N168Q74l983p468q150n973j809K898O441Q006O891
1196A0518L334j727n915p973p141m170J73M668P577P937N259Q33l856o840p707
$$ y = [13349, 15529, 12482, 4876, -4453, -12108, -15489, -13500, -6928, 1857, 10060, 14980, 14688, 9044, 296, -8354, -14008, -14891, -10852, -3104, 5979, 13009, 15371, 12277, 4965, -3708, -11151, -14866, -13638, -7400, 1429, 9718, 14533, 14156, 9017, 1059, -7340, -13482, -14895, -11005, -3213, 5568, 12309, 14655, 12274, 5667, -3050, -10832, -14694, -13293, -7316, 908, 8740, 13795, 14089, 9454, 1429, -7113, -13045, -14299, -10778, -3693, 4745, 11715, 14489, 12262, 5652, -2799, -10065, -13947, -13205, -7777, 362, 8439, 13492, 13798, 9314, 1784, -6287, -12391, -14186, -10970, -3893, 4457, 11094, 13941, 12126, 6141, -2050, -9668, -13756, -13015, -7767, 78, 7623, 12791, 13665, 9682, 2214, -5936, -11909, -13718, -10820, -4379, 3627, 10518, 13852, 12125, 6210, -1763, -8904, -13074, -12901, -8233, -656, 7281, 12540, 13373, 9517, 2677, -5030]
1211e030o240k294K494O397P983O698L162j296n220p600p422m541J74M524P219
1226i92P523N258J324l224o760p868o095k242K143N896P628O768L588r00n249
1241F798p514p037m418l69M034O988P613N407J364l159o331p386o108k715J763
1256a1070N755P602O626L534p42m700p011p139m871m20L966O746P188N379J728
1271A2571k659o071p506o174k656J627N355P077O640L899k96m629o937p009m551
1286a1319p65L362O304P301N613J796k478n714p140o073k926J073N046P154O553
1301G787L810j80m022o526o887m967j034L328O177O878N466K074j914n444p123
1316b577o192k966J056M574O722O473M122K88m013o468o694m736j131K728N748
$$ y = [-5030, -11270, -13564, -11070, -4673, 3310, 10008, 13170, 11874, 6654, -946, -8368, -12909, -12735, -8211, -992, 6531, 11789, 13113, 9889, 3129, -4739, -10834, -13076, -10933, -5037, 2591, 9359, 12947, 12047, 6798, -716, -7753, -12171, -12540, -8506, -1518, 6095, 11502, 12866, 9707, 3376, -4010, -10118, -12833, -11070, -5315, 2287, 8913, 12447, 11705, 7005, -6, -7145, -12016, -12436, -8470, -1724, 5464, 10843, 12571, 9912, 3841, -3665, -9839, -12495, -10868, -5513, 1564, 8204, 12103, 11807, 7178, 241, -6768, -11319, -12084, -8722, -2418, 4883, 10496, 12292, 9814, 4100, -3040, -9113, -12039, -10966, -5920, 1234, 7787, 11597, 11417, 7395, 869, -6018, -10985, -12019, -8691, -2514, 4364, 9830, 11904, 9990, 4546, -2577, -8769, -11735, -10679, -6105, 617, 7090, 11212, 11500, 7487, 1019, -5675, -10411, -11542, -8814, -3066]
1331c066O897N699K247k012n246o563o033l192N40M371O750O457L899L22l511
1346G559n997o598m950j536K690N665O640N390K358j483m653o706o209l209O42
1361a0397M007O302O213M170P72l271n961o565m751j586K207N225O444N742K557
1376A1108j417m629o315n824l412Q1L649O272O253M194P01k914n483o268n031
1391i035j956K098N162O252N337K749r74m153o196o076l548K27L501N692O043
1406E123M356J162k677n438o316m822j924J732M755O027N555K922q97m154n845
1421d41n791l616j91L177N622O150M305J056k465n010o036m927k197J442M714
1436d208N992N351K815n25l694n776n878l705k20L013N400N785M311J511k157
$$ y = [-3066, 3831, 9530, 11777, 9765, 4519, -2044, -8077, -11269, -10729, -6358, 392, 6849, 10748, 11070, 7559, 1562, -5036, -9986, -11522, -8832, -3167, 3473, 8863, 11221, 9738, 5085, -1621, -7830, -11039, -10397, -6390, -88, 6125, 10295, 11067, 7796, 1835, -4730, -9481, -11067, -8860, -3635, 2809, 8551, 11108, 9691, 5062, -1253, -7077, -10489, -10408, -6759, -487, 5766, 9960, 10661, 7747, 2264, -4004, -9035, -10991, -8893, -3731, 2521, 7858, 10607, 9633, 5480, -716, -6792, -10340, -10113, -6612, -920, 5123, 9479, 10641, 7964, 2526, -3790, -8612, -10536, -8804, -4049, 1978, 7533, 10455, 9558, 5404, -441, -6232, -9848, -10039, -6862, -1240, 4910, 9215, 10271, 7806, 2796, -3240, -8167, -10364, -8922, -4208, 1784, 7135, 9950, 9425, 5731, -45, -5923, -9628, -9848, -6835, -1435, 4350, 8661, 10172, 8015]
1451H015n000o021m827k149J256M151N798N474L157m23l679n506n583l721p16
1466i774K667N167N998M383J389j948m567n678m914k538R93M086N771N193L100
1481I328j35l181n253n684l976p81K658N028N493M381J783j513m506n813m883
1496g054k440Q89L672N365N334L359O8l100n232n380l883r36K158M671N666M480
1512G637J820j599m031n514m908k736O71L612N370N208L162K51k730m962n459
1527d208l953j083K095M567N365M341K127j206m067n399m870k586M42L198N036
1542b01N300L393M64k664m878n248l806j366J765M265N451M530K032j188l722
1557D127n040m857k898N7L216N071N132L295M88k245m444n173m200j496J715M261
$$ y = [8015, 3015, -3006, -7833, -9982, -8726, -4575, 1223, 6697, 9854, 9431, 5752, 246, -5337, -9058, -9774, -7107, -1940, 4058, 8441, 9830, 7882, 3315, -2363, -7277, -9815, -8822, -4736, 1035, 6228, 9328, 9193, 6012, 759, -4925, -8901, -9682, -7024, -1996, 3497, 7878, 9661, 8148, 3642, -2171, -7054, -9494, -8605, -4933, 432, 5766, 9125, 9193, 6093, 861, -4519, -8402, -9338, -7180, -2509, 3157, 7637, 9457, 7858, 3827, -1687, -6595, -9331, -8660, -5048, 322, 5530, 8692, 8943, 6213, 1251, -4208, -8161, -9244, -7149, -2582, 2783, 7124, 9251, 8045, 3978, -1421, -6291, -8877, -8435, -5237, -201, 5099, 8492, 8956, 6292, 1414, -3834, -7640, -9006, -7241, -2976, 2475, 7005, 9037, 7849, 4127, -913, -5770, -8668, -8611, -5395, -324, 4808, 8103, 8591, 6346, 1902, -3271, -7471, -8967, -7252, -2991]
1573b991N091M247K295o84l473n102m888k884J04K843M637M980L572R71k173m447
1589B098n194l885j599J322L766N140M490K397p01l331m809m683l037k62K690
1604e598M561M999L513R42j971m025n065m154j637J137L697M952M319K481k77
1619G874l114m779m731l031l20K446M245M862L658J254j763m071m896l916j827
1634h109Q73L404M821M493K547l17k970m448m477l220o59K176M356M787L615J122
1650G994j448l715m704m164k029P30L565M334L706K401mk161l928m110k822n29
1666f884J733L552M018L230J321j110l173m153l507j733M44K573L906L897K417
1681F531O9k143l709l842k873q16J508L387M075L165J408j014k864l943l562k030
$$ y = [-2991, 2100, 6347, 8642, 7958, 4485, -617, -5505, -8389, -8285, -5442, -805, 4175, 7747, 8718, 6545, 2098, -3096, -6981, -8580, -7258, -3492, 1648, 6138, 8535, 7834, 4503, -306, -4989, -8026, -8288, -5598, -1037, 3962, 7475, 8417, 6446, 2421, -2644, -6798, -8435, -7298, -3601, 1351, 5670, 8151, 7874, 4760, -19, -4750, -7781, -8101, -5655, -1410, 3452, 7110, 8364, 6601, 2530, -2366, -6282, -8109, -7236, -3832, 989, 5482, 8029, 7712, 4742, 294, -4183, -7403, -8062, -5886, -1530, 3257, 6872, 7994, 6546, 2831, -1873, -6037, -8066, -7336, -3771, 563, 4269, 6670, 6666, 4505, 577, -3533, -6355, -6884, -5151, -1599, 2419, 5649, 6970, 5860, 2687, -1466, -4973, -6706, -6262, -3689, 217, 4114, 6531, 6600, 4457, 748, -3094, -5967, -6783, -5275, -1888, 2187, 5352, 6760, 5746, 2882, -1061, -4623, -6653]
1697f653L86K533L835L646K394L18j848l530l995k854q75J441L198L801L301J517
1713F615p94k836l886l425k039J89K310L636L769K537M27j940l400l729k850j108
1729f524J209L124L910L213J472p56k558l637l545k130Q0K273L471L668K415N68
1745F253j562l248l861k901j120J275K848L651L243J623m05k565l627l454k078
1760e928j37K028L331L697K607P05j613l118l631k909j189Q19K731L749L270J644
1776F056l79k315l444l393k345k80J970L422L493K518Q01j314k926l716k997j216
1792f065Q39K550L507L257J796j58k201l530l405k201k40J730L027L533K755Q47
1808F041j274k880l497k947j339O21K396L553L263J779j53j994l247l347k457
$$ y = [-6653, -6267, -3734, 101, 3747, 6141, 6459, 4611, 1081, -2914, -5768, -6643, -5202, -2004, 1797, 5098, 6615, 5821, 2985, -901, -4326, -6365, -6176, -3866, -230, 3539, 6076, 6503, 4563, 1163, -2566, -5416, -6524, -5315, -2191, 1719, 4932, 6404, 5648, 3090, -547, -4092, -6222, -6142, -3869, -398, 3270, 5685, 6253, 4691, 1443, -2418, -5319, -6439, -5164, -2316, 1335, 4578, 6201, 5796, 3231, -396, -3850, -5928, -6065, -4037, -706, 2991, 5598, 6303, 4690, 1572, -2059, -4968, -6157, -5338, -2607, 1142, 4412, 6056, 5677, 3362, -82, -3475, -5820, -6100, -4130, -708, 2785, 5303, 6104, 4790, 1864, -1852, -4849, -6065, -5226, -2676, 831, 4088, 5884, 5726, 3525, -5, -3410, -5611, -5851, -4121, -1094, 2439, 5194, 6041, 4767, 1887, -1610, -4557, -5896, -5275, -2879, 674, 3937, 5716, 5563, 3569, 322, -3025, -5482]
1823e482l78J518L156L532K476R81r94k647l536l033j448N90K327L394L084J976
1839E516J44j923l290l406k182n90J398K868L412K762J135r52k640l367k926j572
1855e613L39K134L331L230K011Q9j779l034l254k397q01J295K826L410K660J159
1871E606p50k374l270l029j755L41K059L140L154K008M15j561l032l275k403p86
1887e512J145K514L305K805J374p13k388l123l020j624K8J860L029L197K124L86
1903E387j606k701l103k507r95R27K635L275K646J362m69k158l089k964j863N6
1919e167J794K966L052K093N85j266k703l255k487r71R22K346L087K785J457l38
1935D900k074l081k912j740j65J577K804L192K169N79j239k557l072k478j116
$$ y = [-5482, -5860, -4342, -1186, 2346, 4822, 5803, 4809, 2162, -1374, -4407, -5855, -5265, -2938, 456, 3540, 5516, 5660, 3737, 447, -2959, -5141, -5731, -4333, -1465, 1947, 4709, 5844, 4892, 2252, -1115, -4041, -5613, -5274, -3140, 191, 3421, 5432, 5521, 3742, 708, -2546, -4943, -5744, -4449, -1623, 1787, 4447, 5606, 4856, 2482, -788, -3817, -5572, -5231, -3172, -32, 3122, 5130, 5545, 3984, 952, -2323, -4726, -5512, -4367, -1853, 1452, 4257, 5631, 4918, 2530, -593, -3613, -5237, -5209, -3349, -320, 2877, 5001, 5387, 3781, 1080, -2023, -4530, -5525, -4598, -1963, 1312, 3958, 5320, 4851, 2693, -396, -3360, -5223, -5167, -3373, -407, 2645, 4738, 5323, 4057, 1354, -1901, -4388, -5359, -4437, -2091, 996, 3781, 5238, 4900, 2826, -255, -3167, -4907, -5072, -3495, -691, 2501, 4670, 5249, 4010, 1453, -1619, -4097, -5213]
1950e213O75K245L173K712J399k52j777k874l011j879k82J546K699L047K146P59
1966E113r97k411l175k479j127N98K194K856K781J583l1j879k853k873j845l38
1982d883J247K564L026K314P36r31k370k865k503j311M43K045K926K768J480k5
1998D661j582k640k890k027m46J271K560K822K244Q89o77k255k978k546j276M90
2014d380J833K766K676J717Q5j549k629k814j949n37J049K350K915K391R55p76
2030D103k137k724k567j387K54J744K711K732J700J86j415k466k728k147n28R61
2046c708K298K777K295R72m60j975k769k602j340J37J674K538K650J813L56j365
2062C291k459k751k002o24Q10K130K772K336J105m41j971k623k457j470m2J528
$$ y = [-5213, -4538, -2293, 880, 3592, 4991, 4739, 2962, 88, -2923, -4802, -5084, -3538, -839, 2208, 4354, 5113, 4116, 1705, -1470, -3949, -5076, -4478, -2284, 572, 3353, 4936, 4905, 3026, 173, -2700, -4545, -4883, -3636, -1072, 1954, 4268, 5004, 4073, 1703, -1162, -3665, -4976, -4533, -2488, 438, 3206, 4686, 4661, 3079, 439, -2451, -4478, -4924, -3653, -1093, 1729, 3973, 4862, 4185, 1930, -1048, -3594, -4870, -4380, -2547, 219, 2895, 4612, 4697, 3148, 519, -2295, -4244, -4781, -3732, -1382, 1533, 3924, 4879, 4103, 1966, -758, -3325, -4712, -4458, -2714, -3, 2729, 4429, 4615, 3200, 734, -1994, -4141, -4669, -3708, -1410, 1367, 3662, 4634, 4174, 2199, -570, -3172, -4512, -4375, -2701, -163, 2487, 4300, 4656, 3291, 832, -1919, -3921, -4545, -3735, -1605, 1167, 3503, 4608, 4167, 2196, -427, -2884, -4354, -4396, -2868]
2078b868K611K645J713L79j142k305k670k137q43Q15K104K739K259J075k76j723
2094B376k624k530j599nJ570K368K505J922M89j063k231k698k069p88N99J924
2110a854K580K427J234k22j804k491k405j594j97J363K319K635J883M84r68k096
2126A294k637k091r81N77J877K598K350J269k01j515k453k502j633j59J218K224
2142g65K498J909P60q90k081k655k091r25M11J706K540K324J474j31j535k389
2158A60k327j662m22J104K200K648J860O47p62j926k475k144j096L85J597K528
2174C15K314J370J8j286k311k468j776l41J067K053K435J997P98n77j929k510
2190h31k176j063K75J555K330K299J537J15j287k249k384j702n51R12K037K420
$$ y = [-2868, -257, 2388, 4101, 4480, 3338, 1033, -1637, -3774, -4617, -3802, -1698, 1041, 3300, 4375, 4099, 2376, -248, -2778, -4377, -4382, -2812, -444, 2061, 3983, 4472, 3409, 1178, -1520, -3589, -4377, -3778, -1854, 726, 3153, 4387, 4165, 2361, -130, -2535, -4129, -4326, -2963, -644, 1991, 3874, 4358, 3390, 1294, -1343, -3434, -4415, -3838, -1961, 637, 2987, 4256, 4055, 2540, 87, -2415, -4048, -4207, -2989, -765, 1733, 3642, 4402, 3512, 1431, -1224, -3315, -4240, -3829, -2123, 417, 2741, 4215, 4084, 2549, 160, -2167, -3829, -4251, -3147, -947, 1701, 3561, 4208, 3446, 1520, -955, -3099, -4195, -3810, -2213, 315, 2629, 3999, 4017, 2731, 420, -2048, -3824, -4165, -3098, -1045, 1390, 3387, 4185, 3608, 1679, -831, -3007, -4070, -3795, -2240, 90, 2389, 3926, 4041, 2754, 505, -1879, -3581, -4132, -3220, -1183, 1237]
2206A237K073P50n11j798k354k152j205P7J596K302K285J473K07j186k092k365
2222a663j841n05Q86J876K344J966Q82l48j665k374k178j239J03J380K131K327
2238B082J537L79j191k018k355j708p08P11J810K426J994R16l60j593k180k156
2254b414j300QJ219K183K294J534K68q35j952k333j843o72O26J697K293K007R28
2271C708j17j479k245k226j273n1J201J974K259J612M13q40j919k195j800p54
2287c732L83J680K331J971J069j69j485k086k032j396k10J081J980K264J571M31
2303C651p03j828k157j838q66M33J633K160J968J131o3j295k115k119j447j01
2319c556R76J862K140J670N38o61j741k169j817q30L45J468K058K041J152j9j216
$$ y = [1237, 3310, 4060, 3549, 1751, -603, -2755, -3960, -3883, -2287, 15, 2300, 3773, 3980, 2794, 702, -1663, -3504, -4009, -3123, -1247, 1097, 3063, 3945, 3597, 1932, -442, -2620, -3859, -3756, -2376, -245, 2082, 3619, 3998, 2807, 789, -1566, -3274, -3982, -3271, -1461, 965, 2959, 3875, 3515, 1922, -258, -2414, -3714, -3706, -2487, -304, 1990, 3524, 3792, 2957, 1005, -1328, -3171, -3843, -3217, -1520, 773, 2780, 3708, 3591, 2112, -133, -2359, -3632, -3683, -2482, -508, 1751, 3363, 3776, 2936, 1017, -1178, -2978, -3732, -3349, -1669, 662, 2633, 3702, 3533, 2048, -38, -2070, -3466, -3676, -2595, -615, 1649, 3220, 3651, 2948, 1120, -1037, -2875, -3741, -3308, -1675, 485, 2453, 3584, 3521, 2226, 111, -2008, -3455, -3556, -2580, -718, 1422, 3092, 3630, 2969, 1228, -941, -2758, -3588, -3243, -1775, 283, 2324, 3476, 3457, 2241]
2336B241k028k011j454k24Q09J917K101J591O60o27j623k054j880j003L21J451
2352a813K063J847J297nj062j944k124j469l18Q44J765K101J687P06m99j641k074
2369f39j863r11J85J251K000K000J324J05j129j840k051j453m64P43J690K096
2385A044J686P33m77j410k038j870j062J14J314J961J912J259J91r85j748k019
2401a395j562m17O95J565J953J749Q81m46j356k034j867j051M8J156J906J992
2417A817J295K68r55j775j880j550o17N70J543K083J766O74j95j369j891j819
2433b035j182K9J102J792J944J320L43p90j674k009j511o73O07J471J858J699
2449B291R57j84j246j926j854j101j11J002J753J862J467L62p19j678j889j560
$$ y = [2241, 213, -1798, -3252, -3476, -2667, -750, 1351, 2942, 3602, 2975, 1352, -702, -2582, -3585, -3264, -1813, 250, 2097, 3394, 3389, 2327, 383, -1741, -3210, -3528, -2684, -919, 1182, 2869, 3575, 3076, 1435, -639, -2502, -3413, -3228, -1977, 23, 2023, 3347, 3452, 2323, 483, -1568, -3021, -3485, -2742, -1052, 1044, 2730, 3463, 2986, 1576, -462, -2332, -3394, -3280, -1966, -5, 1907, 3166, 3357, 2372, 624, -1395, -2957, -3374, -2679, -1114, 839, 2588, 3469, 3023, 1667, -367, -2234, -3285, -3237, -2081, -175, 1817, 3112, 3380, 2425, 650, -1230, -2780, -3397, -2827, -1284, 799, 2565, 3239, 3044, 1675, -216, -2035, -3217, -3188, -2086, -294, 1650, 2970, 3313, 2523, 849, -1160, -2671, -3344, -2737, -1266, 592, 2291, 3248, 3064, 1818, -108, -1962, -3063, -3174, -2172, -419, 1443, 2910, 3272, 2553, 875, -1014, -2574]
2465b574o51M20J408J939J729R02j94j160j789j796j240j54R10J745J870J310
2481B675M78o20j444j933j605p52M38J320J784J764R96l2j197j730j845j217j85
2498c105Q72J575J897J463M64o02j507j842j543q26L56J301J780J724J031k0j120
2515A898j682j732j256k91P74J632J817J402M95m58j448j798j620q01L06J215
2531a547J677J707J069R2r39j727j842j248k33O88J503J794J455O13n25j322j765
2548e50j603p83J35J105J734J746J066N3r18j531j768j297l93O20J502J779J455
2565B352O80m46j258j747j637q58J84J074J668J569J183J47p99j636j634j387
2581b545l99N78J425J648J532P09l55j164j839j463r68N4R84J593J708J170K01
$$ y = [-2574, -3225, -2805, -1397, 542, 2271, 3173, 2979, 1819, 30, -1766, -3006, -3160, -2250, -505, 1365, 2675, 3153, 2533, 1089, -844, -2449, -3201, -2763, -1443, 341, 2105, 3101, 3069, 1872, 142, -1703, -2920, -3105, -2233, -658, 1239, 2702, 3166, 2564, 1057, -785, -2328, -3154, -2798, -1497, 283, 2007, 3038, 3018, 1898, 216, -1516, -2772, -3063, -2289, -657, 1160, 2562, 3057, 2599, 1151, -647, -2267, -3068, -2762, -1547, 130, 1837, 2906, 2998, 2059, 332, -1510, -2758, -2991, -2303, -800, 994, 2449, 3062, 2537, 1215, -550, -2153, -2936, -2801, -1696, 38, 1784, 2850, 2903, 1985, 454, -1314, -2611, -3004, -2384, -882, 897, 2352, 3032, 2586, 1328, -419, -2056, -2914, -2730, -1656, 12, 1581, 2764, 2911, 2112, 476, -1158, -2545, -2944, -2366, -941, 707, 2239, 2948, 2593, 1429, -410, -1873, -2841, -2787, -1803, -210, 1498, 2668, 2869]
2598B869p76j454j690j338n17M99J343J748J427O96j88j147j615j679q76k3R80
2615a741J513J619J166K86p45j393j707j345m82M89J255J629J480P42j83j079
2631A504j651j594q84o8Q36J522J659J172K79o75j370j633j292n99L67J290J614
2648D77J437Q09j78j020j520j547j074q9Q77J427J604J172L54n48j347j604j353
2665b123o32L26J256J522J465Q80n4j086j466j569j033j24P10J407J643J235L81
2682B738n80j262j572j337o34K67J109J596J417Q42m4q88j500j529j060j59O82
2699a914J374J551J175M41m43j213j570j310o80K23J047J446J423R18Q4q83j426
2716B43j603r57k75O79J218J588J232N73m90j250j476j329p27J81J012J497J467
$$ y = [2869, 2093, 639, -1051, -2389, -2906, -2407, -1064, 684, 2111, 2807, 2619, 1472, -143, -1822, -2698, -2721, -1741, -228, 1391, 2557, 2843, 2098, 705, -1002, -2347, -2829, -2340, -1085, 544, 2024, 2766, 2583, 1504, -147, -1741, -2625, -2693, -1857, -335, 1324, 2496, 2775, 2100, 730, -903, -2195, -2794, -2427, -1137, 477, 1914, 2723, 2545, 1525, 5, -1542, -2616, -2705, -1828, -401, 1203, 2375, 2729, 2181, 834, -770, -2123, -2755, -2429, -1173, 349, 1814, 2694, 2640, 1554, 88, -1481, -2514, -2638, -1928, -521, 1122, 2357, 2738, 2158, 896, -676, -2013, -2647, -2380, -1271, 325, 1742, 2584, 2540, 1652, 152, -1377, -2437, -2596, -1914, -540, 1011, 2186, 2627, 2184, 971, -599, -1909, -2589, -2366, -1319, 127, 1550, 2468, 2552, 1669, 243, -1360, -2317, -2592, -1913, -695, 893, 2125, 2698, 2208, 958, -518, -1847, -2574, -2393, -1381, 116, 1583]
2733A583Q82M0p77j380j474j169k78N44J330J541J200N43l20j113j593j316p30
2750b487J24R29J435J357J037J65p59j383j506j085l41N17J134J552J301N65l36
2767B219j089j430j347q15L8Q78J424J482R98J43p89j254j449j104m23N09J107
2784i02J490J301N07j76r51j442j404q32M1Q95J259J450R55K27o19j230j479j086
2802a996m40L71J101J439J307O28j87r90j402j309p90p7P59J329J415J073J67
2819B398n67j170j483j105n04L46J069J481J234O31j42q10j401j365q95n3P52
2836a584J214J417J011L43n41j151j485j099m84L11J017J357J234P28m9r06j336
2853cj257r11j29O80J146J484J055K25m63j053j331j143o56L22R66J357J224P40
$$ y = [1583, 2465, 2505, 1728, 348, -1126, -2295, -2573, -2029, -699, 842, 2042, 2585, 2265, 1152, -441, -1757, -2487, -2363, -1434, 1, 1358, 2395, 2560, 1801, 418, -1088, -2173, -2514, -1997, -863, 689, 1990, 2555, 2219, 1130, -300, -1647, -2462, -2424, -1546, -122, 1360, 2358, 2501, 1712, 458, -991, -2095, -2518, -2009, -902, 588, 1889, 2396, 2220, 1269, -173, -1577, -2409, -2368, -1473, -214, 1236, 2191, 2418, 1799, 569, -910, -1996, -2436, -2065, -964, 475, 1782, 2410, 2223, 1233, -169, -1478, -2268, -2345, -1586, -257, 1158, 2231, 2398, 1831, 661, -822, -1927, -2431, -2085, -1016, 465, 1699, 2330, 2188, 1378, -23, -1388, -2283, -2336, -1584, -370, 1047, 2058, 2401, 1860, 709, -776, -1875, -2359, -2048, -1031, 326, 1560, 2288, 2239, 1333, -3, -1260, -2171, -2300, -1620, -474, 1010, 2065, 2290, 1827, 774, -557, -1700, -2356, -2034, -1068, 289, 1513, 2253]
2871B253p3p47j334j294r66j08N63J286J240J041M21l76j076j401j174n36K46
2888b035Q83J320J212P86J9p93j172j269r39k44M95J214J314J084L75l42j068
2905H40j270j202n43J37Q64J247J317O60Q0o39j245j283r58k01N49J083J262J035
2923A733M74l13r89j284j162o36J05Q25J265J252P95J02o92j196j228r06l12M28
2941a739J048J307J086N20l38r02j193j235o50J4P90J241J219P80J45n66j115
2958D12j248r86l29L83J040J287J049M70j77r01j178j236p10J38O89J109J247
2975A059Q77J63m89j180j203r29l83L30R55J220J098N83j84q74j193j110p14p7
2993b051O87J119J222Q77J64m52r85j248j053l09K90Q79J231J087N21o0p76j226
$$ y = [2253, 2180, 1433, 99, -1195, -2161, -2269, -1706, -420, 820, 1861, 2282, 1906, 830, -571, -1745, -2281, -2035, -1152, 168, 1380, 2166, 2185, 1392, 220, -1049, -1988, -2232, -1737, -523, 791, 1875, 2250, 1908, 840, -430, -1632, -2175, -2038, -1174, 73, 1390, 2050, 2130, 1491, 246, -1037, -1995, -2196, -1647, -564, 698, 1733, 2207, 1894, 905, -379, -1541, -2177, -2072, -1247, 18, 1270, 2065, 2167, 1475, 279, -949, -1855, -2167, -1739, -691, 616, 1702, 2222, 1884, 982, -211, -1446, -2096, -2082, -1292, -51, 1168, 1948, 2093, 1527, 412, -836, -1822, -2151, -1768, -728, 559, 1608, 2078, 1901, 1000, -178, -1414, -2124, -1986, -1297, -188, 1059, 1936, 2099, 1610, 430, -773, -1702, -2085, -1755, -800, 420, 1518, 2101, 1917, 1043, -150, -1260, -1974, -2051, -1364, -245, 977, 1854, 2018, 1566, 581, -667, -1720, -2029, -1739, -860, 371, 1458, 1979, 1919, 1143, -83]
3011h3j153o89p4O04J130J160Q97K99m77j020j195j008m27K99Q00J185J172N40
3029A960r9p03j132j077q08j38O18J080J148Q60K64l59r43j203j063l54K01Q10
3047i38J149J030O56Qo79j111j180p61j12M98R96J141R51L18k98r53j177r61n25
3066a948J60Q18J071J136N98No64j027j031q36k02M69R27J155R58K69k64p93j109
3085c08j016n69J42P35J081J074O63L2n51j016j133q41k02M44Q98J126Q92M20
3103A871k29q62j025j070m96O3O52J112J041O97N2n49r20j061q62k76L65R21J076
3122E00R56L91k10p55j076r98n59J7O54J049J024O50J71m72r55j095p99l21L44
3141a484P87J102R18M51j91o73j095r70n58nN83R27J082P67J71m85q56j048q21
$$ y = [-83, -1236, -1925, -1999, -1395, -265, 895, 1792, 2091, 1614, 594, -601, -1609, -2036, -1737, -937, 248, 1420, 1960, 1861, 1158, 26, -1051, -1859, -1997, -1379, -299, 849, 1709, 1973, 1614, 671, -532, -1595, -1949, -1748, -938, 211, 1241, 1897, 1905, 1226, 115, -1065, -1826, -1938, -1440, -444, 697, 1648, 1966, 1668, 715, -462, -1423, -1948, -1788, -970, 101, 1237, 1835, 1840, 1176, 149, -882, -1718, -1920, -1451, -524, 631, 1589, 1858, 1594, 801, -308, -1324, -1893, -1751, -1016, 65, 1139, 1802, 1834, 1283, 267, -866, -1707, -1909, -1465, -567, 559, 1451, 1871, 1642, 780, -245, -1315, -1811, -1748, -1096, 16, 1057, 1754, 1806, 1257, 337, -724, -1586, -1862, -1497, -576, 500, 1456, 1847, 1637, 882, -194, -1192, -1751, -1734, -1080, -31, 993, 1643, 1814, 1342, 387, -708, -1507, -1828, -1484, -697, 405, 1323, 1774, 1583, 910, -185, -1155, -1713, -1718, -1135, -208, 874, 1641, 1812, 1327, 471, -577, -1398]
3160a398l35J97Q39J055R38M59j03p04r83r46p06n4N94R57R89P20K34m09q27j093
3180e76q70l28L01P44R87R22M99n5n89j028r73o22j31N37Q54J032P94K80m59q10
3200E09r88q49l28J36P52R66R07N64o0o45q57r59o60k27N30Q88J018O80L14l18
3220A373p54j045q40m34K14P02Q58R10O33jn11r22j065o20j34M03P96R78P70L35
3240A646k60p77r14q96m55J40O71R00R55N23L2m81r08q75p18k18L33Q94R41P94
3260A327K81k16o74r71r05m74J29N54R76Q36N94P7l91r16r20o92j80L11P73R39
3280D58P21M59k46o36j013q10m54J5N91Q12R74N78J22m49q67q53o83l07K92P58
3300e38R34P40M07j87n55r04q85m84l2N33Q90Q16O34J78m01p96q85p58k65K71
$$ y = [-1398, -1733, -1536, -697, 358, 1296, 1755, 1652, 948, -35, -981, -1687, -1741, -1147, -190, 799, 1519, 1753, 1344, 517, -576, -1446, -1774, -1473, -729, 258, 1180, 1679, 1624, 1035, 7, -966, -1588, -1719, -1182, -328, 704, 1498, 1778, 1319, 509, -479, -1328, -1656, -1520, -768, 198, 1105, 1669, 1609, 964, 107, -852, -1512, -1739, -1209, -321, 697, 1377, 1691, 1373, 619, -426, -1266, -1700, -1486, -784, 74, 984, 1617, 1616, 1105, 183, -882, -1502, -1636, -1233, -437, 541, 1311, 1646, 1386, 609, -305, -1201, -1656, -1516, -845, 55, 1010, 1533, 1565, 1084, 176, -699, -1417, -1635, -1302, -408, 533, 1327, 1608, 1392, 718, -253, -1158, -1632, -1503, -949, 27, 863, 1457, 1534, 1143, 227, -693, -1385, -1565, -1254, -481, 458, 1179, 1638, 1392, 756, -257, -1067, -1521, -1506, -915, -103, 871, 1449, 1571, 1122, 255, -598, -1281, -1588, -1296, -538, 396, 1136, 1543, 1356, 801, -103, -988, -1472, -1504, -971, -81, 735, 1369, 1547, 1146, 350, -535, -1293, -1558, -1287]
3320a287P12Q92P57M51j45o05q37q56n05p0M83P85R19O28J44l53o99r14p04l18
3340a522J86O62Q97Q20M44j00n18q35q48n90j16M78P73Q86O51K18k74p16q61p77
3360a142l22J71O29Q25P85M26L8n83p98p66n82m0K86P95P97P18K22k96o73q45
3380c55o90m22J50N71Q60Q44L95k2m18p33q60o49p4K93P60R07N94K30j57o75q18
3401b69o98m44J23M69Q41P92M88J09m91p77p68o55r2K78O98Q16P06L32k16o31
3421F11q65p10m10N0N07Q10Q35M70N1l82p09q51o44j89L15O57Q49O27L44j42n56
3442F68q36p10m59J03M53P67P20N23J61m21p27p63n63k38K45N95P74P00L67j69
3462A190n18p54p06m73l6M82P56P37N04J14l45o09q00o36k03J94N82P75O73L55
$$ y = [-1287, -575, 317, 1074, 1525, 1380, 775, -62, -918, -1423, -1493, -1010, -225, 694, 1322, 1466, 1113, 414, -500, -1204, -1522, -1336, -674, 223, 1043, 1487, 1387, 869, 34, -814, -1404, -1520, -1042, -269, 617, 1268, 1486, 1212, 496, -365, -1142, -1464, -1293, -664, 161, 946, 1372, 1410, 827, 29, -737, -1319, -1359, -1073, -278, 519, 1237, 1459, 1163, 490, -355, -1045, -1467, -1317, -746, 114, 958, 1353, 1331, 913, 180, -680, -1329, -1403, -1110, -350, 557, 1151, 1381, 1224, 549, -269, -967, -1411, -1288, -819, 22, 814, 1302, 1411, 920, 143, -625, -1280, -1372, -1094, -396, 420, 1126, 1458, 1242, 611, -254, -964, -1374, -1324, -817, -7, 828, 1298, 1349, 967, 258, -593, -1237, -1426, -1111, -454, 395, 1022, 1366, 1224, 668, -168, -878, -1337, -1234, -781, -14, 706, 1229, 1390, 969, 242, -521, -1084, -1322, -1077, -482, 292, 992, 1359, 1190, 672, -82, -788, -1261, -1297, -815, -59, 678, 1182, 1296, 951, 342, -458, -1094, -1297, -1103, -521, 254, 927, 1282]
3482A282n8n10p72p68m51M1M10P05P19N47J36k64o34p58o42k33J23N19P42P94
3502I28L41o2n03p62o41n17j1L48O15Q26M98K11k39o59p28n95l75K22N55P26P04
3523H82L26k9m25o80p30n31n1M13O21O72O20J47k20n95p16n97l92J98M28P42P33
3544H16L41L6m39o69o69m84j96L23O10O87O63K13k34n37p30n71l55O5N11P05O78
3565G64L81qk95o41o90o15r8L09N81P14N81K11j12n87p28o47k66P9L57P61O11
3586F62M83pm04n90o27n32j65K30O04O88N46K67j30n19o61o27l91J20M25N53P43
3607F68L86J04l50n69p69m56j53J97N69O81N20K87p7n00o50o15l63nL46O89O75
3628F15M47J04l22n87o76n40j81J29O01O54N83K64m6m01p21n56m08l4L54N90O37
$$ y = [1282, 1224, 714, -58, -826, -1277, -1236, -826, -121, 598, 1145, 1281, 1017, 383, -375, -1017, -1250, -1127, -608, 134, 928, 1269, 1207, 704, -58, -699, -1216, -1227, -879, -264, 562, 1060, 1271, 1032, 373, -355, -950, -1325, -1103, -548, 178, 882, 1208, 1179, 754, 74, -656, -1187, -1238, -825, -204, 468, 1088, 1235, 1015, 420, -296, -893, -1285, -1087, -659, 83, 816, 1157, 1193, 754, 85, -584, -1068, -1264, -941, -331, 356, 1019, 1232, 998, 461, -269, -840, -1195, -1130, -619, 86, 764, 1145, 1137, 842, 201, -489, -1104, -1202, -893, -312, 402, 983, 1194, 1082, 495, -233, -880, -1146, -1067, -710, 51, 662, 1145, 1138, 734, 144, -483, -1015, -1180, -950, -346, 342, 888, 1155, 1025, 506, -155, -782, -1173, -1053, -628, -75, 668, 1054, 1158, 808, 239, -530, -986, -1139, -942, -373, 308, 828, 1115, 1038, 538, -112, -727, -1090, -1095, -749, -60, 615, 1062, 1166, 844, 257, -419, -959, -1140, -1011, -410, 244, 827, 1091, 1045, 644, -77, -633, -1041, -1075, -721, -131, 506]
3649E06M98J06k89m92o87n10j96R5M93O83N71L52q1l79o75o05m31j3L52N33O16
3670D47N59J00k22n47p13m74k51K06L59O71O16L07k9l77o07o19m72p1L06O25O26
3691D40M62J19k12m20o49n31k93R9M71O75N10L40k3l33n70o49m31k2K21N73O12
3712C89M68K12j59n15o33n33k31M2L88N89O38L31J0l38n77n51m61r4K32N15N46
3733B68N21J97p8m77n65n94k50Q9L07N57O01L75O9k62o07o37l94j28J91N10O27
3754C20M52K76j44m19n97n49l06K9L15O29N50M29Jk82m77n69m59j91J50M92O19
3775B69M61K79j85l55n05n55l68l5L94N55N26M72K5k67m74n96m27j76J25M45N92
3796B00N03K44r4l28n52m95m08J4L02N30N43L77J16k45m78n00m73k28J44M75M73
$$ y = [506, 1004, 1110, 821, 329, -358, -868, -1064, -969, -476, 207, 778, 1130, 1049, 670, -5, -610, -1041, -1054, -702, -169, 447, 1006, 1106, 884, 337, -376, -850, -1101, -895, -536, 135, 751, 1058, 1029, 652, 45, -574, -1046, -1117, -811, -186, 440, 902, 1021, 809, 389, -260, -791, -1084, -985, -514, 161, 671, 1011, 988, 655, 85, -564, -995, -1017, -796, -223, 389, 857, 1069, 910, 395, -238, -771, -1002, -960, -572, 17, 655, 986, 996, 658, 81, -470, -931, -1025, -793, -278, 268, 789, 986, 908, 431, -134, -728, -978, -889, -582, -25, 576, 951, 1020, 758, 151, -486, -880, -1008, -817, -307, 320, 772, 1048, 904, 485, -112, -661, -967, -938, -623, 6, 556, 985, 986, 704, 227, -342, -801, -992, -842, -350, 269, 730, 1009, 824, 469, -36, -591, -959, -994, -600, -45, 481, 953, 978, 711, 237, -359, -786, -962, -837, -392, 200, 703, 947, 853, 525, -27, -522, -930, -916, -614, -84, 459, 836, 952, 707, 229, -271, -744, -972, -828, -353, 120]
3817A20N40K17%l22n57n17l37o2L12M34N54M34P2j73m13n47m81j89J34L80M75
3838G4N38L20l1l93m86n08l26p6K63M76M95M26J48j85m26n43m44j76M4L39N35
3859F4N28K27nk59m95m84l63p0K05M68M70M60J48j19m37n31m92k33J40L61M83
3880F6M13L44J1k85m01n43l67j08J57M59N41L53K17q4l92n34m76k63Q9L18M65
3901b0N45L70n2k46m66n28l66j59K43M22N27M16J59j23l71m22m69k83R4K77L91
3922f1M60L75J32l15m67m87l56j13J29L97M79L95K64p8l64m84m48k51l0K97M63
3943f3M84L37Q2k24m61m45m05j43J07M04M92M03K34p6k99m66m99k57l6L10M02
3964a19M85L49Q5j49l91n10l78j72M8M28M08M70K62l5k60m99m62k31j26K45M17
$$ y = [120, 660, 877, 877, 555, -2, -519, -856, -918, -606, -172, 382, 816, 888, 715, 302, -245, -726, -915, -781, -401, 74, 612, 932, 901, 508, 22, -486, -812, -888, -625, -149, 346, 772, 920, 735, 309, -234, -678, -854, -810, -471, 64, 592, 819, 814, 555, 60, -424, -787, -857, -652, -184, 286, 746, 894, 775, 338, -193, -685, -918, -778, -417, 66, 479, 823, 834, 549, 148, -395, -762, -870, -713, -254, 287, 640, 857, 773, 381, -153, -629, -892, -803, -485, -20, 525, 895, 843, 597, 131, -397, -763, -922, -679, -257, 270, 686, 845, 722, 351, -71, -540, -823, -729, -452, -61, 399, 774, 906, 591, 124, -363, -719, -832, -703, -306, 173, 568, 832, 754, 390, -94, -542, -793, -823, -526, -63, 421, 758, 840, 616, 155, -290, -695, -838, -731, -327, 165, 568, 802, 726, 427, -39, -538, -795, -831, -521, -119, 366, 715, 800, 651, 260, -250, -628, -800, -752, -324, 84, 554, 816, 781, 521, 22, -440, -671, -797, -552, -135]
3985a35M74L74M9j26l37n22m04j79N8L72M98L99J79N8l22m35m02l46j0J55M11
4006a91M47L56J57j10l23m84m23j65K1L14M21M20L37l7k43m33m80k16j24J72M00
4027a84M58L36J31j27l13m32l63k61N3K84L92M44J99Q0k58l63m02l66p3J90L46
4048b29M17L83J33l4l36m24m18k14K2L10K96M78K97N3j60m02m26l03j74J66K57
4069c08M69M03J27p4k83l96l74k07n4K47M00L97K67Q0j82l13m47l17k08K04K93
4090b76L68L52K54o0k41l93m08k33r6K21M25M16L14P9j85l12m36l53j61J50K74
4111c01L94L63K32l2k35l88l61l02p4K07L70M20L23N1p1l43m56k87j59O2K63L74
4133E0L07K78L9k03m46l63k47q9J95K97L97K88J52j40k84l17l70j61L4J68M57
$$ y = [-135, 339, 713, 762, 636, 299, -223, -627, -806, -748, -376, 122, 521, 700, 758, 436, 1, -401, -747, -757, -602, -191, 256, 612, 769, 659, 336, -148, -571, -736, -715, -401, 20, 440, 777, 740, 497, 64, -416, -632, -756, -584, -184, 274, 610, 741, 614, 301, -131, -494, -755, -702, -418, -26, 418, 617, 697, 439, 76, -326, -692, -765, -575, -229, 188, 571, 704, 670, 334, -90, -508, -722, -700, -390, -94, 384, 681, 734, 574, 172, -254, -557, -731, -565, -308, 161, 564, 691, 617, 334, -62, -436, -643, -697, -450, -50, 347, 614, 694, 512, 199, -248, -565, -773, -569, -276, 92, 444, 698, 638, 397, 4, -404, -637, -733, -512, -87, 329, 643, 722, 537, 225, -211, -564, -725, -575, -301, 93, 456, 688, 656, 421, 33, -328, -630, -704, -497, -127, 293, 616, 667, 596, 253, -203, -490, -649, -587, -324, 50, 357, 635, 674, 471, 25, -338, -585, -674, -479, -182, 215, 503, 655, 515, 231, -86, -456, -617, -583, -415, 42]
4154D2L50K37J7j97l87m05k61n9J34L47M02K65K54j67k65l50m24k02L6K76L34
4175b3L49K92K5j73l01m21l29o3M0L92L81K73K23p3k52l71l60j97m1K19L59L72
4197C21K81Q2k39k58m34k67j11P0L68L69L07J22L0k41l87m42j92pJ87L51M44J93
4219E47J32j68l10l72l47r7j3L27L97L36J82K9k53l55m19j62l6J62L92K63L45
4240E80M3r4l21l70k96j32j5L34K93L78K22l4j54l83m17j64q4J39L51L29L15O1
4262E81p8k33l91l24j20M0J85L18L84K25j9j59l80l31k37m2R6K56M39K43K09j32
4284E30k65l83l20j19q5K95L78K89K78J3j70l92l44k58p8Q3L58L52K85J83q1k81
4306B68l43l17j95n2K24L37M19K02J14j92l82l04k86j50J86K19L83L19J80r8k43
$$ y = [42, 392, 629, 646, 449, 62, -343, -604, -663, -529, -182, 220, 485, 739, 572, 307, -43, -467, -669, -633, -357, -23, 326, 618, 643, 470, 169, -252, -581, -644, -604, -212, 169, 442, 665, 592, 340, -31, -391, -588, -629, -410, -51, 321, 602, 684, 445, 187, -247, -514, -625, -555, -187, 182, 489, 611, 641, 400, 13, -429, -621, -628, -441, -90, 354, 547, 679, 511, 201, -171, -518, -615, -628, -301, 96, 432, 614, 643, 390, 35, -384, -546, -582, -420, -28, 235, 580, 623, 529, 208, -162, -458, -590, -605, -271, 22, 400, 622, 588, 434, 51, -366, -530, -614, -475, -124, 205, 520, 581, 503, 270, -121, -445, -565, -525, -340, -22, 362, 587, 568, 409, 29, -302, -539, -581, -485, -229, 210, 453, 662, 530, 265, -118, -438, -557, -642, -347, 31, 320, 598, 611, 441, 49, -295, -553, -631, -548, -190, 162, 447, 630, 549, 268, -75, -392, -587, -639, -415, -78, 341, 543, 657, 465, 83, -221, -507, -657, -471, -252, 131, 450, 630, 532, 289]
4327B89k93l67j93l5J61L83K59L79pj11l13l63k32j48P9K75L38L20J49J4k62l00
4349B2l49k66L9J15L50L60K46R9j83k48l71l04q6J37J44L82K77K11M8k87k74l94
4371c32k72L2Q6L29L31L28J31j28k89l58k19k38Q7K13K94L30K20K2j70l26l47
4392b76k22q7J32L61K81K75J14p4k37l81k84k15O4J84L58L77K09rj54l19l44k47
4414d94o0J14K10L87K82J63q7k60k83m10j37O8J36L61K60K49P7j39k59l76l31
4435e29NL1K92L02L55R0K4k91l41l09j85M5J54L22K84K64Q9k32k35k98l07n8K5
4458e03K28L46L70R7K4k41l23l36k25J8K34K15M13J92R3j92j92m46k61p9P4K01
4480b93L25L61J49jj72l72l71j52m2K04K74L18K42J15j58k27l77k24j64R3K15
$$ y = [289, -4, -371, -564, -599, -438, -55, 204, 583, 576, 465, 152, -211, -443, -591, -512, -237, 101, 421, 570, 584, 322, 22, -327, -593, -554, -439, -89, 271, 517, 616, 433, 185, -186, -490, -576, -439, -295, 87, 364, 575, 623, 336, 62, -332, -604, -572, -486, -157, 174, 502, 633, 505, 216, -142, -361, -599, -512, -299, -5, 325, 545, 567, 397, 71, -276, -498, -585, -453, -92, 189, 464, 578, 504, 267, -114, -398, -613, -549, -365, -7, 370, 579, 570, 416, 97, -247, -494, -554, -440, -230, 157, 439, 602, 515, 255, -28, -438, -575, -507, -371, -10, 250, 499, 576, 437, 178, -198, -529, -524, -493, -201, 101, 456, 546, 570, 279, -62, -371, -556, -511, -357, -35, 249, 513, 602, 370, 135, -163, -470, -528, -503, -275, 71, 441, 538, 562, 321, -2, -338, -563, -545, -311, -96, 317, 509, 602, 410, 218, -228, -489, -568, -494, -293, 32, 393, 542, 541, 369, -3, -374, -526, -568, -364, -90, 228, 470, 585, 427, 200, -177, -401, -565, -472, -257]
4501b57L81K15K02l2j77k86l64j38j66J95L41K60L18O1n9k67l90k54j42M3K05
4522c11L17L01K46pk11l20k66k10j18J72K59L26K29K18q2k77l78k47j76J6K10
4543c09L38L41J57J8j95k50l47k14j18N7L97L51K23J51p7k47l15k87k52P4J41
4564c63L58L25J38Q9o9l69l13k28j39J16K47L58K70J41k2k47l39l38j38JJ84K65
4586g3L09L22m7o8l00l81k14n6K8K27M17K19J51qk33l25k88k00kK29K42K80L10
4609E39l2n3k77l71k50j69J34K62K74L00J84m8j88k71l06k29l9J35K95M08J10
4630D08J34r6k99l22k44j56Q4K03K89L32J40M7j23m38j94k29o7J29L48K79J89
4651D14J46j10k53l05l16j14K1K67L26K64K21j4j96k54l51k56q2J46K67L49K39
$$ y = [-257, 124, 339, 541, 509, 332, 46, -318, -456, -622, -427, -86, 174, 492, 553, 494, 227, -163, -417, -559, -516, -311, 6, 307, 553, 546, 335, 15, -251, -461, -579, -407, -148, 178, 407, 625, 543, 266, -112, -359, -535, -519, -309, 29, 370, 527, 545, 350, 100, -247, -461, -579, -522, -125, 226, 449, 600, 523, 276, -39, -326, -578, -504, -363, -5, 320, 458, 547, 478, 109, -204, -432, -571, -455, -208, 150, 420, 561, 539, 292, -47, -385, -523, -522, -338, -73, 236, 558, 511, 443, 143, -238, -452, -508, -480, -253, 164, 383, 534, 526, 293, -32, -320, -520, -522, -293, -51, 229, 539, 507, 454, 177, -194, -444, -613, -479, -217, 57, 357, 541, 493, 305, 34, -272, -501, -540, -405, -110, 298, 408, 542, 446, 147, -175, -419, -575, -491, -288, 1, 333, 473, 520, 397, -41, -235, -464, -531, -402, -54, 225, 414, 560, 450, 197, -108, -424, -538, -517, -250, 76, 340, 561, 547, 351, 97, -254, -510, -592, -446, -179, 170, 409]
4672D09J15l5k22l36l06j57Q0J81K94L12J47mq5l06l29k84l4J26K71K77K76J21
4694E11q3j80l04l62j20L7J69K92L16K16J5j13k99l27k57m1J23J88L36L06J04
$$ y = [409, 524, 489, 267, -69, -375, -532, -452, -271, 23, 335, 482, 478, 393, 87, -242, -526, -560, -434, -163, 114, 390, 511, 428, 248, -56, -418, -538, -501, -332, -40, 276, 492, 507, 394, 95, -232, -489, -530, -407, -219, 117, 423, 527]
$$ [...]
8191B39
##END NTUPLES=NMR FID
##END=
