##TITLE=1H_ES-APTMS-20%
 D2O
 8 sc, 
 9.4.2024
##JCAMPDX= 6.0         $$ Bruker NMR JCAMP-DX V2.0
##DATA TYPE= NMR FID
##DATA CLASS= NTUPLES
##ORIGIN= UXNMR, Bruker Analytische Messtechnik GmbH
##OWNER= root
$$ XWIN-NMR		Version 3.5
$$ Tue Apr  9 14:28:35 2024 Russian Standard Time (UT+4h)  she@DPX200
##.OBSERVE FREQUENCY= 200.1309
##.OBSERVE NUCLEUS= ^1H
##.DELAY= (6, 6)
##.ACQUISITION MODE= SIMULTANEOUS
##.ACQUISITION SCHEME= undefined
##.AVERAGES= 8
##.DIGITISER RES= 18
##SPECTROMETER/DATA SYSTEM= spect
##.PULSE SEQUENCE= zg30
##.SOLVENT NAME= CDCl3
##.SHIFT REFERENCE= (INTERNAL, CDCl3, 0, 15.7039)
##AUDIT TRAIL= $$ (NUMBER, WHEN, WHO, WHERE, WHAT)
$$ ##TITLE= Audit trail, XWIN-NMR		Version 3.5
$$ ##JCAMPDX= 5.01
$$ ##ORIGIN= Bruker BioSpin GmbH
$$ ##OWNER= she
$$ F:/spectra/data/she/nmr/H-F/1/audita.txt
$$ ##AUDIT TRAIL=  $$ (NUMBER, WHEN, WHO, WHERE, WHAT)
(   1,<2024-04-09 14:27:36.59 +0400>,<she>,<DPX200>,
      <created by zg, POWCHK disabled, PULCHK disabled
       configuration hash MD5:
       00 E9 B6 7A A2 85 ED C7 34 08 36 98 17 FE 4E 26
       data hash MD5: 16K
       53 A5 15 FC 0D 3C 45 45 BA 9A 81 FA 7A 76 53 12>)
$$ ##END=
$$ 
$$ hash MD5
$$ 56 78 EC 32 22 AC 5C C5 64 2B 80 78 C1 85 2A FA
##$RELAX= 
##$RELAX= 
##$RELAX= 
##$RELAX= 
##$RELAX= 
##$RELAX= 
$$ Bruker specific parameters
$$ --------------------------
##$DU= <F:/spectra>
##$EXPNO= 1
##$NAME= <H-F>
##$PROCNO= 1
##$TYPE= <nmr>
##$USER= <she>
##$AMP= (0..31)
100 100 100 100 100 100 100 100 100 100 100 100 100 100 100 100 100 100 
100 100 100 100 100 100 100 100 100 100 100 100 100 100 
##$AQSEQ= 0
##$AQ_mod= 1
##$AUNM= <au_zg>
##$AUTOPOS= <>
##$BF1= 200.13
##$BF2= 200.13
##$BF3= 200.13
##$BF4= 200.13
##$BF5= 200.13
##$BF6= 200.13
##$BF7= 200.13
##$BF8= 200.13
##$BYTORDA= 1
##$CFDGTYP= 0
##$CFRGTYP= 5
##$CHEMSTR= <none>
##$CNST= (0..31)
1 1 145 1 1 1 1 1 1 1 1 1 1 1 1 1 1 1 1 1 1 1 1 1 1 1 1 1 1 1 1 1 
##$CPDPRG= <>
##$CPDPRG1= <>
##$CPDPRG2= <>
##$CPDPRG3= <>
##$CPDPRG4= <mlev>
##$CPDPRG5= <mlev>
##$CPDPRG6= <mlev>
##$CPDPRG7= <mlev>
##$CPDPRG8= <mlev>
##$CPDPRGB= <>
##$CPDPRGT= <>
##$D= (0..31)
0 1.2 0 0 0 0 0 0 0 0.06 0 0.03 0 0 0 0 0.0002 0 0 0 0 0 0 0 0 0 0 0 0 
0 0 0 
##$DATE= 1712658456
##$DBL= (0..7)
120 120 120 120 120 120 120 120 
##$DBP= (0..7)
150 150 150 150 150 150 150 150 
##$DBP07= 0
##$DBPNAM0= <>
##$DBPNAM1= <>
##$DBPNAM2= <>
##$DBPNAM3= <>
##$DBPNAM4= <>
##$DBPNAM5= <>
##$DBPNAM6= <>
##$DBPNAM7= <>
##$DBPOAL= (0..7)
0.5 0.5 0.5 0.5 0.5 0.5 0.5 0.5 
##$DBPOFFS= (0..7)
0 0 0 0 0 0 0 0 
##$DE= 6
##$DECBNUC= <off>
##$DECIM= 32
##$DECNUC= <off>
##$DECSTAT= 4
##$DIGMOD= 1
##$DIGTYP= 9
##$DL= (0..7)
0 120 120 120 120 120 120 120 
##$DP= (0..7)
150 150 150 150 150 150 150 150 
##$DP07= 0
##$DPNAME0= <>
##$DPNAME1= <>
##$DPNAME2= <>
##$DPNAME3= <>
##$DPNAME4= <>
##$DPNAME5= <>
##$DPNAME6= <>
##$DPNAME7= <>
##$DPOAL= (0..7)
0.5 0.5 0.5 0.5 0.5 0.5 0.5 0.5 
##$DPOFFS= (0..7)
0 0 0 0 0 0 0 0 
##$DQDMODE= 0
##$DR= 18
##$DS= 0
##$DSLIST= <SSSSSSSSSSSSSSS>
$$ [...]
##$SUBNAM2= <"">
##$SUBNAM3= <"">
##$SUBNAM4= <"">
##$SUBNAM5= <"">
##$SUBNAM6= <"">
##$SUBNAM7= <"">
##$SUBNAM8= <"">
##$SUBNAM9= <"">
##$SW= 18.0517689322627
##$SWIBOX= (0..15)
0 0 2 0 0 0 0 0 0 0 0 0 0 0 0 0 
##$SW_h= 3612.71676300578
##$TD= 16384
##$TD0= 1
##$TE= 0
##$TE2= 300
##$TE3= 300
##$TEG= 300
##$TL= (0..7)
0 120 120 120 120 120 120 120 
##$TP= (0..7)
150 150 150 150 150 150 150 150 
##$TP07= 0
##$TPNAME0= <>
##$TPNAME1= <>
##$TPNAME2= <>
##$TPNAME3= <>
##$TPNAME4= <>
##$TPNAME5= <>
##$TPNAME6= <>
##$TPNAME7= <>
##$TPOAL= (0..7)
0.5 0.5 0.5 0.5 0.5 0.5 0.5 0.5 
##$TPOFFS= (0..7)
0 0 0 0 0 0 0 0 
##$TUNHIN= 0
##$TUNHOUT= 0
##$TUNXOUT= 0
##$USERA1= <user>
##$USERA2= <user>
##$USERA3= <user>
##$USERA4= <user>
##$USERA5= <user>
##$V9= 5
##$VALIST= <valist>
##$VCLIST= <CCCCCCCCCCCCCCC>
##$VD= 0
##$VDLIST= <DDDDDDDDDDDDDDD>
##$VPLIST= <PPPPPPPPPPPPPPP>
##$VTLIST= <TTTTTTTTTTTTTTT>
##$WBST= 1024
##$WBSW= 4
##$XGAIN= (0..3)
0 0 0 0 
##$XL= 0
##$YL= 0
##$YMAX_a= 146480
##$YMIN_a= -133558
##$ZGOPTNS= <>
##$ZL1= 120
##$ZL2= 120
##$ZL3= 120
##$ZL4= 120
##$ABSF1= 10
##$ABSF2= 0
##$ABSG= 5
##$ABSL= 3
##$ALPHA= 0
##$AQORDER= 0
##$ASSFAC= 0
##$ASSFACI= 0
##$ASSFACX= 0
##$ASSWID= 0
##$AUNMP= <proc_1d>
##$AZFE= 0.1
##$AZFW= 0.1
##$BCFW= 1
##$BC_mod= 2
##$BYTORDP= 1
##$COROFFS= 0
##$CY= 11.3945322036743
##$DATMOD= 1
##$DC= 2
##$DFILT= <>
##$DTYPP= 0
##$F1P= 15.7292609196834
##$F2P= 12.9074282941183
##$FCOR= 0.5
##$FTSIZE= 0
##$FT_mod= 4
##$GAMMA= 1
##$GB= 0.15
##$INTBC= 1
##$INTSCL= 1
##$ISEN= 128
##$LB= 0.24
##$LEV0= 0
##$LPBIN= 0
##$MAXI= 10000
##$MC2= 0
##$MEAN= 0
##$ME_mod= 0
##$MI= 1.114404
##$NCOEF= 0
##$NC_proc= 0
##$NLEV= 6
##$NOISF1= 3.799351
##$NOISF2= 2.8
##$NSP= 1
##$NTH_PI= 0
##$NZP= 0
##$OFFSET= 15.70392
##$PC= 1
##$PHC0= -25462.73
##$PHC1= 14.98731
##$PH_mod= 1
##$PKNL= yes
##$PPARMOD= 0
##$PSCAL= 0
##$PSIGN= 0
##$REVERSE= no
##$SF= 200.130013532006
##$SI= 16384
##$SIGF1= 3
##$SIGF2= 2
##$SINO= 400
##$SIOLD= 16384
##$SREGLST= <1H.CDCl3>
##$SSB= 0
##$STSI= 0
##$STSR= 0
##$SW_p= 3612.71676300578
##$SYMM= 0
##$S_DEV= 0
##$TDeff= 0
##$TDoff= 0
##$TI= <>
##$TILT= no
##$TM1= 0
##$TM2= 0
##$TOPLEV= 0
##$USERP1= <user>
##$USERP2= <user>
##$USERP3= <user>
##$USERP4= <user>
##$USERP5= <user>
##$WDW= 1
##$XDIM= 8192
##$YMAX_p= 0
##$YMIN_p= 0
$$ End of Bruker specific parameters
$$ ---------------------------------
##NTUPLES= NMR FID
##VAR_NAME=  TIME,          FID/REAL,        FID/IMAG
##SYMBOL=    X,             R,               I
##VAR_TYPE=  INDEPENDENT,   DEPENDENT,       DEPENDENT
##VAR_FORM=  AFFN,          ASDF,            ASDF
##VAR_DIM=   8192,          8192,            8192
##UNITS=     SECONDS,       ARBITRARY UNITS, ARBITRARY UNITS
##FACTOR=    0.0002768,     1,               1
##FIRST=     0,             0,               0
##LAST=      2.2672688,     0,               0
##MIN=       0,             -133558,         0
##MAX=       2.2672688,     146480,          0
$$ Real data points
##PAGE= N=1
##DATA TABLE= (X++(R..R)), XYDATA
$$ [...]
848e357N307N194L813Q99l008n733n553l551j291J815M385N670M873K303j616
863H150m421n174m382l005j29L426N480N311L368Q9k739m272n094m411j620K216
879g207M670N161L993J931q29l411n127n212k761P82L198M509M620L469P85k301
895F270m696n321l511q41J505L482M977M502K236j265l653m779m044k463k04K520
911e285M751N090K974K49k244l806m502l767j744J534M096M809L596J651m71k877
927D054m526m520k680L31K833M134L974L042J046j835m129m770l354r65J410L095
943b860M274M005K211p84l304m310l731k153l00K108M013M615K941L36k000l473
959A588l966l162j680J064L482M398L378J514m46k460l820m080k561m7K544L732
$$ y = [-5357, -50, 5144, 8957, 9856, 6848, 1115, -4438, -7989, -9280, -7465, -3080, 2590, 7463, 9766, 8150, 3729, -1445, -5827, -8832, -8961, -5535, -55, 5256, 8624, 8713, 5974, 1702, -3392, -7803, -9423, -7207, -2537, 2624, 6617, 8548, 7719, 4308, -819, -6031, -8792, -8010, -4812, -303, 4317, 7786, 8571, 6270, 1574, -3747, -7258, -8099, -6594, -3112, 1865, 6367, 8603, 7338, 3685, -1094, -5138, -7601, -7805, -5285, -534, 4556, 7530, 7779, 5535, 1729, -2773, -6540, -8284, -6750, -2654, 2155, 5751, 7402, 6931, 4054, -472, -4992, -7672, -7341, -4508, -374, 3600, 6642, 7688, 5853, 1724, -3046, -6400, -7365, -5955, -2860, 1414, 5419, 7630, 6846, 3542, -768, -4499, -6652, -6952, -4844, -831, 3784, 6725, 7061, 5061, 1588, -2378, -5540, -7220, -6156, -2674, 1724, 5102, 6616, 6170, 3710, -110, -4190, -6751, -6798, -4254, -522]
975e22L644K655R97j472l473m220l265r62J252K760L554L580K175m95k797l835
991d24l444k058k00J767L282M089K936M95j865k984l390l063j461P74K783M010
1007A247L263J425m91j948l285l707k416q8J955L383L347K327P95r43k861l958
1023a955k899r60R44K380L247L076J866r4k222l577l220j721k61J368K889L553
1039B414K569P62j420k833l090k461j400L37K580L354K979J507l39j892k776l043
1055b752k314m41J885K936K926K113Q79r35k443l187k904j155R65K220K641K731
1071C165J861j3j932k962l007j800%J213K338K982K647O13j172k358k923k290
1087c638j023K90J772L133K937J234l42j514k458k780j967m17J189K758K889J759
$$ y = [-522, 3122, 5777, 6774, 5302, 1829, -2391, -5656, -6618, -5366, -2606, 948, 4528, 6703, 6208, 3411, -424, -3868, -5926, -6126, -4359, -1077, 3012, 5948, 6443, 4578, 1594, -1796, -4859, -6320, -5546, -2763, 1247, 4510, 5935, 5444, 3496, 211, -3496, -5912, -6000, -4045, -662, 2685, 5012, 5807, 4864, 2003, -1955, -4854, -5814, -4870, -2490, 757, 3833, 5699, 5605, 3383, -194, -3414, -5135, -5396, -4028, -1139, 2414, 4983, 5745, 4325, 1492, -1598, -4059, -5459, -5122, -2542, 812, 3791, 5298, 4959, 3067, 291, -2752, -5066, -5507, -3622, -686, 2240, 4353, 5232, 4297, 1854, -1333, -4237, -5392, -4427, -2207, 434, 3165, 5026, 5013, 3081, 119, -2888, -4688, -4688, -3475, -1137, 1845, 4492, 5105, 3933, 1575, -1348, -3638, -4661, -4371, -2599, 534, 3471, 4705, 4363, 2849, 391, -2389, -4356, -4773, -3584, -826, 2063, 3822]
1103C822O11n30k040l037k363j077M24K031K654K220J501L02j520k900k607j552
1119d061l31J193K257K437K163R74r24k372k449j952j159K22J783K494K583J469
1135D327k93j618k113k233j962m84J200K321K448K017M76p88j584k397k534j048
1151d265O97J665K203K212J329Rj112k288k697j539n0J009J742K433J991P22o88
1168C373j895k524j831q02J80J202K490K347J292j43j231k162k115j391o60P29
1184c141K258K496J486N85n02j703k187j903j255K98J780K151J682J294L61j164
1200B536k156k135j560l83J076J717J968J727J005o39j842k109j742q80K78J183
1216a956J831K198J487j32j345j634j908j611l98P21J651K307J688M45o50j194
$$ y = [3822, 4433, 3903, 1863, -1174, -3537, -4614, -4190, -2159, 495, 2715, 4216, 4518, 2998, 98, -2509, -4061, -4392, -3199, -942, 1495, 3658, 4632, 3708, 1336, -1113, -3065, -4224, -4002, -2219, 275, 2858, 4327, 4034, 2416, 303, -1930, -3892, -4376, -3176, -855, 1593, 3610, 4086, 3298, 1714, -683, -3217, -4265, -3568, -1903, 300, 2512, 3841, 3850, 2738, 450, -2247, -3786, -3836, -2827, -1085, 1348, 3339, 4061, 3373, 1478, -1046, -2877, -3679, -3499, -2297, 193, 2540, 3832, 3689, 2458, 296, -1819, -3210, -3870, -3141, -883, 1613, 3099, 3684, 3182, 1479, -708, -2611, -3866, -3568, -1788, 363, 2045, 3339, 3700, 2536, 380, -1755, -3315, -3698, -2622, -905, 1063, 2790, 3795, 3156, 1314, -795, -2537, -3417, -3139, -1956, -125, 2073, 3560, 3428, 2083, 449, -1459, -3070, -3468, -2747, -1096, 1211, 2899, 3344, 2694, 1500]
1232A500j924j980j011L29J228K021J840J002M8o78j746k273j322k30P28J584
1248h84J908J463P04k06j540k153j550o93N9J049J781J800J178K96j119j783j682
1265a372j124o15M57J745J941J395O21m64j364j561j558j114mJ378J762J453J080
1282B656K04q06j472j718j494m48Q82J357J534J420Q52m17j227j735j609p42K35
1299b528Q61J378J754J270K1q43j478j637j117k95L83J172J828J473M87m74j007
1316A248j430j563q26o5R47J681J597P38N6m83j305j683j177m23N59J344J526
1333G41J053O76l8j128j659j400o39M7Q78J357J334J052L53q17j498j312j020
1350b020m39M25J132J448J351O44l70j122j243j237r02r7R17J387J402R02O6o32
$$ y = [1500, -424, -2404, -3415, -3086, -1858, 163, 2003, 3005, 3053, 2375, 629, -1644, -2966, -3196, -2468, -884, 1024, 2487, 3191, 2985, 1445, -708, -2258, -2951, -2892, -1843, -62, 1738, 2916, 3212, 2093, 310, -1372, -2496, -3111, -2654, -909, 1032, 2427, 3048, 2584, 1220, -341, -1899, -3013, -3017, -1639, 123, 1576, 2656, 2860, 2054, 582, -1136, -2630, -3078, -2196, -839, 695, 2115, 2967, 2550, 1323, -412, -2021, -2763, -2528, -1667, -289, 1465, 2735, 2756, 1913, 435, -1202, -2319, -2614, -2231, -1059, 769, 2242, 2729, 2255, 1248, -182, -1745, -2571, -2636, -1689, -8, 1589, 2327, 2383, 1900, 595, -1088, -2265, -2688, -2129, -785, 741, 1794, 2470, 2432, 1304, -355, -1755, -2394, -2347, -1469, -112, 1222, 2274, 2627, 1810, 312, -1000, -2020, -2459, -2034, -902, 546, 1897, 2541, 2171, 1049, -194, -1431, -2333, -2430, -1513, -126, 1276, 2178, 2244, 1612]
1368A612j021j362j285m24O06J115J277J179N12j22q54j338j546n67J08P02J165
1385b43J311R86K32n84j219j440q98k75L17Q70J435J194N59k53r03j257j153o60
1403a981j62O49J403J283P22J89n72j036j183j019n02L56J157J256Q75N63o3p62
1421A173j274j187p91L0Q58J044R97R74K95n18j101j252r10l39L27Q19J158J154
1439A457O82k92q82j046j064p35k9N78J089J277P82P7n20q15j093j031m48L14
1457a699R80J132R55M75j70o10j038j234p05R4O13J054R36Q25L43m52r60j259
1475g20q29k89L33P01J073R47O62j27p53j120r31n88j13M52R81J192P57J52m53
1494A327q75r58q42m93K34Q25J143Q54M28o4n94r37j082p44M5O09R31R06O71L73
$$ y = [1612, 591, -771, -2056, -2480, -1874, -759, 518, 1697, 2209, 2087, 1233, -105, -1651, -2218, -2110, -1408, -243, 1068, 2054, 2286, 1702, 483, -957, -1855, -2130, -1813, -943, 492, 1686, 2245, 1992, 1089, -168, -1321, -1981, -2143, -1494, -91, 1192, 1914, 2103, 1531, 495, -688, -1707, -2209, -1853, -696, 560, 1435, 1998, 1935, 1173, -101, -1288, -2079, -2049, -1191, -147, 850, 1824, 2119, 1601, 500, -752, -1662, -2001, -1674, -855, 303, 1457, 2139, 1847, 965, -81, -1145, -1880, -1909, -1331, -242, 1035, 1817, 1894, 1374, 559, -534, -1565, -2013, -1699, -719, 413, 1368, 1843, 1673, 1063, 25, -1209, -1914, -1820, -1207, -153, 783, 1608, 1951, 1499, 539, -720, -1549, -1838, -1505, -804, 269, 1216, 1878, 1751, 998, -122, -1053, -1641, -1754, -1302, -321, 871, 1628, 1780, 1327, 452, -506, -1348, -1841, -1607, -782, 361, 1215, 1643, 1579, 985, 48, -1034, -1778, -1733, -1124, -193, 713, 1384, 1757]
1514A757l15r43j080q15l37L45O69R13R21O08o4p37j038q23n13j05L56Q74J108
1533G81P38J64m17q21q73p97m44J70P50J012Q53M17m5n98p62j035p01qN48Q88
1553a80Q49O62K34j85q50j057p88k81L34N56Q91P96N59k7o00r04r42m03j24L57
1573a103P25J025P16J08l07p56q49o40l67P5O43R48Q70K96n4n05o86r19o18j94
1593a592N34Q25R14M78K62j86o62r46p90l45K27O88P66P01M94J11o02q43q78m23
1613a267o5L45O32Q91P20J97l57o85p17p03l87J37M90Q65Q08M48j16l90p72p32
1633f58o08j43L33P84Q22N88K45k63n43p95p87l43J67N92O72P37M89j1l64q17
1653I7p88m93K6J71O31P87N77L71k66o46p79n39l98J6M79Q54P15M02j1m27o71
$$ y = [1757, 1442, 499, -581, -1396, -1733, -1388, -719, 194, 1115, 1723, 1659, 922, -116, -939, -1452, -1557, -1201, -327, 781, 1519, 1683, 1266, 445, -428, -1225, -1669, -1499, -749, 263, 1116, 1533, 1488, 890, 128, -907, -1608, -1616, -1068, -180, 669, 1331, 1565, 1380, 530, -527, -1315, -1596, -1262, -706, 185, 981, 1540, 1513, 913, 9, -933, -1336, -1460, -1103, -378, 647, 1363, 1471, 1164, 408, -441, -1081, -1448, -1373, -730, 218, 1088, 1384, 1330, 825, 139, -780, -1398, -1592, -1058, -233, 681, 1159, 1421, 1235, 573, -373, -1163, -1508, -1281, -593, 173, 874, 1368, 1479, 877, 34, -844, -1267, -1332, -987, -355, 536, 1256, 1453, 1096, 411, -306, -1009, -1396, -1259, -769, 96, 904, 1352, 1236, 846, 74, -658, -1266, -1409, -1076, -292, 530, 1118, 1363, 1100, 557, -238, -1025, -1368, -1201, -609, 63, 800, 1289, 1278, 914, 97, -691, -1184, -1158, -987, -356, 431, 1008, 1379, 1113, 467, -312, -851, -1249, -1233, -754, 100, 815, 1217, 1206, 779, 108]
1674A08p22m55k07K08Q02P38M96K30j13n62p42o39l98Q9N97N71N81N22J15l92
1694H27o63o82o30l7L68M46O74O39L46k59n42p36n67k96L9M04O03P58M29o6l22
1715G33n45p17m71j17K11N31P47N25K30j99l51o91o77l07M9M18O47O32L21P0j80
1736H59o89o75m70j08K23N80N13N94K95j05n54o68m72l21J5L26N85N99M97O6m04
1757F86n85n10m51k88L18N07O42M67K84k31l54n45n85m44R9M62M81N87L95P2k89
1778G18n08n81n41p7K69L34O04N29K03o4m28o05n26k40K4K50N07O26M30pk46m58
1800B13n83l57j55K6M09O56N16J59l1l76n59m81k73j02K96O18N05K85J18j45m99
1821B40n83l72j72J41M30N41L79K87Om31n47n66k33O1K38M24N18M44J26k72n22
$$ y = [108, -614, -1069, -1276, -1068, -266, 472, 968, 1198, 1085, 523, -219, -858, -1256, -1167, -570, 1, 582, 1104, 1219, 827, 164, -518, -1148, -1185, -817, -371, 303, 942, 1288, 1029, 487, -249, -816, -1112, -1073, -669, -66, 692, 1121, 1055, 733, 188, -529, -1000, -1117, -906, -375, 372, 897, 1127, 928, 577, -114, -791, -1098, -1049, -631, 16, 648, 969, 1039, 859, 170, -505, -975, -1083, -860, -280, 233, 827, 1122, 1017, 463, -205, -677, -998, -983, -657, -72, 527, 1024, 1090, 686, 101, -409, -860, -1148, -830, -323, 319, 786, 1070, 839, 485, -60, -645, -1089, -990, -528, -47, 540, 935, 1007, 718, 210, -371, -912, -989, -720, -386, 218, 747, 950, 886, 458, -147, -673, -913, -889, -639, -132, 494, 924, 917, 671, 213, -370, -727, -882, -856, -447, 209, 725, 884, 853, 477, -82, -563, -836, -938, -642, -24, 481, 766, 884, 739, 240, -343, -715, -887, -746, -316, 225, 604, 891, 897, 466, -81, -647, -880, -819, -581, -157, 361, 805, 931, 659, 137]
1842A37m06m23k06Q8M22N02N61K42j88k90l77n27l99K1L29M23M96L44Rj31l26
1863C01n56n03j08J27M07M42M15K57M0l12n18n37k01j9K04M16M65L88J09j28m34
1884B55n39k78k00M1K62N31M84J74J0k68n09l29l38p9J81M79N04K73J09j14l84
1905B65m57l61k34J46L11L93M20K90Jk45m99m40l25qK36L89L34M60J35j94l64
1926B53m80l21j41R0J35N09M91J99o6k06l52n00k33j12J92L79M66L01J01j42k60
1947C03m10m48j74J04K73M60K80K07J02k16l85m65k93oJ52L65L60L00J58j5l02
1968C50n56l18j52Q6K29L76L62L45mk81l56l50k64j26O2L83M58K52J94k31j72
1989B87k97m56j98O3K99L01L07L08k2j14l73l86k72j18K20K13L56L61J74j17k45
$$ y = [137, -269, -692, -898, -810, -388, 114, 675, 917, 729, 439, 62, -465, -864, -843, -514, -91, 405, 749, 758, 627, 301, -255, -758, -866, -739, -332, 110, 525, 782, 822, 510, -8, -545, -746, -765, -561, -145, 320, 708, 817, 689, 255, -284, -562, -762, -721, -459, 72, 556, 730, 740, 472, -37, -366, -704, -783, -602, -123, 381, 654, 763, 649, 265, -192, -553, -787, -641, -330, 63, 483, 773, 774, 529, 30, -410, -735, -743, -507, -118, 216, 676, 811, 617, 253, -227, -548, -689, -599, -464, 45, 536, 735, 669, 463, 111, -389, -622, -734, -542, -163, 303, 604, 705, 563, 303, -107, -555, -729, -625, -352, 108, 388, 595, 697, 481, 96, -369, -662, -668, -516, -151, 209, 509, 667, 652, 350, -206, -524, -676, -590, -361, 15, 377, 722, 718, 437, 81, -269, -533, -659, -597, -214, 244, 496, 690, 459, 287, -10, -466, -664, -601, -302, -1, 306, 614, 592, 478, 105, -281, -553, -671, -451, -238, 118, 479, 653, 536, 291]
2010B91l90l45k02P7J81L05M16K54P2k03l65l72k45p8O6L00M26L07R0j10j46l74
2032d5k69l00OK18L48L47J79R8j16k79m06l32n0J28K94K82L08J87n3k09l83k89
2054c36k29P7J47K44K81K98O0j50k67l53k24j06J2L09L50K72J24rk97k18k59k25
2076d99m5J66L04L32J90M1m3l08k73k84j47Q9K83L22K14J69Jk16l43j95k34J7
2098d59R8K76K83K58P1j18k75k39l28k8J1K23K83L24J10n8j70k24k59k44m3J23
2120c85K97K68K18R3j56k03k73k26j60J45K09K20K85P9O2j70k50l24j17p5N2K70
2142a41K94J87J24q2j99l24j99j18N1J12L10K72J30Lj60k50k78r2q6J02K55K77
2164A88J88N5j53j12k30k93j21L8K74K26K31R9kr8k69l01j44nR2J79K29L02R0
$$ y = [291, -99, -444, -646, -569, -388, -83, 333, 587, 659, 456, 91, -281, -526, -604, -538, -238, 188, 495, 585, 475, 329, -45, -314, -614, -608, -390, -42, 305, 484, 582, 466, 187, -219, -551, -601, -473, -179, 103, 411, 598, 545, 336, -47, -336, -565, -488, -341, -97, 184, 482, 542, 392, 125, -228, -452, -558, -546, -237, 113, 385, 509, 500, 203, -15, -274, -499, -544, -378, -74, 258, 448, 489, 446, 138, -135, -419, -566, -477, -194, 128, 342, 511, 512, 296, -47, -242, -476, -459, -361, -85, 198, 456, 527, 409, 134, -105, -433, -461, -450, -227, 56, 380, 490, 432, 262, 38, -221, -465, -508, -385, -88, 180, 398, 491, 335, 132, -141, -367, -527, -382, -173, 47, 332, 411, 473, 303, 53, -271, -388, -463, -411, -141, 153, 340, 464, 382, 183, -141, -340, -458, -407, -295, 15, 287, 417, 420, 260, 10, -268, -360, -446, -344, -89, 188, 376, 431, 278, 166, -64, -357, -478, -440, -166, 60, 291, 390, 388, 290, 21, -280, -424, -429, -337, -158, 71, 373, 463]
2187D63j23j75k73j81j24N2J19K26K26J95k8j55j73k82q1r3M5K37K68J96j5l2
2209B92j40k23j78j51NJ54K85K53O8k8o3j76k60j99KK3K45J81J64R0J3j98k22
2232f3j80q7j6J21K01J84K02O7k12k04j44j64j13J09J88K34J82M6r3j11j26k15
2254a94j62J9J06K05J83J47kl1j91j80k50JM2J78K09J52R1lj33k26k14j40QJ42
2278b43J55K23J52K2q9j08k00j61j06NJ39L08J58P9n1j95q8k10p5p3O1K50K34
2301A87O1L2L1k49j29k20j8P7J36J20J17J67M7j70j85j91j07j6J19J32J37K00
2323B78L6j15j24j90j50J0L7J08J36J12J70l6j49p4j88j07k6O7J55J56J22K0q8
2346A60m7j93j32j56R5J30J63J45M9Mo7j22j44j42L5QJ51J50R4R5j29m3j66j31
$$ y = [463, 340, 165, -108, -289, -413, -361, -242, -16, 210, 405, 377, 222, 49, -233, -314, -407, -362, -125, 143, 339, 324, 292, 152, -71, -249, -400, -395, -241, 44, 297, 365, 337, 274, 98, -162, -361, -359, -336, -91, 90, 254, 344, 357, 159, -63, -243, -330, -346, -225, -24, 160, 362, 429, 217, 13, -131, -295, -408, -299, -111, 123, 305, 351, 258, 147, 21, -194, -356, -337, -231, -26, 157, 304, 302, 271, 80, -100, -350, -349, -307, -129, 80, 232, 323, 320, 187, -39, -253, -393, -385, -243, -88, 135, 287, 309, 220, 112, -88, -249, -355, -350, -211, 97, 255, 334, 283, 88, 0, -210, -285, -358, -297, -47, 187, 248, 280, 311, 62, -67, -287, -305, -228, -92, 28, 145, 312, 359, 189, 4, -187, -294, -310, -191, -59, 78, 278, 314, 199, 75, -115, -265, -255, -218, -110, 26, 138, 308, 272, 123, 49, -139, -246, -272, -205, -50, 106, 228, 248, 160, 113, -80, -212, -368, -273, -143, 20, 165, 214, 218, 151, 29, -115, -257, -222, -214, -63, 87, 181, 276, 147, 104, -62, -193]
2370a93p3RR9J17J91J11O0j13j72j83o5j2L6J40J46J33L9r4j16r1j29o5J2J65
2394d8N1J82N7L6j49q8j80j17J7J40RJ24J51L8p0r2j55j53OP3L4J30J15J12K3
2419B46j41j55l3l6j01P7J18R3J27l0j8p4j33j02l4j4P5J46J03Q9L3q1j03j89
2443a37o2k1M3J46Q9Q7N2K7j46j32n7q9L4O0J15K9J72L2j72r3o4m1k7M6J27J1
2469B9J27QN5j62j20p2q9M3R9Q0R2L4M7m0q4j79r5K3N2R1J30M1L5jq7p3j12m6
2497a74O3k2N2J59P3N7j27l3r3p2nk8R1R1P6O9J1j29j14l1o5PN1J8J55Q1l0n2
2525G9k7q9j23m4P4P0Q4P3L4K4o0j09q7m7L8J3P0R7Q4j1jj06j44m5pP8L2M2J30
2554A22Ok0j3p3q6j6m3M7J1J15P3N4p9n7m4m0o2k4L6J14Q4K6lo8m7j38k8k9J15
$$ y = [-193, -266, -257, -158, -41, 150, 261, 321, 208, 36, -147, -212, -224, -188, -48, 98, 231, 270, 176, 60, -31, -160, -225, -213, -48, 3, 185, 242, 278, 129, 41, -139, -256, -239, -99, -90, 34, 185, 223, 153, 61, -94, -247, -241, -168, -134, -4, 111, 223, 246, 105, -50, -83, -119, -220, -143, -25, 68, 195, 165, 147, 73, -60, -162, -196, -210, -135, 11, 114, 203, 236, 155, 52, -137, -199, -220, -177, -31, 58, 145, 197, 224, 78, -54, -111, -200, -166, -106, 9, 38, 210, 242, 70, -23, -87, -128, -155, -109, 18, 29, 156, 164, 219, 57, -63, -135, -224, -181, -82, -2, 90, 124, 171, 131, 47, -132, -227, -204, -152, -61, 69, 110, 145, 144, 57, -16, -128, -174, -111, -133, -81, 78, 151, 208, 81, 48, -45, -117, -122, -150, -59, 32, 108, 177, 188, 59, -55, -86, -151, -144, -93, -75, 80, 161, 131, 79, 52, -37, -160, -204, -130, -60, 24, 97, 131, 155, 95, -14, -101, -148, -110, -97, -27, 70, 154, 143, 142, 36, -108, -153, -160, -82, -50, -8, 122, 128, 108, 95, 22, -64, -80, -123, -76, -65, 50, 123, 177, 98, 41, -3, -43, -105, -129, -93, 21, 105, 131, 128, 60, 13, -125, -153, -182, -67]
2583f7P6P3M7Ll2n5m4j06k9O5L2J12k9K0L5k9j17l3j7Qj0J25J5M2j0Pm8j02J4
2612e4m8kR9K4O4k3MJ1p6n8k2o2Q5O0O8k0Q2o1m2m6r9j5Q3N8RN3J2O7j31k5p5
2643h0jk7K6N9O5Q6m3o1J3Nj25O0m3J3L4O2K1%k6q4k9m7P2j7P5pQ1QK2k8j01j08
2675a25P2pj2N9O9N3m4Ln1p4j8M6%ML2Q8o1J7m0Qr6QQPO0P3k5K0r2L5n8Jj6mN7
2710cN3J6j8N3o3o6j12J31r5Q4N3j5J9M2j9l0r4N6n1L3m8R8Q1o4J9m1k7j%q2O2
2741b9O6Mk1Rk9K3m8p1O2N1Pk7O2l3R0r9q1K1k5N4m0R6J0n1K5m5pK2o2M1J5o7
2773g7J20l9oQ5j06m1Q5mn3R3p1O1L7m2j3r7J8m0J08p5NR7m5O6Jr3L9j3n9N5L6
2804C2o0M1l9L8K2p7l4O0l6jM0L3j8M7l9Qj5o5M6k7M0K4J6J0l1l5M9l2l3O7l9
$$ y = [-67, 9, 82, 129, 132, 100, 45, 1, -105, -134, -69, -37, 75, 46, 66, 101, 72, -45, -78, -95, -87, -97, 28, 43, 85, 75, 82, 34, -68, -54, -102, -104, -5, 19, 83, 60, 64, 75, -1, -59, -81, -143, -58, 2, 70, 50, 132, 71, 29, -17, -116, -131, -48, 10, 19, 72, 84, 151, 20, -5, -80, -81, -108, -82, -23, 42, 128, 85, 24, 37, 42, -83, -23, -66, -53, -19, 43, 64, 64, 38, -46, -75, -122, -50, -67, 8, 1, 82, 90, 112, 84, -17, -125, -53, -60, -72, -13, 56, 109, 65, 68, 17, -57, -75, -29, -29, -25, 7, 95, 34, 51, 11, 19, -77, -69, -61, -54, 6, 79, 54, 74, -18, 17, -41, -40, -56, -60, -3, 50, 66, 48, 101, 38, -28, -140, -9, -104, -20, 33, 18, 37, 79, 60, 30, -64, -8, -59, -26, -74, 24, 105, 41, 60, 19, -8, -9, -9, -91, -29, 37, 41, 20, 29, 0, 23, -25, -96, -34, 17, 24, -3, 59, 26, 116, 17, -64, -43, -68, -14, -54, 42, 52, 1, 26, -19, -26, -4, -66, -25, -10, -77, 43, 4, -2, 83, -23, -64, 21, 17, -36, 57, -14, 47, 84, 42, 29, -68, -50, -90, 18, -57, -52, 45, 0, 66, 67, -26, 13, 0, -59, -4, 32, -28, 13, -26, 12, 34, -43, -77, -17, -53, -54, -14, 19, 1, 48, 9, 17, 2, -63, -17, -44, -4, 20, 36, 46, 15, -20, 29, -3, -36, 31, -8]
2835hM0l0L5l2pN8j03Pj5O5po2P6M8o6O1j22L8K8m3M1lN3p3K5m5%O1n6p2R0K7
2867IK4j7M1q0L8l0J1Qm6M4M6l8JK3m6L1Lq2Q6NJ2j5lpm6L8k7Rrl2N4j4j6O8l
2902D0m8P4p2m9N8ql6R7m5L8j3p8M0K4l6mJ8O1l9j2L4p7m1O4n9P5j1J9k3M9n0
2933a0J8kk3m3O9%J4j3J4m5M4j9n3L4l9M1J3L0n0L0Oj0j8J2l3N3l9j4N9Oj1j8
2965Cl7j1j3Q3l6J7J8L5m2l4K1j6L0l3J6o5P1j2K1Rl4Q3j34K2Nk7K5M9Pk2M3o2
2997b0k2mL8M8o7M0K5rRpm0J2J2o1N1NL4ok6K9l7K1n8jK2J4L7j0lMJ0k2q3Q8l8
3032a5qM5Ll%J5j04N7n6L3J0K9J9K3j4k7Nl0N0l3j9J4j5J07n0l3j2k0J6k6N5L6
3064E2o0k2R7q9N4l5K2o4P2o0kLJ00n5NJ4o6n2M5mM2j0MK7j2M4m6m2qj5N7J9J9
$$ y = [-8, 32, 2, 37, 5, -2, 56, -47, -40, -55, 10, 3, -59, 17, 65, -1, 60, -62, -24, 4, -39, 2, -1, 52, -21, 4, -41, -41, 20, -36, -108, -18, 9, 33, 16, 57, -23, 15, -15, -4, 4, -42, 2, 48, 10, 11, 34, -12, 19, 22, -60, 26, 31, 43, 28, 25, 18, -28, 10, -17, -8, -17, -49, 5, -9, -25, 43, 40, -8, 66, -6, -55, 3, -5, -41, 56, 11, 49, 36, -42, -2, 22, -14, -18, 0, 61, 22, 10, 44, -33, -74, -10, -69, 6, -5, 14, -9, 40, -10, 8, 6, -17, -60, 9, 9, 23, 10, 24, -21, 23, 4, -49, -15, -54, -13, 0, 30, -20, 10, 16, 6, -12, 0, -33, 20, -19, -33, 26, 32, 21, 3, -34, -45, -58, 25, -11, 6, 24, 59, 17, -17, 4, -12, 18, -15, 1, -64, 7, -5, 16, 25, -9, 74, -60, -38, -33, -60, -35, 14, 21, -1, 42, -20, -42, -46, -8, 40, -27, 13, 38, 29, 38, 31, -9, 3, 15, -46, 5, 10, 44, 38, 12, 41, 4, 25, -33, -34, -12, 2, 39, 29, 26, 30, 40, 18, -65, 23, -15, -23, 22, 25, 22, 22, 37, -67, -10, -66, -33, -23, 6, 25, 48, 34, 7, 12, -18, 32, -1, -20, -6, -21, 86, 36, 3, -9, -29, -13, -39, 16, 52, -8, -30, 67, -22, 32, -3, 19, -45, 27, -33, -35, -32, 68, 13, 18, 32, -34, -86, -41, -45, -3, -13, -9, 18, 6, 50, 4, -38, -46, -61, -4, 15, 34]
3097C4m7P4o6k2j4l0L6LO4j1J0K4k0p8Rm6O7p3L9N2K0J7k7L8o5K3r2P5ml9P0M
3129B5k5J8kK5on5q1J46k9M8%J9n8k6o0K8ROK4L7n2J10j00K%mOl5J1O4J1n9J9
3162A6J5o5Ooj7N0l5Q9Mk1Mj8j0p7L2K9j2MK1J5N3m0o6M0m2m4N6KJ1O6k5j4J2
3195C3nk2l9j4K1J9LK9M8K4j20L9q2oN3j2P6m3L4l6N0rq6J8LrJ2kP4l0J4l5m7
3228d7N1m9Mj2O2K5J3N8n2m8k0o9L3RO0j5Q2m9Rl4kn5j8l1RR4L8ll6K2l0l2l5
3261f8J7l3O8RqJ14q3k2k9l1K2K0j5J0Q2L6J6r3l6j6k4RM5L9l1jP0k2l6j8K9o5
3293d5%N2Jl8O5M3k4l2j05KN9O7m4K3Ql3O2n9pk8m2P0k4%M6J4J0M8r4J1q4L3k0
3326f5M1N0J9M5m1j6j6j2q5Q0k7P1l0K8O3Kr1m5o9OM5K7L1qP1l8J0m3o3J4K5k0
$$ y = [34, -13, 61, -5, -27, -41, -71, -35, -32, 32, 21, 31, 55, 35, -43, -34, -80, -13, -86, -47, 5, 25, 42, 15, 53, -12, 11, -81, -6, -10, -49, 21, 25, 0, 18, 16, 41, 35, -20, -101, 45, 16, 64, 64, 83, 25, -1, -61, -33, -24, -18, 6, 43, -9, 101, 1, 3, 3, -1, 5, -30, -19, 45, 56, -3, 16, 31, -34, -28, -34, -51, -1, -36, 53, 57, 36, 40, 22, 12, -65, -33, -4, -16, -12, 9, 24, 77, 37, -29, 11, -31, -75, -19, -17, -6, 60, 35, 21, 33, 28, 6, -33, -47, -26, -7, -4, 25, 73, 97, -23, 16, -66, -72, -19, -31, 45, 2, 36, 0, 50, 41, -45, -27, -24, -33, -21, -23, 51, 21, 35, 0, -47, 4, -45, -41, -53, 9, 34, 47, 105, 53, 5, -15, -84, -51, -42, 18, 3, 85, 36, 45, 11, 9, -46, -64, -95, -86, 8, 46, 43, 7, 29, -1, -33, -68, -51, -84, -16, -7, -15, 99, 16, -6, -35, -66, -44, -24, -39, -29, 53, 89, 105, 12, -24, -40, -64, -55, -10, 29, -2, -3, 67, 45, 9, -9, 20, -45, -45, 7, 8, -30, 35, 78, 54, 22, -83, -81, -22, 45, 1, 24, 32, -1, 61, 2, -5, -33, -75, -5, -29, -29, 17, 31, 41, 89, -5, 6, -78, -45, -65, -24, 26, 45, 90, 49, 33, 17, 5, -80, 0, -27, 44, 14, 42, 105, 107, 16, -29, -98, -92, -47, -20, 11, 3, 74, 36, 46, 3, -60, -46, -21, -41]
3358d1nR0j1O6n0l8o1M6p6N1N1J2K5m0Q0o6n0k2mM5jl2N0J0J2n6L5k8j2l8J6r
3390e1Q9j0M6n0Rk7Lk2n0K9J3N0K1L7pq8l4oOrO6l7M7J4Oj5m3j6p1K6o7J23O9
3423E1j7L7o7j0p0j0P5m8K1J17m0nJ2No4k5ol7O6Oj8L6M8j0oj15K9l6O7j0RN2
3455C7Rk4K6q2J7J1j2L7q9N4O3j7k9nMj7m3M5N6k6K%L8K8p6l4OLqO5p6O9Lk8L2
3490C9o1L9k5n8P7RM5k0j6L3m6j3n9KJ4M2L3rL2m6l2j5m0M3o4J7M2P9qJ7l4J3
3522C0n2j7pk0L2O0j2NNL9j09k7O5k9L1M2j5J5M2o5%Km2k9k6P9k0N5J4l0j0l0
3554b4J7j0j6M3l9P6j9OK5o6O1q8Rj7qN8jP3K3r3M0m5j5k5J6qJ2J09m0l6Lj6p9
3587g4L4lK2K6L0J4Qk9nm2oj2K3L9j7LP3p2M6p6j2l9O9L2Ok3pL2lrn4J8KJ0k9
$$ y = [-41, -46, 44, 33, 99, 49, 11, -50, -4, -80, -29, 22, 34, 59, 19, 99, 33, -17, -39, -43, 2, 1, -31, 19, 29, 41, -15, 20, -8, -20, -58, -42, -51, 38, 28, 74, 24, 33, 6, 9, -13, -63, -34, -21, 29, 50, 87, 80, -8, -42, -48, -42, -51, 15, -22, 25, 39, 45, 30, -13, -29, -100, -74, -141, -18, 51, 34, 71, 4, -6, -76, -86, -11, -59, -38, 79, 39, 34, 46, 51, -13, -38, -44, -81, -15, -9, -27, 9, 57, 47, 41, -74, -45, -81, -14, -24, -15, 37, 46, 22, 48, -34, -17, -6, -18, 19, -70, -16, 47, 30, 1, -4, 0, -17, -60, -15, 41, 15, 17, 17, 55, 83, 7, -27, -21, -18, -26, 39, -37, 32, 35, 7, 39, -22, 17, -8, -66, 11, 20, 65, 45, 29, 62, 16, 3, -56, -54, -40, 2, 35, 26, 58, 12, -20, -35, -75, -32, -96, -79, -37, 42, 34, 51, 17, 30, -22, -39, -46, -66, -34, 26, 14, 19, 24, 63, -46, -73, -8, -37, -6, 36, 21, 36, 78, 13, 13, 15, -27, -56, -82, -3, -23, 32, 46, 16, 6, -24, -7, -17, -33, 10, -29, 47, 28, 34, 59, -7, 54, -34, -25, -42, -50, 8, 7, 80, 103, 10, 50, 5, -10, -35, -19, -27, -15, 94, 54, 18, 21, 5, -74, -40, -43, -21, 5, 35, 49, 57, 28, 23, -19, -25, -37, -14, 25, 8, 11, 84, 12, 58, -18, -30, -69, 0, 32, 38, 15, 8, 40, 37, 28, -26, -8, -6, 4, -25]
3622b5J2N4k1l5M1l9Mj2l4K5J0K4LOk4ok0OKL7J7PL5Ml7p4O9Rj08M8K5J4J7%q
3657B6rJ7j04N6m4M4N0%J3n3N9p6j9J48j05m0M6m3O1j3j9J4m7J2K7j5nk6N9k7
3687a3N2l1OJ5kq0j0N0L6m0O6nr7R0p3K8l3O8k3K6k3P4q7k6n8R4j7k7KL7k8N4
3719B5O4r7N6q3Q1q8j3M4L8m9P3j8j1n4J3Jk7j0oR5J3rj0Qq1N2q3K3QO1K5lm1
3752cJ0N3m5q0M9qJ7K4P1o1L2n9O8r0l2K4M5K4k7L7k3JJ4n9l5K1JR6n7MK5J0l5
3785A2Ok5p5M5K0M8mJ0KjJ2m2m9k5N6K2k9J2K1M2p3L3n9j4Q0J1m8ON6k1j3m1l0
3818e5L9m9M6o2N8N2K5Jp0K5k1nK7j1j2J1K1l6M7k6j3J5o7P5p9O7j2j2L8Olj8
3850Bj5j4Q1n0N5lj2m3J2k6j6PK8j7M0Pn7Q0Qm1j1jk1mL7k1NJ0%j0M0k2r3M5m
$$ y = [-25, -13, 41, 20, -15, 26, -13, -9, -21, -55, -30, -20, 4, 7, 13, -11, -17, -37, -31, -29, 8, 25, 32, 67, 71, 34, -40, 29, 38, -70, -22, 3, 17, 34, 34, 26, 17, 34, -70, -14, -58, -14, 36, 36, 49, -4, 55, -21, -40, 108, 3, -37, 9, -34, 27, 14, -5, 9, -38, -26, 1, -14, -19, -45, 14, -13, 39, 8, 14, 29, 27, -53, -63, -13, 23, -17, 49, 44, -53, 37, -36, -8, -41, 27, 4, 30, 7, 81, -6, -32, -90, 4, -13, -40, -38, -1, -29, 25, 89, -8, 48, -35, 46, -42, -55, -11, 27, -22, 51, 33, 22, -32, -19, -18, -45, -55, -61, 34, 47, 38, 28, 36, -45, 7, -76, -53, -45, 16, 41, 38, -3, 7, 60, 15, -65, -16, -24, -7, 17, 88, 27, 59, 0, 68, -22, -54, -30, 15, 39, 12, 49, 26, 27, 41, -18, -53, -32, -31, 65, 8, 12, 37, 47, 12, 18, -7, -82, -37, -17, 31, 27, 37, 39, 38, 50, 8, -41, -66, -10, 12, -17, -5, 16, 58, -15, 18, -41, -55, 25, 36, -12, -6, 50, 29, 16, -25, -55, -16, -65, -19, -81, -23, 29, 54, 55, -15, 10, -11, -16, 11, 0, -12, -1, 20, -16, 31, 5, -8, 7, -60, 15, -64, 3, -9, -21, 17, 23, 20, 2, -13, -27, 54, 4, 59, 56, 44, 1, 13, -13, -29, -22, 6, -11, 29, 36, -21, 59, 67, 26, 15, 14, -7, -11, 26, 5, 10, 20, 20, 10, 50, 28, -65, -20, -24]
3885b4K3k4M8K2K3n0l6l5O9o3N3J3K0nk6n1L7qjK8K8l0kj3Pk3rM9l6pj2M2J4n
3919A6oLJ5n0O8j9j0o0K6K4o0R8p1N2o7j8K9n7P1K7K0L2n5l2Pl3J6O8m5k1M0M6
3951E4o0k6K5QL6k1o3KO0m2P4o4J7K5m4K7l4K1J7k3rN7k2K7j18M5J6N8Jm4J5O0
3983G5o6L0ol0m8J5j4N2K6mn5K1KPj9M6J8lm4m2nJ07j5q9J2L5m7L6L7j1J0n0L6
4016A7k8K7k5jMJ0K9K5k2kJ0m6j4L0l7l2P3lj7J1j0K6J3j4l9k7R3j7k3L2o6l6
4048e9L9K2O0o6%K3%%k6O9o1j4%j1Ok1M7n6N4M6m5n0P6j09N5oK%J08n3J2mn1j2
4082b5j1PL7k6J7Oj7L6j3j4j9J5J7L2q1J2LKmN3J6k8j6Ll3J9K7L8o7qO3l6Lj5
4116gn9N9K8n4M3M4p2L7k7o7N1L9k3rL2Ol7j1J5j4L5mKm5N5M0k7l2M1l6j6j6L5
$$ y = [-24, -1, -25, 23, 45, 68, 18, -18, -53, 16, -47, 6, 19, 39, 34, 8, -43, -6, -14, -15, 13, 41, 11, 9, -4, 3, -20, -29, 20, -16, -23, -35, 7, 21, 16, 10, 13, 28, -22, 46, 27, 17, -43, -17, 7, -53, 45, -26, 26, -41, -59, -30, -87, -16, 11, 31, 63, 8, -24, -17, -50, -34, 34, -11, -32, 8, 54, -6, -32, -7, 1, 37, 16, -47, -45, 15, -27, 47, -17, 0, 25, -19, 8, -26, -5, 12, -11, -20, 37, 15, 42, -76, -31, -15, 43, 44, 0, 15, 75, 9, 39, 33, 3, -45, -30, -44, 8, 34, 30, -25, -4, -2, 5, -14, 32, 50, 47, 3, -39, -44, 63, 48, -41, -29, 6, -41, -5, 32, 21, 31, -19, 17, -11, 16, -9, -10, -6, 4, 33, 58, 36, 34, 44, -2, -16, 14, -23, -55, 18, 15, -2, 9, -1, 25, 38, 24, -15, -42, 51, 34, 11, 43, -23, -59, -20, 2, 62, -4, -4, 19, 19, 19, -7, 62, 1, -13, -13, -24, -18, -39, 8, -48, 6, 52, 7, -43, 33, -76, -21, -27, -25, -25, 83, 30, 42, 38, -13, -25, -36, -29, 8, -18, -1, 5, -12, 24, 11, -3, -22, -7, 10, 42, -39, -27, -24, -22, -26, 27, 43, 15, -1, 2, -31, -12, 15, 53, -14, -22, 41, 5, 8, -7, -66, -7, 21, -33, 10, 54, -18, 19, -8, -75, -24, 15, -8, -17, 15, 21, -16, -27, -12, -26, 9, 5, 7, -38, 17, 57, 30, -2, 39, 3, -13, -29, 6]
4149Fj6N6o7J3mM8m7m3jL8rP2r9L2M3m0P4n0m1M9M0j9Nm5Oj3JJ7m3P9n5k5L5K0
4183A7l2QN7j18P3Kk3K0j05J14l6M2J5J7o3J3l1N0N4q3L5l9PL5L1nk8L0r0N0k7
4214a0Q3p0j5oK8l1K4pl3Q4n2M6m7OM0K7q6k0PK5N1l2K6m1L1r1Q7m0K7k9k3L9
4246bm7L8j2J8j3L3k4NO7q7O8r1L2NJ4N7o5J0L8k8l7KJ7K7m1J0j2l7L2J2M8l1
4278FM2l0lQKk4m2K9m0N9l5j3M6j1qP4p6M4lj8l6J6k9K1nP5n4nLl6P7o8j7O5j7
4313ck2K2mKO9o4j5j6K8l3K5mM4pj2K4k9p3J01Mn5J0oM3m1K3Lj3l5L5m1N3l7M7
4347B3Mn2J3k9J7j3M7K3n9P6r5O2m6K0K5K2l8l7P1l6KK5lm9%N3j0o5J5L3pm6M3
4380a1K7p0J8L9j5L1L3n0K8jn6M4ml0k7L3J2k0L0j9L2J4k7mK0Q8j45Rj4O0l3k9
$$ y = [6, -10, 46, -21, -8, -12, 36, -11, -54, -55, -17, -26, 46, -53, -21, 22, -18, 56, 6, -35, 14, 54, 35, 40, -5, 1, -12, -11, 6, -37, 42, -13, -38, -3, 17, -15, -7, 50, -68, 5, 7, -16, 4, -101, 13, -23, 19, 34, 51, -12, 1, -30, 20, 74, -9, 26, -13, -6, 29, 60, 55, 27, 57, -33, 17, -10, 73, 3, -12, -18, 10, -21, 3, -4, -37, 47, -5, 41, -6, 0, 40, 67, -19, -39, -32, -7, 44, 12, 38, -3, 28, -63, 24, -16, 11, -18, -41, -2, -49, -11, -23, -5, -18, 15, -9, -4, 63, -24, 44, -47, -15, -10, 4, 61, -4, 6, 44, 16, -21, -19, -2, 25, -16, -6, -18, -55, -23, -11, 37, 6, 48, 18, 15, 23, 25, 1, -41, -12, -52, 7, -28, -41, 5, -6, -14, 60, -16, 28, 25, 7, -29, -13, -42, -21, -26, 49, -5, -10, -7, -43, 34, -34, -51, 14, -3, -25, -3, -7, -5, 64, 0, -15, -31, -3, -36, -11, -15, 29, 22, 10, 34, 5, -68, 33, 37, -18, -8, -14, 29, -12, 11, 14, 1, -34, 1, -40, 13, -24, 23, 27, -25, -12, -41, -24, -37, 10, 33, -26, 50, -45, 17, -29, -9, 16, 38, 0, -37, 34, -2, 0, 25, 22, -27, -27, 26, 16, -49, -34, -1, -8, -54, -11, 16, -54, -36, 3, -12, 19, 52, 2, 30, 29, -27, 17, 13, -17, -44, -11, 1, -19, 11, -8, 24, 38, 11, 7, 27, 115, -30, -21, -35, 25, -8, -37]
4412c7L0j7j6L8K8J7l5PK4r4N9j0MJ7k7J5O9n1Nm0N1j9j0l4k2JK8%RJ2loK2n9
4446d4N6m1jK9j3M4K2n9l8J0K9K4m4j2Q6o1j0N1l9l%k0KO1%J1m6M2k6k5O3p2K2
4479bl4K9J2n2M7Qk6O4n1k4L2j2j5K6PJ7k6nlMq7N4K7O3l7k7J2LK9l6K7m7N8j5
4513B0k7K9Om9K0l4J5K6j0nqJ6l1PM8J7k2r1P1pJ8k5jOJ4m4J2J6l3M5L9q6O9%
4547B1L5n1l5J13r3oK5rJk2N4q1K0J1Jm3M1J0J1l1K3L5N1j3j11K9l4R8m5JJMp
4580DNn5M5k1M7j0l2M2n8K0J3Nj2j7J4N1n2K9l8K3jm4M8L9o5L7j6L6o5J0k3M7
4612Fn7K6Pn1O0n2R6j4J7p1J3k9J2K0j2N0m7L7J8K7o9J8rKPKJ2o3O2%m1k1K5k5
4646d4M2L5m7LLL8n8l1M9n0Q0l9l7K3pN0M2o8K1K4n8PL5m2m1J07m3j5Q8r1%l3
$$ y = [-37, -7, -24, -40, -2, 26, 43, 8, 15, 39, -55, 4, -6, -2, 15, -12, 3, 72, 21, 26, -14, 37, 18, 8, -26, -48, -47, -19, -19, -10, 2, -1, -7, 15, -44, 12, -29, -30, -1, -14, 30, 52, -7, -45, -35, -6, 18, -26, -38, 48, -13, -23, 28, -11, -14, -14, -34, -32, 29, 29, 40, -6, 36, 10, -15, 48, -24, -2, -36, -7, 5, -47, 0, 8, -18, 46, -5, -29, 3, -9, -24, 2, 9, 26, 0, -5, -8, -4, -91, -37, -10, 53, 16, -11, 1, 4, 33, -3, 24, -23, 35, 20, -7, 22, 28, -21, -1, -35, -20, 6, -4, -9, -17, -1, -32, -25, 23, 40, 18, -73, -2, -9, 9, -16, -17, -11, 3, -41, -29, -13, -46, -1, 38, -48, 21, 21, 56, 5, -30, 83, -10, -16, 9, 0, 1, -21, 33, -48, -28, -17, -16, -59, -18, -8, 3, -28, -5, 30, 81, 68, -43, -14, -48, 50, 5, 6, 7, 11, 4, 9, -46, -1, -22, 25, 15, -17, 25, -33, -13, 0, 5, -7, -24, -10, 41, -11, 18, -20, 3, 2, -42, 6, 45, -20, 17, 1, 37, -28, -18, -41, 6, -51, -25, -18, -69, -9, -61, 35, 21, 38, -33, -20, -49, -37, -17, -29, 21, -26, 11, 29, 56, -13, 5, -4, -2, 5, 7, 19, -44, 18, 18, -23, -44, -19, -44, -2, 33, -14, -11, -8, 30, -28, -59, -10, -60, 20, -19, -56, -33, -40, 10, 52, -16, 5, 29, -29, -22, 13, -29, -70, 37, -6, -21, 67, -24, -24, -57]
4678e7O7l0L0m5K4N8K3q5K7L4o9L7qk5N0m3K2n8RK7k1N8N1n0pj5Pk1rJ2LK6k7
4711eJ3rj0M6r1L9%RJ9Oj4L8J3p5O8n5l7J1M6m9J8J7L4n9L7J7n8Q1n7N7k3n5J2
4744a6M1o0N0Km3J3k1lM1k7rP2l6K4J3k8kk8K9k1O9rr7N9J6NjK9o4lJ6l8K9NJ4
4779B1l8L3J6j05R8J0j9l5RK6j3m7N2J0l0NK8k9J2l5Q0q3M9lLk7K0l5K3mk3R2
4811F1j01N7kqk6L2M3o4O6j4p8Q5p0j3ONJ6oK5m9N2K2p5K0k5jM4J5n6N9mjl2J2
4845en6O6L6m3K2k1j4K2K1Qr9K0RK2J6l5L5k6L5Nj05P8j1j9L7qL0jj1l3J7k3L4
4878Cl7L8Mj1J8j4kj9O8o0j8J1L9J3Onj4l5K1nk9K5l3K2nPL4l1J9J9k7j8l1N0
4912Cj6OJ5j9L8m4j5J8k9L8j8K6K8n4M2ql1J2l8M1m8R5n1JL0qjJm7J3j0M6nk1
$$ y = [-57, 10, -20, 10, -35, -11, 47, 70, -15, 12, 46, -23, 14, 6, -19, 31, -12, 10, -48, -39, -12, -33, 25, 76, 26, 19, 4, 11, -10, -19, -7, -4, 22, -5, 8, -1, -11, 35, -56, -17, -17, -8, 11, 17, 3, 41, 54, -21, 47, -8, -45, -34, 12, -37, -19, -2, 32, -27, 10, 27, -31, 50, -7, 50, 27, -28, -16, 25, -35, 15, 17, -26, -13, -34, -37, 4, -23, -32, 40, 4, 28, 41, 13, 11, -17, 12, -9, 60, 51, -46, 13, 29, 34, 33, 62, -2, -5, 11, -27, 2, 7, 21, -17, 16, 32, -73, 25, 35, 16, -19, -10, 16, 3, -44, 8, 18, -12, -7, 21, -8, 4, -31, 49, -34, 15, 12, 15, -12, 8, -27, -4, -8, -31, 61, -40, 17, 15, 7, -19, 13, 56, -8, 58, 44, -34, 51, -19, -32, -26, -21, -5, -11, 14, -35, 17, 39, -36, -16, -41, -42, 2, 17, -39, 20, 16, 15, -17, -5, -61, 5, 41, -2, 20, -1, -15, 7, 28, 36, -63, -43, -34, -12, 4, -31, 4, -22, 13, 18, -87, -9, -20, -39, -2, -10, 20, 19, 8, -25, -8, -31, 3, -34, 4, 8, -3, 15, 1, -1, -20, 48, -12, -30, -19, 20, 33, 39, 34, 20, -15, 6, 1, -28, -3, -36, -14, -19, -12, 22, -9, 10, 29, 2, -16, -47, 3, -13, -7, 8, -11, 27, -17, -32, -14, -43, -5, -23, 3, 31, -23, 19, 11, -20, -8, -46, -5, -53, 42, -9, -8, 22, 14, 13, 14, -33, -20, -30, 16, 11, -10]
4946a0K4n4R5q2K6j9J4M4n0N9m6Nl2j9J6L2j5j4j8O4J6k3J9o7L6l1N4J9%pJ6l3
4978A9K3m5j9L1J5k9pM5j0K9q8N0j2kL8j6r9O1R4o4j2m1R2q9K3M7q2M1MMML3j9
5011A9k3rJ8nl5L4pM7qm9O6m4J4j3J6nK9l8J0RJ6o5Q5k5r0L2N4q3O5K3l3qM6o2
5045a9P3m6m3N6p4K5jL4M8l7m1OO5j1p7L9l6N2K0k9qQn9M8j6K7M0Pn9l9L0j8j8
5078e3M3NK4m3L1k7j0L7NPo8KP1j0PM%o4QJ1N7j1l6L0p1J6R3j2k8n8P3K1l3o4
5112d3L8k7Q0l0ORn3L8j5m1J9K3j9J6j2P2q2K3K3j9j0L6L0q4L3rL1Ol5J5n6J0
5144b7L3j6K6K3l6Moj6J3M6J3p1lM0j9j0N3r2J9j5J4J5N8k6o7M4p4N4k5N6%j4
5176foJ6%K2k7K6k1K1m4J3Kj7J0n0P4j3l0L0rK2j2n0M9J5j4mP4p7l3Q7n6J8m1
$$ y = [-10, 14, -40, 55, -27, -1, -20, -6, 38, -12, 47, 1, 6, -26, -45, -29, 3, -12, -26, -44, 20, 36, 13, 32, -35, 1, -30, 24, 43, 43, 36, 52, 19, 42, -3, -22, 9, 24, -5, -12, 33, 23, 52, -36, 14, 2, 0, 38, 22, -77, -16, 78, 14, 2, -39, 53, -36, -13, 34, -48, -7, -3, 1, 5, 38, 19, -4, -13, 5, 0, -35, -1, -8, 39, 31, -18, 48, 4, 18, 5, 21, 16, 45, 7, 17, 26, 42, -23, 62, 37, -53, -21, 33, -50, 15, 38, 5, -3, 43, -19, 54, 8, -35, 21, -53, -28, -29, 5, 53, 16, -25, -19, 46, 35, -42, -3, -39, 13, 33, 4, -4, 4, -55, -7, -23, 4, 44, 51, -8, -47, -17, -35, -53, -10, -5, 19, -24, 7, -20, -30, 7, 12, 19, -49, -47, 24, 14, 21, 25, 25, -39, -31, -20, 37, 26, -10, 20, -51, -35, 58, 46, 18, -40, 33, 54, 21, -43, -5, -32, 48, 18, 24, 33, -20, 18, 3, -38, -19, 4, -15, 1, -11, 61, -21, 2, 25, 6, -4, 32, 62, -22, 11, 2, 33, 39, 4, 19, -37, -27, 6, -10, 16, 39, 3, 7, 1, -15, -2, 44, 57, -14, -17, 23, 4, -6, 47, -45, -26, -41, -27, -12, 46, 20, -47, -3, -77, -23, -48, 8, 8, -6, -12, 4, 4, 26, -1, 25, 4, 25, -19, -6, -4, -21, -11, -61, 13, 0, -30, 0, -9, 13, 1, -49, 0, 15, 1, -3, 71, -6, -39, 48, -8, 10, -31]
5209c1J1N0j7l4PQ5q1M9qk1k0mK8j0k2J6J9qOJ2k9N8m6M4o3NOl0K1J8K8j8j3p3
5243f5N1l6Q8l8n3M6n7K0OmQ2j6l3K7j9K6Ol7K7K2Klj7j7lM1l1K0p4P2k6j0PN0
5277E4l7l2L3l2R3p5k2PM3j1kn2OJ4m5N1K8Rm0N2q1L1j9j9K7j2K1O3m3m3K5L6
5309B8m3L9m2O4o4lR1o0K7nk8K7k6pQ3p6l1M7J4n8L3n3QkK2j5K3N7k1o3N1o3P3
5342B7m8L5mN3r5j3O2nk6M8K7p0JR0o9k6M6K2j7j23Q7l6J3l7K8j6N4L6n4oL0l2
5374a8%l3M8j8k9Q0Qj6m1j6L4n9O0M9p2O9k1nl5K0p0J00l6LK6k9L4j0K1p3L0L2
5406C3l1k1PN6k2j3K8l6jl0K2L5J5j1K7m9L6o0J6J7ol4L0k2O8m2K1J4mm2M3n4
5438a0L4J1ln5L5K6J3l3k1O2q6P2k4n6N1n2L2P2o0nj8lO9o1J3J2j6j0j1L6rN5
$$ y = [-31, -20, 30, 13, -21, -14, 71, -10, 39, 31, 10, -10, -14, 14, 4, -18, -2, 17, 9, 15, 27, -2, 56, 10, 54, -9, -4, 2, -28, -7, 11, 39, 21, 8, -65, -14, -50, 38, 0, -53, -7, -64, -44, -38, -42, 40, 24, -9, 18, -1, 25, 31, -6, 21, 43, 45, 42, 25, 8, 5, 46, 15, 35, -39, 33, 7, -3, 4, 54, 17, -15, 18, -14, 79, 4, -18, -11, 32, 21, 19, -33, -27, -13, -58, -7, 21, 30, -10, 42, -39, -8, -27, -46, -19, -31, -10, 53, 10, -33, -8, 28, -15, 24, -18, 46, -18, -21, 70, 10, 37, 32, 4, 31, 5, -2, 81, 5, -26, 21, 35, -23, 10, -43, -35, -37, -15, -30, -7, 50, 29, -34, 17, -46, 27, -21, 14, 10, 63, -32, -45, 17, 12, -14, 34, 61, -9, -8, 82, 13, -13, 33, 55, 38, -85, 2, -34, -21, -58, -30, -46, 8, 44, -10, -16, 14, -18, -18, -51, -3, -21, -50, 30, 38, 22, -19, -35, -1, -60, 0, 49, -23, 46, 25, 20, -15, 5, -65, 35, -1, 2, 28, -1, 33, 23, 44, -29, 1, 33, 2, -19, -12, 44, 22, 9, 37, 1, 0, -30, -8, 27, 42, 31, 58, 9, 45, -15, 1, 18, 12, -22, 8, -14, 54, 12, 33, 47, 43, 1, 44, -10, 24, 35, 32, -23, 12, 38, 51, 18, -3, 59, -27, 45, 21, -35, 16, -36, -4, 68, 8, 3, -15, -18, 51, -10, 3, 15, -1, -11, -22, 14, 5, 60]
5470F0n0O1k3l2k9M2l0l9l4J09m4L3l4j1J4l5M0P4n6j0L7p2K7nP3p5P4m5K5m8
5500cJ8J8n2M5lj1l3nK4j7N5o3j0QK2J4J1m6K9Pk9K7%K0n3J8kJ8J0k9M1J1m9N5
5534D6q2M8K9jo6lN6oj7K%m6N6q8P4j4pJ5l1l0R1l3N7n2Jl6L0J9m2j3N6k7MJ6
5568Fl8J00o6llkj3nN2k1J0On4j0O7l3L0J0n5QM6l2J7j7m7P6L0o6L5j4L6q9M6
5601GpM6nk3m2L8l5M3j5m2O0K2k4j0k2lj5O2Ro2P3m9m2l6L3QM6j5l9J4K1K3J1
5634C0n9J3%N0Rq7RL6m5JN2m0L6qL2k5L2L0r4J0M7j7PKM3p5K5Ppl2J2J1L6m2j1
5669a2J1RK4k2J1p4N4mk6J7j8J5J2J2n1M0K4m9K8L0m0M4l4N7m7m6L0j8K2L6p8
5700d3J8M2Mk2K2J4pj4j8MK3l1nJ7%j4J5jK6q3L6jml6Q2j8lJ0k0jL4l8J3O3q2
$$ y = [60, 10, 71, 48, 16, -13, 29, -1, -40, -74, 35, -9, 24, -10, -21, -7, -42, -2, 72, 16, 6, 43, -29, -2, -7, 66, -9, 65, 20, 45, -3, 15, 33, -19, 26, 23, 12, -21, -26, -2, -19, 36, -27, -37, -29, -7, 7, 18, -28, 1, 8, -21, 6, 6, 26, -27, -9, -11, 7, 17, -12, 29, 40, -9, 46, -36, 12, 41, 40, -26, -29, 27, 21, 4, 6, 6, -40, 16, -72, 2, -12, -19, -4, -35, -65, 26, -7, 50, -2, -1, -37, -7, 12, -30, -43, 13, -14, -10, 6, -32, 68, 2, -1, -4, -6, -19, -24, 28, 7, 17, 23, -31, -41, 26, -7, 23, 33, -22, -14, 32, 0, 17, 0, -47, 29, 59, -7, 28, 14, 50, -39, 7, 0, 46, 41, 18, -24, 14, -21, 22, 7, -35, 25, 47, 23, 13, -9, -12, -27, 35, 44, -18, 55, 6, -36, -72, -39, -31, 15, 0, -39, -25, -4, 19, 30, -29, -16, -16, 34, 43, -44, -35, 1, -44, -43, 9, -31, 5, -3, 29, 4, 36, 66, -28, -18, 29, 12, 19, 21, 64, -11, 14, 21, 14, -18, -6, 5, 41, -1, -12, -1, 8, 32, 10, 21, -53, 1, -3, -29, -12, -30, -15, -3, 9, -42, -2, 22, -27, 1, 31, -9, 35, 1, 58, 11, -35, -5, -23, -1, 35, -43, -25, 17, 21, -1, 21, 35, 28, 14, -4, 0, 23, -8, -13, 4, 4, -10, 5, 4, 30, -53, -17, -18, -22, -58, 24, 6, 3, 13, -7, -8, 26, -12, 1, 64, -18]
5735a8Q1j02L6LlM3n9O1l9j4L1j4LK4m6O2m2j2J8K4j4j6j1k7M6J3Lp4OQ9n1J8
5767A9m7K4j9KO6p0k3N2KK8Oo6J3J1N7m4OoL5p3m3L4K6J6K0j00J11l5l3k9O8j
5799GJ7j7jm5N9K5n6R2j04PRO6n3p2P6O2o7ooM2k9L9l1n0K6M2n3M2K9o2M6n9J8
5832gK2m6K3j5N5k8k3N9m8olL1mRl2J1j6K5J1l0nk8j6QN5kOnj5K2nJ0Rl8N6q%
5869C2K0o1j7j3J9N8m0k1oK4K5o0LK1k9N5OJ1J0j9j1J1q3N0n7Q1l8PN7j1rl0J8
5902CQjJ5Mpj2J3rL7m1Qo3K1K0N3k7J5j7n8O5o4Q2o9M5qn2M7M0j06L7L1m7QL2
5936Ck9N7j9j0J5m4j1M3j0k6N5k0K1nk2N0n9LkO2l9k0K5qJ1k6mk3M6o8j4N4J7
5969Cjp5O6m0J8M1l6Q6j02L4lM3n8J5K3n7J0P1k6j4MK0l9L8K5n6N9q6PkN4n1M
$$ y = [-18, 63, -39, -3, 0, -3, 40, -19, 42, 3, -11, 20, 6, 9, 33, -13, 49, 7, -5, 13, 37, 23, 7, -4, -31, 15, 28, 31, -43, -37, 52, 1, 19, -28, -4, -23, -21, 45, -25, -48, 4, 6, 34, 40, -26, -13, -2, 55, 11, 17, 11, 46, -27, -70, -36, -10, 6, 26, -74, 37, 2, -31, -60, 8, 7, 24, 7, 6, -39, 20, 45, -11, 81, -23, -16, -7, 59, 6, -66, 10, 72, 5, -1, -7, 35, 6, 45, 14, -36, -10, 32, -21, 21, 50, -12, 34, -25, -7, 15, -31, -8, -23, 32, 4, -19, 40, -8, -14, -17, 14, 10, 19, -13, -2, -18, 7, 18, -12, -17, -45, -61, -53, 2, 0, 6, 1, -14, 8, 3, 13, 22, -16, 40, 32, 32, 52, -9, -26, -39, -20, 38, -2, -23, -29, -5, 20, -40, -37, -16, -45, 10, 16, 27, 37, 18, 7, 18, -65, -15, -72, 9, -29, -22, 35, 24, 15, -15, 3, 11, 10, 25, 29, 22, 10, 23, 14, 51, 10, 18, -45, -24, -4, 49, 22, 37, 20, -38, 27, -37, 45, -24, 21, 13, -39, 8, 48, -58, -21, 10, -37, -29, 3, -26, 31, 12, 2, 17, -27, -38, 5, -5, -31, 24, 4, 25, 20, -2, 48, -11, -8, -10, 52, 13, -7, 18, 10, 21, -5, -9, -32, 14, -54, -68, -14, 3, 2, -73, -7, -47, -29, 12, -24, 62, -40, -6, -9, 34, -24, -9, 14, -43, -33, 38, 12, -2, 2, 22, -17, 21, 46, -10, 49, -37, -30, -32, 22, -29, -25]
6002b5M1l5j6N4o0M7Qm9ML9j6M6n3K5l4M6K8l9p7O0j2J1OK3p4N5L2l6n8J16j10
6033e3K2oM0Nj8JJMNqJ9m1K6l2P6q3K2k3K6qKj4O7l3MJ3k6k6J2mK6M5l0l7j2Q4
6069D6j5k9l1J3OO5p5k2M8j9RM2k1l9N4o8M4NjJ1m5n1P4j8qk5J13o8j1JmL6j2
6102En0K2P8m7QK3l4K1j5j1n0M7L3J6m6NK4n0K6OrpL5o0O7RMm1l7j4oL4mnP7o8
6138a4lN3Nno7K0j2J2lj8mM1k7j7Q5j6o8JP4n4L9k2K4Qp0N6k3K8m2k3P9o1M5m3
6172b2L9n4N6oML1km4M4p7J5k1N9j7njpk9J6N9l6L6l5M7o8N9Rj1m2K1qrN8lJ1
6207F7n5N2j5p6N9k5J6q4M4M5l9O3m1p3M0J4J3nRJ6lm9k2N4l9LJ7kM4L7m8m7M1
6240A1kM0p7K9K1k0m3L0K1J0N1q0N3p8NMML0o4M3j3P8q3Q8o7LJ4n3L4K7k5p2P0
$$ y = [-25, 16, -19, -35, 19, -41, 6, 14, -35, -31, 8, -8, 38, -15, 10, -24, 22, 50, 11, -66, -6, -18, -7, -1, 22, -52, 3, 35, -1, -59, 57, -53, -31, -37, 3, 8, -10, -9, -8, -4, 1, -7, 12, -29, -3, -35, 41, -42, -20, -43, -17, -25, -23, -37, 30, -3, 1, 14, -12, -38, -26, -30, -4, 41, 11, -26, -38, 46, 31, 2, -29, -16, -10, 55, -20, -42, 6, -13, -4, 38, 17, -22, 32, -36, 8, 13, 12, 23, -22, -73, 1, -17, -25, -50, 63, -5, -16, -15, -19, 17, 5, -45, -23, 55, 8, 16, 39, 5, 26, 11, 0, -50, -3, 30, 46, 0, 5, 29, -21, 5, 11, 2, -5, 30, -30, 37, 46, 50, 9, -28, -42, -48, -14, -18, -23, 54, -14, -17, 36, 41, 36, -31, -11, -23, -11, -14, -32, -36, 5, -22, -39, 46, 30, -38, -37, 37, -17, 22, 0, 24, 32, -38, 18, -5, 23, -19, -42, 37, -24, 21, -22, 17, -37, 19, 13, 17, 48, 46, 2, 46, -31, -16, -37, 22, 5, 0, -1, -8, -37, -21, 38, 2, 38, 3, 50, -18, 41, 50, 39, -3, 18, 10, 1, 59, 56, 67, 12, 64, 49, -27, 32, 7, 23, -61, -17, 28, -11, 52, 11, -62, -22, -8, 5, 0, 9, 25, 22, -27, -49, 5, -34, -31, -14, -16, 28, 65, 17, -30, 11, 9, 49, -28, 1, 22, 2, -41, -11, 10, 20, 71, -9, 44, -34, -29, -25, -21, 9, -55, -12, -25, 53, -30, 58, -9, -6, 8, -45, -11, 16, -9, -81, -11]
6273a1RK5j2l6j4L4m5R4k2j4j3P5p3qpk4Q5n7K7Ll0M3j0k3m5K4P3p9K5j7O0n1
6305a4K1lkj6K4k2K3Km6OK1p3M6N4l1m9P7o3M8M3n7M4k4qM1l4j8M7m0j0rLN3l4
6339@k9O5n1pmO0m7j9N4k6n1J00m8nJ2PK5o7K7ML4m0j6N9p0L0Q0p1pJK1j8j2j8
6373b7P6Mo3lP8l8k5j7L6k8J0L5n6ml3J2Q5n3K6j8J4K9n0jPJ7OLj5L1k9M1J2q6
6407b4k6N7M4p9J2K2PN7o1L6m3pL0J4k5K8m4k3M2l6O2om9J5m6L8j5M1k3rj2lJ1
6440a5J3j0K3k1%L0m6J3j2O6m9J7Pk2l4K6K3m3J4P4K3j23Q4l5k2L4l6J5K1p5M6
6471a4L8m2Q9j31R5j15J09l1l1j2J04l7l3Rj6O1n7OQ1j11%J5L2K9j07M1M6nj0
6500CNJ2k4lM3m6k7O2l3K9K8n3j8M2J3j7n1P5p9K3%pl0L5J4L9o5N4l8l0L6j0N4
$$ y = [-11, -2, 23, 11, -25, -39, -5, -50, 44, 22, 8, -5, 70, -3, -11, -18, -42, 43, -14, 13, 16, -14, 29, 19, -4, -49, -25, 48, -31, -6, -23, 37, -14, 7, 4, 2, -14, 10, -12, 11, 13, -33, -27, -6, -79, -33, 21, -10, -59, 18, -45, 3, 46, -11, 33, 9, 1, 42, 8, -10, 37, -3, -13, -22, -19, 34, 0, -29, 36, -15, -22, -26, 34, -13, -32, 22, -4, -55, 45, -3, -8, 4, 11, 36, -31, -4, 0, 34, -6, -22, 37, -33, -3, 77, 6, -1, 0, 21, 3, -9, -27, 49, 53, -10, -13, 65, 27, 2, -15, 21, -7, 3, 38, -18, -22, -55, -43, 42, -11, 15, -3, 11, 40, -10, -11, -4, 13, 19, 22, 7, 38, 9, 50, 62, -24, -50, 7, 51, -28, -16, 6, 13, 70, 9, 45, 2, -5, 25, 39, 14, 42, -2, -25, 17, -19, 43, 37, -12, 3, -43, -5, -20, 21, -2, -11, -23, -26, -15, -2, -12, 11, -10, -10, 20, -26, -13, -25, 41, -8, 9, 16, -6, -40, -14, 9, -34, -20, 54, 77, -46, 38, 3, -19, 15, -21, -6, 15, -60, -14, 24, -18, 71, -60, 35, -80, 29, -2, -33, -45, 59, 22, -11, -2, -18, 43, -14, -8, 73, -38, -38, -23, 9, 38, -69, -28, 18, 13, 3, 8, 20, -4, -7, 36, -10, -37, 25, -8, 21, 49, -4, -22, 20, 33, 16, -35, 40, -39, -16, -16, -23, -53, -18, -4, 35, -30, 24, -14, -44, -8, -18, 36]
6533C6k1Mj7j4J3Nl6N4l4N9j2Jm2N2p2N6j2n5N5L6p0J0Mlql5M4NL0k5K0m1L6j
6567B2l2J3lLk8K5%LN1l5L5j1k3j7J8j2L5k9l7O0J0o1L2l7Nj9J4P0o6J3J8o4P3
6600B6k0J0j6Oj9oj1L4L2j21Q3J1n4N6QMk2l0m9J03k7O4j6Qp6M0k3o9P6L2k8N0
6632E6p6Mk5k8Q9o1O3NK4o9J2J9m1M8l3J0J9mLn6O0oj5Pp1O1qj3N0JJ7n2O4p1
6666a7pj1L3jj6K2qj6J2M5l6j1K1M1m1j0K5jp3okO8nK8Jl3j5L2j2j0k4L4k7K5
6700Eokj5M9l7j6kl2O6m0l6Q7nK7J1m0N0p4j5K8J4J4qMoln3M3l6n5Q0k7O7Rm7
6735aqL5l7M2n0JJ0j4J7NJ6n8%P3J2j04K5k0O7L3k1J0ql9Q1o3j6l1M3j4rL8pK2
6769C0l0L5mp8N8j8J0j4k1N2Ll9QJ5K7o1M7K3n6M5p6N0j1pL2L4q6P4l4O2q7K6
$$ y = [36, 15, 19, 2, -12, 1, 6, -30, 24, -10, 49, 37, 38, -4, 48, -24, 32, 20, -35, 20, 56, -14, -4, 0, -3, -11, -46, -2, 3, 33, 8, 28, -13, 23, 22, -10, 3, 0, 3, -25, 0, 0, 3, 54, 19, 54, 43, 20, 3, 21, 9, 44, 15, -22, 38, 48, -13, 19, -18, -13, -32, -18, 52, -14, -1, 17, -47, 26, 6, 16, 0, 6, -13, -19, -30, 4, 36, -85, -2, 9, -45, 11, 19, 23, 1, -29, -78, 25, -2, 62, 46, 54, -22, 18, -5, -74, 2, 34, 6, 56, -20, -16, -41, -69, 20, -41, 22, 27, 51, -18, -6, 13, -28, 20, -13, -3, 16, 12, 15, -41, 19, 13, -2, 5, -66, -5, -13, -26, 24, 25, 42, -10, 54, -17, -24, -35, -2, -3, -19, 3, -5, -21, -9, 36, 0, -11, 10, 51, 10, 0, 25, 24, -49, -55, -57, 11, 6, 34, 35, 2, -13, 19, 7, -3, -27, 7, -20, 5, -1, -3, -18, 31, -6, -22, -24, -56, 10, -30, -66, 21, 16, 43, 54, 14, 64, -10, -25, 3, 17, 31, 23, 27, 21, 18, -35, 8, -28, -83, -3, -30, 37, 46, -1, -9, 26, -11, 31, -19, -18, -8, -22, -5, 0, 16, -42, -42, 31, 43, -61, -36, -56, 11, 44, 23, 33, 25, -14, 67, 4, -12, -43, 0, -14, -23, 15, 8, 30, 0, 35, 31, -47, 11, -7, 3, -11, -32, 20, 23, -16, -8, 7, 34, -27, 20, 43, -13, 32, -44, 6, -5, -12, 20, 54, -32, 42, 8, 70, -17, 9]
6801IK1q4M6j8P3n2Nj2M4M4l9o7P0q0R1l3J1p3N7o7P3Jl6N0j0k6L3ml3k5K3J3
6833El5N2Qk9j3L8k5j4rL4j2rK9m7oK3J1K8On5j3R2o9J1o2R2n7J0jK2q7P7KKR
6868Hj6L7L3o4J1l7JJ8QK8k9L9m2J9J0MqpM4o3J9j0ok9O0J4L2m9Ln1K2L6o4Np
6903c1O6k1Ok3J0j0qJ9k5K9l8lO2l1l2Lm5O4K3j1K5o6K0M3l6K9Rm2M4N7p0rm5
6936c7K7Nn6N0N7n0K1p1P2J6o6J2L0o3L9J5J2oJ6l1J2Ol1m0R8m5RM1o4L2n0K6
6968a4o2R5j4N0o6L2l3O7l2o2P4Qp7lLL4qO1j7n1PL7k2l7J9J5m3lJ02o6l4O0j
7001A9K6l6L7m7qQ9q0j5K6nJ8k6%qK6J1l7L3l6O1p3J1L4j7N5n6n2Q3K2r6M8k1
7033a4oL7J1K2p9OlM3l0J2J6k8M9p2LQ0m6K6j7m4P8l2L6l6m0P7q0M3J5J1qn2L9
$$ y = [9, 30, -54, -8, -26, 47, -5, 0, -12, 32, 76, 37, -30, 40, -40, 51, 18, 29, -44, 13, -54, 19, 20, -16, 34, 24, -2, 31, 27, -6, -31, -8, 5, -30, 22, 30, 1, -12, 26, 1, -13, -22, 12, 0, -9, 20, -27, -33, -10, 1, 29, 35, -20, -33, 59, -10, 1, -61, 31, -26, -16, -17, 5, -82, -5, -3, -1, 8, -8, 29, 62, -2, 9, -28, -27, -9, -1, 27, -2, 37, -5, 14, 24, 28, 20, 13, 57, -6, 13, 3, -3, -32, 28, 42, 74, 25, 28, -23, -1, 35, -29, -24, -31, 35, 14, 20, -3, 7, -3, -11, 8, -17, 12, -26, -29, 33, 2, -30, -27, -72, -8, 15, 4, 29, -37, -17, 26, -10, 19, 28, -14, 30, 87, 17, 8, -37, -10, -5, -61, -11, 46, -4, 17, -54, 18, 34, -32, -20, 10, -53, -14, 1, 13, 7, 23, -8, 4, 10, -21, -61, 37, -8, 1, 42, -22, 10, -40, -14, -76, 19, 5, 55, -11, 21, -12, 55, 23, -39, 35, 43, -34, -37, -34, 0, -8, 53, 36, -15, -8, 29, 7, -30, -11, 4, -39, -42, 60, -6, -40, 20, 19, 45, 9, 46, -1, -9, 80, 0, -15, 11, 6, 24, -2, -2, -10, 16, 27, -10, 23, -13, 48, -25, -14, 20, 3, 58, 2, -50, 33, 55, -41, 7, -14, -20, 17, 28, 50, -29, -23, -26, 17, -13, -1, 15, -13, 36, -36, -33, 47, 1, 27, 10, -34, 44, 12, 48, 12, -28, 49, -31, 12, 27, 38, 30, -22, 17]
7066A7l6M3l3km2Q7n6j5K2k8J02o9qJ3M8r9P8j0k9OL2n3N6J0oQm8M3p8O9J7J1
7098E0j4k1orQl9L8k3M6j3m7JJ6j9%J0QJ1j8J5L8j14M8M8Qn3P4r1P7m3J5qj9O1
7132C5m2kl4K1K9J7m2K6J0n9N0RKm8N4L4l1o7K9M7m0K9m5J2j5OJ6KK7mk8oj4R8
7166G6l8o3m3K8K8L1Kk9L8l0K2Pp8J00k1o4Q2Lk1o0N0K1J2n1j1k3M3K5o8K8m2
7197d6M4kJ5k9m1M4L1m4k8P3k8n2L1N0j8N6j17lM2%L6m3M5j2N3l9o3L8L0l4L2
7228B1m1K0kj1M8l0k1J7m8M4m7O4Rq1Q1l4J7k7nJ9j4rJ2OMK9ql4M4Jl2l7K2O0
7262C7m0O2q7J08j01K9J9q1O2k4O0r0N0nj0O1n2nk7qN6ll1K0J3k8K1K9K4j03O9
7293B5kl3j4L6k3nM5m5lJ3KK0j4KK0l3j5RJ7j6l2P3l1j8N0N3q0N9q5L5m7K6RJ0
$$ y = [17, -19, 24, -9, -11, -53, 34, -22, -37, -15, -43, 59, -10, -18, -5, 43, -56, 22, 12, -17, -11, 21, -32, 24, 34, 28, 36, -12, 31, -47, 22, 39, 50, 36, 15, 9, 0, 8, -31, 7, -16, 30, 17, -30, -29, -13, -32, -32, -22, -14, -3, -21, -6, 32, -82, -34, 14, 22, -31, 43, -48, 29, -14, 1, -7, -26, 35, -7, -9, -43, -22, 7, 24, -18, 8, 18, -41, 9, 18, 20, -28, 26, 60, 29, -38, -9, 38, -2, 27, -18, -6, -21, -15, 1, 3, 30, 26, -2, -8, -22, 76, 38, -25, -68, -40, -12, 19, 21, -8, 30, 0, 22, 29, -49, 51, 30, -34, 48, 51, 30, -30, 20, 41, 53, 2, -9, -32, 11, 36, -32, -4, -46, -2, -4, 11, -18, -59, -15, 16, -28, -56, 17, -11, -63, -32, 18, 0, 56, -61, -64, -22, -22, 14, -29, 16, 4, 57, 18, -45, -7, 23, -11, 21, -20, 0, -2, -13, 35, 5, -16, 1, -47, -3, -50, 14, 23, -58, 23, -11, 6, -21, -26, -7, -21, -30, -18, -12, -8, 21, 13, -21, 23, 24, -8, -45, -23, 37, -3, 59, -28, 80, -21, 8, 27, -54, 8, -16, 44, -46, 4, -1, -11, 50, -2, -7, -34, -42, 14, 11, -20, 0, 13, -15, 6, 35, 59, -44, 25, 23, -10, -24, 12, -11, -16, 29, -16, -19, -6, -4, 16, 2, 4, 24, -9, -24, -15, 2, -14, -46, 27, -4, -22, 28, 81, 1, 60, -25, 10, -37, -11, -2, 8]
7327HK3l9J9o8J00r8K4j5L1l8N4JN8o4L1k3K6K4n4K5m9M5mK0l9J6j5K4l9k9J00
7358E5l4Kn8PL7O2q9QJ5p9M4L2N9q8K3kK8m2J6J6J3qOj4j5%M8n4J4k6m1O8k6L4
7392A1L0j7J0LJ5J5p1o0O3L6m2L0ok8N5k8Ol3K9j1k4L2L1n1N1m6j5qN8j3Ll1p3
7425g9Q2j4kl2j7L6P0m0M5qm7k5M4l7J9RK5r2P6J4j4k9J%k9mQ4r7J21n4m5L2o1
7458f8J08m4M0q3L2N7l3M%J5l2J5L%k3K4l5K6k2L0k2L6rLQk9l1N4k8Ql0JJ9L3
7492B7l6nK8mM6p2M9n6L1l6J01q5j0Q4n6J5K1k1n4JJN7m2QL1mn1O4k1j9L3Lk6
7525BL5K2j0m8k8P2m7N3n1J0l0n7P2J1K9j1l2K5o9M7K3m9L6L0n3L5pm1lM8m7L9
7557Fk8mO2k3k6J8M6m2Qm7K7K9jj2k1OMnK1m7K5O5m2n6M2J6J1j9%k1L4k3j5L9
$$ y = [8, 31, -8, 11, -57, 43, -55, -31, -46, -15, -53, 1, 2, 60, -4, 27, 4, 30, 54, 0, 25, -24, 21, 17, 37, -2, 14, -1, 23, -16, -45, 55, 21, 23, -35, -28, 9, 71, -18, -10, 5, -74, -30, 2, 61, -27, -4, -6, 22, -20, -4, 12, 25, 17, 23, 9, -6, -6, 42, -12, 2, -24, -65, 3, -23, 11, 41, 24, 34, 37, 52, 67, -4, -64, -1, 35, -7, 23, 17, -11, 44, 16, 22, -11, 18, 7, -17, 15, 46, -5, 46, 0, -15, -23, 35, 22, 25, -6, -79, 3, -11, -13, -45, -62, -26, 44, 4, 49, 41, -6, -31, 13, -24, -5, 4, 29, -63, 13, 27, 13, -16, -15, -15, -44, -48, 36, -61, 60, 6, -39, -7, -68, 40, -4, 36, -47, -15, 42, 9, 13, 13, 28, -4, 11, 14, 14, -9, 15, -20, 6, -16, 14, -8, 28, 19, 22, 30, 1, -30, 24, -4, 4, -26, -25, -6, 27, -9, -14, 14, 10, 56, -16, 33, -23, 8, -28, 73, -12, -22, 62, 6, 21, 42, 21, -33, -32, -31, 26, -16, -8, 23, 19, -32, 32, 11, -8, 25, 28, 2, 37, 59, 49, 1, -27, 45, -2, 51, 0, 10, -20, -77, -5, 6, 35, 24, -8, 17, -52, -5, 18, -31, 5, 35, -18, 17, 10, -31, -34, 14, -33, 6, -22, -26, 36, 13, -13, 5, 51, 9, 17, -30, -3, 26, 25, 13, -8, -2, 2, -3, 18, -29, -4, 61, 19, -37, 5, 21, 32, 13, 13, -8, 26, 3, -12, 27]
7591B7pj4m1M0Ko3L1L5L6k0m0K2n0K1L3ok3QO6k6K2m9j6J8k7k0J4nP6j8Po4Rq
7625c0Rk6M1J1k6K4j7K4j2J1j6J2J0k3mrL3l1K2rK6m0J8K8K1l9m0M7pl4L1Q9j13
7658a9M1m5Q8j07kNJM0pj0J2K9p8R1n7K9K6j5l3KL0n0M2l2N7n1Jmj7K5J4l1J7
7691hL3j0n9J3L1J6Rmm9oK2J9M6j11O0kj0kL5j8j4K3k1O1j7o4M6o5J07q6O8q1
7723c8P0o9J9j1O1n6PM1p2K6o1O4J2M9p5J7J0l9JO0k8Okn0O4L2o0nN2q9M6K0j8
7756a6k3M6o5lL1L7k9k2N0jL9n4K1L9k2l5O8p4QJ0OK7l3j3j4J1J8J1L6n6%J1K
7789A1l7k0O8m4MLl9O6j5n0M8ll5Rj5K1K7j0O7j11K0K7l9O2n1OM1K8Ln8J9L0J8
7822E1m4L4qk7N6j08kP6Jk8J0K3o6MJ1j5Q4o5j8k4O5N2q4L2j1j3K6%j6kl6K9k6
$$ y = [27, 20, 6, -35, 5, 7, -56, -25, 10, 46, 26, -14, 8, -42, -21, 12, 6, -17, -9, 57, 31, 53, 4, -12, 6, -21, -41, -27, -32, 44, 26, 33, -31, -22, -30, -21, -47, -6, 5, -21, 3, -14, 10, -2, 9, -7, 5, 15, -8, -12, -21, 12, -19, 3, -6, 20, -20, -2, 26, 47, 8, -32, 15, 8, -26, 5, 94, -19, 22, -23, 65, -42, -44, -39, -38, 2, -5, -15, -3, 26, -52, 39, -18, 11, 37, 22, -11, -9, 21, -29, 13, -19, 38, -13, -12, -16, -33, -8, 6, -25, -8, 25, 15, -44, -31, 0, 16, 25, 21, -28, -34, -12, 7, 53, -58, 2, 0, -10, -12, 23, 5, -9, 14, -7, 54, 37, -27, 19, -46, 61, -25, 43, -38, 32, -37, -18, -29, 32, -24, -17, 24, -48, -22, -83, -19, -7, 42, -33, -16, -6, -45, -44, 16, -12, -6, -8, -58, 6, 38, -22, -27, 25, -64, -18, 2, -16, -39, 7, -58, -61, -30, 7, -22, -44, 6, 5, 44, -10, 11, 50, 28, -7, 61, -13, -5, 5, 11, 38, 5, -8, -22, -11, 7, 18, 54, -2, -2, 9, 11, -26, -46, 22, -22, -18, -15, -54, 12, -3, -53, -5, -8, -43, -34, -49, -28, -1, -11, 56, -55, -35, -8, -47, 15, -36, -30, 11, 39, 42, -16, 3, 33, 51, 7, 41, 33, 6, 62, -46, -48, 28, 29, 1, 11, 34, -32, -28, -17, -32, 52, -13, -31, -55, 10, 62, -22, 10, -1, -14, 12, 12, -4, -6, -42, -13, -39]
7855c9K9J1K5m0j6N2m2pL5K7k0J2n1N0l7mO7q8K8K2l8LR8m9Om8NJ9QL9n8m7K4
7888b4J9m3KN9K3l0m0K9JJ8qkj9N0m2k0O8o3O6n5O9m5K2J2r7J9Ql1K8K2N3l0l0
7921a1L2p3P3k3n6N6kj2N1k2KJ6o7K0N4J3o7pL2J9L3j8Np4O9m2oj7L1Kl4O8o5
7954b0K6kMk1N6m7J5j0k3qN2nm4L8m3K5l2L2pj3KL1l6mrK4LK7o1P1rl9J03j04
7988b8j1N4m7pN1J2kLPj8k1j1N3n0K3n1O6k1o1M5M5k4Ml9M1K1k9NkJ0m2oK7J1
8022Hl4P3r9M3JJ0PQk5K2k4j2L8l0O2p3nNoO7l2l5K5l1Q4n9M3m0Lk8O7l0k0mN0
8057B9m6L4n1L6lK6k1j6No%p3J05K9l6j3o1Q2Ok7K8rJ0l6M1m0K3m9J5M0m0OJ7
8090Ej3M2o2K4L2k0N8k9l2j6k2P1q1J1J8P4j2m4pj3k8L5O6J3m8LK1j10N4JM3l6
$$ y = [-39, -10, 1, 26, -14, -30, 22, -20, -27, 8, 35, 15, 27, -24, 26, -11, -15, 52, -36, -8, 14, -24, -21, 77, 28, 34, -14, -9, 10, 18, 57, -1, -48, -24, -5, -48, -46, 13, 36, 6, -34, -5, -4, 14, 6, 4, -15, 35, -7, -27, 41, -22, 44, -11, 58, 13, 35, 47, -50, -31, -23, -54, -26, -4, 49, 19, -11, 21, -52, 21, -2, -58, -2, -4, -16, 35, 13, 15, 31, -36, -16, 38, 51, -16, -23, 9, 28, 61, 43, 48, -26, 43, 1, -5, -22, 9, 11, -23, 45, -20, 6, 4, 8, -13, 43, -4, 11, 1, -22, -30, 22, 17, -27, 11, -32, -7, -39, -7, -14, -27, -25, 6, -30, -34, -43, -19, -16, 11, -50, 21, 12, -27, 76, -28, -39, 15, -32, -39, 12, 24, 22, 25, 32, 14, -7, -18, 35, -15, 8, -43, 23, 2, -59, -14, 31, 7, 11, -28, 13, 34, 5, 10, 8, 18, -24, -30, -3, 8, -26, 47, -52, -9, -8, 2, 9, 17, -8, 14, -10, -22, 16, -14, 48, -25, -30, -25, -31, 36, 4, -31, -6, -37, 47, -12, 31, -9, -6, -34, 33, 3, -17, -21, 29, -17, 17, -34, 2, -1, 25, 4, -12, -7, -13, -13, -86, 19, 48, 12, -1, -62, 20, 26, -1, 27, 18, 28, -8, 33, -7, 16, -33, -18, 22, -18, -12, 5, -8, 34, -28, -4, 28, 8, 66, 37, 5, -11, -33, 38, -43, -32, -14, 60, 48, 4, -3, -16, -44, -9, 57, 70, 22, 25, 46, -64, -10, -9, 34, -2]
8122bK0J2n9K5jn3O7m1J5K3l9N7m4L4r1O4j4L6k6KN1lk0K9m6j8K1N9q6J8M5L6
8154G1m8J7k6m9M8J8o4J5J7M0j9pJ8j9Nk6ko1J21l9l6oJ0M8L5n8m3O5J2l1o2O2
8186F%l0N2n2p
$$ y = [-2, 18, 30, -29, -4, -5, -58, 9, -32, -17, 6, -33, 24, -20, 14, -77, -13, -27, 9, -17, -15, 36, 33, 13, 42, -4, -22, -1, 58, -28, -10, 35, 71, 23, 40, 14, -35, 13, 31, -33, -18, -1, 39, 20, 13, 31, 12, 17, -9, -11, -72, 49, 10, -26, -32, -22, 26, 61, 3, -40, 25, 37, 6, -56, 6, 6, -24, 28, -24, -31]
8191c1
$$ Imaginary data points
##PAGE= N=2
##DATA TABLE= (X++(I..I)), XYDATA
0@%%%%%%%%%%%%%%%Qj6J6j6J6k4L2l2M0m8N5o3P2q7R5j04J20j37J60j83K04k28
37a20K56k88L20l57L98m40M88n41N97o58P27q04Q85r73J073j184J306j442J595
56H38j767J965k197K468k790L182l674M309n167O398q322J1783j9990P7558Q1886
71A46480p0555n7538q0284n0956k0705L3657N8143Q4107O5128K2341k6718m7576
83E5524p0558p0053m0943Q732M5236P3608P0503M0084J623k7320o1920p7043n4307
96a06834j0084K5496N5682O7974N3867K5040o948m8096p3268o0008k6927J984
108a02122L4546O1550O2933M2515J0500l2073o1920n9221m0512j9703J4635N1792
120c7080O3777N0933K4646j2321m4179n3498n0096l7928l845L8453N7578N2600
$$ y = [0, 0, 0, 0, 0, 0, 0, 0, 0, 0, 0, 0, 0, 0, 0, 0, 8, -8, 8, -8, 8, -16, 16, -16, 24, -24, 31, -32, 40, -47, 48, -56, 64, -73, 87, -96, 108, -120, 136, -152, 168, -189, 209, -231, 257, -284, 313, -345, 382, -422, 463, -510, 563, -621, 685, -757, 838, -929, 1036, -1161, 1307, -1483, 1699, -1975, 2334, -2833, 3565, -4757, 7026, -12964, 64594, 146480, 75925, 18387, -61897, -112853, -133558, -99901, -41758, 42349, 107477, 129818, 103100, 55524, -15034, -85087, -126030, -117298, -72062, 1546, 72049, 112133, 113756, 86436, 24516, -52527, -106834, -116918, -91422, -35740, 32234, 86101, 111141, 104193, 56097, -17171, -77179, -104106, -102122, -67576, -6026, 56907, 99422, 109922, 77849, 15929, -43292, -83804, -103507, -88872, -37080, 26697, 77630, 102276, 89955, 45776, -7722, -57818, -95746, -99591, -61138, -3560, 49040]
132D9040L6948Q688k4909m6285n4550m8774j8358K2624M4703M8610M5658K6977
144I0372o730l5766n1699n2589k9942M532K7553M1486N1216M0775Q388k3184m3172
157B1240n0515l8687j2956J0695L2709N1313M7598J9911r056k9481m4043m4323
169d5595k7851m268K2159M5947M8418K8613O083j3778l5739m6999l7580j5943
181g6533J0726L5783M4244L4489K0146J020k6268m5033m1272k4336k084K1976
193d7142L7127L8073L1202J3396j6077l8366l9932l0217j4888P427K8644L8610
205G857L7507K2362n121k7607l4737l3719k6274n769J9561L5259L8541K8400O595
218F2855j4692k7269l5226l4475j6108J0167K8001L5069L2102J7810j668j9172
$$ y = [49040, 85988, 94676, 69767, 23482, -31068, -79842, -98200, -75576, -30873, 17737, 63395, 90372, 83642, 47876, -3823, -56412, -86354, -81822, -54269, -12783, 38433, 79208, 87596, 64412, 21240, -29275, -67962, -80918, -70223, -37514, 13799, 61397, 81308, 72252, 42771, -1272, -45595, -73446, -77714, -55555, -9608, 38810, 67423, 73506, 59728, 23989, -23010, -60590, -76533, -65807, -30024, 14220, 48709, 68855, 69875, 43607, -1426, -42698, -67034, -69118, -47142, -10015, 28058, 59260, 72656, 56579, 18213, -21719, -51936, -66824, -59397, -30753, 7857, 45364, 67726, 62605, 34998, 261, -33458, -59732, -65501, -45940, -10681, 27860, 56260, 62855, 48163, 20894, -14332, -48807, -64915, -54748, -26747, 8322, 40424, 58234, 56566, 37394]
230C7394l3782l8000k3222J73J7444K8620L3985K7132R637j0788k9048l6912k7683
243d5050j0078N489K0907L3726L3026J8014k191k0977l1977k9980j9713n939J2852
256d1891L0831L4660K3367O672j0505k4733l0624k7078j5165M778K4930L2125
268G367K6191J5442Q35j6685k9360l0976k1599l021J6119K6336K7281K3124J1059
281E2113q816k5473l0809k5005j1142N638J8921K6696K8426J8653j106j8975k6764
294B357k6356j8749m764J1017K4392L0081K3349O329r886k0451k5963k4761j3774
307d7179L515J9653K8072K5265J3607j9j2814k4098k8174j9979l467J2580K2886
320a0152K5188J9976R382n323k0584k8102k3142j0039L921J5735K3648K4476J6739
$$ y = [37394, 3612, -34388, -57610, -57437, -39993, -11373, 22612, 49744, 59381, 48593, 19545, -17367, -45050, -55128, -49639, -28732, 4994, 38020, 56034, 53843, 32866, 889, -29091, -48804, -54743, -41891, -11060, 23600, 46967, 53639, 43134, 18401, -12223, -39301, -54466, -49688, -24758, 7367, 33558, 49000, 49835, 33150, 3790, -27186, -48785, -51806, -35687, -9351, 17930, 41054, 52113, 43297, 17824, -12985, -37990, -49132, -43494, -24573, 2123, 30549, 49202, 48096, 29121, 2357, -23999, -42748, -47512, -36495, -12103, 17978, 41327, 47656, 37770, 17319, -8644, -33405, -47179, -43664, -24011, 4061, 29326, 42933, 42914, 30100, 6002, -22172, -42151, -45618, -33038, -10152, 15036, 35012, 44394, 39071, 18487, -9615, -32757, -42796, -38875, -23140, 508, 24984, 41723]
333D1723J478j5059k4646k3688j6129n125Q083K0746K6276K1164P565p599j8572
346A6217k2613k1023j3108J044J6322K4820K2700J3115P36j1013k0278k3949j8798
359c5828n136J0385K0324K2072J7826Q960l669j6777k4230k1488j0360K985J3825
372b1111J9987K1222J5442K967j2023k1481k1611j4798m876O447J7025K2583J9622
385B9395Q242n963j6250j9863j8294j2023l75J3135K1456K0796J2709J009r591
398B4383j6970k0394j7373o039Q193J7695J9779J6182Q124k808j3368k0549k0051
411b3196j0475K375J1832J7181J8748J4061L280r084j8334k0087j3958m092N183
424b6566J3798J9676J8043Q094m137j3651j8291j6443j0147j345R768J8917J9355
$$ y = [41723, 43201, 28142, 3496, -20192, -36321, -41446, -33363, -12617, 13659, 34823, 42388, 34789, 16217, -6396, -27419, -40527, -39483, -23161, 1659, 24359, 37474, 38210, 27197, 6919, -17030, -35828, -40964, -30579, -10255, 11817, 29643, 38603, 34934, 18157, -6073, -27561, -37921, -34936, -21111, -1124, 20098, 35540, 38507, 26484, 5003, -16608, -31406, -36282, -29835, -12810, 9773, 29395, 37637, 31674, 15424, -4439, -22733, -34756, -35131, -21996, -540, 20256, 32965, 33974, 24383, 7413, -12981, -30354, -36393, -28200, -10505, 9274, 25456, 33580, 30772, 17404, -3145, -23196, -33671, -31296, -19464, -2283, 16465, 30526, 33806, 24722, 6388, -13699, -27657, -31749, -26566, -12768, 6908, 24951, 33045, 28908, 15257, -3034, -19477, -29624, -30969, -21201, -2284, 17071]
437A7071J1617J567p604j5121j8002j4919o582N314J5853J8440J3986P416j090
450B7946j1401j8029j7405j0573L72J0827J5909J5585J2507M748p321j6280j7627
463a0742j3123m975M842J2297J6057J6071R326k911j2747j5606j4602j0218j284
476b7615Q435J5232J7338J2482J725p429j2435j5325j4454o366M366J2789J6451
489E194J4195O585j632q534j4928j6926j0110K45Q461J3706J5119J0974L886m472
503B1763j3336j7163j2374l964L056J0025J4998J4222Q140n62j0072j5398j3369
516a4034q160k401N926J3927J5598J0892L338n500j2197j3408j1625p305J891
529b3058J1751J5002J2113P126k18q222j2807j3653j0630j907Q203J2493J2193
$$ y = [17071, 28688, 30255, 22651, 7530, -10472, -25391, -31973, -26659, -10806, 7634, 21620, 29036, 27946, 16545, -1484, -18889, -29462, -29090, -18263, -2354, 13231, 25738, 30486, 23165, 6885, -10742, -23865, -28840, -23998, -11701, 4356, 20427, 29753, 26842, 14095, -1511, -16113, -26331, -27615, -19180, -3948, 13390, 25872, 27597, 20168, 7733, -7592, -22046, -28412, -24046, -11257, 5194, 19389, 25974, 24342, 15808, 880, -16046, -26156, -25911, -17450, -3744, 11375, 22349, 26235, 21763, 8427, -8736, -21110, -25074, -22018, -11993, 3005, 17227, 25367, 24805, 14733, -665, -14034, -22194, -24595, -18669, -4742, 10856, 21748, 25086, 19586, 7389, -6019, -17644, -24949, -23058, -11307, 3695, 15808, 22934, 22716, 14494, 1687, -11966, -22596, -24503, -16300, -3807, 8386]
542H386J0557M914m118j1281j3978j2449n388L609Q928J1571J3104Q961n93q501
556A3722j2493j2769q596j292M902J0311J4148J1518K807m779r368j2317j1396
569a5602n753J172Q240J3603J2547N828n91n460j1095j3057q987k067N249J1247
583d726J2310Q380L952j499r250j3545j0730m833J360P939J1294J0467P527J904
597B0550o806j2305j0880p166k763L987R664J1373R861M752l524r535j0139r194
611a2125o684J82P755J1134J0708P033M0o046q808j0261r520k857N301R222J0107
626E181Q770M000k320o906j0540j1003n419K074O511Q792J0197P251R25m952r541
641C020j1118p123j157K903P089J0732R366L539k305p224j0192q513m555n21N058
$$ y = [8386, 18943, 23857, 19739, 8458, -5520, -17969, -23357, -19748, -10820, 751, 13855, 22816, 22223, 13722, 1229, -11540, -20136, -21428, -16526, -6215, 7933, 19451, 22258, 17479, 8111, -4206, -15602, -21355, -20183, -11943, 1660, 14207, 20035, 19444, 13984, 2889, -10168, -19155, -21222, -15973, -4726, 7584, 15964, 19916, 18417, 9167, -4378, -15108, -19941, -18581, -10642, 652, 11119, 18646, 20550, 13744, 1439, -9441, -16607, -19370, -15383, -5719, 5654, 15515, 20267, 16743, 7208, -2931, -12125, -18809, -18627, -10872, 262, 10970, 18003, 18043, 11997, 3189, -7072, -16592, -19449, -14148, -4926, 5181, 13951, 17951, 15631, 8725, -1815, -12818, -18237, -16163, -9652, -860, 9337, 16588, 17513, 12561, 3020, -8098, -15221, -16378, -13475, -6386, 4346, 13712, 17251, 14946, 7722, -2470, -10983, -15538, -16059, -11001]
656a1001J0486J0384N531M50m212q575r456p133l230K838Q989R916O712L586p18
671A4567o548r575q719n485L92O364Q636P801O359K407m475r048q921o718k361
686a5324L188O849Q099Q323M761k161p065q037p573n229j13M716P945R217O587
701A4183L16m503o473q143p486k883K814O669Q834P476K953j414m482p972q957
716i068m898N24M624P539Q048N299J544k519p240r237o291j555K024N558Q092
731B444P135L871o04n676q450o778l767r53L447P680Q057N451J404l403o904o946
747c992n786l533J532O661P921O190L331o76m790o781p028n427m29M860O774O404
763E231N276K096k716o122p503o411k366K496N040O223O733M280p46m863o739
$$ y = [-11001, -515, 9869, 15400, 15850, 11638, 3063, -6393, -13526, -16756, -13918, -4929, 4987, 11699, 15285, 14567, 8019, -1556, -10275, -15760, -15368, -9004, -368, 7433, 13792, 16199, 11724, 2676, -6245, -12963, -15324, -12136, -5287, 2812, 11135, 15896, 13735, 6670, -1367, -8940, -14169, -14282, -9566, -1621, 7596, 14183, 14499, 9996, 3523, -4620, -12106, -14989, -12175, -5506, 3328, 10804, 13757, 12343, 7861, -111, -9068, -13966, -13442, -8818, -1279, 6769, 12068, 13612, 11093, 3853, -5384, -11675, -13230, -11206, -5648, 2444, 9579, 13450, 12846, 7170, -1280, -8058, -11825, -12778, -9331, -1651, 6406, 11857, 13261, 9858, 2954, -3992, -9778, -13311, -11779, -5118, 2803, 8993, 12324, 11648, 6858, 77, -6951, -12378, -12807, -7947, -1173, 5231, 10507, 12603, 9887, 3765, -3738, -10149, -12515, -10019, -4979, 1244, 7977, 12257, 11511, 6648, -91]
778i1o862m061j36K959N626P553N761J081l056n285o559n717k562R84M746P356
794A737O403K753p43l411o009o740m522p35L323O293O490M123J675j359n187p166
810c075n481k308J413M584O055N361L713M05m011o582n875l551q16K599N262O088
826C781N114J920k431n316n539m699k927O40M358O083N699L258o25l462m889n605
842d640m518j069L020N345N629M176J601j532m088n867n596k298J487L863M957
857D70N142L378K60l052n507n699l438l28K081M111N608M733J670j812m343n378
873b104m262k235K66L219N602N274K812j81k893m556m914l685j394K209M822N298
889C278L544J517j127l531n156m740k519Q93L604M660M212L030O74k566m852n021
$$ y = [-91, -6953, -11014, -11150, -8191, -2565, 4988, 10749, 11830, 8774, 3489, -3070, -8787, -11349, -10365, -5619, 1737, 8140, 10893, 10150, 6739, 730, -6010, -10532, -11267, -7944, -1651, 4839, 8962, 10637, 9278, 4091, -3075, -8556, -10864, -9451, -4867, 1188, 6549, 10262, 10667, 6656, 74, -5801, -9352, -10168, -7569, -2307, 3781, 8895, 10815, 8384, 3068, -2471, -7170, -10097, -9457, -5099, 984, 6683, 9941, 9316, 5854, 965, -4640, -9158, -10227, -7207, -1862, 3767, 7943, 9544, 8012, 3924, -1943, -7539, -9837, -8350, -4487, 470, 5612, 8990, 9250, 6198, 691, -5008, -8446, -8774, -6693, -2582, 3026, 7759, 9429, 7617, 3274, -2104, -6366, -8601, -8335, -5116, 486, 5760, 8572, 8391, 5498, 942, -3972, -7657, -9051, -6842, -2020, 3278, 6822, 8339, 7212, 3681, -1475, -6215, -8734, -7841, -4237, 423, 4635, 7665, 8339, 5773, 921, -4100]
905d100l295o36J983L644M705M185J991j404l975m695l930k108K65K697M586M891
921D804K875n4k684l889m249l448j352J773M098M733L499J298r85k950m370m321
937e222k433N81L056M222L862K622O01j978m061m702l110o19J693L213M113L692
953E530J900r13l423m339l577j840J19K244L933M362K817J62k366l542l810l019
969e762j243J334L348M466L272J204q98k518l752l843k290J84K702L808L564K198
985E774O20j502l433m248k922p85J424K888L709L074J883m93k849m072l314j635
1001e881O5J858L360L812K642L90j892l293l339k600j243Q48L024L822L100J336
1017F009q28k265l110l332k341m1K321L408L166K147N73j357k804l611k956q63
$$ y = [-4100, -7395, -8031, -6048, -2404, 2301, 6486, 8477, 7073, 3098, -1597, -5527, -7635, -7370, -4673, -87, 4804, 7679, 7625, 4941, 1052, -3197, -6645, -7997, -6224, -2126, 2607, 6106, 7404, 6419, 3469, -901, -5222, -7655, -7074, -4018, 204, 4066, 6688, 7289, 5311, 1250, -3452, -6562, -7181, -5488, -2275, 1838, 5530, 7430, 6517, 3094, -1245, -4822, -6662, -6543, -4299, -366, 3996, 6813, 6975, 4609, 1067, -2743, -5762, -7005, -5671, -2323, 2143, 5415, 6619, 5721, 3203, -549, -4392, -6682, -6498, -3796, 12, 3576, 5774, 6394, 4892, 1459, -2789, -5711, -6496, -5072, -2184, 1525, 4599, 6482, 5989, 3140, -932, -4246, -5881, -5816, -3958, -598, 3214, 5856, 6246, 4354, 1061, -2278, -4878, -6121, -5273, -2249, 1573, 4673, 6009, 5181, 2916, -194, -3526, -5867, -5908, -3587, -179, 2987, 5134, 5707, 4350, 1546, -2065, -5021, -5884]
1033e884J309K585L082K917J652l83k342l415l288j484J66J532K737L450K514
1048E148L74j498k832l204k295q71N16K318L555K964J042n83j892k886k942j883
1064d969k78J709L158L098J725M73q96k525l243k510j013R92K439K828K355J462
1080D805j5j964l202k677j519r7J493K510K729K273P77j390k666k683k021j047
1096d694N37K129K784K706J399o60j873k295k514j926k77J542K582K712J944L26
1112D422r53j926k796k570q96R82J911K568K312J167r6j457k613k839j397R6J151
1129b934K176K572J983O08r03k328k702j784p28K74J672K772K411J140l00j651
1145B278k356k184j417n21J111K547K545J559M94q65k011k217k153j084N56K163
$$ y = [-5884, -4575, -1990, 1092, 4009, 5661, 5278, 2936, -479, -3767, -5251, -5085, -3553, -816, 2634, 5148, 5522, 4024, 1192, -2012, -4307, -5178, -4662, -2344, 1211, 4175, 5217, 4634, 2742, -144, -3086, -4969, -5247, -3538, -380, 2718, 4443, 4916, 4020, 1495, -1748, -4258, -5271, -4279, -1840, 988, 3343, 4805, 4790, 2826, -376, -3053, -4572, -4669, -3176, -666, 2063, 4336, 5113, 3723, 1057, -1626, -3647, -4694, -4157, -2028, 756, 3462, 4861, 4201, 2328, 33, -2481, -4407, -4684, -3142, -560, 2152, 4096, 4422, 3469, 1543, -1253, -3823, -4719, -3737, -1826, 742, 3054, 4221, 4125, 2668, 55, -2784, -4181, -4085, -2934, -758, 1814, 3797, 4405, 3502, 1174, -1528, -3312, -4040, -3766, -2094, 678, 3089, 4229, 3929, 2278, -78, -2262, -3679, -4200, -3089, -542, 2003, 3562, 4056, 3191, 1180, -1037, -3190, -4274, -3718, -1555]
1161a555K256J843J259L1j476k274k304j578r2J392J911J981J931Q24j008j978
1177A163k332j901p43O62J353K072K358J344m36j564j848k075j476k28R70J886
1193g95K477J691K39q02j487k157k021r32M98J474K381J936Q12j3r76k114k317
1210b106j195j36R49J839K034J471O49m64j827k371j499o64K41J380K060J780
1226B141J209P6j352k089j691j153n33P93J961J977J461O47q11j531j725j702
1242b322j184L76J609J968J611J005j5j074j628k015j517k6J101J488J668J532
1258B577O43n08j470j964j727n87M28R96J656J869J188j29j051j718j785j078
1274b660j87N12J430K090J423K92n13j232j769j470p64OJ201J985J599P29L9p79
$$ y = [-1555, 701, 2544, 3803, 3834, 2358, 84, -2220, -3798, -3890, -2498, -587, 1394, 3325, 4149, 3141, 1163, -1169, -3070, -3813, -3151, -1798, 274, 2632, 3976, 3540, 1976, 128, -1947, -3423, -3651, -2681, -795, 1682, 3373, 3612, 2810, 1323, -834, -2855, -3787, -3289, -1815, 566, 2502, 3314, 3301, 2325, 211, -2106, -3301, -3437, -2488, -649, 1385, 2856, 3505, 3041, 1214, -1157, -2656, -3320, -3079, -1699, 361, 2141, 3350, 3426, 2074, -15, -1706, -2859, -3392, -2599, -638, 1339, 2800, 3447, 2636, 1105, -620, -2322, -3506, -3130, -1521, 447, 2058, 3063, 3048, 1974, 346, -1669, -3186, -3212, -2111, -623, 1045, 2577, 3220, 2712, 1242, -722, -2449, -3036, -2608, -1612, 44, 1913, 3101, 2972, 1921, 203, -1582, -2660, -2847, -2335, -905, 1185, 2608, 2900, 2387, 1155, -614, -2084, -2848, -2842, -1641, 344, 1943, 2672, 2711, 1932]
1292A932j571j776j142l18P26J606J552J130O47k77j326j864j351p02K62J057
1308a415J521J417J090K34j102j629j467r45l25O21J305J499J443N81o78j189
1324I61j262j397r24J08J105J473J590Q80k13p34j170j532j266k83P36J298J351
1341G21J265M42k70j042j581j512m50K90P75J354J437R12Q4p29j449j477q81j37
1359b248K87J171J540J256M19l44j166j322j106p08o5Q40J544J348O77M7o54j116
1377D00j414r91m71O54J323J265Q91N87k37r67j349j290p04J76J002J120J161
1394A156Q82K30o92j271j326r52j61M96Q83J301J228N01l82r76j247j104o17M6
1412b005P19J237J320P34k4o17r22j278r80l05L90J105J270R46M06j80p56j275
$$ y = [1932, 361, -1415, -2557, -2875, -2149, -543, 1009, 2139, 2786, 2509, 1183, -681, -2032, -2734, -2472, -1415, 106, 1523, 2613, 2847, 1745, 116, -1351, -2296, -2621, -2000, -695, 804, 2247, 2828, 2150, 961, -301, -1698, -2622, -2514, -1409, 64, 1654, 2534, 2321, 1587, 417, -1115, -2381, -2664, -1928, -630, 721, 1986, 2428, 2158, 1116, -465, -1977, -2427, -2137, -1362, -8, 1429, 2341, 2425, 1696, 247, -1230, -2111, -2248, -1961, -790, 750, 2006, 2425, 2081, 915, -407, -1513, -2221, -2286, -1446, 98, 1446, 2123, 2170, 1516, 400, -1014, -2005, -2476, -1822, -499, 766, 1657, 2244, 2007, 1040, -309, -1599, -2303, -2127, -1125, -5, 1156, 2038, 2268, 1576, 305, -1021, -1973, -2134, -1638, -755, 546, 1774, 2275, 1893, 917, -330, -1434, -2051, -2005, -1286, -49, 1271, 2005, 1981, 1364, 442, -836, -1816, -2121, -1731, -626, 644, 1590, 1996, 1816, 1060, -215]
1430b15j179o36J74P68J059J077Q13J77n04j139j331p87k43M35Q78J111J037N52
1448B047j61r75j207r32n69p5O40J142J195P38O0o15r67j010q61m54L73J058J092
1467E19R47L20k03o50j044j125o52P6P43R91R75P63J66m31r04j283q27j83M08
1486a394P51R69R88N60k10p95j066r77m87j9N14J015J084P33M9m78q50r88q09
1505a410l44K49Q43J217P37L83j67o21r55j004o55RO62R66R25O72J56l89q54j083
1525f63p84k43L43P98Q49Q93N11o4q22r86q50n26l2M44R87Q79P59J71n11q57q15
1546e19p20l91J76Q26R66Q30L56j52n85q26q76o14r1N90R71Q24O09J31k77p41
1566D87j047p84k75L94O59Q42P81N27j13n94r84q22m58j4M80O67R21O91J74l95
$$ y = [-215, -1394, -2030, -1856, -1088, -29, 1048, 1861, 2038, 1534, 395, -936, -1723, -1966, -1531, -653, 458, 1495, 2047, 1886, 911, -296, -1228, -1797, -1872, -1232, -90, 1105, 1843, 1903, 1288, 321, -689, -1550, -2004, -1631, -573, 519, 1466, 1786, 1583, 933, -111, -1236, -1888, -1812, -1069, -78, 897, 1660, 1826, 1395, 491, -792, -1619, -1802, -1394, -643, 326, 1314, 1874, 1664, 869, -197, -1174, -1661, -1680, -1166, -151, 933, 1666, 1715, 1237, 387, -601, -1410, -1754, -1505, -662, 555, 1292, 1675, 1508, 887, -68, -1072, -1727, -1718, -1056, -90, 835, 1507, 1663, 1274, 420, -663, -1447, -1690, -1347, -549, 300, 1193, 1704, 1640, 818, -168, -1018, -1544, -1576, -1132, -145, 734, 1493, 1664, 1153, 296, -519, -1239, -1630, -1454, -628, 338, 1168, 1524, 1372, 787, -39, -915, -1529, -1620, -1030, -59, 765, 1374, 1505, 1228, 487, -560, -1344, -1619, -1225, -566, 276, 1057, 1584, 1471, 877, -107, -929, -1387, -1401, -921, -254, 667, 1358, 1532, 1137]
1586A137q39q52n99l40J93O23R46Q91L25k38m92p08q31o20j04N18Q45Q21N42J53
1606A371k21o43r16q10k32K72N86Q29O97L85L2m72r05q50m10K4L12O35R25N69
1626A178K31l14p26q13n37l06N1N73Q53Q74L08j59m48p68p09n32j53M62P80P75
1646F20M70J92k16o48p18p21m55L20O54O70O23N03o0m68p33p82n03N8L55O23O46
1667D30O13L20l47o04p67o01k69J71L70P73Q14L72j05m73n70p67m34j16K36O91
1687b63P78N46R2k39m28p54o67k71J68N28O60N71L25N8k78p54p94l21j37L10N87
1708b83O60N72K16j28o26p68m43l20M6M85O64N69M87pm53o12n84m47j69K58O87
1729a96O54M59J65k16m61n59o32l80J58N03O42M92L22M4k80n80o92n04L6L41L83
$$ y = [1137, 298, -554, -1153, -1493, -1300, -677, 269, 1160, 1485, 1247, 755, 47, -784, -1404, -1508, -990, -145, 676, 1218, 1371, 1150, 507, -409, -1219, -1451, -1179, -593, 236, 933, 1318, 1350, 878, -27, -877, -1287, -1263, -951, -316, 609, 1178, 1409, 1095, 369, -444, -981, -1287, -1236, -663, 190, 1064, 1372, 1213, 765, -3, -712, -1244, -1397, -935, -155, 620, 1090, 1282, 1066, 418, -300, -1021, -1476, -1156, -502, 168, 791, 1294, 1234, 766, 33, -749, -1252, -1194, -839, -216, 430, 1043, 1363, 1016, 412, -355, -956, -1225, -1054, -684, 89, 903, 1275, 1170, 697, 127, -640, -1074, -1190, -954, -263, 515, 1061, 1153, 914, 486, -268, -935, -1206, -1038, -510, 150, 721, 1046, 1104, 826, 72, -722, -1043, -1180, -870, -283, 377, 949, 1165, 1037, 411, -357, -800, -1120, -1074, -589, 75, 644, 1131, 1124, 671, 59, -525, -972, -1141, -883, -196, 458, 917, 1082, 866, 405, -154, -786, -1166, -1008, -505, 137, 629, 951, 995, 715, 135, -557, -1061, -1025, -684, -301]
1750c01O28N38K02j58m88o62o20j08RL52O16O26L72j7l50n26o31l82r2J08O09
1771b75O66M65J46j63m07n89m87l40M3L34O62N41K68Q1k49n08o12m60j24K38N44
1792b26M99L91L77j80m79n60m77k42L6L65L68N95M55P5l99n35m80l32j10J62L67
1813c30N67O22P4k22l50m02n21l86P9L04N69N65K31K0k67l56n30m95j05K09M47
1834b77N44M02J90m9l78n96m58k46M0K48M92N66K66J68k49n44n66k18j33M6L75
1855c77O30L50K26p0l94m32l85k91r3L07N47M69K34P8j60m30n15l99k15K20M76
1876b24M21L48K64j03k56m74m91k95N7K74L43M32M20J51l03l88m41l73j03J08
1896f33K83M82M46K40j32k57m73m36k06n6K04M35N18K92M7k12k80n16l69j69J46
$$ y = [-301, 327, 865, 1067, 909, 421, -241, -861, -969, -960, -608, 8, 634, 1006, 989, 639, 113, -518, -900, -992, -884, -275, 391, 856, 1002, 839, 432, -157, -644, -984, -941, -607, 55, 596, 864, 945, 696, 188, -424, -884, -1008, -770, -226, 273, 664, 1041, 861, 382, -178, -655, -897, -861, -496, -128, 467, 922, 997, 598, 63, -417, -749, -859, -697, -330, 237, 859, 933, 711, 361, -41, -562, -948, -869, -565, 4, 569, 800, 820, 553, 197, -333, -828, -933, -724, -277, 267, 669, 859, 810, 432, -164, -622, -868, -828, -580, -88, 478, 744, 912, 663, 119, -447, -665, -798, -752, -377, 253, 603, 829, 759, 365, -67, -452, -743, -836, -529, 18, 487, 721, 799, 639, 209, -306, -705, -920, -700, -224, 197, 545, 809, 706, 450, -24, -515, -810, -753, -479, -136, 296, 716, 867, 564, 176, -265, -638, -741, -633, -350, 132, 578, 818, 686, 429, -44, -480, -686, -742, -538, -103, 415, 707, 754, 542, 262, -254, -623, -792, -646]
1917f46L27N01K79K21Jk33m27m90k49M1J77M10M28K59J66j64m09m64k76j55O6
1938f37L14M16L82K66l7l42m44k03l40j26K67M00L94L36O9k43k52l49l82j74N0
1959f35L74M18K91K04k3k74l30l41l68K2K41K95L36M14R7j34l05m90k96j12Q6
1980e30J44L75M55J61L9k80l54l71j78o4J06L65L32L62R3j18k46m60l36j33O9
2001e69K06M48L32J49m5j10l14l92k80j40K60K83L71K36J65n3k37m79l11j33P0
2022e43J78L19L71K91j1k43k67l42k66n9J04K35L94L65J01r6l50k71k57k56P9
2043e24J99L54K89K21j1j17l13l80k80o0J74K96L13K58J01Ok06m42k71j27O6J51
2065c03K55L08K59Q3k49k43l36k41p6J63J97K93K98J17o7k47j87l57j99k4K56
$$ y = [-646, -319, 182, 461, 682, 683, 450, 23, -467, -716, -675, -498, -88, 340, 599, 765, 601, 192, -272, -548, -703, -637, -323, 93, 475, 741, 704, 362, -82, -285, -625, -751, -484, -84, 310, 646, 715, 472, 220, -129, -511, -685, -635, -261, 157, 448, 652, 629, 355, 25, -316, -684, -662, -421, -126, 210, 624, 721, 587, 282, -208, -504, -616, -530, -386, -11, 444, 605, 644, 364, 10, -361, -539, -603, -497, -132, 200, 562, 655, 537, 291, -169, -505, -638, -569, -363, 85, 417, 566, 521, 411, 97, -295, -575, -715, -455, -172, 199, 435, 600, 547, 310, -169, -480, -613, -543, -365, -46, 325, 616, 605, 362, 95, -247, -513, -572, -468, -233, 161, 526, 627, 531, 181, -90, -347, -603, -524, -325, 29, 318, 539, 528, 411, 98, -282, -562, -622, -448, -152, 161, 419, 520, 526, 320, -122, -393, -520, -454, -303, -48, 260, 519, 602, 353, 110, -226, -467, -543, -380, -183, 110, 408, 525, 458, 211, 24, -333, -532, -556, -300]
2086c00K44L46K14J6j82j94l52k52r4N5K45L75K35J07M6k64k93k70k11O4J52K60
2108e3K30K82N4r3l12l14j37j43P6J91L47K09J44o0j46l21k84p5j00J72L03K89
2130B59J88J4j45j67l08k23j85R5K59K76K77J36o8j12k81l08j56m2J55K52K10
2151A26K77M0q8k29k48k83J9O3R5K48K97J34Rj47l45k21j29j7J00K29L05J48L3
2174D16p1k25j73l11o4L7K24K23K24L9R8j62k67j85k05l4J35K50J79K30O1m2k40
2197A37k52k01o7OJ52K30K21J95j6j81k30k27j21m5N1K33K71J86K1p8j44k12j98
2220b69j01MJ92J91K78P1l2j08j88j74j87m2J05J32K68J28J21o8j95j53k54q1
2242c62K1J12K32K36R3R2j75j88k09j56l3N3K12J47K54O9j07k02j45j72j44L6
$$ y = [-300, -56, 290, 504, 520, 338, 144, -208, -460, -554, -499, -254, 121, 356, 463, 509, 245, -48, -318, -529, -465, -313, -53, 177, 459, 513, 420, 108, -206, -343, -486, -410, -219, 128, 337, 481, 421, 275, -46, -330, -405, -505, -333, -30, 259, 447, 461, 316, 149, -159, -382, -567, -472, -213, 63, 340, 476, 408, 296, 15, -293, -449, -491, -336, -84, 126, 403, 443, 355, 126, -122, -405, -386, -323, -228, 20, 317, 451, 460, 313, -32, -253, -382, -399, -299, -70, 235, 383, 416, 345, 120, -53, -364, -428, -391, -167, 56, 280, 319, 417, 255, -12, -197, -402, -436, -301, -51, 128, 358, 419, 377, 137, -115, -316, -383, -377, -225, 5, 226, 421, 405, 224, -6, -233, -354, -399, -348, -115, 156, 342, 363, 285, 141, -71, -269, -370, -366, -174, 17, 295, 366, 334, 226, 38, -136, -323, -365, -260, -128, 140, 268, 389, 321, 126, -27, -281, -362, -341, -229, 3, 239, 332, 424, 249, 61, -148, -304, -337, -284, -72, 75, 329, 398, 291, 89, -56, -228, -372, -336]
2264c36J12K90J52K4J07j14k22j60j63p1J56J79J13K11K0qj06k75j24r5N7J23
2286a30J42J59J92nj34j97j93q4n4M4R5K03K24J31j05j73j81j11j44lJ50J63J88
2309A77J10pl6j75j73k04p0R9K19J49R7Q3Jr6j95j50j61N9P8J59J94O7M9j06j27
2334D1j43j20q8O9J04K29P9J23K0j80j82o9j90L1P6J37J74J41L8j38o3j57j32
2357b00m3k4J81J41J04Q8j01k5j51j39j41J04N4J22J17J56M1j02j29j46j07l3
2379b33R9O4Q1K24O6n7j15j42j40j12O7jJ41J41J55qMj67j66r2n3M2J05J56R7
2404A56K3M9j17o8j57r1q0J69J41J23K8M8j0j68l2k25qM2M6J60Q8J08K4j53r1
2429Ej22j11L8M5L8J93J06k2k1r6r6j35o2J2J31J32J19K4j4q1n1q2j16jL3J20
$$ y = [-336, -224, 66, 218, 242, 349, 235, 13, -147, -310, -381, -225, -46, 67, 278, 298, 290, 184, -91, -215, -310, -253, -130, 12, 171, 363, 358, 224, 27, -166, -250, -304, -260, -165, 38, 262, 393, 288, 115, -66, -177, -321, -324, -174, -11, 177, 287, 280, 244, 69, -104, -308, -378, -279, -60, 89, 186, 269, 270, 174, -21, -171, -332, -273, -195, -36, 158, 225, 274, 168, 41, -102, -222, -310, -241, -137, 92, 171, 294, 314, 134, -48, -117, -307, -276, -200, -63, 111, 252, 290, 152, 89, -68, -200, -243, -267, -86, 55, 159, 247, 146, 121, -30, -169, -310, -206, -152, -30, 87, 243, 284, 182, 53, -93, -200, -233, -134, -70, 11, 235, 301, 244, 129, -13, -153, -265, -198, -199, -58, 83, 238, 230, 234, 67, -99, -191, -244, -202, -97, 59, 156, 179, 228, 111, 43, -114, -205, -285, -116, 25, 148, 176, 224, 214, 46, 14, -211, -219, -177, -131, 29, 117, 225, 249, 96, 5, -117, -228, -190, -145, -107, 86, 192, 170, 149, 53, -43, -178, -240, -228, -97, 35, 154, 178, 164, 83, 32, -50, -166, -167, -134, -14]
2455a4P3J51n7m9oj75j11l1P2J02N6J02Q7l3%j68q9o4ljJ04J37K5P8rj08j01k1
2483e3j35nJ14J54K9L2J1o7n7j18o7lM9P5J15P4MPj48j2r8p2O2j7J01P6R3Q5j41
2512H8k0j28j17JM5N9R0J38Lo2p1l2r7m0K2J9P9Q3P2j2l2k4r3j10%L6P1J12K7
2541A07OM1l2j62j10K1K3J5J29R2J1Nq5l0o7j02L7j0M5P8P4N8l9p0q4qp4k1P2
2570h0N2J17J0j3J5j18l5p9nK5R2M6M3L6M4j25m3j01PJ1J23r8J42Q0k6q4l7q5
2598h6m5N0k9R9N8NQ0Jj04j7j31%PK9N3J46m8Omk4q0n1K0n8P2N7R3J6k3p8l7%
2630b3p6l9M1J32Q5n5P5o7l9o9m7M6l5M5K2J19j9k0l6j04J9m4l4K8J22k2P8l9
2658D4Ll7p2mm1P0mO2O8Ql5l4k4J3n2ok0N9P7j2O1r6k9l1pm0L6M5k3O3L5nl2r8
$$ y = [-14, 59, 210, 153, 104, 98, -77, -188, -219, -147, -45, 11, 113, 200, 167, 167, -1, -90, -154, -157, -158, -54, 83, 108, 186, 177, 69, -32, -53, -188, -193, -79, 75, 104, 136, 147, 80, 23, -95, -162, -165, -116, -41, 74, 148, 152, 159, 11, -1, -99, -171, -109, -126, -25, 51, 144, 229, 88, 68, -60, -177, -176, -131, -72, 18, 156, 159, 97, 26, -6, -103, -143, -121, -102, -23, 60, 132, 120, 88, 64, -29, -139, -139, -103, -32, 80, 107, 113, 154, 122, -40, -150, -129, -106, -91, 38, 130, 141, 146, 61, 31, -36, -138, -101, -111, -66, 12, 86, 144, 105, 35, -49, -57, -131, -152, -80, -28, 89, 99, 86, 101, -17, -52, -131, -136, -111, -19, 27, 70, 106, 150, 25, -18, -119, -112, -101, 22, -76, 66, 146, 120, 36, -1, -86, -131, -81, -110, -11, 47, 52, 132, 133, 29, 12, -119, -119, -112, -83, -30, 116, 68, 74, 70, 46, -34, -85, -65, -123, -51, 6, 99, 115, 92, 14, -23, -23, -99, -138, -97, 35, 120, 65, 140, 73, 34, -35, -82, -36, -71, -26, -4, 115, 96, 76, 40, -64, -45, -89, -123, -95, 27, 5, 83, 44, 47, 10, -62, -66, -107, -37, -41, 21, 89, 97, 62, 28, 4, 17, -35, -41, -61, -2, 75, 63, 124, 28, -1, -32, -39, -79, -43, 2, -21, 42, 77, 72, 40, -58]
2692e8L2on9N8l9J17L4l8L8r2l2M3j12%M5J34j2J0kj2m1o2L0pK1M3j3M0K3k1j7
2723D5o5o2L2k4J04m8N6J6J6m2j7p8j8L9J9jP8n8oP9om1n1J2l6J7R3J3l4k5M9
2754E6p2K3k0j7LP1J3k3O1p9L1m6r5O8l3OL9M2oM8k3j5q2l6J4L4JO7m8Q4J1p9
2786bJ9p1l1P2l5J5J28k5l4qk6Op7O2K9Kj1k7N7l7L3n0l7RK6oRMJ0%n4qO6m1K8
2821er1N9K1K4J2J6jo1K4k8l1N9o0P7L2j4JJ7q8j5M4J4k0M5M7J1r5j6JJK0K0k6
2854fKK4j1L6j5q9J1Lk1M1O0l8KKrm2N0o5L3QJ7rM2M3k6qm4J1n6N1LJ9M1jk7l8
2890fL8p9L7plL7PM1op5J1l9O7q6M4Mk0N3l1M3m2j5J9m6N7n6K1QJ4k5L0nJ6Jn9
2925e2RL2P2L2j15K6j1J7p5N4k5K3k0PK5l7J6K8oj3JJ2NK6l8oJ2kKK3l7j7M9Q
$$ y = [-58, -26, -32, -91, -33, -72, 45, 79, 41, 79, -13, -45, -2, -114, -114, -69, 65, 53, 63, 61, 49, 8, -54, -24, -31, -10, 33, 20, 60, 83, 62, 45, -20, -82, -50, -74, 30, -18, 38, 54, 70, 28, 11, -67, -85, -46, -27, -28, 50, -8, -14, 65, 59, 18, -33, -21, -57, -40, 53, 66, 32, 7, 56, -16, 7, -13, -30, -27, 44, 57, 34, 95, 16, 47, 1, -94, -26, -59, -53, -14, 28, 22, 70, 47, 32, -50, -86, -72, -38, -37, 30, -18, 66, 77, -2, 17, -54, -85, -13, -48, -33, 95, 70, 36, 28, 2, 8, -69, -7, 22, 24, 13, -14, 43, 6, 39, -11, -48, -39, -13, -19, -10, -6, 4, 4, -50, -58, 8, -33, -5, -96, -37, -16, 8, 20, 36, 35, -26, -2, -30, -61, -2, -62, 15, 47, 33, 34, 51, -37, -52, -8, 6, -14, 31, 78, 89, -6, -22, -21, -20, 0, 20, -6, -4, 20, 9, 45, 30, -59, -48, -45, -66, -25, 35, -3, -1, 1, -8, -50, 0, -65, -32, -24, -7, -16, 26, 69, 43, 35, -9, 2, -54, -3, 0, 19, 60, 59, 32, -6, 32, -47, -10, -17, -20, 17, 24, 65, 59, -16, -5, -44, 23, -63, -19, -15, -35, 18, -13, 30, -12, -27, -8, -54, 3, -53, -32, -24, -10, -35, -5, -10, 6, 7, -52, -43, -11, 61, 93, -22, 4, -7, 10, -65, -11, -36, -13, -33, -26, -1, -38, -22, 6, 0, -13, -12, 0, 5, 31, -7, -13, -1, -3, -1, 22, -15, -32, 17, 25]
2959B5l5J0K2oKl3m5Q2qj9KM6P0r0n9K0j5pM0l5L5J6J2j7q6P2M3r2M9L4m7L3k0
2992alM1n7k7klR2n3N6n7N2j9n8k1O3p9K3R3kOMq5N1ql4L7l1OJ2P4%n0qKk8qn2
3029g4J02Pl7J6L1n8N7n2n3l6M6L5QJ6N4prq5M5J4n6Q8k3J0K9l6j1n0m3KK5L5
3061a0OL9ll4l5K5j7Jk1J3l1M9L5J1J2p2j0j7M8L9o9J5L8J8K0Rp8L0k3l2mQO5
3094B5j1L9p4mL7j2n2J6M3lJ7m4Q5l9l3k0k7j1J0Q5m3j1J00p5L1p2J6m5JJ9Q1
3125B9J4NloLl5j1no9J45n8N2j5M7l2o6j2k9l0P5qL2N4n2k0j7L3k9m8k7M6Q0l0
3158A3J5J6l8n9m0j8P6J3J4l6Q1m4J9Mq4M3j2L1L7j4L7J8l1N6j43pl4P9Pk5L3
3189GR3l0n3K4q6M8l7j5K4L6N7kK5o4m4m1M9n3mQ2L0qK3n2j8m6O7n0J9rN7L0n4
$$ y = [25, -10, 0, 22, 16, 18, -15, -60, 22, 14, -5, -3, 43, 113, 23, -36, -16, -31, -38, 2, -33, 2, 18, 30, 13, -73, -1, 42, -50, -1, 33, -14, 19, -1, -4, 37, -20, -47, -49, -52, 40, -13, 43, -14, 38, 19, -39, -60, 3, -76, -53, 40, 38, 44, 48, -37, 14, 6, -28, 9, -22, -16, -4, 70, 70, 20, 12, 14, -14, -22, -74, 28, 35, -2, 14, 45, -13, 44, -8, -61, -97, -51, -16, -8, 8, 62, 55, 46, -39, 6, 20, -36, 52, 29, 39, 68, 32, 21, -29, -72, -70, -45, -10, -4, 35, 32, -2, -37, -12, -29, -28, -49, -36, -67, -18, 17, 28, 40, -32, -42, -59, -11, 28, -41, -26, 12, 30, 50, 59, -19, 11, -12, -44, -48, -40, 25, 14, 53, -21, -25, 12, 0, -52, -36, 7, 4, 21, -23, 62, 23, -10, -30, -57, -68, -58, 27, -16, -27, 73, -2, 29, -43, -27, -72, -71, -52, 29, 43, 48, 45, 39, 42, 7, -4, -9, -78, 67, 9, 61, 46, 93, 61, -5, -17, -46, -76, -1, -9, 23, 77, 25, 5, -12, 21, -8, -56, -83, -37, 43, 13, 28, 44, 6, -53, -93, -111, -35, -22, -8, -44, 37, -7, 12, 16, -68, -25, -37, -6, 31, 17, 54, 72, 41, 97, -46, -53, -87, -8, -1, -26, 7, 100, 70, 17, 41, -45, 3, -34, -49, -25, 11, 68, 66, 91, 27, -17, -58, -9, -62, -66, 16, 46, 38, 61, 9, -9, -55, 12, -38, -19, -28, 29, 59, 5]
3222EL9Qo2rl1L9n1K5L9K0L2o8O0kq3J8k6OpJ07k0PJ4p8k1M8k3j4k2K3N4L8J3
3255G8l8j7qo4K2L8k8O5l8N8q2L4q9L7k6K7K9J7LP0l2o0lj6M4m3Rj8N8J3pj2l
3288A8k5q0l2J10mM5MjJ1o4m9O3m2QmlJ11m8K5ljm5%l8K8m2O2Q0r1L9j9M3j15
3321e9M1k0MM3j1O1j7Rq9J8pp8P5pj2J09j4K5p8J4p4L7l4J6O6L3NL4o1o1j3K0
3353b5k9N0jL6mNM2J4j37O7k3r3P3K6P4n6J07r6j6Kj16L9J0L0J9L1Mm5J6k0K4
3384Hq5j4J04NN2l1l9M8q3Kl8N1m1P5M1l7M0k8M4r0m8%K2Lj1K4M1K5qm6k9K2o1
3417h2OL2K8J5P4k4L5j10L0k6m5N0PO0L0m9j1pNm0l4K6j4O5L9n5j1O1q6lk9O9
3449FkK1J6ln9k2K4L4p0lrRL4L7M2m1l2lk1%M0l5k1Q2M3L6q4l1n3J0J9k7l6J26
$$ y = [5, 44, 52, -10, -19, -50, -11, -62, -37, 2, 22, 54, -14, 46, 44, -39, -21, -47, -41, -48, 59, 39, 46, 60, -18, -39, 9, -14, -28, -50, -27, 27, 65, 78, 40, 23, 15, -49, -27, 11, -17, 48, 10, 68, -14, 20, -69, -32, -58, -31, -2, 15, 18, 88, 56, -4, -7, -23, 21, -22, -13, -31, 27, 40, 33, 21, 18, -7, -87, -119, -9, -13, 32, 36, 35, 46, -18, -67, -4, -46, -38, -42, -45, 66, 18, 43, 40, 39, -6, -6, -44, -16, -58, 4, 84, -7, 32, 13, 56, -59, -18, -38, -34, 9, -2, 59, 42, 51, -38, -20, -27, -105, -30, -37, -49, 60, 46, 71, -7, 7, -67, -30, -64, -48, 18, 51, 56, 90, 29, -32, -45, -25, -54, -4, -5, 31, 27, 32, 74, 88, -49, 18, -5, -98, -25, 1, 75, 19, 126, 30, 14, 16, -100, -61, -51, -21, -2, 29, 33, -12, 4, -16, 8, -77, -91, 13, 18, 70, 39, 0, 48, -35, -33, -71, -20, -61, 14, 55, 18, 58, 30, 74, -16, -64, -64, -42, -39, -50, -26, 15, 40, 32, -14, -43, -21, -82, -76, -44, -16, -1, 73, 49, 84, -26, 4, -22, -67, -17, -10, 50, 80, 31, 20, 13, 18, -22, -56, -30, -44, 21, 60, 5, -6, 55, -31, -34, -63, 6, 4, 25, 41, 38, -21, -43, -19, 15, -55, -58, -67, -58, -24, 13, 55, 14, -18, -21, -42, -42, -2, -37, -58, 24, 67, 103, 19, -12, -65, -55, -36, -63, -99, 27]
3483B7J2PMl1k2k4K4j7lN1j9l7M7j8qo0P6m3KJ2N7n5K4L1k6p2K4L7jm1m5P2P6
3516F1k2kk6Km7N8l1m4R8rQJ7k8j2o1J8j4k1RM0N0m7nN1Pr7lqO2m1N4J7nj3J4
3551C0m1kJ3Lj5L2mJ1K7Lm5pj1m0qM4P1J1Qj01j7J7L9o2K1QM8j2J4J7l7k6Po1
3585f5PL1M0k2K5J3L3j1k7m8KJ5n8P2j9N3m8O3n4o5M1J1m1Q2K5p8O9nL2n8m6k5
3617e6MJ2L0L0J7l2J5J3r3oL6k8Q8n4O1qk8j8l4M1k0L3L6n8jL6L6j3j2p0J1m1
3649g3L9K2L6N0n1j7j9L8l0k3l6O7l2O5K8j00kK9J3q1%N1K5j1J4M4j5Mo8J9%k5
3681c9j7M6kL8o5N1l0o0Q1k8J0MrM8l2M1o5N5l4p5J09q7L8K3j1P0J3k5o9K0k9
3712c0K2K8n0O7J6n2NJ5q0Mj0M2O6l0O8p9j8KLKN7l5k2J4N3l2M9q9K4j5n6K3M8
$$ y = [27, 39, 46, 50, 19, -3, -27, -3, -20, -23, 28, 9, -28, 19, 1, -7, -67, 9, -34, -32, -20, 37, -18, 6, 37, 11, -61, -37, 0, -1, -42, -87, -15, 61, 39, 37, 11, 13, -34, 24, -7, -51, 47, 38, 46, 63, 35, 23, -38, -20, -34, -55, -46, -6, 44, -3, -8, 43, 50, -47, -50, -58, 4, -37, 17, 34, 29, 16, 30, -11, -13, 0, 3, -12, 20, 16, 27, 54, 57, 12, 5, -6, -46, -54, -10, 61, 72, 80, -21, -38, -21, 18, -44, -23, -15, 33, 21, 35, 52, 15, -11, -4, -65, -58, -27, 13, -9, 16, 29, 62, 51, 24, -24, -22, -7, -65, 7, -12, 41, -7, 56, 2, -63, -22, -11, -52, 30, 55, -23, 46, 41, 73, 15, -31, -56, -52, -40, -10, 20, 37, 5, 20, 33, -60, -66, -30, -58, 30, -24, 37, 29, 1, -17, -51, -10, -30, 3, 39, -19, -20, 16, 52, 39, 27, -43, -32, -73, -34, -12, 24, 74, 23, 6, -13, 25, -5, -28, -64, 3, -29, 36, 64, -36, -38, -9, 4, -77, -77, -26, -1, -12, 2, 46, 31, 35, -33, -14, -14, -39, -56, -10, -12, 26, -39, 12, -18, -78, 3, -25, -15, -11, -20, 28, -4, 37, -28, 27, -7, -82, 27, -60, -22, 1, -10, 60, 73, 48, -21, -1, -30, -8, 20, -30, 37, 53, 1, 6, 21, -59, -55, -65, -23, 43, 13, 81, 2, -16, -14, -11, -9, 48, 13, -9, 5, 58, 26, 75, -14, 10, -5, -61, -38, 10]
3745A0j8nP0j1o3O6j07k0O1k0koK9K8M0p0L7k6r0J00J3L4mkJ7l3l2l9K6Qk5K9
3777ej2K0N0K8j13M2nj9l1L2M1nj5k3J05r4L1o5N8j10J36k7k3N2j3o3K0jRm1M4
3808Ck0L8k0O3k8Mm9n9K8qj5J14k5mL4m2k8L8kj4j9KL0l9K0n5N6o6M3n7P2J0L7
3841D2m6O1p0P4o4j4nJ7k7L1N4J5m7l9J5L9j4l7M6l7J4j5JrPJ3l2K3J8l6K4K0
3873B2j6J4j8o3O1l4PPL2N1j2k4M8m8jo2L6l5PK7J4k0L0NL3j03O5m5J7J7pO5n4
3906A6n0M0K6Pnn5j0QL1N5n4L6l0k6Qj5l0oNL0j6LK5j8J7k4KmNK4M6ol0Pj4n4
3942e6QJ0J02o8L0M0m3k9N2J7o7n8P1o1M5m0O6OK2m7l9J3k4j3Q6J5J3qp4PJ3O0
3974D9p6n5P8Qo6J14n4K1m4LM1n2K0L6j9l7M3K0k2k0j3O7K4q3%RK9l8k0L1M7j25
$$ y = [10, -8, -13, 57, 46, -17, 49, -58, -78, -17, -37, -39, -45, -16, 12, 52, -18, 19, -7, -97, 3, 16, 50, 46, 44, 61, 28, -4, -43, -17, -9, -34, -5, -17, 3, 53, 81, -32, 10, 5, -14, -45, -13, 28, 23, 8, -15, 90, -4, 27, -38, 20, -90, 46, 19, -4, 48, 35, -28, -8, -9, 0, -41, 3, -17, 21, 1, 64, 36, 40, -9, -68, -40, -48, -63, 51, 26, 22, 56, 14, -14, 24, 22, 8, -11, -9, 21, -18, 2, -53, 3, -63, -20, -77, -5, 5, 42, -4, 57, -13, 61, -3, -17, -22, -5, -32, -1, 53, 68, 21, -18, -3, 36, 22, -15, 31, -6, 8, -7, -6, -15, -8, 5, -27, -4, 14, -22, 2, 22, 6, 20, 2, -61, 0, -34, -27, -20, 12, 63, 51, 27, 75, 27, 26, -36, 0, -35, -28, -1, 13, -7, 23, 28, 61, -42, 23, -22, -5, 12, 5, 70, 16, -34, 6, 32, 39, 34, -21, -31, -23, 8, 63, 9, 45, 15, -11, -3, -18, -48, -54, -49, -19, -35, -32, -7, -25, -8, -32, -30, -34, -29, -5, 41, 35, 5, 12, -2, -56, -48, -38, 64, -4, 26, 66, 23, -6, 46, 63, -4, -62, 9, -52, -7, -47, 19, 25, 47, 0, -39, -26, -50, -63, 23, 38, 51, 43, -31, -24, -11, 49, -27, -82, -4, 4, -62, 52, -2, 19, -25, -22, 19, -33, -13, 23, 4, -33, 10, 30, 8, -12, -25, 42, 66, -17, -17, -8, 21, -17, -37, -6, 41, -84]
4006h4J00q3J8M3J7K3m5J8q4R5k6J1jM9p7N2k9O6q2O9on0j7K6J6N0o5K9m0l1N7
4037A9J7l8J9n6N6jo7O7j2J0m3k8N6NM3p5O6l1J5j5qo6P8PJQm1J6L1l7M3n3k3
4070c7N7n8K0M4j4n5O0j7M8o3N5Pk0Kj5K4n5K5m6J9n2P1J4J8p9P4o1J4OM0l2r
4102a5OJ5j2P6m4m4J7%J2k6qNN3no7O5m3K2q1Q0J0J7l8KL5jln8kO3lq4L8L7k4
4137eL6mj3k3kl0O9l4PL6q2K0O9n8koJ7L2j5k5lK7n6P5qp7O8j3J3l9O8o8L3kO
4172A1o8Q1m0K9K0k4j0l9O3l6J9k1M5r3N6J5J9Lj6j2J9qm6L3m0L6o0MN8j6P2k6
4204B8Mj0m9L7k4k8P1j1Qo0M2Jk1J9m6N8kKm4j3P0n4Qk1jjLoK6j1J4j0K3L2n4
4239b0LR4r4K8J0k1k3L9oJ7j4L4l2rM9q9Q4o2l8Q8m6m6M8J1K5n2J8K9Qm1o5N4
$$ y = [-84, 16, -67, -49, -6, 11, 34, -11, 7, -77, 18, -8, 3, 2, 51, -26, 26, -3, 63, -19, 50, 44, -6, -23, 3, 19, 69, 4, 33, -7, -38, 19, 36, -2, 17, -39, 17, 16, -51, 16, 4, 14, -29, -57, -1, 4, 47, -28, 38, 7, 22, 7, -1, -67, 11, 18, 19, 27, -14, 2, 33, -4, 39, -14, -37, 20, -38, -18, 26, 12, -43, 17, 0, 48, -15, 40, 47, 27, 29, 14, 38, -17, 8, -38, -19, -71, 0, 14, 32, -47, 27, -34, -20, -14, 26, -6, -15, -9, 6, -6, 70, 26, -18, -1, -1, 11, -15, -23, -18, 35, 30, -37, 28, -15, 7, -74, 6, 16, 33, -5, -3, 32, 31, 28, -30, -32, 31, 28, -56, -18, 19, -5, 31, 27, 14, -9, -11, -41, 28, -6, 1, 37, -45, -25, 44, -14, -16, -22, -5, 27, 12, -13, -16, 11, -45, 30, 22, -55, 13, 0, 13, -26, 42, -26, 7, 5, 11, -57, 24, -16, 13, 33, 9, -1, -40, 23, -13, 6, -15, 30, -63, -7, 8, 27, 30, 14, 2, 21, 13, -33, 0, -40, -4, -64, -60, -2, -18, 54, 28, 32, 22, -27, 10, -14, -42, 29, 18, 26, -34, 8, 9, -12, 7, -39, 19, 17, 19, -25, -38, 32, -22, -14, -35, -36, -37, -34, -40, -14, -25, -11, -21, 2, 34, -20, -17, 77, -17, 11, 21, 0, -23, 16, 10, 27, 13, 47, 15, 6, 55, -34, 50, -12, -50, 38, -8, -54, -6, 5, 30, -22, -4, 25, 33, -8, -73, -19]
4271a9NJ4P6n6k8n3O1jL7o0K5J7o2Q6q8J7Q0q2P1q1M8LK6p7j6J00o7k4M9k0J0
4302il1K8l0K0PL2j0jl4j6M0KL6k2k7L1o9O4l4K5M0m0mMO5l4N4n6l8Jl9N8k2L
4336fJ2L9p1P2n0k5N6p6O9n6K9K7o5qO4m9N1l1R0q9J7Kk2J7j1RQK1j9jk8J9j4
4369a9L0K7j4J0jMq1K2P0q1J4K9j2P2o2oPM8J0o8K0o3rL6j3L4j8O8n5j9JK9l6
4402b6j7N4k9K0M5Ln8Ql7J3J2J2L2plQJl5J3J5rj3OK0pj1l4K0nJ3l8m5M0oO8k4
4438ap8M4J7QLpm7N8l4O9j9O0n1j9l1QL3j0jm9Q0L0o9km1K2J1n5N5LL6k2l3L3
4472Aj1J4kr3P9L8k5K3p6J05j16Q9N4j75Q1j6J4L3LK4p1K6J6oM5q3J8Q7q9J9L0
4503C6l0l1NqL3j4M1k0L1l0l8M4j5m0%J1n0J38o8K4m4P8k1k6j5j3LM3k1L7o2K5
$$ y = [-19, -14, 0, 76, 20, -8, -61, 0, -1, 36, -24, 1, 18, -44, 42, -46, -29, 51, -31, 40, -41, 7, 10, 36, -41, -57, 43, -24, -48, 1, -19, -9, -40, -12, -42, -22, -15, 17, 7, 6, -28, -44, -4, -2, 34, 12, -15, 16, -53, 11, -23, 2, 42, 2, -2, 2, 67, 33, 87, 31, -7, -6, -45, 13, -9, -6, 6, 45, -26, 46, -4, -29, 27, -49, 20, -36, -7, 20, -45, -53, 11, -38, 13, -18, 72, -17, 0, 2, -20, -3, -14, -5, 3, 24, 5, 4, -24, -5, -19, 11, 38, 24, 34, 33, 37, -44, -22, 48, -33, -19, 10, -2, 70, 8, 2, 9, 57, 67, -1, 19, -44, -53, -17, -30, 4, -14, 54, -1, -20, -19, 10, -26, -43, 11, -18, 2, 47, 50, -8, 0, -37, -24, -12, 0, 32, 25, 22, 30, 31, -4, 9, 24, 15, 2, 8, 28, 21, 10, -24, -4, -9, 4, -34, -79, -39, -45, 23, -1, -79, -35, -18, -10, -7, -14, -61, -3, -37, 32, 13, 73, 22, 3, -28, -20, 13, 3, 2, -47, 33, 63, -6, -8, -49, -27, -16, -71, -16, -13, 23, 1, -32, 1, -10, 4, 2, -91, -12, 26, 1, 24, -52, 53, -63, 26, 80, -95, -14, -30, -16, 17, 20, 44, -27, -1, 15, 9, 54, -29, -11, 76, -13, 6, 36, 6, -25, -20, -28, 5, -9, 32, 12, 43, 13, -25, 19, 4, -36, -36, -25, -75, 63, -5, 19, -25, 53, 32, 6, -9, -22, -19, 24, 3, 40, -22, 3]
4535COK8j6j0L2oo1P7J3q3M8o4J1l6N2K2n5J0M7k4ml0L7k1j5qJ8M4l9P8rn8P2
4568E9m0p6L7M8J0ln1J1L8qpn2P2J5o8J0K1K1m0j0L2q2P8J5j6Kp6P6J4k5K0j7
4600Hom1J3J7K7Jk8LK6pj8rnk8Q2n3K8Nj9N7o8j4L6k4K7m6N1Ok7L5l1J1Nm4J6
4635a4k9R1j0n1J4j6o2P7Mm8R3k1k2j9k3K7oj0N3J0j00J3M3K1k9j2K1j7L9j5m2
4666d0N9Nm1K0kK8Jl8LJ2j8L0M5l7j3m5Q0k7k8k7LM2k5K0j9L4Pm7K5n4N1l0J4
4699a2jL9m3N0k3j0k6kK3K8ok9J1l1K3qOj6L9m3J9K0KP1m6o5O1j00j3P2j9MK4
4732aoJ9m3l4pO3Nj7J4Mk8P9J3l8Rk5%J6o3K8L5m7L4Kq2P5J9p5KP9kmk0j2K0k6
4768a4j9K0j6K3o2M3K9m2M3l7NRoK3J0k1pL8kLJ2n1n3Q3M2p5O4r1J3N2lL4r1M2
$$ y = [3, 9, 37, 21, 11, 43, 37, -24, 53, 66, -17, 31, -33, -22, -58, -6, 16, -39, -29, 18, -6, -10, -40, -3, -24, -39, -47, -29, 15, -24, 54, 45, -13, 59, 19, -57, -20, 28, 38, 35, -16, -5, 33, 25, 18, -34, 38, 53, -15, -5, 16, 37, -3, -13, 19, -63, 15, 30, 14, 16, -60, 16, 30, 5, 25, 8, 2, -39, -26, -9, 18, 19, -9, -6, 20, 13, -5, -14, -19, -47, 35, -18, 10, 15, -4, 53, -15, -29, 7, -17, 10, -36, 15, 21, -6, 29, -2, 9, 14, -30, -14, -43, 48, 38, -13, 1, -15, -77, 0, 4, -44, 49, 28, 6, -13, -36, -9, -15, -25, 28, 38, -62, -49, -6, 15, -14, -26, -5, -22, 17, 2, -40, 19, 24, -17, 3, 1, 29, 30, -8, -5, 7, -11, 19, 64, 27, 14, -31, 49, 22, -6, -33, -30, 12, -13, 7, -12, 22, 29, -18, 7, -47, 4, -26, -12, -13, 26, -17, 33, 10, 0, -26, -28, -5, 23, 17, -12, -1, -32, -9, -17, -11, -27, 12, -31, -12, 8, 10, 81, 35, -30, 31, -69, -82, -10, -29, -25, -1, -7, 12, -31, -65, -72, -9, -4, -21, -7, -3, -31, 48, 61, 23, 32, 7, 7, 23, -40, -12, 23, -24, 10, 12, -70, 5, 24, -51, -49, 30, 28, 24, 4, -8, 12, -14, -33, -13, -29, -6, -68, -25, 4, -38, 5, -32, -27, -18, -24, -1, 9, -12, -19, 19, 17, 20, 32, -19, -72, 11, 53, -22, 42, -49, -36, 16, 13, 47, -44, -2]
4802bl7KLL6Pj0Ll3J9k6K8M9n4j6M4J3m8J4j9L4o0QO6Mj6MM3k1n9N7k4Jkk5L3
4837A6qN7k8j6o0mJ6N0qJ1l0rO2j5Rk7n5N3l6ON2m8lK5L0n5Kj5j1P9n8L1j6k2
4871b5k3P7n3J7o2L7KL7K2j7K3Jk4l2K0K6k5l2K6L5j7n8L9Mm5K6L9n1j3O0k1R
4903BL8l8k2PK9mj7Qk6L6nk8P2j3m3l5O1m9O4m1PJpkJ2J5j34J39k8K8l7N3k2o1
4937d0kL0kL0k8N2k3n8K5j3K0O1n9nL3l3L4j6o4L1O3n9M4m7K4NK2Mjj3Jnl7k7
4971e3K6N7j7M8p5j1P8j2l0n6L6m1M5L5oJ2J7m2m2mNkJ1j2M3k4N9n9K8j0k9M3
5003A8k8N3Pj7l2K2m5Q2k3r4M5N9k8ll4P7m7l9J4K2l5K6k5P8pl9Jn3J04p3k3N7
5035B0o2k5K4N3m1N2n6P8p6N0k3J4l2rQ0n1J9j9Q7o8rl1N4Kj6K8o2k2O8k3m0K3
$$ y = [-2, -39, -37, -34, 2, 9, -1, 2, -31, -12, -38, -10, 39, -15, -31, 13, 26, -22, -8, -27, 7, -53, -45, 21, 25, 9, 13, 56, 35, -24, 33, 9, 10, 8, -17, 16, 8, 65, 37, 21, -39, -43, -27, 23, 15, 26, -4, -13, 49, 34, 43, 16, -39, 14, -22, -16, 36, -12, -15, 10, 40, -15, -13, -28, -39, 40, -18, 13, -3, -25, -48, 29, -24, -7, -69, -32, -30, 7, 29, 12, 35, 36, 12, -20, 0, 26, 1, -31, -5, 30, 13, -45, -6, -2, -47, -21, 18, -33, -46, 14, -7, 2, 40, 2, -20, -13, 16, 12, -5, 3, -23, 13, 8, -20, 52, 39, -4, -39, 22, -27, 37, -4, 3, 4, -3, -5, 7, 22, -112, 27, -1, 27, -10, 43, 21, -40, -42, -12, -14, 16, -12, 40, 17, -41, -16, -29, -9, 52, -7, -12, 21, -12, 22, 6, -58, -27, 36, -23, 21, -26, -2, 3, 25, 29, 28, 15, 16, 11, -26, -53, -27, 30, 13, 61, -14, -25, 53, 41, 11, -45, -9, -50, -5, 30, 24, 36, 53, 11, -31, -35, -30, -32, -21, -33, 10, -14, 45, -14, 14, 4, -25, 18, -10, 43, 50, 33, 1, 23, -22, 60, 37, -57, -12, 47, 19, 16, -18, 59, 12, -27, -13, 9, -26, 0, -25, 53, 46, 7, 8, -45, 59, -14, -37, 20, -42, -67, -43, 10, -31, 21, -35, 43, -33, 17, -6, 8, -24, -33, 47, -4, 15, -4, 83, 15, 6, -25, 29, 31, 15, 43, -19, -41, 27, 4, -36, -13]
5067a3mooNj1M3j8Om4RO3%Mr1Q1jJ2k4J5l8j7R2j2n9L4m7N8m3k7J14p4kk8j4J5
5102b8nJ6L4K7k7m1J0MJj7P1q0P4o7M0j7m9kR2Pl3L1j7qn5N0Mj3L8k0j1k5L0j1
5136CPK1m3J4J0K1n0J5K5J4l7nm5J09o0J1n9L4K8k5n7N2k5J3j2L5J9j3k1K2L8
5167C9o6O2n4RM8l2l3j2M2pqK2j9K5rk3%M9n5J2N6o4l2K8MO5r3J2%MK7j6L3o2
5201d8j2M6pN6n0O7k8M3j23M5KJ3k3L9j3M5k3n8K5PM9j38N9K2M4j6o5L3K2mQk2
5233eL8j02J7l9Q1j1L7m2n7L0P6l6j0j9P1l7K7n8j3J22m5j7n1jM2Mn1J26k8no9
5264b5J5l6K1RJK0k1pQ0m6qm7N0k6k6N5m6M2l9M0l3j8M4J9J7kk5m0O9k9plj2j2
5298b6J1K5J2L8n6l7MRk0J8JJ1K0oO0m0M5k4m0k7l5L7lJ05j34L1O2r8M3m0M1j5
$$ y = [-13, -17, -23, -29, -24, -35, 8, -10, -4, -48, -39, 24, 24, 28, -63, 18, 17, 29, 5, 20, -18, -35, 57, 45, -14, 20, -27, 31, -12, -39, 75, 1, -1, -29, -43, -28, -33, -17, 17, 44, 17, -24, -14, -10, -9, -26, 45, -35, 39, -28, 12, -5, -54, -56, 36, 43, 10, 41, 24, 16, -39, 11, 15, 2, 40, 20, 9, -16, 14, 3, 10, 31, -12, 2, 12, 33, -17, -2, 23, 37, 0, -5, -50, 59, -1, 10, -49, -15, 13, -12, -69, -17, -42, -29, -41, -6, 13, 0, -21, 1, 39, -27, 35, -19, -10, 38, 6, -27, -39, 3, -4, -12, 10, -9, 16, 7, -16, -16, 33, -22, -10, 46, -18, -50, -22, -18, 47, -46, -34, -34, -30, -3, -19, 14, -48, -60, -14, -21, 35, -15, 52, 24, 67, -56, -11, -9, 4, -19, 20, 7, 52, 29, -29, -4, 3, 52, -86, -27, -5, 39, 23, -42, -9, 13, 9, 17, -5, 33, -69, -52, -91, -10, -21, 16, -26, -83, -53, 23, -13, -23, -42, 29, -8, 19, -39, -52, 70, 25, 8, -43, -44, -2, 2, -49, 77, 49, 44, -25, -10, -46, -25, -16, -15, 5, -16, -23, 57, 11, 3, -44, 6, -20, -46, 9, -37, 5, -34, 6, -27, -45, -1, 18, 35, 33, 8, -32, 37, 8, 1, -2, -14, -26, -15, 10, 22, 60, 4, -33, -29, -20, -40, -22, -21, -10, 10, 4, 64, 24, 69, 45, 5, -22, -57, -20, -23, 82, -52, -21, 41, -57, -14, -54, -13, -28]
5330b8N4j8J3Lk0J3PK3o1M6m1N3k5m0K1J9rk3oLL5p6lM7Q9r8KkJ8j8J8j2J4M7
5364D5n1J1j7k5K6LK0m0J7n0O2j4MP6j06R1mkp9N2l1K9qMk7rk3K0K6L7j9m1lP
5398a9L1Ll5M4k6K8o3J8K9l9P7j06R4m6L7j6j8O1m4jj4O4r4K0K2NNrK9k2l0N6
5430D1l2K8p4M1k1k5P4j1lpj0O3j08Jj4Q4p5OJ02j14Q7k3q5O5M0l6l4N4J5l4K5
5461B0n2N8J8o3J1k0M3K7j4l9N8k3k3J7m2K6j0j5K3k0L1O7p1k6mj0L4k0j3M5n3
5492d0P3o1N4q0O2k8L2k8mm4O4jL1o0J4NL4j6J8k3M6l2oK2p0NNL9J6k0j6M5Kk9
5526Ik3O0p8P6Pq3K1rM5K9p3L8l1M0l0k5K0KNk0M5l2Ql0J4k1M3K8k5l8rN7j9k4
5560b3J9qK0n4QK0K2%k5OK9L4n5NRo7J1MM9l8K3M3q2N4k6K5J7r4N3n0O2l7J4L
$$ y = [-28, 26, 8, 21, 24, 4, 17, 24, 47, -14, 32, -9, 44, 19, -21, 0, 19, 10, -13, -19, -16, 19, -57, -60, -13, 76, -22, -20, -22, -4, -22, -4, -16, -2, 45, -6, 5, -12, -37, -11, -8, 12, -28, -11, -61, 1, -13, -9, 67, -39, 52, 48, 46, -33, 19, -12, 17, 9, 13, -14, -23, -46, -26, 0, 37, 18, -23, -26, -19, 12, 15, -20, 24, -2, 26, -37, -19, 10, -29, 48, -58, 36, -10, 27, 11, -7, 54, 10, 9, -5, 59, -35, -15, 7, 12, 17, 8, 37, 15, -15, 41, 9, 37, -37, 4, -17, -42, 32, 21, 18, 11, 1, 64, -44, -43, -57, 27, -48, -42, 60, -54, 33, 10, -75, -10, 30, -6, -40, 14, 29, -5, 20, -32, 26, 44, -19, -8, -28, 15, 42, 28, -11, 47, 24, 1, 18, -24, 2, -8, -23, 0, -20, 11, 78, 7, -19, -23, -33, 1, -19, -32, 13, -40, 33, -28, 26, -54, 8, -20, 12, -16, -20, -64, 0, -1, 30, -30, -16, -11, 23, 7, 25, 2, 48, 16, 10, 32, -38, -33, -28, 11, 27, 7, -9, 36, 38, 9, -14, 46, -32, 44, 51, -32, -11, -20, 25, 54, -19, 19, -12, 28, -2, -27, -7, -5, 0, -20, 25, -7, 1, -29, -15, -36, 7, 35, 10, -28, -37, 20, 1, -23, -4, -12, 8, -46, -38, -18, 4, 4, -21, -15, 14, 48, -7, -2, 7, -60, -49, -45, 4, -34, -11, 32, -50, 4, -22, 3, 20, -74, -21, -71, -9, -46, -32, -29]
5594b9j0M7j0j7J0km5O0N6o6M0l4PK7kk4M2o6O4q3Ok1j5M8M0Om3J6QpNm7M1Ol0
5629b2M0m2L4L2j2n9K1j3Km3R5j5L0o5M7j2J9o5k7M5o8J07o0Q4o4RL8kk1l8L7
5660A2l0nJ1Om8L6J2K9j8L6p7J7J7M6kl3RkJ3nj4l9j7Q7nm1R3j00M2j2Km3K1N
5694CRm2jJ0J0qLn5K7N0l8K0qJ9k7k0L5j6J4M7n8M4kL7q9J5L1qJ4l7L7J4n7K1
5728fj7k8K9j4N1n3K2MJ2n7N7j7j0J3k7L3k3PJ7lk9N5l9J1l3J02l8l1llN2p9L2
5761a3j7J3l5jQ8p4L7oj1K2L2l7k8L2L9k5l8J4O3j44Q2k0qQ6m1n2L5Pl7M2k0J2
5793cj5j0kJ0M3j3l7J8j3J05m3p1O3m8KJ8M4k5L0j6k6K3m7N7j09J09q0Q3l5j6
5823dK9p8L5j7M1m7P8l7L2k1j4J6%%n3K1L9k3j9M5J6j8j1J0j2l6P1k1k3k1nK6
$$ y = [-29, -39, 8, -2, -19, -9, -11, -56, 4, 60, -6, 34, 0, 7, 34, 32, 8, 50, -16, 48, -35, -29, -50, -65, -17, 23, 29, -14, 2, 10, 3, 8, -39, 2, 8, -22, 18, -24, 10, 42, 30, -29, -8, -21, -19, -62, 33, 18, 48, -17, 30, 18, 37, -28, -55, -10, -78, 29, -31, 53, -11, -2, 36, 34, 13, -25, 12, -18, -23, -12, -6, -54, -18, -6, 23, 5, 41, -36, -19, -2, 44, 42, 9, 18, 16, 29, 24, 10, -29, -46, 41, 36, -5, 88, -12, 30, 18, 20, -23, -2, 3, 12, -30, -31, -21, -11, -19, -16, -71, -44, 6, -32, -12, -20, -1, -28, -48, -13, -29, -15, 32, -26, 18, 16, 53, -36, -21, 10, 2, 16, -21, 16, 30, -27, -6, -23, -51, -22, -36, 15, -38, -16, -12, 0, -57, 0, -17, -27, -14, -41, -8, -31, -24, -7, -10, -39, 16, -23, -12, -45, 57, 19, -12, -15, -18, 34, -45, -13, -30, -17, -52, -53, 35, -39, -2, -8, -19, 3, 35, -2, -30, 2, 41, 16, -22, -8, 55, -89, -7, -27, -35, 51, 10, -42, -7, 0, -37, 5, -15, -3, -18, -28, -30, -20, 23, 10, -27, -9, -22, 83, 40, -31, 32, -16, -14, 4, 48, 23, 53, 37, 11, 34, -13, 44, -65, 44, -36, 47, 12, -4, 25, -53, -18, -35, 6, -41, 37, 0, 32, 11, -3, 13, 13, 13, -40, -19, 20, -3, -22, 23, 39, 21, 10, 20, 8, -28, 43, 22, -1, -22, -27, -1]
5855aj1M7m1kRO6m4j6k8QJ3QOj7j2pj8M2l7O7m5qJ2l9P2j2nj5M0Ml0J3o2l2L7
5890c8M1Kl5K9%K2j1kJ8j7N3Pm4k4K6j01M0O3mmj0m6L0MPk6J1K1l0O7o2k6J0N5
5924B6n6k1O7k3L0l4rnoN2m0P4n1j4j7P1j5k4L1J2k1k3nK5J3o3NJ7qKJ6m2L3k1
5958b4j7J1L6j7okK2j9qKJ7J8j3Ml4oQ7k0m2j3JJ5J4l0L4rk6RK9j8N7k8k9M1m4
5993hj9O6pl0k6Qj3N4p4M0K9n8j2K1K3N4k9p4N8p8Q2kJ7l3Nl1L6O1p0%mk4O4j0
6027A6Kl7MJ8jJ6Ol4L3o0K3k9K8K4j8j1nJ7N0m4L3l2K7k2nP4j08Nj3J9O3n8J7
6060bl5N6K%j9nM2m2P5o7%K1k4On0K0L8n7M6rj4Qk2N8k6J7l5J6JM5j2n4L0J7m2
6095a7N8oo9N9kk4k2J6jj0N3nj8m8k4O4n3O6o9P0Pn8O8n4M1Qm6J7j2j6J5L2m9
$$ y = [-1, -12, 35, -6, -8, 1, 67, 23, 7, -21, -13, 0, 8, 14, -3, -15, -22, -40, 2, -35, 32, -13, -21, -9, -48, 24, 12, 7, -8, 32, 36, 6, 19, -43, -75, -38, 3, 5, -30, -1, -1, 21, 10, 8, 26, 9, 62, 69, 25, 1, 27, -74, -34, 29, 25, 21, 11, -35, -5, -1, 6, -20, -9, 12, -18, 49, -13, -39, -29, 26, -30, -51, 16, -7, 23, -11, -20, -25, -31, 21, -19, 55, 4, -10, -27, 44, 29, 5, 36, 48, 27, 4, -1, 24, 37, -26, -21, -4, -12, -10, 6, -36, -3, -24, -41, -30, 6, -11, -17, -19, 3, -16, -24, -22, -5, 13, 0, 4, -30, -36, 51, 31, -11, -24, -23, -8, 6, -24, 10, 1, -25, -16, 13, -5, 52, 24, -5, 36, -8, -27, 39, 32, 2, -24, -16, -29, 25, -49, -9, 20, -38, -50, -29, -6, 48, 19, -55, 3, -75, 7, 5, 22, -11, -6, -37, -1, 60, -10, -10, -14, -38, 26, 16, 18, -19, -15, 3, 2, 18, 24, -10, 23, -37, -14, -43, -15, 9, -9, -20, -25, -8, 42, -2, 31, -1, 26, 4, -1, 73, -35, -30, -43, -24, 39, -19, -2, -37, 19, 21, 21, 2, -3, 39, -3, 72, 5, 5, 26, 2, 8, -42, -22, 16, -41, 5, -4, -18, -10, -32, 26, 0, 17, -18, -2, -1, 44, 32, -22, 8, 25, -17, 41, 35, -34, 25, 23, -1, -23, -7, -8, -18, 35, 30, 12, -36, -60, 4, -49, 17, -52, 18, 25, -33, 35, -19, 22, 30, -16, 1, -11, -27, -12, 20, -29]
6128b9J8m4L2N6m9K0o4P7k0n5K7J6K9K2m6Qk4N3k1L4kJ7o9J0N2l2pJ0j0j6LL3
6160B9L0o2J6j7J7l9L5K8nj7PJ0n3j2L8J9K7o2K7m5K8K5j3k7k2O2j4k6L2K4n0
6191a0K0m2K6L9j6L0r2O3m4P6m1Ok3J7qk0k2M6k8J4K1j2n5L2PPj0KL1J1k8LM0
6224D0m2J9l8J2JpJ6nKLN3l6K2o8pO7m3JN1p1R8j13OmL0j7J8nqK1LJ5m2K6j1K7
6260A4n0L6K6n4L1J2J0J6l5J5k3pQj6M8L5r5L3j9Q1o5k0K4m0N1k5RJ7l1N9J6r1
6292c0P6n5k7J8K1l3O5o3n5R4m2P2n6NRL0n3M9k0m8K2K4n9M6L3l6L4l0L2p1N4
6323Fjp6J8R4m1LNl5nO2l7L6m9J1K9k6l8M1l3j9J8JRRN0Lk6m0M3K1m4l9L0J4J
6358eK2K0m9J5l9M0K7pl7l8J2N4L2k7K0r1L4p1J41j06J7N2j0o%k3N1o8L1j2rL8
$$ y = [-29, -11, -55, -23, 33, -16, 4, -60, 17, -3, -58, -31, -15, 14, 36, -10, -2, -26, 27, 6, 40, 38, 55, -14, -4, 48, 16, 9, 19, 9, -7, -4, 29, 59, -3, 13, -4, 13, -26, 9, 37, 32, 15, 22, 32, -21, -33, 5, 24, 51, -11, 16, -29, -1, 24, 11, -16, -38, 24, 10, -16, 16, 40, -10, 10, -32, -6, 33, 17, 47, -45, 18, -26, 50, 9, 15, -8, 9, 1, -19, -41, 5, -23, -9, 12, 0, -55, -23, -16, -9, -19, -17, 14, 25, -3, 0, 40, -2, 17, -21, -9, -8, -15, 1, -4, -2, 1, 54, 18, 40, -28, -35, 32, -11, -10, 41, -30, 68, -45, -39, -43, -13, -30, -12, -17, -25, -4, -1, 14, -28, -2, -13, 14, -36, 0, 26, -28, 3, 15, 25, 41, 6, 21, -2, -9, -1, -17, 31, 66, -29, 4, -15, 66, 1, -19, 5, -35, 16, -9, 0, 17, -14, 45, 61, -30, 46, -9, -36, -18, 3, -30, 35, -28, -83, 11, -31, 41, -15, -10, -1, 29, -24, 25, 5, -43, -21, 3, -56, -10, 23, -13, 21, -9, 23, -48, 6, 5, -71, -53, 41, 0, 3, 8, -27, -32, 30, -7, 29, -20, -9, 20, -6, -44, -3, -36, -55, -37, -36, -27, -18, 32, 35, 9, -31, 12, 33, -11, -50, -20, -6, -5, 17, 37, -12, 3, -36, 4, 31, 24, -13, -51, -39, 15, 47, 20, 40, -51, -17, -88, 53, -53, -36, 16, 6, 0, 0, -23, 28, -40, -9, -21, -30, 8]
6390HjOj4Pl4M7K4p5j0N4rj9N4m5lKM1n0oK1J3l5J6M8n9J1l3M8j7N1m3oJ6l3K6
6425Am4O6l9qK8k3k8J07p7L4k8J2k3K3l2N9j2k9L9J3k8Rn8O7l4mo3N0M0j3L8j3
6457C0o2J2j3L1Oj4OJ3k9K5lj3j4j5L5jj0JK9J8k2m5M1K8J9n1o4R2n8Q5o2J3k9
6490b1K1J2j9Ql7L9L5m3j9M5k9J1Mlk0l2j3L5L2qJ5j8lq1M2M3m3OQJ9oj3M5j7
6524e%K4l5l1L8Qn7P5rj3N4l0k4J7No3L2N0m5L3k3l5k8N9J9l8J5n5N5ok5J8l9
6557e9R1p4K0K3J7m3L6m3L6K2m8k4K6M2p1P4k6j7K7J1Oj08M8Q0k2l3L4o1K3M0
6587B7n4N4Oj5Pl7j2j1j6L7o8P3LL3k0Qj4n6O8pk2L0kqk2L6J4k4%j5lL2nQm1j3
$$ y = [8, 7, 13, -1, 6, -28, 19, 43, -32, -42, 12, 3, -16, 38, -7, -10, -8, 33, -17, -23, -2, 11, -24, -8, 40, -19, -8, -41, 7, -10, 41, -2, -8, 8, -25, 1, -43, 23, -16, -24, 4, -19, -47, 60, -17, 17, -11, 1, -22, 1, -31, 28, 16, -13, 26, 39, 11, 20, -38, 29, -5, -9, -72, -22, 18, 5, 43, 30, -32, -20, -33, -2, 4, -10, -4, 9, -20, 5, 2, -11, -25, -40, -5, -6, -16, -15, 14, 32, 10, -35, 6, 34, 53, 2, -62, 30, -28, 57, -5, 8, -21, 0, 12, -7, 1, -36, 3, 38, -5, -24, 21, -8, 3, 7, 4, -16, -48, -61, -26, 6, -2, 13, -5, -8, -89, -47, -4, -47, -41, -33, -14, -20, -33, 12, -5, -5, 19, -16, -47, -9, -1, -58, 17, 8, -5, 49, 19, -5, 12, 17, -46, -14, 36, -9, 24, 1, -34, -62, -3, 16, -22, -7, -62, -7, -13, -38, -20, -59, 32, -42, -22, 1, 18, -25, 11, -32, 4, 26, -22, -46, -20, 22, -49, 25, -1, -18, 9, 20, 26, -82, -34, 46, 24, -9, 25, -36, -13, 27, -27, 27, 33, 18, 25, -12, -24, -35, -51, -14, -82, -9, -6, 27, 7, 15, 1, -55, 13, 6, -16, 14, 12, 4, -18, 18, 32, 8, 8, -7, -10, 22, 17, 25, -16, -29]
$$ [...]
8191d1
##END NTUPLES=NMR FID
##END=
