##TITLE=1H_ES-APTMS-10%
 D2O
 8 sc, 
 9.4.2024
##JCAMPDX= 6.0         $$ Bruker NMR JCAMP-DX V2.0
##DATA TYPE= NMR FID
##DATA CLASS= NTUPLES
##ORIGIN= UXNMR, Bruker Analytische Messtechnik GmbH
##OWNER= root
$$ XWIN-NMR		Version 3.5
$$ Tue Apr  9 14:24:43 2024 Russian Standard Time (UT+4h)  she@DPX200
##.OBSERVE FREQUENCY= 200.1309
##.OBSERVE NUCLEUS= ^1H
##.DELAY= (6, 6)
##.ACQUISITION MODE= SIMULTANEOUS
##.ACQUISITION SCHEME= undefined
##.AVERAGES= 8
##.DIGITISER RES= 18
##SPECTROMETER/DATA SYSTEM= spect
##.PULSE SEQUENCE= zg30
##.SOLVENT NAME= CDCl3
##.SHIFT REFERENCE= (INTERNAL, CDCl3, 0, 15.7039)
##AUDIT TRAIL= $$ (NUMBER, WHEN, WHO, WHERE, WHAT)
$$ ##TITLE= Audit trail, XWIN-NMR		Version 3.5
$$ ##JCAMPDX= 5.01
$$ ##ORIGIN= Bruker BioSpin GmbH
$$ ##OWNER= she
$$ F:/spectra/data/she/nmr/H-F/1/audita.txt
$$ ##AUDIT TRAIL=  $$ (NUMBER, WHEN, WHO, WHERE, WHAT)
(   1,<2024-04-09 14:23:44.43 +0400>,<she>,<DPX200>,
      <created by zg, POWCHK disabled, PULCHK disabled
       configuration hash MD5:
       00 E9 B6 7A A2 85 ED C7 34 08 36 98 17 FE 4E 26
       data hash MD5: 16K
       47 66 E1 68 90 5C 53 88 6B 9D 99 E2 43 A4 0C 6F>)
$$ ##END=
$$ 
$$ hash MD5
$$ 43 51 F5 C0 B5 2B FE 30 43 1E 46 84 08 4B 4C 45
##$RELAX= 
##$RELAX= 
##$RELAX= 
##$RELAX= 
##$RELAX= 
##$RELAX= 
$$ Bruker specific parameters
$$ --------------------------
##$DU= <F:/spectra>
##$EXPNO= 1
##$NAME= <H-F>
##$PROCNO= 1
##$TYPE= <nmr>
##$USER= <she>
##$AMP= (0..31)
100 100 100 100 100 100 100 100 100 100 100 100 100 100 100 100 100 100 
100 100 100 100 100 100 100 100 100 100 100 100 100 100 
##$AQSEQ= 0
##$AQ_mod= 1
##$AUNM= <au_zg>
##$AUTOPOS= <>
##$BF1= 200.13
##$BF2= 200.13
##$BF3= 200.13
##$BF4= 200.13
##$BF5= 200.13
##$BF6= 200.13
##$BF7= 200.13
##$BF8= 200.13
##$BYTORDA= 1
##$CFDGTYP= 0
##$CFRGTYP= 5
##$CHEMSTR= <none>
##$CNST= (0..31)
1 1 145 1 1 1 1 1 1 1 1 1 1 1 1 1 1 1 1 1 1 1 1 1 1 1 1 1 1 1 1 1 
##$CPDPRG= <>
##$CPDPRG1= <>
##$CPDPRG2= <>
##$CPDPRG3= <>
##$CPDPRG4= <mlev>
##$CPDPRG5= <mlev>
##$CPDPRG6= <mlev>
##$CPDPRG7= <mlev>
##$CPDPRG8= <mlev>
##$CPDPRGB= <>
##$CPDPRGT= <>
##$D= (0..31)
0 1.2 0 0 0 0 0 0 0 0.06 0 0.03 0 0 0 0 0.0002 0 0 0 0 0 0 0 0 0 0 0 0 
0 0 0 
##$DATE= 1712658224
##$DBL= (0..7)
120 120 120 120 120 120 120 120 
##$DBP= (0..7)
150 150 150 150 150 150 150 150 
##$DBP07= 0
##$DBPNAM0= <>
##$DBPNAM1= <>
##$DBPNAM2= <>
##$DBPNAM3= <>
##$DBPNAM4= <>
##$DBPNAM5= <>
##$DBPNAM6= <>
##$DBPNAM7= <>
##$DBPOAL= (0..7)
0.5 0.5 0.5 0.5 0.5 0.5 0.5 0.5 
##$DBPOFFS= (0..7)
0 0 0 0 0 0 0 0 
##$DE= 6
##$DECBNUC= <off>
##$DECIM= 32
##$DECNUC= <off>
##$DECSTAT= 4
##$DIGMOD= 1
##$DIGTYP= 9
##$DL= (0..7)
0 120 120 120 120 120 120 120 
##$DP= (0..7)
150 150 150 150 150 150 150 150 
##$DP07= 0
##$DPNAME0= <>
##$DPNAME1= <>
##$DPNAME2= <>
##$DPNAME3= <>
##$DPNAME4= <>
##$DPNAME5= <>
##$DPNAME6= <>
##$DPNAME7= <>
##$DPOAL= (0..7)
0.5 0.5 0.5 0.5 0.5 0.5 0.5 0.5 
##$DPOFFS= (0..7)
0 0 0 0 0 0 0 0 
##$DQDMODE= 0
##$DR= 18
##$DS= 0
##$DSLIST= <SSSSSSSSSSSSSSS>
$$ [...]
##$SUBNAM2= <"">
##$SUBNAM3= <"">
##$SUBNAM4= <"">
##$SUBNAM5= <"">
##$SUBNAM6= <"">
##$SUBNAM7= <"">
##$SUBNAM8= <"">
##$SUBNAM9= <"">
##$SW= 18.0517689322627
##$SWIBOX= (0..15)
0 0 2 0 0 0 0 0 0 0 0 0 0 0 0 0 
##$SW_h= 3612.71676300578
##$TD= 16384
##$TD0= 1
##$TE= 0
##$TE2= 300
##$TE3= 300
##$TEG= 300
##$TL= (0..7)
0 120 120 120 120 120 120 120 
##$TP= (0..7)
150 150 150 150 150 150 150 150 
##$TP07= 0
##$TPNAME0= <>
##$TPNAME1= <>
##$TPNAME2= <>
##$TPNAME3= <>
##$TPNAME4= <>
##$TPNAME5= <>
##$TPNAME6= <>
##$TPNAME7= <>
##$TPOAL= (0..7)
0.5 0.5 0.5 0.5 0.5 0.5 0.5 0.5 
##$TPOFFS= (0..7)
0 0 0 0 0 0 0 0 
##$TUNHIN= 0
##$TUNHOUT= 0
##$TUNXOUT= 0
##$USERA1= <user>
##$USERA2= <user>
##$USERA3= <user>
##$USERA4= <user>
##$USERA5= <user>
##$V9= 5
##$VALIST= <valist>
##$VCLIST= <CCCCCCCCCCCCCCC>
##$VD= 0
##$VDLIST= <DDDDDDDDDDDDDDD>
##$VPLIST= <PPPPPPPPPPPPPPP>
##$VTLIST= <TTTTTTTTTTTTTTT>
##$WBST= 1024
##$WBSW= 4
##$XGAIN= (0..3)
0 0 0 0 
##$XL= 0
##$YL= 0
##$YMAX_a= 122513
##$YMIN_a= -109845
##$ZGOPTNS= <>
##$ZL1= 120
##$ZL2= 120
##$ZL3= 120
##$ZL4= 120
##$ABSF1= 10
##$ABSF2= 0
##$ABSG= 5
##$ABSL= 3
##$ALPHA= 0
##$AQORDER= 0
##$ASSFAC= 0
##$ASSFACI= 0
##$ASSFACX= 0
##$ASSWID= 0
##$AUNMP= <proc_1d>
##$AZFE= 0.1
##$AZFW= 0.1
##$BCFW= 1
##$BC_mod= 2
##$BYTORDP= 1
##$COROFFS= 0
##$CY= 11.3945322036743
##$DATMOD= 1
##$DC= 2
##$DFILT= <>
##$DTYPP= 0
##$F1P= 15.7292609196834
##$F2P= 12.9074282941183
##$FCOR= 0.5
##$FTSIZE= 0
##$FT_mod= 4
##$GAMMA= 1
##$GB= 0.15
##$INTBC= 1
##$INTSCL= 1
##$ISEN= 128
##$LB= 0.24
##$LEV0= 0
##$LPBIN= 0
##$MAXI= 10000
##$MC2= 0
##$MEAN= 0
##$ME_mod= 0
##$MI= 1.114404
##$NCOEF= 0
##$NC_proc= 0
##$NLEV= 6
##$NOISF1= 3.799351
##$NOISF2= 2.8
##$NSP= 1
##$NTH_PI= 0
##$NZP= 0
##$OFFSET= 15.70392
##$PC= 1
##$PHC0= -25464.17
##$PHC1= 14.98731
##$PH_mod= 1
##$PKNL= yes
##$PPARMOD= 0
##$PSCAL= 0
##$PSIGN= 0
##$REVERSE= no
##$SF= 200.130013532006
##$SI= 16384
##$SIGF1= 3
##$SIGF2= 2
##$SINO= 400
##$SIOLD= 16384
##$SREGLST= <1H.CDCl3>
##$SSB= 0
##$STSI= 0
##$STSR= 0
##$SW_p= 3612.71676300578
##$SYMM= 0
##$S_DEV= 0
##$TDeff= 0
##$TDoff= 0
##$TI= <>
##$TILT= no
##$TM1= 0
##$TM2= 0
##$TOPLEV= 0
##$USERP1= <user>
##$USERP2= <user>
##$USERP3= <user>
##$USERP4= <user>
##$USERP5= <user>
##$WDW= 1
##$XDIM= 8192
##$YMAX_p= 0
##$YMIN_p= 0
$$ End of Bruker specific parameters
$$ ---------------------------------
##NTUPLES= NMR FID
##VAR_NAME=  TIME,          FID/REAL,        FID/IMAG
##SYMBOL=    X,             R,               I
##VAR_TYPE=  INDEPENDENT,   DEPENDENT,       DEPENDENT
##VAR_FORM=  AFFN,          ASDF,            ASDF
##VAR_DIM=   8192,          8192,            8192
##UNITS=     SECONDS,       ARBITRARY UNITS, ARBITRARY UNITS
##FACTOR=    0.0002768,     1,               1
##FIRST=     0,             0,               0
##LAST=      2.2672688,     0,               0
##MIN=       0,             -109845,         0
##MAX=       2.2672688,     122513,          0
$$ Real data points
##PAGE= N=1
##DATA TABLE= (X++(R..R)), XYDATA
$$ [...]
2035d418O38J813L316K921O25j104j992k476k425j420r7J826L264K886R99k85
2051D071j168k165l029k269k88J502K859K562J547P28l66k166l380k483o52R72
2067c725K004K363K313J589J25k080l243k466j032J14J152K267K883K161L92j691
2083C126k671k301j640r44N13K230L173K364O30r33j802k200k436j702R3K071
2099b429K937K375J097L9j012k287k946k195j33J613K368K189J808J001m83k273
2115A669l201k220n26P39J736K202K436J712k30k077k779k108j167j76R97K268
2131g25K914K009K07j599k201j993j942j116O49K373K858K042O52o91j515k142
2147b20k654j657L91K098K431K039J340J56r52k236k985j934J04J446J830K085
$$ y = [-4418, -3780, -1967, 1349, 4270, 4895, 3791, 1799, -677, -3102, -4522, -4619, -2793, 471, 3357, 4356, 4071, 2903, 738, -2291, -4560, -4848, -3346, -487, 2075, 3622, 4350, 3984, 1818, -1562, -4045, -4697, -3725, -1721, 642, 2955, 4544, 4669, 2589, -654, -3120, -4152, -4038, -2886, -619, 2264, 4425, 4817, 3126, 455, -1846, -3486, -4430, -3917, -1687, 1486, 3850, 4480, 3547, 1745, -455, -2891, -4593, -4500, -2429, 508, 2883, 3980, 4019, 3007, 720, -2226, -4421, -4554, -2941, -573, 1616, 3424, 4425, 3942, 1669, -1532, -3752, -4278, -3539, -1803, 399, 2835, 4547, 4317, 2240, -539, -2647, -3814, -3990, -2993, -725, 2189, 4198, 4405, 2806, 605, -1388, -3330, -4446, -3797, -1424, 1434, 3476, 4128, 3437, 1922, -220, -2874, -4531, -4140, -2042, 389, 2428, 3768, 3924, 2972, 736, -2249, -4183, -4079, -2633, -803, 1282]
2163A282K162Q72o37k273k822k056l38M71J287K229K790J384m64j817k385k090
2179b405j179l01P84K519K992J583j90r82j892k309j939q80N64K325K817J632
2195C139M58p9j394k555k386j253J67J896K469J668J229P45j044k722k520j417
2211c599k81J109J958J920J959J285q19k519k273j514r33J70J577K256K395J538
2227D229n48j971j824j685j789n44J438K282K422J653J0j195j358k046k424r26
2243d276J256J975K083J834Q36n20j176k146k847j114Q52J356J616K374J548R7
2259C748j024k210k722j356L44N64J256K581K234M27p63j866k386j521n43j34
2275c371J116K791K397O29l22j131k136j919j337n52J014K727K219Q42L31l14
$$ y = [1282, 3444, 4316, 3679, 1406, -1416, -3472, -3810, -3339, -2052, 177, 2967, 4351, 3887, 2070, -315, -2405, -3584, -3885, -3101, -582, 2410, 3993, 3803, 2821, 929, -1380, -3319, -4199, -3635, -1310, 1507, 3139, 3597, 3518, 2124, -431, -2817, -4070, -3903, -2007, 462, 2130, 3359, 4104, 3060, 338, -2182, -3599, -3880, -2771, -813, 1107, 3066, 4351, 3532, 1013, -1260, -2774, -3707, -3537, -1960, 296, 2691, 4229, 3681, 1710, -114, -1799, -3588, -4132, -2694, -412, 2010, 3663, 3673, 2478, 1120, -926, -3350, -4276, -3020, -1045, 1038, 2872, 3708, 3188, 2012, -134, -2981, -4095, -3243, -1887, -271, 2103, 3651, 3748, 2724, 514, -2208, -3564, -3220, -2656, -1400, 1181, 3415, 3842, 3079, 1213, -1173, -2694, -3237, -3371, -2255, 536, 2933, 3562, 3240, 2109, -27, -1946, -3283, -3835, -2821, -94, 2125, 2967, 3298, 2984]
2291B984j936k313j679q90O45K281J954J213J157K84j791k603j795j037J43J661
2307a722J716J500J831O07j582k342j624j274o34Q78J645J991K148Q94j307j953
2323G72j320j700j409L63J670J983K217J052p37j153j247k110k020Q6J489J668
2339c96K053J396J07o16j147k561k211j58J123J157J840J987P59k59j142k463
2355e31k218l28M56M29J783K488J254k7r02k127k090q38l50J06J789K708J398
2372C000J26m13j570k003j351r35k98J674K691J367N61K03r56j966j879j429m11
2389c589J429K221J312J021J058o44k101j942j426o68P70J642J379J486J621k63
2405C306k041j831j362j168L6J277J442J938J834q2j673j339j340j709o30R03
$$ y = [2984, 1048, -1265, -2944, -3834, -3189, -908, 1046, 2259, 3416, 3700, 1909, -694, -2489, -3526, -3383, -1722, -6, 1494, 3325, 3932, 2350, 8, -1616, -2890, -3524, -2646, -1001, 990, 3138, 4032, 2725, 772, -548, -2248, -3657, -3294, -1624, 359, 2576, 3628, 2891, 1738, 491, -1619, -3639, -3553, -2064, -396, 1657, 3053, 3160, 2544, 1397, -1164, -3375, -3533, -2410, -1253, 587, 2574, 3333, 3074, 1932, -531, -2749, -3077, -2621, -2192, -409, 2079, 3333, 3306, 2404, 277, -1813, -2651, -3001, -2895, -1106, 1602, 3000, 3126, 2713, 1143, -860, -2211, -3146, -3444, -1770, 921, 2288, 2849, 3052, 2096, 130, -1749, -3178, -3589, -2160, 61, 1373, 2394, 3452, 2808, 707, -1235, -2661, -3329, -2559, -917, 462, 1948, 3569, 3306, 1265, -566, -1928, -3096, -3060, -1783, -341, 1597, 3431, 3349, 1676, 337, -1003, -2712, -3342, -2439]
2421b439J531J976J858K46r63r60j466k189j148P04J394J831J850O91k79n31j616
2438D90k514j303N01R49J300J892J305L71l10j600k529j255P0K51Q93K057J854
2455B422O70j68j362k239j308n42l08O04K160K105P44Q2q46j752j548r74r77M49
2473b788K157J994R39M90k07j379j771j464j202K51J817J668J014J115M17j129
2489A922j796j740j248q1J212J362J203J623R51j037j858j448j353n79N67J073
2505a227J466J970J101q50j389j198j462j194l3R79J597K030J187m66q11j010
2521F90j665j688l66Q01J422J906J241K43k82p57j963j996m75N73J004J526J525
2538A739Q03K26p55j942k015o14J32M57J305J850J237M86n62j762j800p54n46
$$ y = [-2439, -908, 1068, 2926, 3172, 2209, 1249, -217, -2406, -3554, -2850, -1456, 375, 2225, 2916, 2637, 2106, 490, -2024, -3327, -2826, -1877, -577, 1315, 2620, 2991, 2681, 1081, -1448, -2703, -2633, -2382, -1489, 568, 2422, 3092, 2924, 1562, -677, -1985, -2527, -2835, -2231, -71, 2034, 2778, 2860, 2014, 262, -1286, -2260, -3237, -2788, -631, 1363, 2302, 2792, 2585, 1206, -565, -2029, -3231, -2980, -1163, 505, 1519, 2634, 3051, 1922, 126, -1614, -2862, -2943, -1731, -369, 834, 2457, 3408, 2371, 513, -935, -2288, -2867, -2300, -1227, 239, 2209, 3310, 2460, 1071, -127, -1589, -2783, -2816, -1837, -240, 1790, 2977, 2511, 1700, 690, -975, -2663, -3029, -2228, -806, 1100, 2341, 2584, 2302, 1545, -418, -2414, -2889, -2316, -1312, 214, 1739, 2542, 2768, 2013, 71, -1944, -2558, -2426, -1969, -664, 1186, 2423, 2909, 2347, 585, -1215, -1969, -2515]
2555b515m3J190J973J571N65l07j214j510j153j045m41J096K011J456P58J64o32
2572A924j396j481j461o01Q98J768J298R34P83k17j267j705j551p40N32J137J194
2589D9J356J294R7j182j638j499q68n4O08J180J589J633K88j036j279j325j192
2606a979o39K67J028J821J685M68o54p40j202j590j103M6R81J591J591P23j5l03
2624A976j250j811j363j89P69J221J388J096O67j04j181j865j450l17K49Q42J325
2641CJ517J039lj006j664j284p14k59L80J355J754J242J26p03j220j241j088q25
2659b591J93J375J725J210M26k37p55j342j451j128M6J129J459J171Q26K81m03
2676A934j338j695j247j01P28J033J221J261Q13l10j316j578j263l62J08P79J289
$$ y = [-2515, -2558, -1368, 605, 2176, 2741, 2434, 1220, -290, -1443, -2488, -2929, -1833, 178, 1634, 2392, 2556, 1924, 528, -953, -2414, -3015, -2117, -349, 949, 1883, 2666, 2449, 1182, -523, -2074, -2814, -2282, -1145, 49, 1405, 2699, 2796, 1614, -24, -1523, -2391, -2445, -1837, -657, 932, 2565, 2853, 1817, 538, -787, -1979, -2618, -2351, -1323, 498, 2183, 2651, 1997, 1257, 55, -1535, -2638, -2592, -1611, -20, 1571, 2294, 2279, 1976, 726, -1085, -2448, -2637, -1868, -647, 741, 1837, 2504, 2400, 1219, -646, -2096, -2413, -2164, -1322, 3, 1520, 2559, 2556, 1550, -114, -1398, -2112, -2371, -1991, -636, 1118, 2360, 2486, 1783, 563, -678, -1766, -2591, -2398, -1023, 702, 1912, 2338, 2101, 1346, 4, -1447, -2575, -2529, -1400, 59, 1230, 2056, 2337, 1934, 596, -1099, -2346, -2447, -1719, -686, 535, 1796, 2609, 2299, 983, -595, -1858, -2220, -2112, -1333, -44]
2693d4J551J027q5j099j372j124q58l58M50J438J653J018J46o65r59j259j239
2710a779p81L21J351J571R95M61m9p36j352j561r39K46J043J229J052R51L75n42
2728A856j438j568j006o0O15Q79J170J349P42m48j271j370j108n19J90O04J419
2745C6J571Q35l46q65j101j117j033l12N16J461J518Q91M8m36p54j488j342n30
2763b448L65J258J444R27M61Q0o36j617j478o29K04P91J144J172R01M83o18j556
2781B48j406o55k06K67J027J290J219O70m28j357j227p66o80j27Q60J496J262
2798A487O96j54q73j018j011j156m65R04J450J123Q46K91m16q82j282j388o80
2815b528P11J153R60J050Q69j57q88j284j387o96L24P08Q48J260J161J47p99j101
$$ y = [-44, 1507, 2534, 2449, 1350, -22, -1146, -2004, -2362, -1912, -474, 1179, 2197, 2343, 1678, 719, -540, -1779, -2560, -2239, -888, 683, 1678, 2139, 2090, 1354, 2, -1559, -2498, -2252, -1209, 20, 1072, 2023, 2398, 1856, 418, -1150, -2156, -2216, -1601, -722, 448, 1797, 2539, 2091, 820, -550, -1658, -2177, -1987, -1383, 36, 1607, 2442, 2096, 1231, 130, -987, -2020, -2332, -1816, -355, 1163, 2054, 2102, 1666, 912, -576, -1918, -2448, -2083, -825, 619, 1546, 2007, 2087, 1451, -166, -1644, -2273, -2069, -1278, -134, 1038, 1939, 2422, 1804, 248, -1158, -1813, -2019, -1752, -725, 565, 1784, 2454, 2026, 669, -558, -1324, -2004, -2131, -1271, 225, 1487, 2183, 2029, 1156, 138, -873, -2029, -2494, -1590, -140, 983, 1829, 2120, 1704, 822, -460, -1848, -2528, -1817, -664, 296, 1346, 2215, 2058, 1170, -114, -1501, -2197, -1873, -1165, -317, 943, 2104, 2251, 1452, 351]
2833C51j294q87n5K25P51J467J423K81o80p85j153j081o02O7N78J556J465L37
2851A964j90l80j033j384r47j65O01J350J233N09L08K4j059j576j031k53K37J077
2869g15J146Q05P25K64r71j582j056m31o7N22J184J078R64L78q09j358q66o72
2887a461o51K96J199J227J065N28m92j061q47r61r97P4J133J182R68P43q5o85
2905A175q09j242j251p3R99Q89R64J024L98m35q40j396j266j44N87O18Q14J393
2923A405P17l16p34j147j296m68J73K29R85J642Q51k12n40q61j267p56k94J03
2941a786R62J642R55j1k33m91j243j214n09k2Q68J449Q30L36L04l37j322j351
2959a173o12j43N64J162R17P25N85j88j297j368n77l90J24Q78J004R62Q51j5j237
$$ y = [351, -943, -1830, -1885, -1660, -909, 558, 1981, 2262, 1582, 797, -356, -1437, -2039, -1972, -1394, 162, 1627, 1964, 1774, 1394, 361, -1023, -1970, -2135, -1534, -184, 1049, 1558, 1866, 1890, 831, -745, -1776, -2029, -1792, -715, 431, 1236, 1961, 2225, 1254, -328, -1384, -1815, -1882, -1360, -176, 902, 1866, 2244, 1435, 77, -789, -1461, -2112, -1816, -617, 610, 1675, 2203, 1711, 650, -197, -1158, -2155, -2081, -948, 234, 1202, 1945, 1860, 1175, 366, -876, -2127, -2200, -1201, -312, 652, 1676, 2074, 1639, 799, -597, -1863, -2007, -1420, -802, 12, 1405, 2122, 1806, 1072, -75, -1371, -1839, -1666, -1437, -452, 1190, 2041, 1829, 1289, 428, -839, -1595, -1889, -1786, -824, 818, 1773, 1762, 1529, 1038, -205, -1419, -1928, -1950, -1082, 367, 1197, 1533, 1837, 1500, 178, -1173, -1785, -1928, -1364, -202, 715, 1440, 2025, 1837, 540, -828, -1405, -1795, -1671, -793, 211, 1173, 2024, 2009, 772]
2978G72j048o77p06l16O87J149J099R45J8p92q79o95j069o59N78J150J014R26
2996A497L28k77p57q16j308q36M60J042P41R53P46L9n50r47j392q15L10M53N85
3015e44J077J188K74m61r29j218r60k6J29L53J248J353M41l50n89j077j010l88
3033a489k57L34J233J376M63r5j89q70j116q86m05K03J153J357M52L30R1p11j355
3052c81r41m81P4Q83J073O05O70N49p41j364r57n47j98M62Q98Q62J032N72o58
3071A412j113q51n96o02R7Q86J022J005O70l85p83p10q53r69j96Q89J003J024
3089I50P01m0m67n76j082j117k53O52P52Q82Q95L71j53n67j205j204l07M29M07
3108i32Q02J102P33N0n74j051j213m19L8J46O97J296R36J13m23p82r77p28l74
$$ y = [772, -276, -953, -1659, -1975, -1288, -139, 960, 1905, 1923, 1131, 252, -443, -1512, -2171, -1593, -443, 571, 1497, 1825, 1548, 791, -25, -1333, -2169, -1709, -667, 74, 1027, 1773, 1812, 1262, 315, -1077, -1892, -1582, -1129, -544, 533, 1721, 1995, 1534, 605, -613, -1573, -1599, -1470, -1117, 131, 1484, 1925, 1575, 986, -91, -1101, -1489, -1746, -1412, -179, 1197, 1660, 1565, 1376, 506, -610, -1496, -1901, -1698, -545, 812, 1264, 1594, 1685, 974, -381, -1322, -1803, -1729, -846, 227, 832, 1502, 2051, 1310, -54, -1011, -1558, -1756, -1294, -396, 466, 1498, 2070, 1412, 299, -552, -1148, -1750, -1653, -767, 255, 1260, 1930, 1545, 762, 52, -801, -1770, -1966, -1077, -74, 950, 1651, 1611, 1144, 568, -514, -1631, -1884, -1232, -480, 402, 1297, 1668, 1515, 948, -257, -1461, -1768, -1339, -932, -130, 972, 1705, 1755, 1181, 130, -1083, -1502, -1464, -1318, -621, 675, 1611, 1724, 1301, 519, -458, -1186, -1560]
3127a560r9P38J344R48K14k11m38r20r70o64j88O11J265Q90L78J83j42r12j113
3146f46q66k78M64R24Q17O39O09j5q88j157q06m28J58O04Q05Q53Q85J50q51j004
3166c1p08o26k29K84Q59J098Q90K48o20p42o56r25n28J78Q12J020Q53M00k05m61
3186I11p27j082q39J34O20Q40Q81O43J53j99q47j189q40n7M54N50Q15R57N13j86
3206A505p27j131q26k29N6L06J008J028O77q4o52q24p53n71m00K78R48J138O60
3225A407J24l49o69p98p90o34J61Q06J086P27K99Kl19r69j031o57N5O64P39P63
3245F17O30L77l59q86j044o65j50K85O09Q24Q99N13j63q66r31o60l61q7L90R47
3265h1J001O32q7n47p29p68p09k64L22Q65J047N71J02j60n18r53q83m84K31Q39
$$ y = [-1560, -1659, -921, 423, 1371, 1585, 1374, 936, 16, -954, -1618, -1806, -1195, 70, 960, 1338, 1521, 1379, 467, -646, -1512, -1790, -1326, -402, 415, 1054, 1663, 1648, 760, -397, -1203, -1631, -1473, -869, -64, 789, 1674, 1824, 973, -31, -739, -1365, -1594, -1310, -451, 647, 1537, 1785, 1165, 423, -233, -1158, -1686, -1508, -696, 324, 1177, 1577, 1372, 911, 184, -898, -1737, -1603, -983, -143, 738, 1381, 1534, 1335, 488, -701, -1541, -1598, -1144, -594, 221, 1178, 1691, 1505, 778, -353, -1179, -1408, -1352, -1046, -38, 990, 1667, 1583, 931, 107, -646, -1217, -1617, -1339, -391, 747, 1407, 1531, 1182, 513, -285, -1075, -1709, -1548, -742, 344, 1071, 1370, 1372, 1053, 84, -947, -1604, -1549, -885, -146, 617, 1247, 1624, 1265, 379, -665, -1330, -1480, -1195, -586, 238, 1137, 1650, 1487, 621, -310, -970, -1331, -1418, -1028, -81, 920, 1552, 1465, 918, 189, -579, -1288, -1552, -1230, -365, 682, 1253, 1355, 1195, 677, -276, -1159, -1643, -1412, -573]
3285e73P73P01M73J34n10r90r95n04J12N08O47P58P62L35m25q80r23o36r7J69
3305a161M73R49Q86M45k62p52p25o94m66r2M25Q93J020M92j52m07n91p65q17k81
3325a582M10Q51R23N75J47j50m33r88r25l34L13N54P79P48N06N2l83r93j052l14
3345a296L3L24O14Q34P81K51l98q38q82m92j61o2N77J034P68L01j44o40p48o30
3365g74n20j38M41J105P74L62N6l20o95p89p44l05M50R73N90M61L90o5o32q82
3385b62q22l32K54O84N37O32O87Q8o30q67p44n02oM29N16P83R65N8n69o29o54
3406c84o40l54K14N06R08R10J69l12l42o05r06n56M8N00Q42Q36L53j3j45o09j030
3427f10o41r4L84O12P60N40K82L2n65j087o72j39J41K97P87P76M71R6n47r44p04
$$ y = [-573, 200, 901, 1374, 1508, 998, 8, -987, -1491, -1379, -871, -224, 534, 1296, 1631, 1206, 326, -597, -1233, -1330, -1161, -688, 261, 1147, 1592, 1330, 578, -147, -841, -1307, -1399, -974, -81, 939, 1431, 1279, 872, 281, -484, -1301, -1582, -1172, -321, 602, 1177, 1324, 1174, 741, -247, -1172, -1506, -1193, -639, 140, 888, 1394, 1446, 1063, 70, -982, -1296, -1263, -939, -325, 509, 1290, 1541, 1143, 305, -577, -1069, -1230, -1292, -715, 319, 1087, 1388, 1244, 604, -144, -774, -1294, -1432, -991, 114, 888, 1250, 1306, 986, 291, -498, -1242, -1547, -1097, -124, 466, 927, 1317, 1252, 620, -262, -1084, -1416, -1162, -478, 59, 691, 1378, 1466, 836, -31, -775, -1277, -1283, -854, -338, 445, 1410, 1468, 899, 270, -384, -1024, -1378, -1164, -658, 250, 1160, 1329, 1017, 675, 70, -836, -1392, -1344, -844, -2, 834, 1187, 1174, 1029, 420, -610, -1251, -1345, -961, -349, 411, 951, 1233, 1265, 700, -387, -1059, -1198, -1057, -760, 27, 803, 1274, 1370, 823, -121, -825]
3448h25k23j54J16Q33Q83N18J68l43p59o07m30n36L7Q33Q51N96K89j08m86o44
3468Ip24o08m5O96Q13M16M74K66k87o94p95p30j74N34N06N26P24M94k61p04o75
3489b39o92l48K77L58N39R00N93j77n87n69o25n17p2K43N62R73O60j09l56l39
3509D75p19p75k79K42N43Q59O26J45j04j69p87r52l31R2L27O95P42L33K05q5q33
3530B50r46m11J2J40N37P17N61M26j27p39q35l66k39j72M01R02O85M13K9n65p05
3551c2l66o04l55M54Q02O43M36K26l20n58n15o99m29J86Q04N72M71M56J1n09o29
3572D5q10n96K21O13L54N92P13J27m31o24o59o60J1L11L46O10R28K24l58n18n46
3593a07p36k60Q1K99O77R29K72k02k74m09q07m87j40K64O55Q71L49l1j4m19q12
$$ y = [-825, -1048, -1202, -1086, -253, 630, 1148, 1316, 973, 214, -393, -823, -1359, -1322, -489, 362, 958, 1247, 1139, 653, 9, -715, -1323, -1368, -672, 141, 557, 1031, 1297, 1010, 316, -479, -1209, -1383, -849, -343, 183, 907, 1401, 1140, 436, -239, -931, -1279, -1002, -644, -105, 795, 1388, 1211, 624, 55, -570, -1087, -1159, -916, -354, 619, 1279, 1170, 814, 475, -244, -1019, -1298, -1056, -513, 346, 972, 1117, 1013, 844, 57, -895, -1226, -1134, -807, -112, 630, 963, 1168, 1083, 250, -696, -1107, -1095, -955, -418, 299, 860, 1286, 1159, 420, -415, -781, -1020, -1192, -791, 111, 796, 1209, 1238, 673, -32, -398, -1002, -1357, -903, -101, 542, 978, 1204, 884, 326, -189, -888, -1317, -1131, -327, 245, 716, 1172, 1183, 674, 45, -765, -1361, -1140, -527, -173, 419, 1132, 1259, 828, 204, -455, -1115, -1104, -793, -447, 163, 1091, 1315, 957, 439, -107, -843, -1103, -1022, -723, -46, 883, 1155, 953, 679, 270, -537, -1024, -1164, -900, -245, 626, 975, 944, 930, 511, -301]
3614c01o68j29R4N13P60N13J95K12l90r57o61k37j6K73O54O22M83K79k81q62o20
3635e24l31j74N2N26P34N67L64j67p04n38m03m64j04M47P93O05M34o4l97m46o25
3656d19o62k10N67O11N00M88J80k00l82o93p43k65M01M61M03N72N14p5m36o14
3676bp67k19P7K10M01P64O53K0l99n02o26n15o3J3M31Q02O71J09k04l46n52o75
3698g19l09m3L56Q48N73J96Kq0o12p79l95j29L18O17N41L84K24L8n98p89n07j36
3720i99Q2M38N83N07M60L6n49p01m47l07q6K39N97O53M80J45m19n78m08m17m15
3741a106J39O09O58N45J56j93l69m60o12m75P7N63N52M82L86k5k25m49p29n56
3761a032M8L54M01N65M61K63j63m69p58n14r6J62K44N17O95M24j04m28o33m53
$$ y = [-301, -969, -1098, -1004, -491, 269, 782, 977, 1189, 799, -158, -819, -1056, -1072, -799, -145, 477, 960, 1239, 958, 96, -524, -855, -1029, -977, -451, 283, 850, 1214, 1047, 343, -195, -598, -1062, -1166, -719, 74, 679, 1113, 1049, 652, 206, -419, -1081, -1291, -724, -113, 387, 875, 1055, 855, 473, -220, -963, -1228, -827, -366, 37, 609, 1123, 1048, 612, -2, -769, -988, -911, -701, -300, 464, 1117, 1137, 738, 236, -390, -905, -968, -955, -524, 278, 949, 1058, 854, 508, -44, -719, -1028, -1071, -715, 133, 706, 902, 904, 824, 212, -567, -962, -1091, -773, -156, 385, 769, 993, 1031, 433, -356, -863, -999, -917, -479, 104, 611, 1071, 1107, 558, -143, -590, -897, -983, -744, -147, 506, 986, 1131, 712, 134, -274, -691, -1106, -967, -358, 300, 845, 1001, 808, 439, -21, -633, -1108, -1031, -468, 84, 566, 952, 927, 702, 253, -476, -1032, -984, -630, -229, 336, 797, 1060, 897, 428, -330, -844, -940, -778, -534, -17, 678, 1102, 998, 570, -63, -516]
3781e16l72m5K07N54P09M29l0k45m40n42n23k32J39N08P93L84J35q5k61o51n95
3802f79l62P4M82N58M23L36J69k16o68n95m40qK79M25N00M90L15k03n29o81m34
3823g64o5PL05N78O22L57j23m25n57m43l14j88K53O53O33L19N6k03l70n70n95
3844h34k24K54N47N43M15J24L4k79o20o46k75J33L88M25M36M69J20k13p31n87
3864e21l07m1J81L85N90N01K73k34n35n37m07k61N2L26N98O01L10p8m21m14m65
3885d04m41j76L25N79O11L71L5j99l40n85n83k34L19M76M81L84L28r0k87o00o91
3906g21j54J23K98L12N36M58J11k77n60o26l02RQ4L73O36N02J84k33m09n25l79
3927e60k38r9L86O59N87J17o5k50m58n23l75j82L84O17M46K71J06o5m62n64n29
$$ y = [-516, -888, -933, -726, -172, 537, 966, 936, 691, 251, -291, -814, -1046, -907, -399, 394, 778, 913, 828, 567, -84, -679, -1041, -967, -485, 73, 496, 832, 1001, 785, 117, -478, -918, -926, -647, -222, 278, 768, 1083, 880, 351, -330, -764, -829, -822, -517, 61, 683, 1040, 917, 492, -65, -508, -822, -1010, -757, -104, 529, 848, 904, 701, 331, -239, -834, -1058, -804, -257, 286, 701, 825, 859, 580, -40, -686, -961, -828, -440, -15, 421, 890, 1010, 797, 66, -521, -828, -869, -688, -303, 287, 788, 1061, 827, 292, -245, -652, -913, -861, -535, 63, 664, 974, 896, 475, 61, -404, -845, -1021, -696, -117, 494, 865, 900, 701, 361, -224, -807, -1041, -722, -246, 235, 619, 947, 857, 570, -30, -721, -875, -752, -454, -142, 394, 852, 963, 686, 126, -500, -802, -793, -709, -336, 300, 802, 986, 753, 344, -181, -560, -798, -897, -511, 148, 735, 852, 787, 537, 79, -444, -819, -1001, -617, 0, 446, 717, 823, 758, 296, -268, -797]
3948g97j00J73M75M38L20L83Pl65o92m48k42J01K89L49M69M57J30l74n65l66l48
3969g06j93K25M05N41N30J42k99l96k82n15l98O2M88N27M85K49j45k11l45o24
3989d60m57L7L57L94M41M12O1o5l74o77m75k4K17K56M19N32K48n0l59n35m92j45
4011g39L3R7M86O43L58jk81m64m80l02j28QM91O40L87j6j8l97m56m11k50j28N32
4034c96N60L41J32J27k03n27n13l27k7K86M64L38L95K09j54n54m53l22k07J46
4054f85M18K65N51M00k11l74m95l21k49p4L03L51N06M81m4l29l55l05n56j37J86
4075f74M29N28M45N1k40j51l93n66l11J71K75M20M53K69j1j51m02o93k44P3K25
4096d97L11M70L96J10q3m72n60k53j9j11K96M67N45J72k8l30n32l17k05j20J12
$$ y = [-797, -897, -724, -249, 189, 509, 892, 899, 534, -158, -606, -848, -747, -458, -109, 360, 817, 947, 573, 8, -358, -706, -899, -674, -269, 272, 802, 944, 645, 249, -33, -548, -946, -884, -396, 131, 616, 865, 720, 509, 164, -460, -917, -880, -523, -129, 312, 724, 785, 720, 346, -331, -806, -830, -613, -357, 62, 594, 842, 792, 433, -102, -594, -739, -706, -609, -123, 520, 878, 877, 596, 132, -348, -650, -778, -770, -279, 361, 748, 732, 714, 317, -139, -550, -800, -928, -396, 164, 505, 637, 764, 561, 34, -479, -806, -833, -547, -83, 255, 650, 859, 705, 151, -302, -624, -831, -685, -267, -2, 549, 949, 738, 364, -131, -452, -701, -775, -472, -121, 385, 866, 822, 493, 138, -167, -723, -860, -674, -245, 283, 728, 779, 539, 388, -5, -571, -882, -711, -436, -16, 437, 706, 695, 544, 142, -551, -795, -722, -497, -186, 284, 680, 790, 707, 235, -325, -578, -597, -708, -412, 55, 600, 772, 744, 414, -118, -435, -640, -760, -648]
4117f48O54M59K42L4k13l96m08k78l21J26N52M82J93K07j6k58n22m40k81R2M05
4138c35L98J98L89J94l18n30l40l59n0L11K46L88M57K87l19m43l61l34k34J26
4158f29K48L78N83K56j99l21k18m66l86j3K91M08M52L85j84r3k25m85m87q1K23
4179e63K82M91L57J09J0k55n00n49j12J14K21M04L68K80P6j74n19n02r8n4L8L66
4201b10M50L85J53j62m17m63j68j96j04L14N79L87J25Ok99l84l08m11p4L49M75
4222B7L47J67J61j36m02l16m55j87K13M15L37K35L73q4l18m45m62j48N7K70K58
4243i3L97M27j2k55m03l82k98n3J52K81M21N35N4k88k41l22m12k23M5L34M63M64
4265E91P1j16r6l19n43k35q2K76L66M49J61J01p6k16o04l56m1J03K58L95L66K26
$$ y = [-648, 6, 465, 707, 741, 528, 132, -276, -554, -875, -749, -197, 285, 478, 685, 669, 411, -111, -551, -832, -740, -335, 63, 261, 650, 844, 526, -4, -344, -703, -753, -442, -196, 192, 649, 936, 617, 174, -187, -521, -755, -629, -381, -3, 580, 836, 637, 316, 98, -368, -754, -767, -476, -68, 384, 769, 585, 492, 267, -218, -705, -786, -563, -281, 210, 567, 676, 686, 431, -69, -618, -730, -616, -395, 9, 377, 657, 733, 559, 40, -462, -560, -614, -576, -210, 240, 625, 778, 616, 199, -264, -432, -628, -732, -418, 161, 548, 673, 679, 380, -4, -312, -723, -797, -448, 27, 374, 541, 702, 566, 164, -152, -607, -794, -581, -166, 171, 406, 779, 695, 377, -68, -530, -678, -621, -351, -93, 304, 731, 719, 464, 61, -321, -619, -672, -520, -239, 182, 717, 771, 483, 242, -80, -492, -715, -670, -336, 127, 591, 662, 546, 450, 131, -412, -647, -729, -453, -87, 362, 523, 624, 548, 332, -272, -628, -669, -566, -308, 87, 453, 679]
4287F79nk70n53l45q7k7K23K77M26L44L3k20m69k41k15k28K3M34M77L03J26j28
4309E57l42k68l41l06K6M20L83K76J88K4j79l37m43l46m1L33L21L16K77J49j13
4330E54l39m18l62l3J05K65K59M02K91j18l22l51l63j76mJ82L54M36L18m1k11
4351D28l46l07k44j27PM10M69K43O3r4j82l20m73k17N2L64L78K51J43J19j11m15
4373I1m16l02K8J96L10K57L02J65r4l62m30j95j15M4K36K83M17K47j25k81k92
4394c6k98j30k24K29L78M01K60Pj75l28k77k92j78J48L57L36K14J84j02j42l91
4415e9l54k28J05K69L17K30K26J30k21l22l52k58k5J44K40L28K59K28j65l26l54
4436a88j32k08K5K13L14M14J62p0k32k64l14k14j21J58M03L49K40K3j73k23l43
$$ y = [679, 674, 404, -149, -494, -581, -608, -385, -108, 318, 662, 695, 475, 6, -235, -450, -678, -655, -221, 256, 559, 685, 557, 215, -53, -394, -700, -674, -254, 129, 405, 593, 617, 438, 101, -342, -688, -729, -396, -75, 241, 518, 667, 554, 215, -203, -565, -598, -493, -228, 31, 433, 724, 606, 284, -67, -430, -606, -610, -428, -74, 362, 680, 639, 428, 82, -225, -469, -596, -589, -179, 290, 533, 596, 502, 320, 0, -473, -690, -638, -274, 104, 355, 498, 617, 506, 91, -325, -627, -599, -403, -93, 164, 466, 631, 537, 175, -255, -450, -565, -521, -285, -2, 415, 662, 537, 256, -36, -334, -464, -688, -459, -81, 320, 580, 587, 412, 84, -193, -485, -663, -515, -158, 178, 392, 576, 474, 332, -59, -413, -641, -536, -267, 50, 280, 506, 636, 415, 93, -259, -517, -542, -398, -158, 170, 429, 657, 492, 166, -188, -320, -528, -503, -290, 24, 438, 600, 530, 298, 34, -280, -494, -615, -457, -54, 295, 535, 558, 385, 162, -181]
4457a81k73j76J47L44K75K39J53J8k19l93l41k42J75J86L07J93K99J19k05l26
4477I9l07k51l8P9K18L94K59K05j74k75l42k49j37k7K10L66M04Q8p9j53k44k78
4499b32k05p5P2L82L04J88M6m3k17l41l14p0N4K76K16L23J01N7j79m22k57j35
4521d71L6J04K71L12J83J65j16m10k96j56j50M2K94L33K45J71p3l42j53k82k87
4542e80L3K74L21K76J93p8j14k69k96k75q1K10L19K15K43R5o1j98l05l85l9J24
4564c78K12J67L10K22j3j42m33k50k00J15O3K78K87K72K6j29k86k77k23p5PK28
4586b19L99K19Q9l6k18l20k28j38o8J64M28K39J04pk1l01l15j82j17J86K33K98
4608A89J67J30J1l23l17k25j19R3K24J83K95J96M6k80l27j51k01q6J19K76L18
$$ y = [-181, -454, -630, -483, -139, 136, 375, 528, 546, 327, -66, -407, -649, -474, -288, 19, 212, 511, 630, 425, 99, -208, -459, -497, -418, -200, 194, 453, 658, 484, 209, -133, -382, -519, -546, -336, 30, 434, 522, 443, 290, 46, -232, -437, -512, -440, -58, 246, 434, 480, 437, 220, -121, -435, -505, -451, -175, 41, 364, 465, 522, 343, -79, -336, -471, -435, -331, -60, 252, 435, 600, 484, 74, -222, -378, -528, -486, -192, 141, 386, 557, 484, 142, -11, -293, -580, -547, -273, 48, 324, 517, 439, 325, 56, -240, -515, -596, -386, -67, 148, 391, 486, 425, 227, -78, -463, -502, -378, -166, 1, 311, 533, 520, 378, -55, -305, -505, -390, -327, -49, 238, 510, 536, 407, 121, -156, -379, -454, -447, -219, 180, 399, 488, 452, 234, -86, -314, -452, -520, -356, 72, 311, 415, 408, 387, 86, -229, -411, -528, -342, -109, 189, 356, 486, 497, 174, -143, -368, -487, -394, -170, 13, 308, 504, 550, 270, -57, -208, -409, -495, -376, -100, 218]
4629B18K83L0k13k41j33k84j30M1K47K03L56J17k22rk21l33k43N6K17K19K95J46
4651C99Nm8j87m05j86L6J06J38K07L15J12q5j86l17k71lj5R0L31K75J55j0j12
4674C44m15j90q6j09N0L01L15K12k9k2k33l00j10k10k4L26L69P3J06P9j52l04
4696ik12k27k2K23K78J40J78J94k06k63k00k42n7J14J94J84J93J93o5l02k48j19
4718b81j29k6J81K16K45K94k0k33j57k29k72p4J38K47K91K33J3j07j79k30l23
4739d02k7J34N7K77L05N9mo1k68m02j12Q6R5K35K47K12j7l9l40k60j49LK4R1L52
4764I6K42J10l3k28l28j08q3m5R9K93K93J05J3k00k09j08k36j43N6L19K84J13
4786C02L1M7j69k52j73j98P9J71K23J73J55J5j86j70l06r4J8Q4J55K18K32Q2j25
$$ y = [218, 501, 531, 318, 77, -56, -340, -470, -429, -182, 21, 377, 494, 272, 263, 42, -291, -534, -478, -261, -42, 253, 399, 404, 356, 169, -236, -422, -386, -280, -142, 65, 380, 492, 407, 221, -96, -367, -370, -385, -295, 36, 311, 466, 456, 344, -71, -261, -347, -456, -406, -105, 210, 422, 393, 371, 138, -162, -272, -482, -506, -180, 189, 262, 368, 447, 295, -9, -221, -448, -470, -247, 31, 171, 349, 543, 337, 74, -126, -368, -425, -311, -117, 67, 260, 453, 388, 86, -162, -281, -410, -436, -255, -39, 206, 500, 480, 247, 90, -139, -411, -485, -347, -100, 191, 424, 437, 330, 151, -79, -402, -429, -295, -238, 39, 344, 403, 399, 338, 70, -332, -444, -358, -263, -28, 219, 431, 414, 375, 35, -225, -374, -371, -347, -256, 96, 338, 448, 415, 187, -141, -249, -332, -377, -278, 15, 308, 413, 426, 226, 17, -91, -327, -470, -414, -95, 189, 302, 333, 380, 211, -41, -214, -412, -333, -162, 61, 234, 389, 404, 218, 48, -258, -352, -334, -250, -95, 123, 355, 437, 312]
4809C12k67j75j67j37J24J48J80K89J25j34j17k02j36k11k8K00J02L36J70q5j33
4830A94p3k21k79j4J12J80K17J43P1mo7l29k62n0O5J17J47K21J28P1p1l44k24
4853b72Ql5K1J68K47K06K6kk71k57p8j04n5K00K56K22M1O3j51k18j56k56K1J33
4877b43K42J44J10O8Nk53k24j33r2Q3K13J67J71J39o2j86k35k27o9J9J76J76J81
4900A70J88oj24k37j81j38O1J8R8K93K24pm3j96k63j16q5rJ31K80K10O2p2k8j38
4925I2l33j09o9J56K38K28O2j2m7r4k46j94k8Q4J34J83J99N9rr6k45k08j4k2M6
4950b45K22K36J25Qj42j89j44p2j10rJ92K28K10n4N8k14j09k31j21M4J04K49J01
4973A37J86J2j26j79k27j21KQ8J71J58J30J41q0k19k37j02p7R4J14R8K04J68n
$$ y = [312, 45, -130, -297, -434, -310, -162, 18, 307, 432, 298, 181, -21, -157, -368, -396, -196, -94, 242, 412, 327, 194, 121, -100, -379, -393, -281, -101, 116, 259, 330, 326, 259, -70, -332, -382, -317, -200, -53, 168, 296, 367, 296, -48, -272, -264, -299, -278, -110, 137, 343, 369, 367, 96, -161, -239, -343, -398, -198, 58, 280, 321, 384, 233, 15, -141, -397, -376, -243, -1, 143, 253, 321, 326, 73, -151, -284, -376, -293, -80, 87, 258, 397, 335, 149, -86, -313, -382, -363, -187, -11, 170, 358, 352, 228, -9, -190, -328, -267, -249, -151, 142, 366, 359, 316, 120, -143, -259, -344, -353, -222, 58, 268, 330, 258, 230, 92, -241, -350, -419, -263, -25, 203, 265, 253, 206, 112, -134, -328, -356, -272, -138, 45, 244, 303, 294, 198, -47, -255, -269, -291, -245, -23, 213, 338, 346, 204, 15, -129, -201, -311, -320, -128, 100, 310, 256, 314, 100, -9, -240, -361, -317, -213, 36, 137, 323, 335, 209, 30, -197, -318, -316, -228, -57, 101, 231, 372, 292, 73, -164, -266, -343, -249, -135, -37, 167, 335, 330]
4996C30j50j29k35j00QK3J98K46J59k0j75j02j39j54j33J24J32J95K08n7lp3j97
5019d4j55j16n0K23J82J98K7M3j42j21j94j09l1M7J65J63J26J11l7j72j94j53
5041b33n0QJ57J05K68J02k9j60j65j65j39K0J2K10K38J25m4k4j93r1j87j62J10
5064b87J92K30R6O0j4p7j66k39q2k2J23J95J37O9R4n5j39k38j71l0J54J23J05
5087E8J66N9j7j76j58j40k2n3N8K22K08O3o3n0j33j32j44o1P9J71J87J09M2j14
5111A59o5j30j27r0O3R1J18J52J44k4j06j48k29j01O9R4J11P9K16M4j07j82j38
5134a07j07J4j3P4J66K17K7o9p1j32k06lj10J29K06J52O4m3j1j58n5j84j1JJ49
5159h1K46J6P6o1q4k22r0k7rJ82J11J15R6Oq0k07j43j32j9J67P8P4J46K11j63
$$ y = [330, 180, 51, -184, -284, -276, -253, -55, 191, 350, 330, 155, 53, -86, -240, -373, -249, -117, 78, 286, 229, 226, 153, -44, -199, -315, -365, -142, 40, 238, 265, 308, 166, 45, -149, -258, -289, -242, -77, 86, 212, 323, 286, 114, -80, -233, -283, -275, -118, -13, 255, 357, 328, 168, 3, -162, -301, -281, -269, -59, 179, 304, 260, 236, 43, -48, -235, -397, -287, -95, 135, 231, 291, 277, 200, 34, -205, -287, -309, -186, 9, 146, 215, 309, 254, 115, -123, -294, -324, -170, -47, 58, 224, 283, 266, 90, -68, -208, -230, -283, -225, -3, 205, 268, 205, 155, 22, -110, -254, -315, -236, -65, 122, 231, 273, 159, 94, -36, -163, -253, -190, -99, 19, 171, 315, 291, 185, 37, -192, -293, -224, -130, -19, 60, 276, 320, 213, 31, -107, -214, -200, -213, -139, 27, 244, 271, 202, 131, -1, -207, -210, -320, -191, 15, 167, 231, 188, 177, 19, -36, -220, -231, -230, -81, 165, 181, 257, 196, 112, -110, -200, -227, -236, -54, 57, 172, 268, 274, 194, -13, -156, -288, -307, -140, -62, 12, 158, 369, 206]
5184B06j59j70J7j95O7J41J06K40Jj9p9j85q9j21m6J08J70J36R5P3j20o9j85j44
5208b21M3k2J53J45O0R4o1k7k15j56n2R2M1Q5J16J71K3m3k18j46q9N0jO1J99J39
5234B21j2p5k2k18n3q5M6KJ99J90J1k0m4j17j79j1n8QJ70K19L5K9j8j79j37q8
5260a86n5m4K42J12P1J25J1j73j65j21k2n9J62J00J39J23k1j24o5r9q7l9o7J26
5284a16J60J50M7o8j04p2j49l1n7J55R7J43O3Qq4m3k04j53J1R9R9J85lJ13q3k8
5310A35k29r8RO7k3J81Q4R5k2o6j61j89L2L1l1J29J75P2Ro9p3j41q1j9kO4J85
5337F4N7J23q6q1j08r5j2j13J21J83K5J00N1n9n0k48l3q3O0J45N1J44K6M6j35
5362I3j34j14n4l3J19J52P7J25M2j71r2p6q6j06J22J22O5J34O6j11q0j06r6n8
$$ y = [206, 47, -123, -106, -301, -234, -93, 13, 253, 254, 235, 156, -29, -118, -239, -285, -177, -7, 129, 224, 297, 177, 108, -77, -221, -178, -200, -47, 98, 158, 252, 191, 164, -51, -207, -259, -167, -126, -41, 75, 246, 269, 226, 8, -138, -227, -177, -178, -117, 82, 221, 209, 134, 112, -106, -159, -244, -198, -196, 3, 193, 204, 184, 140, 23, -156, -167, -225, -217, -47, 172, 207, 236, 218, 39, -98, -186, -241, -285, -43, 69, 140, 265, 276, 103, -62, -183, -205, -264, -102, -2, 137, 260, 239, 115, 50, -49, -136, -175, -242, -116, 44, 194, 241, 173, 69, -3, -152, -183, -240, -85, 12, 155, 218, 226, 142, 99, -105, -258, -247, -148, -49, 136, 133, 246, 163, 135, -94, -192, -183, -116, -139, 42, 126, 221, 199, 133, -28, -217, -185, -154, -185, -56, 119, 191, 200, 131, 58, -83, -164, -183, -185, -121, 64, 121, 244, 158, 77, -31, -126, -138, -251, -130, 53, 78, 178, 229, 170, 120, -128, -161, -244, -184, -39, 12, 156, 182, 228, 93, -41, -155, -209, -242, -123, 29, 106, 231, 273, 102, 10, -66, -152, -258, -136, -14, 51, 185, 251, 140, 60, -46, -142, -200]
5386b00K4J05J40J05O8p1j00nj71j37K3Q5J04J60J5M1op9j58j24j6L8P2J09J25
5411A47Q6jj35j22j36l9K0K7J51J44N0M4j02j12q1r4Lj8J41J51K2J2k3m9j33n2
5437i9j37P8N3J51Q5j7R4j27m4j20j86N5P7J63l2J66M9J6j95j67m4k7P2L8J41
5462D3Q5N5K9j12r4n3j79N7K9L0J56J98l5j06l6j22j16k8O1M8J35J01L5oj08p9
5488a2j01j26P6N3J22J38j5L9J2j69j27q1J4O3K1R6J27L1J1j35p0r4qk2N2P9J50
5515A24O7k2mk31r8l0O6qJ24K6J34L1l0o9j40q8n2k1J92PJ27R1k8j2r2j01j30
5542a67m4Q2J40M2J38J3o7q5p8j16j2P3K1R9P9P1m3j11j01j4q9O2ML8J63J22j02
5569A18m1j34pj38nP8O4J21J33Lp9j9j00j70PK8J8J76J06l0J4P4j91j13q0OL4
$$ y = [-200, -176, -71, 69, 174, 242, 171, 71, 66, -105, -242, -219, -134, -30, 130, 145, 186, 180, 101, -57, -181, -197, -159, -87, 22, 147, 233, 232, 97, -25, -161, -200, -180, -153, -2, 142, 192, 236, 134, 22, -59, -153, -150, -168, -27, 124, 146, 158, 135, 86, -47, -99, -236, -158, -105, 46, 131, 114, 208, 81, 37, -83, -269, -214, -137, 26, -6, 160, 209, 225, 30, -137, -181, -208, -136, -98, 43, 128, 183, 212, 100, 6, -47, -226, -169, -140, -110, 46, 244, 209, 103, 67, -55, -171, -199, -138, -90, 45, 146, 181, 175, 67, -12, -113, -239, -163, -110, 12, 150, 135, 174, 186, 17, -110, -191, -177, -114, -93, 3, 130, 161, 172, 37, -33, -127, -135, -157, -105, -26, 124, 191, 169, 165, -66, -164, -194, -128, -136, -12, 14, 148, 179, 149, 80, -60, -148, -200, -221, -29, -22, 105, 196, 168, 156, 64, -37, -167, -211, -129, 11, 53, 191, 204, 137, 52, -26, -142, -154, -81, -60, 39, 118, 189, 146, 35, -66, -80, -169, -107, -103, -65, 98, 220, 118, 77, -57, -64, -202, -207, -129, -65, 56, 189, 192, 113, 94, -6, -176, -169, -141, -123, 53, 159, 129, 143, 217, 26, -87, -167, -161, -127]
5596a27P6J43J0P8l3j17q9r0k5l1J04R6J29J06j07Oj24j19l1j7M7P2J38P4l5J6
5622A50n9j10n3j15R1M0P2N1P9J6j11n6j25m2M7K3O1J14O6Q5kj51j58n9QJJ06
5649c1M8J37K8o8r2n0j29J6KO1J12L8R6j4j8j21n6q5k5J3J04J23M7K4k1k1j18
5676@l8j32Q2N3O3R4NJ3k2j10j15p5N2Q2K5R2M4Q4j17q2n6j31oQ2L5J39P9P9p6
5705A43o4q8j09j1N0j9P0J68L7J8l1j54q8m9l3J9J12J04Q5m6J0j8j84j2q8R4m
5732h8P0R9P0Rr5r2r6ql2L3O1J57N3jjj23pq2p5K2O2J30JJ26o0n5m8r7j19K5P6
5763h5Q7P6R5r6J9q3o1j13k9M7J54l5P0J27o6o8o2o1p3O7J1K5J43O9j3k1r0j59
5791a25%L1j5O2J05Q6J6n6m7j17n8l9PJ03J22N2K6l2Lj35m7p2m8K1J21J74p3O3
$$ y = [-127, -51, 92, 102, 180, 147, 30, -59, -149, -174, -205, -101, -5, 124, 230, 123, 129, 5, -114, -145, -162, -115, -43, 95, 169, 134, 150, 91, -19, -72, -187, -96, -56, 16, 67, 146, 162, 51, -5, -130, -172, -125, -102, -41, 73, 139, 224, 222, 71, -87, -146, -138, -137, -31, 17, 154, 182, 114, 22, -28, -157, -141, -139, -78, 34, 72, 168, 154, 136, 15, -41, -126, -151, -138, -34, 89, 136, 160, 139, 118, 0, -38, -170, -88, -35, 28, 122, 127, 140, 118, 8, -107, -182, -130, -48, -23, 69, 113, 197, 80, -2, -58, -189, -195, -113, -78, 61, 140, 219, 143, 79, -9, -118, -129, -79, -98, -28, 140, 177, 195, 164, 10, -78, -127, -160, -141, -29, 75, 160, 114, 124, 106, -78, -90, -178, -84, -88, -18, 81, 151, 160, 65, -27, -123, -131, -163, -130, -69, 88, 141, 140, 139, 16, 9, -73, -148, -126, -64, 66, 67, 193, 133, 78, 30, -67, -186, -161, -85, 2, 78, 173, 77, 96, 13, -48, -161, -190, -143, 11, -24, 46, 173, 107, 39, -23, -84, -157, -90, -79, -54, 89, 158, 145, 124, 34, -125, -125, -94, -109, -47, 58, 144, 160, 104, 57, -60, -118, -157, -150, -47, 75, 127, 153, 121, 124, -11, -58, -130, -178, -157, -36, 138, 65, 128]
5819A28qp0o5o4j11J09jJ55j5J28m1m8j24n5l9pK9M7Q6J21K6r2kj55p7O5pKQ0
5848eJ53j4m8p6K2r7j24O0P7L4R6P5m6m4m1j20r6J0O6R5L7J29l4N2j00j42p1M2
5876a10K8K1O9R5M6j5rr1j04o0m0N8R2J06P3K2n7q7q5q2m7Q9M0J02O2K8mj07m
5905B9o6p6o5R7P9Q8K5L6j19J0o1r3K0QJ11L8K8P6m0j08M0p9o6j2O1M1Q3N4j8
5934A21q2Pq1j22J9Q6M1Q1N4k9mo7j7j14j7l6N3R5O4O6jk7o9j28j3rL4J15J6M0
5964G6N9No0j47n0k8N3O4M6J20P5j42J6j48p0N9p8L6J28M1O9m3j3q9j4m5q8N4
5992a14R6P7L8J6m4q6k5k9l0j1O8P4M5N2l9po4j06m0N2j5R0j0J50m5J5r5r4n3
6021a34l6P9lJ34M0P1p2k5n4r3p4l1J02N1J47J5m0pl8n7j48K6K4R9L8Q9l0K0L0
$$ y = [128, 120, 50, -15, -79, -190, -81, -82, 73, 58, 186, 145, 97, -27, -82, -121, -128, -99, -52, 34, 155, 181, 89, 87, -68, -145, -80, -87, -85, -5, 148, 134, 86, 10, 32, -65, -189, -129, -52, -18, 78, 153, 107, 63, 22, -98, -194, -184, -118, -23, 14, 143, 109, 161, 61, -81, -152, -110, -82, -61, 8, 103, 149, 134, 125, 34, -70, -130, -170, -112, -20, 86, 159, 181, 124, 37, -48, -130, -177, -88, -48, 54, 116, 144, 140, 33, 29, -37, -113, -178, -81, -2, 86, 111, 147, 28, 38, -23, -116, -96, -88, 23, 61, 89, 165, 125, 17, 57, -22, -88, -100, -39, 2, 85, 139, 121, 39, 46, -35, -157, -138, -52, -11, 70, 124, 95, 91, 24, 7, -107, -124, -160, -107, -12, 52, 118, 117, 90, 21, -107, -120, -129, -95, 20, 36, 76, 135, 140, 80, -67, -117, -145, -92, -28, 18, 138, 213, 71, 87, -61, -131, -72, -150, -114, 14, 55, 124, 81, 68, -21, -35, -80, -168, -114, -18, 59, 97, 113, 69, -17, -42, -71, -101, -112, -44, 30, 75, 127, 88, 81, 17, -89, -129, -77, -92, -2, -12, 138, 93, 108, 13, -81, -134, -170, -91, -94, 40, 80, 151, 79, 54, 0, -93, -167, -198, -96, -45, 102, 117, 77, 70, 32, -25, -173, -147, -123, -24, 14, 103, 73, 93, 123]
6050A23j03p5k7l4R6k0J07M1K0J1j48o7k7NJ0P5P7L4L7p1o6l2m3%p3J61m1R2N8
6079A20j6n7q2l0r4K3L0O1O2Q6j8k2N4j45p4m9N7Q1P5k9Q3Rn4o6p8j2%k0Q0M9
6109B4N9N1m9q4p1k1j0k0K9P4P7O1l7q8k2j19K5Nj3J45K8J12o8k5k7o9m8m2L5
6138h8R9M2P4%Qn9j31Mo0P5l0M5J15J1K5j5j31j22M9l4P3kJ00P5l8J2q8n9o3L3
6168h0m1P5J2N7J18o3J7j00p5J5o0M0J01P2j2O5m9n6j04l2l7K2P9R0N0j7jm7j03
6197f4l5p0R7N7K6L5J5P1o0m4j60M1q1N5P4Q0M7O9l2r9n9mn6k6P8P5R8Pm2j1n8
6228B4r3m3m2R2R5J1K2M9m0Oj27k8o6J5L8J11N2j7P1o9j19p4P1nk3J10P1N8K6
6257A76r6m3j17m5L0L9K2R3J8RN6n7p5j01Qm9Q1J28L1k4L0l9m5r3k8Rk9O5N8N7
$$ y = [123, 20, -55, -82, -116, -20, -40, 67, 108, 128, 139, -9, -76, -103, -98, -88, -13, 64, 98, 135, 64, -2, -34, -77, -77, -150, 11, -30, 62, 120, 104, 47, -35, -65, -159, -136, -106, -45, 17, 103, 85, 63, 117, -28, -102, -151, -94, -13, 62, 33, 116, 125, 71, 5, -73, -85, -85, -105, -25, 24, 83, 134, 85, 1, -70, -91, -101, -121, -92, -18, 59, 120, 83, -5, -27, -146, -121, -116, -129, 16, 44, 156, 88, 63, 36, -33, -81, -123, -88, 11, 53, 127, 127, 135, 76, -55, -51, -111, -36, -66, -21, 94, 105, 130, 115, -16, -138, -89, -123, -50, -52, 48, 123, 85, 97, 9, -50, -113, -80, -121, -46, -34, 23, 141, 78, 95, -5, -80, -65, -125, -85, 16, 88, 76, 141, 92, 36, -68, -100, -137, -115, -36, 54, 104, 87, 86, 39, -64, -99, -169, -72, -15, 11, 46, 61, 132, 72, 28, -132, -91, -172, -117, -43, 37, 84, 153, 121, 22, -37, -41, -97, -123, -45, 30, 128, 135, 93, 82, 24, -69, -112, -154, -62, 33, 44, 66, 115, 75, 81, -46, -74, -140, -125, -87, 24, 76, 59, 130, 61, -58, -132, -61, -66, -89, 21, 92, 150, 176, 80, 37, -80, -125, -95, -56, -34, 59, 77, 86, 142, 85, 10, -91, -83, -132, -51, 77, 108, 84, 114, 75, 30, -63, -91, -82, -111, -46, 12, 69]
6287F9RRj7j46j4Qj1L9K6P9Q6j5l9r3r4J6qrN3O3J36O8r6q9p0j4m6l3O7J23L3
6318I0j3j4j3m7j23M1j7O6M4L7O8j0o0jj01j23nJ4J22P4K7N4J1q6o3j26M8J6M9
6347d1LJ24P4nq4k1j03p3m%O8Q9J01J4J1j27n5o7l9M4P1P0N8n5M1J6j34o9jo2
6377a56R8M0K5O6J9J3j10q0l3l6QO6P6O4P4Pp2m8n1o7O5o2Q2J02L3K8n0j13jj20
6407a33K0K2J4J09J2P9n9po2n2q3NL4R1P9P2qk9q3o5j08L5R3k4J10M6nKk8p3j23
6438a19K4J8QN3J11jN3j10o3l7r4L5l3Q6J02O0KJ4j11m4l1n5L7O0N3Q6J3Mo8j07
6468e4m4j4JM7O5M7O4N1n8k6m6j07k5K8L0O2J06M8k7j22q1k6K5o6M7L8N8M7Q0
6497A48j00o5l1r2L0k6R0P8Q8QOr1k0o4j32K4K9J23O0N6k7J5n9j63J5n2J06J2
$$ y = [69, 78, 87, 70, -76, -90, -82, -93, -54, -28, 51, 137, 122, 83, -10, -104, -88, -96, -105, -52, 11, 147, 215, 119, 30, -40, -54, -100, -133, -66, 57, 90, 77, 63, 50, 3, -120, -79, -96, -30, 14, 51, 119, 109, 49, 48, -53, -176, -181, -167, -45, 29, 56, 110, 121, 35, -28, -154, -106, -90, -41, -38, 86, 160, 155, 71, 50, -53, -126, -130, -130, -62, 27, 128, 142, 153, 26, -29, -96, -135, -91, -20, 50, 108, 53, 94, 110, -24, -93, -94, -156, -58, -18, 7, 73, 92, 105, -5, -85, -118, -154, -146, -80, -4, 60, 134, 141, 69, 21, -30, -97, -32, -94, -12, 90, 123, 151, 101, -12, -13, -133, -113, -91, -77, 32, 44, 123, 64, 57, -5, -57, -140, -135, -101, -10, 69, 141, 133, 104, 21, -44, -152, -117, -24, -48, 62, 108, 103, 105, 77, 4, -119, -95, -77, -69, -16, 95, 94, 147, 37, -26, -63, -157, -122, -155, -69, 33, 93, 95, 109, -2, -46, -77, -132, -95, -35, 18, 104, 117, 121, 53, -54, -98, -112, -111, -64, 1, 48, 112, 163, 105, 79, 33, -74, -99, -71, -41, 21, 127, 175, 148, 26, -55, -81, -56, -122, -75, -37, 21, 68, 148, 48, -17, -48, -140, -110, -136, -46, 32, 120, 128, 134, 43, 23, -41, -173, -149, -120, 3, 63, 119, 92, 107, 48, -115, -100, -152, -46, -34]
6525c4J26m6Q1p6K6j40r4R9NPQ8N9L6Qj07p9k7m5m7P5M4P1Q0m9k2n9l9n7QJ5K5
6556f8J20L8N8j2l8r3p8q7M9R7L4O2NM0Jj09n1m6j22J63K2M6N8J7M0j12n1r5J5
6585i7nR7k2J21Pj4j8n0p9n0JN2Q3J6J11j6n1l9qj54L4J0K0O7R7Rjl7o0n3n4q1
6617a64P6R9RR9J3n8o1n7n1N2rL1M7P9M8j01k6l5r3j6k1J3J23J02P3k7n6m7p1
6646b9q3%PN0O7O9M6o2K4o0o9j61J54K4M1O0KM9p4l7q6p9K4K8Q5O4M5M0l3o5p7
6677c6q2j6L5K5P7R0P7n1p0Rj04l3j2L2N5J07N3o3P8j66n2q6KN1N0Q9K1L8k4l5
6707E9n7j34J2o3J15L2J11J0J4m6mj78j5mQR7M0J25O7n4j17r7k9M2l1J0J11Q4
6735A08L8l9m6q1l4l7m0O3P8Q0J2Nn6m9k2j12l6J00m1R2J00O3no6r3r4m2K6J01
$$ y = [-34, 92, 46, 127, 51, 77, -63, -157, -58, -53, -46, 42, 101, 137, 145, 38, -41, -68, -113, -160, -85, -41, 30, 110, 61, 39, -20, -59, -116, -108, -93, -68, 52, 90, 148, 136, 98, 5, -73, -160, -111, -14, 20, 82, 87, 127, 128, 19, -32, -78, -200, -37, -15, 31, 89, 106, 146, 34, -17, -112, -97, -102, -5, -27, 94, 101, 87, 69, 19, -60, -110, -109, -57, 26, 42, 153, 137, 86, 47, 39, -115, -81, -71, -51, 16, 113, 122, 121, 84, 24, -29, -83, -164, -88, 11, 20, 119, 132, 74, 13, -44, -95, -43, -52, -21, 26, 105, 153, 52, 26, -9, -102, -118, -139, -126, -3, 99, 172, 145, 89, 42, -29, -112, -112, -105, -55, 12, 81, 127, 65, 89, 29, -40, -201, -47, -23, 18, 78, 80, 129, 55, 18, -68, -147, -123, -95, -10, 54, 99, 139, 106, 41, -36, -118, -134, -99, -74, 3, 93, 170, 119, 49, 58, -46, -79, -91, -59, -4, 103, 156, 93, 171, 5, -47, -133, -131, -80, -30, 59, 80, 118, 94, 59, 2, -132, -120, -183, -68, -36, 75, 85, 99, 53, 49, -129, -144, -148, -140, -43, -3, 122, 189, 135, 18, -79, -108, -66, -97, -87, 24, 108, 146, 107, 61, -20, -54, -91, -131, -68, 10, 90, 102, 107, 51, 2, -20, -132, -168, -68, -109, -17, 83, 146, 141, 75, -18, -112, -154, -128, -27]
6764b7L3K6P2K2K1r9r4m3qkQ8K3R0L2j4m8n3o4o8JM6R1K5Q9K1r0n6m4q2j6QQ3
6796c7J8J28J6j5m9q3j01l0J4J31k6R1Q4l1k9kj01m7k5J6J3J54J8O5o9j15J5j33
6824a30L2J2K5N9J13m1P7j17l3o4r7L9L2O0R4J08q2m0k4m2m6m9k8O5J42JJ19o8
6852A17o6o4o4l6J0J11PN6N1K4n0o7j07K1m8Q0p6J32J17k9j0n9q7p2J6o4Q4O4
6880iJ24nK0o8r0rj00j5Q0N4P7O9j9j0Jj74o1RK4J10J7N2Q5O7j31q4j12L3%lN3
6911a5P7M5k2K1q9n8j20J1J3R7J17L6L2m2p6p0n5op4N5J05J00O7Pp8n9o4l9K7
6940e7q1O8J08R2oL6m8j34o1j6oJ09L9J8J11m4j21k1n3r1M3ML8J45L8L1j17l6
6968a2q2k2kN5L1L8J27m6rm2n0r7n8L8P6P5N8L5Ok4n4r6o4j5O8M2R4pM7K1pj28
$$ y = [-27, 6, 32, 104, 126, 147, 48, -46, -89, -97, -99, -11, 12, 102, 134, 120, 72, 19, -45, -113, -112, -66, 25, 50, 139, 160, 70, 14, -30, -112, -128, -120, -37, -19, 109, 125, 110, 61, -22, -123, -153, -139, -8, -34, 57, 141, 110, 81, 79, -22, -69, -94, -78, -65, 89, 107, 172, 103, -12, 3, -130, -98, -86, -61, -2, 111, 70, 147, 30, -3, -67, -164, -125, -93, -33, 61, 169, 87, 47, 23, -19, -65, -114, -142, -77, 65, 66, 185, 117, 51, -13, -77, -113, -103, 8, 15, 71, 122, 146, 96, 29, -78, -57, -105, -25, -101, 31, 148, 119, 109, 50, -37, -109, -93, -157, -73, -9, 115, 110, 130, 62, -28, -37, -137, -152, -72, -18, 59, 128, 109, 99, 100, -74, -135, -126, -102, 8, 25, 77, 162, 229, 98, 14, -98, -65, -65, -68, -15, 62, 107, 85, 106, 17, -41, -161, -150, -137, -40, 77, 113, 145, 103, 27, -43, -98, -104, -178, -123, -18, 82, 149, 156, 78, 19, -45, -84, -57, -138, -70, 38, 130, 124, 160, 112, -22, -83, -99, -105, 4, 43, 61, 172, 128, 7, -14, -67, -158, -115, -111, -73, 72, 110, 141, 24, -12, -94, -116, -118, -63, -32, 6, 133, 87, 78, 36, -14, -111, -169, -131, -55, 20, 78, 113, 119, 95, 41, -55, -119, -134, -66, -24, 70, 63, 110, 131, 124, -4]
7000dj44qqN9J00J01k9K7l6q1m6J3j34Q2J3J33L9O3n8p0J2j18n5K9K8J42N1N7
7028A58Kp5n5m5r0m7N3J07jJ08O1p0j10q9Jk8M5M1K2J38%k3j3q6r5j6N4p0J04
7057a9M5J11jr1p3n0Lr1R9mJ30J36k5n1j5r6j00k1n6J40Q0O7%L3n8m6j33l2k7
7086a45O4O5K5J12J7n0o7o3j11J14r9L8J25J09qJk3p8j33O3j22P8R0J00Q3l3m9
7113A03p3j2j79M4j8R7J04K7N9j1p4k3j65mkQ0N3M7L2J31j39k6j65k8m5Q6P6L6
7141A1J15M1m8m4j08o2m3j7J12J16M1K2np5j9q5q3m5O9J28J07Pj9m1J0j25m3k6
7169a09k3R6O5N5JN9n1j20j25L1mN5O1R3R1m2J6j58q6L1p0L1J5J43O2L8l3j28
7197fl0p3m4J0P8R2R9K6k5j08j6q4m9p0N4J15J24j0N4Qp5j05r0n9R5M0O3R4K6
$$ y = [-4, -148, -156, -164, -105, -5, 96, 67, 94, 58, -23, -69, -56, -190, -108, -95, 38, 77, 140, 82, 12, 24, -94, -149, -120, -92, 50, 101, 158, 160, 85, 30, -15, -105, -152, -99, 8, 7, 115, 176, 106, -4, -93, -92, -120, -75, -34, -12, 126, 126, 103, 90, 4, -91, -107, -53, -123, -19, 26, 137, 136, 45, -28, -78, -75, -166, -67, -71, 59, 195, 170, 119, 104, 8, -92, -113, -169, -29, 51, 118, 118, 151, 93, 47, -86, -118, -145, -81, -16, 9, 121, 138, 88, 21, -42, -153, -39, -138, -100, 25, 134, 126, 127, 104, 26, -107, -44, -166, -88, 2, 102, 185, 152, 103, 30, 18, -161, -117, -135, -38, 66, 93, 152, 141, 67, 44, -121, -125, -127, -47, 6, 53, 85, 216, 77, 51, -114, -142, -187, -101, -25, 11, 126, 167, 119, 75, -33, -95, -138, -155, -43, 73, 114, 136, 131, 56, 37, -48, -131, -176, -107, 21, 128, 135, 116, 75, 85, -40, -83, -109, -132, -36, 29, 84, 85, 144, 93, -27, -152, -121, -125, -70, -9, 84, 175, 133, 149, -9, -95, -64, -134, -103, -88, 55, 117, 155, 122, -6, -36, -109, -153, -143, -65, 27, 126, 152, 127, 19, 3, -81, -130, -200, -146, -31, 93, 83, 137, 145, 70, -35, -125, -184, -89, -49, 14, 108, 134]
7226A34L7j18j2j97M3NK7O6P2P8k5K2j16q7r4N3jN7J48J25n2m3o3q0q1p8K8PJ39
7255fP8O2m5nq7o5r0o1P6J18N7Q4N7k4m0j62q8nM1lJ75J3R7k1k0j86J3j12oJ11
7285d4K7R8P6N6p4j05j16n9J6k8J09J21J19l2p5n2n4n5j06K6O4J01M2M5Jj3m2
7312D6j52k3KL3O0O1O0R1l2o3j75n4K6J3L8L3J55L8J6p9r8j06l4j3Q6RJ67J5L7
7341A57j45M5q9j05m0qJ21J21L1P9m6p0n3m1j08jQ1M8R9M5P4p9q9r6o1j1O6O1
7369a4J2J13M5l0p6j10n0jn6Q2J05N1N5L5q4j06l8r9J2N7Q6N9J31m6L2j57Mj46
7397a34n4L2J18O6J80p2lJ1j52j01n4J8N0J00J03L4N7M3k10q5j04jM9J21M5%J21
7424A78k2j19j09p0O0m0p9J63J22J38p9q3m0q6p5nO4O8J52j4Rm5m1o1r1j11M7
$$ y = [134, 171, 53, 41, -156, -113, -108, -81, -15, 57, 135, 110, 132, 16, -71, -165, -112, -113, -56, 92, 217, 165, 122, 59, -21, -102, -180, -152, -145, -6, 72, 134, 89, 84, -3, -68, -158, -219, -143, -25, 32, 116, 173, 149, 109, -53, -141, -146, -105, -108, 67, 80, 177, 156, 136, -50, -37, -149, -155, -44, -17, 81, 157, 213, 139, 34, -82, -141, -125, -153, -44, 77, 196, 164, 89, 37, -17, -72, -178, -152, -88, 13, 55, 100, 101, 88, 46, -106, -129, -127, -94, -34, 27, 87, 178, 146, 83, -92, -146, -120, -107, -69, -36, 119, 157, 173, 94, -4, -110, -144, -157, -71, -62, 105, 120, 157, 12, 57, -32, -137, -177, -185, -64, 57, 88, 167, 121, 51, -2, -43, -151, -152, -71, -23, 76, 121, 195, 116, 27, -69, -130, -141, -75, -14, -2, 111, 156, 126, 50, -60, -110, -111, -167, -85, 20, 71, 126, 161, 77, -29, -67, -166, -154, -97, -11, 48, 179, 133, 165, 8, 12, -134, -188, -156, -38, 28, 208, 136, 133, 144, -8, -109, -163, -145, -95, 5, 108, 142, 199, 242, 32, -53, -157, -158, -109, 12, 57, 57, 178, 156, 37, -72, -142, -82, -122, -201, -38, 84, 222, 143, 60, 20, -66, -141, -146, -82, -14, 138, 124, 133, 88, 47, -14, -105, -216, -169]
7451a69J33N6J10j1O5j31l4j50n1P9rQ8P3P7N0m3q1j36p9rL1L8J48J19j5o0k7
7478F2r8j08m5K6P2J18J09n4Q3o9m1o0j41k5J9J55J20L5L1q7k5o5j79k5P5P1R9
7505E3M9K2L3j02p0q0p3J6O5R8N6N6J3l4j53o1j8k2M6M0N5J43L9K4j87Jj38l9
7533a68RJ06N1R5J20o9n6l8r9j78N2P8O5J16R4kl9p7j00j46M3j2J36J2J10M9J2
7560A64q8q5r6l4j4M2J11R5N8K2m2k03l1n3O9p9J15J13O8M5p9lj07j11Nk5L7J36
7588C0P4rR5k5j59m7j13m0P4J18P5K9N9m3o7j32k4n8j5J34Q5O9P0J0j51m5m9n5
7616a10n3P1Q0N5J44M1p7j03q8j00k6pJ43P4Q5N4o8j13N8j69n5J4O7O3J29k2M3
7643A30J1j37j16n8m7J50N0L7J49m1Jm1j28o6Nk0OJ27J11M3n0k2j02p9ln8j3R2
$$ y = [-169, -36, 20, 130, 119, 184, 53, 19, -131, -182, -103, -112, -24, 49, 126, 176, 133, 52, -84, -163, -172, -141, -103, 45, 164, 149, 89, 62, -36, -144, -189, -163, -91, 27, 136, 82, 165, 96, 55, -5, -146, -171, -152, 3, 123, 158, 189, 102, 77, 12, -167, -192, -117, -46, 53, 102, 124, 157, 55, -15, -95, -168, -152, -87, 11, 67, 123, 136, 102, -51, -112, -130, -152, -106, -66, -11, 132, 171, 195, 8, 9, -129, -168, -159, -53, -2, 93, 213, 144, 88, 50, -49, -227, -175, -97, -32, 84, 178, 176, 137, 60, -40, -186, -143, -155, -19, -7, 103, 152, 164, 76, -9, -105, -139, -153, -111, 0, 95, 153, 175, 133, -70, -101, -154, -85, -164, -49, 64, 132, 177, 98, 95, -12, -123, -118, -143, -106, 30, 104, 95, 190, 165, 6, -41, -154, -194, -120, -2, 73, 102, 161, 118, 51, -81, -105, -163, -178, -44, 41, 110, 180, 190, 39, -6, -55, -110, -163, -92, -12, 43, 187, 228, 151, 48, -40, -140, -166, -173, -30, 44, 129, 183, 115, 2, 60, -109, -164, -150, -83, -20, 109, 87, 130, 141, 4, -112, -170, -217, -67, -17, 20, 169, 128, 129, 88, -40, -106, -101, -121, -115, 12, 123, 166, 116, 94, -8, -87, -90, -148, -161, -69]
7671f9J71N2L2r7qj05q7n8n0J54N9Q3L3Jrj61m6j00kJ62N0k7J02J23q6j23p3q3
7699a62n8J25O5M6O4Q6Kj56k7q6m7K5M8M6R1J65o5o4o9j28l9n6Q5O6O7J13J9L
7727A59j34n4n2j18L2J52R8L9K0k7m1j15j04p1R0K6N9M8J22N4Nj60j67k0J7j4
7753a56Q0R8J36J2J7q9j76Rn4m4K9J80O9P7p7n4n4m0j11m1M3L3K03N0O1m4j00
7780E7p0j30KL4Q1O5O7Q2M2n5j48j56m9m1J37Q2Q3M8P9p5j31n2q8m2KJ48P0Q0
7808A22P6r5q3j4j32M2n4N7Q8J30L3m8m6n5j08k0n7M7J13J29k4L5N7r2j22j15
7834a36k5J5J08J03L8P0K9j13r0j28L5k5j0J20J20L8J6J4j65j15o7k5j5R0J61
7859D3R2L7q9k4r4q0q7L0O2J15Q5N6l3K3m1j37q7j15J65J11K4K5J01p4%j79q0
$$ y = [-69, 102, 154, 186, 89, 81, -24, -111, -169, -219, -65, -6, 77, 110, 111, 102, -59, -105, -205, -207, -45, 5, -22, 80, 203, 117, -6, -79, -162, -220, -95, -30, 16, 80, 166, 168, 12, -15, -101, -148, -123, -75, -29, 62, 227, 162, 98, 29, -99, -138, -194, -109, -43, 24, 137, 156, 159, 25, -29, -81, -199, -167, -15, 83, 122, 142, 115, 74, -41, -145, -216, -126, -100, -41, 7, 129, 183, 188, 28, -139, -159, -142, -156, -76, 22, 158, 170, 187, 98, -78, -69, -123, -167, -138, 42, 111, 188, 111, 57, 3, -37, -148, -189, -146, -113, 90, 140, 201, 157, 57, -13, -143, -141, -107, -26, 39, 106, 188, 230, 175, 27, -129, -178, -219, -82, 0, 83, 131, 210, 135, 4, -48, -136, -178, -176, -28, 42, 122, 198, 103, 20, 6, -126, -84, -138, -81, 7, 137, 170, 122, 76, 21, -87, -107, -164, -117, -4, 125, 101, 136, 193, 101, -21, -136, -161, -146, -38, 65, 103, 173, 202, 89, -1, -129, -94, -119, -129, -9, 111, 149, 165, 179, 14, -101, -168, -193, -208, -118, 43, 135, 172, 83, 59, -35, -115, -202, -172, -110, 5, 90, 146, 113, 136, 95, -42, -129, -244, -79, 32, 56, 81, 182, 108, 108, -71, -151]
7886a51l7N5J06O7Q7L5j0p7q6q7r2N7j2L9J42Q8Q5q2j04j31kp5Q0J9J49N4J00
7913B17n3r9l5j13n3J3j2K08J8M5mk3m1j37o9K7L3N0Q2M2L6Kr4q6q5m2N8J8P8
7942a9J29O3J2o7j42p3%m5j8R9J68P1l6j4j11k9j22l3j1J19R2Q5jL9p9q7o8n6
7970a34p2J52J09K5J9J5K7q9j36k5m4N4L9J07K1M6Q2q2j32j07n6jR1J08Q4O7L6
7997B04j57n0p9o1NqJ29J17P7rk8j10j1j42j04Q8J20N7M6J3L5n9l8j40o6J5O0
8024i6Q8Q1L2P3p5j24j18j7J2LJ05P4J15k1m1m2q8k5l2K8l1J26J24J5m5Oj51o8
8052i2l4n8L6J10J18P7J0l0p8r6q5r4M0J07J48OK0L6j6j58j41K5l4P1J17O2P9
8079A46K1j2j16j13p7K4PQ8O6R5P9j0j91Lo6l0q7P0J02J45l6jk9l2j41n1p0P9
$$ y = [-151, -188, -133, -27, 40, 127, 162, 152, 75, -11, -98, -190, -133, -145, -106, 36, 124, 209, 127, 23, -108, -110, -185, -105, -86, 63, 117, 217, 164, 65, 30, -83, -136, -123, -135, 73, 91, 136, 132, 109, 68, -69, -138, -111, -78, -28, 54, 96, 132, 134, 40, -46, -131, -173, -115, -97, -19, 110, 173, 185, 118, -24, -97, -97, -142, -160, -61, 107, 178, 142, 128, 17, -12, -134, -167, -178, -59, 33, 118, 117, 156, 77, -10, -78, -134, -206, -54, 55, 80, 99, 114, 141, 52, -84, -109, -153, -99, -60, 47, 68, 114, 196, 114, -18, -125, -181, -182, -91, 17, 101, 168, 204, 47, -3, -82, -143, -138, -146, -17, 100, 177, 168, 140, 30, 19, -123, -227, -139, -19, 38, 84, 97, 132, 73, 35, -105, -171, -156, -96, -8, 73, 105, 178, 103, -21, -139, -156, -144, -141, -36, 38, 153, 132, 91, 49, -39, -64, -96, -68, -99, 27, 151, 166, 121, 127, -24, -92, -126, -184, -148, -38, 80, 157, 167, 137, 59, -37, -122, -216, -176, -69, 79, 85, 105, 141, 125, -33, -174, -149, -183, -112, 5, 67, 146, 167, 155, 39, -74, -151, -127, -120, -32, 34, 129, 208, 198, 7, 10, -56, -86, -173, -103, -1, 144, 108, 107, 78, 46, -95, -146, -216, -137]
8107a37J43P1N4nm3m1m2j31l4nQ8N0J07Q8K3j54n2j19k8M7L4M8R4J03M6l2j11
8134F2j19p2Pn3N4J78Q8j1j5j7j89j0r1P3oQ5J82m6L3J5p1j91l1j3K9J58R4l3
8162I0N4nl5j53q3l0L4P2R6L7Q9ql6j50n9n5L3m6J38R6P1O4j03o4j09l9p4L5P1
$$ y = [-137, 6, 77, 131, 126, 83, 42, 0, -131, -165, -170, -82, -32, 75, 163, 186, 32, -20, -139, -167, -120, -86, -38, 56, 159, 205, 173, 62, -57, -129, -122, -175, -121, 57, 145, 134, 119, 102, -87, -97, -188, -115, -121, -36, 146, 100, 133, 148, 77, -114, -145, -158, -129, 29, 123, 90, 144, 139, 104, -49, -132, -162, -128, -56, 40, 77, 166, 158, 122, -28, -87, -142, -109, -155, -17, 79, 150, 214, 111, 47, -62, -101, -175, -140, -69]
8191f9
$$ Imaginary data points
##PAGE= N=2
##DATA TABLE= (X++(I..I)), XYDATA
0@%%%%%%%%%%%%%%%Lj1J6j6J6j7K5l2L4m2M9n7O6p5Q9r9J10j26J45j66J86k08
37a10K34k63K94l27L62m01M46m94N43o00O65p31Q05q89R80j080J190j314J454
56G64j612J793k003K249k546K907l355L933m714N834p581J0718j8129O9922O4333
71A22513p1209m0698o1480m4698j2918L2902M3609P3011N8949N728l4710l1505
83C9494n4307o4544k9663J7979L9638O5225O1407J9982j0731j9070n4294p4319
95f3203l7669R427K8113N0354N8990L3806R414p469m9568p3329m0356k910Q469
108g5931L4115N9586M8404K4178K16m2804o6374m0694j5855r662K2096N9538N4314
121E1127K9149P365k8045n2076m0259l0043k6566J1789N5891N3299L1816J8374
$$ y = [0, 0, 0, 0, 0, 0, 0, 0, 0, 0, 0, 0, 0, 0, 0, 0, 3, -8, 8, -8, 8, -9, 16, -16, 18, -24, 25, -32, 34, -41, 48, -51, 59, -67, 78, -88, 98, -110, 124, -139, 155, -172, 190, -211, 235, -259, 284, -316, 349, -382, 423, -466, 514, -566, 624, -690, 764, -848, 945, -1058, 1191, -1355, 1552, -1803, 2130, -2584, 3250, -4331, 6387, -11742, 58180, 122513, 51304, 10606, -50874, -95572, -108490, -75588, -31979, 41032, 99981, 105709, 70999, 39494, -14813, -79357, -109020, -91041, -51403, 13822, 75229, 95211, 84480, 65410, 11116, -63203, -100872, -91445, -63332, -12978, 46012, 79818, 89232, 81763, 32195, -41134, -81490, -84400, -75931, -41816, 17770, 66174, 90352, 90568, 47764, -18610, -59304, -75159, -84821, -62725, -3187, 51127, 80276, 87641, 59596, 7520, -32739, -62782, -89348, -77559, -21668, 31631, 63447, 81821]
133H1821r767l9730m3184m1483l5374N545M7701M5322L1594K9948P253k9234m3178
146G234m5018l8606l127L2314L4169L3358M2422K1136k1543m0725m2761l9396
158f0543j3823J6160K4997L5844M9968K7736j5200l2146l4205l9376k6118N99
170f6107J7448L6163N1553L0944o197j8878k5317m1851l7587r983J2886L2905
182b4021M7097L1900M795m752j8083m3817m3653j5446P017K3623L9061L4161J7400
195E5282P483j3279m3351m4340j8548j378J1576L1383L7735K7521J4886r280l8403
208A7287l9691k0976j2102r80K5475M0240L2993J8765l404k8576l3334k4981k3414
221e2698j0602K1396L9901L2850K1073N308j6544k7687k9657l1493j6434J7007
$$ y = [81821, 72054, 32324, -10860, -52343, -87717, -82172, -34471, 10851, 42445, 72393, 79646, 50412, 7234, -37784, -76390, -79517, -47203, -13034, 20324, 62746, 83882, 62339, 21614, -21147, -60543, -74366, -58206, -33209, 2635, 52603, 80339, 65139, 32993, -1212, -40588, -66706, -66107, -48659, -12496, 39057, 70001, 63804, 44926, 19609, -22242, -59829, -69812, -56926, -24021, 23076, 54976, 59771, 55019, 36936, -6881, -50534, -65980, -58963, -35340, 3721, 37882, 55282, 62765, 49486, 6135, -38205, -56753, -58131, -46555, -15172, 22563, 50084, 64970, 55690, 17287, -22404, -43380, -55482, -56462, -30987, 9253, 42246, 61011, 57607, 29031, -4303, -29284, -52698, -63300, -41904, -2003, 30847, 51920, 57228, 40684, 12997, -16660, -48153, -64587, -47580]
233d7580L4230K8908K4177J6302n037k4004l2627l4929j9425R982K4587K4358
245a058K8711K6412L256k0922l1746l3546k2103m0J3720K0872L3216L2934Q357
258E8063j6288k6038k9691k6080j1299L948J8906L5272L4956J1875q851j7050
270B7723k5788l0986k1210k744J6529L2934L2983J5860J539p444k3305l5249k7034
283d6192o857J1729K6227K9415K1376J2443K00k1529l6174k8437j0529L866J6970
296b7492K6559K7309K0929N248j8551l2529k6940j5254o224Q161K4806L1487K5392
309D2901Q565j2720k5208k4522k1474j5788J486K3021L1936K6017J2121l998j6235
322B6102k3223k7307k2608k788J9443K7986K4480J6999O204q362k2640l0883k5232
$$ y = [-47580, -13350, 15558, 39735, 56037, 51000, 26996, -5631, -40560, -59985, -50003, -25416, -1058, 27653, 54065, 57321, 36399, 4653, -28893, -50996, -51036, -37316, -16444, 16772, 49706, 58063, 41775, 15737, -13954, -40034, -51333, -47385, -28479, 6793, 41749, 53624, 44773, 27723, 1935, -29051, -50261, -53005, -36476, -3542, 29441, 45301, 46840, 39396, 16091, -19158, -46192, -53049, -41320, -15093, 14322, 35698, 48141, 48341, 26812, -9362, -37799, -48328, -44462, -27492, -933, 26376, 47305, 52553, 34002, 1473, -25467, -40721, -46945, -38784, -13978, 17509, 42901, 51466, 38746, 13538, -10984, -32458, -48246, -46760, -23739, 8197, 34214, 46335, 42337, 26102, 2879, -24428, -47036, -49824, -30381, -2395, 22085, 39084, 45288, 36926, 14286, -16597, -41829]
335d1829o193J2633K0903K3112K2987J5097k789k1309l0175k4839j0511L097J3278
348b6538K2870K8186K0538J165j7558k5576k3343j6375o835P150K2866L0253K2568
361C9371M997j0574j8933k2406k2816j4739L022K1394K8244K2155J0282j432j2364
374B6201k2524k7470j9450k11J6930K2955K1406J7079P426p488k2335k8673k1027
387c7181m160R496J6248K1719K3559J3976m251j9968k5882k1218r926O71J0506
400b6411K2357K7776J7367j119j4341k0653k1627j6625p219O292K2051K8362J8373
413C4583L239o224j4780k2906k2581j2402L034J9123K5486J8612R299K454j0154
426B6783k4128k5661j4705n18J3005K0528J9603J5894R601o838k3812k5125j5383
$$ y = [-41829, -48022, -35389, -14486, 8626, 31613, 46710, 43921, 22612, -7563, -32402, -42913, -39816, -26538, -3668, 24518, 45056, 46221, 28663, 3087, -20256, -36631, -43466, -36316, -13450, 16803, 39371, 44368, 33794, 14861, -7545, -30361, -45100, -42078, -20684, 7560, 29715, 39997, 38565, 26201, 3677, -23793, -43243, -43454, -26524, -3569, 17837, 34916, 42342, 34854, 12519, -16154, -37181, -41341, -31845, -15597, 6122, 29681, 43657, 39406, 19438, -6444, -27662, -37588, -36917, -26411, -4054, 23722, 41089, 39970, 25629, 4976, -16651, -33276, -40495, -34203, -12152, 16210, 34583, 37822, 31598, 16818, -6088, -28669, -41071, -38037, -18914, 6572, 25184, 34483, 36937, 26783, 2655, -23006, -37711, -38229, -25224, -4696, 14907, 30801, 40402, 33564, 9752, -15373, -30756]
439c0756n693M794J6008K1201K1066J3879l864k0435k1636j6036j2519l121J2520
452b4592K2416K2855J5963K77j4099j7202j7536j9201r278J0196K1231K1404J7119
465B9553O197o480j3242j9335k3713j2930P419J6984J7730J8495J3269N51j0476
478B4022j9937k5072j4650K910J0296J3573K0820J9525N464q192j7945k3194j6154
491b8534l243K845J0309K2863K3305Q060n067j2838j9678j8432r975l314P965
504b5734K3183K3760R689o8n956j6535k1172j5327p094N646K0603K1651J1218
517B3864O327R96j4022k3134j7949r260J754J5264J8752J3873J2770O300j2279
530B3256k3114j7628j0743l698Q736J6319J6563J7178R524r906j9867j5107j2915
$$ y = [-30756, -36449, -31655, -15647, 5554, 26620, 40499, 36635, 16200, -5436, -21472, -33991, -37112, -24592, -2176, 20679, 36642, 36919, 22820, 5618, -11918, -31119, -40397, -30201, -8970, 12434, 29553, 35750, 29270, 16028, -3307, -27020, -39950, -32531, -15547, 2183, 20678, 33947, 34498, 24022, 4085, -20987, -35637, -32727, -22431, -8858, 11962, 31487, 36951, 28759, 10814, -12380, -28534, -31777, -28932, -18623, 4240, 27545, 35605, 30538, 17700, -1978, -20410, -30385, -33699, -25734, -2551, 21209, 30898, 30830, 24874, 8339, -12833, -28160, -35254, -29608, -9005, 12646, 23864, 30191, 31187, 17165, -5969, -23918, -33178, -31424, -16160, 2592, 16465, 29235, 35535, 23256, 142, -17486, -28229, -31927, -23191, -6872, 9691, 26869, 36393, 26487, 6620, -8487, -21402]
543b1402j0442K433J4707J8158J8946J1566n576j4522j2923j5929j6370j646J3360
556a9640J7255J7851J3416J80q377j0868j8413k0140m442J0470J3367J5717J6509
569B2885O944l230r894j9681k1334o401O302Q118J3790J9711J2023j21q322j7682
583C108k0056q657J72K106J2440K2257J5262K394n127j3669j8504j2394n947j800
597b8415J1853K2951J5597L988m59q352j7159j5408j0311m446R590K0383J4530
610A4342P156N879l311j6592j8077j2809o355O307J6508J3693J0558J0979j00
623B8178j6006j7783j2293q420Q71J1229J2788J3750J5026K696j3703j5278j1600
636a0545j2170n370P452J3130J5698J6445M410r996j1370j0702j5506j0142M572
$$ y = [-21402, -31844, -29411, -14704, 3454, 22400, 33966, 28390, 13868, 945, -14984, -31354, -33000, -19640, -2385, 15466, 28882, 29062, 20685, 9817, -8596, -28736, -33178, -22708, -9341, 6376, 22885, 29829, 26599, 16705, -2976, -24310, -30711, -24409, -16291, -2501, 17210, 29233, 29112, 20790, 3108, -16948, -25605, -25433, -23327, -10887, 11370, 26632, 29026, 23899, 10230, -8274, -20668, -26615, -28415, -16562, 6389, 21986, 25974, 25515, 17163, 4, -15404, -25715, -30161, -20571, -188, 14342, 21498, 27377, 24066, 7474, -10603, -23412, -29767, -23460, -6952, 6741, 17299, 28278, 28178, 12172, -5611, -17904, -26324, -25453, -14224, -1436, 12314, 27340, 30036, 16333, 1055, -10545, -22715, -28085, -20633, -7503, 8195, 24640, 29050, 19054, 7684, -3018, -18524, -28666, -24094]
649b4094J1997J4631J5932P444l962o760j0802j8792j3565K192R832J2048J5621
662A1722J1279J444l934j0987j9665j4242K32N469P785J4842J5078O032j226r664
676A4165j8256j4331l549q9M082J5567J8165Q573K09p104j5238j4034p261m915
690b4016J471J5377J8314Q942K785k026j1117j4427j1328q815n03J3799J6855
703E311R286O394L249q260j5377j3380j0377k144J0309J3627R459J0234P696n774
717B0253j4884j3396j0757n320N162J0323J0603J3960J0610m043j3218j1718j0961
730a3386q948K47P942J1376J5270J1594j736r250q694j1428j3122m067O037J1120
744g045J4643J2254J829m524o184j2800j6012o324M505Q869J2361J2716N905J48
$$ y = [-24094, -12097, 2534, 18466, 25910, 21948, 15188, 4386, -14406, -27971, -25779, -15947, -3899, 11722, 23001, 24445, 20511, 9524, -10141, -24383, -24151, -18682, -10897, 3945, 19023, 25055, 23829, 14165, -4091, -18422, -21971, -22060, -17978, -2411, 15754, 24327, 24536, 17432, 2194, -11840, -19101, -24016, -22545, -7168, 11146, 20088, 22873, 20847, 9730, -4697, -16025, -24840, -25343, -11544, 5311, 14597, 20991, 24240, 15980, 603, -12777, -23154, -25298, -14989, -1362, 8097, 18331, 26027, 20253, 5369, -8027, -18784, -24104, -18942, -8619, 1984, 15944, 26554, 22511, 9293, -2425, -13386, -22334, -22087, -14145, -2769, 12501, 24095, 22359, 13109, 4415, -7013, -20135, -24202, -18165, -7045, 7598, 19852, 21681, 17157, 10973, -1827, -17839, -24163, -19658, -10789, 1572, 14288, 20193, 20341]
758B0341m311j3252j6942p472J856M811R738J3841J0025L584l007j2472j5837
771i097q326j772L49P599J5021J2608N369j418r642j3383r458o065l643O048J5279
786e31J3188O380J358n427j1221j1062r678o165M752J3976J2012P224N154j030
800A8930r567j2387j1655p456K762J0678J0083Q761R094K531q271j2633j1716
813a0846q334n58O550Q455J0596J2163M610o808j1036j0396r425m632K410P387
827i864J1918J3418N837m327p776q804j1117q472o69O504J1786J2870O969p21
841A7552l872p697j2775j1189k445N059R691J1461Q608L507l96p029j3595j2059
855a5179l774K548O256J0107J0565P219J910o222j2775j1454n247j167K738R138
$$ y = [20341, 16030, 2778, -14164, -21636, -19780, -14969, -5231, 8610, 18635, 22219, 19212, 6740, -9097, -17423, -19195, -18846, -11247, 3774, 16382, 21751, 20333, 10691, -2692, -12150, -18215, -21858, -15810, -531, 12657, 19037, 20395, 14968, 3747, -7315, -16993, -23158, -18406, -4430, 7582, 14806, 19960, 18930, 9363, -3024, -14679, -22135, -19373, -8695, 1388, 10149, 19243, 21774, 13503, 870, -10846, -19180, -19738, -13188, -4733, 5863, 18026, 22636, 15828, 4792, -5604, -15029, -19661, -17251, -9864, 2054, 15472, 21309, 16982, 9206, 402, -10715, -19187, -19856, -13352, -1566, 11304, 18273, 17552, 13680, 5983, -6792, -17981, -20426, -15367, -5676, 5785, 14393, 17900, 17504, 10475, -3120, -15179, -18953, -16405, -10149, -42, 10523, 17742, 19652, 13430, 655, -10799, -16046, -17213, -14475, -5337]
869e337J2340R473L232m513j0306j0164p338n213o6Q490J2920J0094M396j624
883A6384o836r281r633q288j895P468J1800R454O017K141l394q867j1382r953
897a6265k934N375R068Q710Q229N818r24q384j1756r978m268J965N905Q364J0427
912I352Q363N96p195j0333r341o175j922K971Q458J1763R352J954m772p788q783
927c500q497n495J032Q081J1634R174L672j312m929q672j0646p696l11O879R851
942g35Q639N954K563k764q753j1478q533j681M151P170Q418Q629N643j246q243
957G734j0725q479l804P67M542Q551J0710P427k20o453q753q285o486k629K792
972a3311Q520J1278Q023J250l612o174q563r000n140J560P664J0399Q027L381
$$ y = [-5337, 7003, 16476, 19708, 15195, 4889, -5275, -12613, -17826, -17892, -9402, 3518, 13612, 18008, 16384, 9548, 267, -9366, -17654, -19549, -12081, -281, 9173, 15190, 17331, 13937, 5070, -6312, -16265, -19199, -13824, -4756, 3954, 12183, 18001, 17077, 8693, -3063, -13041, -17309, -15344, -9439, -1075, 9352, 17715, 18311, 11116, 783, -8558, -14733, -16655, -13684, -5226, 6537, 15889, 17843, 13071, 5283, -3500, -11997, -17492, -16460, -8379, 3255, 12429, 16101, 14789, 9860, 1188, -9458, -17154, -17465, -10586, -735, 7904, 13858, 16421, 13657, 4904, -6574, -15107, -16788, -12637, -5467, 2951, 11580, 17223, 15977, 7734, -2991, -11470, -15274, -14507, -9965, -1414, 9296, 16723, 16503, 10050, 1297, -6988, -13474, -16103, -13311, -4791, 6487, 14510, 15760, 12148, 5974, -2589, -11589, -16729, -15169, -7505, 2894, 10921, 14302]
986A4302p9l894r088j0738o368L10N646Q435Q189O062L010k400r121j0963o600
1001a3297j420K390O260Q759Q344N201j173q229r893o616l864j054M535R369R631
1016H943O130J29n869p981p002o596l871L372R346R410O357K356k749o264p717
1031b006q758n680K451Q132P926O706N049N08n010q242r622o572R46N653O117
1046b402P346P914K870m119p882r099o986j385K503M596Q312R817M208l134o182
1061F377p668p689m222j75L516Q636J0518M785j345l492o058q747o865k107K640
1076a1896Q009R861N387J081m58m895r790q365l089J465O080Q505O288L813K100
1091A4096m099j0091q623l596o57L294P347P565O163L681l353r330p743m256l305
$$ y = [14302, 14223, 10329, 1241, -9497, -15865, -15555, -9909, -1474, 6715, 12777, 15787, 13387, 4266, -6697, -13297, -14717, -12327, -6067, 2692, 11036, 16237, 15064, 6835, -3058, -9674, -13538, -14592, -10057, -688, 8943, 15073, 15202, 9333, 1352, -5650, -12246, -16117, -12745, -3399, 6011, 12368, 14724, 11975, 5711, -2006, -10764, -16444, -13993, -5861, 2065, 8771, 13820, 14328, 9318, 1076, -8546, -15118, -14172, -8519, -2402, 4944, 12858, 15728, 11609, 3727, -5372, -12358, -13743, -11240, -6644, 1668, 11485, 15693, 12559, 6377, -1291, -8980, -13202, -13377, -9861, -1225, 9293, 14078, 12733, 9241, 3183, -5564, -12429, -14536, -11896, -3887, 5974, 11361, 12442, 11984, 7089, -2701, -11066, -14155, -12690, -6610, 1895, 8183, 11996, 14096, 9997, -94, -8717, -12313, -12970, -9676, -2329, 5236, 11399, 15080, 11727, 2397, -5346, -9602, -12907]
1106a2907M35O607Q504P215M523j815p171o565n501o081j692N951Q578P169N288
1121A2538N10m560n747o768q038l018N245P308O189O188L408k016n223p501q900
1136a0385l885L456N163N149P730O116l66m763p252q619m736J115K636M496Q900
1151D755P768O81l714n620p711o048j896M49M107R647Q389J420j789l371p143
1166g6p642m094q33L689Q984P786K464P36j026o557q830n471j791K323P094P353
1182D109M101L517Q26o553r340n702k522K49N077O847N632N292J908n692q521
1197g72n027l776k614K759O769O829O359K900m226o764m821n475n145J492O803
1212d709O840O249L753j971m597m501o944o755L97N703N674N919N459R16k830
$$ y = [-12907, -12472, -5865, 2639, 9854, 14377, 12562, 5391, -1174, -6675, -12756, -14448, -8497, 81, 7250, 12538, 13048, 8488, 2741, -4027, -12065, -15083, -9838, -2530, 3659, 9847, 13255, 11239, 6016, -1485, -10385, -14270, -10814, -5651, -502, 7228, 13344, 12978, 8215, 963, -7656, -12392, -11277, -8641, -4145, 4755, 12523, 13204, 9490, 3870, -3841, -9889, -11785, -11336, -7229, 2418, 10807, 12227, 10438, 7067, -76, -7718, -11812, -12645, -8956, 28, 7814, 10278, 11014, 9988, 3431, -5399, -10870, -12661, -10338, -3244, 4109, 8210, 11727, 12553, 6000, -3340, -9042, -11564, -11315, -6238, 609, 6241, 11533, 13441, 7749, -772, -5799, -9575, -12189, -9430, -2661, 4168, 10527, 13427, 9201, 2437, -2384, -7859, -13004, -11512, -4709, 2131, 8380, 12133, 10162, 5565, 1064, -5880, -12635, -12238, -6535, -861, 5058, 10517, 11433, 8603]
1227H603m748p923p505n13M246M017N679P120L068j873m496p461p227j798J707
1242i104K026N535Q735M577q72l511o175p194l628q26P83N873R254N023j22j691
1258H683m411p049n334k725j70N314Q561M974J432R90k709p488o805l838q99M168
1274g306P308N066L243L127j742p505p062l999j929K020N561N184N001M829p70
1289A1026o937o356m077l717m65M244N864O168N459k7n422n074m267n482k548
1304a1611L369N791O146N580J395l066l564m864p091m067K583N107N341N802L237
1319A0088q19k682n266p880m434J569L468L884O092N222J107j984n093p589m795
1334i112o8J300K804O742O636K226j348m214o573n117j903q92K120P023P156K694
$$ y = [8603, 3855, -4068, -11573, -12086, -7840, -3823, 1856, 8976, 12044, 10171, 5675, -1786, -9013, -10811, -9104, -7078, -1543, 7192, 11769, 10897, 7386, 1211, -5983, -9611, -10437, -9654, -3781, 5473, 10496, 10374, 8683, 4272, -2777, -8111, -10836, -11006, -5692, 2869, 7843, 9275, 10265, 7556, 68, -6737, -10575, -11474, -7306, 2, 5068, 8311, 11438, 9696, 2191, -4871, -8870, -10799, -8779, -3218, 1966, 6967, 11796, 11026, 4089, -2267, -6344, -10061, -10526, -6282, -418, 5750, 11209, 11182, 5760, 686, -3581, -9063, -11611, -8242, -2451, 3695, 9275, 10670, 7604, 4040, -824, -7915, -11982, -9399, -4292, 1049, 6851, 10088, 9269, 6587, 1321, -6559, -10993, -9424, -5956, -2072, 4020, 9242, 10349, 8365, 3272, -4317, -9112, -9180, -7880, -5076, 1666, 8302, 10528, 9180, 4966, -1607, -6724, -8627, -9519, -7399, -376, 6780, 9474]
1350I474k87k341n282n773l942k298J508O701O781L036J440k83m279o502n231
1365g278l037Q40N389N743L623L457J579l699o804n470l457m92L370M800M597
1380C161N050K843l158o218m977l919k296J330M126N284O039L349k188m718m167
1395d59m580m340l15L664N486O084L729o16k789l455n517n692j475L124M781N376
1411C006M365J461r57l118o053o368k065J993L277M590N245L372M42k786n999
1426D05o175k549K06J602L926O167M740J275k259m988n539l315j847n8L647O667
1442A905N257J733r65l405m839m535l542j173L463O201N037K411Q18j729m371
1457B266n555m617j680K632M970M524L462K700k57m246n954m812k210J138L408
$$ y = [9474, 9187, 6846, 1564, -4209, -8151, -10449, -8941, -2240, 4541, 7577, 9017, 8734, 4455, -2047, -7278, -10315, -9475, -4086, 1657, 5280, 8737, 10316, 6617, -187, -5657, -9114, -9606, -6236, -1436, 3161, 8211, 11054, 7896, 1678, -3299, -7218, -9514, -8184, -4058, 1226, 7265, 10614, 8426, 3708, -459, -5039, -9379, -9694, -6030, -544, 5540, 9269, 8653, 5864, 2409, -3108, -8800, -10275, -7151, -2370, 3006, 7371, 8832, 7875, 4757, -1296, -7664, -9729, -7736, -4459, 131, 5376, 8748, 9190, 6404, 405, -5770, -8319, -8113, -6511, -2585, 3582, 8322, 9597, 7338, 2350, -3189, -6504, -8351, -8409, -4762, 1905, 7162, 8895, 7930, 4525, -314, -4849, -8391, -9564, -6101, 100, 5137, 7548, 8366, 6637, 2266, -3289, -7906, -9586, -6954, -1984, 2540, 6002, 8702, 8445, 4199, -1755, -6567, -8777, -7639, -4231]
1472d231M060M667M200N59l783n352m643k957p75J831L913N555M985J156k787
1487F398m199m125l995k735N77L947N728M903J820j073k707m014n118m001j87
1502h781L456N065M544K767Q57j260m042n860m489q76K379L732M252M047K633
1517H424m03l984n724m411j690O32K334M247N156L751J48l426m728m201k828j273
1533g976J332M184N647M239P84k170l369m060m215k807O33L890N396M197J691
1548G396m38k037m177n393l521J45L061M347M164K886J400j189m233n762l776
1563g127m84J636L045M216M255K608n88l879n279l654j637j62J948M533N142L173
1579G746L8k893m313l768k876j859J253M654N272L171R11j219l248m091m028k903
$$ y = [-4231, -171, 4496, 8696, 9255, 5472, 120, -4523, -7480, -8255, -6424, -2511, 3044, 8029, 9185, 6398, 2199, -1926, -5921, -8656, -8079, -4132, 1596, 6499, 8319, 7246, 4539, 525, -4593, -8594, -8781, -5325, -260, 4284, 7051, 7908, 6648, 2606, -3254, -7743, -8619, -6240, -2508, 1744, 5791, 8424, 8021, 4037, -1687, -6098, -7788, -7156, -4822, -575, 4581, 8332, 8480, 5054, 326, -3875, -6703, -7976, -6644, -2460, 3187, 7426, 8210, 6040, 2671, -1389, -5604, -8411, -7778, -3888, 1508, 5705, 7396, 6958, 4921, 744, -4649, -8170, -8025, -4964, -617, 3547, 6433, 7833, 6644, 2411, -3351, -7127, -7611, -5975, -2930, 1286, 5541, 8149, 7561, 3682, -1597, -5251, -6888, -7050, -5102, -569, 4573, 7746, 7784, 4891, 578, -3190, -6066, -7925, -6672, -2018, 3254, 6425, 7336, 6117, 2869, -1222, -5250, -8153]
1595h153P14M259M653L138K198M28k356m374m703l422RL174L563L436L587J921
1611H072j904m335m608l483j032J631K582L737M821K777j513l652l823l722k363
1626f815NJ954L944N299L156p64k438k818m108l769j194J635L678N048L304L99
1642F516q27k037m559m788j796J104K863M337L607J731O42j501m824n122k004
1657f658K29J542L440M282K935J639j100m503m841k244j002NK856M783L750K036
1673G149m87l542m075k672k432j288K498M907L909K210N66k129l406l316l588
1688e696k148K161M511L471K505J855o73l042l780m064k586J465L409K751L123
1703C262L331M47k765l848m091k871K96K098K214L901M325J015k469l074l613
$$ y = [-8153, -7439, -3180, 1473, 4611, 6809, 7237, 4881, 507, -4196, -7618, -7609, -4435, -872, 2564, 6151, 8072, 6168, 1833, -2775, -6258, -7290, -5659, -3077, 660, 5481, 8258, 6745, 3093, -730, -4452, -6815, -6810, -4856, -912, 4387, 7543, 6779, 4341, 1523, -2585, -6354, -7548, -5913, -2235, 2813, 6117, 6516, 5689, 3652, -907, -5695, -7491, -6387, -3524, 813, 4420, 6151, 6793, 5292, 468, -4654, -6658, -6429, -4887, -1447, 2835, 5770, 7409, 6309, 1806, -3035, -5279, -6281, -6276, -3420, 1363, 5113, 7149, 6662, 3120, -955, -3627, -6059, -7347, -4849, 58, 3967, 6177, 6743, 4614, 1208, -2108, -5696, -7844, -5683, -1172, 2299, 4804, 6659, 5986, 2944, -836, -4900, -7486, -6021, -2612, 139, 3262, 6593, 7040, 4275, 427, -3664, -6535, -6239, -4141, -1927, 1974, 6299, 7314, 4845, 1771, -1842]
1718a842l244j218Q28J883M275M838J319j639j852l063m107k529l1J724M132M670
1734D144J723m20o41k616m872l305m90J265L200M237K344J068N02k437n149l660
1750e107q74L11K027L891L252K232J164k274m902l390j313r72Q26L617M001K793
1766E282J509j544l980l044k058k490o3L574M232K926J879m48k864k924k865l456
1782f334n31L248L703K670K484Q88j707k721l491l898j136K529K742K442L421
1797D309K259r83k766l688l812j533J389J754K244M239L063n77k340k860l660
1812b962k344l9P43K263M709L529j23j509j945l550l325j293L73K225M569L376
1828D697M14k85r05l464m124j920j80J652L812L373J379J106k08l558m587k186
$$ y = [-1842, -5086, -6304, -5476, -3593, 682, 5520, 6839, 5200, 3348, 285, -3822, -6351, -6382, -4658, -526, 4144, 5867, 5447, 4806, 2190, -2682, -5987, -6477, -5212, -2012, 2225, 4569, 5637, 6139, 3702, -1447, -5107, -5981, -5670, -3643, 248, 3500, 5732, 6896, 4622, -280, -3670, -4983, -5955, -5129, -1512, 2489, 5282, 6791, 5247, 1267, -1777, -3835, -6325, -6388, -2814, 1418, 4344, 6223, 5775, 2911, -13, -2878, -6334, -6865, -3617, 86, 2756, 5240, 6128, 4421, 1700, -1791, -5689, -6825, -4296, -1554, 888, 4309, 6568, 5585, 2819, -869, -4681, -6214, -4825, -3071, -827, 3412, 6475, 5898, 3558, 698, -2962, -5306, -5345, -4602, -2339, 2370, 5899, 5776, 4267, 2322, -1228, -4553, -5846, -5473, -3248, 1321, 4697, 5111, 4826, 3921, 457, -3667, -5587, -5767, -4115, -303, 3070, 4449, 5555, 5347, 1789, -2798, -4984]
1844d984n58P69K847L396K288K018K20l372m191k090j202n60J848L500L117K524
1860E570N94k694l443k190k195j853J493L575L325K507J185j626k551k311l166
1875c780k514R11L330K835K583K017k33j890k546l807k968N43K593K168K704K984
1891D930P85j516k563l642l063j78J404J397K892L913J594j132k208l229l160
1906c776j108J44R17L225M278J827o66j402k471l270k171p76N55L047M170J988
1922D511J08k44j754l683k979j325K51K619L569K209J101Q82j406l818l319j574
1938d852j50J503K894K474K237J597j084l634l114j711j099M31K316L022K871
1953C701J973p21l002k636k003k112n20K027L141L051K126p9j974k062k446l009
$$ y = [-4984, -5542, -4773, -1926, 1470, 3758, 5776, 5996, 2624, -1567, -3657, -4859, -5419, -3571, -71, 3046, 5570, 6164, 3470, 27, -2163, -4358, -6211, -4718, -1143, 2182, 4689, 5874, 4248, 1697, -614, -3780, -6294, -5383, -2053, 782, 3365, 5382, 5149, 3259, 713, -3094, -6062, -5519, -2926, -758, 1946, 4930, 5715, 4199, 1636, -2006, -5069, -5247, -3843, -2446, 446, 4359, 5953, 4821, 2613, -616, -3776, -4884, -4740, -3823, -598, 3680, 5507, 4841, 3439, 968, -2302, -4473, -5249, -4694, -1647, 2523, 4511, 4619, 4375, 2621, -1062, -4041, -5366, -5115, -2496, 1073, 3282, 4383, 5265, 3859, 41, -3278, -4852, -5002, -3499, -605, 1869, 4106, 5703, 4619, 985, -2129, -3840, -4939, -4508, -2192, 830, 3701, 5674, 4953, 1951, -685, -2688, -4800, -5320, -3293, -152, 2899, 5025, 4946, 2972, 910, -1536, -4545]
1969d545j134J700K954K764K314Q80q66j707k945l505j530J454K129K259K708
1984B930J926O4j653k959l538j582L83J203J910L203K740N42j315k598l151j952
2000c847o24K20J638L521L211Q62q29j787k629k661j520n40J478L498L095J174
2016D260Q2p94k354l140k314q81J143K953K749J690J089K3k159l416k656j037
2032d762N54J972K434K296K040N66j980l246k497j445m50J101K307K800K614Q18
2048E122j543k557k331j966j372L71K062L100K763J069q09j715k091k630k131
2063d658j19J913K821K574J490K80q70k176l063k576l79J431K222K290K111J234
2079D525k53k033l279k543p77N83J390K295K700J957P2j881k747k446j350l42
$$ y = [-4545, -5679, -3979, -1025, 1739, 4053, 4933, 4067, 2360, -585, -4090, -5620, -4166, -2037, 222, 2930, 4856, 4920, 3267, 308, -3230, -4812, -4429, -3226, -1316, 1887, 4627, 5169, 3854, 1256, -1895, -3847, -4471, -4251, -2613, 908, 4119, 4981, 4152, 2365, -264, -2925, -4445, -4985, -3507, -9, 3086, 4260, 4342, 3548, 1194, -1946, -4260, -5141, -3998, -1045, 1704, 3394, 4483, 4506, 2347, -1069, -3725, -4762, -4208, -2236, 198, 2494, 4534, 5100, 3120, -126, -2623, -4068, -4518, -3417, -1110, 1690, 4304, 5122, 3579, 1022, -1309, -3275, -4647, -4276, -2214, 886, 3649, 4718, 3909, 2194, 103, -2527, -4658, -4777, -2864, -43, 2531, 4021, 4301, 3431, 1255, -1808, -4384, -4763, -3332, -1110, 1180, 3291, 4525, 4272, 2239, -1040, -3583, -4360, -3777, -2387, -92, 2608, 4565, 4637, 2756, 9, -2437, -3787, -4129]
2095d129O17K266L108K373L06j264k066k255k095j398L47K163L092K286Q20l97
2111C774j382k158k812j942M6J806K620K255J438N02p18k259l125k155j87J191
2127c106J813K211K219J367l98k194k914k131p74K03J188K360K806J757k08j636
2143B563k424k191j396p06O16K460L055J881J65q26j798k325k141j341L50K264
2159a794K878J823Q66pj270k443k599j741J08J825K316J893J488J020r47k592
2175H24k690j735m32R72J705K112K227J537o51k431k324j734j118m9J363K202
2191b22K694J823m15j707j774j936j981p31J072K256K630J882K02r11j297k180
2207e95k614j152Q90J855K310J988R25n6r27k404k945j317M82J196J791K268J694
$$ y = [-4129, -3512, -1246, 1862, 4235, 4541, 3277, 1211, -1044, -3139, -4537, -4190, -2027, 1065, 3351, 4171, 3774, 2392, 234, -2578, -4520, -4474, -2668, -48, 2207, 3645, 4147, 3429, 1170, -1955, -4110, -4297, -3106, -1293, 918, 3137, 4504, 4106, 1912, -1002, -3133, -3907, -3704, -2516, -156, 2650, 4407, 4199, 2563, 139, -2052, -3448, -4154, -3538, -1078, 1977, 3858, 4023, 3197, 1399, -926, -3067, -4408, -4058, -1794, 1084, 2907, 3773, 3766, 2496, 53, -2546, -4287, -4179, -2354, -38, 1855, 3343, 4363, 3416, 824, -1866, -3601, -4033, -3061, -1356, 756, 2983, 4520, 3869, 1438, -886, -2620, -3738, -3787, -2424, -222, 2472, 4295, 3880, 2173, 399, -1537, -3518, -4249, -3177, -921, 1709, 3591, 3793, 2882, 1585, -595, -3209, -4361, -3471, -1616, 694, 2682, 3607, 3551, 2624, 220, -2725, -4042, -3560, -2364, -573, 1695, 3389]
2224C389N79p51k270k816j452j10L29J350K635K263Q47m66j868k486j652r12m26
2241c817J122K868K485R02j4j143k011j985j608r48R66K752K149J117O54j35j903
2258A451k300j981j315O79K172K001J335J486L96j741k307k118j378N7J458J574
2274e31J772K209P28j497k170j851j634o44P14J423K054K493J007j189j550j541
2290b07j920j527R4J279K233K430J201m88q49j282k430k130j12J084J856K240
2306A472J503K37k27j109k759k292l02O41J129J964J988J049J72j004k676k218
2322b432o32R0M11J842K425J419N00q93k208k066r32p04k01J803K664J643N83
2339C312k80j501j956j424j442n20J754K587J484Q81N28j095j891j836j669p20
$$ y = [3389, 3968, 3217, 947, -1869, -3321, -3431, -3102, -1752, 883, 3146, 3993, 3527, 1659, -827, -2479, -3391, -3817, -2695, 173, 2658, 3560, 3546, 2403, 392, -1593, -3201, -4149, -3183, -431, 1718, 2835, 3489, 3354, 1451, -849, -2830, -4145, -3466, -1294, 707, 2042, 3528, 3924, 2183, -124, -2242, -3620, -3563, -2105, -531, 1241, 3450, 4178, 2681, 511, -1340, -2974, -3618, -2904, -1481, 573, 3066, 4073, 2884, 1334, -207, -2127, -3654, -3560, -2281, -48, 2382, 3583, 3095, 2246, 964, -1466, -3596, -3708, -2624, -768, 1472, 2975, 3212, 2985, 1876, -883, -3175, -3477, -2836, -1707, 257, 2245, 3294, 3466, 2462, -214, -2432, -3064, -2974, -2563, -721, 1704, 3123, 3623, 2730, 522, -1544, -2476, -3180, -3381, -1578, 1086, 2729, 3312, 3032, 1531, -425, -1849, -3291, -3811, -2057, 530, 2014, 2895, 3423, 2328, 437, -1399, -3068, -3788]
2355c788J399K026J314J375J211m29j948k004j756j011Q26J491J315J884J798
2370C703k20j894j714j713j265J19Q45J283K254K045l9j352j273j595j831p22
2386c369N61J291K291K164K72p94o78j618k383j215M67J113J911K031P67k7k65
2403B519j638k595j461J58O67J442K011J342O93k1j724k608j313j98k0Q79K137
2420B70J764J050J83j379k276j290p38p62N94K181K102J098M27q87j748j495j277
2437b183j197L71K153J938J041P64m8j371j643j680j550K45J726J576J181J393
2453B716N70j116j720j848j593j15J199J113J321J975R44q94j604j581j604p22
2469b959M77Q68J480K245J303p08j247j251j696j329j23P67J508K316J247l36
$$ y = [-3788, -2389, -363, 951, 2326, 3537, 3108, 1160, -844, -2600, -3611, -2785, -1294, 21, 1905, 3703, 3483, 1589, -125, -1838, -3103, -2984, -2139, -856, 1398, 3443, 3404, 2052, 779, -816, -2647, -3369, -2808, -1517, 774, 2938, 3210, 2416, 1738, 120, -2263, -3478, -3011, -1898, 13, 2044, 2811, 2784, 2519, 881, -1714, -3175, -3017, -2350, -908, 1103, 2445, 3138, 3117, 1393, -1215, -2528, -2726, -2746, -1867, 270, 2034, 3084, 3267, 1888, -388, -1678, -2416, -3178, -2584, -403, 1699, 2797, 3224, 2337, 589, -906, -2183, -3380, -3009, -856, 1082, 2123, 2887, 2839, 1468, -175, -1855, -3405, -3160, -1434, 142, 1323, 2716, 3286, 2170, 450, -1398, -2991, -3106, -1907, -794, 527, 2502, 3446, 2552, 948, -633, -2237, -2959, -2482, -1614, -134, 2111, 3414, 2706, 1459, 208, -1488, -2817, -2940, -2173, -665, 1651, 2898, 2562]
2485B562n61r00j794j875m44M57J391J993J375L25O3o75k100k049p18L07Q98J697
2503d8J563Q63N47n14k097j966p57j53K84J348J872J347P99l45j843j848q69o93
2521b510l56J243J967J546R45j23j248j462j182j313o16R68J996J467R66M89o73
2538B104j211j504j694q53Q03J676J237J179J043j10j140j728j697j005M43J079
2554a378J029J552J509K50j088j517j655j090j39N10R07J849J769M30q21j220
2570H97j344j391o81o3R40J854J828N84l87n97j260j770j184j96Q31J666J633
2587A360P97K55j45j134k017j469l50N54J174J538J115Q39K01j160j968j506m52
2604b368K8P23J386J567J156L22r90j714j251q54m87K80J310J783J380M34o09
$$ y = [2562, 2001, 1101, -693, -2568, -3012, -2555, -1164, 829, 2204, 2529, 2592, 1917, -183, -2232, -2950, -2643, -1745, -48, 1515, 2378, 2925, 2411, 314, -1652, -2409, -2562, -2278, -930, 942, 2289, 3088, 2743, 900, -948, -1817, -2510, -2866, -1623, 344, 1890, 2835, 2712, 1464, 2, -1180, -2493, -3109, -2141, -145, 1322, 2288, 2777, 2104, 893, -611, -2305, -3158, -2355, -679, 558, 1737, 2780, 2670, 1530, -198, -1895, -2900, -2457, -1378, -349, 1203, 2712, 2962, 1874, 357, -1298, -2388, -2527, -2017, -1110, 739, 2508, 2938, 2117, 897, -447, -1838, -2519, -2582, -1642, 212, 2040, 2624, 2237, 1640, 380, -1390, -2574, -2770, -1939, -273, 1360, 2157, 2412, 2267, 1133, -884, -2353, -2703, -2149, -975, 563, 1678, 2517, 2718, 1558, -410, -1916, -2368, -2340, -1617, -231, 1336, 2492, 2814, 1824, 110, -1141, -1995, -2482, -2202, -892, 891, 2271, 2705, 2096]
2621B096j267j235j173j069L9J302J687J337O20m4q02j185j570j275j19J023J357
2638b78J266R90N18l13j255j785j387l52O71R80J181J417R96j32j213j642j335
2655a673o00O3O19J223J722J204Qr37j320j247j010n42L14J346J768J211K32m67
2673A914r10j274j381r11J39J231J537J232N37J12n66j307j667j093J8Q92J223
2690b74J159J069N45l64j362j754j075k10L74Q51J292J524Q32k65j207j447j143
2707a455o24j62O08J390J592J046j40o95j172j243j040n69M34J375J601J015J69
2724B130k94o78j430j454p90L11J102J474R75O51L28o63j496j572q35k1P56J115
2742c91J195J022O50m67j452j424q86l75K04Q65J379J350Q08l07j229j210r10
$$ y = [2096, 829, -406, -1579, -2648, -2609, -1307, 380, 1717, 2337, 2293, 1491, 306, -1264, -2539, -2658, -1635, -278, 988, 1978, 2496, 2183, 928, -857, -2244, -2596, -1925, -945, 236, 1653, 2649, 2517, 1304, -338, -1673, -2273, -2210, -1591, -368, 1354, 2558, 2566, 1629, 309, -938, -1948, -2490, -2176, -830, 938, 2149, 2381, 1914, 1004, -270, -1651, -2562, -2423, -1192, 345, 1577, 2114, 2226, 1660, 353, -1314, -2407, -2389, -1497, -274, 885, 1954, 2499, 2135, 773, -981, -2056, -2266, -1892, -1041, 251, 1775, 2607, 2342, 1135, -312, -1455, -2079, -2241, -1633, -243, 1349, 2395, 2255, 1560, 388, -855, -1895, -2464, -2030, -655, 946, 1961, 2130, 1836, 1158, -272, -1726, -2516, -2205, -1103, 371, 1346, 1997, 2325, 1662, 166, -1406, -2241, -2262, -1506, -391, 804, 1826, 2476, 2009, 557, -867, -1753, -2128, -1924, -1059, 320, 1670, 2478, 2171, 942, -268, -1178]
2759a178q99k21P39J442J469Q78m3p89r54j094j292n98P05J302J281R94L95l24
2777A813p20j331j497o69M47J038R90J183Q40J34p37j357j525p38J75N56P47J429
2795G78J218L21n65j169j408q82k79J14O70J588J500L37l71p69j226j120p33j77
2813b173O02J593J396M35O7l34j050j418j049l72N14J369J245O89M26O8r51j587
2831e30j128n28J93J035J054R60R13L42q91j570r82o18l41N39J072J174J226M79
2849B399p56j307r14q47p45K01J061J303J175O93n28q51p96j171j128J9R69J165
2867e8J161P92J7m70p86j376j390j41R03P42J102J038N20k65p12j453j338k68
2885a982L85N12R08J404Q46n1p01j271j271n25qJ12J000J662R49k4m52q54j266
$$ y = [-1178, -2077, -2298, -1559, -117, 1352, 2230, 2187, 1398, 444, -650, -1942, -2540, -1835, -533, 748, 1742, 2137, 1813, 1093, -238, -1735, -2404, -1957, -919, 71, 1254, 2094, 2228, 1491, 134, -1391, -2129, -1954, -1398, -651, 778, 1996, 2317, 1752, 583, -825, -1707, -1986, -1872, -1202, 386, 1886, 2223, 1852, 1083, -143, -1263, -1996, -2173, -1571, 22, 1418, 1853, 1920, 1586, 536, -882, -1931, -2303, -1789, -420, 825, 1514, 1940, 2008, 1057, -530, -1658, -2186, -1993, -958, 96, 1056, 1969, 2311, 1420, -150, -1132, -1750, -2091, -1552, -480, 694, 1920, 2399, 1643, 336, -578, -1425, -2170, -1969, -908, 395, 1570, 2263, 1735, 884, 88, -1083, -2211, -2192, -1223, -58, 1103, 1895, 1912, 1442, 656, -720, -2110, -2251, -1348, -606, 496, 1534, 2054, 1789, 1077, -376, -1714, -1982, -1597, -1085, -177, 1227, 2073, 2022, 1321, 50, -1221, -1746, -1754, -1642, -642, 1020, 1969, 1945, 1493, 639, -627]
2904f27p37n34q1R56J650R38J93N1n99j289j145p48j84Q44J459R02M28M75k43
2923A709j310j257q47l52N53J150P87Q13Q92p4j289j281q83n50J53P52J049J036
2941A051J070j4j114j005p80q87l46N74J005J162J111K33q06o56q26j315o73M97
2959a719R75J148J025M28l11m67q31j560q50M66O56Q51J093P42J93l28r41j451
2977h81j026K64K72N89J287J046M03k17r27j346q78j63o8L39J320J360M93o6o06
2996A195j133j004n18m97K91J338J391M93J62j69r06j160q38n70J03J198J213
3013E89N33N05K58p35j183j099p07mQ33J021O32Q54O15p29j194r58p83k64M59
3032a357P63Q87J072P66n25j097p47q35p48R7P62Q91J213Q23l46p19o17r37j166
$$ y = [-627, -1364, -1898, -1979, -1023, 627, 1565, 1758, 1809, 1210, -79, -1224, -1972, -2156, -1312, 147, 1049, 1477, 1952, 1709, 399, -858, -1705, -2057, -1504, -354, 433, 1246, 2138, 2064, 775, -506, -1389, -1939, -1786, -1034, 15, 1051, 2121, 2107, 993, -12, -792, -1679, -2025, -1451, -446, 716, 1827, 2060, 1254, 598, -228, -1543, -2216, -1719, -744, 404, 1429, 1857, 1546, 1079, 248, -1312, -2162, -1696, -1040, -189, 904, 1646, 1839, 1511, 570, -881, -1907, -1643, -1371, -782, 505, 1551, 1954, 1737, 810, -536, -1414, -1577, -1645, -1306, 14, 1374, 1867, 1801, 1195, 62, -942, -1460, -1957, -1666, -328, 1063, 1556, 1718, 1549, 643, -517, -1355, -1925, -1822, -624, 589, 1122, 1627, 1885, 1150, -33, -1132, -1839, -1843, -1010, 11, 643, 1497, 2112, 1383, 189, -769, -1552, -1816, -1357, -594, 293, 1365, 2131, 1606, 509, -238, -1073, -1821, -1724, -962, -71, 1142, 1965, 1619, 900, 283, -654, -1820]
3051a820j32O46Q93J180P76P5k96m86j185j282k23M48O65R97R93M33rm40j298
3070f5j263l25J90L40P91J154Q24J29l30j093j249m90q8j00P81J364R20K95k41
3089A544q52j045o91m84l36O93J403R86L34R0n34r07q97q70l85O10J213Q59N42
3108A273M14j57q97j068r94l66L32R79O84P11Q19Q2q74j072r03n90J40M65P14
3127c08R70R97K64q60q64p60p67l31K98O41J126J077K71n26o06o76j020p22J95
3146a601O45J016J037M58j40l18o68j243q94L5N83P86Q95P22K66j13p46j277q46
3165a403j40K75N30Q67R37N41J8o72j115q77l26j61K89R80J102P24R2n25q66q48
3185e78n91m87J35R19J205O95L01k41n76q87q84o82L7P50J081O77N02J79l81q98
$$ y = [-1820, -1952, -1306, -413, 767, 1543, 1618, 1322, 836, -349, -1631, -1854, -1406, -741, 256, 1249, 1682, 1673, 1233, -65, -1328, -1653, -1463, -1123, -332, 822, 1646, 1775, 1445, 352, -897, -1387, -1475, -1575, -794, 570, 1490, 1785, 1544, 692, -353, -1044, -1528, -1864, -1171, 232, 1218, 1552, 1642, 1108, 201, -696, -1566, -1951, -1341, -128, 731, 1273, 1687, 1530, 633, -435, -1429, -1795, -1463, -484, 200, 911, 1730, 1812, 938, -134, -1037, -1627, -1487, -1022, -308, 662, 1659, 1923, 1063, 199, -561, -1328, -1659, -1361, -720, 406, 1483, 1754, 1228, 622, -54, -1074, -1796, -1601, -956, 60, 1097, 1555, 1415, 1097, 429, -814, -1708, -1673, -1090, -304, 591, 1313, 1579, 1466, 720, -557, -1403, -1543, -1268, -738, 129, 1066, 1607, 1625, 953, -162, -1039, -1365, -1526, -1237, -257, 845, 1569, 1661, 1136, 270, -578, -1169, -1656, -1521, -602, 603, 1298, 1599, 1358, 782, -105, -989, -1671, -1634, -884, 197, 874, 1376, 1555, 1174, 276]
3205B76j036q19j34P00P37P39P22N51l26r05j030p55k72K33N42P81J053O64j42
3224A579p77r52o95n19j63K99Q97J140Q04j04m85o53p99p69m37K50Q51J043P28
3243A238J21q2m58q97j014n75K01P17Q59P25N10J83l68r43j010o40l3L93O45Q66
3263D38Q00M18k80r21r49o54k35R0M60Q66J055N56j93o86q46o44n73k51M15R44
3283a90J012N99o4l21n30q88q30m02L30Q03R31O15K56k7m65r23j035m10J78N84
3303g77P16P55O24K16m32r32j016m83KK41N74R33Q63K85k52r42q26n85l14J0M85
3324h55J014Q60M80j61n88p00o81o40k89M92R64Q29N27R6k70o54p28r21m07N08
3344a124P67O44O63M26q6m71r14q87m90K36N07O14P60O93J75n78p61q89n15l6
$$ y = [276, -760, -1579, -1713, -1013, -276, 463, 1185, 1736, 1410, 505, -525, -1280, -1552, -1319, -777, 4, 1057, 1721, 1579, 802, -150, -845, -1364, -1527, -1228, -331, 809, 1613, 1509, 1024, 371, -428, -1197, -1634, -1384, -533, 510, 1238, 1359, 1277, 819, -78, -1092, -1667, -1466, -749, 110, 835, 1345, 1528, 1160, 217, -793, -1433, -1466, -1073, -428, 438, 1238, 1656, 1376, 455, -494, -1148, -1383, -1293, -833, 33, 1088, 1644, 1451, 765, -81, -725, -1298, -1549, -1134, -190, 822, 1421, 1357, 1036, 506, -382, -1212, -1614, -1284, -481, 450, 1065, 1321, 1294, 829, -94, -1129, -1539, -1361, -777, -61, 694, 1318, 1534, 1102, 170, -846, -1329, -1327, -1086, -512, 421, 1284, 1569, 1317, 375, -451, -1036, -1350, -1340, -855, 159, 1019, 1499, 1338, 750, 50, -631, -1271, -1560, -1068, -104, 725, 1252, 1348, 1078, 424, -304, -1225, -1632, -1124, -357, 287, 950, 1376, 1290, 819, -95, -982, -1472, -1236, -729, -115, 645, 1338, 1513, 935, 174, -715, -1230, -1266]
3364a266K28N12Q35R49K77m39o26q18o06l55PM53R77R58K39j87k94p14q82n48
3384a300j13M37Q16R18L64J04k7o16j065p44j52K53N97Q08N92M17J45n94j089
3403b49p87j43LL60P01Q00O10J88n14r30o19m57l14J97P58Q76O40K63k62p68n71
3424b18o32n12o2Q46Q17O33L19J5m40n67p46q37n9O38O57N99N85K82k34o30q34
3445c80r10j23M11N66N41P94N60k15n84p50q02l23J27K63N12J014P02j27m80o08
3465A88p59n24j33J78N46R79P20jk69k52q47p81l70Q8N00R33P10Q8K17k38q12
3486A61r15l95p8L30P76O25L95M60j46r07q94l46k01O4N86O35O62M76M3p04q96
3507b69l89l86k44M65P18P48N18J46n47o50m38o28m92L68P58P05N81K52k87m17
$$ y = [-1266, -1038, -526, 309, 1258, 1535, 1096, 470, -348, -954, -1309, -1302, -849, 128, 1086, 1325, 1138, 844, 130, -752, -1300, -1413, -976, -160, 758, 1122, 1226, 1199, 583, -482, -1226, -1378, -1125, -528, 280, 872, 1289, 1434, 840, -249, -1036, -1179, -1176, -816, -115, 685, 1295, 1483, 969, 39, -580, -1037, -1351, -1154, -396, 480, 1120, 1383, 1121, 353, -218, -850, -1362, -1424, -578, 239, 872, 1191, 1206, 766, 199, -547, -1384, -1443, -805, -148, 451, 1036, 1318, 1084, 454, -380, -1290, -1413, -1002, -436, 105, 899, 1459, 1244, 660, -90, -892, -1215, -1088, -825, -313, 701, 1403, 1276, 796, 188, -571, -1095, -1228, -1050, -504, 475, 1195, 1194, 925, 673, -174, -955, -1325, -1237, -737, 196, 906, 994, 1211, 973, 161, -754, -1149, -1227, -897, -121, 504, 899, 1359, 1213, 306, -588, -934, -1135, -1071, -485, 150, 812, 1288, 1331, 627, -269, -658, -1044, -1288, -823, -105, 643, 1161, 1307, 760, 110, -328, -956, -1448, -1080, -322, 383, 964, 1216, 929, 512]
3527E12n20q23o29K78P58M96N97M82O3l90o29q69o22J60M45L14O94P43K50l54
3547I56n33p94o98M8P5K14Q32R06K83k70l86p00o41l17j61J82Q47R33L55j68q5
3568H78m99q31n55j84J54O91Q70L74M7J33l65r54o46k08rN57P32L81L81K83l41
3589H89q73p38k54j26K40O42N82N63M04l19q19n45m39l18J4N36O86O73M72k07
3609A063o27m08n24o02r5M62O47O62N38m3l69l64o26p89j67M13N39O26N37K20
3629A093j57k98p55q38k26K48L47M48P48N05K4m00o18p84l18O6J00L94Q10O52
3649A041J05k93m87p36m16k12n4L92R31O54J31j39l02n63o89m04r5L45Q42N76
3669F27K23J84j36n73p66n06j75K23O51N85L48L38J07n68p74n67k70N3M82M54
$$ y = [512, -8, -831, -1460, -1182, -424, 72, 669, 1151, 1214, 824, 195, -674, -1296, -1136, -691, -377, 317, 1060, 1310, 956, 423, -371, -1069, -1021, -946, -732, 100, 1006, 1289, 1019, 633, -67, -708, -1025, -1186, -1004, -157, 776, 1131, 963, 878, 379, -452, -1007, -1191, -1037, -346, 524, 898, 945, 1078, 713, -241, -887, -1095, -1104, -547, 185, 566, 947, 1230, 889, 16, -722, -976, -1102, -862, -220, 362, 925, 1329, 1010, 191, -354, -793, -1111, -1097, -561, 125, 798, 1270, 1063, 436, 28, -496, -1098, -1193, -731, -84, 578, 1116, 1073, 704, 340, -286, -1075, -1242, -829, -290, 336, 873, 1093, 936, 638, -117, -955, -1181, -933, -586, -138, 610, 1115, 1139, 739, 121, -663, -981, -915, -815, -421, 389, 1041, 1146, 853, 366, -370, -786, -998, -1052, -660, 271, 925, 1056, 917, 615, 52, -637, -1041, -1136, -791, 51, 627, 850, 1034, 898, 325, -441, -947, -1122, -899, -248, 337, 685, 1023, 1130, 562, -212, -779, -1049, -996, -514, -60]
3689f0N40O04Q2n19p36m46l08k17K08N74O13O07K09l66m84m19n45n14J35N91O67
3710B16N51L23j58l53m00o71o03PM90M35N87N00N1j71m68p00o78K2L25L36N77
3731B18N22L15j18l92p52n74k25J46K40N32P68M14q2l53n68n24m05k04J80N39
3751c23P68M26J25j96m51n47n19k89m1O09O82M78J51M2k35o28o58m18p0M44O62
3772A2L83L73K66j42o47o83m36j21K25M28M74N84L52r4n83o15l84k94K3K56N15
3793a08P09M24o3m52m06m70m17k53J88N77O98M39P9j54l78n15o62l35J64N36N91
3814A92M44K34Kk41n73o97m23J42L62M23M84M42K87k39n66p09l19j33J74L22N69
3835A77N89L31k13m57n67n09k20n6K29O75O72L00p1l43l46n77l80k72K43N92N96
$$ y = [-60, 480, 1084, 1166, 647, -89, -535, -843, -1060, -852, -278, 335, 942, 1151, 785, 301, -118, -663, -1177, -1042, -451, 216, 767, 1090, 932, 579, 179, -492, -1095, -1088, -598, -163, 424, 924, 975, 804, 336, -364, -1042, -1020, -695, -359, 218, 740, 1055, 937, 545, -207, -781, -1006, -860, -620, -88, 680, 1094, 1012, 659, 91, -433, -838, -1042, -862, -323, 445, 871, 996, 800, 349, -198, -717, -1006, -1047, -438, 244, 722, 873, 915, 680, 52, -606, -1024, -1094, -650, 12, 395, 768, 1034, 892, 245, -438, -874, -995, -770, -342, 132, 716, 1068, 974, 391, -224, -608, -902, -879, -623, -108, 601, 1025, 962, 510, 104, -366, -783, -1036, -848, -271, 427, 866, 945, 791, 413, -102, -764, -1099, -935, -399, 192, 636, 870, 872, 631, 58, -639, -1062, -920, -558, -135, 349, 791, 1078, 839, 273, -436, -755, -888, -714, -392, 177, 766, 1097, 884, 427, -140, -649, -869, -925, -696, -21, 651, 951, 880, 537, 191, -386, -766, -1038, -795, -203, 393]
3856C93L59J06j07k86n37o80k92J71N28M60L92L34M9k17o45o85k63N0K97L26N48
3877C01N23J60j79n80o00l48j29N7L83O47N18K47j86m71m29l82l42j07L44N55
3897a8O37K53p7k03l68n73m81k10L18O18M59L21J44k1l91o41n16k02J59M45L65
3918A8M33M01J34l95o53n37k05k4K25M17M71O31Q1l56m78m87l43k01J36K88O05
3939A61O11J24j79l47m09m92l89J6L64N38N51K29K5k08l09n99n74k1K77M49M57
3960B75L95J75k9l49o87n61n2J67K25M32N42K93Q5l16o61m39j55j34L3O05N79
3981D23L33K8j63m44m85k59k60n6N28O30L60J94q2l82m14m02m29r0M97N64L29
4002D20K79J79j96n05m94n13n8K80M66K61M39L75j26n01m89m24j93R6K88L43N91
$$ y = [393, 752, 858, 751, 465, -72, -752, -1044, -873, -345, 115, 507, 841, 890, 673, 28, -657, -920, -870, -573, -247, 301, 824, 984, 805, 225, -375, -723, -852, -795, -412, 235, 753, 1000, 814, 343, -86, -468, -810, -917, -573, -18, 619, 872, 795, 592, 224, -349, -830, -1040, -722, -104, 355, 676, 820, 799, 408, -233, -749, -951, -792, -347, 18, 451, 852, 986, 591, -62, -599, -804, -828, -603, -186, 285, 916, 997, 641, 163, -324, -667, -868, -732, -444, 161, 772, 896, 717, 370, -39, -531, -920, -904, -540, -2, 549, 778, 803, 595, 286, -313, -887, -908, -631, -182, 275, 670, 845, 816, 467, -220, -781, -833, -666, -441, -9, 533, 826, 911, 595, -66, -505, -660, -794, -761, -156, 423, 756, 784, 621, 177, -308, -567, -827, -883, -355, 275, 635, 829, 747, 365, -49, -451, -880, -970, -473, 91, 420, 699, 878, 682, 177, -317, -830, -888, -608, -142, 119, 558, 933, 807, 306, -183, -607, -800, -704, -416, -73, 518]
4023E18L89q2l81m51l86m01KJ70L57O13M43j8k10l06m46m28k71J40L91N58M56
4044F57J4l2j12m10o69k99L0L28M82M45J79J43r1m36o40l01o2J84K85M90M01K56
4066H42m8m37o35l55n1n7K84N30M62L33k0l82n29k82k07l11J90N44M85K48J68
4087G72j79l88l24m63l27Q2O17M33L05K49l4l56m05m31l54K4M07L17K88M54J39
4108H26k54m70m51l19j03K37K52M10M98K70k45l56m14m22j43L5J53M17O00K92
4128H13j66k21k49n20l42p1J36M37N61L17n6l5k02o02m64j17J06L75M72L24J29
4149F25J04k17n36n46j18LJ92L70M33L41J46j74n25m65j40j95pM21M45M02K20
4170G79q8m29m34k44k02k06L73N02L96K49M2k57l65l87l72j76K49N03L73K09K17
$$ y = [518, 907, 825, 444, -7, -393, -794, -792, -622, -265, 348, 791, 773, 563, 257, -189, -617, -888, -748, -357, 201, 657, 671, 639, 527, 117, -552, -851, -821, -493, -11, 434, 613, 756, 665, 229, -411, -712, -774, -590, -305, 185, 586, 842, 794, 357, -278, -633, -684, -741, -457, 73, 535, 868, 848, 466, -63, -345, -552, -863, -673, -129, 356, 604, 772, 593, 205, -119, -582, -909, -827, -210, 223, 528, 777, 743, 387, -18, -449, -803, -779, -372, -55, 233, 687, 826, 572, 102, -349, -668, -771, -534, -282, 128, 626, 896, 651, 295, -119, -541, -684, -649, -496, -79, 521, 813, 647, 426, 177, -343, -685, -756, -620, -183, 378, 695, 639, 604, 402, -200, -664, -781, -675, -300, 172, 496, 625, 729, 512, -24, -570, -688, -685, -493, -123, 310, 651, 797, 623, 98, -367, -507, -702, -709, -288, 157, 559, 779, 691, 262, -172, -416, -618, -824, -451, 51, 447, 696, 738, 481, 116, -271, -643, -819, -570, -67, 306, 515, 732]
4191G32j31l09m29m40k49K50L20L25L71L28l7l60l85m20k97O4K11K31M75N16l1
4212G35k83l77l22l53m8Q6K29M41N32N9j57k19l33m37k71N1K05N37M21J48q0n4
4234E10m00m50l07r3J33N18L74K35Q9L5k60o47l03r8MK74M38K82K85J31k42n70
4256f2l29k16n4R9M50M45K84J21k53l79l25j84k55kL98M18L71J55j15k94k65l34
4278c26m14JL43M39L39K01M7j17l40m04m41n5L14K36L51L52J57l8l20m30m28r3
4300f26J19J85K46N62K18k4k66l96l81k41L3Q2L02N02L88j30j09k86l58k84j56
4321f20n1L40N13L69M2m0j68m03m30k08L4K22M15L06J58J77j34l90m92j93n2J80
4343d25K29K47M25J62K1m28m12k37j45KJ72L65L98L00k2k70l57l02k27j65J26
$$ y = [732, 601, 292, -137, -577, -826, -576, -256, 69, 440, 768, 731, 371, -14, -434, -731, -667, -456, -225, 250, 766, 735, 452, 75, -247, -600, -648, -562, -333, 108, 640, 699, 542, 323, -10, -447, -718, -667, -462, 75, 496, 644, 564, 510, 110, -340, -647, -740, -607, -89, 285, 520, 609, 644, 384, -263, -566, -664, -660, -386, 52, 334, 619, 750, 508, -62, -391, -607, -661, -562, -112, 333, 617, 738, 485, 106, -219, -403, -658, -660, -262, 156, 527, 682, 567, 273, 8, -326, -740, -739, -396, 43, 382, 583, 630, 513, 173, -231, -672, -727, -413, -177, 174, 526, 683, 645, 325, -105, -533, -626, -507, -322, -76, 486, 704, 680, 414, 18, -363, -604, -571, -489, -187, 315, 703, 573, 464, 178, -180, -464, -620, -671, -331, 182, 551, 593, 553, 385, -18, -448, -656, -622, -400, 15, 321, 479, 656, 522, 132, -360, -553, -605, -425, -196, 51, 476, 638, 659, 231, -181, -418, -563, -561, -389, -24, 374, 674, 652, 382, 25, -277, -504, -669, -543]
4364e43M11L81L09O0j45k82k75l83k41J25L02L92L03J43J7j61m09m04k58Q5K70
4385c03K66K96J98J36j26l40l95k57l0J15J98M25K77K00j18l70l01k39j63m0J48
4406d23M25L82K68j12j87k75l30k70p1MM19M50K20L4m1k04l79l83j55P3L55L15
4428A15K18K27Mk06l43m11k07P1K29J85L17L15P9j50l74l04k48l6O2K39K79L20
4450C81K29j36k80k12k63k17n4J51M01M00J59k2j35k99k67l84p9J46L51L37K30
4471D37L8K9k16l84l32j50R6K40L14K02K53O5k06l33l98j76L4J02K71K79L48J33
4493F46k84k57k94j79j53J4K47L45M04P6j10k43k01k97k75nJ74L47L70J98k5j25
4515C73k25k43l91j35K20K47L01K61J32k7k18m13l19n3R5P6L25K93J62J09k20
$$ y = [-543, -132, 249, 558, 618, 473, 191, -84, -467, -708, -583, -281, 111, 414, 557, 574, 413, 4, -400, -658, -573, -303, -37, 259, 457, 593, 467, 127, -268, -525, -555, -440, -242, 183, 460, 660, 542, 172, -129, -368, -531, -571, -423, 2, 384, 652, 540, 353, 78, -252, -522, -593, -589, -170, 280, 500, 534, 493, 289, -90, -473, -628, -555, -200, 115, 333, 560, 564, 358, 15, -396, -603, -532, -303, -118, 199, 514, 593, 443, 69, -235, -483, -519, -457, -218, 61, 381, 610, 474, 194, -18, -281, -498, -552, -401, 0, 400, 559, 537, 402, 103, -164, -548, -627, -481, -130, 207, 437, 475, 504, 288, -96, -428, -578, -482, -242, 72, 274, 527, 592, 386, 53, -345, -521, -487, -385, -114, 165, 513, 646, 362, 105, -189, -368, -521, -507, -260, 85, 489, 565, 455, 212, 11, -286, -561, -566, -392, -45, 325, 523, 498, 373, 148, -95, -486, -621, -401, -154, 147, 408, 540, 513, 295, -118, -437, -490, -395, -319, 6, 299, 461, 570, 350]
4536C50l49l37j28OJL05M04K10L3q9k65k85k28j37RJ82M75L01k0j6j10k64l02
4559b54k27j6J52M32J91J37M8m0l17l29k09j32J72K80K25K22J48K4k68l71k25
4580c57j51O6K29J74L36K41j1k87k73j64k02p4O3L46J87L92Q5k78k22j41k60k02
4602e03N7K35K93L16P4r1o2j91m33k14rK85K41K20K00kJ6k19m27k42j7J66J46
4625a61L26J52J14Q1k71l38k89j3J5L3K96L13J75P4j85l01k44j26j32J3L19L72
4647B23J46N3l4j70k53l02j57oK71L78J34J62J9j51l22j74l05kK03K43J74K26
$$ y = [350, 1, -336, -464, -458, -457, -152, 252, 462, 495, 406, 141, -144, -372, -509, -500, -318, 157, 458, 438, 422, 312, 48, -254, -481, -497, -345, 87, 278, 415, 463, 423, 106, -223, -432, -564, -392, -112, 113, 335, 483, 507, 239, -132, -357, -508, -442, -213, -39, 297, 538, 527, 240, -33, -197, -399, -473, -410, -64, 123, 515, 600, 322, 100, -41, -301, -503, -446, -211, 82, 398, 472, 381, 319, 128, -305, -519, -528, -243, -2, 218, 418, 416, 432, 213, -214, -456, -473, -307, -161, 165, 317, 431, 512, 241, -97, -386, -399, -384, -351, -55, 258, 433, 507, 322, 21, -223, -349, -481, -468, -149, 223, 369, 422, 388, 218, -35, -337, -494, -500, -229, 149, 283, 445, 464, 313, -9, -183, -488, -490, -287, -44, 130, 356]
$$ [...]
8191I1
##END NTUPLES=NMR FID
##END=
