##TITLE=1H_ES-APTMS-1
 aceton-d6
 8 sc, 
 9.8.2023
##JCAMPDX= 6.0         $$ Bruker NMR JCAMP-DX V2.0
##DATA TYPE= NMR FID
##DATA CLASS= NTUPLES
##ORIGIN= UXNMR, Bruker Analytische Messtechnik GmbH
##OWNER= root
$$ XWIN-NMR		Version 3.5
$$ Wed Aug  9 15:47:49 2023 Russian Standard Time (UT+4h)  she@DPX200
##.OBSERVE FREQUENCY= 200.13135
##.OBSERVE NUCLEUS= ^1H
##.DELAY= (6, 6)
##.ACQUISITION MODE= SIMULTANEOUS
##.ACQUISITION SCHEME= undefined
##.AVERAGES= 8
##.DIGITISER RES= 18
##SPECTROMETER/DATA SYSTEM= spect
##.PULSE SEQUENCE= zg30
##.SOLVENT NAME= Acetone
##.SHIFT REFERENCE= (INTERNAL, Acetone, 0, 15.7039)
##AUDIT TRAIL= $$ (NUMBER, WHEN, WHO, WHERE, WHAT)
$$ ##TITLE= Audit trail, XWIN-NMR		Version 3.5
$$ ##JCAMPDX= 5.01
$$ ##ORIGIN= Bruker BioSpin GmbH
$$ ##OWNER= she
$$ F:/spectra/data/she/nmr/H-F/1/audita.txt
$$ ##AUDIT TRAIL=  $$ (NUMBER, WHEN, WHO, WHERE, WHAT)
(   1,<2023-08-09 15:47:02.90 +0400>,<she>,<DPX200>,
      <created by zg, POWCHK disabled, PULCHK disabled
       configuration hash MD5:
       00 E9 B6 7A A2 85 ED C7 34 08 36 98 17 FE 4E 26
       data hash MD5: 16K
       B4 27 15 BD 06 44 F1 00 39 31 79 74 A2 B4 E4 BF>)
$$ ##END=
$$ 
$$ hash MD5
$$ 7B 8A 81 25 1F 49 32 3A 0B 8B 8D 48 3F 69 D7 14
##$RELAX= 
##$RELAX= 
##$RELAX= 
##$RELAX= 
##$RELAX= 
##$RELAX= 
$$ Bruker specific parameters
$$ --------------------------
##$DU= <F:/spectra>
##$EXPNO= 1
##$NAME= <H-F>
##$PROCNO= 1
##$TYPE= <nmr>
##$USER= <she>
##$AMP= (0..31)
100 100 100 100 100 100 100 100 100 100 100 100 100 100 100 100 100 100 
100 100 100 100 100 100 100 100 100 100 100 100 100 100 
##$AQSEQ= 0
##$AQ_mod= 1
##$AUNM= <au_zg>
##$AUTOPOS= <>
##$BF1= 200.13
##$BF2= 200.13
##$BF3= 200.13
##$BF4= 200.13
##$BF5= 200.13
##$BF6= 200.13
##$BF7= 200.13
##$BF8= 200.13
##$BYTORDA= 1
##$CFDGTYP= 0
##$CFRGTYP= 5
##$CHEMSTR= <none>
##$CNST= (0..31)
1 1 145 1 1 1 1 1 1 1 1 1 1 1 1 1 1 1 1 1 1 1 1 1 1 1 1 1 1 1 1 1 
##$CPDPRG= <>
##$CPDPRG1= <>
##$CPDPRG2= <>
##$CPDPRG3= <>
##$CPDPRG4= <mlev>
##$CPDPRG5= <mlev>
##$CPDPRG6= <mlev>
##$CPDPRG7= <mlev>
##$CPDPRG8= <mlev>
##$CPDPRGB= <>
##$CPDPRGT= <>
##$D= (0..31)
0 1.2 0 0 0 0 0 0 0 0.06 0 0.03 0 0 0 0 0.0002 0 0 0 0 0 0 0 0 0 0 0 0 
0 0 0 
##$DATE= 1691581622
##$DBL= (0..7)
120 120 120 120 120 120 120 120 
##$DBP= (0..7)
150 150 150 150 150 150 150 150 
##$DBP07= 0
##$DBPNAM0= <>
##$DBPNAM1= <>
##$DBPNAM2= <>
##$DBPNAM3= <>
##$DBPNAM4= <>
##$DBPNAM5= <>
##$DBPNAM6= <>
##$DBPNAM7= <>
##$DBPOAL= (0..7)
0.5 0.5 0.5 0.5 0.5 0.5 0.5 0.5 
##$DBPOFFS= (0..7)
0 0 0 0 0 0 0 0 
##$DE= 6
##$DECBNUC= <off>
##$DECIM= 32
##$DECNUC= <off>
##$DECSTAT= 4
##$DIGMOD= 1
##$DIGTYP= 9
##$DL= (0..7)
0 120 120 120 120 120 120 120 
##$DP= (0..7)
150 150 150 150 150 150 150 150 
##$DP07= 0
##$DPNAME0= <>
##$DPNAME1= <>
##$DPNAME2= <>
##$DPNAME3= <>
##$DPNAME4= <>
##$DPNAME5= <>
##$DPNAME6= <>
##$DPNAME7= <>
##$DPOAL= (0..7)
0.5 0.5 0.5 0.5 0.5 0.5 0.5 0.5 
##$DPOFFS= (0..7)
0 0 0 0 0 0 0 0 
##$DQDMODE= 0
##$DR= 18
##$DS= 0
##$DSLIST= <SSSSSSSSSSSSSSS>
$$ [...]
##$SUBNAM2= <"">
##$SUBNAM3= <"">
##$SUBNAM4= <"">
##$SUBNAM5= <"">
##$SUBNAM6= <"">
##$SUBNAM7= <"">
##$SUBNAM8= <"">
##$SUBNAM9= <"">
##$SW= 18.05172834244
##$SWIBOX= (0..15)
0 0 2 0 0 0 0 0 0 0 0 0 0 0 0 0 
##$SW_h= 3612.71676300578
##$TD= 16384
##$TD0= 1
##$TE= 0
##$TE2= 300
##$TE3= 300
##$TEG= 300
##$TL= (0..7)
0 120 120 120 120 120 120 120 
##$TP= (0..7)
150 150 150 150 150 150 150 150 
##$TP07= 0
##$TPNAME0= <>
##$TPNAME1= <>
##$TPNAME2= <>
##$TPNAME3= <>
##$TPNAME4= <>
##$TPNAME5= <>
##$TPNAME6= <>
##$TPNAME7= <>
##$TPOAL= (0..7)
0.5 0.5 0.5 0.5 0.5 0.5 0.5 0.5 
##$TPOFFS= (0..7)
0 0 0 0 0 0 0 0 
##$TUNHIN= 0
##$TUNHOUT= 0
##$TUNXOUT= 0
##$USERA1= <user>
##$USERA2= <user>
##$USERA3= <user>
##$USERA4= <user>
##$USERA5= <user>
##$V9= 5
##$VALIST= <valist>
##$VCLIST= <CCCCCCCCCCCCCCC>
##$VD= 0
##$VDLIST= <DDDDDDDDDDDDDDD>
##$VPLIST= <PPPPPPPPPPPPPPP>
##$VTLIST= <TTTTTTTTTTTTTTT>
##$WBST= 1024
##$WBSW= 4
##$XGAIN= (0..3)
0 0 0 0 
##$XL= 0
##$YL= 0
##$YMAX_a= 79023
##$YMIN_a= -18705
##$ZGOPTNS= <>
##$ZL1= 120
##$ZL2= 120
##$ZL3= 120
##$ZL4= 120
##$ABSF1= 10
##$ABSF2= 0
##$ABSG= 5
##$ABSL= 3
##$ALPHA= 0
##$AQORDER= 0
##$ASSFAC= 0
##$ASSFACI= 0
##$ASSFACX= 0
##$ASSWID= 0
##$AUNMP= <proc_1d>
##$AZFE= 0.1
##$AZFW= 0.1
##$BCFW= 1
##$BC_mod= 2
##$BYTORDP= 1
##$COROFFS= 0
##$CY= 11.3945322036743
##$DATMOD= 1
##$DC= 2
##$DFILT= <>
##$DTYPP= 0
##$F1P= 15.7292609196834
##$F2P= 12.9074282941183
##$FCOR= 0.5
##$FTSIZE= 0
##$FT_mod= 4
##$GAMMA= 1
##$GB= 0.15
##$INTBC= 1
##$INTSCL= 1
##$ISEN= 128
##$LB= 0.24
##$LEV0= 0
##$LPBIN= 0
##$MAXI= 10000
##$MC2= 0
##$MEAN= 0
##$ME_mod= 0
##$MI= 1.114404
##$NCOEF= 0
##$NC_proc= 0
##$NLEV= 6
##$NOISF1= 3.799351
##$NOISF2= 2.8
##$NSP= 1
##$NTH_PI= 0
##$NZP= 0
##$OFFSET= 15.70392
##$PC= 1
##$PHC0= -21202.44
##$PHC1= 8.252722
##$PH_mod= 1
##$PKNL= yes
##$PPARMOD= 0
##$PSCAL= 0
##$PSIGN= 0
##$REVERSE= no
##$SF= 200.130013532006
##$SI= 16384
##$SIGF1= 3
##$SIGF2= 2
##$SINO= 400
##$SIOLD= 16384
##$SREGLST= <1H.CDCl3>
##$SSB= 0
##$STSI= 0
##$STSR= 0
##$SW_p= 3612.71676300578
##$SYMM= 0
##$S_DEV= 0
##$TDeff= 0
##$TDoff= 0
##$TI= <>
##$TILT= no
##$TM1= 0
##$TM2= 0
##$TOPLEV= 0
##$USERP1= <user>
##$USERP2= <user>
##$USERP3= <user>
##$USERP4= <user>
##$USERP5= <user>
##$WDW= 1
##$XDIM= 8192
##$YMAX_p= 0
##$YMIN_p= 0
$$ End of Bruker specific parameters
$$ ---------------------------------
##NTUPLES= NMR FID
##VAR_NAME=  TIME,          FID/REAL,        FID/IMAG
##SYMBOL=    X,             R,               I
##VAR_TYPE=  INDEPENDENT,   DEPENDENT,       DEPENDENT
##VAR_FORM=  AFFN,          ASDF,            ASDF
##VAR_DIM=   8192,          8192,            8192
##UNITS=     SECONDS,       ARBITRARY UNITS, ARBITRARY UNITS
##FACTOR=    0.0002768,     1,               1
##FIRST=     0,             0,               0
##LAST=      2.2672688,     0,               0
##MIN=       0,             -18705,          0
##MAX=       2.2672688,     79023,           0
$$ Real data points
##PAGE= N=1
##DATA TABLE= (X++(R..R)), XYDATA
0 0 0 0 0 0 0 0 0 0 0 0 0 0 0 0 0 0 0 0 0 0 0 0 -2 1 -1 0 0 1 -1 2 -2 2 -2 1 -2 2 -2 3 -3 2 -2 1 -2 3 -4 4 -4 4 -4 5 -5 5 -7 8 -9 13 -13
57 -13 17 -20 26 -36 45 -61 85 -121 186 -307 568 -1327 -18705 3389 -2104 -279 520 -1607 3425 170
77 170 1065 -2113 -301 -906 -2123 -262 -705 757 1701 379 -804 -545 -3346 2544 -895 -1460 709
94 709 1363 987 -1320 1094 387 109 -470 -2131 -871 722 -1998 -814 1438 314 -627 -964 1606
111 1606 -153 -1732 25 -454 -1336 -1565 476 687 -895 -1622 -2081 -1390 -2144 -1128 365 864 1533 1750
129 1750 2479 1857 315 -2089 -2142 -1925 -1899 -2088 -1695 -692 1324 1051 449 -65 192 384 259 -138 451
148 451 1141 1344 839 -111 -1634 -1616 -692 -142 -129 214 318 319 82 615 998 448 -240 -1096 -1335 -124 760
169 760 600 452 236 -135 -686 -394 159 -14 -79 96 318 151 111 -708 -983 -925 -608 -29 742 1262 1207 1033
191 1033 579 -414 -1016 -720 256 932 1054 1143 918 725 587 412 -2 -487 -956 -1149 -164 742 703 326 -80
212 -80 -86 -288 25 371 540 740 663 326 -519 -891 -476 174 322 -436 -512 -524 -259 -222 282 585 670 272 -232
235 -232 137 128 -358 -525 -238 -16 -31 -387 -516 -538 -134 293 578 246 -16 -449 -193 -56 -199 -109 -149 -65 337
258 337 5 48 -76 -37 -93 103 198 -3 104 -113 -142 -211 -241 21 -67 -75 -33 -234 -171 -131 162 505 373 301 209
283 209 65 135 99 624 231 -69 -68 50 -286 -165 -248 22 146 -164 92 68 -253 6 -2 -422 -102 86 -163
306 -163 161 -41 -179 -21 250 64 14 -141 -230 237 -174 -101 -88 -158 -197 -140 -17 -63 -128 151 26 -91 -50 -63
330 -63 27 56 -79 -131 -103 312 -194 46 101 -104 -367 58 68 -151 -155 109 -9 -69 -145 -164 160 34 -191 -49
354 -49 -99 92 -16 -78 200 -216 -100 212 28 -32 89 153 126 -127 -210 202 -51 -31 0 -247 -54 -77 -132 -58
378 -58 -102 -37 -87 -54 -76 12 -319 249 290 162 240 79 230 -44 -113 92 32 33 -57 -128 -4 -59 91 -69 114 -184
404 -184 11 75 -69 3 -83 135 -53 260 2 -45 62 167 282 142 178 -25 -165 139 -2 -91 32 88 -91
427 -91 2 17 -72 -120 -106 -94 -186 91 140 42 -112 65 65 -64 -16 -8 52 -67 10 -14 -164 1 -105 -163 -29 2 193
454 193 -50 41 -216 12 28 256 -30 119 137 -129 -20 129 -104 143 135 125 135 198 83 -104 38 112 -9
477 -9 76 -45 137 117 151 209 -14 -167 36 156 120 -17 -294 -23 48 -395 -181 81 35 17 195 132 96 -52
501 -52 -180 -77 74 -98 -229 -281 84 166 31 -126 24 -19 26 55 49 -11 -82 58 193 -167 -77 172 76 -9 -197
526 -197 235 138 -106 -52 23 17 -136 100 72 -213 -143 -26 -13 -369 -159 -271 27 -255 15 181 102 -42 37 26
550 26 50 -58 -202 -87 -76 81 -197 18 3 46 136 -106 -34 -162 184 78 154 139 -28 77 -39 222 191 -189
574 -189 135 -115 -16 -123 -27 -44 -57 113 -113 39 188 -12 -93 80 -81 -21 -146 -7 22 60 185 -15 155
597 155 -55 -222 219 -328 -204 -23 96 -54 127 -82 -197 -9 -61 392 -64 -57 72 -146 55 87 223 -21
619 -21 181 267 49 -8 -17 -116 -17 -110 -195 197 -191 -138 -80 -59 -108 -176 -313 -109 -228 39 194 85 -10 170 -121
644 -121 3 75 -11 363 -360 -282 -835 -1330 -701 -838 -1025 -435 -614 281 -26 -38 804 94 199 379 343 -209
666 -209 132 67 404 346 44 -68 14 275 292 240 -180 201 -362 4 57 116 32 -194 183 -183 -82 49 -102
689 -102 177 20 7 -271 293 -72 -241 -55 37 121 152 179 -125 58 -133 -55 93 -117 -67 156 291 135 118
712 118 75 42 -132 -102 -139 -252 153 0 -30 86 -102 30 162 33 162 109 -182 -120 -53 -145 153 94 120 304
736 304 2 -20 -206 -13 -162 -60 170 -120 -40 80 115 234 35 -19 -44 -53 36 26 238 144 154 -147 79 17
760 17 -129 44 -120 -134 -138 47 197 -94 79 -35 -87 -25 212 -151 106 151 133 143 25 78 177 25 -142 -75
784 -75 72 -29 -76 -7 -105 83 463 183 96 52 -49 194 -16 -117 -4 80 -47 -418 48 294 -57 257 160
807 160 59 191 236 -58 12 19 262 -128 223 68 -136 -15 63 -33 -202 -212 68 -70 157 63 -28 175 145 -135
831 -135 143 241 -50 11 58 40 8 -76 32 26 56 -140 27 -37 -51 245 -55 -114 132 252 -52 60 63 74 168 31
857 31 -53 243 -238 -168 -77 -26 -51 12 -67 -3 6 42 52 147 137 -52 -60 8 -12 -83 82 108 -156 -116 337 268 -103 10
885 10 -44 101 -33 -104 -118 177 -19 -108 -3 132 -171 241 -165 202 76 -213 33 112 -116 141 118 -71 -60
908 -60 114 114 -122 -224 -35 118 -192 -165 97 16 117 44 -73 108 -81 -169 -144 80 237 -116 18 -88 139
931 139 194 53 -77 81 96 -252 183 -109 -214 -43 122 72 29 -185 113 -70 -186 -297 31 187 -177 150
953 150 171 346 -35 54 -282 -255 142 4 21 116 145 -41 -26 -281 32 129 -91 21 116 193 -66 -208 -15 -261
977 -261 -10 82 72 12 -95 2 80 97 -26 241 -139 -96 -46 -274 -48 26 -5 53 47 -142 146 150 -96 -31 34 -4
1003 -4 -306 -130 -28 -160 -93 -305 -78 -72 -14 25 105 -39 -90 -124 169 -101 -99 -168 -7 12 -125 64 272 -60 -26
1028 -26 -52 -71 83 -15 26 65 -96 60 26 -123 -144 -45 158 -68 -137 -37 119 221 -106 70 -142 -197 -65 -133
1052 -133 -82 -40 28 12 171 124 -31 20 -261 -129 12 -62 24 -71 2 34 134 -54 211 77 -88 77 23 -26
1076 -26 -157 -12 116 80 -29 59 70 -204 -17 18 -153 -25 89 168 -187 46 -197 -30 -22 125 52 79 26 -92
1100 -92 -91 62 -50 -55 -11 -104 146 109 -285 -129 179 72 -42 -139 114 -154 354 72 1 -1 -61 -44 32 216 58
1125 58 38 -6 -153 92 -109 -69 -54 -241 188 201 -7 13 97 29 207 268 -185 -180 -18 -140 -4 40 -200 47
1149 47 193 136 44 140 -126 154 -69 -330 -254 -73 -74 262 -129 160 -142 59 15 -226 -10 70 35 244 255 247
1173 247 -47 113 -61 54 -209 -62 50 220 -142 168 -180 -299 -60 231 326 9 -104 -107 -94 8 -208
1194 -208 -232 92 80 7 -9 -29 -96 101 -240 -121 90 -124 198 -40 116 -62 -317 114 96 81 3 -59 132
1217 132 -49 88 202 32 173 -16 155 -83 -14 -187 183 0 -61 -262 -241 68 188 -111 38 -198 -194 -85
1239 -85 -15 -58 -122 -132 -37 -73 -59 -41 -357 84 -2 -252 70 29 234 226 -85 -189 -11 52 -40 221 -92 -36 103
1264 103 271 -203 61 -11 -144 70 260 -236 -54 -13 -95 23 -30 -135 235 -257 209 36 82 196 4 121
1286 121 -147 -70 -233 7 -15 -113 -92 -92 -19 -153 60 64 -50 35 197 141 -83 -71 112 259 39 -373 -113 -22
1310 -22 -90 -220 -20 -65 -125 -140 -177 16 -126 18 33 114 -53 -161 51 38 -86 -221 -99 -38 -254 -349 1 -78
1334 -78 -85 -114 140 105 -207 -193 -121 -30 64 -22 -13 -57 -30 5 -205 123 22 155 -47 -172 166 -92 -47 -48 -50 -70 33
1361 33 -115 205 -94 8 -2 -33 71 -45 206 73 47 -138 -112 -53 -48 112 226 66 58 -45 132 124 30 -1 162
1386 162 36 -5 -233 19 -126 114 53 -52 10 197 -126 -271 117 -116 50 -73 62 -102 107 -51 58
1407 58 -18 -161 -72 -71 -2 -8 13 -76 -250 91 -44 -76 24 91 -33 -136 -7 51 -8 4 291 -202 178 -64 73
1432 73 -41 -10 -290 200 143 -109 -64 23 166 345 -47 97 245 152 -244 -93 -95 -56 -110 -55 -61 -148 -74 144 25
1457 25 -157 -158 30 -140 22 26 -89 108 8 -218 276 -92 -41 80 -137 113 271 30 -224 167 -123 -95
1479 -95 14 32 102 -94 -153 -218 -211 -53 -231 68 -125 -39 25 -212 84 -33 -155 146 247 -177 35 152 193
1502 193 157 108 -253 -128 -217 39 367 141 37 -11 -21 -312 50 99 -27 -238 -23 190 91 222 14 -193
1524 -193 4 21 175 -103 59 198 -35 -63 -83 51 121 14 168 30 13 -27 -46 22 11 230 148 -248 -82
1547 -82 -73 64 -126 -45 90 -161 72 -87 135 133 -22 125 -16 21 -40 152 250 96 161 -40 -3 -160 -15 2
1571 2 -105 -171 -44 12 -35 22 -133 -81 113 143 101 -56 -94 50 -4 54 119 -43 -152 18 -167 84 25 -221 134
1596 134 95 184 223 -64 -187 -142 93 -8 211 -61 -217 48 -64 188 33 35 101 -53 148 111 -127 10 162
1619 162 -243 -130 -165 -38 100 -75 -68 138 -222 -83 -44 48 123 -158 -238 -44 98 115 11 183 11 21 134
1642 134 32 -228 -46 -220 -54 -20 -77 61 -9 -296 -103 -22 122 0 326 14 112 118 -229 -187 -17 176 -88
1665 -88 123 -164 67 -240 -21 68 -13 -64 200 -166 278 11 161 -103 139 30 248 -128 14 11 -270 -57
1687 -57 128 203 -57 300 -13 -229 -127 -11 -182 170 -186 -261 232 241 33 20 187 84 -43 -62 -18 102 79
1710 79 203 -15 50 158 11 66 -114 -15 -48 -121 63 108 -37 -48 16 123 -86 66 -45 18 -4 -70 32 105
1734 105 -349 -246 20 -124 -163 -205 -272 -105 -137 -52 -128 221 -106 -40 -94 31 -11 -81 77 123 150 275 360 -49
1758 -49 88 100 -215 -205 -232 -45 99 -254 26 105 -46 119 -107 263 71 80 15 -29 44 174 -174 -31 -43 -25
1782 -25 15 52 -115 -277 104 68 45 -188 -258 -89 126 -328 -316 -5 280 -51 230 -256 160 -171 -148 -293 -50
1805 -50 47 92 -28 62 218 134 -45 -86 98 13 -134 68 191 4 -169 -167 283 16 -108 -91 67 49 -286 197
1829 197 -150 87 29 106 -179 -144 212 4 -74 -148 -149 12 -66 32 13 50 145 112 -88 -292 7 195 -123 -58 -41
1854 -41 200 181 32 81 -199 -154 -253 140 -61 -24 70 -68 -96 -380 -100 68 58 2 10 41 -29 16 155 7 98
1879 98 36 -233 156 -164 -318 -99 6 -136 195 -66 -163 31 73 11 -160 110 136 14 -149 -59 -99 85 -110
1902 -110 -236 91 -47 197 154 66 45 -88 -76 -90 77 -47 58 162 -47 16 13 65 -2 -22 -174 131 50 104
1926 104 132 77 -113 3 17 88 -51 170 -3 233 -56 -85 -20 22 181 0 161 163 185 -310 14 -108 65
1949 65 15 -7 -25 -54 244 213 172 -132 223 11 -85 91 36 -12 -176 -26 -3 128 -52 143 52 -85 90 173
1973 173 -141 106 47 145 -11 -1 -244 284 36 -45 -119 -25 73 100 -246 -152 -19 -320 293 -62 1 92 98 -2
1997 -2 -86 -79 -14 31 8 -261 96 150 0 -150 -206 -40 -65 129 370 -32 199 -9 -12 73 -23 204 -107 76 15
2022 15 -87 -77 -122 -16 3 -17 34 109 -20 -130 9 -79 71 22 157 93 93 -167 52 -241 210 -109 -58 -165
2046 -165 -152 3 -84 34 59 139 15 -198 -282 57 211 16 -194 51 -251 85 96 61 -106 -54 96 59 -158
2069 -158 -151 145 -141 138 -160 -80 -59 -123 43 260 -58 100 295 178 10 3 65 2 -199 43 -289 -123 236
2092 236 67 141 272 -30 -70 101 -49 90 -265 94 -211 135 -29 -22 84 -438 -71 269 -5 -67 87 98
2114 98 75 210 -15 57 214 46 -162 -137 -219 -144 -9 -1 -171 12 6 -296 -46 -119 188 132 -12 -115 31 -200
2138 -200 -177 261 33 200 51 93 -252 -21 10 -133 -76 37 102 64 -197 205 -110 228 55 -114 -69 -28 192
2161 192 105 -204 -116 32 -10 -8 -140 55 -221 -76 29 -94 49 -15 185 152 -11 -89 77 -70 -215 49 -58
2184 -58 -16 -17 155 221 -70 10 -67 94 257 203 -37 -170 -118 -119 243 1 53 -144 192 -24 25 -72 22 -142 -200
2209 -200 -65 214 -107 1 54 20 251 -251 -249 -89 108 68 -145 -216 -32 -177 34 108 -71 20 180 -192 -78
2232 -78 298 -165 -112 -74 19 25 -107 -190 -83 208 -21 -85 -77 182 72 65 27 -84 271 -124 -96 -47 72 29 66 -99
2258 -99 118 -10 -142 -258 -146 -170 177 122 -148 65 224 163 170 159 305 132 -35 -139 -56 302 -122 14 -46
2281 -46 -249 82 -64 -115 -183 -200 -66 44 34 128 -178 183 44 -44 -196 -176 48 22 -45 54 -76 -89 9 -121
2305 -121 93 -41 -8 115 -130 -49 -130 10 139 134 151 -54 86 -254 -19 35 -207 113 -90 121 -90 96
2327 96 -196 33 -172 -122 -317 49 106 -113 17 -221 -22 -75 38 109 -139 59 125 -51 183 150 24 161
2349 161 -55 146 -73 110 -170 99 -260 -35 147 189 1 -34 -32 18 -74 101 35 -46 326 29 344 -176 -17
2372 -17 -160 176 -45 -59 62 59 -46 7 97 -78 -271 -250 -51 49 67 -10 131 -96 46 -11 -83 17 -170 74
2396 74 88 143 76 14 217 -307 -68 145 105 14 62 -22 8 -113 10 2 -100 7 53 183 -224 152 -101 -198 -74
2421 -74 -148 27 -197 139 46 -120 -142 -4 21 -253 126 114 -80 -309 -46 29 395 93 52 106 -160 -239 145
2444 145 30 -159 186 -60 -71 49 261 167 -189 -17 98 232 -148 -77 -26 16 -38 -19 12 -2 100 95 19 -259
2468 -259 94 -16 25 122 -129 -96 78 186 137 4 -94 46 77 221 131 274 20 -67 72 -226 -70 90 -108
2491 -108 -25 305 -1 23 332 -82 57 70 -44 -145 144 241 2 -289 197 144 152 156 95 171 -26 -53 130 164
2515 164 -219 -319 148 -156 -197 44 -264 238 -58 41 -73 189 38 140 61 -104 -81 94 110 -156 -173 -103
2537 -103 -336 -133 -181 38 -128 74 145 166 11 -277 6 195 69 59 163 88 296 261 253 -81 155 19 332
2560 332 39 -68 163 85 -69 23 -175 173 -83 -37 -149 185 -129 30 -6 74 -138 142 138 83 96 -96 -20
2583 -20 9 -90 134 54 86 18 -144 -2 -106 172 35 42 44 -185 309 -12 -144 175 -73 -153 -110 8 240 147
2607 147 -11 150 118 -202 -54 -2 23 32 6 -75 214 53 13 125 -79 -134 -138 71 120 -172 -221 -145 98 -130 -63
2632 -63 -174 -30 122 -170 133 -75 114 25 17 -85 -194 -175 -24 -5 52 65 24 -56 51 -155 -114 109 -47 -113
2656 -113 -101 101 128 -302 -31 -207 -104 -54 5 -65 21 -46 -25 -78 -88 -81 38 21 197 67 -58 87 -48 -145 -273
2681 -273 -25 -25 -119 37 -7 20 119 32 -228 -74 43 -253 59 -107 74 -162 -105 -109 74 70 -99 -165 -165 -8 -101
2706 -101 -34 11 -359 -20 20 1 -190 -177 145 69 148 -83 84 211 42 -35 181 13 -90 281 -68 -7 99
2729 99 -3 -61 -192 -29 118 297 99 78 96 -18 -19 41 19 50 2 -12 194 18 12 -12 -214 -231 35 176 145
2754 145 56 -40 -88 134 -65 -131 117 -218 30 -61 30 192 55 107 21 -113 -128 -47 -154 -101 247 27 136 115
2778 115 -315 -23 -148 -274 -64 -155 -123 -69 14 -74 125 100 -36 140 56 47 -201 -34 6 -244 -57 175 -183
2801 -183 87 -14 -117 -25 23 -165 -78 -34 -136 -107 161 136 -155 78 204 121 -20 111 -60 -238 -70 -16 -62
2824 -62 -67 -191 -86 160 203 -129 -19 -37 -33 -43 163 -38 125 -131 83 107 143 262 -91 -82 -39 -43 93 262 -11
2849 -11 -20 -220 111 -77 151 -21 63 23 -111 -123 42 18 -22 125 58 -114 102 152 -60 -81 -55 78 303 108
2873 108 -49 5 -297 -238 196 55 252 146 3 215 250 149 -11 88 -149 -292 -166 -154 -143 -102 -165 -55 -166
2896 -166 151 112 2 -186 -40 -178 85 -42 -149 50 -152 56 234 184 203 -50 141 26 54 102 160 83
2918 83 221 -53 203 183 99 39 -6 53 79 142 103 -12 66 -71 -94 31 139 8 -373 -179 -85 -179 -297 -44
2942 -44 102 -158 148 35 293 18 -42 -190 -46 31 59 -61 -129 83 -23 -183 -177 -13 -55 -35 -110 -65 19 71
2966 71 -94 -127 -158 -121 91 -69 -99 147 -143 279 -77 -287 15 -121 204 -109 219 45 -180 -21 -118 -6
2988 -6 15 -27 48 14 182 258 58 58 -93 -82 -151 -170 -42 77 69 -127 84 41 -131 96 25 28 112 -115 92 124 269
3015 269 -8 27 26 -153 51 31 -51 -215 -60 30 -52 -98 -208 282 -191 147 24 -135 -10 -43 15 311 3
3038 3 52 -141 202 49 -211 92 154 -85 -152 317 -285 136 135 -289 74 -96 75 -109 -82 -106 27 202 26
3061 26 -100 -9 154 159 -27 37 -113 181 -139 56 30 -34 -94 10 213 -144 81 -27 179 42 -2 36 286
3084 286 -47 190 189 -29 24 -214 -15 -30 81 -208 23 92 68 -86 -58 187 113 94 42 108 -63 13 -38 143
3108 143 122 242 50 -99 -42 318 33 -56 -138 -107 -158 52 14 81 -69 213 132 -72 20 -250 -6 -77 -138 -101
3132 -101 108 -18 -75 -135 142 -64 -91 19 192 -109 -49 33 -56 94 84 -61 77 -99 -9 -118 1 -83 -376
3155 -376 100 -141 -158 81 -11 -110 -88 98 -131 -55 -240 123 107 -111 245 28 336 16 413 228 115 65
3177 65 -54 -43 -232 -133 3 152 159 -223 136 187 50 -105 10 40 -204 -78 24 21 -17 -119 -1 -208 76
3200 76 112 -32 -126 51 -136 -123 123 71 11 -151 132 -64 114 358 19 34 -150 -148 6 274 72 199 -1
3223 -1 94 -12 -315 -46 -8 56 22 220 33 55 -150 -94 -95 -105 8 29 -63 63 200 231 -6 128 -7 97 -186
3248 -186 117 -15 -47 42 -122 -161 -147 176 122 19 133 1 294 240 -85 75 54 83 246 -34 -31 -46 32 201
3272 201 12 208 -97 -17 -78 52 106 -88 150 -178 54 78 -20 62 -39 61 45 125 51 212 -22 -154 -36
3295 -36 -254 -15 -205 35 -198 119 74 220 135 85 196 287 120 9 -193 -53 -81 58 -82 142 134 21 -200
3318 -200 -355 -317 -37 82 -252 -95 -29 72 -209 257 -52 -130 10 -159 73 -168 63 -18 -45 258 -147 1
3340 1 -104 155 225 44 153 221 -127 204 -66 -116 45 -168 -84 143 -112 -203 60 -62 -99 -67 -66 48 -112 -147
3364 -147 249 111 -188 255 -50 -4 194 29 -159 -90 155 -22 104 -51 -264 -35 -74 53 -137 271 -7
3385 -7 38 7 48 -93 -19 13 -207 -28 -126 -45 -40 -212 -224 -49 150 249 230 125 -74 -132 276 -41 203 109 -110
3410 -110 -48 274 -103 138 -123 13 -182 94 51 126 -17 220 139 11 -196 29 102 54 -291 -109 -69 280
3432 280 -54 -10 -59 24 24 -101 -211 45 161 80 -71 -300 -227 -21 169 -89 -17 84 1 58 256 -135 32
3455 32 333 220 9 0 15 166 -79 -119 -129 153 -257 -33 165 -198 -127 -3 27 -98 -88 141 39 0 148
3478 148 228 -52 -120 -102 -23 55 -43 -266 154 -83 55 -3 247 -127 -53 -144 40 -107 3 -73 -76 21 49 -213 130
3503 130 5 -197 92 257 256 -41 47 26 46 -131 -18 -106 -11 82 112 65 -107 -174 -217 92 2 76 38 -9 188
3528 188 -137 -32 -63 -29 3 86 198 -95 -57 -246 134 45 -94 -241 -21 -1 170 -35 -24 364 -7 233 -57
3551 -57 50 14 48 388 106 -132 175 -246 162 -27 -75 166 150 48 186 -279 57 373 61 177 206 168
3573 168 131 -134 106 17 -4 146 -128 -258 149 284 -100 -25 -39 94 92 29 -185 108 -253 167 -62 185 24
3596 24 -189 -113 19 176 66 -6 -54 -251 -44 -200 53 48 45 -12 189 20 -37 133 -82 -143 -222 201 123 111 8
3621 8 -167 15 -248 215 244 -307 -83 -193 -95 -143 128 -9 -46 -176 114 -139 74 186 86 94 -249 -196 167
3644 167 250 -87 198 -109 149 221 190 -164 165 160 -86 92 -61 -48 -294 5 -218 -118 51 26 19 0 73 100
3668 100 -78 5 -127 -31 -150 233 -217 120 120 16 14 -58 -216 -102 135 17 48 -14 -66 -241 275 187 -136 -301
3692 -301 71 109 72 46 -222 -57 34 -48 -106 24 46 -6 31 -229 205 -228 52 29 108 68 -246 -39 -35 30 114
3717 114 -77 -110 55 12 100 17 166 211 -8 95 250 -199 -150 -69 195 -106 109 -21 284 -82 115 19 121
3740 121 79 -17 19 -133 206 -241 -169 -214 -130 -148 46 154 278 -99 -180 186 -111 128 -82 63 -150 -105 131
3763 131 -109 47 -216 131 -168 120 -89 -53 42 47 25 87 35 -106 -26 -25 -76 -19 -136 64 -55 146 -83 -140
3787 -140 120 21 -94 -63 207 75 -155 -109 247 112 51 83 -173 187 18 115 118 19 163 -122 75 21 -35 319
3811 319 10 -203 -73 -201 309 -131 -151 -49 -49 -137 81 -37 -126 -13 174 -41 -22 -150 155 38 154 201
3833 201 121 136 -295 -152 -15 57 -166 8 154 -146 109 -112 54 13 -8 -47 -94 -26 -87 231 -123 92 -2
3856 -2 0 249 -31 -85 -5 -64 -126 3 -34 32 -170 68 -94 177 -72 -192 47 -5 -50 -84 433 101 301 69
3880 69 45 5 15 -111 -26 -206 47 -161 102 318 -145 -50 -84 -358 -51 -28 75 190 -113 -139 -85 2 100 175
3904 175 261 31 -120 -105 -173 -8 -8 176 2 -205 112 -395 12 -193 -151 -96 208 10 -21 -84 -137 -9 186
3927 186 -64 -138 -11 -31 -189 -136 -8 325 -180 64 -22 -117 49 -49 45 -41 -53 82 174 -19 -206 -152 130 13
3951 13 68 66 -33 -7 -143 68 -111 45 -226 -273 -60 -187 -83 -201 -56 73 130 45 -3 119 93 270 100 -125
3975 -125 234 28 -229 78 -5 -121 -13 177 209 -133 36 8 -189 228 47 -107 -104 -64 58 -29 -407 -46
3997 -46 60 -53 -36 -90 222 -125 -6 -292 -8 51 92 -129 109 -114 -31 -72 -73 -7 -70 -17 -95 23 -89 -28 296
4022 296 -30 -77 -86 182 -241 -74 203 -137 99 -138 -77 59 80 26 23 -115 165 60 2 13 -115 94 -270
4045 -270 -37 12 15 -7 -42 46 -300 151 -12 137 -124 -216 -34 85 166 -70 -86 -30 -118 -22 -34 38 -56 144 160
4070 160 27 84 157 -32 -351 -22 -45 142 126 -46 -115 -176 -36 -10 160 -20 -66 -76 -35 47 -131 -156 148 -63
4094 -63 -254 153 81 58 -25 158 134 85 -94 207 4 -72 -76 -3 -100 258 167 -12 -73 22 -142 -33 353 95 121
4119 121 -32 14 111 -213 -21 112 -33 30 -46 27 -29 196 50 -92 229 45 -281 15 16 -85 -4 -72 5 59
4143 59 18 -178 137 -165 -6 -83 -118 272 119 165 -183 -128 -18 84 -112 197 -47 100 -30 -99 -51 195 -153
4166 -153 52 276 163 -38 94 142 25 -17 -68 37 55 -137 -147 -226 89 67 127 -15 198 4 -54 165 -29
4189 -29 90 -8 31 73 -141 103 -62 -156 64 94 38 -13 29 307 180 -27 -229 82 -24 72 -59 58 -119
4212 -119 -60 30 -122 14 87 117 215 -162 -36 -5 -188 177 164 272 22 -75 -75 226 81 -18 33 -33 -225 -41
4236 -41 220 -16 107 107 -14 39 -23 -70 -78 -173 -117 -288 62 146 223 40 72 247 -26 -123 18 -177 -170 297 196
4261 196 209 -95 -12 16 -2 -68 79 -1 -40 -33 129 -132 214 6 -101 149 -99 -28 64 7 -45 99 225 188 60
4286 60 -136 74 -21 139 -48 -23 61 -118 327 220 143 115 42 -167 -112 -71 242 93 -231 63 -213 10 369
4309 369 -96 -86 -96 -97 278 -51 -282 96 39 -27 -233 381 213 -95 -34 382 -165 -119 11 -238 -10 3 6 122
4333 122 -181 -88 -29 -205 -89 -223 -66 131 -196 -163 -95 -91 -220 -48 -19 77 -7 -22 -57 -115 -20 30 125 -100 167
4358 167 84 -65 -198 213 23 -109 -26 41 48 -28 -73 24 -208 -124 -80 234 59 105 -102 60 12 54 -121 40
4382 40 -21 4 226 -110 91 -66 -2 73 153 31 -70 16 44 -140 217 -122 175 12 -11 227 -9 163 297
4405 297 -80 55 152 -131 51 -30 -100 11 39 -236 -2 -163 66 36 170 9 198 103 181 -65 -28 103 -138
4428 -138 -102 90 -99 48 -162 -255 -58 -130 33 118 -55 -84 56 -137 -226 1 44 110 -335 169 -123 -20 78
4451 78 -134 -43 36 -7 -23 -17 91 -49 -74 144 277 -179 182 -104 33 245 12 111 54 54 158 85 -13 -94 -21
4476 -21 -191 -139 -124 -52 -259 117 -38 -81 6 -30 -78 5 100 -36 96 -17 142 12 260 102 -166 86 -88
4499 -88 -28 73 4 142 164 -27 -188 101 180 210 -24 40 168 -13 163 188 91 27 -344 146 39 -170 76
4522 76 172 192 143 -192 112 109 79 79 -140 84 10 -203 -388 -31 -63 63 -62 65 218 181 -180 128 -219 12
4546 12 -8 -169 -258 117 204 -66 30 -7 110 -309 -86 20 62 -287 -291 199 -40 149 -10 -181 86 -133 -70
4569 -70 139 -167 209 13 3 -79 106 319 16 -35 -29 73 18 -52 5 -37 -333 146 -16 39 148 97 -215 -16
4593 -16 -284 -10 4 -31 50 12 -37 -194 77 45 112 -3 -59 -31 -119 -7 91 171 -10 -152 -36 173 201 -170 -279
4618 -279 67 -240 -160 5 -44 127 160 -153 26 30 145 -86 123 -68 -17 -58 -44 -8 110 -11 -101 187 -108
4641 -108 23 21 22 22 151 -38 -81 113 105 -18 17 83 -131 251 -1 69 -146 -22 -71 -177 24 126 213 150 -25
4666 -25 174 177 27 150 -101 266 -105 40 63 -202 -22 149 36 -1 -129 -174 -109 -78 13 -132 92 96 -25 -184
4690 -184 175 -90 137 -250 -191 -61 50 -85 76 177 -19 85 136 -15 -131 359 -94 25 -21 128 60
4711 60 251 8 -150 106 42 32 -232 34 -16 251 411 115 -309 118 -196 218 -60 -262 -187 -5 65 -83
4733 -83 -105 -275 93 -142 168 127 30 -132 -216 -39 -32 -189 -50 57 209 0 -2 209 20 -106 17 127 103
4756 103 -100 117 15 172 100 -37 107 -24 115 75 -232 94 148 -8 -33 -17 66 148 47 30 40 -3 -129
4779 -129 -183 -113 -70 37 40 -4 -239 -90 18 -58 -5 66 -8 -25 213 -39 9 191 -213 129 -1 -22 -27 -139 -121
4804 -121 -203 -58 179 163 -70 -5 156 -81 -120 -206 162 -33 -357 -142 -106 -173 -143 -123 -38 41 44 111 -33 32 31 258
4830 258 -169 -71 127 -104 15 -73 211 -73 -243 -8 159 -27 70 -58 -168 -75 187 -19 -330 8 -176
4851 -176 -62 -61 65 144 -80 343 -43 -118 -142 -66 112 29 31 -72 -164 71 106 -232 -216 -53 -127 -78 231 175 -57
4876 -57 183 101 239 97 70 102 -108 76 250 -123 -323 24 70 -48 -304 -46 211 -127 18 6 -37 91
4898 91 257 60 -51 -142 47 -192 129 -55 -94 -16 -24 14 243 -200 -228 14 -64 -17 -98 299 67 91 77 293
4922 293 307 -236 -60 243 104 -122 -187 15 -64 -202 2 54 -110 -7 -188 -37 -75 116 6 62 27 -26 -40
4945 -40 -165 252 160 129 -121 88 -70 58 135 -316 -28 121 83 4 11 89 -99 -85 -13 -315 -151 -167 -228 -28
4969 -28 -161 -30 86 53 70 -153 157 -44 72 189 66 25 -99 192 -39 -117 28 20 159 43 108 -58 49
4992 49 -80 -135 45 -96 79 24 -47 -143 -101 114 -305 -165 -97 -25 5 -220 125 -230 26 264 -32 -46 39 -196
5016 -196 142 -7 46 -8 73 122 -24 10 -28 170 -19 -111 -332 0 210 184 70 21 68 103 110 -81 -178 -90 162
5041 162 76 30 162 -3 180 179 -27 -145 -21 82 24 50 195 206 -47 -145 68 -41 -114 -24 92 35 136 -10
5065 -10 -82 -36 -44 -152 -60 -199 -245 -61 55 123 -188 55 -36 -6 82 148 -58 55 -66 55 -305 -28 136 0
5089 0 244 -53 201 -204 -1 94 -165 170 176 4 174 41 -4 -109 38 -86 214 -340 -151 -97 8 143
5111 143 -123 115 153 8 74 108 40 -130 247 -223 -10 47 -339 -24 11 59 52 48 -108 -174 53 -5 31 28 1 -312
5137 -312 -180 -67 15 204 -29 216 72 30 -38 -77 73 -73 -113 -90 45 -91 -89 -57 -138 -106 -104 168 -106 -7 79
5162 79 -86 36 198 286 246 7 60 -64 -129 -133 -81 -119 -78 116 73 184 45 38 58 79 130 42 -226 121 102 395
5188 395 48 -5 129 -81 -87 -101 26 67 183 88 44 -199 99 -43 15 286 69 226 94 -9 155 121 138
5211 138 -68 -129 -111 -170 -69 7 -5 -115 -27 21 64 23 -30 72 -72 104 -24 65 -64 -127 -95 142 18 19 -114
5236 -114 78 -74 183 3 16 130 -261 -245 -378 -172 22 26 -42 -58 -37 -75 7 -27 25 345 -193 -83 -112 -165
5260 -165 -68 74 -11 115 -18 -30 -91 -115 108 -247 -140 287 -156 -54 -343 -59 -176 -275 -16 -135 242 -187
5282 -187 -75 -17 -130 -148 5 -66 25 307 -23 -50 14 -79 -60 -64 -177 205 94 266 -5 108 -94 -70 -3 -156
5306 -156 -95 -126 386 -48 -22 -25 -153 51 -54 -37 -88 -38 -173 136 56 358 -108 133 -32 -10 -162 -30 15 -257
5330 -257 83 -49 160 -234 98 -5 53 -185 148 226 -108 -146 -204 31 92 -36 -109 110 -129 -114 84 -6 -87
5353 -87 -44 -82 -148 46 36 76 -168 -96 261 -217 128 -41 -144 -132 -119 -84 -33 -143 177 -117 -222 264 -125 -141
5377 -141 -252 220 353 -231 144 -13 186 4 -280 -61 112 -61 70 127 -77 -95 -164 -27 63 -174 3
5398 3 100 -82 -179 157 234 194 -95 522 11 15 20 -136 90 53 -106 -76 7 -28 -166 -225 61 -62 -172 -82 109
5423 109 -178 -240 -52 78 2 45 -89 4 14 34 -68 126 64 29 -156 166 -142 85 -99 -287 98 -68 -129
5446 -129 166 -14 25 -15 -100 -104 131 -197 -110 -133 -83 -110 -38 43 -50 -141 -159 -121 0 184 58 -50 76 46 -34 -114
5472 -114 130 -37 -134 126 181 161 -1 71 -203 211 385 -130 -62 -25 -23 -22 -131 -184 -17 -108 -8 191 26 -50
5496 -50 116 -97 -157 -181 -91 -54 -79 -36 -86 -235 -4 -13 6 -75 -31 -123 -97 -98 -15 -27 -146 -108 -127 -139 -56 53 -159 -323
5524 -323 66 3 124 28 43 -1 -23 103 -223 -43 -218 343 218 31 -11 43 -3 34 16 6 72 92 -59 -265
5548 -265 67 15 -143 -168 -4 -71 -101 -57 -60 54 -15 161 213 -127 131 0 -114 109 -23 29 122 -45 61 -192
5572 -192 -137 159 -35 -24 204 -57 -7 -130 -1 -82 63 45 25 18 77 97 164 -81 -32 205 24 -118 -55 -221
5596 -221 -236 -49 -156 79 168 -80 160 -129 -54 22 -2 35 -302 18 250 -85 52 251 228 21 -298 -170
5618 -170 35 -113 -11 309 -10 0 107 89 29 -19 73 123 -60 15 124 -84 -117 -188 253 -36 37 80 119 61
5642 61 -17 -179 7 -137 -1 134 -207 208 -1 64 -91 1 11 356 24 274 125 11 -78 -242 71 -51
5664 -51 -69 -65 -9 8 -17 -131 160 222 56 -32 -127 -264 -80 -116 28 -27 62 -89 76 84 -62 -43 129 54 -73 29
5690 29 257 27 -7 -65 6 4 -60 -228 -136 -31 69 111 -183 156 38 77 213 31 40 11 104 26 -109 -83 -26 -179
5716 -179 -218 147 195 146 6 80 159 29 -138 322 52 19 20 182 9 254 -287 -38 -208 120 -106 -111 -56 143
5740 143 54 -58 122 242 131 208 163 170 184 150 96 -359 -29 191 -45 -249 112 53 -67 -114 51 -31 -264 178
5764 178 -246 -198 205 262 -116 40 106 127 2 54 131 240 160 -42 184 -190 106 74 -220 -34 226 118 -88
5787 -88 6 234 111 64 -156 -132 -217 -54 -68 -88 23 98 45 -162 -54 120 74 -56 7 94 27 -210 -96 6
5811 6 103 -29 -256 -48 -128 70 184 38 -54 -13 64 131 -101 44 9 169 135 248 -155 274 -15 10 -215 -20
5835 -20 -50 -202 -31 75 51 -67 56 -24 157 -243 -109 -57 135 49 93 -169 89 14 55 206 -163 24 -204
5858 -204 -157 -72 100 169 62 145 59 -142 327 69 -188 -228 80 113 -83 -124 -33 92 83 193 -25 176 -3 8
5882 8 321 122 -106 -162 -86 -173 35 86 -193 16 119 -61 19 -35 -19 58 121 53 -118 116 -64 -19 112 142 15
5907 15 115 -90 233 -171 -141 46 140 -29 -356 16 253 -116 -23 -38 -112 -135 -195 130 308 -16 211 44 -117
5930 -117 11 -195 -32 -122 -176 -113 226 67 165 85 125 149 -151 18 123 26 77 185 -142 108 -169 102 -11
5953 -11 -238 51 75 62 148 96 -31 159 -155 -175 -97 -119 161 -10 184 -203 127 199 158 173 151 -83 193 -175
5977 -175 37 -221 -94 75 -165 -136 153 -209 120 160 -85 46 -11 3 -149 10 -31 29 -215 392 156 95
5999 95 190 -99 -191 81 22 -189 -220 -113 -4 -31 28 27 -79 106 -96 2 -107 -51 137 -148 257 -164 -69 -4
6023 -4 141 -326 -20 -4 83 -98 -150 149 18 -357 -128 162 192 -88 -80 -163 -234 24 7 51 0 259 -110 56
6047 56 175 68 89 -211 -112 40 35 255 -37 153 123 -74 -95 138 18 152 -161 -221 96 -75 24 -197 55
6070 55 129 -252 177 -120 -51 36 241 -75 -166 -106 149 114 -119 -26 -13 -131 140 -153 197 -41 2 -19 204 -89
6094 -89 -33 -107 187 110 -277 165 -121 -103 -208 -36 -5 26 161 -46 43 56 -75 -203 -31 -26 -16 -30 -197 -28
6118 -28 60 63 -27 312 -115 35 297 1 114 23 286 253 -54 381 47 92 -83 -86 -26 3 59 -55 -140 -69 20
6143 20 126 103 -40 4 -3 -12 228 -110 -108 -90 262 348 -18 181 -48 46 -20 -25 -195 -209 -12 -192 -314 -215 -232 115
6169 115 -206 -26 -2 41 163 254 31 97 -41 -150 -180 -139 -41 -14 118 81 -149 309 19 18 333 -29 122 -226
6193 -226 -7 286 -190 9 143 70 44 39 18 195 -26 176 280 -142 142 -21 -1 -66 -211 -45 -81 -92 -196
6216 -196 -73 134 163 -85 -43 102 -104 -107 -188 -121 -22 17 133 -1 68 36 112 1 -3 -87 56 -161 -2 61 44
6241 44 104 -73 68 93 -135 -28 -84 242 219 77 218 21 62 -65 -5 -184 -118 13 51 -190 -43 108 128
6264 128 -52 -19 -50 111 192 -63 -124 -246 75 -218 188 -44 -42 -184 -314 220 -31 -26 260 72 37 -304 63
6287 63 -160 117 -217 -98 -103 -208 58 -169 98 37 -126 113 -95 153 55 -108 44 -83 227 151 100 170 -177
6310 -177 16 -184 -152 -125 -122 207 -132 84 -174 181 -110 13 -82 -143 -175 -81 190 -50 203 15 -104 -89 -2
6333 -2 78 161 126 89 34 74 46 -127 -76 343 88 48 -307 -178 -78 -38 142 45 -101 149 -173 -188 -25 -75 -343
6358 -343 -73 43 -201 163 132 -27 82 114 -99 -179 52 109 -6 68 -45 -167 176 -56 8 -116 199 -215
6380 -215 -56 -218 -44 19 241 31 34 -17 -93 40 58 -257 -128 -11 34 4 50 -267 -45 -34 143 -179 145
6403 145 159 48 -223 103 65 -118 26 34 -167 -175 -36 -292 49 29 146 -60 194 -106 6 -322 215 172 -138
6426 -138 153 -5 -112 270 -48 -130 -107 99 -54 166 -264 92 62 -93 -23 -76 -203 -181 -250 59 -64 -99 1
6449 1 2 -30 -67 -32 -92 -14 -6 205 96 150 134 73 117 -70 -5 178 -219 -12 -120 51 17 82 -22 -138 -110 48
6475 48 284 -130 152 -147 -74 0 140 111 12 -21 -48 23 131 132 -177 -228 -296 -115 112 78 -107 -198 -200 139 55 -126
6501 -126 -17 -54 -42 59 -167 -123 -157 112 39 121 20 -9 202 19 113 -36 -262 171 52 -90 -95 122 52 40
6525 40 77 -130 -130 115 199 -106 193 209 212 88 -154 -122 -158 126 -213 -275 56 -218 -85 -44 95 88 -59 187 -189
6550 -189 86 38 229 58 -104 176 213 53 132 -67 103 79 -38 51 -98 159 79 -16 -12 151 10 -89 187
6573 187 82 -194 -192 -10 -19 -10 -24 152 -233 178 -62 -93 101 29 -144 67 113 46 194 -25 493 89 63 0
6597 0 -67 -214 -165 147 -25 -176 -34 49 -174 -135 -191 170 126 -151 218 258 -14 -261 19 111 109 63 -29 -75 6
6622 6 -62 19 20 149 -189 57 -203 -121 -221 -4 -56 191 40 -138 -108 -51 233 -90 -51 49 -51 -14 -125 -80
6646 -80 -44 36 -134 175 -10 -69 -52 83 58 250 -49 -215 -185 -241 -8 69 -39 -54 67 11 20 99 258 -40 -27
6671 -27 164 -8 167 -423 11 183 152 160 -345 -64 18 218 -13 30 -78 -174 -212 62 45 244 -24 -101 -154 -138
6695 -138 -24 92 -66 80 91 70 28 51 -64 146 93 146 -40 -41 109 -3 -208 -1 211 -36 49 86 -169
6718 -169 12 -111 -214 -269 28 54 4 154 130 71 -85 -299 100 137 84 72 91 117 -6 287 -63 194 -72
6741 -72 -31 5 -96 45 -277 53 131 22 53 -8 -77 25 -29 132 160 -56 102 15 -25 100 32 -33 -94 -66 -1
6766 -1 -183 188 129 -169 25 -35 -185 14 -62 -222 -223 0 -73 -4 48 9 -59 116 4 -6 1 53 -67 -7 -57 -59 -167
6793 -167 101 102 1 28 -74 -325 -130 11 -303 -33 -15 -139 -192 114 -57 -131 265 -75 -6 -91 -329 -24 -215
6816 -215 -160 -38 108 126 9 -57 59 93 -133 176 201 -9 -52 -73 256 39 -77 169 -224 41 134 152 230
6839 230 -106 -279 22 143 37 -239 8 59 -37 70 133 -83 -9 -87 111 153 230 31 -51 -9 26 71 -123 -3
6863 -3 222 -161 -337 -54 -28 -134 194 96 144 -113 279 -67 -27 50 -140 105 51 118 158 -354 45 -138 96
6886 96 222 -73 -85 -169 289 -206 -43 189 145 -261 -104 -25 -54 13 -4 -70 311 68 -66 189 -95 -56 51
6909 51 6 17 -62 -120 -81 187 -150 219 131 119 65 125 157 220 -70 -1 248 221 139 127 -255 -117 217 96 202
6934 202 -44 140 -176 169 -145 173 -12 35 -185 103 280 -158 -109 -119 -119 -56 -74 -142 -16 244 -61 94 270
6957 270 -144 -177 -76 116 57 180 -39 -223 220 -166 62 95 -197 -71 196 -76 163 -15 164 85 -77
6978 -77 -49 66 -330 2 23 -67 94 -108 -27 -177 -36 -80 51 -94 -217 -108 35 -42 -177 -158 64 21 211
7001 211 151 -62 272 -173 90 -8 -64 -225 -94 84 46 62 -124 -21 -36 236 -147 133 142 -74 -69 90 236
7024 236 248 123 -43 -246 52 163 136 167 0 115 141 86 -30 53 -151 -31 74 -97 228 -190 -50 62
7046 62 -256 144 -20 169 67 -29 123 -62 66 -185 14 204 -116 -17 -124 -15 83 68 -156 135 -106 -183
7068 -183 56 -295 -104 56 143 -91 108 -85 101 62 -19 -14 89 275 -48 -15 83 -166 -23 29 -35 129 9
7091 9 -131 -20 138 -33 -72 34 220 6 -136 37 58 -195 -53 162 25 -40 -119 -111 21 64 -40 334 -24
7114 -24 -11 120 -1 -353 19 200 -88 51 -33 -19 -194 177 -93 46 471 -68 -35 159 -189 -39 78 37
7136 37 59 149 -248 -159 262 -72 1 -15 55 -125 -158 -230 -41 -6 17 51 -41 -16 204 118 56 -108 -143 -55 64 -114
7162 -114 18 23 -156 97 -358 -134 -142 -274 21 -314 -71 118 84 -237 65 -46 79 -40 -86 -71 -224 -96
7184 -96 -44 94 81 -116 97 -16 225 13 -187 63 45 -229 -9 -68 66 -35 -6 82 27 -11 271 67 158
7207 158 89 -107 64 -3 -12 -128 -210 54 -16 -69 58 -4 94 -89 310 -20 36 243 58 7 6 -55 -7 -208 169
7232 169 -273 173 -20 -25 218 -17 78 226 -41 -161 -14 120 -8 -103 -99 -30 -246 56 -90 87 -30 149
7254 149 190 -133 -90 -1 -281 125 149 134 153 -88 -42 36 -131 -179 -57 -36 -214 19 -49 -79 -19 143 78 7 163
7279 163 -179 -239 -11 -47 -71 308 -86 -181 155 7 -100 -90 -133 -172 82 -159 418 -16 -184 -10 91 235
7301 235 -78 205 79 -93 -34 196 129 119 -139 391 -73 -248 -84 54 -104 19 166 -72 -112 -100 61 -75
7323 -75 -292 -56 -249 -43 57 -118 -45 -97 -45 -34 62 179 219 -89 -144 191 20 25 88 131 119 11 179 -228
7347 -228 -112 104 -44 -119 151 -122 46 -88 35 30 33 115 107 4 -282 46 232 -101 -143 -200 158 -12 48 -39
7371 -39 -93 7 146 -235 168 70 -214 -145 -206 -24 -25 42 221 48 -171 59 -30 49 20 146 -102 -39 -44 -121 47
7396 47 -27 -385 49 -102 27 -74 -253 108 65 -217 92 -77 -166 113 202 -33 -311 100 -260 1 -90 -83 31
7419 31 173 146 -39 -22 45 -90 -166 -165 75 128 -64 -4 -245 31 222 111 -265 -89 -68 -168 -68 -205 47
7442 47 -78 108 -47 47 -174 154 115 78 -6 45 56 -5 312 85 79 11 111 62 -44 75 -50 -327 235 106
7466 106 7 330 15 -28 41 -9 -57 -189 120 -44 24 -28 178 175 -41 -34 108 -41 244 -10 13 -234 65 114
7490 114 -75 73 -118 54 77 121 50 -61 181 95 -86 -181 9 -140 134 75 339 97 63 -61 -184 14
7512 14 123 19 -110 119 -27 129 -295 7 224 -130 -28 -181 101 -132 -77 -66 -57 -100 -122 -30 -99 -229 141
7535 141 156 -162 171 -58 -9 -220 320 -72 -25 -14 27 84 -5 119 -199 -288 -15 -215 -45 165 148 59 106 -103
7559 -103 -115 -30 58 -158 115 154 -57 -225 -52 -166 -21 96 18 40 -126 14 29 112 -117 -57 -6 -223 -246 -115
7583 -115 -152 82 -92 -2 81 110 328 -46 45 -220 -72 72 -7 5 -47 98 53 -150 2 -23 -70 -1 195 -10
7607 -10 -172 -109 130 -57 -138 143 1 81 76 -89 237 20 -48 161 231 106 36 123 99 -244 -27 126 -46 -2
7631 -2 -45 271 233 -125 -127 103 146 -189 105 -50 -64 -12 -124 -150 -1 -79 -23 280 -30 -81 48 127 180 47 -109
7656 -109 339 -73 -54 127 46 93 -16 -289 -208 104 250 -74 -72 -100 -18 -52 -99 23 -351 297 8 -3 123 -100
7680 -100 2 161 183 -121 -54 -38 10 -257 167 40 44 125 135 106 -369 -225 -19 141 147 121 181 -109 -121 -2 120
7705 120 70 3 31 -64 -30 0 -99 -38 257 -70 145 18 222 -90 23 25 -67 -21 189 195 -94 367 7 -235 -162
7730 -162 -29 -24 48 34 58 175 31 53 -85 39 -52 -204 -134 155 -82 -126 191 58 114 0 122 63 110 -91
7754 -91 -115 78 159 -164 -100 -35 -63 206 293 56 36 -16 -38 -5 -97 90 9 105 -42 2 -48 68 238 -231 -17
7779 -17 300 -96 -5 28 88 71 11 -214 36 -27 -168 21 118 -46 169 -140 -6 -123 33 207 -183 -135 -30
7802 -30 81 -93 174 181 -282 -190 162 -212 29 278 169 56 -15 27 -43 -46 -142 114 22 136 -14 -87 -186 -285 -46
7827 -46 48 -171 -78 -111 75 87 13 -36 145 0 283 -195 95 -196 7 67 -20 -29 216 -6 132 108 -84 -138
7851 -138 66 261 19 -139 29 48 -206 78 -60 78 156 -45 212 0 82 -76 -51 -53 79 -94 -44 99
7873 99 54 132 7 -225 -14 2 -137 -35 334 165 202 -244 143 -5 27 -192 -8 124 3 -65 134 465
7895 465 61 144 35 263 179 84 51 5 -209 -40 5 48 59 324 -170 70 38 128 127 100 92 -152 182 97 -27
7920 -27 30 0 -71 32 38 82 118 -72 -11 211 -130 57 43 -66 -58 42 129 -141 -149 194 -95 -74 126 -19 53 125
7946 125 52 147 -71 347 198 -189 -22 372 31 -59 129 -157 -211 -24 -212 104 -46 288 48 73 44 68
7968 68 -200 -10 166 -7 48 33 -225 -227 -130 50 -83 64 209 162 11 232 -45 -73 217 135 -129 49 40 -5
7992 -5 -21 -183 27 1 -116 -23 285 26 47 -104 169 -17 -43 170 79 -56 -160 -267 -84 -126 -196 -67 -17 -257
8016 -257 -164 -41 31 -81 63 -9 -103 179 15 197 40 -194 242 -164 -56 95 102 -46 -106 -116 -115 176 170 -48
8040 -48 152 119 141 -9 9 -5 29 -163 -110 -54 144 81 43 284 -257 1 106 87 -86 -22 216 156 297 -42
8064 -42 66 135 -89 -37 -109 155 1 -12 69 43 66 -116 -124 340 75 -16 -112 164 -161 32 -264 7 -4 -125
8088 -125 138 -101 -37 90 -213 -123 -35 -21 -39 117 -148 -15 124 -49 115 28 -53 30 -142 104 -19 258 -7
8111 -7 -76 124 -178 233 113 -65 -184 37 -28 126 216 40 164 -6 4 -59 -138 -180 -64 -2 60 -238 -137 57
8135 57 23 -1 -106 156 -149 62 -98 233 274 244 161 -136 178 82 79 -38 18 -70 -12 53 -92 44 -46 139 -26
8160 -26 128 -7 166 -51 125 87 -174 -49 -64 152 -122 0 66 -193 -10 -96 -139 -116 -95 22 -26 2 -185
8183 -185 6 10 -13 98 36 -107 44 -70
8191g0
$$ Imaginary data points
##PAGE= N=2
##DATA TABLE= (X++(I..I)), XYDATA
0 0 0 0 0 0 0 0 0 0 0 0 0 0 0 0 0 0 0 0 0 0 0 0 0 1 -6 6 -6 7 -7 8 -8 9 -12 14 -14 15 -17 19 -22 24 -28 30 -32 35 -39
45 -39 44 -47 51 -58 62 -69 78 -84 93 -103 115 -129 144 -165 188 -217 255 -304 373 -472 633 -922
67 -922 1559 -3707 79023 4376 -4082 683 -4242 994 -2393 212 -5 -45 888 3492 -273 -974
83 -974 744 -1258 1951 -1021 795 -435 -1346 -1435 1986 -1717 -1103 -1012 1234 -99 -1279 425 -1363
100 -1363 -2240 -485 -1879 204 1506 -1824 -1293 -1383 -1195 -1958 -1045 1814 -992 -2488 -1929 -1774 -1559 -1256
118 -1256 1516 2087 1136 1658 1398 1162 -185 -65 1345 1599 1193 775 983 2091 1320 -591 -1196 -1155 -771
137 -771 -1217 -1861 -1503 -363 -400 -6 -245 8 405 160 -5 387 960 1354 1635 925 -656 -1251 -828 -379
157 -379 -216 -364 252 -57 -52 833 1201 1539 659 -638 -1414 -679 -268 76 329 793 66 -472 -168 0 -196
178 -196 -15 -166 140 346 498 178 -378 -949 -1224 -1185 -403 -32 774 949 1013 369 -573 -1091 -856 -247 152
199 152 223 482 667 830 1040 1019 352 -482 -1089 -776 24 388 -75 -583 -578 -832 -873 -412 -182 323 667 468
221 468 197 -666 -530 -62 -29 -240 -348 -612 -686 -633 -244 116 649 282 -97 489 661 -120 117 151 357 449
243 449 295 -125 -635 -272 -107 260 625 246 -16 -105 -257 -170 -91 39 -69 157 34 -75 -10 -8 109 -63
265 -63 157 262 153 120 135 -101 -68 -128 271 69 -57 -284 -323 -478 -208 -266 -47 394 31 87 -31 98 299
288 299 259 -261 -46 -53 191 82 277 10 -74 282 26 124 -35 -23 248 -110 70 160 -17 -116 114 -39 -209
311 -209 98 -40 -301 98 44 -40 -100 -101 -2 8 95 191 -107 -68 167 142 78 -112 67 3 30 76 -101 -59 117 281
337 281 -42 -43 -47 -172 74 -134 259 -146 -88 115 132 254 82 68 93 -60 164 172 27 -37 -84 -164 322 76 -100
362 -100 50 120 218 -37 23 53 -127 244 196 -13 103 -131 -74 -69 136 -66 -64 2 293 -3 -72 231 174 129 72
387 72 -39 -86 106 -320 -113 208 -33 -51 194 -64 -10 -20 230 47 176 -30 -58 -100 -53 173 130 -53 229
410 229 -57 7 22 -8 319 -11 142 -194 241 106 -200 -162 123 47 -24 215 197 -136 -175 -44 -35 154 -190 49
434 49 -94 -3 -23 -70 193 132 130 -115 208 -140 39 198 2 -85 154 7 -151 132 3 -118 119 -109 233
457 233 19 198 -128 -23 -63 73 0 46 47 236 -25 -125 154 -114 174 218 73 260 57 -42 -3 -245 -141
480 -141 -139 94 -20 94 -113 71 -28 -2 -69 147 -170 59 -9 75 29 -264 95 -24 -193 69 7 23 -148 40
504 40 -84 81 -78 -272 35 215 -172 -131 216 -38 -24 108 4 -47 -1 -82 159 186 7 45 -303 25 -107
527 -107 -222 -20 266 57 69 -29 -67 -7 -186 31 90 -38 20 -110 -62 53 37 -166 202 135 -306 139 -307
550 -307 40 33 173 -210 -89 141 414 -81 -18 88 77 -59 -36 -34 70 -101 18 150 -112 2 152 43 -255
573 -255 -91 -121 188 7 201 -103 -21 151 -233 -112 320 -63 -126 272 134 11 -184 44 -107 251 -137
594 -137 160 -84 -163 -61 -10 92 121 -22 109 -86 60 190 -280 117 167 152 -44 -148 177 -9 -36 -19 230
617 230 -169 -146 85 221 -83 -217 83 -84 -33 223 -119 -114 100 101 32 35 134 -28 63 42 -45 -104 179 -217 197
642 197 143 145 154 123 25 -295 -334 525 51 -696 -1129 -950 -972 -306 -751 -853 -204 -33 -149 -489 -400 -204 460 -83
666 -83 158 -126 -76 -316 73 -174 -97 97 -27 117 42 7 -220 -3 104 93 128 205 226 -89 -132 23 -361 115
690 115 75 146 131 51 -264 -80 47 -137 -264 188 -70 -39 132 -49 -62 50 63 19 237 49 89 33 -75 133
714 133 174 119 -46 -124 -107 -47 246 141 87 -240 206 -214 152 -11 1 26 -36 -102 -195 -201 130 -58 37 22 -40 -121
740 -121 86 -75 68 -40 207 -80 38 -214 -58 108 -144 -41 95 12 -245 -37 -218 -28 -232 194 63
761 63 -94 -71 -12 -139 -14 133 -194 104 72 -157 133 -192 -102 -59 20 -44 192 -172 -74 79 -240 79 235
784 235 -41 16 28 -9 -151 47 -304 32 28 199 -29 16 235 -74 278 -139 -163 59 -164 -244 198 63 -258
807 -258 -80 232 -281 9 74 69 -124 -56 79 -49 114 -99 -311 55 -208 -101 -42 -58 -140 10 -18 156 125
830 125 32 6 -227 73 -122 102 -260 -73 -193 -44 -81 -81 75 219 -27 27 318 -4 -255 105 24 -192 12
853 12 19 -19 101 -3 44 -92 182 -184 -49 185 -16 -80 -169 0 27 -17 255 120 243 -59 -104 37 -127 3
877 3 64 -93 -2 187 -136 115 100 -63 -33 -135 40 80 87 -116 -49 253 133 -204 192 -98 98 -92 10 10
901 10 -19 40 154 105 -83 -57 24 -225 -299 -93 -68 -94 94 168 -54 -288 80 83 -173 143 -110 -237 -161 -58 12
926 12 -400 101 -325 49 100 -159 61 -38 8 64 -196 305 467 191 -17 -36 82 226 -279 -227 94 -5 63
949 63 -49 -33 -140 -107 85 29 90 77 56 76 -167 201 60 -30 -33 176 -7 -44 -49 -299 -61 71 -72 -138 -76 73
975 73 -32 23 -112 -38 183 30 -4 242 98 -198 141 151 -30 29 253 -157 -229 -260 3 58 119 -7 21 -6
999 -6 -13 -76 9 -167 -57 103 75 -34 -107 -94 48 -105 143 -109 -43 -43 -116 203 -169 -119 -22 157 43 -53 -14 -161
1025 -161 94 -101 31 -144 -266 50 31 -162 69 -92 222 -158 -2 98 220 386 90 -60 62 60 105
1046 105 108 157 52 -9 -238 168 68 254 -51 117 200 80 55 -48 70 3 40 -70 -77 -93 260 -219 9 83
1070 83 118 -138 32 124 -303 -70 45 253 -122 3 -59 69 -125 15 -115 115 120 9 323 135 145 -90
1092 -90 -14 117 -131 19 -220 165 93 86 126 -75 98 -31 -84 75 -34 -1 -137 67 207 -149 -62 12 9 158
1116 158 -214 197 -122 -482 5 -135 -94 105 106 -76 98 34 -176 -182 203 21 -32 181 156 137 91 -100 44
1139 44 103 58 -31 31 113 -8 -60 -12 103 58 -112 87 270 -169 -192 -79 44 69 46 -124 177 -126 -48 -3 -94
1164 -94 -25 120 -105 -43 -1 -44 24 -111 -13 -86 33 121 76 -269 29 61 74 176 -353 -33 88 276 160 -126
1188 -126 -43 217 -155 -274 41 109 -32 36 113 133 137 55 -85 25 -21 -95 -112 -73 77 60 11 66 -107 -39 -157
1213 -157 -7 -95 -101 135 -38 26 94 -38 -2 165 163 248 -107 11 123 86 -87 106 142 -54 46 -79 -143 123
1237 123 -147 -41 -149 -77 -119 14 78 -124 -112 233 -100 -67 118 13 -35 80 178 81 -144 65 128 -13 27
1260 27 -71 -23 -73 -220 135 222 52 -87 165 86 308 173 -74 -1 133 -99 -62 -30 -123 4 -247 -159 250 127
1284 127 -184 -110 38 -235 -224 -32 87 40 -228 -24 -101 56 -220 135 -100 72 -307 -133 -3 -259 116
1305 116 195 180 -125 -140 180 216 356 90 -178 32 -4 56 -125 -242 -16 112 -164 122 -76 23 172 80 0
1328 0 -52 -7 16 237 -55 35 310 34 29 7 165 60 102 -281 67 90 27 225 -56 155 -69 9 -251 -90
1352 -90 -291 288 -171 45 53 147 -172 -136 -128 -197 55 77 -56 -167 78 -103 -156 189 218 205 105 169 135 5 84
1377 84 -28 -8 -12 -92 235 8 81 282 -29 -26 114 -97 -11 -214 123 -69 59 -93 105 190 122 -26 7 -48
1401 -48 -64 -101 -56 -296 -108 173 -21 41 28 18 -166 187 -96 -214 219 -268 117 191 -98 250 -337 -129 -149
1424 -149 125 53 -13 34 -360 338 -48 250 -15 11 45 -46 -7 -123 -42 -266 156 2 -36 149 131 -10 -73 199
1448 199 41 -154 68 250 87 -250 -13 -169 -15 -205 -134 221 113 91 187 122 -93 -224 -69 -14 -7 166
1470 166 -105 -164 281 -11 130 -150 -51 158 45 -21 -115 -51 48 35 83 55 -150 -22 85 -35 -161 -100 156
1493 156 -22 -199 45 -87 -3 20 102 122 23 5 92 218 149 316 131 -76 -40 -28 166 38 88 2 5 92 84 -105
1519 -105 -34 105 -65 132 -97 56 -10 -96 -184 -168 106 51 -209 33 -19 272 220 125 -83 -58 -244 275 -135
1542 -135 -284 49 54 107 97 -19 -9 -103 -12 208 -361 -112 34 90 -52 -108 129 -49 235 -60 220 81 100
1565 100 -167 77 -18 183 151 -75 40 63 -284 -205 87 98 234 20 121 14 148 77 228 5 -184 -212
1587 -212 125 -77 117 -128 333 -82 -52 -49 -77 8 114 77 -80 -293 221 193 115 47 -365 59 94 64 -25 74
1611 74 83 128 144 168 17 -81 273 88 -22 -171 -78 -55 30 35 -18 87 -77 25 -125 -32 -28 -60 204 -29 -9 -15 354
1638 354 -80 -71 149 47 -273 56 -23 -79 277 -376 -147 71 -7 -10 47 -142 -103 69 173 -71 -36 -127 -32 151
1662 151 28 -278 229 -79 55 -132 65 281 -121 104 -3 8 276 -14 -205 -32 -81 110 -37 127 -23
1683 -23 159 -1 -104 -20 -137 -65 16 -144 224 -273 -174 211 221 -194 -162 -11 -223 22 36 62 114 -178 315
1706 315 -221 -200 -206 -172 5 -46 210 -45 -226 9 -146 -212 208 -148 -118 -35 -49 -44 -145 -102 -158 22 67 161 254
1731 254 112 -99 -38 17 110 9 -43 44 83 50 -139 77 132 93 -171 114 71 42 -120 33 147 -53 111 -104
1755 -104 50 -119 -4 -20 58 -185 104 -87 199 -236 78 53 1 -89 -50 10 -59 -159 25 162 -112 3 -43
1778 -43 -95 -192 5 -48 -21 116 -14 18 61 124 -32 19 12 -51 76 0 182 -233 -92 -194 -51 -129 59 100 -77
1803 -77 250 -4 6 -147 -88 -122 -142 86 102 -97 101 -16 -41 88 139 -103 -174 -180 86 -163 -194 122 -127 -57
1827 -57 109 -151 -10 -60 -133 -161 -163 57 -135 257 -77 -116 -137 0 59 -88 -12 -69 -271 78 -170 -219 -31 21
1851 21 -34 -63 -47 110 153 -16 157 -34 -288 -129 -26 -183 138 -72 139 10 -135 -31 -83 43 -44 221
1873 221 -58 135 -172 -29 147 136 349 -96 71 225 -46 96 -145 -362 142 11 -40 -5 -10 8 -228 71
1895 71 -22 -135 116 -56 165 -84 -64 228 56 -225 37 105 57 -24 229 367 153 -110 44 244 -6 -61
1917 -61 -182 -68 47 210 -140 108 76 228 39 101 -85 -47 55 -58 149 -31 -16 119 149 96 -368 -185
1939 -185 -92 98 10 58 -52 -295 178 268 91 6 16 -32 168 -71 213 -213 -224 -284 126 -111 -102 154 -397 -144
1963 -144 14 -14 -143 66 57 -138 12 135 -418 -328 -40 34 177 127 -157 2 182 -208 -203 -35 -47 -5 156
1986 156 263 -77 164 -147 -1 62 293 -196 -117 -238 -35 -23 187 17 38 52 143 298 -239 63 54 -94 65
2009 65 27 -68 261 184 105 77 -55 174 111 -57 47 -232 -248 -19 88 63 79 74 46 156 135 18 -132 -53 348
2034 348 10 -195 -183 9 -62 105 -9 -336 63 193 318 -137 3 -160 136 -70 174 54 -39 -256 133
2055 133 -248 -107 169 -165 -70 -116 -53 115 -143 -103 194 -105 63 -62 132 -24 -113 146 136 -191 -183 -60 98
2078 98 24 -342 -117 103 -25 70 -225 108 -131 153 -76 239 157 -157 20 -63 -91 -43 79 -7 -203 107 -63
2101 -63 111 358 88 -104 -135 10 -60 -38 82 136 67 139 12 74 57 233 97 -26 -88 -53 139 -148 -110 137
2125 137 -153 -53 -129 135 -56 -144 -24 169 204 -46 126 -182 143 4 47 -60 -154 276 -126 307 -20 -128
2147 -128 80 123 152 -48 -110 82 12 29 -109 114 67 -27 -66 -213 -101 -176 177 127 -9 213 -63 -45 135 -12
2171 -12 48 -3 223 121 16 215 -29 -183 52 102 -5 -8 -247 -8 26 12 10 102 -47 -41 15 132 -319 86 -53
2196 -53 -50 15 -168 93 26 56 141 -220 -137 -195 -163 43 137 -102 15 195 204 195 28 34 -133 -144 -26 -78 -120 14 -177
2223 -177 7 97 87 -132 306 -68 -218 212 -226 -51 8 -169 -62 -20 129 157 132 214 -185 234 -29 234
2245 234 46 105 192 38 -15 -257 180 -8 -184 -31 50 -73 128 -55 -31 115 -6 46 256 -101 -42 69
2267 69 2 100 6 -144 -138 -11 14 137 18 -205 -294 -68 79 -165 5 -54 -93 182 -124 -80 92 109 133 -96
2291 -96 -213 32 -76 -88 153 -114 5 196 96 246 -66 -149 -120 170 61 -150 -71 26 -135 168 100 243
2313 243 224 97 -96 139 289 -3 -256 -30 112 -37 -7 44 99 22 -146 -320 -35 -117 -129 356 -208 -25
2335 -25 -69 -12 128 -16 6 -10 55 -89 91 31 66 -26 125 70 94 215 -143 65 174 277 140 16 7 130
2359 130 379 51 -278 51 85 137 71 -215 56 -97 82 136 14 -25 184 -89 -214 -38 -88 -302 228 157
2381 157 -128 -147 201 15 4 -268 137 75 -59 92 168 -107 111 -52 -177 -135 37 30 -105 103 103 196 -7
2404 -7 78 -161 313 -50 -25 80 -53 70 11 -191 -54 42 120 -318 -108 -54 -118 -8 -237 -41 118 33 -179
2427 -179 212 -153 -245 -37 -72 -36 -44 87 12 -41 -7 -71 -93 73 45 223 -166 87 38 -278 -166 71 116 -86
2451 -86 -22 -190 155 -329 -7 8 -133 17 -225 -155 -170 -17 -123 -192 87 -101 234 -125 -129 -43 15 61 -21 -105
2475 -105 72 -23 -107 -110 -79 142 -17 -131 4 136 55 137 -99 -117 -136 109 -15 99 -459 -108 93 -111 -168
2498 -168 -44 348 -17 -58 -150 7 -133 -152 112 -211 -221 265 -11 -68 33 -145 -340 -137 -73 -1 -213 -83
2520 -83 39 122 17 -36 100 -180 -147 91 149 129 107 -95 106 -76 -117 160 -100 -343 -120 27 147 107 130
2543 130 39 49 259 6 -84 -188 47 87 -160 -34 -2 97 -234 -76 126 -73 -31 -354 -50 48 -54 -19 -24 -23
2567 -23 13 130 -1 37 -113 241 -75 -111 -213 -136 -2 -185 -89 111 -25 -77 98 -80 76 60 -161 -11 -30
2590 -30 -51 230 -237 9 -15 126 125 -63 87 -116 165 -97 -151 -86 -43 190 -140 -105 1 98 -301 -249 108 -229
2614 -229 106 50 172 -42 -35 -127 98 81 92 -75 71 1 -5 68 -178 21 -272 127 -53 68 -46 94 68 97
2638 97 64 -203 138 31 82 -10 72 141 -50 82 -6 -23 -49 12 -121 -10 -178 251 -97 97 -100 -22 227 -252
2662 -252 -71 -73 67 243 323 -23 144 -75 -28 -74 -123 -7 -51 -149 93 -112 111 141 -76 120 -82 2 -40 -30
2686 -30 185 53 -29 -90 95 -66 84 33 -33 38 -2 -7 39 -68 -17 19 -125 -50 100 40 -39 -33 -302 47 18 -5
2712 -5 -99 -192 96 -299 196 -48 108 94 -16 41 -37 -142 160 -128 28 20 98 -57 -110 80 -14 46 185 14
2736 14 -137 32 179 -231 304 29 106 47 -79 34 -20 147 -36 13 30 290 -164 -264 100 -24 141 -5
2758 -5 -194 -54 111 -186 -37 85 -73 -17 72 -1 80 -126 -62 175 -11 -6 17 84 -199 -121 43 150 -124 72
2782 72 -136 -63 -220 -233 74 140 -81 -8 -113 -113 -55 -262 67 39 -56 -114 119 -46 -51 264 13 129 18 -42 -143
2807 -143 -8 -152 45 115 -21 111 -233 -179 -9 72 74 -49 -60 -64 81 208 60 162 63 -133 -49 154 35
2830 35 148 107 -152 -90 -58 38 2 -169 97 81 -71 36 -49 -197 113 -198 75 -45 -93 -3 135 26 49 -25
2854 -25 154 -41 118 -90 -69 -223 -216 -114 -18 159 197 72 123 59 -125 -33 -82 -199 157 -171 -89 -12 48 7 -87
2879 -87 120 46 -7 169 -168 79 151 143 62 139 100 138 247 -123 -158 19 -151 -99 118 -49 18 -215 61 -158
2903 -158 87 -142 -167 84 -47 -146 -66 17 -41 -238 143 -70 -56 232 -17 -103 93 -140 -38 -14 111 194 -118
2926 -118 100 -147 -73 -16 137 3 -329 24 -22 -3 -15 -118 -43 303 -65 256 -6 57 285 103 -161 205
2948 205 13 40 -38 -151 98 -127 -298 71 113 -61 3 -142 -164 -262 20 -87 55 82 -89 -47 -22 86 121
2971 121 -78 -58 112 -5 120 80 12 -64 75 -74 82 130 201 -97 3 260 -62 -12 88 54 194 8 124
2994 124 -89 164 149 242 108 -102 21 -16 84 -220 -33 -2 58 -118 -32 203 19 -23 10 23 137 -132 -42
3017 -42 -57 99 -82 -234 142 -30 136 -173 96 -56 0 -214 6 13 315 196 -58 135 -1 29 -261 140
3039 140 143 322 107 -218 -95 102 -31 -110 194 103 130 138 -182 39 57 -112 -14 -20 90 -267 -38 18 -55 -57 -104
3064 -104 -183 -108 140 -82 189 -47 -161 37 -169 -147 -26 -220 -216 -174 156 84 153 -179 249 -106 61 163 -18
3087 -18 12 -125 46 -12 392 -6 -142 18 -57 249 163 -72 -233 290 195 -163 -206 -19 -13 36 46 -38 -188 -60
3111 -60 -37 -104 125 -25 -243 -112 45 20 -96 -180 -57 -95 142 -114 85 -73 94 151 -145 65 140 -91 -118
3134 -118 -117 10 177 155 -13 -62 -61 102 62 -73 -41 55 34 -94 -182 -47 235 3 -71 207 76 -43 -47 -219 -111
3159 -111 299 16 -58 -60 71 47 194 141 -139 17 -150 -77 143 -114 -36 288 -9 -65 73 265 -6 211 -47
3182 -47 -157 -24 -53 181 -21 1 210 87 76 -82 111 -103 -160 -44 200 253 50 -80 83 -53 -139 18
3204 18 -90 52 -122 215 -102 -39 252 -61 63 105 -16 225 136 -32 52 19 154 -164 -92 108 17 346 -14
3227 -14 -62 8 62 63 -103 21 -15 -48 246 -318 0 -14 -25 273 -16 169 17 98 -263 -5 37 -18 99 43 177
3252 177 -44 27 -338 -120 -117 183 -26 -135 6 201 87 -323 185 148 -13 62 1 -41 17 -145 -234 -91 122
3275 122 69 3 -26 247 -81 114 -67 217 -94 79 -84 176 -19 44 115 12 -194 -238 92 128 118 40 74
3298 74 83 -123 -174 -108 121 -16 -30 -246 -146 9 -100 -104 -82 -101 62 24 109 137 -154 -209 -127 22 -152 45 -127
3323 -127 -311 -17 16 -124 91 56 0 -29 3 -181 112 161 -75 23 141 64 28 -71 -71 -125 105 40 -4 190 -161
3348 -161 61 -44 196 137 -68 94 -100 138 246 -19 -120 60 28 -248 -96 -93 160 -93 -82 -142 -89 -46 55
3371 55 -277 190 -51 16 101 165 223 132 -128 73 -98 -132 -75 17 75 -15 289 -212 -199 -170 -93 -218 35 -164 -80
3396 -80 -170 -34 79 -75 60 -74 73 158 26 98 210 -76 -236 -192 89 97 268 76 -35 -147 46 175
3418 175 211 -197 -175 12 -157 92 -102 26 12 -11 147 45 81 -98 331 300 62 -126 216 -88 31 -132
3440 -132 -112 -84 63 21 -117 161 -27 63 -109 -179 67 107 47 -3 42 -32 -1 6 -144 -116 5 -142 73 23 -25
3465 -25 -158 -144 -49 126 112 63 0 -67 71 -8 239 -52 -127 77 269 63 -185 -141 -48 -300 -124 131 -10 90
3489 90 -34 -97 -54 -45 -124 18 86 184 98 39 -56 65 55 -76 228 3 143 -90 -47 22 32 166 31 -54 -11 158
3515 158 -53 3 -142 58 149 -40 123 27 73 24 -58 94 187 -101 -16 -167 90 -143 96 -196 -20 71 53
3538 53 15 1 -1 -315 49 -88 14 37 48 -41 98 93 60 -25 72 106 -96 114 -41 -157 -72 -157 -100 -84 -191 -57
3564 -57 76 166 70 -223 -153 22 31 -169 -13 -130 225 139 20 -129 -72 -50 -363 -167 -91 216 -80 206 63
3587 63 21 174 -88 202 157 -124 -88 -178 41 -74 -255 -41 59 152 -58 163 115 -162 -18 -39 13 -18 259
3610 259 -217 -105 172 46 88 -167 4 82 139 124 -30 114 -59 61 117 14 -65 -277 -82 292 -352 -23
3632 -23 -224 -7 -75 135 -64 -45 284 110 107 -15 9 218 -63 13 -132 116 30 57 -259 -203 223 7 -98
3655 -98 72 50 -207 50 -21 -1 30 189 -76 -131 -65 -195 -27 291 -169 -92 231 -213 54 139 -114 -69 199
3678 199 -111 -50 -61 156 49 -17 4 -59 18 53 267 -178 -135 76 -1 15 92 -125 -135 106 46 -316 -168 -98 -281
3703 -281 0 -240 44 -24 -31 -221 96 -125 -75 77 331 -13 115 133 -72 -200 45 -44 90 30 33 -79 128
3726 128 -29 8 80 50 20 182 255 -124 -66 -36 107 -202 -200 -16 89 -54 20 -93 68 -109 -44 -29 81 216
3750 216 17 -32 86 79 -87 100 -38 -248 -144 -24 -50 156 24 115 -162 -113 -9 143 -75 -178 91 -45
3772 -45 93 -24 156 124 -223 -166 166 -111 -156 347 178 -160 -122 25 123 -39 -14 -19 -70 240 125 -276 -250 11
3796 11 -34 125 254 35 301 -59 79 44 -261 54 66 4 38 14 72 -66 -125 98 150 -211 178 -92 -89 -189
3820 -189 -161 -201 -129 -22 26 142 -173 60 -90 194 -67 -42 -197 27 -65 -37 59 121 190 101 -57 -58 -114 -71 93
3845 93 165 -72 -168 40 -51 68 97 -39 216 -72 244 115 -273 134 9 138 -75 -143 -37 -341 223 12
3867 12 22 94 310 -136 -119 -85 -106 89 -138 -78 125 -104 -38 41 -51 -26 169 -28 -94 -175 107 -138 -64 -62 -126 -28
3893 -28 -67 300 90 -180 -74 50 -37 -134 235 290 -105 189 -218 -84 -291 -42 19 31 -36 70 126 18 -18
3916 -18 133 -252 -12 40 99 -242 -219 77 109 115 -22 -164 263 -171 -43 -187 -151 95 -46 46 -158 65 120
3939 120 -318 -87 -315 -164 40 -235 114 -3 27 137 166 -156 224 12 -135 -109 -138 -208 81 25 14 181
3961 181 -152 -42 26 -165 31 205 -174 -134 -81 -42 -263 266 97 -191 2 77 -246 -305 -124 83 -130 -40
3983 -40 129 136 171 92 -46 157 237 -115 -142 -113 215 154 69 155 10 -29 157 -169 198 249 -65 41 -97 -109 -77
4008 -77 282 -170 48 -51 -164 72 -120 -127 -24 -8 -45 -73 -110 41 -29 -228 126 12 -10 -102 192 -172 -27 -77
4032 -77 -41 60 117 -134 -88 -160 0 79 70 26 172 -85 2 -16 -115 109 36 244 -149 -56 -95 -53 197 313 -211
4057 -211 -323 174 97 -29 -333 11 102 56 -6 27 91 96 26 179 101 325 105 64 -85 104 45 -80 -91 -10 33
4082 33 -124 -2 46 276 81 -13 -271 -89 -60 -199 -295 70 87 123 -55 87 -206 166 161 40 51 130 195 45
4106 45 12 -79 -93 -21 53 -301 172 146 41 69 11 -39 -190 81 3 8 -179 111 -34 134 292 -85 122 81 12
4131 12 130 -79 -98 -113 12 281 -13 40 256 -149 -16 18 0 120 366 57 91 -12 -24 237 -87 -50 -164
4154 -164 64 -89 220 115 83 145 20 -17 4 170 224 -41 42 36 194 255 -5 -96 -145 -50 24 -5 180 53 48
4179 48 93 33 127 -72 179 -265 189 -136 -185 -154 -65 231 47 -48 -73 -113 441 -3 -352 24 -125 184 -51
4202 -51 -73 -220 154 -26 64 -162 -156 45 -207 103 13 168 120 48 -60 -75 -51 41 163 56 -56 273 12 102
4226 102 74 -172 86 -81 68 72 29 18 51 -240 -212 15 65 152 -121 -67 30 -152 10 15 -159 74 -190 -209 10
4251 10 -71 18 -35 -126 22 6 258 7 0 -7 -2 183 -81 -78 75 15 55 339 25 -220 -82 98 83 92 -184 -88 -60
4278 -60 46 186 -3 -44 91 237 -158 -276 65 -153 157 -392 -56 -131 -58 86 99 -34 167 -171 -137 -47
4300 -47 -473 -83 -99 88 26 113 167 99 -40 -166 250 29 164 303 120 -45 -255 43 66 -98 -37 12 80
4323 80 30 -61 8 252 81 48 89 -101 3 -70 106 -213 -56 50 -67 12 16 -100 -8 -3 -251 -102 19 46 116
4348 116 -138 11 58 -24 -17 107 -71 64 -102 -90 -13 33 -116 139 -240 104 79 -133 -62 -78 60 -56 164
4371 164 230 -150 -21 22 38 61 68 -320 117 -107 10 -273 -77 190 -186 -57 -125 124 37 15 -3 119 139 -2
4395 -2 31 -176 -236 249 190 275 66 -143 46 -102 15 187 81 161 37 20 91 241 -43 -104 -129 128 40 35 -51
4420 -51 -12 -169 -200 3 -280 -287 -6 79 -104 36 95 44 -195 40 -161 137 22 115 57 -166 46 106 -113 52
4444 52 142 -156 136 -47 51 100 29 -141 -149 199 -163 85 164 140 289 87 -13 -171 -162 -119 -107 -47 -65 109 165
4469 165 76 55 98 44 33 121 25 202 57 73 -198 0 -204 -1 385 -27 -76 -27 -338 61 19 175 -45 -250
4493 -250 225 -15 12 94 -34 83 106 -237 189 109 92 213 11 64 49 173 158 17 117 33 -86 148 17
4516 17 16 -249 -31 -194 -72 70 251 -21 -115 22 162 -14 -122 -40 -11 35 -11 168 -40 -44 -40 69 325 41
4540 41 -43 9 63 -64 123 -217 22 15 208 148 27 -231 -196 161 20 -72 26 359 -336 -181 191 279 10 189
4564 189 -389 28 -158 -53 93 70 166 -216 -18 -151 -195 -171 -49 73 84 -149 -19 12 -36 -57 -135 -40 -17 -69
4588 -69 135 -215 -170 -53 76 -19 65 214 69 97 80 11 172 54 62 -31 -83 -46 -156 -213 10 284 -233 -79
4612 -79 -130 76 -136 -329 59 22 -45 111 56 -186 149 189 -333 -57 -241 144 43 -117 108 -180 166 -113
4634 -113 253 140 -132 308 173 140 47 119 15 50 -56 -18 -5 44 -161 90 102 122 148 50 -65 -9 72 122 -108
4659 -108 -33 -197 -44 -12 -97 134 -149 -157 -65 134 -5 -35 -164 -128 1 261 -22 160 -154 -188 -38 202 -85
4682 -85 -194 190 -97 -41 200 -441 -249 -288 334 53 -31 -4 -153 37 127 92 -177 -279 88 -79 -282 57
4704 57 -63 40 -145 -183 -79 -129 89 -5 103 147 117 -124 35 152 -87 137 -69 -226 -74 315 -102 324
4726 324 -47 -139 -66 -58 -37 -37 21 -84 -229 2 -59 -145 -53 -16 -222 9 -207 -26 -207 18 -177 174 -242 -120
4750 -120 66 -10 -22 -55 -64 13 -342 -238 -21 -96 192 -12 -21 -122 275 93 90 201 -91 -33 389 105 106 65 -279
4775 -279 25 -196 198 167 372 104 -100 66 -134 -92 -187 -64 14 35 81 -124 147 54 -45 -128 22 -40 -127 -48
4799 -48 52 -78 -195 -21 101 152 278 76 -226 -67 157 19 92 -228 -342 96 -50 -43 118 -115 -84 70
4821 70 -138 37 -180 256 343 -200 202 150 -195 -61 -141 -296 -94 -10 -25 -227 21 -153 -111 256 -195 -355
4843 -355 61 -92 -11 54 14 170 -189 -95 12 -86 -65 -140 2 63 23 7 24 137 16 -56 222 -86 50 -4
4867 -4 38 102 98 80 -84 -251 -182 -44 106 19 65 -37 -200 93 -76 34 -182 -360 -24 56 109 79 -277 -73
4891 -73 -132 121 213 -228 17 83 261 -128 -175 7 -66 -6 -150 151 -201 135 -114 -116 -69 112 -100 -122 -10 -206
4915 -206 -208 -7 227 -254 11 89 7 -58 47 -15 -86 79 90 97 -123 -116 135 80 88 3 -9 -119 -8 -72 -12 4 -159
4942 -159 50 223 -3 -33 85 23 37 -125 -122 -83 131 -108 96 214 300 -56 246 177 33 165 -60 -10 -165
4965 -165 11 79 286 -116 -132 -4 -53 199 -135 14 -85 -77 75 -378 25 103 116 57 -208 173 -307 -134 17
4988 17 -98 60 134 -191 44 17 -82 -83 -114 -83 210 -33 -66 -6 86 211 210 -272 -60 111 71 243 93 -46 45
5013 45 92 178 -115 40 -16 -109 -93 -107 -41 139 -48 -173 -73 224 -75 -156 170 108 161 60 68 -51 360 326 -71
5038 -71 -37 52 65 52 -65 62 -204 -123 84 -28 -173 115 220 68 331 74 49 -6 40 -13 -156 101 -8
5061 -8 82 194 236 -2 -115 4 134 30 85 -174 168 269 -87 -102 125 20 -23 179 223 107 95 -130 128
5084 128 -7 -80 5 -75 170 107 23 -152 90 -129 26 -31 68 -28 54 14 -76 -36 -141 26 213 -63 155 -150
5108 -150 152 -106 -264 -189 99 -12 -118 -10 -126 76 -121 -196 -188 -256 117 -81 -145 162 -132 327 -90 -44
5130 -44 -46 -117 -128 12 -195 -182 110 -21 309 -95 -6 49 -21 -130 129 131 11 20 219 256 124 107 225 -353 37
5155 37 -29 -50 -27 296 67 -10 -93 -52 -83 54 -155 -222 170 -178 182 82 -47 -193 -46 248 -9 88 94 68
5179 68 -37 89 211 166 130 10 101 63 138 -99 -195 -147 4 -188 110 18 -45 -20 -243 -67 155 4 -273 61
5203 61 -5 -118 -109 -182 -127 -175 -95 135 15 -95 44 -96 141 -23 71 -92 -15 -37 -247 -17 -109 145 170 -80
5227 -80 -162 -192 -264 151 -59 170 13 13 65 -174 38 150 130 -161 -81 233 375 198 287 44 53 182 243 -50
5251 -50 179 8 -137 -294 -211 -374 -278 -220 113 -131 168 335 95 -274 10 -64 -46 148 -161 111 240 178
5273 178 -86 -13 80 -58 -64 -6 -108 -236 -48 -5 175 -180 28 159 -102 -15 9 69 53 -35 -17 -95 -9 91 -102
5298 -102 146 -269 214 -117 71 -61 -33 25 95 97 46 -69 -5 37 131 -186 0 68 44 -112 19 -61 51 186
5322 186 43 -36 128 -246 173 78 -223 60 1 145 131 157 -29 -44 -115 -74 51 -31 70 54 97 68 170 -78
5346 -78 -69 143 17 -50 -68 -4 -216 -64 119 46 -140 -90 -217 46 -120 -67 122 -153 20 159 224 -222 -157 -214
5370 -214 229 -115 18 -249 48 84 27 -174 79 3 80 -292 -199 108 198 -114 103 -1 -71 -118 166 -121 131
5393 131 -94 105 -46 73 266 -8 -8 -214 -83 -188 -46 43 -38 -57 43 26 210 41 269 -67 -223 14
5415 14 7 192 -150 14 -113 64 -122 -219 219 -246 -173 -8 122 133 -15 -7 154 -63 -103 -217 80 -177 32
5438 32 57 68 225 23 212 75 -246 -30 332 27 -106 -209 180 53 -69 20 -8 147 3 -38 -16 20 -209
5461 -209 -124 -81 -11 154 147 56 189 -111 136 -98 -127 -34 3 -194 114 -28 44 -4 47 168 -4 -38 70 -167
5485 -167 -20 106 -49 -28 38 98 -234 -90 200 196 150 60 39 163 -29 61 -128 145 -280 -61 -153 136 23
5508 23 -106 -221 -85 172 -148 -54 -113 179 90 -25 -295 5 -15 -39 -37 0 23 -2 192 10 9 -74 43 86 -86
5533 -86 -4 -140 -241 46 148 15 36 53 -72 -42 190 -194 -262 296 -113 47 -94 -92 -134 41 11 -121 146
5556 146 -67 -179 124 -143 46 49 -190 -8 -72 -91 19 169 63 -56 -5 -81 307 28 164 -42 15 -248
5578 -248 -254 172 -136 -154 49 58 26 -219 173 19 -178 5 -87 -118 19 -33 53 87 -99 -93 22 200 -102 -386
5602 -386 83 -164 51 95 -128 -191 -97 11 156 24 -70 -33 61 -65 92 221 143 51 -152 -172 212 152 -148
5625 -148 -133 -269 -17 53 -123 92 -177 221 -44 -120 67 108 -65 -228 13 135 -160 -4 119 106 140 38
5647 38 199 -191 -85 -141 34 -102 -53 -22 116 4 137 11 27 42 73 -14 177 282 94 -272 -11 155 -141
5670 -141 97 -23 -98 -57 178 -230 191 -165 -154 -86 -55 156 0 27 237 -2 -62 309 62 66 -61 -152 -43
5693 -43 160 -33 -72 17 -17 -114 -38 132 -63 -170 -64 -3 147 30 228 -5 226 49 -153 165 124 33 -38
5716 -38 68 1 321 42 -200 -71 -29 92 -12 27 -267 -26 -14 29 86 -96 75 -19 -259 76 174 -161 136
5739 136 -166 169 15 30 62 -193 -16 -46 -15 -35 47 -180 117 -83 208 61 -255 -33 -140 -67 -39 99 45
5762 45 82 -38 -105 -52 30 -90 -5 -134 176 -184 -116 -260 -57 -29 -287 193 205 -75 239 42 12 -104 -148 98
5786 98 108 -155 90 72 146 -30 -62 208 -70 -138 18 108 -180 -245 95 -111 -9 -202 -43 -38 -113 65 -91 104
5810 104 -183 89 -116 -102 9 100 26 -75 -171 -76 134 -141 -15 -38 33 14 -27 19 -183 120 -186 -147 -38 88
5834 88 -222 110 -113 -79 2 92 -224 -14 129 -11 74 -66 268 -180 -65 14 -179 -38 -77 -8 116 -52 217
5857 217 -47 89 -45 29 -107 -149 -6 -38 -43 256 -30 7 -249 -108 56 129 -29 260 13 -105 226 262 19
5880 19 148 147 -70 79 12 -61 -36 70 210 -197 -47 330 -47 -4 -159 80 38 -55 -102 -108 -89 127 160 -259 -55
5905 -55 73 14 144 46 49 25 35 -16 158 22 147 -72 -174 32 57 143 -141 -37 -18 23 180 293 -62 117
5929 117 268 -157 -59 -38 27 -203 -194 80 -220 -232 24 215 -145 -27 16 -50 99 -238 -79 -120 -111 -10 132 -31
5953 -31 47 -40 -83 -25 21 130 36 -79 259 149 211 92 -336 178 115 174 92 43 127 -206 203 2 30 35 51 -64
5979 -64 -64 -84 168 134 -64 323 -67 -28 80 -73 81 84 -157 48 164 88 7 -148 115 -26 92 39 -151 137
6003 137 202 -221 253 -19 89 276 314 130 4 34 -170 -22 -171 67 -61 78 102 236 -233 71 111 -19
6025 -19 -44 2 -11 -4 146 -186 223 -32 88 -42 5 83 153 88 188 -60 -186 -14 128 -179 10 55 -13 -73
6049 -73 37 -233 186 -72 121 -245 129 -25 141 120 -23 -98 67 -74 -162 56 21 38 -156 157 15 89
6071 89 -21 236 120 -10 297 44 2 -82 41 94 -100 107 197 -125 54 -34 -91 -65 -171 -101 -11 -242 3
6094 3 -106 33 -4 -48 72 -284 134 -25 177 300 105 -139 -33 -2 140 -35 22 -11 158 -3 -235 -63
6116 -63 330 132 23 -80 29 -76 -124 -16 -180 2 -71 120 73 219 -117 84 -97 197 -330 -197 13
6137 13 73 -29 -60 12 -221 2 -41 -126 -34 -342 190 -64 265 49 -62 67 -31 11 -77 130 287 91 52 134
6161 134 -88 -69 -220 -98 68 267 43 -100 61 -57 -152 75 -107 -23 86 -202 -60 -49 -307 144 105 2
6183 2 155 111 -295 75 -15 -68 166 98 -49 -183 -16 186 75 80 5 188 2 -49 89 77 -271 135 196 75
6207 75 258 167 -136 42 91 3 6 2 131 51 -106 173 -125 -210 54 176 8 -166 -56 71 116 115 27 222 156
6232 156 -79 -65 66 107 -21 -174 -154 195 -136 31 -85 -119 17 97 -54 -202 136 -8 -226 152 -172 116
6254 116 84 -360 125 -14 30 -14 -71 -242 208 -65 -159 -34 -154 126 229 -290 39 53 -163 149 162 24
6276 24 50 109 -128 220 -190 79 150 -111 -21 -33 6 -21 -87 53 60 -214 -92 166 -74 72 93 -157 86 -135
6300 -135 52 -31 -18 46 -81 -88 -56 22 -228 -124 185 364 -18 66 -127 -64 10 -50 211 -98 -8 44 -72 -261
6324 -261 -220 59 -218 -37 -139 6 144 82 -138 178 -109 -78 -119 -148 -83 88 42 -113 163 169 336 -208 -76
6347 -76 156 272 -67 246 163 120 -69 135 -81 92 -139 -146 -191 54 74 -203 34 -33 19 -21 -107 -45 266 -68
6371 -68 81 41 -249 28 2 227 61 125 216 -1 -207 -76 69 -154 83 94 125 -147 153 19 9 80 38
6394 38 54 158 -35 -125 -16 134 -51 74 76 -146 -97 -40 41 -17 -306 -90 -244 94 -62 -106 60 -264 -30
6417 -30 -227 128 -35 25 -33 19 55 -109 -213 56 -10 -92 165 138 46 -69 -149 -46 -12 170 146 -57 -102 -48 -140
6442 -140 -82 -90 26 -111 102 -141 -356 137 -285 -105 -60 41 85 -168 43 47 50 -67 71 131 -252 88 76 -122
6466 -122 -26 309 -37 172 -50 -25 16 135 -317 180 68 162 64 21 59 -185 205 -121 -169 -97 -22 -34 -84 -93 110
6491 110 -37 60 -81 68 163 -38 -386 144 -73 -362 152 191 -105 50 78 119 54 104 -71 -142 -220 -24 4
6514 4 146 -126 128 254 114 66 -152 -132 -109 -147 -225 93 -81 30 -109 -325 191 164 10 356 -20 115 55
6537 55 -252 47 -68 -101 124 -8 137 -125 52 -57 -153 141 9 151 113 -201 -76 -143 -48 112 30 223
6559 223 -60 91 -73 159 123 3 43 171 237 -124 90 162 55 -38 -33 71 -142 -58 42 285 8 -393 310
6582 310 -40 -8 36 -82 -76 85 -309 -185 109 -65 -40 201 -22 -277 140 229 41 -148 -147 -136 -135 38 -19 -123
6606 -123 108 -13 47 43 -65 -141 -75 -152 -64 31 -1 -99 80 -114 42 -95 -30 -12 137 59 -206 -107 -295 26 24
6631 24 105 152 203 151 125 59 -114 -40 63 49 -79 -131 -18 16 13 -327 -126 57 47 55 216 -108 5 38 168 71
6657 71 18 -172 -162 -14 -102 350 109 116 -195 94 -35 -70 19 -28 57 -200 -46 -23 -137 218 -64 60 -40 134
6681 134 -125 109 -456 -51 47 -115 -111 -31 109 -29 -170 -107 13 3 -199 -17 -131 3 -30 -15 -128 -80 -121
6704 -121 -86 -3 -131 -34 284 -78 -138 4 -55 -85 -173 -75 140 -178 57 47 22 37 36 70 72 -208 -170 42 214 -8
6730 -8 -62 62 62 191 -194 134 -64 131 -57 -106 84 99 15 56 -93 -39 54 -169 63 -274 66 -137 147 335
6754 335 62 41 163 -295 217 -4 -23 -176 206 57 2 38 30 -180 215 6 -128 192 34 -46 -229 -37
6776 -37 -113 135 73 -167 21 25 153 172 -102 -63 1 -23 -90 -85 83 80 42 121 120 101 110 -248 160 3 -12 -129 67
6803 67 -42 91 -57 175 52 -146 -141 -170 15 92 -111 145 18 -39 -74 -30 206 105 260 -88 -9 -40 149
6826 149 -253 70 16 -87 -97 -126 81 -121 274 -144 12 -72 114 -51 67 47 250 -50 7 150 -231 -41
6848 -41 90 -127 74 15 137 -54 31 91 13 120 96 193 -7 28 28 -246 135 -93 14 -7 73 48 -126 -134 -64
6873 -64 168 -140 -50 -4 34 114 6 -107 221 -119 55 -36 63 8 1 -9 186 36 -67 -104 128 67 86 182 -64
6898 -64 139 84 31 88 125 -263 98 33 -156 -298 -71 -111 168 -70 -32 -189 73 -175 3 -146 -2 111 -189
6921 -189 -93 124 108 25 -113 -88 66 6 51 -49 101 60 14 -21 150 0 345 35 -232 116 -137 144 -7
6944 -7 23 -98 -69 220 -147 -12 56 -200 -186 217 -16 -44 166 45 -191 -8 281 -36 110 29 -310 70 -17
6967 -17 -29 171 73 -162 357 174 15 -84 -11 -53 -160 141 -213 -141 -41 -26 -67 -85 -82 86 115 -158 75 7 -218
6992 -218 127 -43 -32 81 -202 -52 -198 -31 -296 180 -136 -99 -43 41 44 277 4 62 150 10 -35 129 -110
7015 -110 -15 -232 124 -4 -29 -164 -25 -76 -23 27 -241 -267 159 -115 4 -83 -183 53 -205 11 -115 -85 245
7038 245 -181 -174 109 -16 -248 172 -3 197 138 118 97 -100 97 -468 -64 -36 -207 -17 102 -222 -24 -62
7060 -62 -133 -94 -17 -25 -46 135 -68 34 -207 -4 -29 -23 -158 194 -179 -108 -75 -122 -239 -229 -154 -35 168 -284 34
7085 34 120 143 -36 -74 64 -64 24 -188 138 -62 32 161 78 93 -22 -65 207 -276 94 -86 -87 23 -140 191
7109 191 19 -197 133 58 -210 84 152 -128 -222 -89 300 43 -43 -163 -45 -127 77 -85 -91 105 28 66 -79
7132 -79 54 -38 215 83 -101 -128 24 -1 161 76 9 -42 -178 -26 -129 -145 57 47 158 -33 112 119 -20 9
7156 9 108 -217 -48 -193 311 -207 83 -26 -193 84 21 -63 -131 116 -60 184 -136 120 -35 -111 -55 -19 -45
7179 -45 67 128 -48 -68 51 132 298 -69 63 -176 141 133 193 272 6 169 139 -172 -3 -31 -36 126 140 15
7203 15 -205 117 -105 114 61 48 139 81 148 88 90 -1 -347 -55 -123 -119 18 214 -129 -243 117 -128 -94 -62 31
7228 31 -86 222 113 -26 -82 106 120 118 171 55 -214 -199 -222 -192 96 58 106 130 8 55 -106 80 -136 -78 127
7253 127 41 97 -96 135 36 152 -38 -227 147 -27 -145 -180 13 -114 -1 -163 207 108 -20 126 -27 93
7275 93 99 -89 104 -19 -268 -108 178 -102 -137 -110 -207 26 9 -105 -64 -27 -118 -311 56 80 135 163 63 -42
7299 -42 152 -122 138 -82 -129 182 -115 -119 -175 -126 -63 48 -14 -191 -19 -64 -31 -9 -140 -113 117 52 101 58 95
7324 95 -46 -12 4 49 -9 -172 122 -56 -16 -217 -21 -5 -238 107 -202 -136 -127 4 158 148 -229 -37 -182 117
7348 117 -423 -103 105 -4 9 -273 -67 22 -183 -258 150 -183 -116 27 -91 -190 210 -13 302 -8 -167 120
7370 120 27 -62 77 80 163 87 -74 -2 207 34 35 128 -38 -146 -149 -201 -220 32 -47 -111 -114 31 166 119 406 -4
7396 -4 -197 472 -64 1 167 -151 -66 74 105 90 -19 -11 48 -206 179 -41 -51 -319 68 -62 56 77 49 247
7420 247 -75 -95 -100 93 -37 4 89 40 79 -40 -106 141 91 -11 -244 -192 -15 -260 39 -179 -163 183 -158 163
7444 163 -99 -72 -29 -9 150 96 -210 142 17 -30 382 -42 169 -23 57 -15 10 -67 -280 11 17 126 94 261
7468 261 69 146 -223 53 -136 296 -62 -120 191 45 20 12 104 -115 258 35 133 163 -35 105 4 15 -113
7491 -113 -11 232 18 54 71 -217 153 99 28 -164 -80 111 131 -206 63 155 -126 -69 -36 -139 39 246 -151
7514 -151 82 74 143 39 -78 -204 180 20 -50 119 -44 -25 -269 45 -137 -50 -115 -61 71 38 156 278 -82
7537 -82 -159 -121 -110 -271 191 -175 -104 -111 95 25 14 322 183 -78 -59 -72 13 76 -22 -87 129 261 135 103 -5
7562 -5 -287 -19 -129 86 130 -25 208 54 171 -86 39 -164 6 -129 -159 -170 -148 88 -177 93 -26 74
7584 74 71 5 194 -220 -32 -66 -36 -54 151 -198 -219 -140 -24 -2 139 18 88 -18 -48 12 -151 -81 288 -270 43
7609 43 -46 -63 114 166 -25 57 334 44 -148 217 68 -129 -115 214 36 -130 157 -195 -23 214 -3 59
7631 59 65 -15 3 -51 123 19 -192 -59 82 -109 64 235 -97 4 60 146 79 -17 -272 -112 40 83 77 83 286
7656 286 348 110 -190 143 25 12 131 -150 -121 -128 -95 19 -79 86 41 -127 -212 102 64 1 -34 41 -36 180 63
7681 63 -60 -96 99 -141 -123 64 60 -34 110 -172 220 39 -151 149 272 54 -186 36 122 -16 -18 102 12
7704 12 198 -18 -174 -182 120 149 -73 117 -216 -87 -20 25 32 -126 23 136 367 218 -73 -170 -200 78 65 55
7728 55 42 -117 -290 -141 -172 -26 211 -28 -54 121 72 -118 -117 278 115 131 -233 -32 -19 45 195 -247 -76
7751 -76 68 213 -107 -122 165 120 127 108 -195 -259 -107 58 -50 -4 293 -48 13 -74 -181 23 1 216 85 10
7775 10 -235 -322 -89 50 62 225 46 75 83 -161 -48 -49 -4 27 296 78 40 -105 -64 -37 -131 11 63 -33 119
7800 119 -56 70 127 -146 96 17 111 257 212 89 49 84 -4 -99 67 -27 16 8 137 -52 59 95 35 -175 -42
7825 -42 -331 171 96 45 -73 -26 78 115 32 -72 -16 -117 191 110 77 -101 139 -122 59 -2 -188 143 -32
7848 -32 15 -323 210 1 114 -118 -258 -56 -101 202 112 -213 19 -10 335 -22 -119 -100 1 113 -84 -78 -129
7871 -129 47 223 167 -81 -97 70 -356 -24 49 73 215 -202 86 -18 188 210 -139 105 -144 -26 -69 -282
7893 -282 130 136 -32 17 56 -104 125 -37 105 99 -157 -151 -242 -6 -118 -68 -286 -198 -17 -73 -52 -88 -157 49 30
7918 30 -213 -40 -157 95 114 -63 -232 70 -192 -188 162 -134 14 27 316 44 -176 -244 -81 -61 204 128 16
7941 16 39 10 -51 -16 26 -172 -34 -49 47 -189 49 -93 38 -34 97 -46 81 113 -17 -149 105 -17 231
7964 231 -74 -234 161 -88 79 -111 70 -19 129 -55 -37 112 -49 193 14 -57 -59 131 139 287 -152 80
7986 80 -25 100 -70 -133 -62 169 156 -34 259 169 100 153 133 151 99 -167 154 241 -27 108 -19 73 -28 16
8010 16 -138 -139 217 13 155 -43 78 -166 75 11 145 -113 -91 -95 -18 92 -45 -187 65 -75 19 -95 -54
8033 -54 -181 -143 -86 -56 -252 108 214 90 -92 -146 -111 120 -39 -163 82 -78 -5 184 59 19 -81 57 -10
8056 -10 -180 0 -89 122 107 75 -221 -24 -2 214 102 96 -123 -83 -24 -120 -68 37 217 122 42 113 41 3 186
8081 186 64 63 -246 -149 -39 -186 -63 -101 109 420 81 -129 -174 140 124 -111 30 -135 -127 -77 -290 -88 -3
8104 -3 0 184 0 -148 -50 -220 31 69 98 353 -187 10 -100 -58 -12 6 35 -44 140 105 -185 95 165 -303 278
8129 278 161 23 -51 -72 75 28 49 -12 48 -30 -234 103 -24 -137 -108 -31 125 -107 41 -69 226 -192 245
8152 245 2 122 -8 62 -100 6 183 -123 94 -79 0 53 85 192 -51 34 -164 213 32 -52 4 -39 157
8175 157 74 201 -213 -21 -36 207 -178 -22 2 -120 -104 -102 67 214 -233 29
8191B9
##END NTUPLES=NMR FID
##END=
