##TITLE=1H_ES-AN-MeOH-St
 
 8 sc, 
 21.1.2022
##JCAMPDX= 6.0         $$ Bruker NMR JCAMP-DX V2.0
##DATA TYPE= NMR FID
##DATA CLASS= NTUPLES
##ORIGIN= UXNMR, Bruker Analytische Messtechnik GmbH
##OWNER= root
$$ XWIN-NMR		Version 3.5
$$ Fri Jan 21 12:08:54 2022 Russian Standard Time (UT+4h)  she@DPX200
##.OBSERVE FREQUENCY= 200.131346
##.OBSERVE NUCLEUS= ^1H
##.DELAY= (6, 6)
##.ACQUISITION MODE= SIMULTANEOUS
##.ACQUISITION SCHEME= undefined
##.AVERAGES= 8
##.DIGITISER RES= 18
##SPECTROMETER/DATA SYSTEM= spect
##.PULSE SEQUENCE= zg30
##.SOLVENT NAME= DMSO
##.SHIFT REFERENCE= (INTERNAL, DMSO, 0, 15.7039)
##AUDIT TRAIL= $$ (NUMBER, WHEN, WHO, WHERE, WHAT)
$$ ##TITLE= Audit trail, XWIN-NMR		Version 3.5
$$ ##JCAMPDX= 5.01
$$ ##ORIGIN= Bruker BioSpin GmbH
$$ ##OWNER= she
$$ F:/spectra/data/she/nmr/H-F/1/audita.txt
$$ ##AUDIT TRAIL=  $$ (NUMBER, WHEN, WHO, WHERE, WHAT)
(   1,<2022-01-21 12:06:47.60 +0400>,<she>,<DPX200>,
      <created by zg, POWCHK disabled, PULCHK disabled
       configuration hash MD5:
       00 E9 B6 7A A2 85 ED C7 34 08 36 98 17 FE 4E 26
       data hash MD5: 16K
       5E A7 96 FD 5F 61 BF D1 BF 50 DC 0F EF C2 CA 5B>)
$$ ##END=
$$ 
$$ hash MD5
$$ 07 46 05 01 C1 C4 BD 8F D6 97 C8 44 37 DB 21 CD
##$RELAX= 
##$RELAX= 
##$RELAX= 
##$RELAX= 
##$RELAX= 
##$RELAX= 
$$ Bruker specific parameters
$$ --------------------------
##$DU= <F:/spectra>
##$EXPNO= 1
##$NAME= <H-F>
##$PROCNO= 1
##$TYPE= <nmr>
##$USER= <she>
##$AMP= (0..31)
100 100 100 100 100 100 100 100 100 100 100 100 100 100 100 100 100 100 
100 100 100 100 100 100 100 100 100 100 100 100 100 100 
##$AQSEQ= 0
##$AQ_mod= 1
##$AUNM= <au_zg>
##$AUTOPOS= <>
##$BF1= 200.13
##$BF2= 200.13
##$BF3= 200.13
##$BF4= 200.13
##$BF5= 200.13
##$BF6= 200.13
##$BF7= 200.13
##$BF8= 200.13
##$BYTORDA= 1
##$CFDGTYP= 0
##$CFRGTYP= 5
##$CHEMSTR= <none>
##$CNST= (0..31)
1 1 145 1 1 1 1 1 1 1 1 1 1 1 1 1 1 1 1 1 1 1 1 1 1 1 1 1 1 1 1 1 
##$CPDPRG= <>
##$CPDPRG1= <>
##$CPDPRG2= <>
##$CPDPRG3= <>
##$CPDPRG4= <mlev>
##$CPDPRG5= <mlev>
##$CPDPRG6= <mlev>
##$CPDPRG7= <mlev>
##$CPDPRG8= <mlev>
##$CPDPRGB= <>
##$CPDPRGT= <>
##$D= (0..31)
0 1.2 0 0 0 0 0 0 0 0.06 0 0.03 0 0 0 0 0.0002 0 0 0 0 0 0 0 0 0 0 0 0 
0 0 0 
##$DATE= 1642752407
##$DBL= (0..7)
120 120 120 120 120 120 120 120 
##$DBP= (0..7)
150 150 150 150 150 150 150 150 
##$DBP07= 0
##$DBPNAM0= <>
##$DBPNAM1= <>
##$DBPNAM2= <>
##$DBPNAM3= <>
##$DBPNAM4= <>
##$DBPNAM5= <>
##$DBPNAM6= <>
##$DBPNAM7= <>
##$DBPOAL= (0..7)
0.5 0.5 0.5 0.5 0.5 0.5 0.5 0.5 
##$DBPOFFS= (0..7)
0 0 0 0 0 0 0 0 
##$DE= 6
##$DECBNUC= <off>
##$DECIM= 32
##$DECNUC= <off>
##$DECSTAT= 4
##$DIGMOD= 1
##$DIGTYP= 9
##$DL= (0..7)
0 120 120 120 120 120 120 120 
##$DP= (0..7)
150 150 150 150 150 150 150 150 
##$DP07= 0
##$DPNAME0= <>
##$DPNAME1= <>
##$DPNAME2= <>
##$DPNAME3= <>
##$DPNAME4= <>
##$DPNAME5= <>
##$DPNAME6= <>
##$DPNAME7= <>
##$DPOAL= (0..7)
0.5 0.5 0.5 0.5 0.5 0.5 0.5 0.5 
##$DPOFFS= (0..7)
0 0 0 0 0 0 0 0 
##$DQDMODE= 0
##$DR= 18
##$DS= 0
##$DSLIST= <SSSSSSSSSSSSSSS>
$$ [...]
##$SUBNAM2= <"">
##$SUBNAM3= <"">
##$SUBNAM4= <"">
##$SUBNAM5= <"">
##$SUBNAM6= <"">
##$SUBNAM7= <"">
##$SUBNAM8= <"">
##$SUBNAM9= <"">
##$SW= 18.0517287032376
##$SWIBOX= (0..15)
0 0 2 0 0 0 0 0 0 0 0 0 0 0 0 0 
##$SW_h= 3612.71676300578
##$TD= 16384
##$TD0= 1
##$TE= 0
##$TE2= 300
##$TE3= 300
##$TEG= 300
##$TL= (0..7)
0 120 120 120 120 120 120 120 
##$TP= (0..7)
150 150 150 150 150 150 150 150 
##$TP07= 0
##$TPNAME0= <>
##$TPNAME1= <>
##$TPNAME2= <>
##$TPNAME3= <>
##$TPNAME4= <>
##$TPNAME5= <>
##$TPNAME6= <>
##$TPNAME7= <>
##$TPOAL= (0..7)
0.5 0.5 0.5 0.5 0.5 0.5 0.5 0.5 
##$TPOFFS= (0..7)
0 0 0 0 0 0 0 0 
##$TUNHIN= 0
##$TUNHOUT= 0
##$TUNXOUT= 0
##$USERA1= <user>
##$USERA2= <user>
##$USERA3= <user>
##$USERA4= <user>
##$USERA5= <user>
##$V9= 5
##$VALIST= <valist>
##$VCLIST= <CCCCCCCCCCCCCCC>
##$VD= 0
##$VDLIST= <DDDDDDDDDDDDDDD>
##$VPLIST= <PPPPPPPPPPPPPPP>
##$VTLIST= <TTTTTTTTTTTTTTT>
##$WBST= 1024
##$WBSW= 4
##$XGAIN= (0..3)
0 0 0 0 
##$XL= 0
##$YL= 0
##$YMAX_a= 261979
##$YMIN_a= -296964
##$ZGOPTNS= <>
##$ZL1= 120
##$ZL2= 120
##$ZL3= 120
##$ZL4= 120
##$ABSF1= 10
##$ABSF2= 0
##$ABSG= 5
##$ABSL= 3
##$ALPHA= 0
##$AQORDER= 0
##$ASSFAC= 0
##$ASSFACI= 0
##$ASSFACX= 0
##$ASSWID= 0
##$AUNMP= <proc_1d>
##$AZFE= 0.1
##$AZFW= 0.1
##$BCFW= 1
##$BC_mod= 2
##$BYTORDP= 1
##$COROFFS= 0
##$CY= 11.3945322036743
##$DATMOD= 1
##$DC= 2
##$DFILT= <>
##$DTYPP= 0
##$F1P= 2.36226072786647
##$F2P= -0.459571619588291
##$FCOR= 0.5
##$FTSIZE= 0
##$FT_mod= 4
##$GAMMA= 1
##$GB= 0.15
##$INTBC= 1
##$INTSCL= 1
##$ISEN= 128
##$LB= 0.24
##$LEV0= 0
##$LPBIN= 0
##$MAXI= 10000
##$MC2= 0
##$MEAN= 0
##$ME_mod= 0
##$MI= 1.114404
##$NCOEF= 0
##$NC_proc= 0
##$NLEV= 6
##$NOISF1= 3.799351
##$NOISF2= 2.8
##$NSP= 1
##$NTH_PI= 0
##$NZP= 0
##$OFFSET= 15.70392
##$PC= 1
##$PHC0= -15938.97
##$PHC1= -5.79922
##$PH_mod= 1
##$PKNL= yes
##$PPARMOD= 0
##$PSCAL= 0
##$PSIGN= 0
##$REVERSE= no
##$SF= 200.130013532006
##$SI= 16384
##$SIGF1= 3
##$SIGF2= 2
##$SINO= 400
##$SIOLD= 16384
##$SREGLST= <1H.CDCl3>
##$SSB= 0
##$STSI= 0
##$STSR= 0
##$SW_p= 3612.71676300578
##$SYMM= 0
##$S_DEV= 0
##$TDeff= 0
##$TDoff= 0
##$TI= <>
##$TILT= no
##$TM1= 0
##$TM2= 0
##$TOPLEV= 0
##$USERP1= <user>
##$USERP2= <user>
##$USERP3= <user>
##$USERP4= <user>
##$USERP5= <user>
##$WDW= 1
##$XDIM= 8192
##$YMAX_p= 0
##$YMIN_p= 0
$$ End of Bruker specific parameters
$$ ---------------------------------
##NTUPLES= NMR FID
##VAR_NAME=  TIME,          FID/REAL,        FID/IMAG
##SYMBOL=    X,             R,               I
##VAR_TYPE=  INDEPENDENT,   DEPENDENT,       DEPENDENT
##VAR_FORM=  AFFN,          ASDF,            ASDF
##VAR_DIM=   8192,          8192,            8192
##UNITS=     SECONDS,       ARBITRARY UNITS, ARBITRARY UNITS
##FACTOR=    0.0002768,     1,               1
##FIRST=     0,             0,               0
##LAST=      2.2672688,     0,               0
##MIN=       0,             -296964,         0
##MAX=       2.2672688,     261979,          0
$$ Real data points
##PAGE= N=1
##DATA TABLE= (X++(R..R)), XYDATA
0@%%%%%%%%%%%%%%%%%qJ6j6J6j6K0k8L2l2M0m8N2o0O9p7Q7r9J12j28J44j60J76
39I2j94K16k38K62k91L22l56L93m34M78n24N77o38P04p78Q59r53J064j189J337
59G09j518J737k008K363k841L518m549O286r726J8880q5703k24112K81411K20511
73B04958k26469j27662K60165O4218l17388p0383L34106P8402l04017n4195K80465
84A22200M438k80073L1750K91784m8314k87991N7520K69861p7958k48926J04842
95f0867K36749j28939k27312J43918K14136j55858j94505J69104J73866j84376
105a4084j54923J97297J37403k06453j18309K12817R7205k18432p5343K23160
115H0338N4329k26063l4026K26323J3804k24383O599K20813k6493k15931M5353
$$ y = [0, 0, 0, 0, 0, 0, 0, 0, 0, 0, 0, 0, 0, 0, 0, 0, 0, 0, -8, 8, -8, 8, -8, 12, -16, 16, -16, 24, -24, 28, -32, 37, -40, 47, -52, 60, -68, 76, -84, 92, -102, 114, -124, 138, -153, 169, -187, 206, -228, 250, -274, 303, -335, 369, -409, 450, -503, 561, -628, 709, -809, 928, -1080, 1283, -1558, 1960, -2589, 3697, -6029, 12851, -72852, -296964, -15553, 204958, -21511, -149173, 110992, 175210, -142178, -212561, 121545, 199947, -104070, -158265, 122200, 126638, -153435, -121685, 170099, 121785, -166206, -108686, 161175, 83217, -165709, -60867, 175882, 46943, -180369, -36451, 177685, 21827, -172678, -3574, 170292, -14084, -169007, 28290, 165693, -40760, -159069, 53748, 150953, -67479, -142822, 80338, 134667, -91396, -125422, 100901, 114705, -109678, -103079, 117734, 91241, -124690, -79337]
126g9337K09509o3082k01329P9820J91590r5499j80795J10051J69080j23268j56449
137a39709J35054J43022j45526j28924J54743J14374j62721r9442J69328Q4269
147A24468j74643o8866J78673N3328j81468l7753J83013K2221j83235o859J82185
158I1064q328j79827K3181J76229l7635j71344N1526J65194o4717j57882P7168
169c5371J49428q8711j39959R9253J29576j08699j18404J17000J06570j24112
179a3429r4208J30045Q1428j34744o8431J38289N5271j40668m2073J41911K8972
190H2363j42116j6006J41301L270j39523R155J36836k1222j33305L2904J28945
201H2602m4166j23759N4912J17830o5113j11173P4736J03772q3672r5707R1885
$$ y = [-79337, 130172, 67090, -134239, -54419, 137171, 41672, -139123, -29072, 140008, 16740, -139709, -4655, 138367, -7159, -136083, 18660, 133034, -29687, -129129, 40199, 124468, -50175, -119041, 59632, 112960, -68508, -106261, 76752, 98973, -84262, -91121, 91064, 82736, -97091, -73910, 102319, 64684, -106660, -55134, 110060, 45343, -112539, -35371, 114057, 25346, -114613, -15360, 114216, 5517, -112887, 4113, 110683, -13429, -107637, 22408, 103836, -30908, -99339, 38950, 94221, -46447, -88520, 53391, 82363, -59753, -75759, 65542, 68812, -70711, -61556, 75280, 54058, -79247, -46343, 82602, 38436, -85323, -30411, 87419, 22306, -88867, -14131, 89641, 5969, -89738, 2147]
212B147Q7019r9303p7742J05861O7945j11472n7733J16069M7185j19620l6414
223g6058J22141K5506j23563j4612J23940L801j23261O784J21626j7098j19052
234f9846K7021J15604l6505j11378M5488J06438n3923j00872O1799R4738o9077
245I487q8108P5767Q1020q1839p3536Q7284O5696r2079n7525R6227M9052r9693
257b8247m0324J02440L1380j04425k2280J05603J3130j05991l943J05510n160
268D7693j04203J4129J02035k2834r9057L1210R5295l9178r0778M6637Q5587n3523
280A3013p9807N9815P3500o5484o6724P0443N9616p4744n2234P8380M4642q1361
292b0945l6895Q3671K9075q5352k1220Q6449J3370q6968n529Q6880k233q6219
$$ y = [2147, 89166, -10137, -87879, 17982, 85927, -25545, -83278, 32791, 79976, -39644, -76058, 46083, 71589, -51974, -66586, 57354, 61155, -62106, -55322, 66304, 49206, -69846, -42825, 72779, 36274, -75104, -29616, 76822, 22899, -77973, -16174, 78564, 9487, -78621, -2854, 78166, -3673, -77209, 10075, 75771, -16308, -73833, 22394, 71446, -28247, -68571, 33869, 65249, -39176, -61456, 44147, 57277, -48714, -52657, 52853, 47693, -56510, -42381, 59654, 36820, -62237, -31027, 64268, 25090, -65688, -19051, 66536, 13013, -66794, -6979, 66521, 1037, -65687, 4756, 64372, -10372, -62606, 15774, 60416, -20945, -57840, 25831, 54906, -30446, -51666, 34783, 48153, -38815, -44344, 42536, 40303, -45916]
304d5916R886Q5004j7401q3220K4741Q0861l1874p7907L8705P4388m5194p0330
316e8257N1278O5734n6899o0640O1994N5100o6496m9176P0389M2895p3624l6343
328e4045P6154K9638p8004k2803P9159J5956p9660r133P9500K420p8759M149P7451
341D2023j0515p5614J6669P3313k2579p0571K8196O7444l3559o3911L8607O0030
353D9533m3342n5836M7771N1300n1831m6460N5517M1331n8784l5950O1617L0324
365D5190o3962k4481O5758J8500o7010j2420O7677O307o7771k02O7260n798o6174
378c7126J1644O4521j7257o2350K2616N9696k7652n6614L2358N3127l6661m9336
390d3034M0588M5259m4116m0953M7250L6454n0018l1798N2409K7007n4441k2106
$$ y = [-45916, -36030, 48974, 31573, -51647, -26906, 53955, 22081, -55826, -17121, 57267, 12073, -58257, -6979, 58755, 1856, -58784, 3210, 58310, -8186, -57362, 13027, 55922, -17702, -54045, 22109, 51747, -26257, -49060, 30099, 46055, -33605, -42738, 36762, 39182, -39577, -35428, 42023, 31508, -44106, -27437, 45876, 23297, -47274, -19078, 48366, 14807, -49104, -10497, 49533, 6191, -49645, -1874, 49426, -2405, -48865, 6652, 47983, -10801, -46751, 14866, 45190, -18772, -43253, 22505, 41005, -26005, -38425, 29252, 35559, -32212, -32414, 34846, 29048, -37126, -25482, 39039, 21782, -40568, -17952, 41744, 14092, -42522, -10164, 42963, 6302, -43034, -2446, 42813, -1303, -42256, 4994, 41448, -8570, -40368, 12041, 39048, -15393, -37499]
402c7499N6114J7091n7387j2017N8284O905n8820j746N8928l404n8625Q525N7883
415C4232j3555n6700J8492N5068k3252n2989K7775N0482l2030m7566L5966M4286
427D0209l9551m0656M2729L6734m5478l2574M7787K8233m9656k3753N1073J9192
439C4289n2062j4602N2634J0011n2804n466N2621R73n2093L460N1218p784n0061
452b9666J2028M8588j6135m6845K0143M4784k3979m2443K7645L9823l1108l6926
464c4091L4348L3752l7318l0330L9983K6659m2309k2775M4272J8726m5838j4528
476b9449M6951J0265m7648n972M7920J684m7746K537M7145o628m6165J0567M4831
489B8292j4350m3154J7903M1205k1249l9007K4368L6577k7262l3942K9908L1168
$$ y = [-37499, 18615, 35706, -21681, -33698, 24586, 31491, -27329, -29075, 29853, 26449, -32176, -23651, 34232, 20677, -36023, -17531, 37537, 14285, -38704, -10929, 39553, 7523, -40043, -4077, 40209, 658, -39998, 2731, 39465, -6013, -38587, 9200, 37433, -12223, -35976, 15097, 34289, -17773, -32375, 20259, 30270, -22534, -28000, 24621, 25594, -26499, -23039, 28179, 20395, -29666, -17638, 30950, 14815, -32030, -11887, 32897, 8918, -33525, -5880, 33943, 2835, -34091, 257, 34009, -3309, -33639, 6344, 33003, -9306, -32081, 12191, 30917, -14921, -29449, 17502, 27767, -19881, -25853, 22067, 23751, -23995, -21458, 25687, 19059, -27106, -16539, 28292, 13942, -29212, -11309, 29896, 8647, -30360, -5992, 30585, 3323, -30619, -711, 30457]
501C0457l2362k8204L4583K5103l6574k1861L8331J8496l9822j5043M1078J1454
513B5636m2028p793M2680M079m3014l10M2991l428m2652P148M1921j0777m0842
526b6389J4290L9393j7613l7638K0741L5564k3623l3214K6230L0625k8532k7864
538b8030L0578K4919l2300k1877L3730J8744l4869j5550L5748J2307l6374r034
550b2008L6739N782l6863k546L6788p08l6463L913L5930p089l5167J0223L4168
563B2699j3295l2937J6278L1432j9113k9716K1834K7746k4369k5539K6670K3123
575B4813k8726k0516L0516J7749l2015j4862L3202J1874l4056q836L4590N807
587A9540l4817k785L4741j96l4369L076L3764n868l2921Q555L1872j1146l0630
$$ y = [30457, -1905, -30109, 4474, 29577, -6997, -28858, 9473, 27969, -11853, -26896, 14182, 25636, -16392, -24185, 18495, 22574, -20440, -20750, 22241, 18813, -23839, -16691, 25230, 14453, -26389, -12099, 27294, 9681, -27957, -7216, 28348, 4725, -28489, -2259, 28366, -166, -28030, 2548, 27467, -4833, -26710, 7020, 25764, -9105, -24655, 11093, 23400, -12974, -22008, 14731, 20513, -16350, -18896, 17892, 17184, -19279, -15366, 20564, 13475, -21692, -11469, 22699, 9404, -23533, -7255, 24177, 5064, -24652, -2818, 24928, 559, -24980, 1690, 24813, -3913, -24429, 6087, 23836, -8179, -23041, 10161, 22035, -12021, -20857, 13733, 19540, -15277, -18062, 16679, 16483, -17886, -14810, 18954, 13086, -19835, -11280, 20592, 9446, -21184]
600b1184J3594K9213j5911k7653J8128K5940k0211k4069K2148K2060k3953j9942
612b1840K5635J7664k7124j5270K8437J2761k9552j0135L0428P426l1057m653
624a7280L1414J870l1512R32L1308l679l0828O344L0078q910k9066J1350K7826
637A9847j3623k6368J5710K4728j7600k2943J9312K1029k0852j9009K2189J6902
649A9322k3350j4727K4335J2502k5154j0247K5842P932k6345n596K6695L235k6901
662a2457q26K6908j581k6748L988K6404o356k5869Q704K5112j1002k4125J3181
675d667K2962j5255k1585J7158K0029j8887j8298K0420J6423k1727j4448K2812
687D937J2396k3690j0266K4304Q115k4707n967K4918L823k4918j713K4746l58
$$ y = [-21184, -7590, 21623, 5712, -21941, -3813, 22127, 1916, -22153, -5, 22055, -1898, -21840, 3795, 21459, -5665, -20935, 7502, 20263, -9289, -19424, 11004, 18430, -12627, -17280, 14134, 16004, -15508, -14576, 16732, 13053, -17775, -11431, 18647, 9737, -19329, -7979, 19847, 6224, -20144, -4434, 20294, 2694, -20249, -937, 20092, -760, -19769, 2420, 19322, -4028, -18755, 5580, 18082, -7072, -17319, 8523, 16455, -9890, -15486, 11209, 14444, -12457, -13283, 13625, 12044, -14704, -10716, 15688, 9332, -16537, -7833, 17279, 6277, -17848, -4667, 18295, 3040, -18545, -1387, 18642, -245, -18543, 1877, 18300, -3427, -17875, 4937, 17333, -6357, -16623, 7681, 15796, -8911, -14878, 10040, 13863, -11055, -12768, 11978, 11620]
700A1620k4406K359K3936m335k3305O249K2558q107k1677R890K0691j1626j9582
713a5735J3303J8328j4886j6948J6374J5447j7748j3818J8991J2076k0071j0235
725a4922K0983Q304k1724o293K2216M280k2521k243K2602K08k2454J771K2124
738A2331l699k1567N498K0860p217j9999Q819J9002j0316j7874J1691J6658j2921
751A266j5375J4060J4014j5094j2593J6013J1128j6854r585J7575Q002j8206o371
764a2020J8732M685j9125k966J9404J196j9530N78J9515k368j9325M146J8963
777A1885n866j8436P536J7735r123j6879J0588J5880j1937j4741J3139J3486j4178
790i11j2142J5051J0758j5793r296J6365P820j6795o339J7091M848j7263l350
$$ y = [11620, -12786, -10427, 13509, 9174, -14131, -7882, 14676, 6569, -15108, -5218, 15473, 3847, -15735, -2432, 15896, 1010, -15938, 436, 15883, -1865, -15683, 3308, 15384, -4687, -14922, 6061, 14365, -7359, -13652, 8564, 12844, -9677, -11920, 10682, 10890, -11564, -9793, 12331, 8632, -12935, -7437, 13423, 6206, -13793, -4974, 14028, 3712, -14162, -2471, 14187, 1266, -14109, -49, 13965, -1129, -13722, 2291, 13419, -3435, -13020, 4555, 12557, -5649, -12020, 6712, 11397, -7728, -10694, 8710, 9906, -9624, -9046, 10469, 8101, -11224, -7078, 11885, 6019, -12417, -4881, 12854, 3731, -13148, -2560, 13320, 1383, -13358, -219, 13267, -911, -13053, 1998, 12756, -3037, -12333, 4032, 11852, -4943, -11282, 5809, 10657, -6606, -9956]
803i956J7298J894j7247m37J7116j038j6859K454J6539l874j6118N282J5581o654
817C981j4965Q019J4222r331j3358J0553J2413j1726j1343J2805J0163j3754q897
830a1218J4555P574j5232o180J5756M739j6101l297J6305J843j6323m23J6205
843H203r61j5954K282J5591l569j5081M762J4500n895j3847O967J3093p952j2304
857a0165Q893J1453r777j0543J0609R576j1401q519J2098P452j2763o291J3316
870C938N103j3804l851J4189K559j4465j233J4617j29j4609J457J4503k783j4239
884h747M059J3836n282j3297O416J2667p484j1906Q410J1090r272j0173R999R222
898I538j0624q238J1154P225j1609o163J1953N105j2221m043J2440K941j2570
$$ y = [-9956, 7342, 9236, -8011, -8448, 8668, 7630, -9229, -6775, 9764, 5890, -10228, -4946, 10635, 3981, -10984, -2965, 11257, 1926, -11432, -879, 11534, -192, -11535, 1270, 11433, -2321, -11218, 3337, 10911, -4321, -10501, 5255, 9994, -6107, -9404, 6901, 8744, -7579, -8002, 8203, 7242, -8712, -6430, 9161, 5592, -9489, -4727, 9773, 3878, -9969, -3002, 10091, 2139, -10165, -1272, 10181, 404, -10139, 470, 10046, -1355, -9874, 2224, 9676, -3087, -9378, 3938, 9041, -4763, -8614, 5575, 8134, -6331, -7564, 7053, 6924, -7685, -6228, 8275, 5492, -8747, -4688, 9148, 3866, -9431, -3015, 9652, 2168, -9738, -1328, 9762, 490, -9683, 316, 9538, -1086, -9324, 1830, 9055, -2554, -8717, 3236, 8341, -3880, -7923, 4517, 7458, -5112]
911e112j850J2625P72j2638L52J2558j467j2412K600J2183l720j1870M836J1438
925H295n915j0915O952J0297p935r584Q836Q797r674p883J0362O954j0975n937
939h325J1429M917j1810l847J2035K801j2149j755J2146P38j2057K49J1875j210
953E037j1612K129J1305l028j0918L885J0488m717r995N517R461o296q849P032
967e61Q202p743p507Q416O756r068n923R614N044j0109m110J0532L134j0855k126
982f304J1080J082j1166n3J1157r55j1046J938J0829k893j0492L772J0082m599
996B432r598N350R045o039q413O638P777p175p101P665O392q084n654Q448M885
1011F568q768m115R036L328r267k512R449J663r583p91R648p7r679R97R617j909
$$ y = [-5112, -6962, 5663, 6435, -6203, -5851, 6707, 5240, -7172, -4572, 7611, 3891, -7979, -3143, 8295, 2380, -8535, -1583, 8714, 779, -8805, 31, 8828, -846, -8729, 1633, 8587, -2388, -8325, 3104, 8021, -3789, -7636, 4399, 7200, -4949, -6704, 5442, 6180, -5877, -5628, 6247, 5037, -6575, -4446, 6859, 3831, -7087, -3202, 7286, 2569, -7426, -1909, 7552, 1256, -7593, -561, 7641, -102, -7609, 807, 7563, -1505, -7428, 2186, 7230, -2879, -6989, 3543, 6677, -4178, -6304, 4776, 5858, -5308, -5361, 5796, 4841, -6205, -4267, 6562, 3669, -6823, -3051, 7031, 2432, -7166, -1816, 7229, 1190, -7223, -585, 7192, 17, -7084, 581, 6973, -1111, -6765, 1683, 6568, -2200, -6315, 2721, 6049, -3218, -5730, 3719, 5382, -4201, -4992, 4656, 4579, -5100, -4103, 5514, 3605]
1027C605r462K793R232l675q917M528Q522n355q011O088P460o757o855P353O183
1042F732p878n432Q269M710q601l930Q828L163q984k390R053J637r073q95R031
1057D240J51q910N50Q788j278q587J958Q358k662q068L352P751m036p374M691
1072a076O956n348o464N961N926o548n323P078M678p556l974P973L224q300k458
1087e251Q545J666q697q74Q778P0q742O96Q610j405q429K112Q172k778p836L365
1103a998P475l931p068M446O620m918o154N347N673n760n143O137M597o490m023
1118e190O791L416p063k788P333K104p532j418P698P06p792L8P817p91p774J540
1134b905P660k278p466K971P219l661o861M285O461m861n997N366N495n791m964
$$ y = [3605, -5857, -3064, 6168, 2493, -6424, -1896, 6626, 1271, -6740, -652, 6808, 51, -6804, 549, 6732, -1146, -6578, 1691, 6401, -2200, -6130, 2698, 5861, -3123, -5513, 3540, 5177, -3896, -4791, 4240, 4391, -4519, -3969, 4819, 3541, -5046, -3088, 5270, 2608, -5460, -2108, 5643, 1607, -5767, -1076, 5880, 532, -5932, 29, 5955, -593, -5916, 1162, 5840, -1716, -5690, 2283, 5507, -2793, -5251, 3294, 4960, -3737, -4611, 4167, 4237, -4505, -3809, 4801, 3396, -5033, -2921, 5251, 2473, -5363, -1998, 5477, 1546, -5522, -1076, 5544, 626, -5528, -181, 5492, -268, -5411, 726, 5323, -1167, -5190, 1601, 5017, -2046, -4834, 2499, 4603, -2929, -4347, 3351, 4057, -3735, -3697, 4120, 3329, -4445, -2905, 4755, 2477, -4989, -2018, 5201, 1540, -5321, -1036, 5425, 564, -5433, -67, 5428, -363, -5327]
1149e327O149M393o448l808O661L244o846k654O972K058p043j467P065Q94p076
1164c233k89P028k86o956Q74O854j471o708K072O509k675o269L257N983l835n641
1180d786M399N242m929m785N412M279n842l740O214L159o508k554O719J945o878
1195b653j320O962P13o974j15O919m63o800R99O646j518o431K000O185k456n906
1211d212K891N605l308n268L669M936m059m552M419M144m753l718N082L240n359
1226a243k759N637K212n846j684O057J074o167m80O234j32o217P08O182j303o059
1242c786J865N881k405n647K904N353l347n025L755M659m085m287M381L887m640
1257e37l484M865L052n036k621N174K180n275j733N363J281n426q12N442L52n454
$$ y = [-5327, 822, 5215, -1233, -5041, 1620, 4864, -1982, -4636, 2336, 4394, -2649, -4116, 2949, 3843, -3233, -3522, 3506, 3220, -3736, -2862, 3992, 2521, -4187, -2115, 4394, 1719, -4550, -1293, 4690, 855, -4786, -387, 4855, -74, -4859, 553, 4832, -1010, -4750, 1464, 4623, -1885, -4439, 2280, 4225, -2653, -3973, 2989, 3702, -3272, -3387, 3532, 3069, -3731, -2732, 3914, 2396, -4035, -2035, 4150, 1694, -4212, -1321, 4284, 976, -4292, -623, 4313, 254, -4298, 121, 4265, -488, -4206, 876, 4116, -1243, -4002, 1635, 3847, -1999, -3683, 2374, 3448, -2719, -3199, 3035, 2903, -3314, -2606, 3576, 2273, -3786, -1921, 3960, 1555, -4092, -1188, 4165, 818, -4207, -452, 4207, 122, -4165, 216, 4103, -537, -4021, 844, 3896, -1140, -3761, 1413, 3593, -1682, -3415, 1948, 3229, -2197, -3009, 2433, 2785, -2669]
1273b669J31N436o27n380J131N288j640n148K141M964k645m716L106M452l565
1288B59m119L963L757m326l347M639K917m909k456N110J999n243j548N321J093
1303C110n361o35N346K06n281K01N199o09n083R95M926j359m764J724M579k072
1319A122m385K433M140k766l886L108L587l425l277L737K929m025k539M286K136
1334C175m522j710M721J251m851p92M950L10n003J79M983o45m916J084M825j515
1350A524m651J895M439k236m215K559L950k840l699L106L400l313l117L514K808
1365C124l683k500L838K178l975j829M095J469m175j116M265P35m332l31M372
1380B135q1m378N02M331r24m253J339M152j763l993K159L801k541l572K884L297
$$ y = [-2669, -2538, 2898, 2271, -3109, -1978, 3310, 1670, -3478, -1337, 3627, 982, -3734, -628, 3824, 259, -3860, 103, 3860, -466, -3813, 826, 3743, -1166, -3622, 1488, 3487, -1756, -3304, 2017, 3110, -2251, -2886, 2460, 2666, -2615, -2414, 2785, 2176, -2907, -1912, 3014, 1655, -3109, -1385, 3194, 1122, -3263, -830, 3310, 544, -3342, -234, 3353, -72, -3349, 388, 3317, -708, -3247, 1039, 3175, -1347, -3057, 1664, 2915, -1936, -2728, 2222, 2532, -2471, -2292, 2691, 2046, -2870, -1786, 3039, 1524, -3127, -1232, 3207, 971, -3244, -685, 3265, 425, -3274, -168, 3232, -81, -3198, 316, 3124, -559, -3059, 779, 2957, -1018, -2847, 1248, 2717, -1458, -2574, 1691, 2426, -1906, -2237, 2135, 2054, -2324, -1822, 2509, 1585, -2668, -1329, 2823, 1060, -2933, -774, 3027, 486, -3086, -202, 3095]
1396C095l185k992L440K672l661k331L824J985l942j635M027J319m099r69M094
1411A642O60m079l41M048K3l995K78L923n85l837Q91L727j178l617J482L476j797
1428G21l293K094L105k392k873K659K636k955k333L190K032l409j714L603J356
1443B427l742r93L831O38l897k68L914r1l879M29L800p25l721J025L605j302l442
1460b391J542L268j741l125J978K911k159k713K337K518k505k297K655K057k804
1475d69j818K956J547l085j266L194R75l290o54L357L18l397K6L401l54l397P09
1492a247L335j036l256J364L122j665k958J951K757k179k555K389K331k561k110
1507b318K710J876k830j623K909J378k968j152L019R19l049o76L065M34l058k03
$$ y = [3095, -90, -3082, 358, 3030, -631, -2962, 862, 2847, -1095, -2730, 1297, 2616, -1483, -2452, 1642, 2302, -1777, -2118, 1930, 1953, -2042, -1764, 2159, 1574, -2263, -1372, 2355, 1177, -2440, -958, 2518, 721, -2572, -478, 2627, 235, -2638, 21, 2657, -298, -2631, 559, 2591, -818, -2532, 1071, 2427, -1315, -2308, 1523, 2161, -1736, -2004, 1910, 1819, -2060, -1631, 2169, 1444, -2277, -1252, 2353, 1051, -2391, -849, 2419, 678, -2447, -469, 2442, 283, -2430, -93, 2425, -80, -2377, 278, 2335, -469, -2287, 669, 2216, -869, -2135, 1059, 2034, -1256, -1910, 1447, 1765, -1632, -1606, 1795, 1441, -1956, -1247, 2088, 1052, -2204, -840, 2282, 617, -2341, -390, 2367, 188, -2367, 22, 2353, -208, -2318, 392, 2268, -562, -2185, 724, 2102, -866, -2018, 1001, 1920, -1129, -1805, 1260, 1694, -1364, -1567]
1523a567L043m1l031K95K997n57k939Q27K862j093k768J364K642j633k479J895
1539a83K295k132k089K353J868k559j620K716J365k856j093K963Q14l032n42L054
1555A322K79l049k1L024k22k970M37K901o56k799Q39K706j018k602J209K486j390
1572D76k347J539K208j697k061J863J885k011j703K163J505k304j289K434J051
1587A712k545p83K632N24k705k44K731k9k752L25K717n99k655Q40K585j088k473
1604a807J309K343j508k196J669K031j800j878J933J709k041j527K126J340k185
1619d82j178K248J008k300q05K322O26k357m38K391K33k400j2K387k06k364M35
1636h92K334o86k269R00K195j142k082J377J937j576j793J780J601j937j418K080
$$ y = [-1567, 1476, 1435, -1596, -1301, 1696, 1139, -1800, -973, 1889, 796, -1972, -608, 2034, 401, -2078, -183, 2112, -20, -2109, 244, 2112, -447, -2067, 649, 2014, -842, -1935, 1028, 1842, -1190, -1732, 1322, 1601, -1448, -1469, 1555, 1333, -1637, -1200, 1701, 1045, -1754, -915, 1791, 773, -1829, -620, 1866, 476, -1871, -332, 1876, 179, -1882, -19, 1866, -145, -1848, 315, 1820, -484, -1773, 661, 1712, -833, -1616, 1016, 1540, -1165, -1409, 1322, 1293, -1459, -1134, 1583, 984, -1671, -831, 1754, 666, -1807, -498, 1845, 337, -1859, -190, 1841, 41, -1837, 96, 1805, -236, -1763, 363, 1703, -482, -1660, 588, 1596, -704, -1509, 813, 1439, -918, -1356, 1035, 1268, -1132, -1144, 1243, 1037, -1327, -892, 1442, 756, -1513, -613, 1582, 440, -1642, -265, 1672, 96, -1697, 83, 1684, -253, -1671, 409]
1652D09J219k189j011K263Q10k323n94K343M16k359k31K360M0k332J42K273k98
1669I38k206M45K158n96k098P60K004r03j922J048J821j192j720J354J583j490
1685a6j453J639J283j777j105J903R13k009p02K088M83k139k76K201L7k199J82
1702i47K183l93k140N79K090p71k013R49J903j091j813J234J694j328j577J429
1718a2J447j511j324J580J200j657j060J718R16j765p81J832O09j861m58J914
1734G87K75j938r2J934q6j943K91J920m93j871O78J829q92j736J081J631j249
1751A26j509J403J378j543j223J652J066j736q93J784P49j829o11J862M61j882
1767g45l06J861J69j833m9J823q1j803K14J765l43j723M80J669o16j610P54J530
$$ y = [409, 1628, -561, -1572, 691, 1501, -822, -1416, 927, 1343, -1016, -1247, 1113, 1153, -1179, -1037, 1236, 938, -1268, -823, 1335, 739, -1359, -599, 1405, 502, -1420, -372, 1449, 257, -1463, -109, 1474, -16, -1469, 170, 1453, -324, -1429, 474, 1387, -622, -1324, 764, 1247, -892, -1168, 1033, 1070, -1129, -947, 1236, 843, -1297, -718, 1372, 601, -1412, -463, 1440, 349, -1464, -230, 1464, 136, -1441, -12, 1435, -76, -1400, 180, 1380, -277, -1337, 381, 1297, -468, -1249, 583, 1192, -669, -1127, 787, 1062, -876, -968, 966, 880, -1063, -772, 1148, 655, -1216, -538, 1291, 399, -1337, -256, 1375, 126, -1383, 20, 1398, -145, -1368, 284, 1350, -386, -1279, 505, 1254, -575, -1186, 676, 1137, -745, -1051, 810, 979, -854, -903, 920, 839, -964, -750, 1015, 672, -1051, -571, 1098, 482, -1128, -374, 1156]
1785A156q82j452J026J345j161j234J307J105j425r58J528Q07j628o24J688M53
1801A051j749k79J786R6j802Q1J789k36j761L91J709n39j646O54J578p64j490
1818a131Q68J402r50j325J024J247j107j142J167J053j240r34J283Q38j357p07
1834a011J395N94j449m62J507L04j533j51J557nj553J68J530l29j518N09J461
1851A014o61j398Q01J320r43j220J058J119j158j010J230Q99j300p67J326O72
1867I82j378n42J395M44j396l42J407K35j407j36J392M6j383M5J371j55j347K70
1885d99J329l95j282N08J222o14j172P48J083q64j008R88Q91j085p78J175O65
1902I12j246n42J319L98j360k61J373J38j384qJ381j09j353K10J317k98j282L98
$$ y = [1156, 274, -1178, -152, 1193, 32, -1202, 105, 1210, -215, -1173, 355, 1162, -466, -1090, 598, 1051, -698, -977, 809, 905, -897, -816, 973, 737, -1024, -633, 1076, 537, -1109, -455, 1123, 359, -1131, -263, 1139, 189, -1136, -112, 1135, 28, -1114, 53, 1106, -134, -1068, 215, 1053, -304, -1011, 384, 978, -471, -933, 574, 878, -655, -806, 751, 746, -807, -639, 891, 562, -956, -447, 1014, 353, -1045, -244, 1076, 133, -1087, -29, 1090, -68, -1078, 152, 1051, -249, -1016, 310, 982, -396, -938, 457, 901, -495, -837, 570, 805, -602, -738, 654, 700, -683, -638, 733, 578, -769, -499, 830, 435, -847, -339, 883, 269, -903, -155, 928, 64, -944, 44, 935, -150, -928, 247, 912, -334, -876, 443, 841, -519, -780, 593, 731, -653, -661, 720, 611, -742, -532, 785, 487, -795, -397]
1920c97J231m75j189N49J129o13j071O68J021p34r54Q00Q65q41q13R16P16r68
1938a60o40J042N36j096m24J145L00j170j85J198L8j194Q0J208k19j180L55J136
1956G70m63j098N83J043o88r80P77Q93q32q25Q82P48r39o61R76N82r97n10J023
1975B84M17j019l61J048K75j037k25J059J41j064m3J052l7j055J34J025k15j009
1993f30L33R66m34r21N30Q84o43q03P19P51q35o53R11N53r64m54J010L48j037
2012c69k51J048J53j050o6J064l3j038J07J010j71r79K15R74l03r28L54Q91m04
2031B24q51M66Q00n21p66N81P23o48o43O91N87p45n20Q03M19q40l19Q67K39r19
2051c72j34R38K9r52R0R40j89r23K88Q94l64q64M48Q17n22p78N95P13o56o30O82
$$ y = [-397, 834, 359, -830, -281, 848, 235, -836, -168, 853, 119, -835, -35, 830, -11, -824, 92, 808, -160, -800, 242, 778, -318, -742, 403, 703, -467, -652, 546, 584, -610, -530, 678, 459, -721, -366, 770, 307, -791, -208, 835, 147, -833, -56, 837, 5, -820, 62, 810, -129, -790, 186, 768, -229, -739, 284, 701, -318, -679, 369, 644, -393, -618, 441, 582, -482, -525, 527, 490, -565, -431, 594, 379, -630, -297, 669, 235, -686, -156, 728, 85, -718, 1, 752, -83, -736, 175, 728, -236, -690, 320, 668, -369, -620, 428, 581, -469, -535, 529, 496, -542, -435, 575, 404, -575, -360, 614, 311, -617, -263, 628, 224, -627, -161, 639, 118, -648, -67, 656, 8, -635, 56, 643, -102, -622, 181, 600, -240, -559, 308, 547, -372, -506, 432, 461, -491, -401, 539, 350, -573, -285, 609, 245, -619, -171, 646, 124, -654, -59, 654, -2, -632, 50]
2072E0N83p09n35P30M86p66m16P76L66p94k96P97K44q04j93Q17J25q30l0Q06k2
2093C85q23J07Q18k11p86K87P61l66p37M59O87n41o27O17N65o91m81P35M16p79
2113b05l38Q18K58q32j85Q43J10q50l8Q33j8q14O7Q07j31p82J69P62k12p43K61
2134b20P09l03o78L55O45m13o06M64N67n15n21N75M54o24l78O60L10p08k33P38
2154B78J73p79o4P74j8p84J04P78j83p61K60P38l17p22L83O78m49o19M91N75n06
2175C0n47N51M90n72m56N90M17o22l49O32L05o49k66O61K10o77j46O92R2p07j3
2196c34O89m0p08J37O89k11o71K86O51l71o07M43N63n03n19N82M44o21m02O65
2216A62L50p06k70P15K08p35j50P36R7p54j6P27k1p20O1P16j16o96J71O66k00
$$ y = [50, 633, -76, -611, 119, 605, -161, -577, 199, 565, -229, -525, 272, 516, -288, -481, 336, 461, -369, -399, 407, 385, -438, -331, 487, 276, -510, -223, 538, 172, -565, -106, 581, 40, -587, 30, 595, -96, -577, 158, 574, -205, -543, 275, 533, -299, -484, 359, 469, -381, -419, 414, 396, -418, -351, 456, 325, -457, -288, 474, 262, -481, -220, 489, 186, -492, -137, 508, 95, -511, -47, 520, 5, -516, 59, 513, -111, -489, 171, 481, -227, -460, 278, 451, -328, -392, 382, 364, -420, -316, 462, 279, -482, -222, 516, 199, -523, -140, 538, 89, -530, -39, 536, 30, -517, 34, 524, -48, -504, 86, 503, -119, -468, 164, 469, -180, -446, 215, 425, -252, -398, 294, 386, -321, -334, 355, 315, -393, -256, 433, 222, -449, -163, 488, 117, -490, -47, 516, 13, -506, 76, 520, -101, -503, 162, 512, -194, -464, 251, 459, -276, -426, 310, 407, -347, -363, 364, 343, -377, -316, 400, 284, -412, -241, 425, 225]
2237B25o51K47O16k86o09L46N77l97n41M52N00n13m29N56L79o01l33O55K53o86
2257b40j70P02R8p19k3P32n6p38J34P25k01p07K69O82l38o39L79O15m36n59M50
2278d0N42m90m99N15M59n49m11N67L74n91l21N95K84o16k19O22J80o53j13O68
2298C04L9o62K3O62r0o67J59O57k41o43L27O04l84n69M54N13n04m79N70M16n90
2319a01l74O28L14o53k58O75J95o82j40O83J00o81m9O70J0o70M4O48p7o59J37
2340b40O42j95o00K20N82k73n61L43N26l84n01M31M62m87m07N32L45n71k94O21
2360A91K29o54j52O60R2o80j5O92n8o80J10O74j72o62K36O31k67o19L23N67l51
2381I5n45L88N16m24m62M34M44m77m00M92L65n27l10N36K72n62k36N95J77o03
$$ y = [225, -426, -179, 437, 151, -458, -112, 465, 68, -473, -21, 479, -34, -463, 93, 472, -129, -462, 193, 446, -240, -410, 292, 390, -329, -352, 380, 324, -414, -280, 445, 244, -463, -194, 488, 150, -489, -110, 505, 69, -490, -40, 502, 12, -487, 28, 487, -62, -473, 94, 468, -123, -444, 151, 435, -181, -400, 222, 402, -251, -364, 304, 343, -319, -296, 366, 276, -391, -232, 425, 184, -459, -132, 472, 88, -481, -27, 486, -18, -497, 73, 489, -101, -475, 153, 467, -186, -444, 231, 426, -256, -396, 287, 387, -294, -343, 327, 337, -333, -289, 359, 282, -377, -240, 402, 207, -393, -173, 409, 136, -425, -82, 444, 60, -441, -10, 452, -35, -442, 90, 435, -136, -430, 191, 420, -234, -386, 274, 366, -314, -329, 363, 305, -375, -265, 409, 237, -425, -189, 442, 175, -444, -121, 446, 95, -450, -62, 454, 30, -432, 2, 446, -31, -431, 61, 426, -101, -411, 125, 397, -165, -401, 194, 371, -232]
2401b32j09O17N3o29RO39j00o13J65N98k25n91K94N69l62n30M07M95m63m53N15
2422E4M09n28l83N78L12o06k51N98K17o09j61O11J16o13q5O19L7o00nO02n0n96
2444c34J04N86j50n73K05N53k47n38L02N16l49m85L98M45m71l88N12L40n45k83
2464d02N79K26o10j57O19J10o51l4O33k5o30Q3O24j30o18J86N93k36n53K50N39
2485C96k83n17L22M96l61m53L81M30m16l90M45L43m66l17N05K80n32k26N34J85
2505C56n65j20N79N3n81LN88p1n85J40N70j94n55K54N33l10m99L53M61m08m18
2526d16M35L89m58l51M93L05n07k71N21K26n14j95N31J49n44j02N37Q5n62l4N58
2547B75j1n43M3N40j06n24J61N14k15m85K52M67k98m49L64M09m09l63M24L42m74
$$ y = [-232, -341, 276, 329, -300, -291, 348, 248, -365, -200, 398, 173, -418, -124, 445, 83, -447, -40, 455, -8, -461, 54, 463, -65, -448, 130, 442, -164, -415, 183, 400, -209, -370, 241, 357, -256, -341, 278, 315, -285, -290, 312, 262, -334, -230, 356, 206, -367, -162, 391, 144, -394, -92, 424, 75, -410, -12, 433, -38, -426, 86, 426, -119, -402, 177, 403, -207, -364, 255, 365, -286, -320, 313, 288, -342, -259, 365, 235, -383, -197, 396, 160, -393, -143, 396, 113, -404, -82, 414, 53, -400, -19, 411, -5, -395, 50, 393, -73, -390, 115, 395, -137, -363, 171, 356, -209, -329, 250, 303, -278, -275, 313, 242, -343, -203, 367, 173, -382, -128, 405, 95, -404, -51, 410, 2, -416, 19, 408, -50, -401, 92, 397, -110, -381, 140, 366, -148, -343, 188, 337, -207, -309, 228, 313, -249, -283, 275, 264, -279, -236, 304, 198, -326, -165, 349, 134, -351, -99, 368, 70, -379, -15, 394, -15, -378, 46, 388, -86]
2568h6k79N08K21n43j62N59J10n64o1N60K5n66K1N69p2n51J08N44j48n24J91M85
2590C45k00m91K43M66k78m35K96M25l45l88L77L47l99l26M41K82m54k37M72J96
2610C37n07j32N17Q1n41j1N35m2n29Q0N44j47n17J93N02k48m81K84M48l11m17
2631c62L57L80l77l69M18L16m22l03M49K64m42k39M59J98m80j63M92J30n05q7
2651b86N02N2n17RN21o0n07J09M93j59m83K03M60k45m42L00M11l48l76L98L33
2672C68m27k94M58K39m83j96M96J57n02j25N27O6n28l1N18Rn26M4N01p1m98J06
2694a92M89j37m65J58M70k08m41K30M41k87m06L28L73l59l36L94K97m22k50M38
2714A15K11m58j69M90J13n19m4N14nn18O3N02r7n04J44M89j93m58K14M40k47m20
$$ y = [-86, -365, 143, 364, -179, -341, 218, 328, -236, -297, 263, 288, -278, -257, 312, 240, -311, -203, 341, 193, -331, -140, 345, 145, -346, -103, 363, 85, -350, -54, 371, 26, -362, 15, 362, -37, -363, 78, 360, -94, -331, 141, 337, -170, -302, 215, 296, -245, -256, 279, 237, -292, -212, 332, 185, -332, -139, 363, 115, -366, -82, 366, 55, -362, -5, 375, -2, -371, 47, 363, -59, -362, 87, 351, -91, -330, 129, 327, -153, -316, 176, 306, -199, -286, 216, 268, -249, -240, 281, 221, -286, -177, 316, 157, -326, -123, 337, 92, -350, -50, 361, 13, -363, 35, 368, -59, -353, 105, 344, -139, -335, 161, 318, -184, -309, 218, 284, -244, -275, 243, 252, -274, -230, 271, 200, -298, -192, 297, 160, -305, -147, 323, 115, -326, -96, 345, 58, -348, -20, 353, -6, -342, 52, 349, -73, -323, 115, 326, -132, -301, 189, 302, -217, -261, 253, 248, -270, -207, 295, 198, -306, -162, 327, 134, -324, -110, 330, 83, -337]
2736c37K86M07l30l74L42L53l56l21L73L02l99k67M16K42m44k00M49J66m61j28
2756b81M78P0m72m4M87j5m89O0M91j19m68J58M65k22m37K67M07k96l94L59L39
2777C44l75l03M09K60m26k33M54J89m63j55M74J24m82q2M71N6m86pM79rm92M7
2799b06M79p9m75J20M71j70m29J91M29k37m13K76L75l04l52L45L27l88k92M16
2819H4K48m44j91M60J40m71r5M87M7m89oM92m3m85Q0M82j21m69J57M63k00m41
2841c15K17M31k56m04K78L81l11l52L28L46l61l11L81K82m06k40M28J94m35j75
2861c00M52J26m65p1M80J5m72J9M89p6m71J20M56j59m48K20M18k60l91K92L65
2882C39l26l41L56L05l73k72L92K40m18k06M41J65m40j37M46J06m68o1M64L0m64
$$ y = [-337, -51, 356, 26, -348, -6, 347, -9, -330, 43, 345, -54, -321, 95, 337, -107, -307, 142, 308, -153, -281, 197, 267, -205, -249, 238, 223, -266, -206, 285, 166, -302, -144, 321, 99, -338, -71, 336, 40, -354, 5, 344, -31, -334, 75, 335, -91, -324, 130, 319, -144, -299, 175, 299, -183, -265, 206, 262, -224, -231, 248, 239, -253, -206, 273, 194, -281, -161, 310, 140, -289, -98, 331, 94, -319, -43, 332, 28, -324, 21, 348, -40, -332, 84, 332, -112, -303, 157, 297, -174, -269, 218, 265, -224, -230, 262, 219, -266, -186, 296, 175, -294, -137, 326, 126, -315, -98, 333, 77, -327, -49, 332, 21, -331, -3, 343, -18, -329, 52, 334, -72, -312, 116, 310, -125, -300, 152, 278, -187, -258, 222, 237, -235, -216, 273, 197, -274, -154, 302, 143, -305, -85, 333, 73, -318, -26, 339, 13, -328, 28, 333, -40, -312, 80, 320, -98, -304, 137, 302, -138, -275, 171, 277, -191, -252, 212, 242, -222]
2903b22nM59j4m69O3M71j22m50J59M28j80m23K40L88k86l54L10L36l54k91L81
2924F5K47m09j98M25J55m43j16M65O8m58l7M65rm66N0M46o9m45J11M29j42m22
2946b88J66M12j96l91K30L73k47l69K88L42l21l10L46K85l66k57L96K03m03j83
2966b90M27J26m28q7M37N0m49J9M36n3m50J08M22j39m10J87L91k27l64K61L38
2987C05k83l17L00L09l41k71L56K38l69k17L83J85l91j50M02J31m25r5M22O1m21
3008a88l3M36Jm36M2M37r1m21J20M09j65l98K12L65k41l47K85L15l07k82L38K39
3030B90l69k07L94J70l95j32M06Q3m08n5M28J3m10MM22n0m02N7M10r4m00J17L96
3053B68j46l92J84L65k01l60K41L30k56l18K87K82l09k53L37K18l57j84L89J28
$$ y = [-222, -227, 232, 218, -251, -188, 283, 161, -289, -130, 298, 118, -305, -65, 323, 37, -317, -7, 329, -25, -316, 65, 312, -97, -295, 130, 285, -158, -274, 191, 259, -199, -236, 229, 220, -246, -196, 250, 181, -264, -153, 276, 134, -288, -122, 290, 94, -297, -67, 306, 59, -310, -22, 320, -1, -311, 35, 320, -46, -303, 93, 296, -107, -290, 137, 263, -165, -252, 185, 235, -214, -195, 241, 188, -262, -154, 268, 129, -281, -94, 297, 70, -294, -33, 305, 22, -295, 5, 314, -27, -298, 58, 296, -73, -290, 93, 278, -113, -263, 139, 270, -155, -250, 172, 233, -188, -221, 215, 216, -220, -178, 259, 168, -253, -133, 276, 111, -287, -75, 290, 49, -298, -13, 302, -5, -287, 51, 290, -79, -286, 108, 278, -117, -249, 157, 240, -168, -223, 205, 218, -192, -188, 234, 184, -218, -161, 249, 155, -245, -128, 268, 122, -270, -86, 279, 78, -282, -41, 289, 33, -285, 2, 284, -25, -278, 59, 277, -80, -264, 125, 253]
3073B53l84r0L99N4m15qM03k3m04O8L88r7l87J39L66j63l66K06L34k34l02K36
3095b7L00k58k85K90K56l11k29L28K09l44j90L65J51l64j28L79R2l93n9M01L0
3116B13m13K0L98n0l90Q9L86j35l63J67L45k02l21K33K95k62k74K87K36l02k10
3137b53L21J82l38j52L45J19l61r1L77P3l78m9L81Pl75J8L76n0l81R0L56q9l66
3160b38J29L57j66l33J88L14k01l16K41K92k80k37K79K24l18j84L28J54l37j13
3180b17L55P1l63m4L75jl60K6L68o7l40P4L46j19l26J37L17j69l09J93L01k09
3202C9k84K38K55k57k45K75K11k78j92K99J81l19j56L29J20l28j04L52N8l46l2
3223a84L55rl50M7L47q9l24J13L19j54l07J95K66j92k66K24K45k53k21K75J90
$$ y = [253, -131, -221, 178, 232, -183, -191, 212, 189, -215, -147, 241, 144, -243, -104, 262, 99, -267, -61, 273, 39, -263, -27, 273, 15, -270, 20, 276, -35, -264, 64, 273, -71, -261, 104, 255, -109, -237, 142, 234, -159, -218, 183, 213, -200, -180, 218, 168, -222, -133, 253, 118, -245, -78, 267, 65, -256, -23, 272, 10, -264, 23, 259, -43, -253, 68, 250, -88, -240, 105, 224, -137, -228, 149, 222, -156, -205, 176, 183, -192, -174, 202, 152, -229, -139, 217, 128, -238, -109, 248, 82, -251, -63, 251, 50, -266, -25, 267, -13, -250, 29, 253, -65, -249, 79, 233, -104, -217, 138, 209, -154, -198, 177, 176, -184, -158, 210, 143, -197, -123, 223, 104, -222, -85, 232, 63, -246, -53, 248, 39, -245, -7, 248, -9, -254, 21, 232, -46, -238, 61, 242, -77, -233, 96, 216, -112, -216, 136, 194, -152, -184, 171, 162, -188, -141, 206, 117, -207, -94, 225, 71, -236, -41, 225, 33, -233, -9, 236, -17, -238, 37, 227]
3244B27k75j61K90J39l03j30L18R3l14o9L33N2l46l3L43jl35K4L36n4l28P2L34
3267B12j16l14J36L01j59k86J87K68k16k41K46K13k69j80K72J66k96j31L16Q9
3287A98l13o9L24L9l25KL10j9l19M6L15p3l04Q6L12j15l05J42K87j70k77J80K78
3310B30k12k58K38K44k58k08K56K11k97j65L03J37l16j08L29O8l29m0L32Nl19
3331a57RL42p1l10R6K93j11k97J51K87j86k59J94K45k23k12K35J90k61j68K76
3352F3J55k82j41K99J15k96j17L17P6l11n2L30J6l27KL28l1l14N1L07p7l08J23
3375g4K92j44k90J75K63j95k39K27K10k44j85K53J58k66j35K85J00k88r1L07N1
3396A70l00k3K97J1l13K8K97m0l12P6K95q6k89J11K84j26k87J64K60j78k58K12
$$ y = [227, -48, -209, 81, 220, -83, -213, 105, 198, -116, -185, 148, 200, -146, -179, 164, 163, -172, -148, 188, 134, -194, -122, 212, 96, -218, -82, 219, 60, -226, -39, 229, 13, -228, 18, 231, -38, -218, 54, 220, -76, -207, 109, 198, -115, -184, 140, 179, -146, -144, 166, 147, -172, -126, 189, 116, -188, -102, 210, 95, -210, -68, 219, 49, -228, -48, 230, 18, -240, -2, 242, -16, -224, 32, 243, -54, -219, 84, 221, -95, -203, 126, 194, -135, -175, 157, 162, -157, -148, 194, 123, -187, -91, 202, 91, -206, -55, 232, 46, -213, -19, 226, 3, -209, 26, 216, -45, -213, 63, 218, -64, -205, 94, 209, -87, -204, 113, 189, -122, -174, 156, 172, -155, -153, 175, 144, -170, -119, 188, 111, -197, -74, 218, 74, -216, -41, 222, 27, -212, 15, 225, -19, -204, 49, 207, -59, -194, 91, 191, -97, -188, 119, 170, -130, -153, 144, 155, -158, -130, 167, 127, -185, -109, 186, 100, -189, -78, 206, 80, -207, -43, 217, 39, -219, -7]
3418gK32k25k16K43J99k68j62K66J43k78j20L00O9k97l6K89K3l02J5K93l4k95
3440a68P4K77q1k86J28K59j51k42J58K30j80k21K07K03k18j90K20J88k50j49K54
3461F2J49k84j14K80R3k88p1L04M2l07k4L25k9k95L5K96o2k98J01K74j26k69J51
3484e5K63j80k22J87K02k12j68K14J50k32j34K55J09k61q7K72N9k60n2K69K9k80
3506a34LK85l2k73L1K83n8k79Q2K80j08k72J28K68j61k36J56K48k02k10K20J90
3528B09k33j75K48J36k45j22K63R2k78n4K84K8k84LK68j8k74N6K60q0k59R9K54
3551A78j27k30J35K32j52k23J73K04j88j88J95J81k19j59K33J43k45j25K63R7
3571A78k65p4K66N4k71j9K59J6k94L8K68o4k46O9K50r9k42J25K34j46k04J41K08
$$ y = [-7, 225, 0, -216, 27, 226, -42, -204, 62, 205, -73, -193, 107, 176, -121, -157, 132, 155, -147, -132, 161, 127, -168, -94, 183, 102, -184, -56, 203, 52, -190, -32, 198, 18, -203, 4, 207, -11, -201, 19, 207, -43, -192, 62, 211, -73, -187, 93, 186, -102, -173, 131, 173, -134, -158, 167, 138, -157, -122, 174, 112, -186, -85, 189, 63, -206, -55, 208, 28, -194, -7, 195, -17, -185, 29, 179, -53, -187, 68, 177, -84, -171, 101, 160, -100, -152, 117, 146, -134, -131, 154, 122, -151, -120, 163, 105, -174, -92, 188, 80, -192, -64, 204, 43, -193, -37, 211, 9, -201, 19, 209, -24, -199, 49, 185, -60, -182, 81, 173, -105, -159, 125, 153, -131, -128, 140, 122, -152, -96, 164, 84, -175, -76, 178, 51, -179, -44, 188, 36, -187, -14, 190, 2, -186, 9, 190, -29, -188, 45, 188, -57, -182, 81, 178, -87, -161, 105, 159, -112, -131, 128, 144, -150, -112, 156, 92, -154, -85, 165, 66, -176, -51, 183, 37, -167, -26, 182]
3594A82j84j79K02J52k12j08J92J26k31q9K38P2k41o2K43L5k44k1K67j8k46J9
3616a07K46l1k51O5K42p8k44R4K52j34k23J49K06j60j98J84J72j93j57K06J34
3637A74k18j08K26P9k29p0K50L3k39j1K32j1k25K4K33n5k25P2K22q4k24R9K20
3660A65j21k04J44J81j53j80J81J55j82j50J90J42k03j28K20J06k33o9K24N7k29
3681h7m3K25L4k45MK48l4k36O4K15p8j98Q4K06j21j88J34J75j45j65J64J40j62
3704ij31J69J30j95j03J92R5k10p4K21M6k06n3K27K2k27oK40k2k32L1K23m7k21
3728a40Q0K18r4k06J04J89j20j83J49J63j64j43J76J28j83j15J95Q9j99o5K01
3749H0L4k00k8K05J3j95pK05j4k07L2J95m2k00P2J94q2j88Q7J84j08j75J22J66
$$ y = [182, -2, -181, 21, 173, -39, -147, 45, 171, -60, -149, 89, 161, -80, -142, 101, 136, -108, -129, 138, 120, -126, -107, 139, 108, -143, -78, 164, 86, -158, -64, 188, 54, -169, -20, 186, 26, -172, 12, 184, -9, -166, 40, 174, -44, -152, 74, 153, -76, -146, 104, 137, -102, -113, 119, 108, -117, -93, 140, 85, -140, -68, 154, 70, -154, -55, 165, 44, -160, -16, 165, 12, -168, 13, 168, -14, -164, 26, 168, -35, -163, 57, 163, -70, -139, 85, 142, -87, -130, 95, 129, -116, -112, 136, 102, -134, -70, 145, 67, -131, -47, 159, 38, -150, -16, 159, 14, -151, 13, 153, -9, -140, 29, 159, -36, -139, 53, 148, -62, -136, 85, 131, -75, -128, 99, 121, -106, -112, 128, 106, -126, -95, 128, 81, -140, -60, 158, 64, -142, -38, 151, 31, -152, -3, 160, -4, -147, 29, 157, -26, -141, 54, 143, -56, -121, 80, 114, -86, -114, 91, 104, -91, -98, 107, 93, -114, -82, 113, 71, -129, -57, 137, 55, -133, -46, 138, 30, -145, -23, 143]
3773A43j28j63J55J39j71j20J85J16j95r1J91Q1k10m8K07K8k14jJ91Nk03L4J83
3796A14m2j92O7J75p2j85J12J56j17j46J27J46j37j29J37J25j60j09J64J04j89
3817e1p6J94O0j86o1J93M0k08k2K15J6k20J9J99k3k10N2K00o6j92Q9J70r7j71
3841a36J30J49j41j33J46J19j53j08J44J08j74p6J81N1j77m0J82K1j64k9J91l
3863H8j88K2J82k3j95M7J96o7j87Q1J74q5j72R8J68j22j57J47J32j46j24J53J09
3886A31j60r6J80P1j86n4J88K4j83j6J93pj83L3J76n0j72N9J61p2j51P6J66r7
3910C1j56J10J35j12j31J29J22j40j07J38R9j52r6J76P9j85n7J81N1j97l3K13
3932I8Nj95nK01j5j90K9J94n2j87O4J79q6j71J06J44j02j37J25J16j37r2J38J02
$$ y = [143, 15, -148, 7, 146, -25, -145, 40, 156, -39, -130, 61, 142, -68, -116, 91, 119, -95, -96, 95, 100, -103, -69, 114, 72, -120, -53, 122, 50, -135, -23, 133, 16, -130, -3, 143, 6, -123, 14, 139, -21, -130, 34, 138, -51, -127, 67, 127, -59, -120, 73, 113, -95, -117, 98, 114, -106, -87, 112, 89, -121, -69, 131, 65, -127, -38, 132, 35, -136, -6, 143, 2, -131, 15, 134, -19, -127, 17, 125, -49, -125, 56, 107, -70, -110, 72, 93, -71, -100, 91, 88, -100, -78, 104, 81, -114, -67, 129, 62, -125, -44, 130, 45, -127, -29, 139, 17, -140, 7, 139, -7, -131, 22, 131, -29, -125, 55, 126, -60, -114, 74, 98, -85, -101, 92, 85, -98, -65, 111, 61, -111, -52, 109, 37, -114, -38, 128, 31, -125, -15, 120, 8, -123, 6, 128, -12, -119, 19, 118, -34, -130, 46, 125, -60, -117, 64, 115, -82, -115, 98, 103, -92, -97, 104, 89, -101, -72, 122, 70, -117, -53, 126, 40, -131, -25, 119, 17, -120, 5, 121, -16, -108, 30, 132]
3956A32j65q0J66N5j60n0J58M8j68k8J69J3j87J6J80j5j89M1J77m6j81N8J80p5
3980D9j70Q2J72r9j67J28J46j36j32J44J08j49r4J49R3j64q5J82L8j59k6J68J2
4003I0j69%J79k5j78L6J66n0j55O7J57p5j63R4J41r7j39J12J22j14j30J40J17
4026A26j53r8J52J01j68o6J58N8j67n4J83M1j91j3J72J4j83K5J66m1j65O4J50
4049A11p3j42P9J45r9j31J09J19j26r6J25R6j36q1J35P1j46n4J46M5j58j7J58
4072H0J7j55k6J78j0j72L0J66l7j69M8J65o2j60P4J51r2j33Q8J43j15j24J20J04
4096A09j32q5J44O8j45m9J38M8j52l8J64Pj45lJ50j0j60L0J36rj61N8J38n8j39
4121i6O6J43q0j38R3J39j12j30J19J21j34r3J31R8j52q2J51P6j61m9J48M5j57
$$ y = [132, -33, -113, 53, 108, -52, -102, 56, 104, -64, -92, 77, 90, -97, -81, 99, 84, -105, -64, 113, 67, -114, -56, 124, 49, -121, -39, 133, 34, -133, -5, 141, 5, -127, 17, 125, -24, -118, 31, 124, -40, -125, 57, 95, -64, -90, 78, 90, -79, -79, 100, 75, -103, -67, 99, 49, -106, -39, 118, 43, -120, -26, 115, 18, -121, -9, 113, -1, -131, 9, 126, -27, -125, 27, 128, -40, -106, 52, 110, -57, -111, 72, 113, -78, -91, 81, 95, -88, -63, 103, 62, -103, -39, 111, 38, -104, -25, 120, 21, -110, -1, 118, -8, -104, 21, 117, -19, -100, 35, 106, -40, -94, 52, 97, -61, -78, 80, 97, -58, -84, 94, 84, -88, -58, 108, 71, -98, -50, 115, 53, -107, -33, 118, 26, -107, -19, 124, 9, -115, 5, 109, -23, -108, 36, 104, -41, -90, 48, 96, -56, -94, 70, 77, -68, -71, 79, 69, -91, -61, 75, 66, -95, -37, 101, 43, -96, -30, 113, 33, -105, -12, 127, 15, -115, 4, 125, -9, -102, 29, 127, -25, -107, 44, 120, -41, -90, 58, 103, -54]
4144e4j9J54%j51J0J47k3j53M6J40n9j30P3J19q0j07Q2J10q9j01J02R0j22q6J24
4169B3Q7j32p6J38N9j40n0J44M4j61j5J51J4j58PJ59k0j52K7J51l9j55N7J38o4
4194C7j33Q2J29j00j17J07J09j16r5J30O9j18o2J15N2j32l7J37L2j44j0J33J1
4217G9j44J7J34k8j38K3J48m9j21L7J37n9j26P6J22r4j13R9J02j08r9J12J02j19
4241a0q5J30O1j42m1J44L0j46j3J35J6j38JJ33mj42L2J33l6j40N3J26o8j15P6
4266a0J11r4r5Q8Q6p9r3J03Q4j13q8J30O1j18n7J36M2j52k8J52J5j35j3J35Oj41
4292f7RJ38k4j33L2J32m7j33O7J16p3r9P2J01q1j04J15P1j08p1J14O3j20m9J12
4317C3M7j16l7J22K8j24j3J26kj36K0J39k7j29L1J23m2j20M8J32q6j01O5J23r0
$$ y = [-54, -73, 81, 81, -70, -60, 87, 64, -89, -43, 97, 38, -92, -19, 100, 20, -87, -5, 105, 16, -85, 17, 107, -15, -101, 23, 110, -22, -98, 40, 99, -41, -91, 53, 97, -64, -79, 72, 86, -72, -65, 94, 74, -78, -51, 100, 61, -94, -37, 101, 37, -96, -14, 115, 15, -102, 5, 114, -2, -97, 33, 102, -16, -78, 37, 89, -43, -80, 57, 89, -55, -65, 68, 79, -65, -48, 86, 58, -80, -57, 91, 42, -79, -42, 95, 36, -90, -14, 108, 14, -99, 0, 102, -6, -105, 7, 109, -10, -95, 35, 96, -46, -87, 57, 87, -59, -72, 63, 79, -59, -58, 75, 71, -71, -39, 94, 58, -82, -29, 97, 29, -86, -10, 101, 7, -88, 0, 86, 7, -86, 17, 101, -12, -100, 30, 91, -27, -84, 52, 94, -58, -86, 66, 81, -54, -67, 68, 74, -67, -58, 80, 56, -77, -45, 87, 40, -93, -26, 90, 17, -82, -10, 91, 10, -94, 21, 92, -16, -87, 27, 90, -30, -79, 33, 80, -36, -73, 49, 77, -47, -60, 66, 64, -72, -52, 87, 60, -69, -38, 85, 43, -77, -29, 103, 17, -84, -19, 104, 14]
4342A4j01Q8R1r6q7J18O9j08o0J04M8j14m2J27K6j20j4J11Rj19KJ18j5j06K0J13
4368G6l9j12M9J10n4j03N3J03o1j02Q5R2q8r1R9P1r6p7J14N1j00n2J17M3j24m2
4394g8J46Pj27%J25pj36K8J17l3j09M1J10n5j06O5J01p2q7P2Q3q7o7Q9N6q1o5
4421g0J01N5j05l8J04K7j13k8J16K0j18oJ18pj23J6J16j7j23L8J14l9j17N7J14
4446I2p4j00O6J06q4q7Q3R2j08o3Q9N8r1n1J16L1j10k1J07J1r7k3J03Oj08J2J13
4473F8l6r6K1J12k9j11N0J03n6j06O7R6o8r1Q3P6q6p6J00O7r7q0J15M8j12l3J17
4500D6K7j07l1J17J1j21J4J11j7j04J7R9j3j19M7Q8l9r6N0R1o6p9P6P8r0o3R2
4527A9N7r0n7R6M3r6l5J01K5r9j3J02J0j20KJ23qj20J8J15k7j15K8J06l9j01O1
$$ y = [14, -87, 1, 92, -4, -91, 27, 96, -12, -72, 32, 80, -34, -76, 51, 77, -43, -57, 54, 63, -56, -54, 64, 49, -57, -37, 76, 37, -75, -26, 84, 30, -73, -20, 83, 22, -80, 5, 97, 9, -82, 17, 88, -8, -85, 29, 80, -20, -72, 45, 88, -36, -78, 68, 75, -52, -52, 73, 66, -70, -42, 75, 42, -67, -26, 84, 29, -77, -12, 89, 17, -70, 2, 85, -2, -69, 20, 76, -5, -70, 31, 86, -19, -57, 47, 74, -39, -67, 49, 69, -49, -55, 63, 56, -67, -51, 65, 48, -75, -37, 77, 38, -79, -22, 92, 18, -82, -16, 90, 6, -81, 2, 94, -14, -77, 12, 70, -21, -72, 44, 75, -35, -56, 51, 62, -35, -58, 45, 51, -57, -45, 68, 32, -64, -43, 69, 40, -71, -21, 82, 26, -80, -13, 83, 15, -76, 7, 83, -3, -79, 21, 88, -9, -89, 26, 74, -38, -71, 46, 73, -34, -65, 52, 63, -58, -44, 67, 50, -54, -37, 62, 49, -70, -23, 65, 26, -70, -20, 71, 5, -74, 2, 80, -10, -73, 19, 76, -14, -71, 25, 68, -28, -63, 38, 63, -36, -49, 53, 63, -57, -55, 68, 60, -60, -42, 73, 46, -69, -41, 65, 26, -75, -14]
4554a4J03q5p7P3Q2p7p1P1O4q2n4Q4N1r3m5J05K8r4k7R1K8j02oJ06j6r8J9J02
4582F6k8j03L2J01m5q6M4R2n4q9O8Q3q6p4Q6Q0j04n7J01M9j03l3J00K9j09j7J00
4609D3Or2pJ10rr4J2R2k2r2K7Q8l1q6L8Q2m4p2M6P3o8o5O5O8q1n3Q9M8q7m9R4
4640B9L6j01k1R7J0r9jJ09oj05J1J06k9r7L1R5l5q4L9R3o5p9O2P9p4o0O3O3o8
4669an4P6L7o4n2Q1L8r6rP5L1r9qR2%r8J8Q6j4p8K4P6l0q9M0Q7n3p7N7P9o9q1
4701g5Q1N5o6n6P6N6r4l1P4M0r1k4Q3J5p9j8R6j3p5J1Q6j8q5J8P4k5p4L8P7m5
4731A1p9N9O1n3m9N9M6n5n6O9M8p6m4R5K9r2k0Q2J5q5oQ8Lr0mQ8kq9J7Q5k3q9
4763e7L9P7m5o0L4O7n2o2N7O0o0m8O3L9o4l6O9L4p7l0P9K5q7j3Q8jp0j7R4j5p1
$$ y = [-14, 89, 4, -73, 0, 82, 5, -66, 5, 69, -13, -67, 17, 68, -25, -70, 35, 63, -31, -58, 33, 61, -41, -47, 59, 43, -55, -36, 66, 38, -65, -33, 68, 23, -63, -19, 73, 19, -70, -2, 81, -5, -79, 7, 87, -17, -74, 27, 76, -27, -60, 40, 69, -40, -57, 43, 49, -43, -50, 60, 51, -43, -31, 61, 39, -53, -26, 62, 31, -55, -17, 65, 21, -51, -5, 68, 0, -65, 0, 68, -13, -66, 23, 71, -16, -65, 29, 65, -36, -57, 40, 50, -49, -50, 59, 53, -52, -41, 65, 36, -61, -30, 65, 30, -54, -15, 78, 13, -66, -4, 75, 1, -59, 4, 67, -1, -55, 21, 58, -6, -58, 23, 61, -35, -44, 31, 62, -37, -45, 47, 47, -51, -33, 53, 39, -39, -15, 61, 31, -58, -18, 69, 16, -61, -4, 75, 6, -75, 6, 61, -5, -61, 15, 71, -23, -54, 20, 60, -31, -55, 28, 43, -36, -54, 42, 29, -46, -35, 51, 33, -52, -34, 40, 15, -59, -21, 56, 11, -68, -9, 52, -1, -50, 9, 55, 0, -56, 13, 61, -15, -59, 36, 65, -27, -47, 35, 50, -35, -41, 47, 50, -40, -44, 44, 42, -47, -30, 55, 32, -57, -18, 59, 14, -46, -12, 55, 3, -59, -2, 58, -2, -50, 13, 52, -12, -48, 21, 55, -22, -52, 27, 52, -35, -48, 40, 39, -31, -48, 46, 31, -40]
4794d0LQ6k0q1L7O3k5p7M0P8o2o0O0M7m2n7O6N0p1m6O8K4n0m6Q4K6p6j7O6J2n9
4825a9k1P9lp4J9O5j7o9J7P4k8q1M8O1l9o2N2N0m8o2O8N3p4m4P5L2p0l0P7K0p9
4856c0oP7J7r2lP7j1p3K5P0j4p1J4P1k5n4K5N6m6m8L5N5n8k9M6L6l7n2N8L6o4
4887a5l1O3L9p8j1O7J2o5j4P1Kp1OO7j5p0K2P7l6n7K8O3n4m4M3N0n3l3M0N4p0
4918a3l0N6L2m9l4N8K6p3%N0K4o2qN0On9KN9qo6K2N7k2n9L0N6k9o3M1O4o1n2O7
4951A2N2p4l4N2M5p3j9O0K0o0pN0K4o6k0O9Ro0%N6rm9%N2j0o3K9N2j9n5L2M9l1
4984A4n9M9L7m4m4N9L1n5j9M6L5o9k6P7K0p5lO4%p3J1N1Oo4J7N6j4o2J7P4m4n2
5016c9L7M6k9o2N5L6m1l1M3K7n4k4N0L3n7j8N6Qn7oN9Rp5OP4k0n7PO8j9o8L6N8
$$ y = [-40, -37, 49, 29, -52, -15, 48, 23, -54, -14, 64, 2, -58, 2, 49, 7, -50, 16, 66, -5, -51, 17, 41, -9, -55, 29, 55, -21, -38, 28, 40, -19, -40, 39, 36, -38, -19, 46, 29, -40, -23, 51, 23, -58, -10, 51, 12, -50, 2, 52, 4, -58, 10, 63, -11, -55, 20, 52, -18, -48, 29, 49, -30, -36, 41, 58, -34, -37, 40, 29, -44, -19, 51, 37, -34, -20, 51, 26, -28, -3, 53, 7, -41, -6, 49, -9, -38, 8, 44, 7, -45, 13, 49, -15, -46, 17, 56, -22, -33, 34, 46, -19, -33, 38, 40, -31, -25, 42, 27, -43, -21, 56, 20, -37, -9, 54, 0, -44, -1, 49, -4, -37, 3, 57, -13, -43, 13, 45, -4, -38, 20, 46, -27, -27, 23, 47, -15, -23, 27, 33, -26, -24, 35, 27, -39, -17, 40, 18, -41, -11, 45, 16, -47, -6, 58, -3, -55, 12, 64, -10, -44, 8, 53, -20, -39, 21, 41, -19, -26, 24, 48, -18, -38, 31, 40, -20, -20, 36, 27, -22, -22, 30, 20, -43, -14, 38, 19, -36, -4, 45, 14, -45, 4, 41, -3, -47, 12, 43, -12, -31, 15, 50, -19, -45, 32, 52, -23, -26, 38, 38, -35, -24, 27, 33, -31, -14, 42, 28, -34, -17, 57, 13, -39, -2, 44, 15, -47, 8, 44, 3, -28, 15, 42, -12, -36, 14, 47, -10, -28, 28, 36, -21, -27, 32, 41, -34, -28, 46, 26, -31, -24, 44, 25, -43, -7, 51]
5049E1l0o3L6N5m1n9N5N1n4l8N7K8n1l9O1K9o6j6N8K3o9pN1J0n6oO0No7J3M5%
5081B6n2QO1k4n8L3N1k9n4L9M3m2m2M1L4l7l6N6L2o0k6N6K1o5j0O6on3pO7on9
5113c2KN8j1m1%O7k7m3J7N5l5n5M0L6j8m1K6M4l9l2L7K2l9l3N7J3m0k3N4Rn9J
5145c0N4Jm3j0O1rn8K0N4k5n7L7N0l6n1M2M2k6n2L7M3n4l6N7K4l5l4O2J3n9rN5
5177B8J6o9jN4J3o8jO5j2m8J3M1qn9L4L9l5l8J9M7k8l0K2M5m9k4M5K8n7k8N6L2
5209D2o7j2O9pn2LM9Pn6RN4j3n8J4N4k1m2J6M8k9l0J7N2l7m1M3K4l7k4K7L4m2
5241fj3L5K5n7j3N6J0n2j2N9nm7%M6Jn6J4O2k4m9K9M2l6m7M1M4m0l0L2K8m4l3
5273d0N1K0l4k2L7J8n9jN1Qm3nL5Ml6j0N5nn2PM9j4l8KN3j9m9L2L6k1m8M6K4l1
$$ y = [51, 21, -42, -6, 49, 8, -51, 4, 55, 1, -37, 20, 48, -3, -42, 19, 48, -18, -34, 24, 47, -22, -29, 22, 32, -24, -30, 30, 35, -32, -19, 26, 26, -26, -18, 43, 19, -39, -6, 45, 16, -38, 1, 44, 2, -40, 1, 35, -2, -38, 18, 50, -10, -36, 20, 41, -24, -34, 32, 26, -27, -34, 33, 27, -32, -30, 28, 17, -24, -24, 43, 16, -27, -10, 45, 10, -45, -5, 31, 13, -28, -2, 42, 3, -29, 8, 30, -9, -42, 15, 28, -12, -35, 19, 28, -31, -30, 24, 25, -18, -28, 33, 24, -34, -14, 40, 15, -42, -5, 45, 9, -42, 0, 42, 16, -36, 1, 44, -10, -46, 11, 35, 0, -34, 28, 41, -18, -27, 28, 44, -25, -26, 28, 41, -27, -28, 37, 25, -23, -10, 31, 23, -36, -2, 37, 2, -36, -17, 30, 2, -28, -6, 39, -10, -34, 11, 39, -18, -46, 10, 42, -25, -37, 32, 25, -27, -24, 25, 32, -24, -15, 39, 26, -32, -18, 36, 15, -27, -11, 37, 8, -22, -5, 47, 10, -31, 12, 36, -1, -25, 2, 36, -6, -19, 16, 41, -16, -29, 27, 37, -15, -27, 32, 27, -20, -20, 26, 27, -29, -15, 47, 23, -26, 3, 45, 9, -38, 3, 47, 7, -23, 9, 37, -7, -40, 11, 31, -3, -25, 12, 30, -29, -30, 21, 29, -14, -19, 16, 20, -16, -26, 29, 24, -28, -21, 28, 14, -24, -22, 31, 12, -37, -5, 31, 10, -38, 8, 32, 1]
5307Am1M6L9m8k5M8J3n2j4O1Om1k3N5%m8MM5nm9QN1k2l6J3M9l2l0L1K6k1l9K4
5340fM2l1l2K9L4l4l0M1K1n0k1N7J1m3j3M7Po5QN6mn4J6M4j3m7J4N5k5m8K8M3
5372C7k9m1L3K9l4k8M0K0l1l0M3K4n1j1M7J5m5j0M3J4n2jN1pm2NL9j8m0J7M4j5
5404A6l8L2L2l7m2L8L3l7k4L5K5m5k4M4K1m3j6M6J0m4rN2%m0j2M2J0m6OM2ql6
5436a7J2K6lm2PM7j6l6K2L0k6k8K9K7l0j7J8L2m0k7L9K3m5nM1J0l9pM1%l6kM0
5469B8nn2K5L3k7j9J8L7k8m2L6L8m1k0J6L5k9l4M4J5k8j9L5Ql5j0L2Lk7pL6Om0
5502a8OM2j6m2J7L9j2m2K8L9k8k8J9K4k2l2L0L5m1l0M5K7n0j4L4K1m1j6N3mm3
5533b0rM1J0m3KM4ol5QL2j0k9K0J7j3l6K3L1j6l8J5L7l5k0L3L5m1k6M9J6m0j0
$$ y = [1, -40, 6, 45, -3, -28, 20, 33, -19, -33, 28, 34, -7, -30, 25, 25, -23, -19, 26, 21, -28, -20, 31, 9, -27, -14, 35, 3, -27, 4, 30, 9, -30, -6, 36, 5, -27, 2, 36, 2, -28, 13, 34, -16, -37, 20, 31, -12, -25, 22, 29, -36, -28, 28, 24, -30, -14, 30, 17, -30, -16, 39, 14, -34, -6, 37, 8, -33, 0, 29, -5, -33, 7, 27, -4, -34, 9, 33, -18, -29, 18, 33, -12, -22, 21, 35, -17, -18, 33, 26, -16, -11, 28, 10, -30, -13, 31, 16, -22, 10, 42, 5, -37, 1, 34, -3, -27, 8, 33, -12, -36, 8, 29, -14, -30, 16, 26, -18, -27, 25, 25, -15, -27, 15, 25, -21, -15, 27, 19, -17, -5, 21, 18, -24, -17, 30, 14, -22, 0, 30, 4, -24, 5, 32, 2, -15, 3, 35, -5, -32, 7, 30, -15, -20, 21, 31, -8, -15, 26, 26, -10, -12, 28, 23, -29, -4, 29, 2, -17, 1, 38, 10, -32, 4, 42, 1, -19, -3, 32, 3, -31, 13, 28, 0, -19, 16, 24, -11, -21, 11, 14, -13, -20, 16, 22, -18, -12, 30, 14, -28, -11, 28, 16, -26, 2, 41, 13, -15, 4, 28, 6, -26, 4, 39, -2, -32, 13, 40, -10, -24, 10, 31, -10, -26, 27, 23, -20, -29, 12, 22, -21, -19, 25, 19, -16, -8, 24, 14, -15, 5, 22, 9, -27, -4, 27, 11, -27, -12, 25, -10, -30, 3, 38, -3, -29, 20, 36, -4, -14]
5565a4L0Pm2JL7Qm7%L8Km6J6M1j2l8J1M0j8m3J7L8k5l1J9M8l9j5J2L8l7k1L6J4
5598B5k9k6L6J2l0mL3J3n4J6K0jl5ML2jm0J5L5pm4J1M6k1l6J7L4k1k7K5K0k9j2
5631b3K4K5m2oM2J1l9j6M1Qk8j6L8Rn0PK5J5n1K0K1jl5J1N2l4k5J5K3ol8K5K5
5664B7k4l7M5L1m4j7M0J4m0j6N2ok6rL2Lm1JM0ql3J0L5qm1K1J9k0j7J5J5ql1K7
5698AL3l4k8L2K6l7k5M2K9m3j5L4J3m4j3M8lk7NM2j1m1J8K8j5l3J3M3m1j9L2J7
5730B7k9j5J8K4j5l8L0J7k9j0K9K1m5qM1j0j9j3L8Ll3PK9ml5QL1ml5J1M0k8k7
5763b3K2L2l0k2K6K0k8k0J9K7l0j3K6J9l8j2L7J3l7JK1J4l9LK7ok0oL7kl2%M3
5796B9k8k3J9J9rl1K6K3k6k7M1J5l7j4K3K5l2kK6Kk8mK9Pl4LL0lm2QL6j6k9J5
$$ y = [-14, 16, 23, -19, -18, 19, 27, -20, -20, 18, 20, -26, -10, 31, 19, -19, -8, 32, 14, -29, -12, 26, 1, -30, -11, 37, -2, -17, -5, 33, -4, -25, 11, 25, -4, -30, 6, 18, -12, -16, 17, 30, -24, -8, 12, 11, -24, -20, 12, 11, -29, -14, 21, 14, -30, -19, 27, 6, -30, -13, 21, 0, -27, -2, 18, -11, -23, 1, 26, -16, -22, 20, 31, -8, -24, 17, 25, -3, -19, 19, 28, -22, -15, 10, 25, -26, -6, 15, 14, -21, -10, 42, 8, -17, -2, 21, 15, -23, 2, 27, 3, -34, 11, 42, -2, -19, 21, 35, -5, -21, 31, 25, -1, -10, 22, 25, -16, -15, 25, 17, -16, -6, 29, 21, -20, 1, 20, 0, -17, -2, 13, 5, -26, 1, 34, 0, -28, 4, 30, -7, -32, 10, 39, -4, -19, 15, 28, -16, -29, 19, 16, -11, -6, 36, 25, -16, 2, 30, 15, -18, -5, 38, -3, -22, 10, 27, -2, -17, 1, 25, 10, -28, 2, 19, -10, -20, 9, 30, -15, -23, 18, 8, -11, -24, 14, 17, -16, -9, 20, 16, -19, -11, 20, 16, -19, -8, 32, 4, -23, -1, 31, 1, -21, 5, 25, -3, -23, -4, 23, -7, -20, 6, 25, -13, -25, 12, 25, -12, -11, 10, 24, -15, -12, 15, 9, -11, -17, 20, 18, -14, -14, 29, 1, -22, -3, 16, 7, -24, 2, 25, -1, -28, 13, 28, -9, -23, 0, 25, -7, -9, 17, 19, -9, -13, 16, 23, -11, -8, 22, 19, -23, -15, 21, 5, -24, -9]
5830iM2k3l2K0K9k7j8K0K6l0k6L0J9j9k3K5K2l7qL0Pl3JK6Ol3JL4jm0J4K8ol6
5864b1J1J6mk3J3K9k1k9N0Rl9j3K1K5k9oJ4J0k5pL8Jl1nK8%j9RK1j0k3%L0ol1
5899a7KK8kl2K0K6k1l1K6J7l0mJ9J5j6j9J8J9l1oK9Ok6LK0Om2PK5mk3NL4j2k4
5934a5%M0k2j9K2J8j4k3jK7j0j8J7Kj1j0J3K0k1j1K8J0l2qL7%l3ML5j9j3kL2j1
5968A2l1LM1j3l9K7J5pk8L5Nk7j4K3J9k5k0K9Ql0kK8J6m2MK7Jl0J1J9Mk1j7L3
6002A4Nk8KK5j4rKJ8qk0PK8k2k3K7K4k9j6K0K2l5oK7Jk2oM3j2k3jK0Kk4QK9j1
6038A5l1J6J6j0l1J6J8kl0J6K5j3j2J5K1k7j3K2Pk0qJ8Qj9oK3Nl4kJ7Mk6J0K9
6072A7j7k3J0L8j8k4J6K0k2k0K8Mj1rJ9J3j7k2K5Rk1lK9j7k0oK7Lj6%J6Pk5jK7
$$ y = [-9, 33, 10, -22, -2, 27, 0, -18, 2, 28, -2, -28, 2, 21, 2, -21, 4, 26, -11, -19, 11, 18, -15, -14, 12, 18, -15, -14, 20, 19, -21, -7, 21, 15, -21, -10, 6, 2, -21, -8, 21, 0, -29, 21, 30, -9, -22, -1, 24, -5, -11, 3, 13, -12, -19, 19, 20, -11, -16, 12, 12, -7, 2, 23, 13, -10, -10, 20, 14, -17, -15, 13, 11, -21, -1, 25, 4, -27, -1, 16, -14, -18, 1, 16, 0, -19, -1, 18, -13, -19, 10, 16, -10, -7, 13, 19, -23, -16, 9, 5, -18, -13, 21, 9, -15, -15, 25, 3, -16, 6, 24, 10, -13, -14, 13, 3, -15, 2, 4, -7, -17, -4, 16, -5, -16, 12, 22, -10, -18, 19, 19, -14, -10, 25, 6, -7, -9, 23, 12, -19, -16, 25, 12, -27, 0, 15, 8, -20, 15, 20, -7, -21, 2, 21, -4, -24, 5, 13, -17, -19, 9, 25, -17, -13, 14, 15, -15, -4, 15, 19, -2, -19, 14, 19, -9, -7, 18, 4, -5, -3, 15, 7, -13, -6, 22, 0, -23, 4, 28, -1, -17, 3, 25, -10, -16, 11, 12, -10, -16, 27, 15, -8, -9, 11, 13, -11, -3, 26, 15, -16, 0, 16, 6, -25, -9, 9, 7, -23, -7, 18, 5, -7, 8, 29, 2, -11, 11, 18, -2, -10, 8, 16, -3, -9, 14, 19, -15, -17, 0, 4, -22, -12, 17, 0, -23, -13, 25, 7, -17, -1, 19, -3, -23, 5, 9, -2, -11, 8, 21, 4, -18, 7, 16, -5, -8, 21, 4, -16, -22, 5, 8, -8, -8, 8, 15, -10, -11, 16]
6107A6%k5OK4rl0K4J5rk9J7K4k3j8K3J3k5j4K6K2k8j6K6Qk4lK7j4j1%L3k4j1l
6141a2K2J3l9J5J6ml3J3K3%l4J2K3rk4J7J6j2k1K2J3k6mK5%j6rL0Jk9KOJ9l7J1
6176a0L3j5j1kJ8jl6J9K8l0j9L0J0rj9J6J9l5kJ2K2k8JK5Jk7JJ8lj9NK2Ql0rK8
6212A1mj7nL5j9j7ML3qk2RK3j8j2J1J7l0nJ5K3l1j5L3Ok4nK6%l4KL3kj8nK7kk8
6249a3QJ7lj8J5J1j2j9J2L1k8j3QK2j2k6L0J0l1LK0%j5k5M5ml1kL0qj0lK3Jk7
6284a4J2J7j0j7QJ9Jl1K1J0ml0J8J8j7j0K1Pk0j0J9J9l0j6K3J0k3pL1Ll5jL3j4
6318Aj3JK6qk5J6K1k1j2J6K3k5k8K9J9j9j1J4K4l0rK1J6l8oK9Pk8RJ5Rl1RL1k3
6353Ij2mK0Ll0J3J1Jk2OK3j2k7K8J3k2j3J8J9l1rL1Qk5rK3Nk7NL2j1k7kL4j3j6
$$ y = [16, 16, -9, -3, 21, 12, -18, 6, 21, 12, -17, 0, 24, 1, -17, 6, 19, -6, -20, 6, 28, 0, -16, 10, 18, -6, -9, 18, 4, -7, -7, 26, 2, -9, -12, 10, 23, -16, -1, 15, 11, -22, -9, 14, 14, -20, -8, 15, 6, -18, -1, 15, 3, -18, 4, 17, -9, -13, 12, 12, -4, -13, 17, 18, -11, -9, -3, 16, -21, -10, 23, 8, -3, -5, 13, 12, -24, -5, 23, -7, -26, 4, 14, 5, -14, 2, 21, -14, -16, -4, 18, -10, -9, 16, 17, -10, -9, 9, 6, -13, -8, 14, 22, -8, -17, 11, 7, -10, -15, 20, 1, -16, -12, 21, 13, -9, 0, 23, 5, -7, 4, 21, -9, -14, 1, 24, -7, -22, 11, 17, -7, -12, 14, 14, -20, -18, 15, 13, -5, -10, 17, 15, -13, -5, 12, 9, -9, 6, 17, 5, -14, -2, 29, 1, -12, -4, 18, 6, -20, 10, 20, -11, -8, 12, 12, -3, -28, 17, 13, -18, -20, 10, 2, -8, -11, 12, 13, -14, -2, 15, 5, -12, -4, 15, 16, -15, 6, 16, 12, -18, 0, 18, 1, -9, 12, 19, -1, -11, 8, 27, -3, -19, 4, 14, -9, -16, 15, 18, -17, -18, 15, 1, -12, -11, 15, 7, -18, -2, 19, -2, -14, 2, 25, 0, -28, 1, 20, 1, -10, 4, 28, -2, -11, 10, 26, -12, -18, 11, 18, -10, -1, 14, 23, -8, 1, 32, 9, -3, -7, 13, 16, -14, -1, 10, 11, -11, -5, 18, 6, -21, 7, 20, -2, -15, 3, 22, -9, -18, 13, 21, -4, -13, 10, 15, -12, -7, 25, 14, -13, -15, 19, 6, -10]
6389a0J4QMl9J3J8pj7K8J6k2k5J5K2k3k3L2J3l1rK2J0j7j3L0kj8OK0pk4LL2mk7
6424a2QJ7qk4J6K0k2jPJ0j1j7K5Qk1j5K2Lk0JK5ok1qL5J2m4KK9Lk5jK2Jk4lL6
6461A9rk5OK9j4j9J5J5j1k6J7J8j3k0K3J4k7oJ2J6k8nK4Pk5j2M0jl5PK5kk8J6
6495cK2pk8J3K3j5k2J5K1k5j8J6K8l3mK1J5k9rK2K2l0JJ3J1k8%K1kk2JL0j2k1
6529a3J2Qmk7J6K2rk6K1J6j2j8K0J8k8j5K4K4k9j5K4Pj6j7L7lj7j5L2Kk6%K3j8
6563bj3J1J6rj8OK4j0k3J5K2j0k9J1K6k9oJ9K3l2qK5Oj7j6L1Kk4OJ2Ml2J1K4r
6598Gj7j1K8%l7K3K0j0k2K2J9k0k6K7J7k9JLJ9k0j2K6Rk3rK7%k1rM3j6k2JK8M
6633B0l3PK5j0l0K0J7j7j2J0J6j1k0J6K8k3k5K2J1k3jK7Jj6oK3pj7KJ5J1k9OL0
$$ y = [-10, 4, 12, 16, -23, -10, 8, 1, -16, 12, 28, 6, -19, -4, 18, -5, -28, 4, 17, -14, -23, -1, 9, -8, -21, 9, 7, -11, -5, 15, 8, -16, -13, 19, 15, -12, -4, 13, 5, -19, -3, 17, -5, -6, 1, 11, 0, -17, 8, 16, -5, -20, 2, 5, -15, -14, 11, 5, -16, -24, 11, 23, -21, -19, 10, 13, -12, -13, 9, 10, -14, -17, 19, 10, -15, -9, 20, 6, -13, 2, 17, 6, -20, -3, 15, 2, -18, 5, 19, -8, -14, -2, 14, -14, -19, 5, 12, -13, -25, 15, 14, -21, -14, 11, 9, -19, -3, 19, 12, -16, -3, 20, 5, -17, -2, 19, -6, -24, -8, 20, -13, -17, 4, 19, -10, -19, 3, 25, -5, -4, 9, 20, -8, -8, 13, 11, -11, -10, 20, 8, -13, -1, 7, 3, -24, -8, 14, 5, -21, 0, 16, 4, -14, 6, 24, -4, -19, 5, 29, 0, -15, 9, 16, 0, -17, 20, 17, 0, -15, 17, 19, -7, -7, 16, -2, -15, -4, 12, 3, -15, -9, 15, 5, -18, -3, 19, 9, -20, -9, 17, -12, -18, 1, 24, -8, -16, 9, 15, -2, -18, 13, 15, -9, -3, 9, 13, -19, -8, 16, 7, -10, -21, 7, 7, -30, -7, 13, 3, -19, 3, 22, 2, -24, 3, 20, -9, -8, -5, 14, -6, -18, 8, 17, -6, -15, 12, 12, -9, -18, 25, 9, -13, -12, 16, 20, -13, -6, 19, 9, -21, -1, 16, -1, -13, -3, 13, 2, -18, -2, 26, 3, -22, 0, 11, -12, -13, 14, 15, -1, -7, 16, 9, -8, -6, 9, 20, -9, -3, 27]
6667B7j3k6mK6J0k8J2J3j0k4J3L0j7l1K0J5j9oJ9J6k8lJ7J2k9nJ9J6k8k0M4kk3
6700gkK3Kl8J4L2rl9K8J5nl5K6K0k3j5J1K2j3k1J6J6j8j1K5Kk2pK6Jj8qK3Kk4
6735a1JJ9J1l2JJ6Kk6J3K6j4l4K3K9k1k0K9J3k8j4K4J3j6j3J2J3k3pL0nk7%J8
6768BJ3l0%L6Pm0J1ORk1RK3pk9J5K0k3j9K4K6k6j7K2K0l3j9K5J4k3rL6jk6mK3
6803A4Nl3NK3Kk6JK4j0j6kL0lk9J7K6l0j4K0J1j4j5J7J5l0mK1J0j5j8L3Jj8kK7
6838B3Rm4KK2Pk9PK3qk4QL1rm0K0K0j0l7J7M3k6k8K6J2k0j1J6K8l1j5K5J8k5j5
6872a5K2J7l2rL8ll5jM5j3l0J3L3k0k7J5J6ll4J2K3j0j6K3J2l1j0K7J9l0j1J7
6904BK0k9j2L2Ok6j1L5Jl2J0J7qk7J6L0j4k1JK3%k2J2J%k8K6J0j3k0K5K0k6j1
$$ y = [27, 14, -12, -16, 10, 20, -8, 4, 17, 7, -17, -4, 26, 9, -22, -2, 13, -6, -12, 7, 23, -5, -8, 9, 21, -8, -13, 6, 22, -6, -26, 18, 16, -7, -9, 14, 16, -22, -8, 24, 15, -24, 4, 19, 14, -21, 5, 25, 2, -13, -2, 20, 7, -14, 2, 18, 0, -11, 14, 16, -6, -13, 13, 14, -4, -12, 11, 13, -11, -10, 9, 20, -12, -11, 5, 7, -19, -6, 20, 6, -28, -5, 24, 3, -17, 12, 25, -3, -17, 7, 20, 4, -9, 3, 16, -7, -14, 16, 11, -16, -16, 2, 15, -15, -15, 21, 28, -12, -1, 5, 14, -7, 2, 25, 18, -11, 4, 24, 1, -18, 6, 32, 6, -11, 11, 31, -2, -21, 4, 18, -5, -14, 22, 21, -5, -9, 14, 19, -14, -9, 14, 16, -10, -9, 15, 5, -11, -13, 17, 14, -15, 2, 28, -2, -16, 4, 15, 1, -14, 3, 18, -12, -16, 5, 15, 0, -18, 15, 16, -2, -4, 23, 32, -12, -10, 12, 19, -10, -3, 20, 12, -12, -4, 27, 18, -22, -2, 18, 8, -29, -12, 31, 5, -23, 3, 15, -5, -16, 0, 28, -3, -18, 7, 25, 0, -15, 7, 24, -8, -17, 21, 18, -17, -18, 27, 14, -16, -3, 30, 10, -17, -2, 14, 11, -23, -11, 12, 2, -14, 9, 21, -10, -20, 7, 26, -4, -15, 2, 22, -7, -19, 13, 19, -7, -18, 17, 18, -14, -4, 13, 5, -22, -6, 24, 10, -11, -10, 13, 13, -9, 3, 4, 4, -24, 2, 12, -1, -21, 4, 24, -2, -13]
6938a3K1Qk6k1L0J0k1nK1J0l4%L3ok7J5K6j5k4JL9j0k2MK1qk1PK5j8j7J4K2l0
6972a1JJ0J2k2j6L2Rk7qL3%l6JL9Ll0LK8ol7J5L1j7k7K1J8j4k6K1K8l2j0J3K0
7006A9k9k1L6J8l4oK1J7l5oK9Pl5oK8Nl1QK6pk1J4J6ll4%M0mk8J2K6k3k2K0K2
7041A9j9j6K3J0k2nJ9J5l4pK7%j9mM1j9k0nK9Qm4J2L8k8j7QK3ok8J5K2k8pK5K5
7076C1k1k6L2Rl1j4L5Jk4jK6Lk7JK1Rm0J1L0j1l4J0K9j2j8QK3j7k9J5L0k5j2J8
7110@K9k1k6L7Ql2k5L7J6j4k7K8Mk4LK3Pl5lK9Jl3KM3rk8KK5ol2J8J8k9pJ2L3
7146B4k9j5J5K3l2J2K4Ll8kK2J5l6KK1J3l2nL3j3j9RK6j1k2J1K4j4k6QL3k5k0
7179b1K0K6j6l1K3J4k4qL0%k3j1L1J1l5LK7oj7KJ8Nk1nL2j5k4J5L2l1k2J4L9k5
$$ y = [-13, 8, 16, -10, -31, -1, 9, -12, -17, 4, 14, -20, -20, 13, 7, -20, -5, 21, 6, -18, -17, 22, 12, -10, -6, 15, 7, -14, -7, 18, 0, -17, -3, 19, -11, -10, 0, 12, -10, -26, 6, 15, -12, -20, 13, 13, -23, -22, 17, 20, -10, -7, 21, 15, -22, -7, 24, 7, -20, 1, 19, 5, -21, 0, 28, -4, -14, -1, 19, -10, -31, 5, 23, -11, -17, 4, 21, -14, -20, 9, 16, -19, -25, 3, 8, -23, -15, 11, 4, -17, -3, 13, 10, -24, -24, 16, 12, -16, -4, 22, -1, -23, -3, 19, 0, -16, 7, 17, -5, -10, 9, 24, -10, -17, 10, 10, -9, -13, 28, 9, -11, -16, 13, 21, -23, -11, 27, -1, -18, -10, 13, 7, -21, -6, 16, -12, -19, 6, 31, 10, -16, 16, 25, -6, -20, 15, 16, -8, -9, 17, 20, -7, -6, 15, 24, -16, -5, 25, 14, -20, -10, 19, 7, -11, -3, 20, 3, -26, -11, 19, -6, -18, 0, 29, 8, -18, 19, 27, -5, -30, 7, 23, 9, -18, 10, 14, -10, -7, 16, 23, -12, -15, 14, 15, -18, -16, 27, 18, -10, -8, 17, 11, -21, -3, 15, -14, -21, -9, 24, -5, -20, -5, 18, -14, -2, 22, 25, -13, -15, 7, 22, -14, -12, 9, 22, -10, -15, 18, 5, -14, -5, 21, 10, -12, -1, 23, 9, -17, -9, 24, -1, -21, -1, 25, 9, -22, 1, 15, -9, -17, 13, 13, -10, -21, 10, 21, -14, -11, 16, 10, -7, -5, 13, 18, -3, -8, 24, 9, -15, 0, 32, 1, -21, -7, 32, 7]
7213Gj5MK5k4j2K5J0k1j3K2J0j8j4K2Pk2j6L3Ok6jL0Kl8K1K2j4l5K1J0mj5PK0
7247A6qk2J9K2l1k5L2J6j9j7K6J4l3mJ7K4l8pK0J2l0J1J8Ml1j3L9kl0J7K7k3k1
7280b0RL6k1j6MK8l1j0J5K2k2j5J9K1k8j2L0J0k8j1K6Lk6NL0j8j8OK6lk2J0J6
7313A5ml0K4J6j6l3K8J4k1j0K1J7k6rK3Qol1L3Rk2j6L1J1l0KOQk1mL1ol0LL4j0
7349Il3J5K9j5k7K3J5j0k1QK5j4k3K2L0l6j3K4Kj7j2L5Ll0j3L8Jk7mL7nl6RK9
7383A8rj8MK2jl6L0Oj5j9J9J7j6l1K8J6k6j3L5Oj9j9K3Rk3mL6ol1J1J8Nm5J0L6
7418A8j5k1J3K1kl4J1K9j6k9K2K9j6l5K7J2k2pJ0J4j6j8L9Nk8rK4Mk6j1L0J8k6
7451ej1K9jl1J0K5ml3K0K0pk7K5J0k6j3L0J3k0j9J2K6j6l3M0J0l2j0L2J1l5qL9
$$ y = [7, -8, -4, 21, -3, -15, 10, 20, -1, -14, 8, 18, 0, -14, 8, 15, -7, -23, 10, 16, -10, -11, 19, 21, -17, 4, 26, 12, -23, -2, 8, 4, -11, -4, 16, 8, -14, 5, 27, -4, -29, 3, 19, 0, -17, 9, 23, -10, -14, 3, 27, -11, -18, 2, 14, -16, -5, 13, 17, -14, -27, 12, 10, -20, -3, 24, 1, -20, -11, 25, 4, -12, -8, 20, -11, -21, -6, 16, -6, -21, -2, 19, -9, -21, 9, 19, -9, -20, 6, 9, -17, -12, 18, 0, -18, -12, 14, 11, -11, -1, 15, 11, -19, 5, 21, 5, -28, 0, 14, -7, -17, 4, 21, -5, -14, 9, 17, 11, -20, 13, 22, 0, -16, 15, 26, -4, -2, 4, 12, -9, -13, 18, 12, -18, -15, 19, 9, -24, -9, 20, 5, -22, 1, 16, 6, -15, -7, 18, 4, -19, 3, 33, -3, -16, 8, 10, -7, -19, 16, 19, -11, -24, 14, 15, -12, -16, 21, 16, -20, -11, 18, 9, -9, -5, 17, 16, -20, 10, 16, 1, -18, 1, 18, 2, -29, -1, 15, -11, -24, 11, 17, -2, -21, 2, 11, -12, -16, 20, 14, -17, -6, 12, 17, -28, -18, 18, 3, -18, -5, 16, 14, -20, -9, 20, 4, -25, -3, 26, 10, -25, 2, 14, -8, -15, -5, 9, -7, -25, 14, 19, -9, -18, 6, 10, -16, -27, 3, 21, -5, -16, 13, 12, -19, -9, 16, 12, -21, -1, 19, 12, -15, 10, 20, -6, -19, 11, 24, 4, -15, -3, 23, 7, -26, 14, 24, -8, -18, 14, 25, -10, -18, 21]
7484B1jk7jK4J5m1LK4pl0RL0rk0RL1k2j7QK1j7j3J5J5k3rK4Jj8k4L7Rl1NJ3Jj9
7521a4lL4jl0JL0k2j3RK3j1k2J5K6j2l3K4K1k0l2K5L4m0j2J7K1j5k0L2rj5oK0
7554BJ4k5jJ2Rl3MK7qj4oL0j5k3J4L4k0j8J2K5k2k3J7K8k0j4K9Kk7oK8Pj8j0K9
7589B0km0J2K7Ll1lL0Ll8LK8j2k0K0J9k5j5J8J7j7j5QK8j9j9K5J3k9kJ8J4k3%
7623dJ8Qk6KJ6J1l0j2L1Pm1J0K7j9j4OL1j4l0K3K4j7l1K1K5l7NJ0J6k5j6L0J6
7656B1j5j7K3Lj7k3L1Jk3LL2j3j4LJ3Ml9K2L0k4j5RK4j4l0K2K7l2k1L4K3l4j8
7689b4K9Nk6OK1rk5%L3Ql0mL4jl3OK3Kk9J6J7j8j1OK7rl7L6J6l2j4K4Qk4j8L1
7725DJ5k6j8K5K1l4j0L4Lk6j1K5K0l7NJ9%j9LL0k2j3J2K8k2k5J7K8k5k3K2K1k8
$$ y = [21, 20, -7, -8, 16, 31, -10, -7, 17, 10, -20, -11, 19, 10, -10, -1, 30, 8, -9, -1, 20, 3, -10, 5, 20, -3, -12, 12, 13, -5, -29, 8, 17, -14, -9, 4, 5, -14, -17, 17, 16, -14, -13, 17, -5, -18, -9, 14, 3, -19, -4, 22, 10, -23, 1, 22, 2, -30, -5, 29, -11, -23, -6, 15, 0, -20, 12, 3, -12, -18, 2, 16, -9, -10, 2, 11, -22, -18, 9, 1, -13, -19, 11, -4, -27, -13, 21, 1, -17, -5, 20, -2, -25, -8, 20, 0, -14, 15, 17, -10, -16, 12, 19, 1, -9, 20, 18, -22, -10, 17, 20, -11, -14, 16, 19, -19, -16, 12, 0, -20, 0, 19, -6, -21, -3, 14, -3, -18, -10, 18, -1, -20, 5, 18, -11, -13, 5, 19, -4, -4, 14, 22, -4, -2, 14, 25, -5, -17, 14, 21, -20, -10, 17, -2, -16, -10, 21, 7, -23, 0, 24, 7, -24, -3, 22, -15, -10, 0, 16, -9, -25, 5, 21, 6, -11, 12, 15, -2, -25, 6, 7, -16, -13, 19, 6, -8, -5, 8, 12, -27, -5, 25, 1, -14, -5, 19, 5, -25, -3, 24, -8, -29, 5, 28, -6, -24, 5, 10, -16, -10, 11, 2, -23, -23, 10, 18, -12, -16, 18, 17, -16, -10, 13, 15, -14, 2, 19, 1, -10, -4, 23, 14, -23, 13, 29, -3, -17, 7, 15, -9, -27, 4, 19, -7, -25, 0, 21, -13, -23, 11, 14, -12, -23, 2, 22, -15, -10, 9, 9, -10, -7, 23, 1, -12, 0, 28, 6, -19, -2, 26, 1, -22, 0, 21, -7]
7758gj2K6K3l9kK5Kk6lL2nk0nK2%k3jK0Ql0PJ9%k5J1K3j9k6K9Onj3RJ9k0k2L0
7795HJ0k3j9L2J4l5%K3Ok8nK5Kk6JK2Kl1jL4j2k1J9K9k1k5J7K1rk8K0J4j7j2K2
7830HQj4j9K5J3k7pK4Qk7LJ4Pk7NJ7Kk6LK7ok9J3J6lk6J8J7k2j9J8J5j2nKK7k4
7867cj0K1J0j7qK0Jj9OJ5Kl0J1J8%l2nL9j2k6PL0qk4QK8j1l2K1K0k9nJ5K3l3j3
7903b2K6Nk9OJ6K5m2jL8ok6KK2J2l3%K6oj9QJ8j3k6J3K9ql9J9K5j6k0J5K5k8j5
7938a9K0J8k3j7K4Koj3K7Nk2KJ3Mk2mL4nk4oK6mj9KK0lk7J4J8j1k0J4Rj8jJ3J7
7975A8k7j3K6J1k7jK7%k8JK2%j7pK6jj7PJ5kj8oK6qk6RK7j5j4J5J3j6j7J6J5k2
8011hj2J9J9k3j3K6Kj1j6K8oj9RJ4Nj7rJ6Ok0j0L6j2k8K0J9pj3J0J0j1j8J9J3
$$ y = [-7, -19, 7, 30, -9, -11, 14, 16, -10, -13, 19, 14, -6, -11, 11, 11, -12, -13, 7, 15, -15, -8, 11, 11, -14, -3, 20, 1, -25, 4, 10, 5, -8, 1, 20, 0, -22, 8, 18, -5, -24, 8, 22, -13, -13, 10, 16, -12, -17, 8, 10, -16, -15, 7, 9, -22, -23, 11, -1, -22, -3, 26, 5, -20, -3, 18, 9, -19, 1, 15, -2, -14, 8, 16, 2, -17, 8, 21, -6, -13, 11, 19, -8, -5, 9, 16, -11, -6, 11, 13, -13, -10, 17, 11, -18, -5, 11, 8, -18, 0, 17, -5, -24, -6, 9, -3, -8, -6, 21, -3, -13, 8, 18, 1, -7, 13, 14, -5, 1, 16, 18, -12, -1, 17, 17, -15, -20, 19, 7, -19, -12, 18, 10, -14, -6, 22, 11, -21, 0, 20, -9, -14, 1, 24, -9, -22, 4, 9, -20, -14, 2, 27, -15, -16, 22, 16, -10, -8, 14, 26, -7, -7, 19, 13, -6, 2, 20, 7, -19, -6, 23, 15, -24, -5, 20, 4, -16, -1, 24, -4, -19, 1, 19, -4, -21, 3, 5, -1, -14, 13, 18, -4, -2, 11, 15, -7, -11, 23, 18, -6, -12, 14, 10, -9, -7, 13, 10, -17, -3, 15, 4, -16, -2, 7, -11, -12, 1, 18, -9, -22, 4, 15, -12, -13, 14, 14, -14, -13, 9, 9, -8, -15, 11, 10, -7, 0, 15, 13, -5, -11, 15, 7, -19, -10, 17, 2, -12, 3, 16, 0, -17, -1, 14, -8, -20, -1, 18, -5, -18, 8, 10, -1, -17, 11, 5, -14, -5, 9, 14, -3, -12, 4, 10, -10, -20, 16, 4, -24, -4, 15, 8, -5, 5, 15, 4, -14, 5, 18]
8045A8k3rJ7J2k3pK5nj3j2L2oj8LK4qk2pM1qk0RJ3Ll2RK6j5j9PK6j9j5J3K3j8
8081Bk1L5jk0pJ2J1j5j6L3Jk1lK5pl1K1J4Jk5mL1pk5J1L6k2k9K5Jnj5J3K8k1k4
8117a9K4Pj2rJ8Nj9nK5jk0LJ2J1k4pK5Nl5RJ4%j2pK9l0lJ5K0k1k7L2J5k1j4K4
8153GJ2j9j4K3J3k9k0L9Kk9MK6mj5j1K3Pk4jL0j5j8J2J2rj7J6J9j8j6MJ8k1%J4
8188AJ3j1k7
$$ y = [18, -5, -14, 3, 15, -8, -15, 10, 5, -8, -20, 12, 6, -12, -9, 15, 7, -15, -22, 19, 11, -9, 0, 13, 16, -16, -7, 19, 4, -15, -8, 18, -1, -16, -3, 20, 2, -19, 16, 15, -5, -12, 0, 11, -4, -20, 13, 14, -7, -10, 15, 8, -23, -2, 12, 13, -12, -16, 15, 8, -17, -6, 30, 8, -21, 4, 5, 0, -15, -2, 26, 5, -19, 5, 12, 0, -9, 9, 14, -5, -10, 15, 14, -6, -3, 9, 20, -4, -11, 14, 19, -16, -7, 7, 7, -5, -12, 17, -13, -16, -1, 19, -2, -29, 3, 18, -3, -17, 7, 19, 0, -14, 9, 22, -7, -27, 12, 14, -15, -11, 15, 11, -4, -15, 8, 15, -9, -10, 20, 5, -13, -1, 11, 2, -15, 1, 20, 2, -14, -10, 8, -13, -13, 1, 14, 3, -24]
8191b4
$$ Imaginary data points
##PAGE= N=2
##DATA TABLE= (X++(I..I)), XYDATA
0@%%%%%%%%%%%qJ6j6J6k4L2l2M0n6O4p2Q8j06J30j52J76k08K40k72L10l56M06
33B16m56N12n81O55p34Q21r18J025j138J261j398J549j714J892k086K300k535
50a329K792l074L390l741M129m566N062n628O281p047P960r069J0445j2209J4571
65G967j7905K3005l1865N1504j70810Q8458L11625k70014j46081K18202J01660
76A65746l04647n3021L22921Q4857l28889o4687K83975L5166k81779K0708K82758
87A63108l8748k95457N5045K77598o3942k60762R3056K40174j16368k33555J38586
98d1265K20437j48895k05748J62932J83336j76111j64690J91810J45744k01939
108c4389j28501K10142J07690k15442q6451K21146O4553k24785m4243K26612K3863
$$ y = [0, 0, 0, 0, 0, 0, 0, 0, 0, 0, 0, 0, -8, 8, -8, 8, -16, 16, -16, 24, -32, 32, -40, 48, -58, 72, -80, 96, -112, 128, -144, 166, -190, 216, -240, 272, -309, 346, -388, 433, -485, 540, -598, 663, -735, 814, -900, 992, -1094, 1206, -1329, 1463, -1611, 1779, -1962, 2167, -2399, 2663, -2965, 3316, -3731, 4229, -4840, 5605, -6604, 7967, -9938, 13067, -18798, 32706, -138104, -49646, 261979, -8035, -154116, 64086, 165746, -138901, -191922, 130999, 215856, -113033, -177720, 106255, 141421, -140358, -119650, 163108, 124360, -171097, -116052, 161546, 97604, -163158, -70102, 170072, 53704, -179851, -41265, 179172, 30277, -175471, -12539, 170797, -5314, -170004, 21806, 167550, -34389, -162890, 47252, 154942, -60500, -146951, 74195, 138748, -86037, -130280, 96332, 120195]
119A20195k25531l631K22816j6711k18523L6065K12960n4368k05627P1567J96623
130A35835q7796j86301J02908J75056j16835j62860J29332J49810j40426j36051
140a37328J50281J21695j58903j06940J66192R1899j72163p6593J76834O1094
150A16068j80212m5545J82394K9978j83278j4526J82879p59j81180J5815J78185
161I9819l0473j73936M4659J68423n8221j61687P1056J53807q3089j44809R4120
172b0331J34872j04130j24073J12996J12554j20699j00450J27229Q7855j32532
182b6709p4965J36655O1861j39616m8668J41424L5509j42146k2463J41827R610
193G2319j40519K979J38287j5217j35195K7122J31229l8596j26434M9601J20879
$$ y = [120195, -105336, -108967, 113849, 97138, -121385, -85320, 127640, 73272, -132355, -60788, 135835, 48039, -138262, -35354, 139702, 22867, -139993, -10661, 139149, -1277, -137328, 12953, 134648, -24255, -131195, 34997, 126896, -45267, -121860, 54974, 116068, -64144, -109689, 72705, 102683, -80595, -95121, 87758, 86999, -94181, -78366, 99819, 69346, -104590, -59931, 108492, 50271, -111416, -40360, 113447, 30358, -114451, -20331, 114541, 10411, -113662, -666, 111888, -8811, -109261, 17968, 105823, -26709, -101674, 34981, 96842, -42774, -91442, 49982, 85491, -56655, -79118, 62709, 72319, -68200, -65221, 73066, 57849, -77346, -50224, 81005, 42409, -84025, -34424, 86455]
204H6455o0090j14571P0003J07556p9294r9833Q7889R1441r5711q2441J02698
215A4102P2893j08787o2880J13892N2481j17978m1816J21001L0981j22984k0062
226f9157J23886R185j23716J524J22549j1976j20447K2106J17440l1842j13576
237g4024M1072J08991m9773j03734N7940R7878o5530r1468P2505Q4614p8880p7328
249g7737Q4633O9668q9768o1653R4243N3319r8054m4711J01157L5873j03525k6859
261f3414J05109J7736j05902q553J05869o33j04962R667J03214j8502j00653K7075
273c3949R7258l5235r3124M2971Q8254n0145q2760N6756P6703o2743p0151O8054
285A889O3210p2678n5962P6644M8463p9941m0782Q2583L3001q4595k5155Q5978
$$ y = [86455, 26365, -88206, -18203, 89353, 10059, -89774, -1885, 89556, -6155, -88596, 14102, 86995, -21792, -84672, 29220, 81701, -36277, -78093, 42908, 73889, -49095, -69157, 54729, 63914, -59802, -58278, 64271, 52295, -68152, -46046, 71394, 39552, -74024, -32952, 76039, 26266, -77468, -19528, 78350, 12820, -78648, -6143, 78471, -409, -77737, 6896, 76564, -13204, -74857, 19386, 72705, -25349, -70060, 31097, 66970, -36555, -63414, 41695, 59431, -46471, -55024, 50845, 50212, -54750, -45083, 58131, 39629, -61024, -33949, 63309, 28074, -65050, -22079, 66175, 16030, -66730, -9974, 66729, 3986, -66165, 1889, 65099, -7579, -63541, 13103, 61566, -18375, -59157, 23426, 56427, -28168, -53323, 32655]
297C2655J7291q6779r433Q6977J641q6627O080Q5674j3656q4180K1097Q2105k8344
310B4501p9454L5329P6226m2005p2417M8288O8093n4147o3249N9525N7908o4308
322e710n2175O8521M6060p2084l9642P4971L3015p7168k6222P8671J9371p9490
334c1882j2537P9657N766p9211Q78P8172p355p6603J3636P4517j9661p1992K5426
347b1189O9052l0919o5727L6121O2017m1019n7974M5591N3618m9845m8929N3738
359D535M3941n7223l8661O0256L3146o2828k7423O4923K1503o6447j5470O7422
371B7674R356o7786l250O7588k810o6802Q752O5414j4482o3505J9972O1086k5175
384A6032n8204L0046N4903l4533n1288L8669M7327m2396m3127M5732L8729m8694
$$ y = [32655, 49946, -36833, -46266, 40711, 42352, -44275, -38195, 47479, 33823, -50357, -29260, 52845, 24501, -54953, -19624, 56602, 14597, -57820, -9532, 58561, 4414, -58835, 690, 58598, -5710, -57885, 10636, 56696, -15388, -55030, 19941, 52956, -24212, -50434, 28237, 47608, -31882, -44419, 35238, 41004, -38207, -37329, 40843, 33488, -43115, -29479, 45038, 25377, -46615, -21189, 47863, 16944, -48783, -12662, 49355, 8336, -49638, -4047, 49571, -274, -49203, 4535, 48476, -8747, -47408, 12848, 45994, -16834, -44257, 20666, 42169, -24278, -39748, 27674, 37030, -30756, -34006, 33582, 30772, -36030, -27278, 38136, 23654, -39851, -19879, 41207, 16032, -42172, -12126, 42777, 8244, -43044, -4375, 42952, 556, -42571, 3161, 41890, -6804]
396f804l4139N1258K9418n3476k4554N5311J9601n6779j4572N7901R463n8608
408b5980m312N8917q31n8834N979N8299j1045n7351J6043N5958k0904n4084K5531
421a2614N1793k9945m9087L4054M5968l7813m2500M1185L8730m4164l4688M6709
433G628L0417m8790k5998N0412K1493n1624j6913N2401J2311n2766p736N2766
445B3601L202n2400J257N1714n644n0670R919M9355j4089m7750J8157M5828k2068
458A0412m3640K5830M1168k9415l8403L2751L5378l5873l2067L8690K8526m1191
470g834k4755M3338K0780m5109j6629M6447J2391m7354q122M7844L809m7875M39
483b2630M7495m591m6704Q619M5541j2476m4040J6157M2218j9593m0140K2830
$$ y = [-6804, -40943, 10315, 39733, -13743, -38297, 17014, 36615, -20164, -34736, 23165, 32628, -25980, -30292, 28625, 27794, -31040, -25061, 33238, 22193, -35158, -19115, 36843, 15939, -38145, -12614, 39179, 9234, -39853, -5799, 40169, 2356, -40144, 1041, 39771, -4393, -39081, 7628, 38045, -10745, -36743, 13669, 35162, -16462, -33375, 19026, 31337, -21429, -29165, 23601, 26803, -25597, -24340, 27374, 21730, -28940, -19021, 30334, 16245, -31505, -13348, 32480, 10412, -33228, -7398, 33770, 4355, -34048, -1297, 34081, -1792, -33859, 4831, 33357, -7834, -32589, 10749, 31529, -13580, -30209, 16238, 28629, -18725, -26847, 20997, 24806, -23069, -22630, 24865, 20274, -26430, -17811, 27730, 15254, -28786, -12629, 29589, 9996, -30144, -7314]
495g314L7824k5845l5290K8620L2579l1167k9708L3509K6665l5604k3504L7482
507H247K0197l9111j6794M0484J3250m1580r624M2378N943m2891k195M3055j561
520A9798m2862N290M2331q976m1419J2547M0159j5972l8561J9215L6631k2211
532E970l4413K4957L1954k7417k9284K9594K6422l1477k3414L3054K0311l4339
544h082j7131L5334J3924l6083j0686L6586P418l6838m169L6849R22l6665K319
557a6302L6225n506l5576Q676L4692j1771l3567J4790L2208j7708l0606K0492
569c953K8763k3117k6667K5546K4352k7736k1834K9653J9154l1301j6313L2650
581I197J3362l3661j0353L4353P320l4736m296L4814J284l4596J660L4082m477
$$ y = [-7314, 30510, 4665, -30625, -2005, 30574, -593, -30301, 3208, 29873, -5731, -29235, 8247, 28444, -10667, -27461, 13023, 26273, -15307, -24931, 17447, 23390, -19501, -21696, 21359, 19798, -23064, -17774, 24557, 15581, -25838, -13291, 26868, 10896, -27665, -8450, 28181, 5970, -28443, -3486, 28468, 1051, -28233, 1361, 27783, -3694, -27108, 5946, 26257, -8082, -25213, 10121, 24045, -12038, -22724, 13862, 21280, -15558, -19727, 17122, 18044, -18621, -16302, 19923, 14417, -21159, -12483, 22209, 10438, -23129, -8339, 23869, 6161, -24445, -3953, 24810, 1693, -24974, 572, 24924, -2812, -24646, 5007, 24161, -7140, -23453, 9197, 22559, -11102, -21455, 12898, 20218, -14518, -18814, 16000, 17284, -17312, -15652, 18430, 13953]
594A3953l3366P224L2424r885l1262J2377K9941j4772k8440J7037K6806j9184
606B853k5019K1203K3076k3068k1010K4815J8823k6406j6487K7807J4026k9011
618h398j1445L0011Q784l0766o057L1278L257l1504m63L1458k329l1100N031L0475
632A8232p652k9591J0157K8461j2513k7107J4679K5571j6691k3845J8490K1993
644B0184k0114k0018K1543J7954k2790j5824K3868J3625k4762j1384K5517R084
656A6883k6099o755K6531M418k6816k023K6914l66k6846K757K6614n177k6152
669a6117P533K5510r861k4647J2109K3574j4244k2294J6219K0822j8060j9162
681a8618J9674J7394k1112j5454K2301J3437k3287j1336K4033R186k4527p046
$$ y = [13953, -19413, -12189, 20235, 10350, -20912, -8535, 21406, 6634, -21806, -4769, 22037, 2853, -22166, -963, 22113, -955, -21965, 2850, 21673, -4733, -21220, 6587, 20613, -8398, -19843, 10168, 18952, -11814, -17871, 13407, 16664, -14840, -15303, 16155, 13826, -17274, -12243, 18232, 10580, -19011, -8854, 19607, 7094, -20013, -5334, 20237, 3546, -20299, -1809, 20184, 70, -19948, 1595, 19549, -3241, -19065, 4803, 18428, -6334, -17718, 7799, 16883, -9216, -15971, 10560, 14978, -11838, -13861, 13053, 12687, -14159, -11402, 15212, 10035, -16117, -8584, 16926, 7065, -17582, -5473, 18101, 3857, -18437, -2218, 18604, 544, -18618, 1056, 18450, -2662, -18116, 4185, 17622, -5665, -17001, 7032, 16218, -8309, -15355]
693a5355K4846M876k4943k755K4858O78k4600J374K4186l353k3639N296K2956
706A4425p184k2139R014K1191j0773k0135J2466J8953j4092j7657J5634J6219
718A5922j7077j4652J8397J2951j9557j1158K0550R284k1383p305K1982N302k2389
731i133l269K2576J244k2559P84K2307k719k1864M596K1232o362k0444Q039J9506
745A3934r582j8446J1010J7281j2319j6040J3515J4702j4590j3310J5565J1856
757A3576j6429j0376J7223Q813j7911p199J8478N534j8942l826J9279K086j9480
770i174l12J9538j491j9415L258J9148n003j8717O722J8104q350j7313R863J6394
784A3252j1278j5319J2553J4132j3681j2823J4629J1471j5457j0032J6106Q550
$$ y = [-15355, 9491, 14367, -10576, -13331, 11527, 12205, -12395, -11021, 13165, 9812, -13827, -8531, 14425, 7241, -14898, -5884, 15307, 4534, -15601, -3135, 15818, 1726, -15931, -297, 15922, -1155, -15807, 2590, 15541, -4016, -15174, 5376, 14660, -6723, -14028, 7954, 13256, -9133, -12402, 10174, 11418, -11141, -10357, 11950, 9231, -12633, -8037, 13195, 6833, -13611, -5572, 13934, 4352, -14094, -3084, 14197, 1878, -14162, -647, 14055, -535, -13845, 1720, 13576, -2853, -13229, 3994, 12807, -5104, -12303, 6175, 11709, -7233, -11059, 8220, 10306, -9174, -9486, 10052, 8561, -10854, -7596, 11552, 6549, -12168, -5446, 12658, 4308, -13005, -3142, 13252, 1974, -13345, -792, 13340, -341, -13164, 1465, 12936, -2521, -12553, 3553, 12103]
796A2103j6591p077J6952N586j7178m107J7295K609j7290j154J7198l02j6996
809h952J737J6705l160j6341M594J5853n981j5271P345J4599q675j3807R954J2898
823A1498j1154j1886J2281J0761j3286r538J4158Q253j4921o875J5511N468j5954
836e684m025J6226K560j6325j127J6274k80j6101J648J5776k938j5342M170J4802
850I634n338j4180O436J3484p473j2706Q433J1880r340j1002J0202J0064j1002
863i08r053J1744Q005j2433o879J3044N712j3584m467J4006L199j4336j905J4555
877F700N63j4638P92J4571k123j4378L429J4035m680j3576N858J3001o966j2299
891i711P960J1506q863j0633R651R710j0342q715J0902P735j1403o695J1800N633
$$ y = [12103, -4488, -11565, 5387, 10973, -6205, -10312, 6983, 9592, -7698, -8852, 8346, 8044, -8952, -7215, 9490, 6330, -10011, -5417, 10436, 4455, -10816, -3471, 11128, 2453, -11354, -1400, 11498, 344, -11542, 739, 11500, -1786, -11324, 2834, 11087, -3834, -10709, 4802, 10270, -5684, -9709, 6517, 9077, -7248, -8375, 7899, 7619, -8482, -6834, 8942, 6004, -9338, -5168, 9634, 4296, -9884, -3448, 10036, 2563, -10143, -1710, 10170, 830, -10172, 30, 10094, -908, -9961, 1783, 9788, -2645, -9524, 3520, 9232, -4352, -8819, 5187, 8386, -5950, -7855, 6700, 7263, -7375, -6583, 7988, 5865, -8513, -5084, 8951, 4271, -9305, -3447, 9554, 2588, -9711, -1751, 9755, 892, -9741, -90, 9620, -722, -9437, 1465, 9200, -2203, -8898, 2902, 8535]
905H535j2092m574J2337L496j2500k406J2596J320j2647k02J2605r15j2493K034
919d906J2304l169j2015M276J1658n385j1190O440J0621p459r951Q394R201r267
933d48q359J0036P439j0699o442J1220N442j1640m389J1936L330j2102k274J2158
947E208J246j2111k42J1986p43j1767J690J1474k604j1107L463J0711m302j0260
961g358N111R739n898r182O667Q550p389p877Q086P129q724o357R343N487r868
976b541m575J0308L638j0699k624J0967J610j1139n63J1181m45j1124J450J0952
990F396k422j0664L335J0301m196r853M982R328n698q732O333Q119o925p442P423
1005B85O733p864o025Q275N260q605m509Q902L732r169k927R380K089r529j232
$$ y = [8535, -3557, -8131, 4206, 7702, -4798, -7204, 5392, 6712, -5935, -6137, 6468, 5553, -6940, -4906, 7398, 4229, -7786, -3510, 8148, 2763, -8427, -1987, 8634, 1175, -8776, -382, 8819, -448, -8807, 1229, 8668, -2031, -8473, 2747, 8189, -3451, -7840, 4096, 7426, -4676, -6950, 5208, 6454, -5657, -5899, 6087, 5344, -6423, -4733, 6741, 4137, -6970, -3507, 7204, 2902, -7358, -2247, 7492, 1594, -7588, -921, 7629, 240, -7637, 449, 7578, -1146, -7503, 1840, 7327, -2541, -7116, 3192, 6830, -3869, -6493, 4474, 6084, -5055, -5618, 5563, 5118, -6006, -4556, 6396, 3974, -6690, -3355, 6946, 2750, -7103, -2121, 7207, 1509, -7223, -890, 7229, 304, -7138, 285, 7018, -846, -6871, 1404, 6664, -1941, -6450, 2452, 6184, -2985, -5912, 3468, 5557, -3972, -5204]
1020e204R637L54r670N39R644j451r541K355R360l246r087M126Q717m936q279
1035f682N719P750o422p174P070O517p618n816Q074N079q445m316Q713L555q915
1050b911k776R031K014r086j258R052N22q980J96Q868r26q690J630Q464k300q225
1066e375L010P913l689p563M370P151m997o713N647O199o249n642O826N010p347
1081a449m309P766L614q158k844Q425K060q631j265Q753M61q767L09Q675j044
1096C596q532J777Q302k442q021L077P658l647p283M190O853m687o390N146N922
1111E519n568n399N946M872o308m310O648L710o940l100P212K450p436j772P617
1126C141J060p751l26P809m19p814J181P725j922p573K644P348l341p042L975
$$ y = [-5204, 4433, 4787, -4883, -4344, 5300, 3849, -5692, -3337, 6023, 2777, -6310, -2184, 6533, 1597, -6682, -963, 6787, 365, -6809, 261, 6778, -840, -6656, 1418, 6497, -1948, -6264, 2449, 6004, -2911, -5687, 3344, 5358, -3728, -4986, 4066, 4588, -4392, -4196, 4672, 3746, -4944, -3314, 5150, 2850, -5375, -2365, 5548, 1859, -5704, -1334, 5817, 820, -5893, -246, 5953, -296, -5938, 888, 5898, -1449, -5758, 2008, 5622, -2536, -5380, 3045, 5105, -3526, -4791, 3962, 4423, -4344, -4035, 4640, 3596, -4936, -3159, 5143, 2701, -5320, -2243, 5415, 1768, -5515, -1325, 5528, 841, -5549, -403, 5519, -49, -5448, 498, 5370, -938, -5248, 1400, 5110, -1830, -4930, 2282, 4732, -2704, -4476, 3141, 4201, -3550, -3876, 3933, 3514, -4300, -3119, 4606, 2684, -4889, -2245, 5103, 1762, -5280, -1305]
1141a305O681m589o224N114N751n572n233N973M685o305m112O566L532o783k923
1156d744O915K350p011j769P061J190p080o06P067Qo997N73O913j174o785J768
1172b321O610k369o398K964O139l565n805M127N438m675n012N186M528n629m029
1187d811O045L454o371k856O620K256o811j630O936J022o995m00O956j88o855
1202c628P40O711j260o536J764O312k232o052K680N761l105n435L483N103l879
1217D27m745M251M348m595l928M911L492n229l008N509K493n740j959N948J386
1232C561o104p94O209J98o245M06O220j011o120J586N986k148n761K637N520l127
1248A013n202L552M847l920m479M241M089m525l682M759L251m946k825N098K395
$$ y = [-1305, 5376, 787, -5437, -323, 5428, -144, -5377, 596, 5281, -1024, -5136, 1430, 4962, -1821, -4744, 2171, 4521, -2490, -4259, 2802, 3992, -3088, -3694, 3373, 3381, -3616, -3043, 3870, 2696, -4089, -2321, 4289, 1920, -4478, -1514, 4625, 1060, -4745, -618, 4820, 145, -4867, 319, 4847, -782, -4811, 1234, 4688, -1683, -4539, 2081, 4337, -2474, -4104, 2832, 3854, -3141, -3541, 3415, 3227, -3628, -2888, 3823, 2563, -3973, -2209, 4103, 1871, -4181, -1501, 4260, 1155, -4280, -797, 4306, 427, -4318, -67, 4281, -314, -4242, 669, 4161, -1068, -4076, 1433, 3926, -1814, -3773, 2175, 3561, -2543, -3337, 2872, 3070, -3175, -2769, 3451, 2440, -3680, -2094, 3892, 1744, -4017, -1380, 4140, 1013, -4189, -637, 4210, 290, -4189, 52, 4141, -384, -4066, 693, 3944, -1002, -3827, 1271, 3666]
1263C666n220j965N328J501n390j045N428N88n453j00N443l71n425Q92N336j386
1279A827n222J891N068k399m853K887M598l337m292L763L942m158l550M492L137
1294C794m788k686N003K231n177j781N296J309n355q63N374M03n321RN259m16
1310B291n151Q17N008j178m860J554M662j888m474K250M256k590m011K929L730
1325C345l256l434L579L110l887k736M158K349m416j923M617J484m802j020M923
1340B091N44m991o6N004m16m960Q73M860j304m729J710M562k082m347K415M110
1356C274k714l843K978L566l211l267L429K955l603k645L762K324l898j997M028
1371A138J648m137j300M236R09m295n29M357J20m378K89M363p12m306J134M207
$$ y = [3666, -1554, -3519, 1809, 3310, -2080, -3125, 2303, 2891, -2562, -2662, 2781, 2410, -3015, -2123, 3213, 1827, -3395, -1504, 3564, 1165, -3688, -801, 3797, 460, -3832, -69, 3873, -285, -3835, 657, 3794, -994, -3680, 1323, 3554, -1623, -3404, 1892, 3201, -2154, -3017, 2357, 2760, -2561, -2552, 2707, 2291, -2860, -2043, 2965, 1787, -3073, -1519, 3143, 1255, -3219, -969, 3287, 697, -3314, -385, 3345, 89, -3345, 234, 3344, -543, -3279, 879, 3228, -1188, -3111, 1506, 2990, -1812, -2832, 2091, 2635, -2356, -2422, 2582, 2166, -2794, -1921, 2939, 1635, -3094, -1384, 3178, 1096, -3251, -836, 3274, 560, -3283, -305, 3261, 50, -3217, 212, 3167, -436, -3081, 681, 3005, -893, -2890, 1138, 2786, -1351, -2651, 1585, 2494, -1801, -2330, 2027, 2147, -2231, -1942, 2421, 1709, -2597, -1463, 2744]
1387B744j552m080J963L896k346l687K727L415l037l144L335K822l549k501L736
1402G42K175l889j824M002J482m057j153M101Q01m083m91M057J92m040J26L967
1418B108m29l883P25L792j035l679J323L558j633l397J936L208k234l001K531
1433a10K770k823k490L071K191l294j878L496J544l661j177L793Q06l866m46L908
1449A834Q6l907K58L861n80l778Q82L669j166l534J437L356j656l201J875L008
1465B444k066k827K254K614k421k399K572K184k727j940K881J675l010j406L124
1480I52J129l246q18L348M85l384j71L432j98l401N28L378q78l290J204L181j519
1497G32l042J805K869k069k670K298K447k488k215K623J986k759j756K880J497
$$ y = [2744, 1192, -2888, -925, 2971, 625, -3062, -335, 3080, 43, -3101, 234, 3056, -493, -2994, 742, 2917, -972, -2796, 1206, 2688, -1369, -2522, 1579, 2380, -1703, -2194, 1863, 2055, -1985, -1859, 2108, 1679, -2204, -1479, 2313, 1278, -2401, -1078, 2480, 847, -2550, -614, 2594, 360, -2641, -110, 2660, -163, -2653, 418, 2609, -685, -2563, 933, 2477, -1184, -2361, 1432, 2238, -1628, -2074, 1834, 1920, -1987, -1729, 2132, 1552, -2226, -1344, 2325, 1159, -2375, -938, 2418, 762, -2439, -564, 2444, 378, -2449, -195, 2419, -2, -2401, 171, 2355, -372, -2312, 569, 2244, -766, -2172, 952, 2081, -1165, -1983, 1365, 1850, -1534, -1705, 1727, 1529, -1872, -1344, 2034, 1156, -2134, -930, 2251, 732, -2310, -505, 2364, 295, -2375, -77, 2370, -118, -2333, 290, 2276, -483, -2239, 641, 2138]
1512B138k939j270L004J039l048p88L054N57l063l13L058P1l037J65L013m26k960
1529a745O93K894r47k812J220K705j493k575J770K395k023k198K252J977k452
1544c39j755K633J509k796j249K916R66l007o73L028M28l061j54L040r1l009L35
1561a279K947n46k848P40K769r39k658J119K543j286k425J455K292j623k128J777
1577i0J987j948j803K081J616k247j403K379J176k505r19K603O55k681l88K741
1593A254R4k758J96K718m44k694P09K642r78k531J200K409j397k272J584K115
1609A847j739j948J875J796j999j610K069J453k159j256K210J084k252r22K317
1624G66P18k354n33K373L40k388j29K385q4k389L14K356n50k303P85K243j033
$$ y = [2138, -801, -2071, 933, 1972, -1076, -1864, 1190, 1747, -1316, -1629, 1429, 1500, -1537, -1372, 1641, 1215, -1745, -1052, 1842, 895, -1917, -697, 2008, 515, -2060, -290, 2105, 82, -2116, 136, 2113, -339, -2094, 539, 2048, -748, -1997, 919, 1885, -1122, -1795, 1233, 1661, -1400, -1554, 1486, 1395, -1614, -1279, 1668, 1122, -1726, -986, 1783, 844, -1814, -695, 1848, 562, -1863, -408, 1884, 261, -1867, -90, 1897, -51, -1854, 227, 1843, -404, -1807, 572, 1748, -757, -1676, 927, 1582, -1099, -1487, 1254, 1348, -1410, -1214, 1504, 1060, -1634, -925, 1717, 739, -1792, -592, 1817, 420, -1852, -268, 1847, 108, -1840, 35, 1831, -168, -1778, 291, 1744, -415, -1671, 539, 1623, -629, -1551, 766, 1484, -870, -1403, 970, 1310, -1078, -1207, 1178, 1094, -1295, -981, 1375, 825, -1478, -693, 1550, 517]
1641E17k137J264K009j471j869J685J698j854j525K011J324k129j124K231R11
1656A541k287p10K344N02k361l07K361J17k337M3K300k09k240L55K191n18k136
1673a351O81K051q28j966R75J862j110j772J265J649j413j527J563J369j690j193
1689a435J830J021j957q09K043O00k123l61K155J58k185O2K196k85k162M75K113
1706A336o76k043Q51J960j018j852J149J754j294j629J384J502j459j397J562
1721A30J250j616j134J686R96j737q46J800O96j839n52J888L77j908k05J943J1
1738I40j955K01J933l97j901N93J849p84j781R84J674j160j560J315J440j477
1754h6j293J594J139j698r90J777Q22j812o75J844N42j879l81J873K44j861j14
$$ y = [517, -1620, -356, 1653, 182, -1687, -2, 1696, -158, -1683, 328, 1652, -477, -1601, 630, 1541, -746, -1456, 888, 1390, -971, -1278, 1083, 1200, -1137, -1094, 1206, 997, -1243, -888, 1303, 785, -1351, -670, 1381, 553, -1413, -438, 1424, 314, -1458, -193, 1456, 43, -1484, 79, 1448, -242, -1435, 395, 1416, -541, -1350, 693, 1293, -830, -1191, 964, 1122, -1063, -1001, 1195, 910, -1252, -777, 1336, 660, -1383, -532, 1428, 410, -1442, -293, 1461, 167, -1462, -78, 1424, -35, -1432, 130, 1380, -236, -1370, 316, 1312, -425, -1271, 529, 1225, -614, -1166, 722, 1099, -809, -1014, 929, 940, -1015, -814, 1119, 722, -1179, -586, 1263, 479, -1302, -318, 1356, 196, -1364, -49, 1391, -86, -1379, 215, 1354, -344, -1334, 443, 1265, -547, -1222, 622, 1164, -715, -1096, 777, 1021, -840, -954]
1771i54J850k7j815J59J789k89j736M16J692n41j635O77J562q06j498R51J406
1788A201j096j307J242J163j353j037J473Q74j573p18J656N55j740l60J758J96
1804I34j791j2J800j60j768L13J735m76j664O02J609p19j525Q01J475r07j377
1821a130R79J294j064j203J142J100j205r98J267Q77j322p57J363O53j431n23
1837i58J467L87j501k46J536Q2j560R4J544k60j514M12J497n82j441P37J377q78
1855A93j280J004J173j107j061J206R48j284q31J334P14j357o13J398M86j393
1871d70m02J403K92j411j99J414R4j396PJ382j20j350K17J331l35j298M51J254
1889H64n70j189O73J138q03j059R34R40j019q41J124P39j213o16J293M77j347
$$ y = [-954, 896, 869, -946, -787, 1002, 713, -1023, -607, 1085, 544, -1091, -414, 1148, 342, -1156, -205, 1201, 105, -1202, 40, 1203, -150, -1187, 286, 1160, -413, -1131, 525, 1080, -660, -1020, 738, 934, -857, -869, 931, 771, -997, -684, 1051, 575, -1089, -487, 1122, 403, -1122, -321, 1154, 247, -1130, -151, 1143, 79, -1124, 18, 1118, -87, -1085, 182, 1059, -263, -1020, 343, 996, -435, -958, 509, 896, -605, -851, 685, 767, -793, -699, 845, 585, -929, -517, 980, 398, -1043, -306, 1071, 193, -1087, -83, 1090, -17, -1078, 128, 1076, -208, -1039, 295, 1009, -348, -961, 437, 923, -470, -872, 531, 823, -588, -787, 627, 721, -675, -668, 714, 594, -756, -539, 792, 457, -841, -390, 864, 294, -895, -222, 916, 113, -946, -12, 928, -91, -932, 192, 931, -282, -898, 395, 872, -475]
1906d75l31J369K01j378p5J372l9j371J66J332k56j312L52J259m33j211N05J156
1924H31n70j115O50J044p07r91P68R29q27q55Q97P67r42o87J008N94j054m93J109
1943C56L77j149k49J174J24j202J3J200j46j191K80J167m00j134N20J073o36j004
1961h27P17R39p98q70Q67P80r14p12R56O28r83n53J015M89j039l93J043L24j041
1980c72k57J057J70j056p9J055%j044Q5J034j75j028K81J002m00r52M95R00n98
1999A18q36O82P77p89o85Q53N99r19n06R78M04j028k92J039K09j063j12J070L
2018E02j029O5J025j53r85K05R71k65r38L21R12l79q69M42Q14m90p82N44P30n89
2038E2o92O55O29p17n50P76M62q26l84Q75K86r09j83R28Q1r42J8R39j24r38K42
$$ y = [-475, -806, 563, 764, -614, -689, 683, 644, -727, -561, 771, 515, -797, -445, 814, 381, -830, -325, 831, 261, -854, -204, 840, 133, -858, -90, 839, 12, -843, 54, 821, -121, -808, 200, 794, -260, -753, 356, 733, -416, -665, 509, 633, -569, -556, 644, 498, -693, -413, 754, 354, -780, -260, 813, 177, -827, -110, 829, 31, -839, 28, 808, -106, -818, 138, 766, -217, -770, 245, 734, -305, -698, 345, 669, -372, -629, 428, 598, -458, -537, 518, 518, -526, -441, 593, 418, -610, -329, 673, 273, -679, -184, 716, 118, -718, -36, 741, -48, -733, 120, 719, -200, -706, 272, 676, -352, -644, 395, 604, -459, -571, 499, 502, -527, -462, 563, 410, -575, -370, 601, 336, -602, -281, 631, 252, -617, -175, 639, 149, -633, -89, 641, 52, -640, 15, 644, -73, -623, 153, 615, -211, -595, 280, 566, -343, -526, 402, 483, -459, -441, 498, 374, -564, -322]
2059c22R20l39q93M35Q42m93q09N75P53o23o83O56O26o96n65P28N07p56m38P60
2079A85L89p80l37P87K81p95k42Q20J49q12q6Q25J8q33O8Q22j59q10K45P84l20
2100A99p55M22P05n00o58N80N99o52n13O96M57p69l65Q05L03q34k19Q32J57q41
2120c51r3Q45J2q31M1Q24j19p82J51P62j95p47K33P31k82p02L40O54l81o23M26
2141h7N94m80n42N39M94n80m37O40L55o89k77P37K02p66j13P69M0p83M6P90j53
2162B99p65K12P52k90p22L56O89m25o59M80O07m99n69N25N31n69m82O07M16o08
2182a14l82O32L32o40k77O45K41o68j87O86J19o84m7O99j2p13R1O95j77o78K52
2203a87O61l22o40M02N94m85n42N37M92o02m26O42L76o88l15P20K36p24j83P48
$$ y = [-322, 598, 259, -634, -199, 643, 150, -659, -84, 669, 46, -637, 19, 645, -51, -616, 112, 619, -137, -575, 185, 574, -206, -543, 244, 525, -270, -512, 308, 457, -355, -441, 384, 402, -431, -363, 459, 300, -510, -265, 519, 199, -556, -134, 571, 71, -587, -7, 592, -60, -573, 123, 580, -189, -554, 251, 554, -280, -499, 333, 490, -351, -444, 401, 413, -418, -377, 447, 328, -454, -303, 459, 264, -483, -250, 481, 199, -503, -163, 491, 110, -513, -87, 507, 27, -515, 24, 518, -62, -499, 141, 496, -193, -470, 267, 469, -297, -410, 359, 399, -384, -338, 452, 299, -466, -254, 498, 208, -514, -158, 531, 106, -553, -73, 534, 35, -534, -9, 522, -47, -529, 78, 494, -114, -496, 136, 468, -172, -449, 196, 437, -231, -418, 268, 387, -297, -344, 355, 343, -370, -279, 416, 239, -439, -187, 474, 152, -488, -86, 508, 23, -519, 18, 510, -92, -518, 124, 500, -188, -503, 217, 453, -271, -454, 294]
2223B94J08p21p4P46%p24N4O96p9p03J37O96j91o52K17O38k73n98L11N73l64n44
2245d53M17N23m93m56N15M15n69l60O25K73o60k19P04J33p24n8P36j8p43J02P31
2266D21j53p34K40P02k96o61L47O42m03n99M39N54m66n09M90M82n23m39N49L99
2286D82n73l52N90L02o17k45O10K06o47j44O63P9o68k1O75n7o68J29O68k11o37
2307d36K76O26l50n89M22N47m72n07N36M43n72m01O24L28o36k90O71K31o81j65
2327c95O72J17o81p6O82J6o66K4O55o6o48J09O31j54o20J92O11k61n67L15N34
2348D24l44n32M11M85m45m41N05L86n52l22N87K76o36j99O61J26o87n5O74No92
2369c65Q3O83j51o69J98O47k54o16K89N96l29n71L73N24m04m89M36M50m53m26
$$ y = [294, 402, -319, -393, 353, 353, -371, -317, 379, 300, -403, -266, 430, 239, -413, -196, 442, 169, -429, -118, 455, 91, -453, -36, 487, -6, -462, 53, 468, -101, -461, 164, 437, -223, -442, 262, 395, -329, -387, 349, 331, -412, -310, 421, 268, -466, -226, 476, 180, -481, -134, 508, 105, -494, -55, 499, 33, -476, 14, 496, -27, -466, 83, 482, -91, -443, 147, 449, -168, -413, 197, 403, -244, -388, 275, 354, -314, -335, 340, 283, -385, -256, 412, 201, -436, -160, 466, 116, -473, -51, 496, 24, -483, 53, 496, -76, -477, 147, 475, -161, -451, 220, 451, -230, -395, 277, 394, -287, -363, 319, 335, -331, -307, 348, 282, -366, -257, 374, 220, -400, -208, 403, 142, -425, -110, 424, 80, -452, -41, 444, -1, -442, 63, 449, -103, -425, 162, 438, -198, -397, 264, 390, -297, -352, 322, 327, -365, -282, 401, 250, -419, -221, 426, 172, -444, -155, 441, 112, -459, -86, 438, 34, -455, -19, 431, -22, -448]
2389d48M89L95n09l50N34L00n56k42N75K04o00j42O10Q2o23j6O32n2o31J24O23
2410C99j93o17K55N89l34n42L82N19m44m79M78M35n31l76N55L45n90k85O03K31
2430D00n94k02O18J53o18j07O25M6o02j6O04j8o05Q1N92j20n84J72N72k33n56
2451c92K76N37l26n07L76M54m23m10M70L57n14l03N43K62n97j95O15J39o32p4
2471c44O45Ro39N5O26j12o07J51O09k06n67K29N61k78n28L10N12l50m77L77M33
2492D09m07m05M24L95m67l44M82K99m98k76N44J89n54j42N83P6n84j3N81l1n97
2513c36J09N75j76n63K31N63k97n06L34M87l79m52M17M15m53l69M80L32n07k86
2533c81N19K43n35k03N28J77n49j29N45R1n40o1N48Nn41K6N49q3n42J43N24j75
$$ y = [-448, 41, 436, -73, -423, 111, 411, -145, -387, 188, 392, -208, -350, 260, 342, -281, -297, 335, 283, -348, -224, 399, 206, -411, -156, 433, 99, -443, -61, 458, 14, -465, 13, 448, -83, -459, 96, 441, -149, -434, 169, 400, -194, -396, 222, 375, -243, -350, 275, 321, -281, -297, 307, 289, -316, -235, 357, 237, -347, -175, 397, 164, -392, -116, 421, 95, -412, -36, 418, -5, -415, 55, 412, -102, -405, 138, 400, -197, -392, 223, 362, -270, -344, 301, 310, -329, -274, 352, 240, -367, -216, 393, 187, -380, -151, 410, 132, -396, -86, 426, 76, -401, -24, 409, 2, -403, 21, 416, -51, -395, 87, 386, -112, -388, 156, 345, -209, -351, 232, 308, -276, -289, 292, 261, -336, -227, 348, 172, -391, -160, 403, 106, -400, -66, 421, 42, -410, 7, 422, -31, -400, 80, 412, -95, -381, 138, 381, -154, -357, 171, 348, -201, -330, 215, 306, -234, -295, 253, 258, -283, -257, 292, 209, -333, -190, 334, 159]
2555A59n07K24M88k71m63L38M23l84l85M23L53m79k88M99K52n34j91N37J55n65
2575b16r6N76L0n63KN60n0n51Q5N46j34n36J67N08j89n08K40M80k69m54K91M37
2597C56l18l98L39L90l80l47M10L13m46k61M80K12m98j60N06J08n43l9N52j2n50
2618b86O9N31j14n33J70N11k25m94K70M62k96m52L48M06l69l79M02L46m10l13
2638c56M23K93m47k55M66K12m77j75M84J49m90j12N01O7n09j6N01j2n25Q1N10
2659C13j27m96J62M80k31m49K89M10l25l91L73L47m07l10M46K56m65k20M84J83
2679C22n12j29N09J04n22m1N23J2n11J0N12m3n14Q5N05j26m79J50M78j96m54K15
2701a02M40k65m16K95L97l38l70L82L13m01k83M34K42m63j89M79J41m99r0N11
$$ y = [159, -348, -124, 364, 93, -370, -32, 391, 7, -378, 45, 398, -81, -369, 130, 382, -152, -343, 194, 349, -216, -312, 264, 294, -269, -267, 293, 243, -308, -223, 323, 189, -347, -180, 328, 139, -369, -129, 351, 82, -372, -81, 356, 38, -360, -21, 369, -11, -358, 52, 365, -81, -342, 138, 350, -148, -308, 198, 306, -237, -276, 276, 264, -286, -217, 314, 200, -333, -163, 348, 123, -371, -101, 361, 65, -387, -39, 367, -2, -381, 21, 367, -43, -356, 67, 360, -87, -342, 124, 336, -141, -316, 168, 317, -173, -285, 216, 283, -226, -242, 259, 247, -278, -197, 313, 186, -310, -148, 332, 101, -348, -59, 351, 26, -365, 8, 355, -52, -362, 84, 340, -125, -345, 139, 322, -190, -319, 190, 294, -228, -269, 254, 266, -245, -235, 277, 234, -280, -195, 310, 184, -295, -145, 333, 137, -317, -102, 338, 73, -343, -48, 349, 11, -359, 23, 336, -65, -348, 86, 328, -135, -324, 155, 296, -203, -293, 218]
2721B18M0n14J4N22p5m98J24M98j78m68K03M64k41m35K65M23k99l97L30L56l48
2742Dl49L80L18m07k67L94K47m28k17M40J88m63j45M77J09m94n4M83K1m98M2M88
2764B69r0m67J32M68j88m50K44M27k92l86L25L74l63l32L91K88m22k55M33K23
2784C29m55j78M71J29m72j19M86O1m70m6M87km70J7M92o8m83J02M85j54m46J82
2806a22M36k11m17K55L91k93l63L32L39l64l05L99K67m43k23M71J56m75j13M74
2826A91Q3m93k6M89k1n02P3M80j19m58J42M65j85m48K15M31k44m09K64L94k93
2847B9l61L17L50l39l29L66L11l95k70M24K25m39j82M53J48m74r8M68N3m76qM96
2869B69p1m66J01M52j50m37J94M19k34l97K63L74l07l48L45L14l73k87M04K51
$$ y = [218, 258, -256, -242, 280, 205, -293, -169, 329, 151, -317, -114, 350, 109, -326, -61, 362, 63, -334, -4, 352, 4, -345, 35, 353, -54, -321, 73, 320, -108, -325, 115, 303, -160, -305, 172, 281, -213, -267, 216, 237, -261, -219, 269, 179, -288, -156, 312, 124, -326, -82, 345, 53, -333, -8, 366, 3, -329, 62, 350, -72, -327, 106, 329, -126, -304, 167, 296, -176, -295, 191, 252, -218, -264, 223, 221, -249, -232, 260, 192, -291, -189, 296, 142, -304, -122, 314, 103, -314, -59, 332, 39, -324, 8, 347, -17, -322, 77, 344, -99, -322, 149, 305, -170, -283, 191, 274, -219, -245, 244, 223, -279, -206, 274, 155, -303, -161, 304, 119, -329, -114, 317, 73, -336, -72, 322, 29, -332, -15, 335, -4, -333, 33, 344, -51, -321, 103, 328, -111, -293, 160, 308, -166, -264, 204, 257, -219, -227, 269, 198, -268, -167, 285, 135, -302, -108, 311, 77, -320, -57, 317, 10, -338, 7, 321, -52, -339, 65, 316]
2889C16m15k18M32J90m41j51M41J28m45j17M86M6m58k1M61lm70M7M60r0m57J39
2911a40M39j77m27K08M06k67l70K92L47l28l07L62K70l88k30M14J72m19j41M49
2931A65R2m45n1M51J5m59L4M53o3m56J03M47j33m27J60M17j94m06K16L89k45l77
2953c14K74L46l00l31L50K87l62k68L80K28l93k02M14J57m24j19M53N6m48%M36
2974B20k4m46Q5M32j18m33J81M12k11l80K34L59k80l38L04L03l13k98L60K46l64
2995f9k34L93J92l89j81M05J54m18j29M38P7m33m4M30K0m45K9M52p2m27J11M05
3017B65j43l91J88L64k11l57K62L23k97k92L21K66l44k32L80J80m04j41M07J13
3037B57m27p4M13M2m13j5M11j3m11M6M19q1m10J05M06j37l90J62L88j89l77K39
$$ y = [316, -99, -317, 115, 305, -136, -287, 154, 282, -163, -280, 206, 252, -206, -227, 234, 231, -239, -192, 268, 178, -279, -140, 299, 122, -305, -97, 309, 42, -328, -36, 311, -17, -324, 38, 308, -80, -310, 104, 276, -143, -284, 165, 257, -188, -239, 212, 227, -232, -198, 255, 192, -264, -161, 286, 153, -274, -114, 303, 109, -297, -81, 308, 63, -314, -40, 306, 6, -325, 25, 312, -50, -318, 62, 290, -103, -305, 109, 266, -158, -277, 176, 232, -216, -216, 220, 196, -250, -165, 267, 149, -284, -103, 309, 98, -282, -48, 311, 31, -307, -3, 300, -13, -311, 49, 295, -69, -303, 90, 282, -107, -288, 117, 271, -147, -276, 162, 239, -194, -238, 192, 212, -233, -204, 248, 176, -251, -140, 265, 122, -269, -81, 283, 72, -285, -23, 300, 3, -289, 32, 298, -46, -278, 102, 282, -122, -263, 144, 257, -170, -244, 169, 211, -202, -217, 194, 181, -230, -184, 235, 154, -256, -151, 255, 118, -272, -110, 278, 89, -288, -49]
3059d9L44k57l22K95K80k93k82L49K29l56k09L79J47l77j17M06O7m10k8L97mm11
3081b22N5M00j05l81J27L72j60l65J98L46k15l28K42L16k69k87K80K79l15k43
3101b75L26K26l32k09L60J66l52j54L75J15l84q1L92M9m09qM00l9l85O7L85j08
3123A25l72J36L51j76l36K22L03k40k94K77K70l05k29L15J96l14j72L45J41l57
3143a14j09L63Q7l72m9L67K9l70j8L90j2l93M5L84r6l61J16L53j49l38J61L38
3165B52k04l14K31K90k63k55K84K26k99j96L12J79l51j28L55R3l52o2L64K6l63
3186a75J4L62n2l49P3L53j13l18J23L10j47l25J90K87j99k80K18K59k27k56K63
3207A1K34k82k15K85K05l11j80L37J40l40j08L52P6l55l5L62nl53K4L61o5l37
$$ y = [-49, 295, 38, -284, 11, 291, -2, -284, 65, 294, -62, -271, 108, 255, -122, -239, 167, 234, -176, -204, 193, 189, -222, -167, 233, 128, -253, -126, 246, 86, -279, -81, 265, 50, -278, -36, 280, 11, -276, 4, 283, -32, -275, 51, 277, -55, -264, 96, 262, -90, -244, 131, 246, -138, -219, 173, 222, -187, -195, 205, 166, -219, -152, 233, 125, -247, -111, 240, 64, -272, -50, 253, 13, -281, -4, 266, -39, -268, 47, 243, -71, -243, 102, 243, -114, -223, 140, 227, -145, -194, 173, 202, -168, -186, 204, 192, -201, -156, 228, 132, -229, -113, 240, 91, -247, -86, 252, 48, -266, -35, 255, -8, -263, 21, 247, -52, -248, 64, 243, -108, -236, 119, 212, -140, -202, 162, 188, -175, -161, 201, 149, -200, -127, 226, 113, -205, -82, 228, 81, -244, -54, 233, 34, -246, -28, 231, 4, -252, 11, 245, -37, -252, 33, 238, -73, -253, 84, 224, -116, -224, 128, 204, -151, -186, 176, 171, -182, -158, 203, 138, -199]
3229a99R0L32j27l17J73K98k03k79K30K50k43k40K72J90k85j71K91J54l01j37
3249b22L09J11l16q7L19O7l34l4L40J3l41QL45l6l46P5L37r8l29J22L26j51l07
3272b29J88K86k22k51K34K34k72j84K63J81k97j33K91J19l23q4L17M5l19j4L23
3293A53j9l15M7L16o2l20P3L23j11l00J35K98j59k67J70K73k08k46K17K47k41
3314Dk23K49K08k71j91K95J60l16j17L11R5l30o0L23K1l19QL17m7l09P7L07j08
$$ y = [-199, -109, 223, 96, -221, -48, 250, 47, -232, -2, 248, 5, -235, 37, 227, -58, -229, 62, 216, -85, -222, 87, 198, -118, -205, 114, 181, -153, -187, 153, 166, -175, -167, 178, 142, -204, -129, 208, 110, -219, -97, 229, 78, -229, -41, 245, 23, -228, 6, 240, -32, -216, 47, 228, -69, -202, 89, 208, -115, -199, 118, 163, -156, -170, 153, 134, -181, -134, 182, 120, -200, -127, 196, 85, -215, -80, 218, 59, -208, -38, 235, 27, -219, -2, 245, 4, -219, 30, 238, -33, -224, 71, 231, -85, -202, 109, 204, -126, -186, 137, 158, -161, -153, 164, 117, -192, -115, 192, 84]
$$ [...]
8191d
##END NTUPLES=NMR FID
##END=
