##TITLE=1H_ES-AN-MeOH-C2
 
 8 sc, 
 21.1.2022
##JCAMPDX= 6.0         $$ Bruker NMR JCAMP-DX V2.0
##DATA TYPE= NMR FID
##DATA CLASS= NTUPLES
##ORIGIN= UXNMR, Bruker Analytische Messtechnik GmbH
##OWNER= root
$$ XWIN-NMR		Version 3.5
$$ Fri Jan 21 12:01:00 2022 Russian Standard Time (UT+4h)  she@DPX200
##.OBSERVE FREQUENCY= 200.131346
##.OBSERVE NUCLEUS= ^1H
##.DELAY= (6, 6)
##.ACQUISITION MODE= SIMULTANEOUS
##.ACQUISITION SCHEME= undefined
##.AVERAGES= 8
##.DIGITISER RES= 18
##SPECTROMETER/DATA SYSTEM= spect
##.PULSE SEQUENCE= zg30
##.SOLVENT NAME= DMSO
##.SHIFT REFERENCE= (INTERNAL, DMSO, 0, 15.7039)
##AUDIT TRAIL= $$ (NUMBER, WHEN, WHO, WHERE, WHAT)
$$ ##TITLE= Audit trail, XWIN-NMR		Version 3.5
$$ ##JCAMPDX= 5.01
$$ ##ORIGIN= Bruker BioSpin GmbH
$$ ##OWNER= she
$$ F:/spectra/data/she/nmr/H-F/1/audita.txt
$$ ##AUDIT TRAIL=  $$ (NUMBER, WHEN, WHO, WHERE, WHAT)
(   1,<2022-01-21 11:59:22.68 +0400>,<she>,<DPX200>,
      <created by zg, POWCHK disabled, PULCHK disabled
       configuration hash MD5:
       00 E9 B6 7A A2 85 ED C7 34 08 36 98 17 FE 4E 26
       data hash MD5: 16K
       94 27 D2 DE A6 FA CA 0A 67 96 09 2F F1 21 09 2F>)
$$ ##END=
$$ 
$$ hash MD5
$$ A4 F8 29 24 C8 CB 34 7D A6 17 DE A4 43 F2 E0 95
##$RELAX= 
##$RELAX= 
##$RELAX= 
##$RELAX= 
##$RELAX= 
##$RELAX= 
$$ Bruker specific parameters
$$ --------------------------
##$DU= <F:/spectra>
##$EXPNO= 1
##$NAME= <H-F>
##$PROCNO= 1
##$TYPE= <nmr>
##$USER= <she>
##$AMP= (0..31)
100 100 100 100 100 100 100 100 100 100 100 100 100 100 100 100 100 100 
100 100 100 100 100 100 100 100 100 100 100 100 100 100 
##$AQSEQ= 0
##$AQ_mod= 1
##$AUNM= <au_zg>
##$AUTOPOS= <>
##$BF1= 200.13
##$BF2= 200.13
##$BF3= 200.13
##$BF4= 200.13
##$BF5= 200.13
##$BF6= 200.13
##$BF7= 200.13
##$BF8= 200.13
##$BYTORDA= 1
##$CFDGTYP= 0
##$CFRGTYP= 5
##$CHEMSTR= <none>
##$CNST= (0..31)
1 1 145 1 1 1 1 1 1 1 1 1 1 1 1 1 1 1 1 1 1 1 1 1 1 1 1 1 1 1 1 1 
##$CPDPRG= <>
##$CPDPRG1= <>
##$CPDPRG2= <>
##$CPDPRG3= <>
##$CPDPRG4= <mlev>
##$CPDPRG5= <mlev>
##$CPDPRG6= <mlev>
##$CPDPRG7= <mlev>
##$CPDPRG8= <mlev>
##$CPDPRGB= <>
##$CPDPRGT= <>
##$D= (0..31)
0 1.2 0 0 0 0 0 0 0 0.06 0 0.03 0 0 0 0 0.0002 0 0 0 0 0 0 0 0 0 0 0 0 
0 0 0 
##$DATE= 1642751962
##$DBL= (0..7)
120 120 120 120 120 120 120 120 
##$DBP= (0..7)
150 150 150 150 150 150 150 150 
##$DBP07= 0
##$DBPNAM0= <>
##$DBPNAM1= <>
##$DBPNAM2= <>
##$DBPNAM3= <>
##$DBPNAM4= <>
##$DBPNAM5= <>
##$DBPNAM6= <>
##$DBPNAM7= <>
##$DBPOAL= (0..7)
0.5 0.5 0.5 0.5 0.5 0.5 0.5 0.5 
##$DBPOFFS= (0..7)
0 0 0 0 0 0 0 0 
##$DE= 6
##$DECBNUC= <off>
##$DECIM= 32
##$DECNUC= <off>
##$DECSTAT= 4
##$DIGMOD= 1
##$DIGTYP= 9
##$DL= (0..7)
0 120 120 120 120 120 120 120 
##$DP= (0..7)
150 150 150 150 150 150 150 150 
##$DP07= 0
##$DPNAME0= <>
##$DPNAME1= <>
##$DPNAME2= <>
##$DPNAME3= <>
##$DPNAME4= <>
##$DPNAME5= <>
##$DPNAME6= <>
##$DPNAME7= <>
##$DPOAL= (0..7)
0.5 0.5 0.5 0.5 0.5 0.5 0.5 0.5 
##$DPOFFS= (0..7)
0 0 0 0 0 0 0 0 
##$DQDMODE= 0
##$DR= 18
##$DS= 0
##$DSLIST= <SSSSSSSSSSSSSSS>
$$ [...]
##$SUBNAM2= <"">
##$SUBNAM3= <"">
##$SUBNAM4= <"">
##$SUBNAM5= <"">
##$SUBNAM6= <"">
##$SUBNAM7= <"">
##$SUBNAM8= <"">
##$SUBNAM9= <"">
##$SW= 18.0517287032376
##$SWIBOX= (0..15)
0 0 2 0 0 0 0 0 0 0 0 0 0 0 0 0 
##$SW_h= 3612.71676300578
##$TD= 16384
##$TD0= 1
##$TE= 0
##$TE2= 300
##$TE3= 300
##$TEG= 300
##$TL= (0..7)
0 120 120 120 120 120 120 120 
##$TP= (0..7)
150 150 150 150 150 150 150 150 
##$TP07= 0
##$TPNAME0= <>
##$TPNAME1= <>
##$TPNAME2= <>
##$TPNAME3= <>
##$TPNAME4= <>
##$TPNAME5= <>
##$TPNAME6= <>
##$TPNAME7= <>
##$TPOAL= (0..7)
0.5 0.5 0.5 0.5 0.5 0.5 0.5 0.5 
##$TPOFFS= (0..7)
0 0 0 0 0 0 0 0 
##$TUNHIN= 0
##$TUNHOUT= 0
##$TUNXOUT= 0
##$USERA1= <user>
##$USERA2= <user>
##$USERA3= <user>
##$USERA4= <user>
##$USERA5= <user>
##$V9= 5
##$VALIST= <valist>
##$VCLIST= <CCCCCCCCCCCCCCC>
##$VD= 0
##$VDLIST= <DDDDDDDDDDDDDDD>
##$VPLIST= <PPPPPPPPPPPPPPP>
##$VTLIST= <TTTTTTTTTTTTTTT>
##$WBST= 1024
##$WBSW= 4
##$XGAIN= (0..3)
0 0 0 0 
##$XL= 0
##$YL= 0
##$YMAX_a= 20256
##$YMIN_a= -24656
##$ZGOPTNS= <>
##$ZL1= 120
##$ZL2= 120
##$ZL3= 120
##$ZL4= 120
##$ABSF1= 10
##$ABSF2= 0
##$ABSG= 5
##$ABSL= 3
##$ALPHA= 0
##$AQORDER= 0
##$ASSFAC= 0
##$ASSFACI= 0
##$ASSFACX= 0
##$ASSWID= 0
##$AUNMP= <proc_1d>
##$AZFE= 0.1
##$AZFW= 0.1
##$BCFW= 1
##$BC_mod= 2
##$BYTORDP= 1
##$COROFFS= 0
##$CY= 11.3945322036743
##$DATMOD= 1
##$DC= 2
##$DFILT= <>
##$DTYPP= 0
##$F1P= 2.36226072786647
##$F2P= -0.459571619588291
##$FCOR= 0.5
##$FTSIZE= 0
##$FT_mod= 4
##$GAMMA= 1
##$GB= 0.15
##$INTBC= 1
##$INTSCL= 1
##$ISEN= 128
##$LB= 0.24
##$LEV0= 0
##$LPBIN= 0
##$MAXI= 10000
##$MC2= 0
##$MEAN= 0
##$ME_mod= 0
##$MI= 1.114404
##$NCOEF= 0
##$NC_proc= 0
##$NLEV= 6
##$NOISF1= 3.799351
##$NOISF2= 2.8
##$NSP= 1
##$NTH_PI= 0
##$NZP= 0
##$OFFSET= 15.70392
##$PC= 1
##$PHC0= -15932.74
##$PHC1= -8.199219
##$PH_mod= 1
##$PKNL= yes
##$PPARMOD= 0
##$PSCAL= 0
##$PSIGN= 0
##$REVERSE= no
##$SF= 200.130013532006
##$SI= 16384
##$SIGF1= 3
##$SIGF2= 2
##$SINO= 400
##$SIOLD= 16384
##$SREGLST= <1H.CDCl3>
##$SSB= 0
##$STSI= 0
##$STSR= 0
##$SW_p= 3612.71676300578
##$SYMM= 0
##$S_DEV= 0
##$TDeff= 0
##$TDoff= 0
##$TI= <>
##$TILT= no
##$TM1= 0
##$TM2= 0
##$TOPLEV= 0
##$USERP1= <user>
##$USERP2= <user>
##$USERP3= <user>
##$USERP4= <user>
##$USERP5= <user>
##$WDW= 1
##$XDIM= 8192
##$YMAX_p= 0
##$YMIN_p= 0
$$ End of Bruker specific parameters
$$ ---------------------------------
##NTUPLES= NMR FID
##VAR_NAME=  TIME,          FID/REAL,        FID/IMAG
##SYMBOL=    X,             R,               I
##VAR_TYPE=  INDEPENDENT,   DEPENDENT,       DEPENDENT
##VAR_FORM=  AFFN,          ASDF,            ASDF
##VAR_DIM=   8192,          8192,            8192
##UNITS=     SECONDS,       ARBITRARY UNITS, ARBITRARY UNITS
##FACTOR=    0.0002768,     1,               1
##FIRST=     0,             0,               0
##LAST=      2.2672688,     0,               0
##MIN=       0,             -24656,          0
##MAX=       2.2672688,     20256,           0
$$ Real data points
##PAGE= N=1
##DATA TABLE= (X++(R..R)), XYDATA
0@%%%%%%%%%%%%%%%%%%%%%%%%%%%%%%%%%%%mJ0j4J6j6J6j6J6j6J6j8K2k6L0l2
$$ 0 0 0 0 0 0 0 0 0 0 0 0 0 0 0 0 0 0 0 0 0 0 0 0 0 0 0 0 0 0 0 0 0 0 0 0 -4 6 -8 8 -8 8 -8 8 -8 8 -10 12 -14 16 -16
50a6L4l8M2m6N1n7O4p1Q1r2J04j22J45j77K22k93M18o62J340o406j9177K2894
$$ -16 18 -20 22 -24 27 -30 34 -37 44 -48 56 -66 79 -98 124 -169 249 -413 927 -5479 -24656 -1762
72a762J8369k0045r019K3260L033k7020j053K7400j247k5368M851K3288r059k1518
$$ -1762 16607 -3438 -12457 10803 13836 -13184 -14237 13163 11916 -13452 -8601 14687 5628 -15890
86a5890J2485J9758j5075j7261J7041J4236j8770j0933K0111P657k0968m361K1212
$$ -15890 -3405 16353 1278 -15983 1058 15294 -3476 -14409 5702 13359 -7609 -11970 9242
99I242J066k0953K203K0224n324j9068Q226J7494j0852j5530J3133J3219j5032
$$ 9242 10308 -10645 -8442 11782 6458 -12610 -4384 13110 2258 -13272 -139 13080 -1952
112a952j0677J6541P916j7582n032J8162K103j8286Q26J7942l643j7159O308J5964
$$ -1952 -12629 3912 11828 -5754 -10786 7376 9479 -8807 -7981 9961 6318 -10841 -4533 11431
126A1431q742j4409J0893J2562j2727j0450J4205Q139j5308n691J6016L198j6357
$$ 11431 2689 -11720 -827 11735 -992 -11442 2763 10902 -4406 -10097 5919 9117 -7240
139g240o74J6289j790j5883M179J5100o396j4020Q435J2650j0264j1034J1834
$$ -7240 -7914 8375 6585 -9298 -5119 9981 3585 -10435 -2000 10650 386 -10648 1186
152A186R190j3107p180J4064N048j4701k830J4992N91j4944J621J4570l760j3843
$$ 1186 10376 -2731 -9911 4153 9201 -5500 -8330 6662 7253 -7691 -6070 8500 4740 -9103
166i103N763J2824p591j1527R201R991j0551q269J1620O401j2369m432J2804K423
$$ -9103 -3340 9484 1893 -9634 -433 9558 -993 -9262 2358 8759 -3610 -8042 4762 7185
180G185j2935m30J2737j504j2251L336J1502n036j0510O550R316p875p919Q951
$$ 7185 -5750 -6180 6557 5053 -7198 -3862 7640 2604 -7906 -1356 7960 85 -7834 1117
194A117O396r810m774J0433L052j0757j336J0853l98j0681K102J0257l715r593
$$ 1117 7513 -2297 -7071 3362 6414 -4343 -5679 5174 4776 -5905 -3803 6454 2739 -6854
208f854N233Q695o580p612P760O340q732m930R485L413r992j819J0235K10j0231
$$ -6854 -1621 7074 494 -7118 642 6982 -1750 -6680 2805 6218 -3774 -5593 4642 4852 -5379
223e379J381R975k932r461M368Q734n682p817O841O719p810n479Q572M149r128
$$ -5379 -3998 5977 3045 -6416 -2048 6686 1004 -6813 28 6747 -1063 -6542 2030 6179 -2949
238b949k752R469J311r581J23R503j553r193K899Q705m169q024N341P170o360
$$ -2949 -5701 3768 5079 -4502 -4379 5124 3571 -5622 -2723 5982 1813 -6211 -870 6300 -60
253f0o186P248N066p957l848Q475K560q793j234Q916j15q830J450Q519k717q032
$$ -60 -6246 1002 6068 -1889 -5737 2738 5298 -3495 -4729 4187 4072 -4758 -3308 5211 2494 -5538
269e538L908P345m973o505N902N520o670m432P256L256p643k039P841Q05p839
$$ -5538 -1630 5715 742 -5763 139 5659 -1011 -5443 1813 5069 -2574 -4613 3228 4033 -3806
284c806M19P652j599p282K697O754l697o096M624N284n393m380O018L398o493
$$ -3806 -3387 4265 2666 -4616 -1919 4835 1138 -4958 -334 4950 -443 -4823 1195 4593 -1900
299a900k343O803J254o961j53O964r50o790K024O450l025n977L958N350m798m606
$$ -1900 -4243 2560 3814 -3147 -3300 3664 2714 -4076 -2052 4398 1373 -4604 -646 4704 -94 -4700
315d700N518L741o107k781O520J787o788p33O873l14o802J345O566k336o170L251
$$ -4700 818 4559 -1548 -4329 2191 3978 -2810 -3543 3330 3016 -3786 -2441 4125 1789 -4381 -1130
331a130N646m071m987M773M240n363l384N805K496o118j574O286O18o304L15O213
$$ -1130 4516 445 -4542 231 4471 -892 -4276 1529 4025 -2093 -3667 2619 3237 -3067 -2752 3461
347C461j246n958K116N583k924n125L676M527m321l843M867L071n295k251N606
$$ 3461 2215 -3743 -1627 3956 1032 -4093 -417 4110 -211 -4054 813 3884 -1411 -3662 1944
362A944J385n771m87N799m15n696J294N454k128n065K885M570l558l984M161L283
$$ 1944 3329 -2442 -2929 2870 2455 -3241 -1947 3507 1379 -3686 -801 3769 211 -3773 388 3671
378C671m613k527M955J720n164q94N233O6n176P38M997j509m710K223M320k887
$$ 3671 -942 -3469 1486 3206 -1958 -2852 2381 2447 -2729 -1991 3006 1497 -3213 -990 3330 443
394D43l809L447L243l924k614M304J923m592j198M767M58m837L05M782j043m626
$$ 443 -3366 81 3324 -600 -3214 1090 3013 -1579 -2777 1990 2448 -2389 -2084 2698 1655 -2971
410b971J779M347k455l975L065L509l606k958M072K327m426j642M673R29m799
$$ -2971 -1192 3155 700 -3275 -210 3299 -307 -3265 807 3134 -1292 -2934 1739 2668 -2131
425b131k00M807n25m706J228M491j896m174K509L757l039l274L504K713l867k117
$$ -2131 -2331 2476 1951 -2755 -1527 2964 1068 -3106 -597 3160 121 -3153 351 3064 -803 -2920
441b920M124J482m300q17M365J54m347N05M219j122m010J731L714k274l339K765
$$ -2920 1204 2686 -1614 -2431 1934 2088 -2259 -1754 2465 1343 -2667 -936 2778 504 -2835 -70
457g0K891l195k374L547J812l812j212L988N79m062O8M032o98l900J306L668j884
$$ -70 2821 -374 -2748 799 2611 -1201 -2413 1575 2154 -1908 -1840 2192 1494 -2406 -1100 2568 684
474F84l354K393K967k846k497L214J967l492j401L679Q13l778k21L780l66l685
$$ 684 -2670 -277 2690 -156 -2653 561 2528 -964 -2365 1314 2127 -1651 -1872 1908 1542 -2143
490b143R31L500j451l243J935K932k376k534K752K088l060j613L297J105l457
$$ -2143 -1212 2288 837 -2406 -471 2461 85 -2449 303 2391 -669 -2282 1015 2120 -1337
505a337n64L536K2l537N25L459j067l298J574L051k044k735K447K365k820j930
$$ -1337 -1901 1635 1657 -1880 -1355 2104 1037 -2261 -687 2364 320 -2415 32 2397 -423 -2353
521b353L120J447l329r39L467M12l511J21L467o55l330J137L131j599k849K002
$$ -2353 767 2214 -1115 -2054 1413 1825 -1686 -1565 1902 1247 -2083 -946 2185 586 -2263 -261
537b61K533k365k142K655J712k869j261L021P88l090l13L105j67l045O25K924
$$ -261 2272 -93 -2235 420 2132 -737 -1998 1023 1811 -1279 -1592 1513 1346 -1699 -1074 1850
553A850j066k733J480K486j865k181K189J826k470j429K682R96k832n50K920Q7
$$ 1850 784 -1949 -469 2017 152 -2029 160 1986 -484 -1913 769 1765 -1067 -1617 1303 1390
569A390k932L85K853q30k713J263K503j655k232J991J930k289j549K516J151k684
$$ 1390 -1542 -1157 1696 866 -1847 -584 1919 264 -1968 23 1953 -336 -1885 631 1782 -902
585i02p25K767L05k800J30K741n33k638R37K475j313k250J633J983j920j681K160
$$ -902 -1627 1140 1445 -1355 -1225 1516 983 -1655 -718 1757 444 -1806 -173 1810 -110 -1791 369
602C69J341k359r81K504N86k585j95K614j98k581O09K466r73k334J342K116j661
$$ 369 1710 -649 -1630 874 1460 -1125 -1320 1294 1096 -1485 -876 1590 617 -1717 -375 1741 80
619H0j869J964J558k194j223K385Q58k495m66K552P4k551L14K474o84k352J046
$$ 80 -1789 175 1733 -461 -1684 701 1559 -936 -1402 1150 1224 -1327 -1013 1461 777 -1575 -529
636e29K158j347j941J631J670j869j367K042J039k169o98K246L46k276JK249l30
$$ -529 1629 282 -1659 -28 1642 -227 -1594 448 1487 -682 -1380 866 1212 -1064 -1063 1186 856
653H56k174O67K046r83j883J274J678j532j437J759J146j931q29K060N24k147
$$ 856 -1318 -651 1395 412 -1471 -197 1481 -51 -1488 271 1417 -514 -1343 717 1241 -906
669i06j85K186j82k147N21K056q29j936J138J737j396j515J633J258j831r70J963
$$ -906 -1091 1095 913 -1234 -713 1343 514 -1422 -284 1453 57 -1458 175 1433 -398 -1368 595
686E95O65k057l43K082K9k065K80K005n76j906Q64J750j105j573J343J347j525
$$ 595 1260 -797 -1140 942 971 -1094 -814 1191 615 -1291 -427 1323 218 -1355 -12 1335 -190
703a90j103J671Q44j789n67J860K94j908J7J889k96j849N92J756q64j616J102
$$ -190 -1293 378 1222 -567 -1134 726 1020 -888 -871 1018 722 -1127 -535 1221 357 -1259 -157
720a57J435j331j229J524R90j670p17J774M32j837j46J839j32j807M07J722o61
$$ -157 1278 -53 -1282 242 1232 -438 -1155 619 1051 -786 -932 907 775 -1032 -625 1097 436
737D36j602Q98J454j110j266J304J036j421q26J534N74j600l24J632Q0j624J81
$$ 436 -1166 -268 1186 76 -1190 114 1150 -271 -1097 437 1011 -589 -913 719 799 -825 -644
754f44J571m15j502O37J404q66j260J059J085j219r00J372O63j469m34J543J90
$$ -644 927 512 -990 -353 1051 185 -1075 -16 1069 -150 -1050 322 985 -484 -918 625 815
771H15j566N3J565l13j519N44J438p77j300R67J152j140r84J300P71j403n45J480
$$ 815 -751 -698 867 554 -965 -421 1017 240 -1060 -93 1059 -81 -1065 235 1006 -397 -942 538
789E38L15j509r3J510j38j470L60J398n61j294P41J184r19j029J055Q62j174o79
$$ 538 853 -656 -749 761 623 -847 -487 911 350 -944 -203 981 62 -967 88 950 -224 -903
807i03J271M72j333k70J368N0j362J52J339l58j288N58J195p45j078R27R29j072
$$ -903 368 840 -493 -763 605 655 -707 -555 784 426 -862 -304 891 146 -932 -5 924 -148
825a48p59J201N65j288l54J330J55j350N8J328k58j283M62J195o39j092Q03R55
$$ -148 -907 294 859 -429 -783 547 702 -648 -590 738 480 -803 -341 854 215 -877 -74 881
843H81r35p99J038O46j140m54J179K76j222q4J216j00j199K89J137m50j064O15
$$ 881 -54 -853 185 831 -309 -763 416 692 -530 -614 602 502 -697 -408 729 279 -785 -170
861a70R62p69q31Q85P10j008n33J085L72j145k01J196Nj200J89J171l73j114N50
$$ -170 792 23 -808 77 787 -221 -754 331 703 -442 -643 553 558 -642 -453 718 345 -769 -219
880b19J018o99r03Q39P73r49o29J043M59j111k97J148J08j140N8J111k12j078
$$ -219 799 100 -803 36 809 -140 -769 274 733 -378 -675 473 581 -559 -501 610 398 -680
898f80L81J009n32r09O46Q08p61o84Q55N48r32l91R86K50j030q0J039q8j009K31
$$ -680 -299 710 178 -731 -85 723 -38 -722 133 681 -251 -642 344 594 -436 -516 523 435 -574 -343
918c43R89m09r15N45Q35o81p19P85N93q80m53R56K97j004j42J023j6j024J84R79
$$ -343 646 237 -678 -133 702 21 -698 87 680 -200 -653 303 600 -404 -546 477 461 -563 -379 600
938F00l35r14M60Q56n88p51O91O33p89n06Q58L72q98k40R25R8r32M8R16j85q68
$$ 600 265 -649 -189 667 79 -672 19 652 -137 -643 215 587 -311 -551 374 472 -460 -412 504 319 -549
959e49L13Q20m28p61N56O71o63n68P47M53q21l20Q69J82r11k6R06j13q95K51Q58
$$ -549 -236 584 156 -605 -49 622 -41 -609 138 591 -230 -550 319 501 -410 -436 470 357 -538 -287 571
980E71l89p97N11P21o28o16P26M89p76l83Q43K42q73j13Q86k4q70J61Q30k72p71
$$ 571 182 -615 -104 617 -11 -627 99 588 -188 -571 272 514 -359 -472 414 390 -480 -319 511 239 -532
1001e32L78P17m77o31N61N37o51m32P10L16p47k02P72R5p99K9P92j71p58K83P13
$$ -532 -154 563 86 -545 16 553 -98 -530 180 496 -251 -453 319 414 -385 -356 436 265 -493 -210 503
1022E03l95o52N06N71n99m83O81L75p35k58P84J23p95lQ00j22p75K44P33l46o86
$$ 503 108 -544 -38 533 -66 -549 132 507 -228 -486 298 421 -374 -377 423 301 -474 -230 503 157 -529
1043e29M60O07n46n11O08M20o74l15P05K11p33r3P30j7p15J24O92k11o66L08O11
$$ -529 -69 538 -8 -519 89 509 -165 -480 225 436 -297 -390 340 323 -392 -268 424 213 -453 -145 466
1064D66m11n48N05M62n79l70O39K68o71j67P10M7p05M5P02j57o92K94O28l83n62
$$ 466 55 -493 12 474 -105 -475 164 432 -239 -406 304 351 -354 -309 393 236 -456 -162 466 83 -479
1085d79M71M85n37m07O06L18o56k09O73J05o87kO76j06o48J96O12k87n65L63N11
$$ -479 -8 477 -60 -467 139 457 -199 -408 265 370 -317 -319 357 251 -397 -201 411 124 -441 -78 433
1106D33m44m30M91L62n46k86N89J85o12p8O22j1o19J10O02k01n74K98N17l79m54
$$ 433 -11 -441 50 412 -134 -420 169 354 -258 -336 286 275 -344 -234 368 167 -407 -109 408 29 -425
1127d25M56L92n28l02N79K18o15j18O28Oo29R0O21j85n93K75N37l44m89M17M12
$$ -425 31 423 -105 -407 172 390 -225 -343 285 291 -338 -248 373 188 -405 -130 407 63 -426 -9 403
1148D03m67l45N23K50n50j62N59R4n77MN62p7n56J67N24k50m81L21M29l69l80
$$ 403 -64 -409 114 364 -186 -348 211 305 -272 -268 294 217 -339 -172 352 102 -379 -58 371 2 -378
1169c78M30L16m93k19N26J31n36n6N60l9n54J17N38k18m92K85M47l57m05M29L30
$$ -378 52 368 -125 -344 182 313 -223 -279 281 242 -312 -195 343 125 -367 -82 365 8 -397 32 362
1190C62m79k32N01J53n24q4N48qn28Q3N18j54m88K20M54k80m07L42L46l81l04
$$ 362 -117 -349 152 305 -219 -303 245 237 -291 -208 310 156 -332 -112 342 62 -345 -3 343 -38 -342
1211c42M36K23m62j42M74Q3m91j0N01p6m85J57M42k25m25K94L80l45l21L99K52
$$ -342 94 317 -145 -287 187 270 -221 -231 270 194 -291 -134 308 83 -342 -48 332 -13 -334 65 317
1232C17m45j84M69J12m93j8M90o0m76J21M67j98m26K66L80l04l53L72K83m05k08
$$ 317 -128 -312 157 269 -224 -242 248 188 -288 -167 300 102 -324 -58 322 18 -335 37 320 -85 -293
1253b93M13J57m45q6M54J9m43L7M41j02m25J75L73k32l42K77L06l21k57L62K03
$$ -293 120 277 -168 -254 200 219 -224 -187 254 152 -273 -98 275 43 -299 -22 284 -37 -294 68 271
1274B71m01j40M27O5m35MM34p3m21J53L89k04l62K60L25l12k67L52K20l96j50
$$ 271 -130 -270 157 222 -213 -209 225 152 -269 -116 273 69 -293 -33 292 -20 -287 65 285 -111 -261
1295b61M09Q6m18k6M25l9m23J13L83j52l69K11L34k58k86K91K45l28k02L53J34
$$ -261 148 234 -184 -210 215 176 -247 -134 249 97 -272 -61 273 15 -271 20 265 -63 -265 88 222
1316B22l65q4L86L1l88L8L68q9l64J60L36k06l10K57K68k91k22L31J64l47j12
$$ 222 -143 -227 159 190 -198 -160 208 119 -245 -85 251 45 -265 -8 260 -31 -253 78 242 -105 -217
1337b17L73L7l89K9L87q4l71J38L40j85l12K25K74k70k34K99J91l41j21L42Q6
$$ -217 156 193 -196 -167 220 136 -235 -97 243 58 -254 -29 245 -25 -259 40 231 -110 -231 111 197
1358A97l58l3L59k3l40O9L32j19l05J55K82j97k64K57K12k76j61L03J16l29o9
$$ 197 -161 -194 165 142 -198 -129 203 84 -221 -66 216 19 -245 12 224 -52 -213 90 206 -123 -192
1379a92L36K6l43M2L25j07l04J51K95k01k68K43K26k79j81L07J29l23q8L44K3
$$ -192 144 170 -173 -131 194 87 -217 -66 229 28 -240 3 229 -50 -231 76 205 -118 -206 138 161
1400A61l37K4L28o1l22J17K96j52k71J88K48k21k20K51J81k75j26K82Q6k90l9
$$ 161 -176 -152 176 115 -207 -90 206 54 -217 -29 219 -2 -222 29 210 -65 -191 91 177 -113 -152
1421a52L01nl06N5K91j09k68J45K49j85k25K20J91k61j46K90R5l01n5L10kl05
$$ -152 149 144 -162 -107 184 75 -193 -48 201 16 -209 11 202 -59 -205 85 180 -121 -176 134 132 -173
1443a73M7K99r5k70J28K59j68k40K03K15k38j64K59J19k69q1K70M5k70nK81l9
$$ -173 -126 173 78 -192 -64 195 27 -213 -10 205 -33 -197 62 181 -88 -169 101 146 -124 -129 152 113
1465A13k68P0K57j13k33J40K18j79j95K11J52k32j18K55O9k58l4K73j8k73N1K63
$$ 113 -155 -85 172 59 -174 -34 184 5 -190 21 173 -59 -177 78 147 -111 -145 128 110 -163 -112 151
1487A51r2k44J42K15j66j92K05J59k27j22K42P9k50m1K67rk60L8K54p1k32R9K22
$$ 151 59 -185 -43 172 6 -186 19 178 -49 -171 71 150 -100 -141 126 117 -143 -105 149 78 -154 -55 167
1510A67j29k12J70J71j86j47K06J11k21p4K32L9k34j4K32j7k46N4K42j07j97J34
$$ 167 38 -174 -4 167 -19 -166 40 151 -70 -144 88 127 -107 -121 111 94 -152 -98 144 37 -160 -26
1532b6J86j68j55J88J27k03r5K26N4k45qK32j2k34O1K32r9k19J30J96j66j48J62
$$ -26 160 -8 -163 25 152 -51 -146 80 134 -111 -119 113 101 -133 -72 160 61 -158 -28 168 2 -146 16
1555A6J32k01r7K03P3k12m5K17J5k24K9K07n6k03Q9J81j06j72J35J55j51j33J74
$$ 16 148 -53 -150 53 126 -86 -131 86 101 -123 -94 113 57 -146 -57 124 18 -154 -19 136 -15 -148 26
1578B6J01j97o1K19K7k10nK18l4k05O9J89j00j74J31J56j60j37J74J05j83p3J94
$$ 26 127 -70 -131 88 115 -95 -100 118 84 -121 -52 137 37 -137 -6 150 -10 -147 27 132 -51 -124 70
1601G0L9k11mK05k9j94M8J91p4j74J01J59j15j49J41J25j63r8J73P1j66n2J84
$$ 70 109 -102 -106 99 70 -124 -76 115 41 -133 -32 127 12 -137 4 129 -34 -132 41 112 -54 -106 78
1624G8J9j85J4J74l4j83P0J64r1j57J33J22j44j05J68O6j71n2J80J5j83J9J76
$$ 78 97 -88 -74 100 66 -117 -47 117 26 -131 2 124 -20 -125 43 109 -62 -114 66 81 -102 -83 93
1647I3l7j81P6J66r4j57J18J28j31j08J41R1j52p0J72M5j72j9J83j1j69L4J56
$$ 93 56 -125 -49 117 23 -134 -16 112 -19 -127 14 105 -47 -117 55 100 -72 -91 92 81 -88 -54 102
1670A02n4j52P4J40j02j24J22J07j33q3J43O0j55l5J55Lj62J9J62m7j48O5J54
$$ 102 48 -104 -30 110 8 -116 6 113 -20 -103 40 100 -55 -90 65 68 -94 -75 87 40 -108 -43 111
1693A11j08j23J19J08j38q0J43O0j58l0J57J4j57J5J51l1j43N5J37p5j24Q6J11
$$ 111 3 -120 -1 107 -31 -111 32 92 -66 -96 61 75 -82 -67 84 53 -90 -35 102 27 -97 -11 100
1716A00j00r7J18Q0j40m6J22M9j45j7J36Oj56K8J36m6j25O9J15q9j04J21P9j28
$$ 100 0 -97 21 101 -39 -85 37 86 -59 -76 60 66 -90 -62 74 28 -97 -28 87 -2 -106 15 94 -34
1740c4o1J33M0j30j8J36j0j37K6J48n0j30P1J18r8r6R9Q7j11o9J15N7j36k7J26
$$ -34 -95 38 78 -52 -70 66 56 -81 -55 93 43 -87 -16 102 4 -92 7 94 -17 -86 29 86 -50 -77 49
1765D9J9j34QJ15j0j26L1J18n8j04O4J07q9q3J02P1r6o2J09M4j21j2J18j6j14
$$ 49 68 -66 -58 57 47 -79 -48 70 12 -92 -28 79 -10 -93 9 80 -16 -78 31 75 -46 -58 60 44 -70
1790g0L5J18n4j03P4R8r2p1Q9O9j16m5J04L1j16j6J28pj22K8J14m6j16O5R6p8
$$ -70 -35 83 29 -74 0 98 6 -65 24 93 -23 -68 36 67 -49 -65 63 56 -66 -38 76 30 -86 -21 75 -3
1816cp4P0P1q9n6J04M2r8k7J08J4j02mJ09j9j03L3R6n2q9P4P5p3p6R1O0j08l4
$$ -3 -77 -7 64 -25 -81 23 65 -33 -60 48 62 -40 -44 65 46 -57 -24 72 20 -69 5 80 7 -69 22 82 -26 -60
1844f0J09Qj04j1J11j8j07M0R8n2q6O5P8p9p2Q3N8q6m8J12K0r6j3J03mj04J7R5
$$ -60 49 57 -47 -58 53 35 -72 -32 66 14 -72 -7 71 -8 -80 3 61 -25 -73 39 59 -37 -50 53 49 -55 -38 57
1872E7k0r7M2R9o7p3N8P9q0o4R7L5r1k7R3J6j05pJ11k6r6M4Q5n2q5P3O5q1n2Q8
$$ 57 37 -60 -18 81 14 -59 -1 78 -2 -66 31 66 -25 -52 41 57 -48 -55 56 30 -66 -22 63 11 -74 -1 64 -17 -69 19
1902A9M0r5k0R4J3j01NR8j1q7K6Q9m9q1N4P3o9n8O7N0o3m9P7L9q9j0P6Mq2NQ8
$$ 19 59 -36 -56 38 51 -50 -45 53 42 -45 -19 70 21 -60 -6 67 -2 -60 7 57 -6 -55 22 61 -28 -38 38 42 -40 -35 53
1933E3l2p6L1P8m3p2P2M2p0m1Q0L8r4j2P9Lq7L0P4l2p1L6Q3o0o3O0O0q4l2P2L1
$$ 53 21 -55 -24 54 11 -61 11 53 -17 -58 22 60 -34 -46 33 36 -51 -21 53 21 -50 -14 69 9 -54 6 66 -18 -50 22 53
1964E3q5j3Q4jq0J0P1j0q3L3O9l6o5L7O8n9n3O8M3o9m0Q9J7q1kP6j6p4K7P2m0
$$ 53 -32 -45 39 38 -42 -32 39 29 -54 -21 48 12 -53 -16 52 -7 -60 8 51 -18 -58 31 48 -33 -35 41 25 -49 -22 50 10
1995A0n9M3O2n3n5P1L7o9l3P4J5p2mP0Jq2K0P3l6o2L4O7m9o0N4M9o1l9O6K7o4
$$ 10 -49 -6 56 3 -52 19 56 -13 -46 28 43 -29 -33 37 38 -44 -24 49 13 -49 -15 52 3 -57 -3 46 -15 -54 12 39 -25
2026b5j6P4Lp6QO8j3o9K5O3m0m9M7M8n3l1N8L0p0j3O2J8q3J8O0j7p8K7O9k7o3
$$ -25 -41 33 36 -40 -32 36 23 -46 -21 42 2 -47 0 48 -5 -36 22 52 -18 -31 31 49 -34 -16 44 27 -51 -24 45 18 -45
2057d5M3M2m7m2N3L8p3j9P2J0o8mO9ko4J6N3oo7L2N0k9n4M7L7m6l1N4K3n9j2N9
$$ -45 -2 40 -7 -49 4 42 -31 -50 22 32 -36 -40 29 27 -37 -21 32 26 -41 -9 41 12 -42 5 42 -4 -35 19 42 -17 -29 30
2089C0Qo8KO2j5o7K2P0l0o0M8L6n5l1N7J6n9rO7Mp4RP0k3n2K8N3m1l8M5L7m9l6
$$ 30 38 -30 -28 34 19 -48 -26 44 14 -46 2 38 -17 -48 9 25 -34 -43 24 28 -46 -37 33 10 -42 -14 39 -2 -40 5 42 -7 -43
2122d3N8K2m9k0N3J8o7KO7mo3%O0j9n7L2M6m6l8M0M0n1k6N1J4n3pM8No4J4O2k4
$$ -43 15 37 -12 -32 21 39 -28 -26 41 37 -26 -26 34 15 -42 -10 36 -10 -48 -8 32 -19 -45 6 20 -33 -40 8 13 -51 -37 25 1
2155Am3K8N8m9l7M9L3n5k4N8J7n9j0O0Kn3KO2k3n2J8N7l9l3K4M0m7l3N1K0m8j3
$$ 1 -42 -14 44 -5 -42 7 40 -15 -39 19 36 -23 -33 27 29 -24 -22 40 17 -35 -17 40 1 -32 -8 32 -15 -48 3 23 -25 -38
2187c8N3Nn3ON3j5n6L0M8l3l8L2M2m0k8M0K3l7j6M6J1n6LN0j4n0K1M9l0m5K7L8
$$ -38 15 20 -33 -27 26 11 -45 -15 33 0 -38 -6 36 -4 -32 8 31 -6 -22 24 35 -21 -18 32 18 -32 -11 38 8 -37 -10 28
2219B8l1l8L6L1m6j4L8J5m3oL7Rm1QM4j8m4K5M6l4m0M0L6m5j7L7J6m5oM3Jm4Q
$$ 28 -3 -41 -5 26 -20 -34 4 19 -24 -30 7 16 -25 -17 27 9 -35 -10 36 2 -38 2 38 -7 -24 13 29 -16 -22 21 22 -22 -14
2252a4M1j1m6K6M4l0l4L0K9l8l0M5J0m4j5N4Ln0JM5jn3J3M6j9l6K0L8k5l6L6L0
$$ -14 27 16 -30 -4 40 10 -24 6 35 -3 -33 12 22 -22 -37 17 20 -30 -29 16 15 -38 -25 21 2 -34 -14 24 -1 -37 -1 29
2284B9m4j3L4K0l9j6N7qm2JN3k1l3K4K6k8l6M7K5m6j8M1Om1kL1Kl9KN1k0l2K2
$$ 29 -15 -28 6 26 -13 -29 28 20 -22 -21 32 11 -22 2 28 0 -36 11 36 -10 -28 13 19 -22 -24 7 9 -30 -28 23 3 -29 -7
2317gL8l5k4K4L8l9k7L6K0m1rL2K7l9j6M4Jm4J9L3j3m3K6K8k9k8L2K2l5j4L4J2
$$ -7 31 -4 -28 -4 34 -5 -32 4 24 -17 -26 6 33 -6 -22 22 23 -21 -2 31 18 -25 1 29 0 -28 4 26 -9 -23 11 23
2349B3n1PL8j0m0J8L8j4m5K3M2l6k4M0J4m8jL7Pl8lL9On4J5M5j2m0K3K6k0k7K9
$$ 23 -28 -21 17 7 -33 -15 23 9 -36 -13 29 -7 -31 9 23 -25 -26 11 18 -20 -23 16 22 -32 -17 28 16 -24 -1 25 5 -22 7
2382GJ9k3k5L3J3k9j6L4Rm6oM5om3J3L6j8l1K9L0k5l0M4J7m5jL4kl6lN0j8k5O
$$ 7 26 3 -22 11 24 -5 -21 13 22 -24 -30 15 9 -34 -21 15 -3 -34 -5 25 0 -30 14 31 -14 -15 19 17 -19 -22 28 10 -15 -9
2416iL9j9k2K3J5k2k4K6K4m2j6M2Kl3kL1kk0nL2ol7J0L5k1l1L0K0k2k1K9J9l4
$$ -9 30 11 -11 12 27 5 -19 7 31 -11 -27 15 17 -16 -18 13 11 -9 -14 18 12 -25 -15 20 -1 -32 -2 18 -4 -25 4 23 -11
2449a1j4L4J1l4lL6j4l2J7L1j4k7K6K4l2j8L6J0m0j0L2Qm2PL4pl0PK7j1k6J4K5
$$ -11 -25 9 20 -14 -17 19 5 -27 -10 21 7 -20 6 30 -2 -20 16 26 -14 -24 8 16 -26 -19 15 8 -22 -15 12 1 -25 -11 14
2482A4k2k2K3K5k8j8L1K0m7OL3%k7nL0Nl9J5L0k0k4K5J9j7k3K4Qk8lK4Ll2KL4
$$ 14 -8 -30 -7 18 -10 -28 3 23 -24 -18 15 15 -12 -17 13 18 -21 -6 24 4 -20 5 24 7 -16 8 16 -12 -15 9 12 -20 -18 16
2516A6j6k4RL4k4j7K0J6j8k3K4J8k6pM0jl3rM1ql5QL5j1k5J7J8j6j8J7K7l1j4
$$ 16 0 -24 -15 19 -5 -22 -2 14 -4 -27 -3 15 -11 -18 22 21 -12 -21 20 12 -23 -15 20 9 -16 1 19 3 -15 2 29 -2 -16
2549a6K5J7l4lK6ol6JM1j7k5PL0j8j0J9J1k3j2K3J3l1j2M0Ol2KL2j0j5lK9k0j8
$$ -16 9 26 -8 -11 15 9 -27 -26 15 -2 -27 -20 10 -8 -18 1 12 -11 -23 0 13 -18 -30 10 16 -16 -14 18 8 -7 -10 19 -1 -19
2583a9J0K7k0k0K2K0k7j3K7J1l3QK4ok8NK8j9k0K4J2j5j2J9Nk5nK9mk4LK3lk1
$$ -19 -9 18 -2 -22 0 20 -7 -20 7 18 -15 -7 17 11 -17 -12 16 -3 -23 1 13 -2 -14 5 10 -15 -20 9 5 -19 -16 7 4 -17
2617a7NK7j0k2K4J2j6j8J6J6k3pK1Lj5oK1jk1NK2mk1oK9j8j9K8J4k2k6L1K0l5
$$ -17 -12 15 5 -17 7 19 3 -15 1 17 -6 -13 8 11 -4 -10 11 10 -11 -6 16 12 -9 -15 14 -4 -23 5 19 -3 -29 2 22 -13
2651a3mK3Nl0PK0kk2PK3qj8J4J9k3MJ0Pk5%J1J1k7JK8qk9RK2qk0NK2j6k3J8J5
$$ -13 -17 6 11 -19 -12 8 6 -16 -9 14 6 -12 2 21 -2 2 12 19 -6 -6 5 16 -11 -10 18 10 -19 -10 12 4 -16 -11 11 -5 -28 -10 5
2688Ej6j2K6Pk4oK4lj8OJ4pj4RJ9qk1K3J4j7j0J8Pj4j6K8nk1NK1pk6J9J7j4j7
$$ 5 -11 -23 3 10 -14 -20 4 1 -17 -11 3 -4 -18 -9 10 2 -19 4 18 1 -9 9 16 2 -14 14 9 -12 -7 14 7 -19 0 17 3 -14
2724a4J6J4k1j6K2Qj5j4K4Lk2MJ8qj8MK2jl0L0Pj4j6J8J9j7rJ1J4k7JK1qj2oJ7
$$ -14 2 16 -5 -21 1 9 -6 -20 4 7 -15 -11 7 -1 -19 -15 7 6 -24 6 13 -1 -17 1 20 3 -6 5 19 -8 -7 14 6 -6 -12 5
2760Ej1rRJ6j1j5MJ8j3nJ6kk0RJ3kj3%J9pj2J5J0j6j2J3J5j9pK5jrj4J4J2j5r
$$ 5 -6 -15 -6 10 -1 -16 -12 6 -7 -12 4 2 -18 -9 4 2 -11 -11 8 1 -11 4 14 -2 -14 -1 14 -5 -12 13 12 3 -11 3 15 0 -9
2797iK6j3j4JJ1oj0OJ8k0j2J8J0j7rK4poj0K8j3rQJ8j8j2J9J2j8jJ8qj1%J1Kj8
$$ -9 17 4 -10 -9 2 -4 -14 -8 10 -10 -22 -4 6 -11 -20 4 -3 -9 -19 9 -4 -13 -5 13 -5 -17 2 14 -4 -5 13 5 -6 -6 5 7 -11
2834a1JL2qk0QRj0j2MJ2lj7RJ7j2j0J3Rk4mJ8Nk6MK6qj6%J8oj5K0Oj4PRNk0nK0
$$ -11 -10 22 14 -6 2 11 1 -11 -7 5 2 -15 -6 11 -1 -11 2 11 -13 -17 1 6 -20 -16 10 2 -14 -14 4 -2 -17 3 9 -5 2 11 16 -4 -9 11
2874A1Qk9NJ7rnkRkj5ONj5KRMj4%J1Oj2lJ4kj2ROJj2j0K7j1j5K9jj7LRPj5qJ8
$$ 11 19 -10 -5 12 3 -2 -4 5 3 -12 -6 -1 -16 -14 -5 -1 -15 -15 -4 2 -10 -13 1 -1 -13 -4 2 3 -9 -19 8 -3 -18 11 10 -7 -4 5 12 -3 -11 7
2916GLj6MJ0mj3J0Rkj7J8%j8%PLolJ3j2kmJ3lj0J0Klj7MJ6Kj3J2J3j6j1J9Lj2
$$ 7 10 -6 -2 8 4 -9 1 10 8 -9 9 9 -9 -9 -2 1 -5 -8 5 -7 -9 -13 0 -3 -13 -3 -1 -4 -21 -17 -1 1 -12 0 13 -3 -14 5 8 -4
2956dKJ7%j9pK2oj9RK0rj0MJmjPMj3qK2j1qNJ4qoLJ3j4jPRj4pJ6kjjQKj0KJ5q
$$ -4 -2 15 15 -4 -11 11 5 -14 -5 15 6 -4 0 1 -3 -4 3 7 -6 -14 8 -3 -11 -6 8 0 -6 -3 10 -4 -5 2 11 -3 -10 6 4 3 2 10 12 2 4 19 11
3001A1k1J7%%j4J0Jr%PRj4lJ7j7mJJ0j0lJ3j%j0PJ0j2nJ0J1k3J3NKqORqoMLkn
$$ 11 -10 7 7 7 -7 3 4 -5 -5 2 11 -3 -6 11 -6 -10 -9 1 -9 -12 1 0 0 -10 -3 7 -5 -10 0 11 -12 1 6 8 0 6 15 7 1 5 8 6 1
3044AKMkj6RMj2RQLk0JJ1jrlJ6rrJ3jpoJ3Mj1MJLj3%J2lkMRjoPNj0rK1j1qmJ0
$$ 1 3 7 5 -11 -2 2 -10 -1 7 10 -10 -9 2 1 -8 -11 5 -4 -13 0 -1 -8 -14 -1 3 -8 -4 -3 0 -13 -13 -1 -4 -6 -2 7 6 0 7 12 2 -7 14 3 -5 -9 1
3091ANlrQjqkJ0jj3LJ3j2JOjnLPRj0pJ7j3nMQ%j7J0J3j1j0J4J0j1oJ4lnmLjoK
$$ 1 6 3 -6 2 1 -7 -9 1 0 -13 -10 3 -9 -8 -2 -3 -8 -5 2 11 1 -6 11 -2 -7 -3 5 5 -12 -2 11 0 -10 4 14 3 -3 11 8 3 -1 2 1 -5 -3
3136cPjj2KjPM%Mj6nJ2Nj3jQPj2J0QqkjJ4j3%%J3poJ3mj6PRJj8OJ2ponPojKKk
$$ -3 4 3 -9 -7 -8 -1 3 3 7 -9 -14 -2 3 -10 -11 -3 4 -8 2 10 2 0 -1 13 0 0 0 13 6 0 13 9 -7 0 9 10 -8 -2 10 3 -3 -8 -1 -7 -8 -6 -4 -6
3184flJ1mj0QnJ1j6NPJo%J3pKLJ1qpOJq%KPqJJ0lnjJ1pj7J1Pj3rJ2Rj0mRKrJn
$$ -6 -9 2 -2 -12 -4 -9 2 -14 -9 -2 -1 -7 -7 6 -1 1 4 15 7 0 6 7 -1 -1 1 8 0 1 11 8 3 2 13 6 -11 0 7 -6 -15 -3 6 -4 -8 1 3 -6 -5 -10
3232a0J2pjJ0nJM%Mj2PJ2j2nRNnrPlJoJ9ommJ2j4j2J1Nj2qRJ0j0pJ2Plj4J3JJ
$$ -10 2 -5 -6 4 -1 0 4 4 8 -4 3 15 3 -2 7 12 7 -2 5 2 3 -3 16 10 6 2 14 0 -12 -1 4 -8 -16 -7 3 -7 -14 -2 5 2 -12 1 2 3
3276CK%ppQJ2pnRkJj5J1MlpJ0loJ0njjLlmOpMmqQJ6j8j1J6Lkj0J7nrLKKoMJ2p
$$ 3 5 5 -2 -9 -1 11 4 -1 8 6 7 -8 3 7 4 -3 7 4 -2 8 3 2 1 4 1 -3 3 -4 0 -4 -12 -4 12 -6 -17 -1 2 0 -10 7 2 -7 -4 -2 0 -6 -2 10 3
3325CjMQj4jRQrrJ3j2jJRnj5J1Oj1OlQLj9RMj3lK0nj2QRr%OJNj9QPnnJ8mqlJ8
$$ 3 2 6 14 0 -1 8 16 7 -2 11 -1 -2 -1 8 3 -12 -1 5 -6 0 -3 5 8 -11 -2 2 -11 -14 6 1 -11 -3 6 -3 -3 3 4 9 -10 -2 5 0 -5 13 9 1 -2 16
3373A6nk0J7mKj0%L%j2QJ5j2%kQqqK0rqnJ3Mj4kJ9ojJK%pOOm%LkrMPjj0ROlj3
$$ 16 11 -9 8 4 6 -4 -4 -1 -1 -13 -5 10 -2 -2 -4 4 -4 -12 8 -1 -9 -14 -1 3 -11 -13 6 0 -1 0 2 2 -5 1 7 3 3 6 4 -5 -1 6 5 -5 4 10 7 -6
3421fPQj4nJ1Kj5KPOj2J3Mqj5kJ3mjkJ6j2kJNOnJJ2j8jJ8lkqJ4mnoJ2oqJ6nj1
$$ -6 1 9 -5 -10 1 3 -12 -10 -3 3 -9 4 8 0 -15 -17 -4 -8 -9 -11 5 -7 -9 -8 -3 3 -2 -1 11 -7 -8 10 7 5 -3 11 7 2 -4 8 2 -6 10 5 -6
3466fpJ3J%j0J2jlpJ1j0j%J0j2kRNrLJ0l%pQnOnLLj4JJ5kj1J0Oj4pK0mrj5J4J
$$ -6 -13 0 1 1 -9 3 2 -1 -8 3 -7 -8 -8 2 -10 -12 -3 2 -7 -4 6 3 3 -4 4 -1 5 0 3 6 -8 -7 8 6 -5 5 11 -3 -10 10 6 -3 -18 -4 -3
3511cqRjOrjNMj3LLKj1PLqlJ7JqNNOj4MQj3j%RJj5QRJjoKjj0Pjj1NMjmOJ3nj6
$$ -3 -11 -2 -3 3 -6 -7 -2 2 -11 -8 -5 -3 -14 -7 -4 -12 -15 2 3 -5 0 5 11 -3 1 9 -4 -5 -5 4 5 -10 -2 7 8 7 1 3 2 -8 -1 -2 -13 -8 -4 -5 -9 -3 10 5 -11
3562a1NQj0MPMj2%RLq%PkjlQpLLLj1MjPrQM%j1nRKk0QlJ0j0R%qMLMj0oJ3lkmJ4
$$ -11 -6 2 -8 -4 3 7 -5 -5 4 7 -1 -1 6 4 3 0 8 1 4 7 10 -1 3 2 9 0 8 12 12 1 -4 5 7 -13 -5 -8 2 -8 1 1 -7 -3 0 4 -6 -12 1 -2 -4 -8 6
3613FJj0J2Mkj3JJ4j0KLKoj5J5nKkP%MqOnlllRj5LNj5J3kQnKM%mj1J6JkJJ1j0
$$ 6 7 -3 9 13 11 -2 -1 13 3 5 8 10 4 -11 4 -1 1 -1 6 6 10 2 8 3 0 -3 -6 3 -12 -9 -4 -19 -6 -8 0 -5 -3 1 1 -3 -14 2 3 1 2 13 3
3660Cj1J0mPlKLkpLlNj3Rn%LlKkj1J8qKQlj1JJ7olkQkplRjj0PQkj1K2oj1Q%J3
$$ 3 -8 2 -2 5 2 4 7 5 -2 1 -2 3 -10 -1 -6 -6 -3 -6 -4 -6 -17 1 -7 -5 3 0 -11 -10 7 1 -2 -4 4 2 -5 -8 1 0 -10 -3 5 3 -8 14 8 -3 5 5 18
3709A8j7j3J9klj0J3kj5RJmMlOj1kjNMj0OJmPJ2krJJojOjMlMMmqJJ3qlOJk1RP
$$ 18 1 -12 7 5 2 -8 5 3 -12 -3 -2 -6 -2 -5 1 -10 -12 -13 -8 -4 -14 -8 -7 -11 -4 8 6 -3 -2 -1 -7 -8 -2 -3 1 -2 2 6 2 -6 -5 8 0 -3 3 4 -17 -8 -1
3758aJmlLJjjLj0nJ3LpnQmNrJ8rLmMLmjJ7j7MLJnjMNpnRolj0J6j2mJ8ppjPRj0
$$ -1 0 -4 -7 -4 -3 -4 -5 -2 -12 -17 -4 -1 -8 -13 -5 -9 -4 -13 5 -4 -1 -5 -1 2 -2 -3 14 -3 1 4 5 0 -1 3 8 1 -4 5 -1 -4 -14 2 -10 -14 4 -3 -10 -11 -4 5 -5
3809enOjjlLJ3j8JPPnlNlKmRJj3J0JljOjj5J4Kj1lQkjj6J1Op%Rm%%MNj0lKLpL
$$ -5 -10 -4 -5 -6 -9 -6 7 -11 -10 -3 4 -1 -4 1 -2 0 -4 5 6 -7 3 4 1 0 6 5 -10 4 6 -5 -8 0 -2 -3 -19 -8 -2 -9 -9 0 -4 -4 -4 0 5 -5 -8 -6 -3 -10 -7
3860gJ2lnJJ6j2j%MlmJQlklkoKJ4lm%LkrOjmjJJjj1J4KkoJ0omLjQjQkjNloMJk
$$ -7 5 2 -3 -2 14 2 1 1 5 2 -2 -1 7 4 2 -1 -3 -9 -7 7 4 0 0 3 1 -8 -2 -3 -7 -8 -7 -6 -7 -18 -4 -2 -4 -10 0 -6 -10 -7 -8 0 -1 7 5 4 9 6 0 4 5 3
3914C%rPJlkLRmj6J3%moMJ3k2JJ2np%J2JpJ0ommPPj0KPMrOLkj2J6jqmrJ6pJjP
$$ 3 3 -6 1 2 -1 -3 0 9 5 -11 2 2 -2 -8 -4 9 -13 -12 0 -5 -12 -12 0 1 -6 4 -2 -6 -10 -3 4 -6 -4 3 7 -2 4 7 5 -7 9 8 0 -4 -13 3 -4 -3 -4 3
3964CJkl%Lj3RnLj2OJ0rKJ5mj9J2jJrJ3kj2LPJ3j5JQPlOjj4lNJljmRlj0OJ1qm
$$ 3 4 2 -1 -1 2 -11 -2 -7 -4 -16 -10 0 -9 -7 8 4 -15 -3 -4 -3 -12 1 -1 -13 -10 -3 10 -5 -4 4 11 8 14 13 -1 -4 1 2 -1 -2 -6 3 0 -10 -4 7 -1 -5
4012ej%j2kJ9omJOMj3PJ0rnRJqNkRqNJ1qkPjknPkjrKQj5LRK%pkPr%LNj2jNLpL
$$ -5 -6 -6 -18 -20 -1 -7 -11 -10 -4 0 -13 -6 4 -5 -10 -1 0 -8 -3 -5 4 -4 1 12 4 2 9 8 6 1 8 6 5 -4 -2 6 -9 -6 3 5 5 -2 -4 3 -6 -6 -3 2 -10 -11 -6 -3 -10 -7
4066gJ2mmJPrLOQj5kNKqMJ2j0pJ0o%j2RNpKRlJj7K1lJj1OomOM%j1J0J4j9ONkr
$$ -7 5 1 -3 -2 5 -4 -1 5 13 -2 -4 1 3 -5 -1 11 1 -6 4 -2 -2 -14 -5 0 -7 -5 4 1 2 -15 6 3 4 -7 -1 -7 -11 -5 -1 -1 -12 -2 12 -7 -1 4 2 -7
4114gLNPj3NNLJmOnoNlLknJj0pK1njOJlj%KjoQK%j0J1%j1nJ1NJJmKj0OJ1j5%J0
$$ -7 -4 1 8 -5 0 5 8 9 5 11 6 0 5 2 5 3 -2 -1 -11 -18 3 -2 -3 3 4 1 0 0 2 1 -5 3 5 5 -5 6 6 -5 -10 1 6 7 8 4 6 -4 2 13 -2 -2 8
4165HpjkPOnj6J1r%KLOj6OLKj9J3RrPmQj2JJ0Nj1%QJkrJ0kKkQqoPQj2oJ1jnmJ3
$$ 8 1 0 -2 5 11 6 -10 1 -8 -8 -6 -3 3 -13 -7 -4 -2 -21 -8 1 -8 -1 -5 3 -9 -8 2 7 -4 -4 4 5 3 -6 4 2 4 2 10 2 -4 3 11 -1 -7 4 3 -2 -6 7
4215GroNNjj2MKmk%J2qOkok%RNjoLRj6J2Rnj7PJ1rnjRpqOJ4j7nJ8oMnj%oKJOj1
$$ 7 -2 -8 -3 2 1 -11 -7 -5 -9 -11 -11 1 -7 -1 -3 -9 -11 -11 -2 3 2 -4 -1 8 -8 4 13 8 -9 -2 9 0 -5 -6 3 -4 -12 -6 8 -9 -14 4 -2 2 -3 -4 -4 -10 -8 -7 -1 -12
4267a2J0Oj0qJ0J0qpjRrJPJ1j5LJ5j2JlJ0j0mPlpJPkM%rJ5j2lKkklJ1jrlJ7%j
$$ -12 -2 4 -6 -14 -4 6 -2 -9 -10 -1 -10 -9 -2 9 -6 -3 12 0 1 -2 8 -2 -6 1 -2 -9 -8 -1 -3 1 1 -8 7 -5 -8 -6 -8 -10 -13 -2 -3 -12 -15 2 2 1
4313AjJ1k0LnJ8j3qK0oj0J1j%jJNnOmjJkLMj1mJ5mjlPpj3QJo%J0Lj1JJ1%rMRj
$$ 1 0 11 -9 -6 -11 7 -6 -14 6 0 -10 1 0 0 -1 0 5 0 6 2 1 2 0 3 7 -4 -8 7 3 2 -1 6 -1 -14 -6 -5 -11 -11 -1 2 -9 -8 3 3 -6 -2 7 6
4361Fj3J0Qj0KMPnmkQj0jlkOmJ1poNNlqMlPj6JNK%LjljMKk%Rkq%%LqJ1LllOmK
$$ 6 -7 3 11 1 3 7 14 9 5 3 11 1 0 -3 -5 1 -3 8 1 -5 0 5 2 -6 -2 -5 2 -14 -13 -8 -6 -6 -3 -4 -7 -8 -4 -2 -4 -4 5 3 -5 -5 -5 -2 -10 1 4 1 -2 4 0 2
4415BlJNnrJ2Kj5JOJ0j3MnRrRKj7jQQrOkPnj1K1oj1PJLrJ5n%lMnLlK0Jk0ljLr
$$ 2 -1 0 5 0 -9 3 5 -10 -9 -3 7 -6 -2 -7 2 -7 2 4 -13 -14 -6 2 -7 -1 -3 4 -1 -12 9 3 -8 -1 0 3 -6 9 4 4 1 5 0 3 0 20 21 1 -2 -3 0 -9
4465iOLqoNPnJJRj0rJ2kkMJ0Kqj2J0OrMkjlMMj0%RJj0ORKk2J4JJj0oK1j6oNP%
$$ -9 -3 0 -8 -14 -9 -2 -7 -6 -5 4 -6 -15 -3 -5 -7 -3 7 9 1 -11 -1 5 -4 0 -2 -3 -6 -2 2 -8 -8 1 2 -8 -2 7 9 -13 1 2 3 -7 -13 8 -8 -14 -9 -2 -2
4514bj0NPn%mkOlMNllPnMpK2j9nNPj1mJ5oMj0J3Nj1Ml%JoRokmJ8j5nKo%nPJ6j0
$$ -2 -12 -7 0 -5 -5 -9 -11 -5 -8 -4 1 -2 -5 2 -3 1 -6 16 -3 -8 -3 4 -7 -11 4 -2 2 -8 5 10 -1 3 0 0 1 -5 4 -2 -4 -8 10 -5 -10 -8 -14 -14 -19 -12 4 -6
4564foJ%mMR%kN%lJK%pNQ%j5%MRqoJ7prlNokO%Mj2J0NokMpNlJ0%lJJJJJjPJkJ
$$ -6 -12 -11 -11 -15 -11 -2 -2 -4 1 1 -2 -1 1 1 -6 -1 7 7 -8 -8 -4 5 -3 -9 8 1 -8 -11 -6 -12 -14 -8 -8 -4 -16 -6 -1 -7 -9 -5 -12 -7 -10 0 0 -3 -2 -1 0 1 2 1 8 9 7 8
4620Hnn%Kj2ROnqKJ3qqOJklJLllNMm%KLoLJ0jj0pJ0LnO%j0RKkjnOomJ0l%j0Pl
$$ 8 3 -2 -2 0 -12 -3 3 -2 -10 -8 5 -3 -11 -5 -4 -6 -9 -8 -5 -8 -11 -6 -2 -6 -6 -4 -1 -7 -4 6 5 -5 -12 -2 1 -4 2 2 -8 1 3 1 0 -5 1 -5 -9 1 -2 -2 -12 -5 -8
4673hMnkRnrLRklPppRJJ0j3QKpjQlk%NNJoQnnJOkj2J0j0MlP%%o%Nkj6K0joKJm
$$ -8 -4 -9 -11 -2 -7 -16 -13 -4 -6 -9 -2 -9 -16 -7 -6 4 -9 -1 1 -6 -7 1 -2 -4 -4 1 6 7 1 9 4 -1 0 6 4 -8 2 -8 -4 -7 0 0 0 -6 -6 -1 -3 -19 1 0 -6 -4 -3 -7
4727gj3OMJ0oPNj0lKJKM%OpJKKOj3MnpJ2%Kj4nR%JrJ6j1pJ3j0jOqK%KJ0jlNjj
$$ -7 -20 -14 -10 0 -6 1 6 -4 -7 -5 -4 -2 2 2 8 1 2 4 6 12 -1 3 -2 -9 3 3 5 -9 -14 -5 -5 -4 -13 3 -8 -15 -2 -12 -13 -7 -15 -13 -13 -11 -1 -2 -5 0 -1 -2
4777bjkPjj0N%JoJ6oJj%Rj9PmRj7J4%jnjJ0roPlKj1RqJ6pPrJQ%MoMjrMMoQn%%
$$ -2 -3 -5 2 1 -9 -4 -4 -3 -9 7 1 2 1 1 10 -9 -2 -6 3 -14 0 0 -1 -6 -7 3 -6 -12 -5 -8 -6 -17 -8 -16 0 -7 0 -9 -8 0 0 4 -2 2 1 -8 -4 0 -6 2 -3 -3 -3
4830cKJj%kNjnMlmLlOmJnJ0%j0OPmj5QlPqLJ3Mj0RknMnJ0pMJlmoJ4kmkJ6j6lN
$$ -3 -1 0 -1 -1 -3 2 1 -4 0 -3 -7 -4 -7 -1 -5 -4 -9 1 1 -9 -3 4 0 -15 -7 -10 -3 -11 -8 5 9 -1 8 6 1 5 0 10 3 7 8 5 1 -5 9 7 3 1 17 1 -2 3
4882Cqj0J1KllPpKrJ1%Qj3Rkj1jJ4pRqKP%mOoLj1J8rqJ2Qj1Qj0Rpj0J0nLj3Mp
$$ 3 -5 -15 -4 -2 -5 -8 -1 -8 -6 -15 -4 -4 4 -9 0 -2 -13 -14 0 -7 2 -6 -4 3 3 -1 5 -1 2 -9 9 0 -8 4 12 1 9 -1 8 1 -9 1 -4 -1 -14 -10 -17
4929a7QNJ0j4NkQ%nmMLqLQnKLLmNRj1JlpQj2NJ5j5jlKJPoOj2RpQkokJ5j8OoQk
$$ -17 -9 -4 6 -8 -3 -5 3 3 -2 -6 -2 1 -7 -4 4 -1 1 4 7 3 8 17 6 7 4 -3 5 -7 -2 13 -2 -3 -6 -4 -3 4 -2 4 -8 1 -6 2 0 -6 -8 7 -11 -5 -11 -3 -5
4980emJ4klJo%lJ6kknRKj1KJ0j2pjQmKNLnLJnkJljk%LJjlPplJ0Mj1Ro%KKMOrn
$$ -5 -9 5 3 0 1 -5 -5 -8 8 6 4 -1 8 10 -1 1 11 -1 -8 -9 -1 -5 -3 2 5 0 3 4 -1 -3 -2 -5 -6 -8 -8 -5 -4 -5 -8 -1 -8 -11 -1 3 -8 1 -5 -5 -3 -1 3 9 0 -5
5034eMlQj2NL%oN%%Nj4MKLLmmJmPn%oJJOOqpPnRlJ0j2ML%j3J2LlOqJ2j4%nJ3j0
$$ -5 -1 -4 4 -8 -3 0 0 -6 -1 -1 -1 4 -10 -6 -4 -1 2 -2 -6 -5 -9 -2 -7 -7 -13 -12 -11 -5 1 -7 -14 -7 -12 -3 -6 4 -8 -4 -1 -1 -14 -2 1 -2 4 -4 8 -6 -6 -11 2 -8
5086hjJjL%LqKMp%mPnNpKRokOKKnMNpLlNj1POlJKLlJ%jmpLPoJ1j3LpjJ0nkkJ3
$$ -8 -9 -8 -9 -6 -6 -3 -11 -9 -5 -12 -12 -16 -9 -14 -9 -16 -14 -5 -11 -13 -7 -5 -3 -8 -4 1 -6 -3 -6 -1 -12 -5 1 -2 -1 1 4 1 2 2 1 -3 -10 -7 0 -6 5 -8 -5 -12 -13 -3 -8 -10 -12 1
5142Aoj0QjLJJ1mkQrLkMj0J0omOjKjJ%j1J4omKqK%rJ5jL%pKNj1RpqPO%mPoNjJ0
$$ 1 -5 -15 -7 -8 -5 -4 7 3 1 9 0 3 1 5 -5 5 -1 -5 1 0 2 1 2 2 -9 5 -1 -5 -3 -11 -9 -9 -18 -3 -4 -1 -1 -8 -6 -1 -12 -3 -10 -18 -11 -5 -5 -9 -2 -8 -3 -4 6
5195F%M%mqlNJj1OKQmKnPj7PmMplQrMmNKLj1Q%LlPo%JOkNojKKMq%kljRKnRqJm
$$ 6 6 10 10 6 -2 -5 0 1 -10 -4 -2 6 2 4 -1 6 -11 -4 -8 -4 -11 -14 -6 -15 -11 -15 -10 -8 -5 -16 -8 -8 -5 -8 -1 -7 -7 -6 0 -2 3 -3 -4 -2 0 4 -4 -4 -6 -9 -10 -1 1 -4 5 -3 -2 -6
5253f%Lj0J2mj4J1%mNRlmLqRj1QKllJoLMOMj1kQqPmN%j0JK0j6OmRlknlOLpjoJ0
$$ -6 -6 -3 -13 -1 -5 -19 -8 -8 -12 -7 2 -1 -5 -2 -10 -1 -12 -4 -2 -5 -8 -7 -13 -10 -6 0 4 -7 -9 -1 -9 -2 -6 -1 -1 -11 -10 10 -6 0 -4 5 2 0 -5 -8 -2 1 -6 -7 -13 -3
5305cjpK%KMkNOj4J0j2mNkJ1lKNrNJ7j4L%oMJokLkkmMPnlJ%nLNrJ3j0MMmKKpQ
$$ -3 -4 -11 -9 -9 -7 -3 -5 0 6 -8 2 -10 -14 -9 -11 0 -3 -1 4 -5 0 17 3 6 6 0 4 5 -1 -3 0 -2 -4 -8 -4 3 -2 -5 -4 -4 -9 -6 -1 -10 3 -7 -3 1 -3 -1 1 -6 2
5358BQooLLlKMqkLO%j9J0jPoLNmoQj2LKn%%%KLj0NLOqKK%Pj5J2nkRkPj2PNj2N
$$ 2 10 4 -2 1 4 1 3 7 -1 -3 0 6 6 -13 -3 -4 3 -3 0 5 1 -5 3 -9 -6 -4 -9 -9 -9 -9 -7 -4 -14 -9 -6 0 -8 -6 -4 -4 3 -12 0 -5 -7 2 0 7 -5 2 7 -5 0
5411@J%jkKkmjQjj0J1qJMmjmjQ%j2PNpMKkLlLMMj0lJ0%lpJ6KrPjknmLlKjjJ2j2
$$ 0 1 1 0 -2 0 -2 -6 -7 1 0 -10 1 -7 -6 -2 -6 -7 -11 -12 -4 -4 -16 -9 -4 -11 -7 -5 -7 -4 -7 -4 0 4 -6 -9 1 1 -2 -9 7 9 0 7 6 4 -1 -5 -2 -5 -3 -4 -5 7 -5
5465elOlMjnjJ%LjnJNrKLQqLJ0ppJ1j4J6j1PJmMjM%JqjkjKkjoPJNKlnNmKlKkl
$$ -5 -8 -2 -5 -1 -2 -7 -8 -7 -7 -4 -5 -10 -9 -4 -13 -11 -8 0 -8 -5 5 -2 -9 2 -12 4 -7 0 1 -3 1 0 4 4 5 -3 -4 -6 -7 -5 -7 -8 -14 -7 -6 -1 1 -2 -7 -2 -6 -4 -7 -5 -7 -10
5521a0MLMn%OMqJ3jj4NkJLrKPnORqj%pojJPj0J1rQjqQNlj1OOn%J7qqRjoMJ1j1
$$ -10 -6 -3 1 -4 -4 2 6 -2 11 10 -4 1 -1 0 3 -6 -4 3 -2 4 13 5 4 4 -3 -9 -10 -9 -2 -12 -1 -10 -2 -3 -11 -3 2 -1 -12 -6 0 -5 -5 12 4 -4 5 4 -2 2 13 2
5573BjKjJoOkLnONlj2MLnjjQrpQnLkRjnMnLlNJmLkQJPj3MOqKLoN%Lj0LLJoj0J0
$$ 2 1 3 2 3 -3 3 1 4 -1 5 10 7 -5 -1 2 -3 -4 -5 3 -6 -13 -5 -10 -7 -9 0 -1 -6 -2 -7 -4 -7 -2 -1 -5 -2 -4 4 5 12 -1 3 9 1 3 6 0 5 5 8 -2 1 4 5 -1 -11 -1
5630aRrl%mJrJ0oQNLoJJnPk%%q%J2nnJ3j3ROrLoj%KLlJkmM%KMnknPokPkKm%nJ3
$$ -1 8 -1 -4 -4 -8 -7 -16 -6 -12 -4 1 4 -2 -1 0 -5 2 0 0 0 -8 -8 4 -1 -6 7 -6 3 9 0 3 -3 -4 -4 -2 1 -2 -1 -3 -7 -3 -3 -1 3 -2 -4 -9 -2 -8 -10 -3 -5 -3 -7 -7 -12 1
5687AjkmPqKoJ6mqPKQj1KKojNJj5MOKoQoMj1jPmKMj1Pj5RR%LkjJK%nJ4rjLJLM
$$ 1 0 -2 -6 1 -7 -5 -11 5 1 -7 0 2 10 -1 1 3 -3 -4 1 2 -13 -9 -3 -1 -7 1 -5 -1 -12 -13 -6 -10 -8 -4 -15 -8 -23 -14 -5 -5 -2 -4 -5 -4 -2 -2 -7 7 -2 -3 0 1 4 8
5741HKrlKJ3j9J0nLj0J1oNlLMj4O%lkKmLqMKQjkLJKJpJ1JnjlLnPkmNJnL%mKMm
$$ 8 10 1 -2 0 13 -6 4 -1 2 -8 3 -3 2 -1 2 6 -8 -2 -2 -5 -7 -5 -9 -6 -14 -10 -8 0 -1 -3 0 1 3 4 -3 8 9 4 3 0 3 -2 5 3 -1 4 5 0 3 3 -1 1 5 1
5795AKj0OkOJjoKNqJjQrj%RmqRMQj6J2nL%Lk%mKKkLOj3LnnJKrJ0lOm%jJKRrrR
$$ 1 3 -7 -1 -3 3 4 3 -3 -1 4 -4 -3 -4 4 -5 -6 -6 3 -1 -9 0 4 12 -4 8 3 6 6 9 7 7 3 5 7 5 8 14 1 4 -1 -6 -5 -3 -12 -2 -5 1 -3 -3 -4 -3 -1 8 -1 -10 -1
5851aOqmNMJO%qMKMoKJpJJ%%pjJ3rj%KlOk%j0nJ0OnOj2PlnJ0nmMLpJ6jj1PKLm
$$ -1 5 -3 -7 -2 2 3 9 9 1 5 7 11 5 7 8 1 2 3 3 3 -4 -5 8 -1 -2 -2 0 -3 3 1 1 -9 -14 -4 2 -3 3 -9 -2 -5 -10 0 -5 -9 -5 -2 -9 7 6 -5 2 4 7 3
5905CkLKj1lQKr%PKmjOqmJ1mj1NJKNj1LRj1O%O%%NnKj5J0njJ0JkJ1j0LJrKOoL
$$ 3 1 4 6 -5 -8 0 2 -7 -7 0 2 -2 -3 3 -5 -9 2 -2 -13 -8 -7 -5 0 -11 -8 1 -10 -4 -4 2 2 2 7 2 4 -11 -1 -6 -7 3 4 2 13 3 6 7 -2 0 6 0 3
5956CoJ1j6OKlmQrpJ0m%qJ1KqlPMOqnNJjKJNj1ROj2J2%kKnlKjqRNlpkQJnmKmJ
$$ 3 -3 8 -8 -2 0 -3 -7 1 -8 -15 -5 -9 -9 -17 -6 -4 -12 -15 -8 -4 2 -6 -11 -6 -5 -6 -4 -3 2 -9 0 6 -6 6 6 4 6 1 -2 0 -1 -9 0 5 2 -5 -7 1 2 -3 -7 -5 -9 -8
6010hJnMKpJJ0joOlMjJLLNj1PnJjOkkpKqNPj3J1j0RpJ3j1MKjpmQj%oOKj2Q%Pm
$$ -8 -7 -12 -8 -6 -13 -12 -2 -3 -9 -3 -6 -2 -3 -2 1 4 9 -2 5 0 1 0 6 4 2 -5 -3 -11 -6 1 -12 -1 -11 -2 -9 4 -7 -3 -1 -2 -9 -13 -5 -6 -6 -12 -6 -4 -16 -8 -8 -1 -5
6063eMlnMPmpNKJOlQooQqmLqNpRoMmJ1%j4ljRl%LjNrkMlKPKLjPj1KOoKKmMjmN
$$ -5 -1 -4 -9 -5 2 -2 -9 -4 -2 -1 5 2 10 4 -2 6 -2 -6 -3 -11 -6 -13 -4 -10 -6 -10 1 1 -13 -16 -17 -8 -11 -11 -8 -9 -4 -13 -15 -11 -14 -12 -5 -3 0 -1 6 -5 -3 3 -3 -1 1 -3 1 0 -4 1
6121Aj0PkJj1Q%JJj5PMpRkKjnL%klJ0Oj0kJ0jonJ7rlKPpNJlMjnPj1J0l%j1MmO
$$ 1 -9 -2 -4 -3 -14 -6 -6 -5 -4 -19 -12 -8 -15 -6 -8 -6 -7 -12 -9 -9 -11 -14 -4 2 -8 -10 0 -1 -7 -12 5 -4 -7 -5 2 -5 0 1 -2 2 1 -4 3 -8 2 -1 -1 -12 -8 -12 -6
6172fkkJ1j3oMjJMljojJ3LlOKlMoQ%jlqOJKMj2JLKJlKojKjrOrJ4%oQmjqPmMlP
$$ -6 -8 -10 1 -12 -18 -14 -15 -14 -10 -13 -14 -20 -21 -8 -5 -8 -2 0 -3 1 -5 3 3 2 -1 -9 -3 -2 0 4 -8 -7 -4 -2 -1 -4 -2 -8 -9 -7 -8 -17 -11 -20 -6 -6 -12 -4 -8 -9 -17 -10 -14 -10 -13 -6
6228foMmLOmPMJoR%j3jRpjJ3pJ%nJ%LpoJj0J0NJljmRqJ3nMlJMj1N%koNLJkQJK
$$ -6 -12 -8 -12 -9 -3 -7 0 4 5 -1 8 8 -5 -6 3 -4 -5 8 1 2 2 -3 -2 -2 1 -6 -12 -11 -21 -11 -6 -5 -8 -9 -13 -4 -12 1 -4 0 -3 -2 2 -9 -4 -4 -6 -12 -7 -4 -3 -5 3 4 6
6283Fj0nJ3pOqjJMKppJ%oNPj4MNmNJ1j4MNr%LJ2plPj2J1%j0J1lJ0kkoLLj5J1J
$$ 6 -4 -9 4 -3 3 -5 -6 -5 -1 1 -6 -13 -12 -12 -18 -13 -6 -20 -16 -11 -15 -10 1 -13 -9 -4 -13 -13 -10 2 -5 -8 -1 -13 -2 -2 -12 -1 -4 6 4 2 -4 -1 2 -13 -2 -1
6331am%PoLnRpoNlrMJMj2J5jqPlLPkmNkKoNkOMOqKmj1jK%JJPj4%PmOkQj5kJ4j0
$$ -1 -5 -5 2 -4 -1 -6 3 -4 -10 -5 -8 -17 -13 -12 -8 -20 -5 -6 -14 -7 -10 -7 0 -2 -6 -1 -3 -1 -7 -2 -4 2 6 12 4 6 2 -9 -10 -8 -8 -7 -6 1 -13 -13 -6 -10 -4 -6 2 -13 -15 -1 -11
6386a1%OojP%n%jJ7pOqKkpROkLkj%lLJknMoljOrkOjmkPKqNloJ3KkOj5RPj1jQo
$$ -11 -11 -5 -11 -12 -5 -5 -10 -10 -11 6 -1 5 -3 -1 -3 -10 -1 5 3 6 4 3 3 0 3 4 2 -3 1 -5 -8 -9 -3 -12 -14 -8 -9 -13 -15 -8 -6 -14 -9 -12 -18 -5 -3 -5 1 -14 -5 2 -9 -10 -2 -8
6442hjRmLmOJkMmOnjlMmnKJjnNrJ1MoMrOj0JQkMojkQMnMMoOjmMMqJoJ1jj1J0K
$$ -8 -9 0 -4 -1 -5 1 2 0 4 0 6 1 0 -3 1 -3 -8 -6 -5 -6 -11 -6 -15 -4 0 -6 -2 -11 -5 -15 -14 -6 -8 -4 -10 -11 -13 -5 -1 -6 -2 2 -4 2 1 -3 1 5 -3 -2 -8 3 2 -9 1 3
6498CkmPrjKkjkOkkRj5Q%%mmLJMKKmKNoNmNmjoMRp%k%JNnjoMj4J9j0PpQnjK%M
$$ 3 1 -3 4 -5 -6 -4 -6 -7 -9 -3 -5 -7 2 -13 -5 -5 -5 -9 -13 -10 -9 -5 -3 -1 -5 -3 2 -4 1 -3 2 -2 -3 -9 -5 4 -3 -3 -5 -5 -4 1 -4 -5 -11 -7 -21 -2 -12 -5 -12 -4 -9 -10 -8 -8 -4
6555dn%MljkLMMnRmKKJlLqjLJOj4J4qQlNplnoJOMj2PlkPmNOmNrkMnNNJnRlJjO
$$ -4 -9 -9 -5 -8 -9 -11 -8 -4 0 -5 4 0 2 4 5 2 5 -3 -4 -1 0 6 -8 6 -2 6 3 8 1 -2 -7 -13 -12 -6 -2 -14 -7 -10 -12 -5 -9 -4 2 -2 3 -6 -8 -4 -9 -4 1 2 -3 6 3 4 3 9
6613I%lroPoQn%nJ1KmpPrJ0rL%jLLnjnPJKOKj2jMRrnJ3mjLOrNKloJ2j0%rQJ%m
$$ 9 9 6 -3 -9 -2 -8 0 -5 -5 -10 1 3 -1 -8 -1 -10 0 -9 -6 -6 -7 -4 -1 -6 -7 -12 -5 -4 -2 4 6 -6 -7 -3 6 -3 -8 5 1 0 3 9 0 5 7 4 -2 10 0 0 -9 -1 0 0 -4
6668dPj1KNj0J0j5J5j1OmNrN%L%lJ2j0JJpjR%RrmQJ0JkNj4M%j2PmjJlN%%%pNm
$$ -4 3 -8 -6 -1 -11 -1 -16 -1 -12 -6 -10 -5 -14 -9 -9 -6 -6 -9 3 -7 -6 -5 -12 -13 -4 -4 5 -4 -8 0 10 11 9 14 0 4 4 -8 -1 -5 -6 -5 -8 -3 -3 -3 -3 -10 -5 -9
6718iQk%jpM%QJmnRoRj5J1kJmJMLnNj%ljMKmpmrNJ2lmmJQpKJjj1J1%J2j2KOpJ3
$$ -9 -1 -3 -3 -4 -11 -7 -7 1 2 -2 -7 2 -4 5 -10 1 -1 0 -4 -3 1 4 -1 4 3 3 0 -1 3 5 1 -6 -10 -19 -14 -2 -5 -9 -13 -12 -4 -11 -9 -8 -9 -20 -9 -9 3 -9 -7 -1 -8 5
6772El%rMLlJNj1QKjOrKjJnlkpRmQLqJ0pJjkPj3PKJnL%J3o%NpOnM%KmkqLJ3ol
$$ 5 2 2 -7 -3 0 -3 -2 3 -8 0 2 1 7 -2 0 -1 0 -5 -8 -10 -17 -8 -12 -4 -1 -9 1 -6 -5 -6 -8 -1 -14 -7 -5 -4 -9 -6 -6 7 1 1 6 -1 5 0 4 4 6 2 0 -8 -5 8 2 -1
6828aL%Rj5ONj1NnMopQKNoJNj0RpOroJ4kJJlONKpLqNKmRj0MjjMkLpkKj1%Rj0O
$$ -1 2 2 11 -4 2 7 -4 1 -4 0 -6 -13 -5 -3 2 -4 -3 2 -8 1 -6 0 -9 -15 -1 -3 -2 -1 -4 2 7 9 2 5 -3 2 4 0 9 -1 3 2 1 5 3 6 -1 -3 -1 -12 -12 -3 -13 -7
6882gnKnRLrJ1%kjklJ0nNOqMOjmPj0jJ5rnLMoj0PQoRnJrJ%jmlKOmJqJ1KkkJ%L
$$ -7 -12 -10 -15 -6 -3 -12 -1 -1 -3 -4 -6 -9 1 -4 1 7 -1 3 9 8 4 11 1 0 15 6 1 4 8 2 -8 -1 7 1 10 5 6 -3 -2 -2 -3 -7 -10 -8 -2 -6 -5 -13 -2 0 -2 -4 -3 -3 0
6937@lKmQQ%nJ3j5%nJMloRnoJ2pJJLn%KqM%NpJRrOlqRk%PMr%MJnOlJJPqKLnKl
$$ 0 -3 -1 -5 3 11 11 6 19 4 4 -1 0 4 1 -5 4 -1 -7 5 -2 -1 0 3 -2 -2 0 -8 -4 -4 1 -6 -5 4 -5 1 -2 -10 -1 -3 -3 4 8 -1 -1 3 4 -1 5 2 3 4 11 3 5 8 3 5 2
6995BlKKnmL%ooRNnnjjKNOnOjL%Jm%KMj2lJ0J%nOMjNpmKjqN%mKLkJKMj1J2q%r
$$ 2 -1 1 3 -2 -6 -3 -3 -9 -15 -6 -1 -6 -11 -12 -13 -11 -6 0 -5 1 0 3 3 4 0 0 2 6 -6 -9 1 2 2 -3 3 7 6 11 4 0 2 1 -7 -2 -2 -6 -4 -1 -3 -2 0 4 -7 5 -3 -3 -12
7052a2KLjjRJkJ0j1Pj0J6ro%O%MmJQpMnRj3%JrMJlPJkoJjkJNkjj1MOlkJ4m%jM
$$ -12 -10 -7 -8 -9 0 1 -1 9 -2 5 -5 11 2 -4 -4 2 2 6 2 3 11 4 8 3 12 -1 -1 0 -9 -5 -4 -7 0 1 -1 -7 -6 -7 -9 -8 -3 -5 -6 -17 -13 -7 -10 -12 2 -2 -2 -3 1
7105AL%Nj2jmJ8j1KpQJOjj5J0jlmKnMmjljNQMrJp%OjnRmM%j%PmRLpJnPoLPj2K
$$ 1 4 4 9 -3 -4 -8 10 -1 1 -6 2 3 9 8 -7 3 2 -1 -5 -3 -8 -4 -8 -9 -12 -13 -8 0 4 -5 -4 -11 -11 -5 -6 -11 -2 -6 -2 -2 -3 -3 4 0 9 12 5 6 1 8 2 5 12 0 2
7160BjJqJ7j1KLpLnlkJ%RnJpJ3nmkLPkk%mJ0Mm%nQjKrKoOlMmJ1okpQpkPnlOqP
$$ 2 1 2 -6 11 0 2 5 -2 1 -4 -7 -9 -8 -8 1 -4 -3 -10 3 -2 -6 -8 -5 2 0 -2 -2 -6 4 8 4 4 -1 7 6 8 -1 1 -5 1 -2 2 -2 9 3 1 -6 2 -5 -7 0 -5 -8 -2 -10 -3
7216ckj0J1KjmKmQpKjN%P%mKpOmJ2pm%lPlMj%j3RoKPoJlmjPJ%jkjRlj1RjkMjj
$$ -3 -5 -15 -4 -2 -3 -7 -5 -9 -1 -8 -6 -7 -2 -2 5 5 1 3 -4 2 -2 10 3 -1 -1 -4 3 0 4 3 3 -10 -1 -7 -5 2 -4 -3 -6 -10 -11 -4 -3 -3 -4 -6 -7 2 -1 -12 -3 -4 -6 -2 -3 -4
7272dLnMj%J1j1jNknOpJMKl%nM%j0OjJjjJpJ6kOj2LnNlJ2qPqrJ5oLmJ8mmlNln
$$ -4 -1 -6 -2 -3 -3 8 -3 -4 1 -1 -6 0 -7 -6 -2 0 -3 -3 -8 -4 -4 -14 -8 -9 -8 -9 -10 -9 -16 0 -2 4 -8 -5 -10 -5 -8 4 -4 3 -5 -14 1 -5 -2 -6 12 8 4 1 6 3 -2
7325b%JJpjP%JqRqKJ0rk%Lk%j4J1krRKLm%MlnJ2l%OKknJ2lJj4J0kpLnRrLLrRj5
$$ -2 -2 -1 0 -7 -8 -1 -1 0 -8 1 -7 -5 5 -4 -6 -6 -3 -5 -5 -19 -8 -10 -19 -10 -8 -5 -9 -9 -5 -8 -13 -1 -4 -4 2 4 2 -3 9 6 7 -7 3 1 -6 -3 -8 1 -8 -5 -2 -11 -2 -17
7379a7OMnJ5j0JLj0nPKMPpJ2qOoNKnkmMKOlLpmQoJOj0mJ3klMqjJJ4j5lKOj3Qn
$$ -17 -11 -7 -12 3 -7 -6 -3 -13 -18 -11 -9 -5 2 -5 7 -1 5 -1 4 6 1 -1 -5 -1 1 7 4 7 0 -4 4 -2 -1 5 -5 -9 4 2 -1 3 -5 -6 -5 9 -6 -9 -7 -1 -14 -6 -11
7430a1jJ2qJmMOpJ5pnPJOj6JPLJlRj4%NjoNpkpQLj0J1lJkJ1j1JkNkKlRnPnMJJ
$$ -11 -12 0 -8 -7 -11 -7 -1 -8 7 0 -5 2 3 9 -7 -6 1 4 5 2 11 -3 -3 2 1 -5 0 -7 -9 -16 -8 -5 -15 -4 -7 -6 -8 3 -8 -7 -9 -4 -6 -4 -7 2 -3 4 -1 3 4 5
7482EKmnOpPQj1klMMlLojnoJ1nKkJJpkOkPLqKlLPpMmPkOlOj3POmlmJj%KJOkj0
$$ 5 7 3 -2 4 -3 4 12 1 -1 -4 0 4 1 4 -2 -3 -8 -14 -3 -8 -6 -8 -7 -6 -13 -15 -9 -11 -4 -1 -9 -7 -10 -7 0 -7 -3 -7 0 -2 4 1 7 -6 1 7 3 0 -4 -3 -4 -4 -2 -1 5 3 -7
7539g%J1j2%OmqJ1JmlRopQ%KjqJ1pOMmJL%kkRmKojqJ5pkKPlq%Ll%lJ2qOnlJRm
$$ -7 -7 4 -8 -8 -2 -6 -14 -3 -2 -6 -9 0 -6 -13 -5 -5 -3 -4 -12 -1 -8 -2 2 -2 -1 2 2 0 -2 7 3 5 -1 -2 -10 5 -2 -4 -2 5 2 -6 -6 -3 -6 -6 -9 3 -5 1 -4 -7 -6 3 -1
7594akJ1j1qNKNlrJ0nMM%m%JKjlPJj0%MmMkLomQKpj5QJJ3j2LJoNlLLJKllmQlR
$$ -1 -3 8 -3 -11 -6 -4 1 -2 -11 -1 -6 -2 2 2 -2 -2 -1 1 0 -3 4 5 -5 -5 -1 -5 -1 -3 0 -6 -10 -2 0 -7 -22 -14 -13 0 -12 -9 -8 -14 -9 -12 -9 -6 -5 -3 -6 -9 -13 -5 -8 1
7648AjojNOnNLlLj0nOJ%nKLJkj0OoORj6MkNLmjMMjlJLRonjnJ2NkoRmmQKj5Qj1
$$ 1 0 -6 -7 -2 4 -1 4 7 4 7 -3 -8 -2 -1 -1 -6 -4 -1 0 -2 -12 -6 -12 -6 3 -13 -9 -11 -6 -3 -7 -8 -4 0 -1 -4 -3 0 9 3 -2 -3 -8 4 9 7 1 10 6 2 10 12 -3 5 -6
7703fKJ2j0mJ4nkjJpLllKNq%LKjlJlN%QJmKJpjMJ1L%llj2RkLkjrMjlMkJ1j3On
$$ -6 -4 8 -2 -6 8 3 1 0 1 -6 -3 -6 -9 -7 -2 -10 -10 -7 -5 -6 -9 -8 -11 -6 -6 2 3 -1 1 2 -5 -6 -2 9 12 12 9 6 -6 3 1 4 2 1 -8 -4 -5 -8 -4 -6 5 -8 -2 -7
7757gkPpKKqLllJ2KoQk%LkJ0j6QOkp%J0j6RKnJoOJljlKoKoPMj2J6qKOj3%MJJ2
$$ -7 -9 -2 -9 -7 -5 -13 -10 -13 -16 -4 -2 -8 0 -2 -2 1 -1 9 -7 1 7 5 -2 -2 8 -8 1 3 -2 -1 -7 -1 0 -3 -4 -7 -5 -11 -9 -15 -8 -4 -16 0 -8 -6 0 -13 -13 -9 -8 4
7809Dj2MM%oQkKolRqK%JOJmJMpJknQj3NOMk1J6lJPmKkKr%JQPrQoJJ3j1PoKj1L
$$ 4 -8 -4 0 0 -6 2 0 2 -4 -7 2 -6 -4 -4 -3 3 4 0 1 5 -2 -1 -3 -8 0 -13 -8 -2 2 -19 -3 -6 -5 2 -2 0 -2 0 -9 -9 -8 0 7 -2 6 0 1 14 3 10 4 6 -5 -2
7863bjKlMKnmKNkKnjlqOjJnP%JjJ0j6PNLo%jJ4qPKqJjjKKmljLkJ3j3LJ0orOmr
$$ -2 -3 -1 -4 0 2 -3 -7 -5 0 -2 0 -5 -6 -9 -17 -11 -12 -11 -16 -9 -9 -8 -9 1 -15 -8 -3 0 -6 -6 -7 7 -1 6 8 0 1 0 -1 1 3 -1 -4 -5 -2 -4 9 -4 -1 9 3 -6 0 -4 -13
7918a3MmOklnQOrKMmNKlpOnJ2mPlLKnJ3j1LoKRrm%RmqRjpNrRkokQolNkKkJNMj4
$$ -13 -9 -13 -7 -9 -12 -17 -9 -3 -12 -10 -6 -10 -5 -3 -6 -13 -7 -12 0 -4 3 0 3 5 0 13 2 5 -1 1 10 1 -3 -3 6 2 -6 3 2 -5 0 -9 0 -2 -8 -10 -2 -8 -11 -6 -8 -6 -8 -7 -2 2 -12
7975a2J2Mj4J3ojPnMJ%QLqpKjkkQkpLRlmjlpJjMmNjnJ3rRjKLolMnkkJ6pMlLOk
$$ -12 0 4 -10 3 -3 -4 3 -2 2 3 3 11 14 6 -1 1 0 -2 -4 4 2 -5 -2 7 4 0 -1 -4 -11 -10 -11 -7 -11 -6 -7 -12 1 -8 1 0 2 5 -1 -4 0 -5 -7 -9 7 0 4 1 4 10 8
8030HMmjkqoJ1j5J1rMMJJJq%%J%jKMLlkNnPLlmMl%JKNj2J1%jLj0LJNnKnj%j0J2
$$ 8 12 8 7 5 -3 -9 2 -13 -2 -11 -7 -3 -2 -1 0 -8 -8 -8 -7 -7 -8 -6 -2 1 -2 -4 1 -4 3 6 3 -1 3 0 0 1 3 8 -4 7 7 6 9 -1 2 3 8 3 5 0 -1 -1 -11 1
8084AoQqLloLMKjrP%l%OKJpJ1rJ4j0K%mm%MJ0%lkj2RmMkRj6J2rPnJqL%NJj0%%
$$ 1 -5 3 -5 -2 -5 -11 -8 -4 -2 -3 -12 -5 -5 -8 -8 -2 0 1 -6 5 -4 10 0 2 2 -2 -6 -6 -2 8 8 5 3 -9 0 -4 0 -2 7 -9 3 -6 1 -4 -3 -11 -8 -8 -3 -2 -12 -12 -12
8137a2LJ3qLjmQkMoNljJ%lOnRpkNnLKj2J0mJkpjPoPNj0kmJ5j0LkQnNk%KJL%nJ0
$$ -12 -9 4 -4 -1 -2 -6 2 0 4 -2 3 0 -1 0 0 -3 3 -2 7 0 -2 3 -2 1 3 -9 1 -3 -2 -4 -11 -12 -5 -11 -4 1 -9 -11 -15 0 -10 -7 -9 -1 -6 -1 -3 -3 -1 0 3 3 -2 8
8191H
$$ Imaginary data points
##PAGE= N=2
##DATA TABLE= (X++(I..I)), XYDATA
0@%%%%%%%%%%%%%%%%%%%%%%Qj6J6j6J6j6J6k4L2l2L2m0M8n6O4o7P5q8R6j04J20
$$ 0 0 0 0 0 0 0 0 0 0 0 0 0 0 0 0 0 0 0 0 0 0 0 8 -8 8 -8 8 -8 8 -16 16 -16 16 -24 24 -32 32 -35 40 -48 48 -56 64
43F4j32J40j52J71j92K13k32K56k84L12l44L80m20M64n16N78o48P30q32R60j125
$$ 64 -68 72 -80 91 -101 112 -120 136 -148 164 -180 200 -220 244 -272 306 -342 388 -444 516 -609
64f09J344j652K126k951M795j6113N368K7948k2454j0569J9827O826k6664r77
$$ -609 735 -917 1209 -1742 3053 -13060 -7692 20256 -2198 -12767 7060 13886 -12778 -13755
78a3755K6707P46k7203L476K3768o516k2784J1285K0357j3579j8869J6356J5567
$$ -13755 12952 13698 -13505 -10029 13739 7223 -15561 -4276 16081 2502 -16367 -11 15556
91A5556j7732j2783J9664R130k0459o145K1290K603k1061M90K0733l860j9645
$$ 15556 -2176 -14959 4705 13835 -6624 -12769 8521 11124 -9937 -9447 11286 7426 -12219
104a2219O756J8380r616j6514J1988J4448j4141j1968J5820R329j7119o482J7925
$$ -12219 -5463 12917 3301 -13213 -1225 13223 -918 -12886 2934 12263 -4856 -11338 6587
117F587L572j8283o20J8155k252j7593N007J6605p554j5244R863J3521j1851j1539
$$ 6587 10159 -8124 -8744 9411 7159 -10434 -5427 11178 3624 -11620 -1757 11764 -87 -11626
131a1626J3521R311j4809o930J5723M447j6240j928J6362n65j6124K990J5534
$$ -11626 1895 11206 -3603 -10533 5190 9637 -6603 -8531 7831 7266 -8858 -5868 9666
144I666n305j4602P440J3376r383j1873J1077J0137j2512q200J3618O138j4428
$$ 9666 4361 -10241 -2801 10575 1192 -10681 396 10533 -1979 -10179 3439 9577 -4851
157d851l946J4897J715j5019N35J4795k702j4242M772J3379o711j2207Q425J0792
$$ -4851 -8797 6100 7815 -7204 -6669 8126 5424 -8818 -4046 9333 2622 -9585 -1160 9632
171I632r912r160J1122P351j2031n424J2622L427j2902j406J2853n54j2534K449
$$ 9632 -280 -9440 1682 9033 -2998 -8422 4200 7627 -5275 -6681 6172 5618 -6916 -4467
185d467J1906m207j1028N808R931p234q636Q441P174r413n598J0156L915j0626
$$ -4467 7439 3232 -7796 -1988 7943 709 -7927 514 7688 -1725 -7323 2833 6748 -3878
199c878k182J0833M60j0800J257J0505k922r950M488R171n917q179P193O992q270
$$ -3878 -6060 4773 5233 -5567 -4310 6195 3273 -6677 -2189 6982 1065 -7114 79 7071 -1199
214a199n648R134M195r777k624J0137J022j0269N91J0133k165r753L666R118n041
$$ -1199 -6847 2287 6482 -3295 -5919 4218 5240 -5029 -4438 5695 3530 -6223 -2557 6561 1520
229A520q292O278P287p345o123Q218M837q883l449R322K027r554n83R569q46r373
$$ 1520 -6772 -494 6793 -552 -6675 1543 6380 -2503 -5952 3370 5397 -4157 -4740 4829 3983 -5390
245e390K236Q976l556q381M771P620n871o696O829N642p618m472Q230L211q651
$$ -5390 -3154 5822 2266 -6115 -1344 6276 405 -6291 538 6180 -1438 -5910 2320 5531 -3120
260c120j903Q880N59q902P96Q688k099q292L323P714m465o952N468O029o313m988
$$ -3120 -5023 3857 4416 -4486 -3690 4998 2899 -5393 -2070 5644 1179 -5773 -305 5724 -589 -5577
276e577O980L855p470k651P771J418p862j84P771j027p480K162P038l217o440
$$ -5577 1403 5258 -2212 -4863 2908 4326 -3536 -3720 4051 3024 -4456 -2294 4744 1527 -4913
291d913M180N699n017m847N716L893o269k874O667J809o904p02O981m06o888J484
$$ -4913 -733 4966 -51 -4898 818 4711 -1558 -4432 2235 4044 -2860 -3562 3419 3013 -3875 -2391
307b391O637k523o242L506N692m405m994N179M176n825l281O332K300o668j271
$$ -2391 4246 1723 -4519 -1013 4679 274 -4720 459 4635 -1190 -4471 1861 4161 -2507 -3778
322c778O862K02o862Q44O696j840o396K809N929l669n332M440M614n078l820N595
$$ -3778 3084 3286 -3576 -2732 3964 2124 -4272 -1463 4466 797 -4535 -95 4519 -559 -4379 1216
338A216K950n980k039O220J096o317j50O271p87o088J680N790k527n379L314M842
$$ 1216 4166 -1814 -3853 2367 3463 -2854 -3004 3267 2480 -3608 -1928 3862 1335 -4044 -730 4112
354D112m013m198M620L459n095k669N455J825n707r33N811L7n774Q53N592j717
$$ 4112 99 -4099 521 3980 -1115 -3784 1671 3496 -2211 -3144 2667 2704 -3070 -2217 3375 1658
370A658n273K521M833l241m281L883L632m399k899M796K123n074j305N208M75
$$ 1658 -3615 -1094 3739 498 -3783 100 3732 -667 -3566 1230 3353 -1721 -3026 2182 2657
385B657n218L41N102j137m874J881M523k565m068L172L541l703k939M135K271
$$ 2657 -2561 -2220 2882 1745 -3129 -1248 3275 710 -3358 -186 3355 -348 -3287 848 3119
400C119m462j562M689Q32m815p1M821o77m713J407M504k118m169K767L754l351
$$ 3119 -1343 -2905 1784 2616 -2199 -2270 2551 1874 -2839 -1432 3072 954 -3215 -448 3306 -45
416d5l238L840K655m267j987M567J286m756n60M834j73m784Q85M620j573m347
$$ -45 -3283 557 3212 -1055 -3042 1525 2811 -1945 -2505 2329 2156 -2628 -1743 2877 1304 -3043
432c043K202L974k781l534L277L018l696k421M013J793m229j148M347M92m369
$$ -3043 -841 3133 352 -3182 95 3113 -583 -3004 1009 2802 -1427 -2575 1772 2264 -2105
447b105J79M292q20m127J428L876k003l528K532L115k991k641L393K080l681j506
$$ -2105 -1926 2366 1546 -2581 -1153 2723 720 -2808 -276 2839 -152 -2793 600 2680 -1001 -2507
463b507L910Q87m029k65M049l79l967J002L804j605l528K140L169k628k739L038
$$ -2507 1403 2290 -1739 -2004 2045 1666 -2301 -1299 2505 900 -2628 -488 2681 53 -2686 352
479C52K232l357j697L600J113l732n21L788p1l741O51L599j195l378J693L099
$$ 352 2584 -773 -2470 1130 2243 -1489 -2010 1778 1707 -2034 -1383 2216 1021 -2357 -664 2435
495B435k165k729K583K312k901j869L184J358l382q40L508K90l548K62L500q01
$$ 2435 270 -2459 124 2436 -465 -2334 850 2208 -1174 -2014 1494 1784 -1764 -1502 1998 1197
511A197l374J307L192j814k901K248K558k640k159K973J695l221j204L407O70
$$ 1197 -2177 -870 2322 508 -2393 -145 2413 -227 -2386 587 2282 -939 -2143 1264 1934
526A934l484j49L499l88l411R04L238j381l004J814K698k197k337K522J941k777
$$ 1934 -1550 -1699 1800 1412 -1999 -1095 2143 762 -2242 -428 2270 73 -2264 258 2199 -578
542e78j486K954J025l068n52L111P7l095M04K990q51k840J285K610j675k341K022
$$ -578 -2064 890 1915 -1153 -1705 1406 1483 -1612 -1208 1782 931 -1909 -624 1986 311 -2030 -8
559hK012k333j634K584J208k761p74K881L17k916J39K905o03k798J046K627j460
$$ -8 2004 -329 -1963 621 1829 -932 -1706 1175 1492 -1424 -1285 1620 1017 -1781 -735 1892 432
576D32k381J836K077k144j751K414J364k611r38K728N12k777r9K779l42k697P42
$$ 432 -1949 -113 1964 -180 -1931 483 1847 -764 -1702 1026 1538 -1239 -1338 1441 1099 -1598 -856
593h56K571j135k361J482K122j800j837K063J504k268j154K429P80k551l96K608
$$ -856 1715 580 -1781 -299 1823 23 -1814 249 1753 -515 -1669 760 1540 -1011 -1407 1201
609A201j0k600M10K530p86k406J161K239j511j996J819J711k074j400K296J040
$$ 1201 1191 -1409 -999 1531 745 -1661 -500 1739 228 -1768 51 1762 -312 -1712 584 1624
625A624k445o58K532K64k556J19K521n02k427Q77K260j203k062J504J805j747
$$ 1624 -821 -1479 1053 1317 -1239 -1120 1401 899 -1528 -651 1609 406 -1656 -152 1653 -94
641i4j527J960J202k107q74K210N23k266j69K273j70k225M96K121q34j964J131
$$ -94 -1621 339 1541 -566 -1440 770 1293 -973 -1142 1131 961 -1264 -768 1353 519 -1445 -314
658c14J786j408j554J651J298j848j003K009O78k094l56K156J1k167L38K114o72
$$ -314 1472 64 -1490 161 1459 -389 -1392 617 1295 -799 -1155 1001 1012 -1155 -817 1297 625
675F25k007R85J845j289j632J527J397j736j129J905Q19k005n14K076J91k096
$$ 625 -1382 -397 1448 159 -1473 54 1451 -285 -1414 491 1310 -695 -1209 867 1058 -1038
691a038J41K039m36j944P14J822r83j654J226J460j433j229J591R79j729p15J845
$$ -1038 -897 1142 706 -1238 -524 1298 315 -1339 -113 1347 -86 -1315 276 1255 -474 -1189 656
708F56M27j892j37J908j49j882M49J798p27j685R78J533j222j339J421J117j605
$$ 656 1083 -809 -946 962 813 -1069 -620 1178 451 -1234 -256 1277 55 -1284 137 1254 -351
725c51q54J725N92j810l06J837J5j827K67J768n28j668P77J538j007j355J197
$$ -351 -1205 520 1112 -698 -1004 833 848 -979 -712 1056 528 -1140 -363 1175 168 -1187 10
742A0J157j360r27J485P02j578m49J618K00j630M0J619l07j539N31J457p62j328
$$ 10 1167 -193 -1120 365 1067 -511 -960 658 858 -772 -732 887 580 -959 -428 1029 267 -1061
760a061R69J168j135r96J288P87j420n68J519L09j557o3J564j73j556M28J482
$$ -1061 -92 1076 -59 -1055 233 1020 -400 -968 551 860 -697 -760 804 631 -925 -497 985
777I85o53j381Q74J248j072j066J226Q70j352o52J445M37j505j96J510k3j489
$$ 985 332 -1049 -175 1073 1 -1065 161 1031 -321 -973 472 909 -596 -792 718 695 -794
794g94K43J440m61j358O52J247q33j116R97R43j120p75J227N83j311l68J352J57
$$ -794 -551 889 428 -930 -278 969 136 -980 17 960 -160 -935 292 875 -436 -804 548 705
812G05j368M7J363k62j323M80J244o72j140Q48J004j001q50J148O53j230m65J298
$$ 705 -663 -616 747 485 -838 -358 886 214 -926 -78 926 -75 -925 223 876 -354 -819 479
830D79K75j348m9J344j56j318L58J256n56j148P28J011q66q82R97P19j090n59
$$ 479 754 -594 -643 701 545 -773 -415 841 285 -863 -135 876 10 -872 125 844 -246 -805
848h05J163L60j203j72J214qj207J88J163l57j096N30J020p00q96Q27P81r53o31
$$ -805 358 718 -485 -657 557 549 -658 -470 693 336 -760 -230 790 90 -806 21 802 -151 -782
867g82J051M65j113k96J177J13j213R5J180k77j133M48J077o35r57P71Q39q96
$$ -782 269 734 -379 -675 502 615 -598 -503 677 400 -733 -285 792 157 -800 -29 810 -86
885h6p05J003N44j086l69J128J97j142l4J140j51j101L09J040m54r61N93Q59p04
$$ -86 -791 212 756 -330 -699 429 626 -516 -550 590 439 -662 -353 687 233 -728 -135 724 20
904B0p52Q26O17r01m75R65L20r99j70J028Lj029J64J000l15r55M73Q77o15p76
$$ 20 -732 94 711 -190 -665 300 620 -379 -549 479 482 -547 -383 617 302 -653 -180 697 82 -694
924f94P31O66q48n25R33L68r78k21J014O0j032J03J005k63r54M09Q83n37p94O41
$$ -694 37 703 -145 -670 263 631 -347 -568 446 506 -526 -423 582 319 -635 -226 657 120 -674 -33
944c3O97p47n67Q24M36q75l03R11J66r27l0R28j00r15K61Q53l77p95N06P04o15
$$ -33 664 -83 -650 174 610 -265 -568 343 509 -418 -448 480 380 -535 -274 579 202 -593 -87 617 2
965Bo12P07N00p87l89Q54K47q86j16R10l3r12J89Q78l22q28M50P48n57o64O69
$$ 2 -610 97 597 -190 -579 275 522 -364 -480 430 397 -515 -326 552 230 -598 -148 600 43 -621 48
986D8N61p57m37Q12L18q61j73Q69M4q70R6Q49k20p93L25P51m48o56N23N85o17
$$ 48 609 -148 -585 227 545 -316 -489 380 424 -446 -350 499 279 -514 -189 562 114 -542 -19 566 -51
1007e1m82O74L77p26k74P68J49p97k1P91j09p67K24P35l33o90M57O02n44n33O41
$$ -51 -533 141 518 -208 -482 286 435 -362 -383 408 299 -468 -244 491 158 -532 -75 527 -17 -550 91
1028I1M30p12l05P51J98p83o3P97o4p85J84P49k97p06M06O47n02n70N79M69o38
$$ 91 521 -191 -496 255 453 -330 -393 404 340 -445 -261 488 191 -515 -109 538 36 -534 45 514 -124
1049a24l65O87K56p10j51P16M7p21O0P14j72o84K74O24l61n86M70M88n19m28O04
$$ -124 -489 198 454 -256 -407 309 356 -365 -305 409 237 -447 -173 451 90 -496 -26 462 -57 -485 119
1070A19L24o53k13O92J11p03JP09j20o85K33O46l30o09M39N37n27m47N77L54o28
$$ 119 443 -210 -423 269 380 -323 -322 387 267 -418 -185 461 131 -478 -39 498 -29 -476 101 455 -173
1091a73k60O73J48o90m8O90m7o80J49O54k52o00L34N31l97m76M70M03n36l08N72
$$ -173 -433 240 388 -302 -350 340 293 -387 -238 416 164 -436 -102 429 32 -444 26 429 -107 -415 157
1112A57K18n96j29O21L9o25P1O04j62n78K45N50l40m95M22M33m96l50N50K63o03
$$ 157 375 -221 -350 271 310 -315 -244 360 198 -380 -135 415 75 -420 2 435 -61 -411 139 402 -201
1133b01j67O23O3o28K9O28j36o04K33N56l10n06L84M43m38l82M94L00n33k09N58
$$ -201 -368 255 318 -310 -281 347 211 -393 -160 396 86 -420 -36 407 -31 -413 81 381 -152 -361 197
1154A97J28n80l5N74m2n55J19N42k03n07K72M63l42m00M00L34m49k60M94J78n20
$$ 197 325 -255 -290 284 242 -313 -194 348 145 -362 -90 373 31 -369 31 365 -84 -344 150 328 -192
1175a92j00N44jn39Q2N33j81n03K50M73l32m20L94L53m41k94M99K10n18j22N34
$$ -192 -292 252 251 -288 -206 327 146 -357 -107 366 34 -386 8 361 -80 -374 125 335 -183 -305 229
1196B29L4n29L4N25j08m96J76M81k57m32L07L84l71l16M04K68m48j89M67J18m88
$$ 229 263 -266 -232 293 185 -311 -135 346 89 -343 -36 348 -23 -339 65 333 -115 -304 163 281 -207
1217b07m6M94l1m88J19M58j81m42K57L89l14l47L68K98m32k15M57J52m90o5M95
$$ -207 -253 241 210 -278 -159 299 118 -324 -67 322 8 -339 29 327 -105 -320 137 289 -201 -266 229
1238B29j3m91R0M74j53m44K18M07k73l77L45L18l77k48M07J89m37j15M28O0m48
$$ 229 216 -275 -185 289 136 -308 -90 317 44 -333 12 330 -47 -295 112 301 -136 -251 177 237 -211
1259b11PM47p9m27J34M01k02l65K51L22k90k78L37K28l86j57M05J04m29l0M36
$$ -211 -204 243 164 -263 -129 272 70 -295 -44 278 -12 -290 47 275 -111 -268 137 241 -188 -218 218
1280B18m7m15J02M15j79l81K42L38k89k94L38K50l82j81M01J18m20m9M16j0m08
$$ 218 171 -244 -142 273 94 -287 -45 293 4 -290 48 298 -84 -265 136 254 -166 -215 201 191 -217
1301b17O7L92j25l88J90L55k38l15K67K79l13k16L31J68l63j03L84M3l83NL77
$$ -217 -150 242 117 -271 -81 274 36 -279 -12 267 -46 -262 69 237 -126 -229 155 198 -185 -180 197
1322A97n5l68J31L41j78l26K32K89k83k30L05J88l43j34L77P4l88j0L91n9l73
$$ 197 142 -226 -95 246 68 -258 -26 263 -20 -250 55 243 -100 -234 143 217 -171 -181 210 151 -222
1343b22J08L62j69l29K09K89k58k45K93J99l16j59L30J14l48n1L58ml48N3L30
$$ -222 -114 248 79 -250 -41 248 -10 -255 38 237 -79 -238 92 206 -142 -193 165 161 -187 -134 196
1364A96r0l22J43L06j84k68K30K27k72j84L00J37l18r6L37L5l36J4L32o5l35J22
$$ 196 106 -216 -73 233 49 -219 11 238 -34 -218 82 219 -99 -195 142 177 -159 -145 187 122 -213 -91
1386i1L09j73k76K26K40k60k04K92J49l19j01L30N3l32nL23l1l28Q8K98j28k74
$$ -91 218 45 -231 -5 235 -25 -229 63 212 -107 -208 122 175 -157 -162 161 130 -198 -110 188 60 -214
1408b14J71K54k04k16K32J87k53j51K77J09k93o2L06J5l10K0L09p7k90J21K68
$$ -214 -43 211 7 -209 23 210 -43 -194 83 192 -101 -163 143 158 -152 -132 177 100 -190 -69 199
1429A99j72k36J99K11k42j60K62J21k80q7L06K5k98K6K95o1k96J11K75j60k34
$$ 199 27 -209 -10 201 -41 -201 61 182 -98 -185 121 146 -152 -126 169 108 -188 -77 198 38 -196
1450a96J85K13k09j92K53J48k72j00K64Q0k89k8K87k2k66N0K59r0k51J27K22j58
$$ -196 -11 202 -7 -199 54 202 -70 -170 94 174 -115 -143 144 122 -144 -94 165 75 -176 -49 173 15
1472A5j99J95J68k27j31K44R5k59n9K75Jk66M1K54p5k42J17K38j57k10J92J77
$$ 15 -184 11 179 -48 -179 65 160 -99 -158 117 118 -148 -107 147 72 -170 -53 185 28 -182 10 187
1494A87k19j31K27J11k54o6K64K7k67KK71o4k41R5K36j31k12J52J82j75j66K02
$$ 187 -32 -163 64 175 -79 -145 119 146 -121 -119 152 88 -153 -58 178 47 -165 -13 169 -6 -172 30
1516C0J25k08j05K23P2k40k8K37kk37M1K32r1k13J28K00j51j72J79J42j97j15
$$ 30 155 -53 -158 65 137 -103 -131 106 104 -133 -92 140 49 -164 -36 164 13 -159 20 162 -35 -150
1538a50K21P9k33l4K31pk27L5K31p6k16J10J94j44j73J59J52j83j19J97Q2k09
$$ -150 71 150 -83 -117 114 107 -120 -85 146 70 -146 -36 158 14 -159 0 152 -31 -150 47 129 -80
1560h0n3K16K9k18jK17l5k04P1J95j01j80J20J66j43j37J55J26j85p8J92N2j99
$$ -80 -133 83 112 -106 -107 110 75 -129 -58 137 36 -144 -24 142 -1 -138 17 143 -42 -120 72 124 -75
1583g5k1K05j8k12O4J94q9j80J10J67j53j28J47J23j86p7J82O2j99k2K06nk07
$$ -75 -96 109 91 -121 -57 137 48 -132 -22 145 -8 -136 11 134 -52 -129 53 115 -84 -106 100 95 -112
1606a12L7J96n5j92Q9J65j01j54J24J35j43j07J58Q5j78o2J85M1j95MJ87k8j91
$$ -112 -75 121 66 -126 -37 128 27 -127 -3 132 -11 -118 40 125 -53 -115 70 111 -84 -80 107 79 -112
1629a12O3J78r2j58J13J40j43j13J50Q8j65o5J82L2j79j1J74j8j85O0J75q0j58
$$ -112 -49 129 37 -121 -8 132 -11 -124 26 114 -51 -116 66 98 -81 -92 82 64 -121 -61 114 34 -124
1652a24J04J42j15j31J52R6j59o8J61N8j73k3J63J1j73J8J58l8j55O6J39q6j29
$$ -124 -20 122 7 -124 28 124 -35 -103 58 116 -57 -80 83 94 -79 -61 97 59 -96 -30 109 23 -106
1675a06J03J14j23r9J44O9j48n8J68K2j61rJ78l2j67N6J46q0j31J06J25j31r2
$$ -106 -3 111 -12 -111 33 102 -46 -104 64 86 -75 -84 94 62 -105 -49 97 17 -114 -8 117 -14 -106
1698a06J40P3j50m4J57K2j53qJ66l0j47L6J49o9j29P5J24j04r8J10R1j30p5J31
$$ -106 34 107 -43 -87 70 92 -61 -69 97 67 -80 -44 105 36 -93 -18 106 2 -96 14 105 -25 -100 31
1722C1N0j42k4J41Pj34J1J40l4j31N5J23p8j02R1R0j12p2J30M9j30l4J42lj36
$$ 31 81 -61 -85 56 63 -71 -60 80 46 -85 -30 93 15 -87 4 94 -18 -90 40 89 -41 -75 67 64 -72
1747g2K5J40m4j33O5J29r1j02Q6R5j06p9J23M9j30m0J33K6j34oJ26qj30K3J32
$$ -72 -47 93 49 -84 -19 110 19 -83 3 98 -8 -87 36 85 -45 -85 48 74 -60 -66 60 52 -78 -55 77
1772G7m9j04N7J02p3r4R5O4r6n1J11M4j31j5J21Jj25K8J19m9j18P3J00q6p9R5
$$ 77 28 -76 -19 83 10 -84 11 75 -21 -72 39 83 -48 -63 58 59 -66 -38 81 32 -86 -13 87 1 -78 17
1798A7O2r7o3J03M9j15k5J22Jj21K0J16m0j08M6J09o6r4Q0P6q9o0R9N6j07k7R7
$$ 17 79 -18 -81 22 71 -44 -69 53 54 -67 -47 69 29 -79 -33 76 10 -84 -4 72 -17 -77 22 78 -29 -56 41
1825D1L4j12j2J14j5j04K2J10m5r8N1R3p7p3Q4N2r4m2R7L9j13nJ01qj10L7J01
$$ 41 75 -37 -49 65 50 -54 -32 78 33 -65 -14 79 2 -71 13 65 -29 -71 26 65 -48 -53 48 40 -70 -33 68
1852F8m7r1N9Q8q6o3P3O7r3m8J06K5r8k0J05J3j04OR8j6j01M2Q6m7q0O0O8o5o9
$$ 68 21 -70 -11 77 -9 -72 1 68 -25 -73 33 58 -40 -60 45 58 -46 -40 58 42 -59 -17 69 22 -58 2 70 5 -64
1881f4Q0N1r7k8Q4J6r1pR9j2r5L0R1m6p9N9P0p0o2Q8L8q7l1Q7L3j03kJ00j1r5
$$ -64 16 67 -30 -58 26 42 -49 -56 43 31 -64 -34 57 11 -68 -9 61 -9 -71 17 55 -32 -63 24 57 -46 -48 52 41 -54
1911e4K6R5n4p9N4P6n8o9P1O3q0m5P0L9q1l4R7jp8%Q4j5r3L6P5m3p3N3O8o9n0
$$ -54 -28 67 13 -66 -12 64 6 -63 8 71 -9 -54 16 55 -26 -60 37 36 -42 -42 42 27 -66 -30 45 2 -71 -18 50 -19 -69
1942f9Q3L8q1l1J00Kr3J7Q1k1q3L9P7n3o0N5M9o0n4Q2L4q0j7P8J7r0kP8j1p5J1
$$ -69 14 52 -29 -60 40 42 -51 -34 47 26 -57 -18 59 6 -54 1 50 -10 -64 18 52 -28 -45 33 50 -40 -42 36 25 -50 -39
1973c9Q8m2o8L7O2n6n3O7N2p1m8Q8K4p6qP5Kp7J4P9k4p2M2O3m6o3N9M2o8l1O7
$$ -39 49 7 -61 -24 38 -18 -71 -4 48 -23 -71 17 41 -35 -43 32 34 -43 -29 50 26 -46 -4 59 13 -50 9 51 -17 -48 19
2004A9L1q6oP4%p7J0Q2k8q0M1O3m9n4N3N3n7m6O5L2o2l3P3Po6MP3j8n9J8O4l1
$$ 19 50 -36 -42 32 32 -45 -35 47 19 -61 -20 43 -6 -60 -7 46 -11 -57 8 40 -22 -55 18 25 -41 -37 36 18 -41 -23 41 10
2036A0n5M4N1n3m1O1L3p0j7P7Qp1j4O9kp5K3O2l0n4L6M5m1m6M7M3o1k8P0J3o9
$$ 10 -45 -1 50 -3 -44 17 50 -20 -37 40 48 -23 -37 32 30 -45 -22 40 10 -44 -8 37 -4 -50 -3 40 -21 -49 21 34 -35
2067c5rP0Ko5PP1k9m8K8M9l2n3L9M6l8m6N4L2o0j5O1Mo4MN9j4n7K1N6l2n4M3L2
$$ -35 -44 26 28 -37 -30 41 12 -36 -8 41 9 -44 -5 41 3 -43 11 43 -17 -32 29 33 -31 -27 32 18 -39 -18 38 6 -48 -5 27
2100B7l9m0N6K9o9j0O4Nn8J0N6j1n3K1N8l2n5N0M8n2m2N5K8n5j8N4Pn8kN7%p0
$$ 27 -12 -52 4 33 -36 -46 18 23 -35 -25 31 20 -33 -12 46 14 -41 9 57 5 -37 18 46 -9 -27 27 34 -24 -26 31 31 -39
2132c9K0N0j6o1L2M7l0n1M6L7n3k5N2J4n7oN7Ln4J0N2j3n3L4M3l4m3M7K9l6l4
$$ -39 -19 31 15 -46 -14 33 3 -48 -2 35 -18 -43 9 23 -34 -40 17 20 -34 -24 28 15 -38 -4 39 5 -38 9 38 2 -32
2163c2N6J8n2k1O4kn9JN9qn6J4N1k8n2L9M3m6l0L8L3n2k1N6J4n9PM7rm9J6M8k0
$$ -32 24 42 -10 -31 33 31 -28 -27 32 24 -32 -18 33 5 -47 -8 35 -11 -41 -3 30 -22 -43 13 27 -32 -25 22 13 -36 -20 28 8
2196Hm3L2L4l4l8M1K8m4j2M3K3n6oN6lo0K8M4l2l5J6M1l6l5L5K6l7k6M5J6m8j2
$$ 8 -35 -3 31 -3 -41 0 28 -16 -28 15 38 -18 -24 32 29 -31 -3 41 9 -26 -10 31 -5 -40 -5 21 -16 -42 3 19 -29 -41
2228d1M7Pm9J3M9j3m1QM9k4l7K8M4l7l5L8K7m0k0M4Qm5pN0%n8K6M1l5k9K8L1l7
$$ -41 6 13 -36 -23 26 13 -28 -20 29 5 -32 -4 40 3 -32 6 33 -7 -27 17 25 -20 -27 23 23 -35 -9 32 -3 -32 -4 27 -10
2261a0k7M3J9m7j2M6J0n6JN0om4LN3k6l8K9L8l0k4K9L3l3k8M0K0m3rM2jm5ON1
$$ -10 -37 6 25 -22 -34 12 22 -34 -33 17 11 -33 -30 23 -3 -41 -12 26 -4 -28 1 34 1 -27 13 33 -10 -19 23 22 -23 -17 34
2294C4k6l4J2M1k4l8L7J7l0k0L2K3m8JM1mm6NN0j8m8K5L7k7l1K8L6l7j6L5J5l1
$$ 34 8 -26 -14 27 3 -35 2 19 -11 -31 1 24 -24 -23 18 14 -32 -27 23 5 -43 -18 19 -8 -39 -11 25 -12 -28 7 22 -9
2326ij1L3J8m7OK9J1m6NM8k6l7K7L2l0l6L6J8l0k2L8Pl9j9N8pl7PM1j1m1K3L5
$$ -9 -20 13 31 -16 -10 19 30 -16 -11 37 11 -26 1 33 3 -33 3 21 -9 -31 7 14 -25 -44 14 7 -30 -23 18 7 -34 -11 24
2359B4k6k6K5K5k7k9M0J1l5j0M3Nm1ML8ol2J6K5j9k6K0L8l8k2L0J7l9k1M8J1m3
$$ 24 -2 -28 -3 22 -5 -34 6 17 -18 -28 15 20 -21 -17 21 15 -17 -1 24 5 -21 -1 37 -1 -23 7 24 -15 -36 12 23 -20
2391b0nL4Km6J3L3j6k2MM3j7l0L2K1l3j9M4Pl0JK6Mm6J0L4j7k8K2K5k9j9K9K3
$$ -20 -25 9 11 -35 -22 11 -5 -27 -23 20 3 -27 5 26 -7 -26 18 25 -5 -4 22 26 -20 -10 24 7 -21 1 26 -3 -22 7 30
2424C0l0j9K5K0m6jL0Ll7QK7ol6J0L2j0l7L2K6l5rK5K1l6j0L6J8m1qM6Km8J4K9
$$ 30 0 -19 6 26 -20 -21 9 12 -25 -17 10 4 -32 -22 10 0 -37 -5 21 -14 -23 2 23 -13 -23 13 31 -10 -18 28 30 -18 -4 25
2458B5pl6K2J1j4k5L2Rl4jK4Ll3jL1Ol5ML3j0k8J2K1j5k5K5K0k9j3L0J6k4j6L0
$$ 25 18 -18 4 15 1 -24 8 17 -17 -18 6 9 -24 -25 6 12 -23 -19 14 4 -24 -12 9 -6 -31 -6 14 -15 -28 2 18 -6 -22 8
2492HJ0l2%L4Ll5%M3k4k2K2K1l2j3K3J4l3pL1ll0%K9mk4KL3j8l0K9K6k5j2K5J7
$$ 8 18 -14 -14 20 23 -12 -12 31 7 -15 7 28 -4 -17 6 20 -13 -20 11 8 -22 -22 7 3 -21 -19 14 -4 -34 -5 21 -4 -16 9 26
2527B6l9j0L5Nk4pK6Mj8rK9pk9J2K8k1j5J7J3j8j9K7J8l3j8M1%l3kL4ql7J4L1
$$ 26 -13 -23 12 17 -7 -14 12 16 -2 -11 18 11 -18 -6 22 1 -14 3 16 -2 -21 6 24 -9 -27 14 14 -19 -21 13 5 -32 -18 13
2561A3j8k0K2J9l1j5K4K6k5j9L4Pl6J0K5kk6J0K5j9k1J8K4k3k3K7J3k8j1K7Ok3
$$ 13 -5 -25 -3 16 -15 -30 -6 20 -5 -24 10 17 -19 -9 16 14 -12 -2 23 4 -17 1 25 2 -21 6 19 -9 -20 7 13 -10
2593a0pL3ok8J0K6j0k2ML1j9k7K1J4k1j4L0Mk0lK7oj9PL7j8j9PK5j4k2J2J7j9
$$ -10 -17 16 10 -18 -8 18 8 -14 -10 21 2 -25 -4 10 -11 -25 5 9 -11 -14 13 7 -12 -5 32 14 -5 2 27 13 -9 3 20 1
2627Aj9L3Jj8j4K1%k4RJ6mk8PK8ok5J1K6k6j1K5Kk1QJ1J0k4oK6jj3jK2j4j9K1
$$ 1 -18 15 16 -2 -16 5 5 -19 -10 6 2 -26 -19 9 3 -22 -11 15 -11 -22 3 5 -16 -8 3 13 -11 -17 9 8 -5 -6 16 2 -17 4
2663DJ5k1rJ8Jk0pL1ok4QK2j0j9PJ8qk2J0K4k1k1K3J5j2qJ2J6k7qK3J2k1pK8j1
$$ 4 19 -2 -11 7 8 -12 -19 12 6 -18 -10 12 2 -17 -10 8 0 -22 -12 12 -9 -30 -7 8 -4 -12 0 16 -11 -19 4 16 -5 -12 16 5
2699Ek0RJ9nj6J2J7j5j8J9J3k3%J4Jk5JL6j2k6OK5k4j2J3Rnj0J3J5k6kJ5Nk2j
$$ 5 -15 -6 13 8 -8 4 21 6 -12 7 20 -3 -3 11 12 -13 -12 24 12 -14 -8 17 -7 -19 -6 3 -2 -12 1 16 -10 -12 3 8 -14 -15
2735a5K3nj2PK0j1j8J3J8mk2K6jj7nNJ6j2j7J6Rj7j0K6j4rJ4J1j1oJ1Oj3j2K1
$$ -15 8 3 -9 -2 18 7 -11 2 20 16 -6 20 19 2 -3 2 18 6 -11 5 14 -3 -13 13 -1 -10 4 15 4 -2 9 15 2 -10 11
2770A1Lk3mJ2Rj9QK0k2jNJ0qj1J2J4pj8K3Qj8mJ4J0k5mJ6nk4OJ9j7j0J0J8k1r
$$ 11 14 -9 -13 -1 8 -11 -3 17 -5 -6 -1 9 1 -10 2 16 9 -9 14 22 4 0 14 24 -1 -5 11 6 -18 -12 7 -10 -20 -10 8 -13 -22
2807b2K2J0k0qK0Nj2nK6ol0J9J1kj7J6J3j2j5J5Mk3mJ8kNrJ1Ok7J2J8rj0%K2k0
$$ -22 0 10 -10 -18 2 7 -5 -10 16 10 -20 -1 10 8 -9 7 20 8 -7 8 12 -11 -15 3 1 6 -3 8 14 -13 -1 17 8 -2 -2 20 0
2844@j5J3J1j4qK6qj4mJ6Mk4MJ5%k0K0Nj0nJ4J3j7nRQj4NNKj7%J2kk1J3Pkj2j
$$ 0 -15 -2 9 -5 -13 13 5 -9 -13 3 7 -17 -13 2 2 -18 2 7 -3 -8 6 19 2 -3 6 14 0 5 10 12 -5 -5 7 5 -16 -3 4 2 -10 -11
2884a1K0j1j2NJ9k3lJ3Pj7nRPj6J1J8j3pkJ7mj0J4Pj8lK1Kj5nK3qj1MJ1j1j4J0
$$ -11 9 -2 -14 -9 10 -13 -16 -3 4 -13 -18 -9 -2 -18 -7 11 -2 -9 -11 6 2 -8 6 13 -5 -8 13 15 0 -5 18 10 -1 3 14 3 -11 -1
2922aJ3j9nJ2Rj5pQJ3j4%J1%k0LJ6mkJQoj0JJ1lj2RQNj8K4Lj7MPKj6MJ3kk1J2
$$ -1 12 -7 -12 0 9 -6 -13 -5 8 -6 -6 5 5 -15 -12 4 0 -2 -1 7 1 -9 -8 3 0 -12 -3 5 10 -8 16 19 2 6 13 15 -1 3 16 14 -7 5
2964EKmqPJ0k5LJ2nj0JJ3Jj9OJ5qoLJ5rmJ6%JomLLj3J3Pj6%J1mj3ROJj3PJ4k1
$$ 5 7 3 -5 2 12 -13 -10 2 -3 -13 -12 1 2 -17 -11 4 -4 -10 -7 8 -1 -5 11 11 12 6 2 5 8 -5 8 15 -1 -1 10 6 -7 2 8 9 -4 3 17 -4
3008doRJj0%J4j1mjQ%j1JJ4lj2LJ1pmJ9LrKPqkPpJqMJ0Jj3MQj3JKJ0j2lMQj4Q
$$ -4 -10 -1 0 -10 -10 4 -7 -11 -12 -4 -4 -15 -14 0 -3 -15 -12 -1 -8 -12 7 10 1 3 10 2 0 7 0 1 -7 -3 7 8 -5 -1 7 -6 -5 -3 7 -5 -8 -4 4 -10 -2
3055bMJj2ONqnRRk1LLJ1j4QNkq%K1lj3PMo%jQj0oMJ1j3lNQoKlLj4MJ2%j2JJ4j1
$$ -2 2 3 -9 -3 2 -6 -11 -2 7 -14 -11 -8 3 -11 -3 2 0 -8 -8 13 10 -3 4 8 2 2 1 9 -1 -7 -3 8 -5 -8 -3 5 -1 1 -2 1 -13 -9 3 3 -9 -8 6 -5
3103ekP%rKRMnj1J4%mOMon%J0qmJ6Mj2oPOqpJ5jk3OJ1lj3RPj5mNJ1okPL%mMNj3
$$ -5 -7 0 0 -9 -7 2 6 1 -10 4 4 0 6 10 4 -1 -1 9 1 -3 13 17 5 -1 6 12 4 -3 12 11 -12 -6 5 2 -11 -2 5 -10 -14 -9 2 -4 -6 1 4 4 0 4 9 -4
3153dMJ7lj3J0Qj1nP%kmJ0jj1lNkj2RJ1nj5PPnolJ1prQRj0jLJj1J3MKpOPKj5J2
$$ -4 0 17 14 1 11 19 8 3 10 10 8 4 14 13 2 -1 4 2 -10 -1 10 5 -10 -3 4 -1 -7 -10 1 -6 -15 -7 2 -8 -9 -6 -5 -16 -3 1 3 -4 2 9 11 -4 8
3200HNj2LPMnqNJpqJ4Jj4lJ1nj4J3OqmlRm%LRj9MRLnmJ7kj5PJ2plJ0jqkPMnqN
$$ 8 13 1 4 11 15 10 2 7 8 1 -7 7 8 -6 -9 2 -3 -17 -4 2 -6 -10 -13 -4 -8 -8 -5 4 -15 -11 -2 1 -4 -8 9 7 -8 -1 11 4 1 11 10 2 0 7 11 6 -2 3
3250CNj5MJJ1j7KJ4j1jqLkkNJ3j0j1J8Kj0J1mKj1QPqk%J5j5kJ0JomRljoJ5Kk0
$$ 3 8 -7 -3 -2 9 -8 -6 8 -3 -4 -12 -9 -11 -13 -8 5 -5 -16 2 4 -6 5 1 3 -8 0 7 -1 -3 -3 12 -3 -5 5 6 0 -4 5 2 1 -5 10 12 -8
3294hJ3j0J3r%%jpJ0Mj1kNjJlKNoQMnlKJ3qj3RRopQPj0%PkrjJ1ojkPr%lJ4oj7
$$ -8 5 -5 8 -1 -1 -1 -2 -9 1 5 -6 -8 -3 -4 -3 -6 -4 1 -5 3 7 2 -1 1 14 6 -7 2 11 5 -2 6 13 3 3 10 8 -1 -2 9 3 2 0 7 -2 -2 -5 9 3 -14
3344a4J4LrkJ5mqpJ9j0jMNKj6KJ5j2PROpqOJ1j5QMqlkJklMlMk1J7kj2MJ1jj5J1
$$ -14 0 3 -6 -8 7 3 -5 -12 7 -3 -4 0 5 7 -9 -7 8 -4 3 12 18 11 3 9 20 5 13 17 9 6 4 5 3 0 4 1 5 -16 1 -1 -13 -9 2 1 -14 -3
3390cKNnj0J7pj1RMkkJ0nLj2J0MlrJ6Jq%QJj3RLpj0RJ0j4qLJonPOj7jJ6Lj2QJ1
$$ -3 -1 4 -1 -11 6 -1 -12 -3 1 -1 -3 7 2 5 -7 3 7 4 -5 11 12 4 4 12 13 0 9 12 5 -5 4 14 0 -8 -5 -4 -10 -15 -8 -2 -19 -20 -4 -1 -13 -5 6
3437FmoLmJ2rNRj7mK0lj8NJ2kj3J2%knkOKnMoKj2J4kqqK2pj2KOKpNN%rNJ6pqJ
$$ 6 2 -4 -1 -5 7 -2 3 12 -5 -9 11 8 -10 -5 7 5 -8 4 4 2 -3 -5 1 3 -2 2 -4 -2 -14 0 -2 -10 -18 4 -3 -15 -13 -7 -5 -12 -7 -2 -2 -11 -6 10 3 -5 -4
3486dOKj0J1Oj0%J1krmJ6j3OoJ6rqO%j1pJ2J1roQKj3lJ2qN%JLj5RQj2lRL%kOj
$$ -4 2 4 -6 5 11 1 1 12 10 1 -3 13 0 6 0 16 7 -1 5 5 -6 -13 -1 10 1 -5 3 5 -8 -11 1 -7 -2 -2 -1 2 -13 -4 4 -8 -11 -2 1 1 -1 5 4
3533DMLkjmLPkj1R%ppMPj1mMKj0LLNj0MJ0kj1J1Mj0%OLmmQ%rLJ4Rj9%K0j3ojP
$$ 4 8 11 9 8 4 7 14 12 1 10 10 3 -4 0 7 -4 -8 -4 -2 -12 -9 -6 -1 -11 -7 3 1 -10 1 5 -5 -5 1 4 0 -4 4 4 -5 -2 12 21 2 2 22 9 3 2 9
3582Imj1RJ2qpKLqnNKqjPKpKRjj4OJ7j6jJ2J1j8kJ6mljRopQKnjlpQrQOqmJ2Kj5
$$ 9 5 -6 3 15 7 0 2 5 -3 -8 -3 -1 -9 -10 -3 -1 -8 -6 3 2 -12 -6 11 -5 -6 6 17 -1 -3 13 9 6 5 14 8 1 9 11 6 5 2 -5 3 -6 2 8 0 -4 8 10 -5
3633e%J2kkoQlqJ1rMj1J0J1j1j4J9jmjJ4lkNkJ4k0OnJpJ0jkj0J3nkoOjlj4K4J
$$ -5 -5 7 5 3 -3 5 2 -6 5 -4 0 -11 -1 10 -1 -15 4 3 -1 -2 12 9 7 12 10 24 4 10 5 6 -1 9 8 6 -4 9 4 2 -4 2 1 -2 -16 8 9
3678Ij8JJ9j0j2MJ2lkNnklNNj0MJ2qn%J1Jj4LJ4rmJ0mkmLkkj1J0Jj2JJ6j1pLJ2
$$ 9 -9 -8 11 1 -11 -7 5 2 0 5 0 -2 -5 0 5 -5 -1 11 3 -2 -2 9 10 -4 -1 13 4 0 10 6 4 0 3 1 -1 -12 -2 -1 -13 -12 4 -7 -14 -11 1
3723Aj5OKJ0roMN%oJ0J%lO%j0LPnj0J3Jj1NPJqPmMqpJ5nj2OKLj2LJ3j1KN%okJ1
$$ 1 -14 -8 -6 4 -5 -11 -7 -2 -2 -8 2 3 3 0 6 6 -4 -1 6 1 -9 4 5 -6 -1 6 7 -1 6 2 6 -2 -9 6 1 -11 -5 -3 0 -12 -9 4 -7 -5 0 0 -6 -8 3
3772CJj0PJ6rjmMLJkLnjOkj0OKJqoJ1jj1OKKj5J4mlokJ4nmkRJqNPj2MKjNoLJ0
$$ 3 4 -6 1 17 8 7 3 7 10 11 9 12 7 6 12 10 0 6 8 9 1 -5 6 5 -6 0 2 4 -11 3 -1 -4 -10 -12 2 -3 -7 -9 0 1 -7 -2 5 -7 -3 -1 -2 3 -3 0 10
3823A0qKPj3LJ0mLmQqllLPj6NjoLkPoKMRrj0J3lo%OKkM%njJPkqlJ3oKQllnRkj0
$$ 10 2 4 11 -2 1 11 7 10 6 14 6 3 0 3 10 -6 -1 -2 -8 -5 -7 0 -6 -4 0 9 0 -10 3 0 -6 -6 0 2 0 4 4 -1 -2 -1 6 4 -4 -7 6 0 2 10 7 4 -1 8 6 -4
3877dPJjqR%orJ2lj1kJ2Oj5J2pRj0KJ3rjjJ6rnMNrnJ2LplMJjPKopLQqLj%jrQN
$$ -4 3 4 3 -5 4 4 -2 -11 1 -2 -13 -15 -3 3 -12 0 -7 2 -8 -6 7 -2 -3 -4 12 3 -2 2 7 -2 -7 5 8 1 -2 2 3 2 9 11 5 -2 1 9 1 4 3 3 2 -7 1 6
3929FqoQlnQj%nJPKrJ0pk%J2l%pJ0mmOJln%OLj9PJ1poMkj%Ll%%JNnqJ1o%lJ2p
$$ 6 -2 -8 0 -3 -8 0 -1 -1 -6 -5 2 4 -5 5 -2 -4 -4 8 5 5 -2 8 4 0 6 7 4 -1 -1 5 8 -11 -4 7 0 -6 -2 -4 -5 -5 -2 -5 -5 -5 -4 1 -4 -12 -1 -7 -7 -10 2 -5
3983emLPlLOK%k0K1%oJNLj2LMqLqPjmkJ0j1kMKlLRkj6NJ4nrkJ4jrQJmMK%%j0R
$$ -5 -9 -6 1 -2 1 7 9 9 -11 10 10 4 5 10 13 1 4 8 0 3 -5 2 1 -3 -5 5 -6 -8 -4 -2 -5 -2 7 5 -11 -6 8 3 -6 -8 6 5 -4 4 5 1 5 7 7 7 -3 6
4035FPj3nLJ0j1NlMnLJqQ%Qk1NNqoNJ2nkMMj3jROqRnMloJ3MonN%kkJ1j1JkPpM
$$ 6 13 0 -5 -2 8 -3 2 -1 3 -2 1 2 -6 2 2 10 -11 -6 -1 -9 -15 -10 2 -3 -5 -1 3 -10 -11 -2 4 -4 5 0 4 1 -5 8 12 6 1 6 6 4 2 13 2 3 1 8 1 5
4087EoMj2P%jNj3J2Lj1Q%nj0OJJlJ0j0%NNRkj8J2J3j6POJ2k7LNkLoRj3jOOrlj
$$ 5 -1 3 -9 -2 -2 -3 2 -11 1 4 -7 1 1 -4 -14 -8 -7 -6 -9 1 -9 -9 -4 1 10 8 -10 2 15 -1 6 12 24 -3 0 5 3 6 0 9 -4 -5 1 7 -2 -5 -6
4134fJpLJ6j6kLJ0MlmKOj5POLj3Q%oKJ0j1lQ%QopJ1pKOKj0okJ0plKQj0j1J1lJ
$$ -6 -5 -12 -9 7 -9 -11 -8 2 6 3 -1 1 7 -8 -1 5 8 -5 3 3 -3 -1 9 -2 -5 3 3 11 5 -2 9 2 4 10 12 2 -4 -6 4 -3 -6 -4 4 -6 -17 -6 -9 -8
4182hj0J5Jj2J5Nj1NPnPj5J1jj1PMPj2kOKj4QQPj8MPpmMMmkKmqQqPoJ0%pKPKl
$$ -8 -18 -3 -2 -14 1 6 -5 0 7 2 9 -6 5 4 -7 0 4 11 -1 -3 3 5 -9 -1 7 14 -4 0 7 0 -4 0 4 0 -2 0 -4 -12 -4 -12 -5 -11 -1 -1 -8 -6 1 3 0
4231@j1J7P%j3%J3j1LkLj5J1NomKKnJ1j3QrMJOopJ1nrJ5kj0J0mLnmRMjoKPj0K
$$ 0 -11 6 13 13 0 0 13 2 5 3 6 -9 2 7 1 -3 -1 1 -4 7 -6 2 -7 -3 -2 4 -2 -9 2 -3 -12 3 1 -9 1 -3 0 -5 -9 0 4 3 -3 -1 6 -4 -2
4278bJ0Mj5J0OlqKJ0Jj4MQkj6PKpJmPrjJ4rrQJ2qnJPJqkJ1qjMQloJ7qj2NMLoM
$$ -2 8 12 -3 7 13 10 2 4 14 15 1 5 13 11 -5 2 4 -3 -2 -6 1 -8 -9 5 -4 -13 -5 7 -1 -6 -5 2 3 -5 -7 4 -4 -5 -1 7 4 -2 15 7 -5 0 4 7 1 5
4328ELm%jMKj0J4rj0J0Nmj0lJLrPJ3%j8NN%oPOqLJ4qoQnjkj4K2j2oJ5%kmKMkj
$$ 5 8 4 4 3 7 9 -1 13 4 -6 4 9 5 -5 -8 -7 -4 -13 -6 7 7 -11 -6 -1 -1 -7 0 6 -2 1 15 7 1 9 4 3 1 -13 9 -3 -9 6 6 4 0 2 6 4 3
4377CLkolLRj6QNpkLj%rMRklKQnoJ6lj0jJ1njNjMjnmQnjmjLnNk%PjoJMok%MKl
$$ 3 6 4 -2 -5 -2 7 -9 -1 4 -3 -5 -2 -3 -3 -12 -8 1 -1 -4 -2 6 1 -5 11 8 -2 -3 8 3 2 7 6 10 9 4 0 8 3 2 -2 -3 0 -5 0 -2 -2 5 4 -2 -1 3 -3 -5 -5 -1 1 -2
4434bOklkJ1j1JpJ5Nj7J4lOj3PPmnRJj6nJ9q%nOkj0KJ0pj0MOmK%R%j0J2%j2PJ
$$ -2 4 2 -1 -3 8 -3 -2 -9 6 11 -6 8 5 11 -2 5 12 8 3 12 13 -3 -8 11 3 3 -2 4 2 -8 -6 4 -3 -13 -9 -3 -7 -5 -5 4 4 -6 6 6 -6 1 2
4481BQj0oJ7nj0J0nRmL%rJnJ2j1MMnPkrJ0q%OLrqJ0ll%QrNkRoRKpL%K%j0PNnn
$$ 2 10 0 -6 11 6 -4 6 1 10 6 9 9 0 1 -4 8 -3 1 5 0 7 5 -4 6 -2 -2 4 7 -2 -10 0 -3 -6 -6 2 -7 -2 -4 5 -1 8 10 3 6 6 8 8 -2 5 10 5 0
4533@J0kJj0PJrlPQj8PNKo%LrjNMkmJMmrJ8rjQOlpkJ4%j1PKllLRmokMnrPOo%%
$$ 0 10 8 9 -1 6 7 -2 -5 2 10 -8 -1 4 6 0 0 3 -6 -7 -2 2 0 -4 -3 1 -3 -12 6 -3 -4 4 10 7 0 -2 12 12 1 8 10 7 4 7 16 12 6 4 8 3 -6 1 7 1 1 1
4588Al%NkqNJjQoNlj0J1jMr%M%kMJNqPLpJPQk5J0jjqLMnoMOMj8LJ2j3lOPknMn
$$ 1 -2 -2 3 1 -7 -2 -1 -2 6 0 5 2 -8 3 2 6 -3 -3 1 1 -1 3 4 9 1 8 11 4 5 12 20 -5 5 4 3 -5 -2 2 -3 -9 -5 1 5 -13 -10 2 -11 -14 -8 -1 -3 -8 -4 -9
4642iJ0Oj2J1nP%kj1J1KJpJOjrPJrNQqLjkPj9RLkrOKnnQNrkJQrkOL%LKJj2J7k
$$ -9 1 7 -5 6 1 8 8 6 -5 6 8 9 2 3 9 8 -1 6 7 -2 3 11 3 6 5 3 10 -9 0 3 1 -8 -2 0 -5 -10 -2 3 -6 -8 -7 1 -8 -10 -4 -1 -1 2 4 5 -7 10 8
4695HJkLmNkj5OJLmNomOJj4J0QkomNrPQoMj0OLkjjMnOJk%JRpjllMMMMj6ONj0J
$$ 8 9 7 10 6 11 9 -6 0 1 4 0 5 -1 -5 1 2 -12 -2 6 4 -2 -6 -1 -10 -3 5 -1 3 -7 -1 2 0 -1 -2 2 -3 3 4 2 2 3 12 5 4 1 -2 2 6 10 14 -2 4 9 -1 0
4750@lOmlmMmnMQOj0nJ1lkPjPmMJj0nQQqLpMj%MqN%Nj0PjKlkNjjj0O%q%RoRpk
$$ 0 -3 3 -1 -4 -8 -4 -8 -13 -9 -1 5 -5 -10 1 -2 -4 3 2 9 5 9 10 0 -5 3 11 3 6 -1 3 2 2 6 -2 3 3 8 -2 5 4 6 3 1 6 5 4 -6 0 0 -8 -8 1 -5 4 -3 -5
4806el%J0JoJlKOMOj4MLkKj0J0KkpJRj5NJMqROj0nMJrkOLkrMkPnrRQj0OjlJ3L
$$ -5 -8 -8 2 3 -3 -2 -5 -3 3 7 13 -1 3 6 4 6 -4 6 8 6 -1 0 9 -6 -1 0 4 -4 5 11 1 -4 0 1 -8 -10 -4 -1 -3 -12 -8 -10 -3 -8 -17 -8 0 -10 -4 -5 -8 5 8
4859HjqJ2Lj0jNkmKKmnkRJj4PLnKqLkJOMkJmLmKMrPoQk%JNm%kR%qJ2rlLPj4kJ3
$$ 8 7 -1 11 14 4 3 8 6 2 4 6 2 -3 -5 4 5 -9 -2 1 -4 -2 -10 -7 -9 -8 -2 2 0 1 -3 0 -4 -2 2 -7 0 -6 2 0 0 1 6 2 2 0 9 9 1 13 4 1 4 11 -3 -5 8
4915HqOkrLKoLj2RnKOj0MOlOj1J7n%lNKLjnOpOjl%NlkmOjJJnmLMmJkjoMlrJ5o
$$ 8 0 6 4 -5 -2 0 -6 -3 -15 -6 -11 -9 -3 -13 -9 -3 -6 0 -11 6 1 1 -2 3 5 8 7 2 8 1 7 6 3 3 8 5 3 -1 5 4 5 6 1 -3 0 4 0 1 -1 -2 -8 -4 -7 -16 -1 -7
4971gj1K4j0MpJ1JjqJ5m%%Lj%qjQj0LRj0oORpmMMj4J0jn%OkoJLOlNmjkjkLjLl
$$ -7 -18 6 -4 0 -7 4 5 4 -4 11 7 7 7 10 9 9 1 0 8 -2 1 10 0 -6 0 9 2 -2 2 6 -8 2 1 -4 -4 2 0 -6 -5 -2 4 1 6 2 1 -1 -2 -4 -1 -2 1 -2
5023bJnPKLmKmmMMNj1QpKmJjPj3QKoJnOJpPl%mJJ0o%QLj1O%JpNPj1RnJ3j0LLr
$$ -2 -1 -6 1 3 6 2 4 0 -4 0 4 9 -2 6 -1 1 -3 -2 -3 4 -9 -1 1 -5 -4 -9 -3 -2 -9 -2 -5 -5 -9 -8 2 -4 -4 4 7 -4 2 2 3 -4 1 8 -3 6 1 14 4 7 10 1
5077AjJOmjPj2KnOkplRjpJjOmJNPrJ2Ko%NjJkOmpjKMk%jnPlOllRqk%JmLJmlmj
$$ 1 0 1 7 3 2 9 -3 -1 -6 0 -2 -9 -12 -3 -4 -11 -10 -11 -5 -9 -8 -3 4 -5 7 9 3 3 8 7 8 6 12 8 1 0 2 6 4 4 3 -2 5 2 8 5 2 11 3 1 1 2 -2 1 2 -2 -5 -9 -10
5136a0%PpKjKNkOLqOJ1k1J5Kj2PllMKmKoMMQj7%QLj0%RmlnPmmMLj3R%mJ4nrRj
$$ -10 -10 -3 -10 -8 -9 -7 -2 -4 2 5 -3 3 14 -7 8 10 -2 5 2 -1 3 5 1 3 -3 1 5 13 -4 -4 4 7 -3 -3 6 2 -1 -6 1 -3 -7 -3 0 -13 -4 -4 -8 6 1 -8 1 0
5188@lJ1jnJNJlMQnj2MKmJ3oJlqMJj1Q%rQj0J0oJKn%MJMkoNLnNj4OlRM%Nj0Pk
$$ 0 -3 8 7 2 3 8 9 6 10 18 13 1 5 7 3 16 10 11 8 0 4 5 -6 2 2 -7 1 -9 1 -5 -4 -2 -7 -7 -3 -2 2 0 -6 -1 2 -3 2 -12 -6 -9 0 4 4 9 -1 6 4
5241DMlPkpNnLnO%kqOlknLKqQKmm%J7j5QnNLpMKJ%J0j8KOQmpJ2qkjPLj0Kj1J2
$$ 4 8 5 12 10 3 8 3 6 1 7 7 5 -3 3 0 -2 -7 -4 -2 -10 -2 0 -4 -8 -8 9 -6 2 -3 2 5 -2 2 4 5 5 15 -3 -1 5 13 9 2 14 6 4 3 10 13 3 5 -6 6
5294FrLLPj2nJ2nKpKJNrMKoNjPj%Lk%J1pPrJ4j2jlJMj1KjmKM%oMmLKmjjmJ7qQ
$$ 6 -3 0 3 10 -2 -7 5 0 2 -5 -3 -2 3 -6 -2 0 -6 -1 -2 5 4 4 7 5 5 16 9 16 7 21 9 8 5 6 10 -1 1 0 -4 -2 2 2 -4 0 -4 -1 1 -3 -4 -5 -9 8 0 8
5348Hj5J0jpLMR%rkJ0qKlJ4j5OjMNmpJ3k2K6j4kJqOnJjnOkjJkJ4pnMpJ3mKMmm
$$ 8 -7 3 2 -5 -2 2 11 11 2 0 10 2 4 1 15 0 6 5 9 14 10 3 16 -6 20 6 4 5 -3 3 -2 -1 -2 -7 -1 -3 -4 -3 -5 9 2 -3 1 -6 7 3 5 9 5 1
5398AQoNj6J6j6QLQoLjonLJ0Lkn%JNjkj4KlLmlRMj3OKPpNkNlNlJ1Kjm%jlk%Lj3
$$ 1 9 3 8 -8 8 -8 0 3 11 5 8 7 1 -4 -1 9 12 10 5 5 6 11 10 8 -6 -4 -7 -4 -8 -11 -2 2 -11 -5 -3 4 -3 2 0 5 2 7 4 15 17 16 12 12 11 8 6 6 9 -4
5452dJ3JrlNKjpMjj0J0JlmKNjKrNkjJKJOnKKmJ4%pLMkoJQpKMj9J4j4J5oj8J7n
$$ -4 9 10 1 -2 3 5 4 -3 1 0 -10 0 1 -2 -6 -4 1 0 2 -7 -2 -4 -5 -4 -2 -1 5 0 2 4 0 14 14 7 10 14 12 6 7 15 8 10 14 -5 9 -5 10 4 -14 3 -2
5503bPnKNjlKmLpLJ5j5MLPrmNKo%PoKmlPMKMlkjlKj0MPljl%lJoNm%kNJNMpqQN
$$ -2 5 0 2 7 6 3 5 1 4 -3 0 15 0 4 7 14 5 1 6 8 2 2 9 3 5 1 -2 5 9 11 15 12 10 9 6 8 -2 2 9 6 5 2 2 -1 0 -6 -1 -5 -5 -7 -2 -1 4 8 1 -7 1 6
5561FqQkkQnOoLl%%qNMKpKOjrQj2OjnMQlJnkKrRkkQqNPljnPoNPpJ0oOnlMmkLj0
$$ 6 -2 6 4 2 10 5 11 5 8 5 5 5 -3 2 6 8 1 3 9 8 -1 7 -5 1 0 -5 -1 7 4 5 0 -2 0 -9 0 -2 -4 4 -4 1 8 5 4 -1 6 0 5 12 5 15 9 15 10 7 11 7 5 8 -2
5620bLMjNnljPo%l%LJpJ3LqlNMj7N%%JMRKj1J2nNnjlMlOj0Qm%%kj%%kolJPoNO
$$ -2 1 5 4 9 4 1 0 7 1 1 -2 -2 1 2 -5 8 11 3 0 5 9 -8 -3 -3 -3 -2 2 11 13 2 14 9 14 9 8 5 9 6 12 2 10 6 6 6 4 3 3 3 1 -5 -8 -7 0 -6 -1 5
5676Ej2MlLjQmllMMjNLj0kOLNkjj%Po%KnjPqkLj%JkjoL%klKmMlJ2KmqJ0MnJ2o
$$ 5 -7 -3 -6 -3 -4 4 0 -3 -6 -2 2 1 6 9 -1 -3 3 6 11 9 8 7 7 14 8 8 10 5 4 11 3 1 4 3 3 4 2 1 -5 -2 -2 -4 -7 -5 -9 -5 -8 4 6 2 -6 4 8 3 15 9
5732ILnJlLkkjJnRlmKPpkLkKk%JJ0j3pMlkMKKnRnOKkjMnLMQrNkjQPrnoMpMlJ1
$$ 9 12 7 8 5 8 6 4 3 4 -1 8 5 1 3 10 3 1 4 2 4 2 2 3 13 0 -7 -3 -6 -8 -4 -2 0 -5 4 -1 5 7 5 4 8 3 6 10 18 9 14 12 11 19 26 17 12 6 10 3 7 4 15
5790A5qpMj0M%kLKOkqlJ3qjMkjjO%%kL%qQNj%%LnPnMkllKnkRojKJKj1LjoJ3nM
$$ 15 7 0 4 -6 -2 -2 -4 -1 1 7 5 -3 -6 7 -1 -2 2 0 -1 -2 4 4 4 2 5 5 -3 5 10 9 9 9 12 7 14 9 13 11 8 5 7 2 0 9 3 2 4 5 7 -4 -1 -2 -8 5 0 4
5846Dlj2J4mNj0J1kJ%JKpPKJqP%jLoJJKkjMqJ5kpj1MoLlJ%LnJ0lpMLJL%LKlOq
$$ 4 1 -11 3 -1 4 -6 5 3 4 4 5 7 0 7 9 10 2 9 9 8 11 5 6 7 9 7 6 10 2 17 15 8 -3 1 -5 -2 -5 -4 -4 -1 -6 4 1 -6 -2 1 2 5 5 8 10 7 13 5
5900EJ0j2J1Kj3OlmLMJj4L%QoPj2lJ3lmkJLOop%NnP%rJ5nKNJj1J0mjNlJ2mj0P
$$ 5 15 3 14 16 3 9 6 2 5 9 10 -4 -1 -1 7 1 8 -4 -7 6 3 -1 -3 -2 1 7 1 -6 -6 -1 -6 1 1 -8 7 2 4 9 10 -1 9 5 4 9 6 18 14 4 11
5949A1jjlJ%mKmlJOo%jmLjlLJ0k1J3Mj1P%MkmNOj3NPoPn%MjKKPj2M%jnQjRj1n
$$ 11 10 9 6 7 7 3 5 1 -2 -1 5 -1 -1 -2 -6 -3 -4 -7 -4 6 -15 -2 2 -9 -2 -2 2 0 -4 1 7 -6 -1 6 0 7 2 2 6 5 7 9 16 4 8 8 7 2 10 9 18 7 2
6002BMqJkjkj1J3nLOkNlKLkKJ0kpLoNn%oRj4J6jLqQlnkKKrJ4j0MnlQjpKJqmLM
$$ 2 6 -2 -1 -3 -4 -6 -17 -4 -9 -6 0 -2 3 0 2 5 3 5 15 13 6 9 3 8 3 3 -3 6 -8 8 7 10 2 10 7 2 0 2 4 -5 9 -1 3 -2 -5 3 2 -5 -3 -2 -10 -14 -11 -7
6056gOp%PkRKpNL%KrMNqQrlKlkN%pQqJkjLkmNOrlJ0lJKJrLMJJmR%rNMQqlJ0j4
$$ -7 -1 -8 -8 -1 -3 6 8 1 6 9 9 11 2 6 11 3 11 2 -1 1 -2 -4 1 1 -6 2 -6 -5 -7 -8 -5 -7 -11 -6 0 -9 -12 -2 -5 -4 -2 -1 -10 -7 -3 -2 -1 -5 4 4 -5 0 4 12 4 1 11 -3
6114cJOMNrkjLnNkolKo%KLMnM%mPkmRLmNojMMmkjRlkooKJ1lmLjPj2NMomjJNmj
$$ -3 -2 4 8 13 4 2 1 4 -1 4 2 -4 -7 -5 -11 -11 -9 -6 -2 -7 -3 -3 -7 0 -2 -6 3 6 2 7 1 0 4 8 4 2 1 10 7 5 -1 -7 -5 6 3 -1 2 1 8 -4 1 5 -1 -5 -6 -5 0 -4 -5
6173eMnqjRrNOQpLNMkjJlJLkLrRljmKojOjn%mJ4j0OjmjkP%qjQlp%POnmOkJJNL
$$ -5 -1 -6 -14 -15 -6 -15 -10 -4 4 -3 0 5 9 7 6 7 4 5 8 6 9 0 9 6 5 1 3 -3 -4 2 1 -4 -4 -8 6 -4 2 1 -3 -4 -6 1 1 -7 -8 0 -3 -10 -10 -3 3 -2 -6 0 -2 -1 0 5 8
6232HlPqPnJ0pNj0NJkj6kJ2j1OmKJmlJ0pLj1J1%LKJNj4J0qKLMmjlPlMmMlRrMk
$$ 8 5 12 4 11 6 16 9 14 4 9 10 8 -8 -10 2 -9 -3 -7 -5 -4 -8 -11 -1 -8 -5 -16 -5 -5 -2 0 1 6 -8 2 -6 -4 -1 3 -1 -2 -5 2 -1 3 -1 3 0 9 0 4 2
6283B%oLJ2j2oLkNm%KpJlOj1J9j6KJ6rPqJ3nj3QRrQJrOkkJmRm%%krJ2rQKolMK
$$ 2 2 -4 -1 11 -1 -7 -4 -6 -1 -5 -5 -3 -10 -9 -12 -6 -17 2 -14 -12 4 -5 2 -6 7 2 -11 -3 6 -3 5 6 -3 3 1 -1 0 -4 5 1 1 1 -1 -10 2 -7 1 3 -3 -6 -2 0
6335@n%%Mp%LnMKmNnJ2Jj4QjOLqOKKqRoLlkmMoQmoMjMoKqKPjJkKmkM%Nq%MJrJ
$$ 0 -5 -5 -5 -1 -8 -8 -5 -10 -6 -4 -8 -3 -8 4 5 -9 -1 -2 4 7 -1 5 7 9 1 10 4 7 4 2 -2 2 -4 4 0 -6 -2 -3 1 -5 -3 -11 -9 -2 -3 -2 -4 -2 -6 -8 -4 -4 1 -7 -7 -3 -2 -11 -10
6394a0J2rKMJNoROqoPkoLMj6J0m%MknLj0J7k2MJ1oNkjJOjjlQNnNolkJN%KLnQL
$$ -10 2 -7 -5 -1 0 5 -1 8 14 6 0 7 5 -1 2 6 -10 0 -4 -4 0 -2 -7 -4 -14 3 -19 -15 -4 -10 -5 -7 -8 -7 -1 -2 -3 -6 2 7 2 7 1 -2 -4 -3 2 2 4 7 2 10 13
6447A3KnrPJMj5O%MpoLpP%kJoMmLkPlKqJ5loQKLpQmpQJjq%NloPkNmLjj0LLjmM
$$ 13 15 10 1 8 9 13 -2 4 4 8 1 -5 -2 -9 -2 -2 -4 -3 -9 -5 -9 -6 -8 -1 -4 -2 -10 5 2 -4 4 6 9 2 10 6 -1 7 8 7 -1 -1 4 1 -5 2 0 5 1 4 3 -7 -4 -1 -2 -6 -2
6504b%Jj1PJnNmNpkJ2lQoKMllJ1KoJm%l%P%n%mjjNpOmNoPnpPLnNqMQj0jkPLjm
$$ -2 -2 -1 -12 -5 -4 -9 -4 -8 -3 -10 -12 0 -3 5 -1 1 5 2 -1 10 12 6 7 3 3 0 0 7 7 2 2 -2 -3 -4 1 -6 0 -4 1 -5 2 -3 -10 -3 0 -5 0 -8 -4 4 -6 -7 -9 -2 1 0 -4
6561dP%KKnNl%MrJ3rOnjOqKom%NpKQj0MOj3mOJ1nlOkJLjLK%nlQl%QkoQqkkNM%
$$ -4 3 3 5 7 2 7 4 4 8 -1 12 3 9 4 3 9 1 3 -3 -7 -7 -2 -9 -7 1 -9 -5 1 -12 -16 -10 1 -4 -7 -1 -3 -2 1 0 3 5 5 0 -3 5 2 2 10 8 2 10 2 0 -2 3 7 7
6618GJpLK%qOnKmLlKlJOkpKMllMlJ1jKmLKoQnK%%jJkpLKoJ2j9J5j0PqJ0JknJO
$$ 7 8 1 4 6 6 -2 4 -1 1 -3 0 -3 -1 -4 -3 3 1 -6 -4 0 -3 -6 -2 -5 6 5 7 3 6 8 2 10 5 7 7 7 6 7 5 -2 1 3 -3 9 -10 5 -5 2 -6 4 5 3 -2 -1 5
6673El%n%qJNJ0ljnjLOo%J0jMkpjLMj1QNj4NLjmNLj3Pj%jNqmP%Rj2Lj%NqJ1jj2
$$ 5 2 2 -3 -3 -11 -10 -5 5 2 1 -4 -5 -2 4 -2 -2 8 7 11 9 2 1 4 8 -3 5 10 -4 1 4 3 -1 4 7 -6 1 0 0 -1 4 -4 -8 -1 -1 8 -4 -1 -2 -2 3 -5 6 5 -7
6727gJ2lQj0KLOkkqNMKlKoLNKkppm%MkKLjrOJ0ojLNplML%J1j0J2jj2pOJJ1j3N
$$ -7 5 2 10 0 2 5 11 9 7 -1 4 8 10 7 9 3 6 11 13 11 4 -3 -7 -7 -3 -5 -3 0 -1 -10 -4 6 0 -1 2 7 0 -3 1 4 4 15 5 17 16 4 -3 3 4 15 2 7
6779GOj1nJ0KpLqQMj0NKolkPlJnNjMqLjJ1j2KLNMlOm%Pj0O%Nj2RJpj1NmJ2j6Q
$$ 7 13 2 -3 7 9 2 5 -3 5 9 -1 4 6 0 -3 -5 2 -1 0 -5 0 -1 3 -5 -2 -3 8 -4 -2 1 6 10 7 13 9 9 16 6 12 12 17 5 14 15 8 -3 2 -2 10 -6 2
6830BlJNpklNJ%nMQoJkKmNMj2J2qQjPqMjMjllJ2nmJKjpjjJmjNkkJLkMRqmjQnk
$$ 2 -1 0 5 -2 -4 -7 -2 -1 -1 -6 -2 6 0 1 -1 1 -3 2 6 -6 6 -2 6 5 12 4 8 7 11 10 7 4 16 11 7 8 10 9 2 1 0 1 -3 -4 1 -1 -3 -2 1 -1 3 12 4 0 -1 7 2 0
6888@KKj%QomOrQLoNnOKrPJmKnPj3OMKqlQqjoNqQoJ1%j5PQ%j0KPPo%OlJKjqQp
$$ 0 2 4 3 3 11 5 1 7 -2 6 9 3 8 3 9 11 2 9 10 6 8 3 10 -3 3 7 9 1 -2 6 -2 -3 -9 -4 -12 -4 -10 1 1 -14 -7 1 1 -9 -7 0 7 1 1 7 4 5 7 6 -2 6 -1
6945aKPjmklkJNKqMkJjRj0nLN%JkqPkQknlJ2%kQolR%oOKjlLnLKJj0MrKj0KQLn
$$ -1 1 8 7 3 1 -2 -4 -3 2 4 -4 0 -2 -1 -2 7 -3 -8 -5 0 0 1 -1 -9 -2 -4 4 2 -3 -6 6 6 4 12 6 3 12 12 6 12 14 13 10 13 8 11 13 14 4 8 -1 1 -9 -7 1 4 -1
7002ajkjMj2J1jnNRj0KJMll%NkQmLKrJNNMplkMKrMkjj0JNLLj4JMklO%Kl%JLLj
$$ -1 -2 -4 -5 -1 -13 -2 -3 -8 -3 6 -4 -2 -1 3 0 -3 -3 2 0 8 4 7 9 0 1 6 11 15 8 5 3 7 9 0 4 2 1 -9 -8 -3 0 3 -11 -10 -6 -8 -11 -5 -5 -3 -6 -6 -5 -2 1 0
7058@JMKKlNj1KMlkj%LkKJ5j6JJOkjlmOpkKkkJ%kK%nJN%mQMmLjJjpK0mrJNpQk
$$ 0 1 5 7 9 6 11 0 2 6 3 1 0 0 3 1 3 18 2 3 4 10 8 7 4 0 6 -1 -3 -1 -3 -5 -4 -4 -6 -4 -4 -9 -8 -3 -3 -7 1 5 1 4 3 4 3 -4 16 12 3 4 9 2 10 8
7115HpK%jmJkMKnjQorROqkkkLlQlMkNnMjkJlOJ0KqlQloRmm%kjjmOj2LRj3Rjjj1
$$ 8 1 3 3 2 -2 -1 -3 1 3 -2 -3 5 -1 -10 -1 5 -3 -5 -7 -9 -6 -9 -1 -4 0 -2 3 -2 2 1 -1 0 -3 3 13 15 7 4 12 9 3 12 8 4 4 2 1 0 -4 2 -10 -7 2 -11 -2 -3 -4 -15
7173a5J2rRj0QLmMnLMoJ1nKOj6J2JkNKPoJlLjj1%%JqJJJj0N%nJJ2oqQjOj7J6M
$$ -15 -3 -12 -3 -13 -5 -2 -6 -2 -7 -4 0 -6 5 0 2 8 -8 4 5 3 8 10 17 11 12 9 12 11 0 0 0 1 -7 -6 -5 -4 -14 -9 -9 -14 -13 -1 -7 -15 -7 -8 -2 -19 -3 1
7223AJ0noKOjnJ0j4P%LKpmPn%kKomJJ0%j0oJ2nrKJRnMj3J0J0qNklPPlmRj1J4l
$$ 1 11 6 0 2 8 7 2 12 -2 5 5 8 10 3 -1 6 1 1 -1 1 -5 -9 -8 2 2 -8 -14 -2 -7 -16 -14 -13 -4 -9 -5 -18 -8 2 -6 -1 -3 -6 1 8 5 1 10 -1 13 10
7273A0npJ0Mnm%pKOj7J7nlMMllpNlLLpKKqLJ6mr%LjR%mJ0jklJlQ%oMjNj0J0lm
$$ 10 5 -2 8 12 7 3 3 -4 -2 4 -13 4 -1 -4 0 4 1 -2 -9 -4 -7 -4 -1 -8 -6 -4 -12 -9 7 3 -6 -6 -3 -4 5 5 1 11 10 8 5 6 3 11 11 5 9 8 13 3 13 10 6
7326FOj0Kmj2J2Jj1PloJJ2j1QLj0PJ%lMlkRrOOJjj2J2pMj1NNJjJ2nj1KmJNoMp
$$ 6 12 2 4 0 -12 0 1 -10 -3 -6 -12 -11 1 -10 -2 1 -9 -2 -1 -1 -4 0 -3 -5 4 -5 1 7 8 7 -5 7 0 4 -7 -2 3 4 3 15 10 -1 1 -3 -2 3 -3 1 -6
7375f%JpP%%MqLJKlJ6j8QjNjJkK%OmRnj1PkRj6J0lmJNrNLnpQonJ4pLpJMqRJjm
$$ -6 -6 -5 -12 -5 -5 -5 -1 -9 -6 -5 -3 -6 10 -8 0 -1 4 3 4 2 4 4 10 6 15 10 -1 6 4 13 -3 7 4 0 1 6 -3 2 5 0 -7 1 -5 -10 4 -3 0 -7 -6 -2 -10 -1 0 -1 -5
7430eJo%KNMQkJ0mj2J0lqOjOjlnkqOLoLpKjLmMjLoQNj2Q%jj0J3kjkNNJomJ2rj
$$ -5 -4 -10 -10 -8 -3 1 9 7 17 13 1 11 8 0 6 5 11 10 7 2 0 -8 -2 1 -5 -2 -9 -7 -8 -5 -9 -5 -6 -3 -9 -1 4 -8 0 0 -1 -11 2 0 -1 -3 2 7 8 2 -2 10 1 0
7484@MQoKoPJJj0Qj5J1rmQj1OjKlkJRoJOLmKrJ2oJ0j0MmmLRj1RMoojJ3JonjmJ2
$$ 0 4 12 6 8 2 9 10 11 1 9 -6 5 -4 -8 0 -11 -5 -6 -4 -7 -9 -8 1 -5 -4 2 5 1 3 -6 6 0 10 0 4 0 -4 -1 8 -3 6 10 4 -2 -3 10 11 5 0 -1 -5 7
7536Gj4kMQomOmMjklPnKl%Rj2LOmJ2nRojqJ1J%kmRKlj4PJmKnLMnLqKNkmnJ1jJ
$$ 7 -7 -9 -5 3 -3 -7 -1 -5 -1 -2 -4 -7 0 -5 -3 -6 -6 3 -9 -6 0 -4 8 3 12 6 5 -3 8 9 9 7 3 12 14 11 -3 4 5 1 3 -2 1 5 0 3 -5 -3 2 0 -4 -9 2 1 2
7591Bj0OKkMo%NOnNkOkm%R%mLoLmoQOj1pJ0nmMJqKMmnQMmkOpJJ3j1MoJMOj1Mp
$$ 2 -8 -2 0 -2 2 -4 -4 1 7 2 7 5 11 9 5 5 14 14 10 13 7 10 6 0 8 14 3 -4 6 1 -3 1 2 -6 -4 0 -4 -9 -1 3 -1 -3 3 -4 -3 10 -1 3 -3 -2 2 8 -3 1 -6
7646fJ2lQmKljJQnKkpLpNrJ0%j2nJ4okmLNLj2MOMj1J1kjJ2pJOj%lJJ5rj3J2rN
$$ -6 6 3 11 7 9 6 5 6 14 9 11 9 2 5 -2 3 -6 4 4 -8 -13 1 -5 -7 -11 -8 -3 0 -12 -8 -2 2 -9 2 0 -1 11 4 5 11 10 10 7 8 23 14 1 13 4 9
7696Ij3PKkKjnJkQJrj0PJ1oq%LjPl%pjKMKLlMPKj2KKRKokJJlPmmn%jkkNmjJKN
$$ 9 -4 3 5 3 5 4 -1 0 -2 6 7 -2 -12 -5 6 0 -8 -8 -5 -6 1 -2 -2 -9 -10 -8 -4 -2 1 -2 2 9 11 -1 1 3 12 14 8 6 7 8 5 12 8 4 -1 -1 -2 -4 -6 -1 -5 -6 -5 -3 2
7753BoKLkKoLpJ1l%Pm%lMmnQmJ2okPMmlMMo%krLlRpNpLlqJ0nJOjmJjRnkQjrP%
$$ 2 -4 -2 1 -1 1 -5 -2 -9 2 -1 -1 6 2 2 -1 3 -1 -6 2 -2 10 4 2 9 13 9 6 10 14 8 8 6 -3 0 -3 6 -1 4 -3 0 -3 -11 -1 -6 -5 1 0 -4 -3 -4 5 0 -2 6 5 -4 3 3
7811COoJNJojJmOKoKQLroJoJ3mnpKm%mJ0kkKLmJ1oJ2poQJOp%JNJqRnjqjRmmlJ
$$ 3 9 3 4 9 10 4 3 4 0 6 8 2 4 12 15 6 0 1 -5 8 4 -1 -8 -6 -10 -10 -14 -4 -6 -8 -6 -3 -7 4 -2 10 3 -3 5 6 12 5 5 6 11 12 4 13 8 7 -1 -2 7 3 -1 -4 -3
7868cJKkmNjlJJmKm%JjK%LjnMMLjJnPoJ6pLj0J0nOOj3Mr%J%MllkjnKLrJ3lNJj
$$ -3 -2 0 -2 -6 -1 -2 -5 -4 -3 -7 -5 -9 -9 -8 -9 -7 -7 -4 -5 -10 -6 -2 1 0 1 -4 3 -3 13 6 9 -1 9 4 10 16 3 7 -2 -2 -1 -1 3 0 -3 -5 -6 -11 -9 -6 -15 -2 -5 0 1 0
7924@lLnj1J0%RJnoJ2mMrK%OKMj1NlnJ4j1PqMKrLkjoLlj2PJ5oMjnLMoQkLMKjN
$$ 0 -3 0 -5 -16 -6 -6 3 4 -1 -7 5 1 5 -4 -2 -2 4 6 10 -1 4 1 -4 10 -1 6 -2 2 4 -5 -2 -4 -5 -11 -8 -11 -23 -16 -1 -7 -3 -4 -9 -6 -2 -8 0 -2 1 5 7 6 11
7977A1oJJLnJl%MmqPNoNoNmmoPkmjKQpKnlJ3qPmL%JlNJkNkJ0qJ2j4LlJmlKmQL
$$ 11 5 6 7 10 5 6 3 3 7 3 -5 2 7 1 6 0 5 1 -3 -9 -2 -4 -8 -9 -7 1 -6 -4 -9 -12 1 -7 0 -4 -1 -1 0 -3 2 3 1 6 4 14 6 18 4 7 4 5 1 -2 0 -4 4 7
8033Gjj0jNoNj0KRj0jjMNjKjrQMkpJMJ%MlKLMpPKlNKqj3K0j8QojjjpNJmKmKKR
$$ 7 6 -4 -5 0 -6 -1 -11 -9 0 -10 -11 -12 -8 -3 -4 -2 -3 -12 -4 0 -2 -9 -8 -4 -3 -3 1 -2 0 3 7 0 7 9 6 11 13 5 -8 12 -6 2 -4 -5 -6 -7 -14 -9 -8 -12 -10 -14 -12 -10 -1
8088aJolQkojJ1jLknJ2moMJkQJj1NOj0QqJmNkJ1j0JPj3Kmj%KPqlJPLj3J3LoRm
$$ -1 0 -6 -9 -1 -3 -9 -10 1 0 3 1 -4 8 4 -2 2 3 1 9 10 -1 4 10 0 8 0 1 -3 2 0 11 1 2 9 -4 -2 -6 -7 -7 -5 2 -6 -9 -8 -1 2 -11 2 5 -1 8 4
8140DLKmjQl%kJmk%QpjNmMMrmKnjllQnJ1j2MNj3J0LqKKRlkMljQKlnQJn
$$ 4 7 9 5 4 12 9 9 7 8 4 2 2 10 3 2 7 3 7 11 2 -2 0 -5 -6 -9 -12 -4 -9 2 -10 -6 -1 -14 -4 -1 -9 -7 -5 4 1 -1 3 0 -1 7 9 6 1 9 10 5
8191E
##END NTUPLES=NMR FID
##END=
