##TITLE=1H_ES-AN-MeCel-C2'
 
 8 sc, 
 21.1.2022
##JCAMPDX= 6.0         $$ Bruker NMR JCAMP-DX V2.0
##DATA TYPE= NMR FID
##DATA CLASS= NTUPLES
##ORIGIN= UXNMR, Bruker Analytische Messtechnik GmbH
##OWNER= root
$$ XWIN-NMR		Version 3.5
$$ Fri Jan 21 12:50:59 2022 Russian Standard Time (UT+4h)  she@DPX200
##.OBSERVE FREQUENCY= 200.131346
##.OBSERVE NUCLEUS= ^1H
##.DELAY= (6, 6)
##.ACQUISITION MODE= SIMULTANEOUS
##.ACQUISITION SCHEME= undefined
##.AVERAGES= 8
##.DIGITISER RES= 18
##SPECTROMETER/DATA SYSTEM= spect
##.PULSE SEQUENCE= zg30
##.SOLVENT NAME= DMSO
##.SHIFT REFERENCE= (INTERNAL, DMSO, 0, 15.7039)
##AUDIT TRAIL= $$ (NUMBER, WHEN, WHO, WHERE, WHAT)
$$ ##TITLE= Audit trail, XWIN-NMR		Version 3.5
$$ ##JCAMPDX= 5.01
$$ ##ORIGIN= Bruker BioSpin GmbH
$$ ##OWNER= she
$$ F:/spectra/data/she/nmr/H-F/1/audita.txt
$$ ##AUDIT TRAIL=  $$ (NUMBER, WHEN, WHO, WHERE, WHAT)
(   1,<2022-01-21 12:49:16.20 +0400>,<she>,<DPX200>,
      <created by zg, POWCHK disabled, PULCHK disabled
       configuration hash MD5:
       00 E9 B6 7A A2 85 ED C7 34 08 36 98 17 FE 4E 26
       data hash MD5: 16K
       5B B8 0E 29 90 30 21 B5 6A C0 7F E3 C9 24 62 8A>)
$$ ##END=
$$ 
$$ hash MD5
$$ 7F FA 00 0D 9C 1B 85 21 BC F2 37 15 2C AA 82 11
##$RELAX= 
##$RELAX= 
##$RELAX= 
##$RELAX= 
##$RELAX= 
##$RELAX= 
$$ Bruker specific parameters
$$ --------------------------
##$DU= <F:/spectra>
##$EXPNO= 1
##$NAME= <H-F>
##$PROCNO= 1
##$TYPE= <nmr>
##$USER= <she>
##$AMP= (0..31)
100 100 100 100 100 100 100 100 100 100 100 100 100 100 100 100 100 100 
100 100 100 100 100 100 100 100 100 100 100 100 100 100 
##$AQSEQ= 0
##$AQ_mod= 1
##$AUNM= <au_zg>
##$AUTOPOS= <>
##$BF1= 200.13
##$BF2= 200.13
##$BF3= 200.13
##$BF4= 200.13
##$BF5= 200.13
##$BF6= 200.13
##$BF7= 200.13
##$BF8= 200.13
##$BYTORDA= 1
##$CFDGTYP= 0
##$CFRGTYP= 5
##$CHEMSTR= <none>
##$CNST= (0..31)
1 1 145 1 1 1 1 1 1 1 1 1 1 1 1 1 1 1 1 1 1 1 1 1 1 1 1 1 1 1 1 1 
##$CPDPRG= <>
##$CPDPRG1= <>
##$CPDPRG2= <>
##$CPDPRG3= <>
##$CPDPRG4= <mlev>
##$CPDPRG5= <mlev>
##$CPDPRG6= <mlev>
##$CPDPRG7= <mlev>
##$CPDPRG8= <mlev>
##$CPDPRGB= <>
##$CPDPRGT= <>
##$D= (0..31)
0 1.2 0 0 0 0 0 0 0 0.06 0 0.03 0 0 0 0 0.0002 0 0 0 0 0 0 0 0 0 0 0 0 
0 0 0 
##$DATE= 1642754955
##$DBL= (0..7)
120 120 120 120 120 120 120 120 
##$DBP= (0..7)
150 150 150 150 150 150 150 150 
##$DBP07= 0
##$DBPNAM0= <>
##$DBPNAM1= <>
##$DBPNAM2= <>
##$DBPNAM3= <>
##$DBPNAM4= <>
##$DBPNAM5= <>
##$DBPNAM6= <>
##$DBPNAM7= <>
##$DBPOAL= (0..7)
0.5 0.5 0.5 0.5 0.5 0.5 0.5 0.5 
##$DBPOFFS= (0..7)
0 0 0 0 0 0 0 0 
##$DE= 6
##$DECBNUC= <off>
##$DECIM= 32
##$DECNUC= <off>
##$DECSTAT= 4
##$DIGMOD= 1
##$DIGTYP= 9
##$DL= (0..7)
0 120 120 120 120 120 120 120 
##$DP= (0..7)
150 150 150 150 150 150 150 150 
##$DP07= 0
##$DPNAME0= <>
##$DPNAME1= <>
##$DPNAME2= <>
##$DPNAME3= <>
##$DPNAME4= <>
##$DPNAME5= <>
##$DPNAME6= <>
##$DPNAME7= <>
##$DPOAL= (0..7)
0.5 0.5 0.5 0.5 0.5 0.5 0.5 0.5 
##$DPOFFS= (0..7)
0 0 0 0 0 0 0 0 
##$DQDMODE= 0
##$DR= 18
##$DS= 0
##$DSLIST= <SSSSSSSSSSSSSSS>
$$ [...]
##$SUBNAM2= <"">
##$SUBNAM3= <"">
##$SUBNAM4= <"">
##$SUBNAM5= <"">
##$SUBNAM6= <"">
##$SUBNAM7= <"">
##$SUBNAM8= <"">
##$SUBNAM9= <"">
##$SW= 18.0517287032376
##$SWIBOX= (0..15)
0 0 2 0 0 0 0 0 0 0 0 0 0 0 0 0 
##$SW_h= 3612.71676300578
##$TD= 16384
##$TD0= 1
##$TE= 0
##$TE2= 300
##$TE3= 300
##$TEG= 300
##$TL= (0..7)
0 120 120 120 120 120 120 120 
##$TP= (0..7)
150 150 150 150 150 150 150 150 
##$TP07= 0
##$TPNAME0= <>
##$TPNAME1= <>
##$TPNAME2= <>
##$TPNAME3= <>
##$TPNAME4= <>
##$TPNAME5= <>
##$TPNAME6= <>
##$TPNAME7= <>
##$TPOAL= (0..7)
0.5 0.5 0.5 0.5 0.5 0.5 0.5 0.5 
##$TPOFFS= (0..7)
0 0 0 0 0 0 0 0 
##$TUNHIN= 0
##$TUNHOUT= 0
##$TUNXOUT= 0
##$USERA1= <user>
##$USERA2= <user>
##$USERA3= <user>
##$USERA4= <user>
##$USERA5= <user>
##$V9= 5
##$VALIST= <valist>
##$VCLIST= <CCCCCCCCCCCCCCC>
##$VD= 0
##$VDLIST= <DDDDDDDDDDDDDDD>
##$VPLIST= <PPPPPPPPPPPPPPP>
##$VTLIST= <TTTTTTTTTTTTTTT>
##$WBST= 1024
##$WBSW= 4
##$XGAIN= (0..3)
0 0 0 0 
##$XL= 0
##$YL= 0
##$YMAX_a= 248199
##$YMIN_a= -284559
##$ZGOPTNS= <>
##$ZL1= 120
##$ZL2= 120
##$ZL3= 120
##$ZL4= 120
##$ABSF1= 10
##$ABSF2= 0
##$ABSG= 5
##$ABSL= 3
##$ALPHA= 0
##$AQORDER= 0
##$ASSFAC= 0
##$ASSFACI= 0
##$ASSFACX= 0
##$ASSWID= 0
##$AUNMP= <proc_1d>
##$AZFE= 0.1
##$AZFW= 0.1
##$BCFW= 1
##$BC_mod= 2
##$BYTORDP= 1
##$COROFFS= 0
##$CY= 11.3945322036743
##$DATMOD= 1
##$DC= 2
##$DFILT= <>
##$DTYPP= 0
##$F1P= 2.36226072786647
##$F2P= -0.459571619588291
##$FCOR= 0.5
##$FTSIZE= 0
##$FT_mod= 4
##$GAMMA= 1
##$GB= 0.15
##$INTBC= 1
##$INTSCL= 1
##$ISEN= 128
##$LB= 0.24
##$LEV0= 0
##$LPBIN= 0
##$MAXI= 10000
##$MC2= 0
##$MEAN= 0
##$ME_mod= 0
##$MI= 1.114404
##$NCOEF= 0
##$NC_proc= 0
##$NLEV= 6
##$NOISF1= 3.799351
##$NOISF2= 2.8
##$NSP= 1
##$NTH_PI= 0
##$NZP= 0
##$OFFSET= 15.70392
##$PC= 1
##$PHC0= -15938.79
##$PHC1= -3.799225
##$PH_mod= 1
##$PKNL= yes
##$PPARMOD= 0
##$PSCAL= 0
##$PSIGN= 0
##$REVERSE= no
##$SF= 200.130013532006
##$SI= 16384
##$SIGF1= 3
##$SIGF2= 2
##$SINO= 400
##$SIOLD= 16384
##$SREGLST= <1H.CDCl3>
##$SSB= 0
##$STSI= 0
##$STSR= 0
##$SW_p= 3612.71676300578
##$SYMM= 0
##$S_DEV= 0
##$TDeff= 0
##$TDoff= 0
##$TI= <>
##$TILT= no
##$TM1= 0
##$TM2= 0
##$TOPLEV= 0
##$USERP1= <user>
##$USERP2= <user>
##$USERP3= <user>
##$USERP4= <user>
##$USERP5= <user>
##$WDW= 1
##$XDIM= 8192
##$YMAX_p= 0
##$YMIN_p= 0
$$ End of Bruker specific parameters
$$ ---------------------------------
##NTUPLES= NMR FID
##VAR_NAME=  TIME,          FID/REAL,        FID/IMAG
##SYMBOL=    X,             R,               I
##VAR_TYPE=  INDEPENDENT,   DEPENDENT,       DEPENDENT
##VAR_FORM=  AFFN,          ASDF,            ASDF
##VAR_DIM=   8192,          8192,            8192
##UNITS=     SECONDS,       ARBITRARY UNITS, ARBITRARY UNITS
##FACTOR=    0.0002768,     1,               1
##FIRST=     0,             0,               0
##LAST=      2.2672688,     0,               0
##MIN=       0,             -284559,         0
##MAX=       2.2672688,     248199,          0
$$ Real data points
##PAGE= N=1
##DATA TABLE= (X++(R..R)), XYDATA
$$ plain form
0 0 0 0 0 0 0 0 0 0 0 0 0 0 0 0 0 0 0 -8 8 -8 8 -8 8 -16 16 -16 20 -24 25 -32 33 -40 44 -49 56 -60 68 -76 84
39 84 -95 107 -116 130 -144 160 -175 192 -212 233 -257 283 -311 343 -382 422 -469 523 -589 665
59 665 -758 874 -1022 1215 -1486 1879 -2500 3604 -5937 12786 -72184 -284559 43594 233954
73 233954 -66295 -147857 160230 141772 -183664 -118292 187002 80239 -179472 -43719 156901
84 156901 -6549 -143412 39300 125917 -56804 -97150 66705 66603 -68312 -33775 64665
95 64665 6131 -55401 14220 38496 -28464 -17726 36522 -4901 -37920 26326 33130 -44532
107 -44532 -22238 58598 7002 -67746 10782 71044 -28972 -68530 45733 60612 -59688
118 -59688 -48340 69556 33200 -74432 -16913 74068 1112 -68729 12710 59093 -23155 -46330
$$ packed form
0@%%%%%%%%%%%%%%%%%qJ6j6J6j6J6k4L2l2L6m4M9n7O5p3Q4r3J05j16J28j44J60
39H4j79K02k23K46k74L04l35L67m04M45m90N40n94O54p25Q04q91R92j112J254
59F65j423J632j896K237k701L365m379O104r541J8723q4970k12375L28153J90360
73B33954l00249q1562L08087j8458l25436O5372L05294j06763k59711J35753K00620
84A56901j63450j36863J82712Q6617j82721m0346J63855j02j34915L4537R8440
95F4665n8534o1532O9621K4276o6960J0738N4248m1423l3019O4246O804p7662
107d4532K2294Q0836n1596p4748P8528O0262j00016l9558J14263J4879j20300
118e9688J1348J17896l6356j07632N7519R0981p2956o9841Q1439M6383q2248k3175
$$ plain form
130 -46330 29237 31989 -30502 -17501 26971 4424 -19041 5875 7652 -12246 5973 14100 -20522
143 -20522 -11046 34561 3115 -46524 9031 55164 -24473 -59519 42028 58795 -60255 -52745
155 -52745 77593 41555 -92578 -25776 103862 6359 -110288 15347 111156 -37786 -106184
166 -106184 59400 95551 -78588 -79824 93933 60144 -104228 -37833 108902 14470 -107577
177 -107577 8334 100550 -28931 -88392 46052 72249 -58613 -53298 65974 33056 -67854
188 -67854 -13032 64457 -5365 -56320 20915 44310 -32610 -29598 39838 13443 -42339 2842
200 2842 40166 -18008 -33720 30851 23787 -40476 -11332 46258 -2546 -47858 16573 45325
212 45325 -29569 -39041 40478 29702 -48432 -18191 52853 5668 -53481 6743 50499 -17953
$$ packed form
130d6330P5567K752o2491J3001M4472k2547k3465K4916J777j9898J8219Q127l4622
143b0522R476M5607l1446m9639N5555M6133p9637l5046J01547J6767j19050P510
155e2745J30338l6038j34133O6802J29638r7503j16647J25635R5809j48942o8398
166a06184J65584L6151j74139j236J73757l3789j64372O6395J46735r4432j22047
177a07577J15911R2216j29481n9461J34444K6197j30862N315J19272l2918j00910
188f7854N4822P7489o9822n0955P7235K3395p6920L012O9436k6395n5782M5181
200B842L7324n8174j5712O4571p064o4263K9144N7590m8804m5312O4431K8752
212D5325p4894r472P9519j0776p8134L0241P1044m7185n9149O0224M3756o8452
$$ plain form
224 -17953 -44279 27057 35565 -33300 -25286 36285 14445 -35948 -4093 32456 -4853 -26336
236 -26336 11584 18318 -15551 -9293 16546 147 -14485 8201 9704 -14873 -2682 19286 -5851
249 -5851 -20886 15114 19520 -24136 -15149 32082 8177 -38095 932 41596 -11389 -42035 22358
262 22358 39290 -32840 -33420 41960 24815 -48839 -14088 52871 2065 -53613 10309 50980
274 50980 -22065 -45115 32265 36448 -40104 -25694 44984 13698 -46603 -1394 44881 -10289
286 -10289 -40013 20455 32483 -28402 -22916 33581 12117 -35678 -963 34669 -9669 -30689
298 -30689 19004 24183 -26309 -15695 31133 6003 -33086 4164 32115 -13871 -28328 22414
310 22414 22135 -29063 -14058 33297 4827 -34821 4776 33531 -13910 -29575 21790 23344 -27784
$$ packed form
224a7953k6326P1336Q508o8865Q014O1571k1840n0393L1855L6549l7309k1483
236b6336L7920O734l3869O258K5839j6399j4632K2686J503k4577J2191K1968k5137
249e851j5035L6000M406m3656Q987M7231k3905m6272L9027M0664n2985l0646O4393
262B2358J6932p2130n80P5380j7145p3654L4751O6959n0806n5678O3922M0671
274E0980p3045k3050P7380M183p6552J4410P0678l1286o0301M5209M6275n5170
286a0289k9724O0468J2028o0885N486N6497k1464m7795L4715L5632m4338k1020
298c0689M9693N179n0492J0614M6828k5130l9089L7250K7951m5986j4457N0742
310B2414k79n1198J5005M7355k8470l9648L9597K8755m7441j5665N1365J554n1128
$$ plain form
323 -27784 -15451 31389 6592 -32363 2422 30703 -10823 -26621 17898 20535 -23076 -13034
335 -13034 25977 4837 -26416 3347 24460 -10795 -20326 16914 14471 -21201 -7403 23373
347 23373 -200 -23224 7689 20841 -14436 -16486 19831 10512 -23432 -3459 24940 -4066
359 -4066 -24209 11376 21294 -17882 -16444 22957 10055 -26176 -2694 27244 -5016 -26051 12393
372 12393 22719 -18806 -17493 23712 10870 -26687 -3406 27505 -4261 -26122 11482 22694
384 22694 -17645 -17539 22313 11118 -25095 -3995 25821 -3272 -24498 10019 21251 -15800
396 -15800 -16432 20099 10446 -22666 -3812 23277 -2933 -21945 9214 18801 -14528 -14153 18418
409 18418 8389 -20577 -2026 20847 -4361 -19193 10241 15821 -15066 -10973 18438 5159
$$ packed form
323b7784J2333M6840k4797l8955L4785K8281m1526j5798M4519K637m3611J0042
335a3034L9011k1140l1253K9763K1113l5255r531L7240k443l5672J3798L0776
347B3373k3573k3024L0913J3152l5277k050L6317r319l3944J9973K8399k9006
359d066k0143L5585R918l9176J438L9401j2902l6231K3482K9938l2260k1035L8444
372A2393J0326m1525J313M1205j2842l7557K3281L0911l1766k1861L7604J1212
384B2694m0339J06L9852j1195l6213K1100K9816k9093k1226L4517J1232l7051
396a5800o32L6531r653l3112J8854K7089k6210j9012L1159R587l3329L75L2571
409A8418j0029k8966J8551K2873k5208j4832K9434N580l0887M093K9411j3279
$$ plain form
421 5159 -20023 1132 19738 -7306 -17583 12850 13775 -17221 -8670 20072 2747 -21149 3527
434 3527 20382 -9521 -17865 14754 13812 -18824 -8616 21354 2697 -22173 3427 21242 -9281
447 -9281 -18676 14355 14641 -18289 -9537 20742 3723 -21544 2284 20639 -8019 -18087 13018
460 13018 14128 -16830 -9087 19223 3376 -19945 2544 18944 -8119 -16304 12906 12302 -16509
473 -16509 -7276 18621 1667 -19065 4050 17837 -9357 -15075 13806 11030 -17033 -6099 18794
486 18794 699 -18980 4686 17609 -9621 -14829 13687 10902 -16595 -6214 18126 1107
498 1107 -18170 3923 16785 -8536 -14087 12306 10347 -14954 -5841 16299 1015 -16209 3754
511 3754 14732 -8045 -11994 11522 8274 -13851 -3852 14841 -822 -14446 5358 12672 -9357
$$ packed form
421E159k5182K1155J8606k7044j0277L0433R25l0996Q551K8742j7325k3896K4676
434C527J6855k9903q344L2619r42l2636J0208K9970j8657k4870K5600J7815l0523
447i281r395L3031K86l2930Q752L0279j7019k5267K3828J8355k8658j0068L1105
460A3018J110l0958P743K8310j5847k3321K2489J6400k7063q185K9210o04k8811
473a6509R233K5897j6954k0732K3115J3787k7194n718K8881k776k8063J0934K4893
486A8794j8095j9679K3666J2923k7230n208K8516k785k7497J0381K4340j7019
498A107j9277K2093J2862k5321n551K6393j959k5301R113K2140j5284j7224J9963
511C754J0978k2777l949K3516l248k2125R999J8693j5663j3624J9804P314k2029
$$ plain form
524 -9357 -9694 12427 5816 -14318 -1402 14888 -3189 -14048 7518 11933 -11203 -8736 13917
537 13917 4740 -15466 -302 15689 -4218 -14605 8392 12322 -11890 -9039 14466 5023 -15875
550 -15875 -613 16029 -3837 -14930 7962 12660 -11437 -9404 13980 5430 -15384 -1092 15551
563 15551 -3288 -14478 7337 12213 -10726 -9024 13134 5130 -14435 -905 14463 -3309 -13260
576 -13260 7104 10961 -10194 -7786 12316 4010 -13270 10 13048 -3881 -11660 7342 9299
589 9299 -10018 -6134 11759 2511 -12409 1275 11958 -4897 -10447 8068 7994 -10490 -4853 12006
603 12006 1297 -12475 2407 11870 -5932 -10221 8994 7710 -11314 -4509 12722 886 -13053
616 -13053 2847 12318 -6344 -10549 9350 7909 -11558 -4600 12820 956 -12966 2747 12062
$$ packed form
524i357l37K2121o611k0134J2916J6290j8077j0859K1566M415k3136K467K2653
537A3917r177k0206J5164J5991j9907j0387K2997L930k4212K851K3505r443k0898
550a5875J5262J6642j9866j1093K2892M698k4097K033K3384q550k0814J4292J6643
563A5551j8839j1190K1815M876k2939J702K2158q004j9565J3530J5368j7772r951
576a3260K0364L857k1155K408K0102q306j7280J3280J3038j6929p779J9002J957
589I299j9317L884J7893r248j4920J3684J0683j6855n550J8515p4j8484N637J6859
603A2006j0709j3772J4882R463j7802m289J9215j284j9024O805J7231j1836j3939
616a3053J5900R471j8662m205J9899j441j9467O958J7420j1864j3922J5713R315
$$ plain form
629 12062 -6131 -10118 8992 7394 -10976 -4062 12007 486 -11987 3076 10910 -6315 -8915
642 -8915 8944 6178 -10781 -2935 11678 -572 -11571 4019 10470 -7138 -8527 9698 5846
655 5846 -11509 -2673 12407 -759 -12347 4148 11353 -7233 -9468 9800 6896 -11602 -3835
668 -3835 12544 547 -12520 2704 11587 -5643 -9803 8019 7408 -9655 -4558 10417 1535
681 1535 -10294 1345 9296 -3891 -7588 5842 5313 -7094 -2733 7494 67 -7091 2407 5941
695 5941 -4503 -4165 6030 1923 -6842 550 6903 -3028 -6191 5322 4784 -7175 -2788 8478
709 8478 412 -9054 2208 8865 -4787 -7898 7135 6242 -9008 -3999 10256 1370 -10737 1437
723 1437 10398 -4139 -9272 6541 7455 -8437 -5063 9622 2342 -10013 494 9585 -3200 -8394
$$ packed form
629A2062j8193l987J9110j598j8370O914J6069j1521j2473J5063P834j7225k600
642h915J7859k766j6959P846J4613j2250j0999J5590O451j7608j389J8225l852
655E846j7355Q836J5080j3166j1588J6495P205j8586k235J9268k904j8498P767
668c835J6379j1997j3067J5224Q883j7230m160J7822o11j7063N097J4975q882
681A535j1829J1639P951j3187l697J3430n29j2407M361J0227p427p158R498L534
695E941j0444L38J0195m107q765P392O353r931l163J1513n38j1959M387J1266
709H478q066r466J1262O657j3652l111J5033q93j5250N009J4255q886j2107J2174
723A437Q961j4537n133J5813R14j5892L374J4685p280j2355J0507R091j2785n194
$$ plain form
737 -8394 5540 6502 -7344 -4117 8444 1425 -8781 1355 8314 -3985 -7098 6266 5260 -8021
751 -8021 -2911 9137 272 -9481 2475 9073 -5098 -7933 7425 6145 -9239 -3878 10434 1260
765 1260 -10914 1455 10613 -4112 -9630 6439 7975 -8303 -5840 9529 3389 -10075 -845
778 -845 9866 -1591 -9007 3699 7542 -5345 -5669 6401 3541 -6795 -1358 6570 -658 -5730
792 -5730 2366 4419 -3623 -2758 4351 933 -4481 904 4058 -2557 -3118 3915 1756 -4808 -128 5213
808 5213 -1620 -5063 3339 4374 -4868 -3223 6039 1676 -6783 90 6978 -1961 -6613 3751 5713
823 5713 -5278 -4340 6411 2619 -7046 -693 7120 -1267 -6587 3078 5536 -4568 -4015 5633 2201
838 2201 -6136 -231 6081 -1726 -5433 3501 4289 -4932 -2722 5921 848 -6369 1140 6246 -3114
$$ packed form
737h394J3934R62j3846L227J2561p019j0206J0136O959j2299l113J3364j006j3281
751h021N110J2048q865r753J1956O598j4171k835J5358j280j5384N361J4312r174
765A260j2174J2369R158j4725n518J6069J536j6278K463J5369o140j3464R230
778h45J0711j1457p416J2706L843j2887l24J2070k860j0336N437P928p228n072
792e730Q096K053q042Q65P109l418n414N385L154o615n61P033k159o564M680N341
808E213o833l443Q402J035r242J645R262m363q459O873O888q939m652J0364J962
823E713j0991R38J0751l792r665O353P813q387n320R665K458j0104N53R648l432
838B201q337N905O312p807l707Q934P88r221K210Q643n073p217P509N106r360
$$ plain form
853 -3114 -5574 4890 4375 -6366 -2780 7385 854 -7892 1197 7815 -3254 -7188 5149 6019
867 6019 -6720 -4412 7865 2512 -8463 -434 8515 -1624 -7960 3561 6920 -5130 -5420 6290
881 6290 3660 -6920 -1722 7012 -176 -6551 1900 5619 -3316 -4319 4327 2750 -4840 -1093 4864
896 4864 -533 -4437 1981 3565 -3141 -2386 3926 987 -4282 486 4185 -1906 -3652 3157 2743 -4110
912 -4110 -1567 4725 198 -4910 1256 4661 -2585 -3988 3760 2996 -4626 -1695 5094 270 -5145
927 -5145 1157 4739 -2487 -3953 3577 2834 -4329 -1486 4662 38 -4580 1365 4048 -2622 -3156 3589
943 3589 1972 -4224 -626 4441 -803 -4227 2155 3636 -3337 -2681 4257 1477 -4805 -100 4981
958 4981 -1331 -4732 2696 4111 -3894 -3112 4835 1860 -5399 -441 5584 -1045 -5334 2460 4677
$$ packed form
853c114k460J0464n15j0741L586J0165o531q746R089O618j1069l934J2337Q70
867F019j2739K308J2277n353j0975Q029Q949j0139o336J1521L359j2050k90J1710
881F290k630j0580N198Q734p188o375Q451L719q935j003Q646j577p590L747N957
896D864n397l904O418J584o706P55O312k939n269M768L699o091j746O809m14o853
912d110K543O292m527n108O166L405p246j403P748p64p622K931O789m824n415
927e145O302L582p226j466P530p43p163K843O148m624m618N945K683o670n34O745
943C589j617o196L598N067n244l424O382J481o973O56O938k780o282M705N081
958D981o312l401P428J415q005P82P947k975p259M958O025o629m289P794K217
$$ plain form
973 4677 -3703 -3677 4655 2388 -5237 -951 5420 -544 -5168 1943 4504 -3142 -3523 4056 2271 -4592
989 -4592 -900 4706 -503 -4449 1802 3811 -2885 -2851 3684 1694 -4155 -437 4216 -849 -3925 2045
1005 2045 3308 -2992 -2381 3727 1286 -4105 -70 4121 -1151 -3784 2260 3124 -3181 -2201 3806 1064
1021 1064 -4112 129 4063 -1334 -3685 2412 2940 -3279 -1960 3837 814 -4075 393 3936 -1567
1036 -1567 -3461 2583 2698 -3367 -1687 3862 547 -4009 616 3835 -1730 -3316 2670 2545 -3396
1051 -3396 -1579 3818 474 -3938 631 3725 -1693 -3229 2579 2450 -3251 -1511 3633 438 -3739
1066 -3739 637 3500 -1657 -2980 2510 2196 -3139 -1232 3480 175 -3510 904 3213 -1872 -2631
1081 -2631 2687 1816 -3225 -821 3500 -232 -3428 1266 3077 -2176 -2437 2904 1593 -3368 -623
$$ packed form
973D677q380K6Q332k267p625M286O371n964m624P111K561p646l81P579j785o863
989d592L692N606n209l946O251K009o696L4O535j990n849L718M653n065l076N970
1005B045J263o300O11O108k441n391M035M191n272k633O044Q64o305R80O007k742
1021A064n176M241L934n397k351O097N28o219J319N797l023m889M468L543n503
1036a567j894O044J15o065J680N549l315m556M625L219n565j586N986j25n941
1051c396J817N397l344m412M569L094n418j536N808j29n701J740N144l195m177
1066c739M376K863n157j323N490l14n335J907M712l305l685M414K309n085p59
1081b631N318q71n041K404M321l732l196M694J811n253k61N341j311m961K745
$$ plain form
1096 -623 3539 -394 -3437 1360 3023 -2215 -2386 2856 1553 -3273 -622 3404 -359 -3263 1277
1111 1277 2843 -2092 -2188 2706 1358 -3076 -415 3173 -559 -2983 1483 2533 -2264 -1827 2853 961
1127 961 -3184 26 3236 -1024 -2978 1940 2448 -2713 -1688 3278 777 -3560 217 3558 -1230
1142 -1230 -3260 2136 2709 -2877 -1944 3411 1044 -3675 -67 3666 -892 -3380 1753 2873 -2472
1157 -2472 -2140 2974 1322 -3249 -407 3267 -491 -3014 1330 2560 -1987 -1883 2476 1083 -2710
1172 -2710 -226 2698 -620 -2451 1369 1959 -1990 -1299 2389 512 -2563 291 2471 -1092 -2148
1187 -2148 1779 1629 -2304 -955 2611 193 -2705 595 2555 -1326 -2179 1943 1633 -2386 -962 2625
1203 2625 221 -2654 512 2469 -1193 -2075 1759 1528 -2155 -860 2366 150 -2349 580 2120
$$ packed form
1096f23M162l933l043M797J663n238j71N242j303m826K651M026l763k904M540
1111A277J566m935r6M894j348m434K661L588l732k424M466J050m797M37M680j892
1127I61m145L210L210m260j954M918N08n161J025M966k501m337L777L341m788
1142a230k030N396N73n586R33N355k367m719L608L733m558k488N133J120n345
1157b472L32N114j652m571K842L674l758k523M344J230m547J04M359j393l793
1172b710K484K924l318j831L820N90l949O91L688j877l075K854K180l563j056
1187b148L927j50l933J349L566k418k898L300J960l881q53M122l10m019J424L587
1203B625k404k875L166J957l662q82L834k31l683J295L226k216k499K929J540
$$ plain form
1218 2120 -1240 -1710 1763 1126 -2136 -439 2281 -316 -2222 1034 1930 -1722 -1442 2189 803 -2523
1234 -2523 -47 2623 -728 -2489 1485 2144 -2127 -1604 2618 919 -2914 -145 3002 -632 -2837
1249 -2837 1384 2488 -2013 -1939 2513 1288 -2806 -535 2913 -222 -2794 946 2469 -1577 -1984 2060
1265 2060 1371 -2385 -678 2474 -56 -2401 745 2104 -1356 -1652 1808 1052 -2096 -372 2186 -303
1281 -303 -2060 957 1759 -1488 -1275 1907 693 -2120 -41 2148 -610 -1971 1196 1631 -1668 -1148
1297 -1148 2004 571 -2169 39 2147 -656 -1937 1178 1579 -1610 -1114 1894 539 -2031 18
1312 18 1964 -612 -1758 1103 1391 -1512 -917 1764 368 -1865 209 1772 -772 -1521 1258 1135
1328 1135 -1628 -622 1851 47 -1898 548 1767 -1097 -1460 1559 1020 -1903 -480 2082 -122
$$ packed form
1218B120l360m70L473o37l262J697K720k597j906L256Q96l652K80L631j386l326
1234b523K476K670l351j761L974O59m271N23M222j699l833K769L147l634k205
1249b837M221J104m501P4M452j225m094K271L448l135k572L740J523m046m07M044
1265B060o89l756J707L152k530k345L146J359l460k96L460p56l148J724K558k489
1281c03j757L017Q02l247K13L182j214k813K079K189k758j361L167M35l299N20
1297a148L152j433k740K208K108k803j281L115M01l189M96L008j355k570K049
1312A8J946k576j146K861K88k903N95K681j396k233K074J563k544p49K779j23
1328A135k763J006K473j804j945K446J219k864l63L019n39k923J423K562k204
$$ plain form
1343 -122 -2087 710 1894 -1255 -1570 1691 1106 -2034 -570 2171 -43 -2169 601 1980 -1152 -1664
1359 -1664 1586 1208 -1898 -696 2048 131 -2056 448 1896 -978 -1591 1401 1167 -1708 -652 1862
1375 1862 105 -1861 461 1699 -938 -1390 1344 963 -1628 -468 1742 -76 -1713 597 1515 -1052
1391 -1052 -1191 1400 748 -1635 -256 1702 -254 -1626 740 1402 -1165 -1066 1458 631 -1642 -154
1407 -154 1690 -335 -1590 798 1354 -1170 -1019 1464 600 -1635 -130 1660 -358 -1554 811 1322
1423 1322 -1182 -961 1463 534 -1615 -47 1621 -433 -1484 864 1218 -1252 -853 1493 398 -1627
1439 -1627 81 1584 -568 -1420 989 1130 -1327 -748 1542 292 -1636 197 1591 -638 -1406 1060
1455 1060 1124 -1349 -726 1575 305 -1653 163 1607 -615 -1446 1004 1164 -1306 -795 1509 372
$$ packed form
1343a22j965K797J184l149l15L261n85l140J464K741k214k126K770J379l132n12
1359a664L250l78l106J202K744j917k187K504J448k874o13K992k34k875J056K514
1375A862j757j966K322J238k637m52K734l81k591J160K210j818j637K310R18k567
1391a052j39K591o52k383J379J958j956j372K366O62k567R9K524q27k273J488
1407a54J844k025j255K388N56k524J51K483q64k235J505J790k018j196K365N11
1423A322k504K21K424r29k149J568J668k054j051K348L54k470L99K346j095k025
1439a627J708J503k152q52K409J41k457N79K290j250j928J833J394k229p68K466
1455A060O4k473O23K301j270j958J816J444k222q31K450J60k470N11K304j137
$$ plain form
1471 372 -1606 70 1558 -515 -1407 890 1111 -1191 -761 1374 346 -1453 87 1386 -485 -1213
1487 -1213 847 922 -1109 -562 1259 160 -1277 253 1204 -613 -986 936 689 -1140 -324 1257 -58
1504 -58 -1246 441 1116 -792 -894 1065 582 -1266 -237 1338 -168 -1321 538 1178 -868 -941 1130
1521 1130 615 -1335 -269 1392 -138 -1365 518 1206 -857 -967 1132 623 -1298 -244 1361 -139
1537 -139 -1310 544 1145 -864 -869 1120 518 -1264 -140 1293 -261 -1227 615 1032 -927 -773 1147
1554 1147 425 -1297 -68 1306 -329 -1241 672 1037 -980 -782 1183 461 -1320 -103 1345 -260
1570 -260 -1259 608 1095 -895 -833 1117 523 -1244 -183 1278 -183 -1182 509 1016 -790 -756 974
1587 974 455 -1085 -122 1082 -218 -1005 518 812 -766 -556 914 247 -979 62 947 -373 -842
$$ packed form
1471C72j978J676J488k073q92K297K21k302M30K135j028j799J540J299j871p28
1487a213K060P5k031N47J821j099j437J530R51j817l73J922k47j829Q16J581j315
1504e8j188J687O75j908j02J959m83j848J029J575j506j153J859O40k046p3K071
1521A130n15j950J066J661j530j227J883O88k063j10K099n09j921J054J605j500
1537a39j171J854O01k009nJ989o02j782J124J433j554r66J842M17j959J54J920
1554A147p22j722J229J374j635r12J913L65k017J98J965p22j781J217J448j605
1570b60r99J867M87j990O2J950n94j767J061J461j461r99J691N07j806L4J730
1587I74n19j540R63J204j300p87J523K94j578K10J470o67j226J041Q85j320m69
$$ plain form
1604 -842 630 640 -847 -387 959 79 -1011 212 967 -506 -835 740 629 -926 -365 1043 68
1621 68 -1068 238 1014 -522 -863 762 651 -942 -388 1047 74 -1066 227 986 -522 -842 751
1638 751 582 -929 -320 1000 7 -1019 297 910 -579 -750 793 488 -952 -210 1024 -88 -996
1655 -996 386 885 -648 -708 853 485 -992 -186 1069 -91 -1041 387 932 -648 -744 852 517 -979
1673 -979 -249 1050 -39 -1031 321 921 -580 -763 782 514 -915 -248 967 -33 -939 305 825
1690 825 -550 -653 737 422 -839 -153 873 -119 -830 371 715 -577 -521 740 296 -821 -39 848
1708 848 -191 -782 436 652 -621 -464 756 265 -837 -27 842 -234 -791 440 632 -632 -468
1725 -468 756 240 -838 -8 822 -236 -745 459 611 -641 -414 756 185 -807 64 783 -294 -696
$$ packed form
1604h42J472J0j487M60J346q80j090J223P55j473l29J575j11j555N61J408r75
1621F8j136J306P76j536l41J625j11j593N54J435r73j140J293P59j508l20J593
1638G51j69j511O09J320r93j026J316O13j489j71J543l05j440P42J234j112r08
1655i96J382M99j533o0J561l68j477Q06J255j160r50J428N45j580r6J596l35j496
1673i79P30J299j089r92J352O00j501j83J545k68j429O67J215j000r06J244N20
1690H25j375j03J390l15j261O86J026r92p11J201L44j292N6J261m44j117P82Q87
1708H48j039n91J218K16j273J57J220m91j102Q10Q69j076n57J231J92j264J64
1725d68J224n16j078Q30Q30j058n09J204J52j252K27J170n71r92Q71P19j077m02
$$ plain form
1743 -696 510 545 -666 -338 770 111 -795 122 757 -353 -651 546 486 -697 -290 764 64 -797
1761 -797 152 736 -385 -658 533 470 -692 -298 765 64 -783 145 730 -366 -633 548 462 -674
1779 -674 -282 744 57 -756 180 693 -376 -578 555 424 -665 -209 735 0 -739 226 657 -429
1797 -429 -534 571 351 -697 -161 727 -63 -719 264 632 -448 -515 581 330 -689 -146 717 -60 -702
1816 -702 250 623 -432 -488 560 325 -648 -136 694 -64 -660 268 595 -426 -453 561 294 -638 -98
1835 -98 671 -109 -631 286 545 -460 -405 574 231 -647 -52 661 -153 -612 320 510 -474 -385 589 218 -633
1856 -633 -20 647 -147 -587 320 491 -435 -355 541 212 -584 -28 584 -131 -523 292 444 -404 -298 502
1876 502 155 -537 14 529 -171 -475 326 353 -448 -235 502 62 -546 90 508 -278 -458 389 328 -512 -179
$$ packed form
1743f96J206L5j211L28J108o59r06R17O35j110k98J197o0j183M07J054p00q61
1761g97R49N84j121k73J191o3j162L94J063p01q47R28N85j096k67J181q6j136
1779f74L92J026o87q13R36N13j069k02J133j31j089M56R44p35p39R65M31j086
1797d29j05J105k20j048N36Q88p90o56R83L68j080o7J096k51j019N43Q63p77o42
1816g02R52L73j055n6J048k35r73N12Q30p58n96R28L27j021k7J014k67r32N40
1835i8P69p80n22R17K59j005N5R79l43q78N95P13q14m59R32J90r84Q9R74l71q51
1856f33O13O67p94m40R07J71r26Q0Q96l29p96N56O12p15l92Q15J52q48J06Q00
1876E02l47o92N51N15p00l04Q01K7q01K13P37m40o08O36M18p86j80Q47o1q40L33
$$ plain form
1897 -179 559 15 -581 148 529 -301 -452 436 329 -523 -177 564 20 -587 143 535 -294 -446 412 324
1917 324 -504 -180 556 29 -554 130 508 -277 -425 401 298 -496 -169 527 -6 -547 155 483 -309 -402
1937 -402 422 278 -519 -133 549 -20 -544 196 495 -334 -390 448 267 -529 -123 571 -34 -536 178 482
1957 482 -316 -390 416 270 -489 -135 511 -19 -506 140 442 -278 -360 357 226 -429 -125 426 -33 -423 138
1978 138 367 -263 -292 333 169 -405 -50 417 -95 -386 212 330 -307 -218 391 108 -415 33 417 -154 -378
1999 -378 273 302 -361 -201 423 77 -453 41 424 -185 -391 278 295 -375 -204 427 73 -454 44 423 -186
2020 -186 -379 259 298 -348 -193 404 66 -429 53 417 -182 -349 280 268 -369 -161 415 40 -431 101 417
2041 417 -200 -360 322 263 -394 -146 441 26 -458 100 421 -223 -370 333 274 -402 -169 431 32 -443 81
$$ packed form
1897a79P38n44n96P29L81q30j51Q88j07q52L46P41n44o07P30L92q29j52Q58q8
1917C24q28L24P36n27n83O84L78p85j48Q26j03p94L27O96n33n41P02L28p92r3
1937d02Q24j44p97L86O82n69n24P40K99q29n6Q38j81p96M06O94o05n02P14L04
1957D82p98p4Q06j46p59L54O46n30m87O46L02p20q2P17j31o55L04N51m59l90N61
1978A38K29o30k9O25j64n74L55M67n12k91N98J18o37Q9O09k83n23M48L84n71k24
1999c78O51K9o63J60O24l46n30M94L83o09k06O69J7o70J71O31l54n27M98L79o09
2020a86j93O38L9o46J55N97l38m95M82L64n99j67O29j2o37K08N76l75m71N32L16
2041D17o17j60O82n9o57K48N87m15m84N58L21o44j47P03n9o76K33O00l99m75N24
$$ plain form
2062 81 405 -205 -345 288 278 -350 -167 384 50 -392 48 376 -163 -320 247 235 -305 -132 338 21 -351
2083 -351 71 304 -180 -253 244 163 -314 -78 329 -47 -328 113 258 -237 -220 292 122 -344 -31 347 -81
2104 -81 -330 179 275 -261 -203 320 111 -347 2 354 -94 -330 179 277 -247 -193 322 107 -332 -19 347 -87
2126 -87 -315 179 264 -274 -187 298 85 -345 -6 334 -113 -306 185 239 -273 -162 325 67 -353 26 347
2147 347 -123 -305 224 241 -283 -151 355 62 -366 45 349 -123 -298 226 247 -287 -162 325 66 -340 28
2168 28 326 -118 -297 188 226 -267 -156 295 69 -313 14 290 -113 -266 179 190 -240 -127 264 38 -290
2189 -290 40 266 -114 -219 189 159 -240 -83 277 -2 -263 93 258 -164 -198 218 122 -264 -46 284 -35
2210 -35 -265 105 238 -190 -184 227 112 -280 -56 280 -44 -278 109 236 -185 -191 230 112 -266 -52 268 -46
$$ packed form
2062H1L24o10j40O33j0o28J83N51l34m42M40L28n39j57N67j2n40J73M70l17l72
2083c51M22K33m84p3M97q1m77K36M07l76k81M41J45m95J7N12j70m66L13L78m28
2104h1k49N09R6n36N8N23k09m58L49L52m48k36N09R8n24N4N15k15m39L13L66m34
2126h7k28M94Q5n38Q7M85k13m30L39L40m47j93M91N4n12J11M87k58m20L79L21
2147C47m70j82N29J7n24J32N06k93m28M11L04m72j75N24K1n34J25M87k59m06L68
2168B8K98m44j79M85L8m93J11M51k26l82L27K76m03j53M45J1m30J13L91k26l28
2189b90L30K26l80j05M08l0l99J57L60k79k61L56J65m22l4M16r6l86K18L30l19
2210c5k30L70J33m28OM11j15l92K24L36l24k34L87J27m21oM21j18l78K14L20l14
$$ plain form
2232 -46 -263 117 237 -186 -180 229 97 -260 -23 275 -53 -248 131 223 -206 -150 240 77 -283 -7 263 -94
2254 -94 -258 149 200 -220 -167 251 64 -290 5 271 -80 -262 146 207 -216 -155 244 82 -264 -4 268 -62
2276 -62 -236 130 211 -176 -142 227 82 -237 -11 240 -63 -209 134 175 -176 -125 209 46 -222 17 213 -101
2298 -101 -186 141 126 -202 -86 216 4 -230 47 208 -122 -170 162 114 -200 -56 234 2 -226 66 202
2319 202 -126 -170 174 120 -212 -62 233 -4 -215 67 201 -127 -171 174 117 -200 -58 224 -13 -220 76
2340 76 179 -125 -163 175 93 -210 -40 217 -38 -211 89 181 -144 -144 195 91 -217 -18 229 -33 -216 105
2362 105 192 -146 -134 196 97 -208 -18 238 -39 -205 98 183 -148 -137 187 80 -210 -35 202 -24 -209 80
2384 80 161 -134 -136 151 71 -190 -26 188 -27 -185 92 150 -126 -98 165 63 -171 9 184 -47 -160 113
$$ packed form
2232d6k17L80J20m23OM09j32l57K37K98l28j95L79R2m29N6L90j63l60K76K70l57
2254i4j64M07N1m20N3M18j87l54K95K66l51j82M08O1m23O1L99j62l46K60K72l30
2276f2j74L66Q1l87L4L69j45l19K26K51l03j46L43M1l51N1L34j63k68K39J96l14
2298a01q5L27j5l28J16L02k12k34K77J61l30m8L32m8l14J44K90k32k28K92J36
2319B02l28m4L44n4l32J50K95k37k11K82J34l28m4L45n7l17J42K82k37k07K96
2340G6J03l04l8L38q2l03J70K57k55j73L00R2l25%L39j04l08J99K47k62j83L21
2362A05Q7l38J2L30r9l05J90K56k77j66L03Q5l31J1L24j07k90J75K37k26j85K89
2384H0Q1k95kK87q0k61J64K14k15j58K77N8k76K8K63j02k34J80J75k31j13K73
$$ plain form
2406 113 136 -138 -81 174 39 -186 26 175 -66 -163 123 132 -158 -76 173 23 -188 23 169 -80 -150 121
2428 121 103 -163 -82 160 24 -189 31 159 -78 -153 122 111 -157 -74 174 -1 -174 43 147 -86 -129 131
2450 131 90 -151 -41 173 -8 -171 66 163 -107 -135 141 77 -176 -40 174 -18 -183 51 156 -116 -129 139
2472 139 77 -167 -41 183 -11 -170 63 160 -105 -113 137 81 -156 -28 179 -6 -162 73 151 -93 -118 138
2494 138 68 -148 -25 163 -19 -154 74 136 -108 -103 136 50 -158 -11 153 -35 -159 75 113 -118 -94 138
2516 138 47 -158 -6 153 -43 -140 83 128 -113 -81 147 43 -133 8 149 -28 -128 84 123 -110 -75 145
2538 145 34 -140 1 146 -50 -135 83 98 -115 -66 138 19 -147 18 134 -66 -112 91 85 -132 -57 145
2560 145 16 -136 38 136 -57 -106 105 96 -113 -42 161 12 -135 35 142 -67 -94 118 95 -117 -40 138 3
$$ packed form
2406A13K3k74N7K55j35k25K12J49k41r7K86Rk90Q2K49j50k11K11J46k49p0K71
2428A21j8k66Q1K42j36k13K20J28k37p5K75j1k68Q3K48j75j73K17J04k33m3K60
2450A31m1k41J10K14j81j63K37R7k70k8K76o4k53J36K14j92j65K34J05k72j3K68
2472A39o2k44J26K24j94j59K33R7k65qK50n6k37J28K07j85j56K35P8k44k5K56
2494A38p0k16J23J88j82j35K28O2k44NK39q6k08J47J64j88j24K34L8k31K4K32
2516A38r1k05J52J59j96r7K23M5k41L2K28j04j76J41J41j77j00K12L9k33L5K20
2538A45j11j74J41J45j96q5K18J5k13M9K04j19j66J65J16k00m6K03ok17P5K02
2560A45j29j52J74R8j93m9K11rk09P1K03j49j47J70J07k09k7K12k3k12P7J78j35
$$ plain form
2583 3 -138 37 143 -68 -107 108 76 -130 -49 128 -4 -141 43 134 -74 -99 108 79 -126 -29 142 -1 -133
2606 -133 54 126 -81 -90 113 65 -125 -18 134 -5 -122 57 121 -85 -101 109 57 -131 -18 142 -15 -127
2628 -127 57 111 -84 -95 101 46 -124 -16 119 -25 -120 50 94 -84 -78 98 41 -125 0 132 -25 -107 65
2651 65 104 -94 -56 129 44 -112 5 121 -33 -109 71 93 -93 -58 110 27 -115 14 108 -56 -104 71 67 -107
2675 -107 -51 103 18 -121 22 104 -48 -94 74 74 -96 -57 115 10 -115 20 103 -50 -99 76 75 -97 -26 117
2699 117 13 -107 30 116 -68 -92 73 52 -113 -32 109 3 -124 36 90 -79 -100 83 51 -116 -30 105 -14
2722 -14 -116 33 91 -67 -80 94 49 -105 -21 107 -6 -102 38 106 -68 -76 83 60 -106 -18 105 -6 -107 33
2746 33 81 -68 -86 84 43 -110 -14 105 -18 -109 37 85 -72 -77 78 29 -102 -15 100 -19 -89 53 72 -78
$$ packed form
2583Cj41J75J06k11l9K15l2k06Q1J77j32j37J84R1k08k5K07k9k05R7J71j43j32
2606a33J87P2k07rK03m8j90J07J52j39j17J79O4k06j6K10n2j88J13J60j57j12
2628a27J84N4j95j1J96n5j70J08J35j44r5J70M4j78OJ76n7j66J25J32j57q2J72
2651F5L9j98L8J85q5j56J17J16j54p6J80K2j86L5J68q3j42J29R4j64m8J75mj74
2675a07N6J54q5j39J43Q2j52m6J68%j70L9J72j05j25J35Q3j53m9J75jj72P1J43
2699A17j04j20J37Q6j84k4J65k1j65Q1J41j06j27J60N4j69k1J83l2j67Q6J35j19
2722a4j02J49N8j58j3J74m5j54Q4J28j13r6J40O8j74qJ59k3j66Q8J23j11j01J40
2746C3M8j49j8J70m1j53R6J19j23r1J46M8j57nJ55m9j31Q7J15j19p0J42J9j50
$$ plain form
2770 -78 -51 75 20 -101 0 96 -26 -86 59 79 -68 -51 85 22 -103 4 89 -37 -94 54 65 -88 -55 84
2794 84 19 -95 8 81 -35 -88 60 56 -88 -51 90 3 -104 7 89 -33 -84 74 73 -83 -39 93 16 -86 22
2819 22 89 -46 -68 79 60 -74 -33 102 7 -85 20 95 -47 -80 60 55 -92 -27 79 0 -100 10 80 -41 -71
2844 -71 70 58 -91 -25 75 0 -93 35 93 -51 -65 78 46 -76 -9 106 4 -72 40 73 -48 -67 69 37
2868 37 -75 -17 92 -9 -90 40 75 -52 -53 70 41 -91 -21 85 -17 -79 29 70 -55 -53 69 34 -78 -7 73
2893 73 -18 -73 46 69 -51 -44 70 26 -65 12 88 -12 -66 41 55 -59 -47 76 33 -85 4 88 -25 -72 31 48
2919 48 -68 -40 69 1 -75 3 77 -39 -71 51 55 -56 -34 76 10 -71 11 87 -26 -60 54 69 -60 -23 85 10
2945 10 -70 5 82 -25 -60 52 48 -61 -24 66 7 -77 15 70 -37 -58 53 41 -56 -34 69 -1 -73 5 72 -44 -60
$$ packed form
2770g8K7J26n5j21J01R6j22o0J45K0j47J7J36o3j25J07Q5j26n7J48J1j53L3J39
2794H4o5j14J03P3j16n3J48mj44L7J41q7j07J11Q2j22n1J58jj56M4J32p7j02J08
2819B2O7j35k2J47j9j34M1J35r5r2J05P5j42l3J40nj47O5J06p9j00J10P0j21l0
2844g1J41j2j49O6J00p5r3J28N8j44j4J43l2j22O7J15j02p6J12L3j21j9J36l2
2868C7j12N8J09j01q1J30L5j27jJ23k9j32P0J06j02o2J08M1j25KJ22l5j12P1Q0
2893G3r1n5J19K3j20PJ14m4r1P7P6j00n4J07J4j14J2J23m3j18Q9Q4j13m7J03J7
2919D8j16K8J09o8p6P8P4j16l2J22Mj11K2J10o6q1Q2P6j13l4J14J5j29L7J08p5
2945A0q0P5P7j07l5J12mj09L7R0n9q4R2N5j07k1J11j2r7K2J03p0p2P8O7j16j6
$$ plain form
2972 -60 51 29 -64 -23 80 -12 -66 17 70 -32 -48 55 38 -65 -7 79 -1 -67 15 55 -41 -52 53 29 -63 -17 72
2999 72 -9 -73 27 46 -53 -50 65 22 -67 -20 60 -8 -65 24 59 -44 -37 69 27 -65 -4 72 -9 -63 39 58 -42 -29
3027 -29 67 31 -65 6 70 -11 -56 31 53 -48 -41 56 16 -78 -6 63 -11 -57 33 36 -45 -46 54 8 -66 -1 59 -27 -57 47
3057 47 40 -37 -29 53 19 -51 12 65 -26 -49 33 43 -55 -22 54 -6 -59 18 56 -37 -43 49 25 -55 -26 51 12 -68 7 44 -37 -59
3089 -59 38 29 -58 -23 51 -9 -59 5 53 -32 -54 44 42 -53 -20 55 2 -68 15 54 -38 -35 51 26 -43 -11 55 1 -56 18 55 -39
3121 -39 -38 50 16 -60 -12 51 -2 -64 24 45 -35 -33 43 24 -64 -18 48 -1 -50 14 48 -38 -31 45 38 -48 -7 70 -2 -31 33 50
3153 50 -30 -32 53 20 -40 -2 55 -9 -47 28 48 -36 -40 31 10 -53 -4 52 -23 -42 22 30 -43 -28 37 18 -59 -2 55 -14 -42 34
3185 34 32 -34 -22 45 11 -48 12 47 -14 -44 25 38 -34 -21 44 14 -49 7 42 -17 -53 24 28 -44 -24 39 -4 -48 14 35 -34
$$ packed form
2972f0J11k2r3M1J03r2n4Q3N3j02j6J03j7j03N8Q6q0o6Q2M0r6j1J05k4r2M6Q9
2999G2q1o4J00J9r9LJ15m3q9M7Q0o8n7Q9L5j03PJ06m2r2O1P6q1n4J02J9j00J3
3027b9R6l6r6P1O4q1m5Q7K2j01PR7m0r4P2O9p4m6R0Lq1jJ00m6p4O5O0q6l0J04
3057D7pp7QQ2l4p0O3N3r1k3Q2J0r8L3P6o0n3P7L8r3oR2k4q0K9P7l9q0P5L7q1k2
3089e9R7rq7L5P4o0n0O4M8q5k2R8kr5L3P5n3p0Q3L9r2LQ6k5o9L2O6n4n7P4L7r4
3121c9JQ8l4p6M8O3n3o2Q8K1q0KP6j9q8M6O6m9m9O4L4q6PP6pq6M1P7p2k9O4J7
3153E0q0kQ5l3o0L8N7o4l8P5K0q4mP1k1o3M9N6p5j9O4Qp3J5O5j9p7N7N7o9k8P6
3185C4ko6J2O7l4n9O0L5o1l0O9J3p2J3O5l0o3N6L5n9l6P7Mp2K0O3m3m4O2K1o9
$$ plain form
3216 -34 -50 28 31 -47 -24 49 5 -45 10 42 -22 -38 46 38 -34 -12 45 1 -42 15 42 -24 -32 40 20 -54 -11 40 -2 -55 22 24
3248 24 -31 -30 30 26 -38 -19 39 -5 -45 2 32 -29 -30 37 22 -41 -9 42 -11 -36 31 42 -18 -27 46 15 -29 6 51 6 -38 32
3280 32 33 -28 -32 39 13 -43 -6 42 -23 -39 18 24 -41 -27 27 -2 -46 -2 27 -13 -37 22 30 -36 -26 31 8 -45 -2 38 -13 -46
3312 -46 28 31 -28 -7 38 14 -42 -1 40 -21 -31 26 18 -40 -11 39 -6 -55 12 33 -20 -33 22 22 -34 -23 33 -7 -45 3 32 -19
3344 -19 -36 26 28 -30 -18 36 1 -40 3 37 -17 -12 35 18 -32 -5 23 12 -28 8 38 -27 -24 26 21 -29 -24 33 0 -42 13 26 -34
3377 -34 -42 26 6 -44 -13 33 2 -40 24 23 -23 -20 35 9 -21 5 42 1 -22 16 25 -21 -20 35 13 -30 -10 38 3 -31 16 33 -20
3410 -20 -22 32 12 -41 -10 27 -4 -40 11 24 -27 -22 24 7 -39 -5 36 -13 -30 16 24 -21 -5 41 21 -23 8 28 -1 -22 22 18
3442 18 -21 -7 35 16 -32 3 32 -10 -30 18 24 -32 -13 30 -8 -28 2 21 -14 -28 22 10 -25 -9 36 6 -34 5 22 -23 -29
$$ packed form
3216c4j6P8Lp8K3P3m4n0N5L2o4j6Q4qp2K2N7m4m3N7K7o6qP2k0p4M3N1m2n3P7K
3248B4n5JO0mo4J9N8m4m0M7L0o1jO7j5o3L2N1n3k5O7J1o0rP3l1m4L5M5m5m4P0
3280C2Jo1mP1k6n6L7M8o5j6N7Oo5J4N4k9m4M4K9m0k4N9Qo6J0N7k3n3M3M0n1l3
3312d6P4Ln9K1M5k4n6M1M1o1j0N7qn8K9N0m5m9O7K1n3j3N5%n6J1N6m0l8M8K9n1
3344a9j7O2Kn8J2N4l5m1M3L4n4NM7j7n0K7K8j1m0L6L0o5LN0nn0NN7l3m2N5J3o0
3377c4qO8k0n0L1M6l1m2O4jm6LN5k6l0K6L7m1k3L8Rm6JN5k2m3K0M8l5l4M7J7n3
3410b0kN4k0n3L1L7l1l6N1J3n1NM6j7m6L4M1m9j7M6Qm5J6M6k0m4L1K0k9k1M4m
3442A8l9J4M2j9m8L5K9m2k0M8On6J9M3l8k0L0J9l5j4N0j2l5J6M5l0m0L9J7m5o
$$ plain form
3473 -29 23 17 -15 3 24 3 -23 10 35 -12 -21 18 18 -23 -2 25 -3 -28 9 25 -28 -32 12 3 -40 -10 34 -5 -50 8 19 -22 -26
3506 -26 24 12 -20 -6 28 9 -30 12 27 -17 -16 28 18 -22 10 39 7 -14 21 28 -13 -10 17 3 -37 5 30 -12 -33 18 18 -22
3538 -22 -14 29 -9 -41 1 19 -20 -28 12 16 -20 -20 25 17 -31 1 25 -14 -36 25 29 -21 -14 42 11 -24 4 30 -3 -28 18 10 -18 -22 16
3573 16 1 -27 -1 18 -24 -23 16 12 -19 -14 23 -11 -26 -4 23 -21 -25 16 4 -23 -4 28 -5 -21 7 32 -10 -14 17 26 -10 -6 37 1
3607 1 -20 17 22 -28 -19 30 11 -34 -8 26 -4 -30 1 22 -19 -28 9 6 -28 -13 12 -16 -35 0 12 -20 -12 18 13 -34 -6 30 -5 -28
3641 -28 13 13 -18 -4 30 4 -31 0 24 -8 -20 12 24 -18 -12 11 3 -30 -17 19 -11 -26 5 14 -23 -17 15 -9 -33 -3 11 -21 -30
3674 -30 5 11 -22 -11 21 3 -13 -4 33 -10 -12 11 19 -13 -4 22 6 -17 2 18 -17 -22 19 17 -18 -18 23 -4 -19 -6 20 -14 -30 16
3708 16 4 -34 -17 6 -6 -30 5 10 -15 -21 17 12 -27 -4 19 -4 -23 21 15 -6 -16 25 11 -28 -3 20 -4 -12 10 15 -13 -15 22 8
$$ packed form
3473b9N2ol2J8K1k1k6L3K5m7rL9%m1K1K7k8k5L7J6n3mM4rm3L0M4l9m5N8J1m1m
3506b6N0j2l2J4L4j9l9M2J5m4JM4j0m0L2K9l2k1L5Pm1LK7j4m0M2K5m2k1N1%m0
3538b2QM3l8l2M2J8l9qM0Ml6%M5qm8L2K4l9k2O1Mn0PN6l1l5K8K6l3k5M6qk8mL8
3573A6j5k8K6J9m2JL9ml1NL7l4j5K2K7m4mM1j2k7J9L2l3j6K8K5m2mL1Rl6MM3l6
3607Ak1L7Nn0RM9j9m5K6L4l0k6L1K1m1rL7ll4J5K5k8j9L5J2l2QL0nm7K8L6l5k3
3641b8M1%l1J4L4k6l5L1K4l2j2L2J2m2OK3ql3J3L6l0j5L1Rl7OL2k4k4L0J4l2r
3674c0L5Ol3J1L2j8j6RL7m3kK3Ql2RK6j6k3J9J6l5nM1kl5%M1k7j5J3K6l4j6M6
3708A6j2l8J7K3j2k4L5Nk5oL8nl9K3K3k3j9M4ok1j0M1j4l9K5K3k4qK2Nk8kL7j4
$$ plain form
3742 8 -21 0 15 -16 -30 -7 13 -23 -26 2 4 -40 -8 16 -6 -30 7 21 -13 -9 16 1 -25 -2 28 8 -14 21 20 -5 -18 12 2
3775 2 -17 -3 18 -9 -18 9 12 -18 -23 10 -7 -32 1 13 -17 -22 5 21 -22 -16 24 2 -22 -6 23 -1 -22 15 10 -13 5 21 3 -20
3809 -20 3 27 -18 -11 18 8 -15 -7 12 -2 -17 5 13 -21 -24 15 9 -16 2 13 -19 -24 -8 14 -13 -21 6 7 -19 -13 20 0 -22 4 24
3844 24 -8 -12 20 13 -8 4 27 5 -9 18 28 3 -3 27 8 -21 3 10 4 -8 2 15 -13 -22 7 3 -13 -9 11 -8 -31 7 3 -24 -14
3879 -14 12 11 -21 -12 12 -14 -20 9 10 -23 -7 18 12 -12 7 24 7 -12 15 15 -7 -13 11 -1 -22 8 12 -4 -19 -1 3 -20 -12 4 9 -25
3915 -25 -11 13 -12 -14 2 3 -18 -14 16 -8 -20 2 21 -6 -11 12 8 -8 -8 20 7 -7 16 28 -10 -5 11 11 -12 1 22 -16 -17 2 9
3950 9 -9 -19 14 7 -23 1 7 -3 -21 4 1 -19 -19 10 13 -19 -5 15 7 -7 15 14 -7 -15 26 18 -13 10 18 1 -7 12 20 -11 -9 16 12 -17
3988 -17 -9 1 -10 -19 7 2 -23 -19 2 5 -15 -1 7 -9 -20 -4 7 -16 -10 11 7 -9 -1 23 2 -18 10 10 -7 -13 8 5 -21 3 27 1
$$ packed form
3742Hk9K1J5l1j4K3K0l6lK8Km4L2K4k2k4L7J4l4MK5j5k6K3L0k0k2L5jk5j3L0j0
3775Bj9J4K1k7rK7Ll0nL3j7k5L3J2l0nK7J6m3OM0k2k4J6K9k4k1L7nk3J8J6j8k3
3809b0K3K4m5PK9j0k3QJ9j4j5K2Ql4lL9ok5J8J1l2nJ6K2k7qK7Jk6OL3k0k2K6K0
3844B4l2mL2pk1J2K3k2j4K7J0k5oL0j9k9K4Poj2J0J3k8rK9mj6MK0j9k3L8mk7J0
3879a4K6jl2RK4k6oK9Jl3J6K5ok4J9J7j7j9K7%k2oK4j2k1L0Mj6j5J8Mk3QJ6Nl4
3915b5J4K4k5kJ6Jk1ML0k4j2K2J9k7nK3mj6%K8j3j4K3J2l8NJ6%k3J3K1l8jJ9P
3950Ij8j0L3pl0K4Oj0j8K5lk0%K9Ll2J4K0qj4K2jk1qM1ql1K3Qj7qJ9Ql1KK5mk9
3988a7QJ0j1rK6nk5MK1Lk0J4Qj6j1J6J1k3OK1mj6QK4k1k0K8%j7oK1lk6K4K4k6
$$ plain form
4024 1 -8 10 7 -20 -10 3 11 -36 -8 2 -7 -19 4 -3 -24 -12 16 3 -12 -6 8 -8 -9 1 8 -22 3 19 3 -15 5 9 -11 -11 16 12
4060 12 -16 1 18 0 -8 0 18 -3 -6 8 5 -14 -15 -2 -12 -18 -1 5 -15 -14 8 5 -20 -3 -1 -14 -20 -9 2 -9 -18 5 8 -6 4 17 1
4097 1 -14 13 13 -7 -12 18 10 -13 -7 13 -4 -10 10 8 -4 -3 10 2 -31 -21 -1 -6 -22 -1 3 -17 -21 8 -14 -21 -1 10 -13 -11 6 7 -18 -12
4135 -12 9 3 -5 -1 21 -6 -11 12 15 0 6 8 9 -14 -10 5 5 -10 4 6 -26 -17 1 7 -13 -6 4 -17 -16 0 8 -7 2 5 -9 -20 -10 2 -10
4174 -10 -1 -8 0 -17 -12 9 0 -17 5 17 -10 1 16 17 -9 6 15 0 -7 6 -1 1 -13 -1 -8 -14 -5 -1 -9 -14 1 -6 -16 -22 5 4 -13 -3 11 3
4214 3 -20 6 -5 -14 -7 2 2 -17 0 2 3 -3 9 6 0 0 9 1 -10 -5 16 2 -14 -2 5 -8 -13 5 -3 -15 -12 4 -9 -13 -2 2 -20 -21 3 18 -17
4255 -17 1 8 5 -6 9 15 -17 -9 7 9 -13 11 14 3 -4 1 9 -10 -6 8 13 -16 0 4 -9 -7 2 8 -18 -3 9 1 -11 -6 -2 -16 -12 3 -6 -19
4295 -19 -6 12 8 -9 -7 10 -4 -1 18 12 3 -2 10 6 -10 -2 26 7 0 24 10 -17 -12 5 1 -21 -7 6 -10 -14 -3 4 -15 -5 10 2 -13
$$ packed form
4024ArJ8lk7J0J3Qm7K8J0rj2K3pk1J2K8j3j5OJ4j6jJ0Pl0K5J6j6j8K0Mk0%K7m
4060A2k8J7J7j8qQJ8k1lJ4lj9jJ3j0oJ7Ok0JK2lk5J7Kj3oJ1J1j1rK3Lj4J0J3j6
4097Aj5K7%k0nL0qk3OK0j7oK0kj2JJ3ql3J0K0nj6K1Mk0mK9k2pK0J1k3KJ7Jk5O
4135a2K1oqMK2k7nK3Lj5OKJk3MJ5%j5J4Kl2RJ8Ok0PJ0k1JJ6Qj5RLj4j1J0J2j2
4174a0RpQj7NK1rj7K2J2k7J1J5Jk6J5Rj5pJ3pKj4J2poRMqnJ5pj0oK7jj7J0J4q
4214Ck3K6j1rPR%j9J7KJoJ2lo%Rqj1NK1j4j6J2Pj3nJ8qj2LJ6j3mJ1Mk2jK4J5l5
4255a7J8Plj1J5Ol2QJ6Kk2K4Lj1pNQj9MJ4Nk9J6Mj3KROk6J5J2qj2NMj4MJ5rj3
4295a9J3J8mj7KJ7j4LJ9ornJ2mj6QK8j9pK4j4k7NJ7mk2J4J3j6mJ1Pj9J0J5qj5
$$ plain form
4332 -13 -5 3 -11 -11 2 6 -20 -2 13 2 -7 -3 9 -1 6 15 6 -9 4 16 7 -11 3 5 -6 -14 9 4 -13 -6 12 -6 -26 -5 -4 -18 -16 -1
4370 -1 4 -12 1 5 -13 -9 -1 5 -13 -11 14 -7 -13 -1 12 -5 -8 15 15 -2 16 15 13 -2 8 17 -5 -7 3 4 -17 -8 3 0 -8 3 4 -12 -12 0
4410 0 -3 -6 -9 -7 -7 -10 1 5 -7 -10 2 1 -16 -5 5 1 -5 11 10 -6 -2 13 16 -4 -5 10 12 -11 -3 13 -10 -5 0 5 -18 1 6 -5 -22 -1 -4 -14
4452 -14 -17 -4 5 -11 -4 10 -4 -16 4 4 -12 -4 10 9 -6 9 11 2 -17 7 10 -6 -4 17 11 -5 8 -5 0 -11 6 3 -7 -3 6 6 -10 -7 7
4491 7 -8 -11 -7 -5 -12 -18 4 -8 -15 -4 -1 -10 -2 11 -5 -20 3 10 3 -2 -5 14 -6 -1 -3 14 2 -4 15 9 -12 -9 -5 4 -4 -8 5 -6 -7 10 -6 -11 -6
4534 -6 -1 -6 -16 -2 0 -12 -10 -6 -12 -13 -8 5 -6 -10 3 7 -5 -6 0 1 -4 8 8 -1 -5 11 10 -7 0 15 -3 -18 -8 -1 -6 -6 6 -4 -13 -13 5 -9 -22
4577 -22 -9 -6 -23 -21 -9 -13 -12 -8 2 -2 -13 -1 5 -6 -13 13 1 -4 3 2 -7 -3 -8 3 11 2 3 6 -3 -4 0 -7 -14 7 -10 -12 -10 -3 1 -19 -5 -9 -9 -16 -8 7
4623 7 -8 -23 -4 -6 -8 -2 2 -1 -4 10 4 -3 -1 7 12 -13 4 4 3 -9 7 3 -4 -7 9 -3 -9 -8 8 -9 -1 3 0 -6 -5 12 -8 -12 -4 3 -19 -11 -1 1 -14
$$ packed form
4332a3QQj4%J3Mk6J8J5j1rMJ2j0PRrj5J3J2rj8J4Kj1qK3nj7PJ8j8k0K1Jj4KJ5
4370aNj6J3Mj8MQOj8KK5k1oJ2J3j7lK3%j7J8jkj5J0Rk2kJ0Jk1RJ1lqJ1Jj6%J2
4410@lllK%lJ1Mj2lJ2jj7J1J0moJ6jj6MJ5Lk0jJ5Kk3QJ6k3NNNk3J9Nj1j7K1lj0
4452a4lJ3Rj6PJ4j4j2K0%j6QJ4jj5J5Krj9K4Lj6KK1oj6J3j3Nj1J7lj0MR%j6LJ4
4491Gj5lMKpoK2j2pJ1LrQJ3j6j5K3PpnlJ9k0NkJ7j2oJ9ok1LMRqmJ3j1jJ7j6nN
4534fNnj0J4Kj2KMojNJ3j1mJ3Mj2jOJnJ2%rmJ6jj7PJ5j8j5J0Pn%J2j0r%J8j4j3
4577b2J3Lj7KJ2mJMJ0mj1J2Oj1pK6j2nPjrMnJ1QrJLrjMppK1j7kKPMk0J4m%pQJ5
4623Gj5j5J9kkOMllJ4opKQNk5J7%jj2J6mplJ6j2oJJ6j7QMloJJ7k0mQPk2QJ0Kj5
$$ plain form
4668 -14 -2 -2 -10 -14 -1 5 -2 -16 9 11 -10 -8 5 8 -3 0 5 -8 -13 -4 4 1 5 7 -12 -18 -10 -2 -7 -12 -6 11 -13 -19 -2 -7 -17 -1 6 4 -10 0 -5 -12
4712 -12 -7 -4 -3 -7 -5 6 7 -4 1 8 0 -7 1 0 -13 -7 16 -1 -3 6 1 -17 -3 2 -14 -18 -12 4 -8 -12 -2 -5 -12 -2 -2 -11 -7 -1 -3 -13 -2 7 3 -15 0
4757 0 9 6 1 -3 2 -2 5 11 3 -8 -5 11 4 2 0 14 -13 -6 -1 -1 -10 -15 -5 -13 -19 -12 -7 -9 -12 -7 -8 -8 1 -4 -7 -13 2 5 1 -6 10 6 -18 -5 7 9 1 -4 -1 -13
4807 -13 -9 4 -4 -14 -1 2 -9 -7 2 0 -5 -20 0 -11 -17 -6 -7 -16 -13 0 -7 -20 -7 6 -6 -12 -5 6 3 -11 8 -9 0 -5 4 -5 -9 8 7 -4 -5
4848 -5 2 0 -4 3 -6 7 -7 1 -1 5 -9 -2 -5 -10 -1 -2 -1 -22 -5 -3 -14 -13 -3 3 -15 4 10 -1 1 6 18 3 3 11 13 0 -3 18 -9 -1 5 16 0 1
4892 1 13 6 -3 -2 10 -7 -6 0 2 -12 -16 -2 -5 -9 -3 3 1 -9 2 9 -5 -3 -2 -3 -8 2 1 2 -3 6 9 2 -7 16 2 -1 14 7 -4 0 2 17 -5 0 5 4
4938 4 -2 0 2 1 -5 1 -7 -13 -2 0 3 -15 -4 10 -9 -2 14 -5 -5 0 9 8 -5 10 4 6 8 13 9 5 9 7 2 0 17 19 -4 -8 7 1 -6 2 15 -2 -2 -6 0
4985 0 -7 -15 -1 -3 -7 -3 -4 2 -11 -7 4 -7 -15 0 6 -4 11 3 1 -5 -2 9 3 3 5 5 -5 16 10 11 0 -6 -2 -2 -3 -6 3 -8 -7 -3 -1 -11 -11 -2 -17 -18 -3
$$ packed form
4668a4J2%qmJ3Opj4K5Kk1KJ3Lj1LNj3nRQlMKj9oQQnnOJ7k4oJ7nj0J6Pkj4J0np
4712a2NLJmKJ1Jj1NPqpQjj3OK3j7kRnj8J4Nj6mOJ6j2mJ0lpJ0%rMOkj0J1Rmj8J5
4757@RlnmNmPOqj1LJ6pkkJ4k7PN%rnJ0qoPNklNj%RnloJ5LmpJ6mk4J3J2KqnLj2
4807a3MJ3qj0J3Lj1KRknj5K0j1oJ1jrLJ3pj3J3J3j2oPJ1lj4J9j7RnRrmJ7jj1j
4848ePkmPrJ3j4QkOj4PlnRjJk1J7Kj1JJ0Oj8J9Oj1KNJ2j5%QKj3lK1k7QOJ1j6J
4892AJ2prJJ2j7JOKj4mJ4lmOOkj0J1Pj4KJjnJ0jJnRLprK3j4lJ5pj1MKJ5k2NNj
4938DoKKjoOqoJ1KLj8J1J4j9PJ6j9%NRjj3J5oKKNmmMknkJ7Kk3mJ5opQJ3j7%mO
4985@pqJ4kmMjOj3MJ1j1qJ5Oj0J5qkoLJ1o%K%j0K1oJj1oM%jlRj1JMKj0%Rj5jJ5
$$ plain form
5032 -3 3 -8 -4 0 -14 -5 -3 5 -10 1 -2 6 -4 10 -5 1 2 7 6 -2 -2 1 5 -1 -1 9 3 -7 0 -3 -7 -1 5 -13 -17 -10 -5 -9 -4 -10 -12 -20 -19 0 -10 -20 -6
5079 -6 5 5 -6 3 11 -5 8 11 -8 -8 1 10 -1 4 9 7 0 -1 7 6 -6 -1 11 -4 -12 -6 3 -7 -10 3 -3 -21 -9 -3 -9 -10 -8 -15 -7 -3 5 -7 -9 -3 11 -10
5125 -10 3 3 14 2 8 7 5 -2 1 7 -5 5 4 9 -2 2 15 13 -6 3 1 0 2 -6 -10 -14 -4 -2 -9 -6 2 -6 -16 -16 8 -10 -9 -9 -8 -16 5 4 -11 -1 8
5170 8 9 -1 -9 7 4 -1 3 13 0 -9 -10 -2 -5 -5 7 -4 0 -6 -4 -17 -8 -12 3 3 -13 -1 2 6 -5 -3 -5 3 3 -1 -4 -2 -1 4 3 -3 9 15 -6 -3 12 8 -4
5217 -4 6 5 -8 -4 9 6 -5 -1 1 -2 -11 -2 0 -3 -21 -11 -7 -14 0 2 -1 -14 -8 -5 -5 -20 0 -5 -4 1 7 0 -3 1 6 11 8 14 8 -6 -3 8 -6 -5 3 5 10 -3
5265 -3 4 2 -3 -8 6 7 -13 -19 0 -10 -11 -3 -4 -14 -2 -15 -6 -17 5 3 -10 -12 3 -7 -1 4 -1 3 7 -3 7 0 -5 6 9 1 4 1 3 1 -9 -1 5 -2 2
5310 2 -3 -3 -7 -2 -13 -4 -5 0 0 -6 -4 -3 -11 -16 3 4 -2 -3 -10 0 -2 4 6 -11 1 7 -9 2 9 5 10 -1 3 1 6 4 1 7 3 -6 3 -3 -2 -11 -3 -7 3 6 -3 -10 -10 -7
5362 -7 -15 -7 -7 -6 -11 -5 -3 -10 1 -1 8 -6 3 1 3 -1 -6 5 1 -5 4 15 -1 1 2 3 -7 -7 3 -4 -6 1 9 -5 0 -4 -6 -5 0 -1 -8 1 -7 -3 -6 -8 -2 -8 -3 -6 -10 3
$$ packed form
5032cOj1MMj4RKQj5J1lQj0J4j5OJNjq%LMo%J0oj0PlmOOj8mPNmNokqJJ9j0j0J4
5079fJ1%j1RQj6J3Lj9%RRj1NNkpjQjj2NJ2j5qORj0lJ3oj8J2OojKpQMQj2kOJ4k1
5125a0J3%J1j2OjkpLOj2J0jNj1MJ3kj9RkjKqmmJ0KpLQqj0%K4j8J%JqK1jj5J0R
5170HJj0qJ6lnMJ0j3rjQl%J2j1MoKj3RmJ5%j6J2LMj1KkQ%mlKJNjoJ2Ok1LJ5mj2
5217dJ0jj3MJ3lj1MKlrRKlj8J0MpJ4Klj3OL%j5K0nJNOplMNNlOoj4LJ1j4JQKNj3
5265cPknnJ4Jk0oJ9j0jQjj0J2j3Rj1K2kj3kJ5j0ONnMMj0J0pnJ1LqLlKkj0QOpM
5310Bn%mNj1RjN%oKJqnJ9JojpJ0kOKj7J2Oj6J1PmNj1MkNklOmrRoJrQmJ0Lrp%L
5362gqQ%JnOKpJ1kRj4RkKmnJ1moRJ1j6KJJj0%J0pkPQj4NmkJNjpRqMlkOoNlmJ3
$$ plain form
5414 3 -1 8 -3 2 0 11 6 9 15 9 11 7 -3 4 11 5 6 3 -8 -3 -5 -8 -4 4 0 -1 -3 -10 -9 3 5 6 -12 -3 2 -5 -10 -14 -6 3 -13 2 5 0 -2 9 3 4 -4 5 -4 -7
5466 -7 -4 10 -2 7 12 -4 -4 -1 2 0 -7 -6 -12 -9 -16 1 -12 -12 -8 -14 -6 -9 -17 4 -8 -13 -10 -8 -4 -4 4 4 -2 4 2 10 11 15 8 -2 1 -1 0 -1 1 -4 0 1 3 0 5 2 4
5519 4 -1 -8 -5 0 -5 -5 -1 -2 -10 -2 -8 -17 -12 -1 -3 -8 -4 -1 -7 -3 0 0 -6 -3 -2 3 3 7 10 3 -5 -6 -1 -3 -7 -4 -3 -8 -3 2 -6 -7 -3 -14 -8 -9 -1 -1 -6 -8 -4 -17 -8 3 3 -4 -3
5576 -3 -6 -6 -10 -4 0 4 -3 8 5 0 5 5 -6 -3 1 -4 3 -3 -5 5 -6 6 -1 0 0 9 -1 -2 -17 -2 -15 -6 -8 -13 -4 -6 -1 -1 -5 -8 -1 -3 -5 -3 8 -3 -9 -1 -1 8
5626 8 -2 3 18 6 -9 5 -5 -7 5 8 1 3 11 1 -6 3 12 -5 -10 -5 -4 0 0 1 -9 -13 -8 -10 -2 -10 -3 -12 -5 -2 4 5 4 7 1 10 1 7 3 -1 6 3 8 -1 6 9 6
5677 6 -1 3 4 7 -2 6 -5 -11 -3 0 -4 -14 -1 0 -4 -7 0 3 -2 -8 1 10 4 -3 0 8 9 -3 3 -3 -2 11 4 6 1 11 -4 9 5 6 6 5 3 1 -3 -3 -6 -15 -15 -4 6
5728 6 -7 -14 1 -5 -4 2 -6 -5 -8 1 7 -9 -2 -1 -7 6 -8 11 5 0 9 6 16 5 10 6 13 6 5 6 13 14 5 14 3 10 18 -5 3 -1 0 -7 3 -3 -6 -3 -6 -4 -6 0
5778 0 2 -2 -7 -11 -4 -2 -4 -2 -1 7 4 5 9 13 -2 11 -2 8 11 3 0 0 0 3 7 2 -2 0 -1 -16 -2 4 -5 -16 -9 -5 2 3 -6 -10 -9 -10 1 -12 -11 -9 -2 5 -4 -5 9
$$ packed form
5414CmRj1NkJ1nLOoKmj0PPoJlj1NklMQmjkpJJ2KJj8RNpnmQRj6J5LnkJ1oJqRrl
5466gLJ4j2RNj6%LLkpJoLpJ7j3%MoQlqK1j2nLKM%Q%oOkQJMpj0LkJjKnMJKlNlK
5519DnpLNn%MjqQorNJ1knMLoML%oLJN%MLpqjNkmLJnNNqjMj1OjQ%nkMj3RJ1%pJ
5576cl%mOMMpJ1lnN%j1LMnPokJ0j1J2pJ%Rj0jj5J5j3RknRkN%mlPkkKJ1j1oQ%R
5626Hj0NJ5j2j5J4j0kJ2LpKQj0pRRj7nNJM%Jj0mNkQqPrPLOJjLoRrOmmPlNrPLl
5677FpMJLrQj1oQLmj0J3JmlPLnoRRopLQJj2OoJJ3pKnJ0j5J3mJ%jkkm%lr%J1J0
5728Fj3pJ5oJOqJlROj6PJoJ3j4J9onRlJ0j1NmPpjJPJrRj1PQk3QmJpJ0olLlKkO
5778@KmnmPKkKJQlJMMj5J3j3J0Lql%%LMnmKjj5J4Orj1PMPJrmJjJ1j3JKPPrjJ4
$$ plain form
5829 9 1 -3 2 2 -1 4 7 12 11 11 13 10 5 -4 0 -3 2 -4 4 -1 -7 7 1 -3 -4 -5 -7 -6 3 -3 -7 -10 -2 4 -24 0 -2 -5 -1 -9 0 -8 -1 5 -1 7 8 2 10 5 3 9 13 11 2 1 7 4
5887 4 4 -1 3 5 5 6 -6 5 -6 -19 2 -17 -4 -7 -9 -15 2 -5 -10 -1 0 -1 -6 6 -4 0 9 -7 0 -3 5 5 0 10 4 10 1 8 1 1 1 3 -13 -5 5 3 -2
5934 -2 -4 0 -1 -17 2 2 3 -5 -8 0 -12 -6 -2 -9 -7 6 0 1 9 8 -5 2 5 4 -4 6 1 1 -4 -3 6 -2 -11 -3 -3 -1 3 2 0 -10 -2 0 10 -9 -10 -7 -14 -14 -8 -2 -5 -9
5986 -9 -8 -5 -4 -7 8 1 3 3 -1 -3 6 0 -12 8 9 7 -7 14 9 8 11 14 10 2 -11 3 7 1 -3 -1 -8 -11 -7 -3 -5 -14 -4 -12 -2 -13 -2 -8 -11 -6 -5 2 -4 -1 0 -10
6036 -10 2 1 -3 2 -7 3 -1 -4 0 0 -2 2 7 0 3 -7 1 -5 -12 -13 -11 -18 1 -4 -11 -11 -15 -7 -3 -8 -15 -6 -11 -9 -8 -13 -17 -8 -10 -2 0 -5 2 -6 8 3 5 -8 1 4 -3 -1 -6 -6
6090 -6 -11 -2 0 -1 -7 -1 0 -8 -9 0 -10 -18 -18 -16 -6 -7 -9 -4 -20 -9 -2 -10 -7 -14 -10 -3 4 -2 -12 -3 -8 -4 2 6 8 6 7 -5 5 -3 -6 2 7 -8 -6 -8 1 -11 -10 1 -5
6141 -5 -11 -7 -1 -15 -5 -5 -8 -11 -2 3 -14 -10 -2 -10 -3 -15 -22 -7 -15 -1 0 6 0 6 8 0 9 3 5 -2 9 -6 9 -6 2 1 -3 -4 -2 -8 -11 -5 -5 -2 -4 -8 -15 -12 -7 7
6191 7 -5 -1 -9 -15 -12 -3 -4 -13 -5 -5 0 3 -9 -3 1 2 -2 3 -2 1 -2 0 1 -9 -3 6 2 0 -6 6 -3 -1 -5 -13 -9 -11 -6 -1 0 -12 -2 3 -3 1 2 -9 -7 -2 -2 0 0 -6 1 7
$$ packed form
5829IqmN%lNLNj%KlnrMlNoQnoJ4omjjkJRomlQOk8K4klMqRqPOoQJoQnkOMkrjOl
5887D%nMK%Jj2J1j1j3K1j9J3lkoJ7pnRJjnJ2j0MRj6PlQ%nJ0oOrPp%%Kj6QJ0kn
5934bkMjj6J9%JqlQj2OMpKJ3oJQjj3PLjqJ0n%nJRqrQ%KMjkj0QKJ0j9jLp%OOlm
5986iJLJlJ5pK%mkRoj2K0Jkj4K1njLLmqj3J4MomKplMMkrJ0qJ0j1J1olNJPoLJj0
6036a0J2jmNrJ0mlM%kMNpLj0QopjKpJ9np%mQMnpRnKJnmRkQKnPqJ4nKj3RLpKn%
6090fnRKjoOJqjRj0q%KJ0jkNj6J1PqLpMPPoj0RnMOMKkJj2J0qlQNj5KkRj2JJ1o
6141eoMOj4J0%llRNj7MQqPj2pJ5qJ4JOoOKqRoKpJ1j5J5j5QjmjKolO%LkmpLNJ4
6191Gj2MqoLRjrQ%NLj2OMJmNnLlKJj0ORmkoJ2rKmqMkNNJj2J0NoMJj1KN%K%oPO
$$ plain form
6245 7 4 2 -2 -3 4 7 4 1 13 8 0 14 3 -6 -3 -9 5 -3 -6 -9 -3 1 -5 -7 -9 -9 -13 -9 -3 -2 6 -1 3 6 -5 3 5 6 13 2 1 4 10 -2 7 10 9 17 17 12 -1 11
6297 11 5 -1 1 5 -1 -9 -5 1 -7 -3 4 -4 1 3 -2 -2 -6 -6 -6 -1 -3 0 -4 3 -9 -10 -3 5 2 5 8 10 4 1 6 -5 7 5 6 10 12 7 -3 -4 0 0 0 7 -2 -13 -5 -7 -3 1 1
6352 1 -11 -13 -1 -8 -11 -2 -5 6 1 3 4 0 4 -7 6 2 2 -2 6 8 -3 -7 10 11 4 15 3 3 0 -1 2 7 -5 -5 -1 -5 4 -14 -11 -8 4 -10 -3 -10 -5 -4 -2 4
6400 4 -9 -8 -9 1 -4 4 1 -3 6 -1 1 -2 -4 -5 3 10 5 18 2 9 10 3 -1 -4 -4 -5 1 -5 -20 -7 -9 -13 -12 -2 -13 -14 -6 -5 -12 -11 -5 -8 -6 -7 -2 -4 -2 1 -5 2 0 -6 -3
6453 -3 -2 -2 8 8 6 6 -4 0 -9 -6 -2 -2 3 -5 2 -10 -1 -5 3 -4 4 1 -8 -11 -11 -8 -9 -2 -7 5 -12 -13 -1 -9 1 1 -11 0 -5 -14 -2 -4 0 3 -4 4 -8 2 2
6502 2 -1 -4 -3 -9 -12 7 -2 -4 2 2 1 -10 -5 -1 3 -9 -11 -16 -7 -15 -6 -3 -11 -9 -10 0 -19 -16 -7 0 -1 -7 -3 -3 -5 -10 -10 -3 1 1 2 1 0 -8 -4 -3 -10 -18 -9 -5 -13 -4 -12 -8 -16 -9
6558 -9 -11 2 -8 -10 -15 -13 -10 -19 -4 -6 -4 2 -4 -1 2 -1 -4 -1 -8 -9 2 6 -10 -1 -10 -7 0 -14 0 -5 -6 -7 -6 -7 -5 1 -17 -14 -9 -9 0 -3 -5 -16 -5 -14 -8 -13 -6 -5 -13
6609 -13 -8 -14 -4 -9 -5 0 -1 10 -2 5 5 4 5 2 2 8 -7 0 8 -9 -2 6 5 10 3 -7 2 1 1 1 -13 -9 -9 -7 2 -7 -3 -8 1 -4 0 6 6 -10 3 -1 6 1 6 1 -9
$$ packed form
6245GlkmjPLllJ2nqJ4j1rLoJ4qllOMokk%mMOJQpMLj1QKJPj1jLOj2RLjQ%nj3J2
6297A1ooKMoqMOqMPqNKn%m%%NkLmPj2jPQlLLKolNj1J2kJMKnj0jM%%Prj1QkMM%
6352Aj2kJ2plRlJ1nKJmMj1J3m%mQKj1mJ7JpJ1j2%ljLNj2%MmRj8LLJ2j4PpNJKO
6400Dj3JjJ0nQlmRpKlkjQPnJ3j6PJpml%jOoj5J3kmJJ0j1jQJpJOlKjNkKLoPkoL
6453cJ%J0%k%j0MrLM%NqPj2RmQpQlrl%LjPnJ2j7jJ2qJ0%j2J1nrJ2kMLpQj2J0%
6502BllJolJ9rkO%jj1NMMj2knRqRLqKjJ0j9LRPjoM%kn%PM%JjjqMJpqRMqRqMqP
6558ikJ3j0knKLrJ5kKOoLLllLpjJ1Mj6RrLPj4J4njjJjKOj8LN%Rlkj1J1rOnPJq
6609a3NoJ0nMNjJ1j2P%jJl%Oj5PQj7PQjNpj0Rj%%j4M%KRrMnRnMO%j6J3mPnNnj0
$$ plain form
6660 -9 1 -1 4 -4 -4 3 -2 2 1 -8 0 -7 -6 -4 0 -3 -2 -3 -8 -15 -2 -15 -3 -7 -10 -12 -17 0 1 -13 -9 -11 -4 -2 -11 4 -2 18 -6 3 -2 8 3 12 5 3 -2 0 -2 5 -6
6711 -6 -6 -2 -10 -5 -10 -15 -3 -8 0 -5 -11 -5 -21 -3 -9 -14 -11 -6 -3 2 -2 -10 -17 -5 -19 6 -11 2 0 2 2 2 5 -5 7 -4 2 -3 -4 0 5 -3 5 -5 -4 -5 -3 2 -9
6760 -9 0 0 -8 -12 -17 -5 -10 -3 -1 -10 -4 -7 -4 -5 -6 7 -4 -2 2 1 6 -6 4 5 5 2 12 17 1 8 2 -4 1 -9 -14 1 -11 2 1 -3 3 5 -5 -6 -9 -4 -14 0
6808 0 -2 -4 -9 2 -4 -2 -3 7 1 -8 2 3 7 9 5 11 5 6 12 5 1 -3 18 15 16 12 4 9 4 -3 4 3 -3 7 5 -3 1 4 5 5 9 -1 -6 1 -15 2 -14 -9 -6 -4 0 -9
6860 -9 -1 7 -15 -1 -4 2 -5 5 9 4 5 8 10 3 6 3 -2 1 -4 1 -3 -5 10 -2 -17 -6 -5 -7 8 4 0 4 1 -8 -20 -10 -8 -7 -1 1 -10 -9 3 0 -10 -3 5 2
6908 2 5 0 -2 8 -4 3 11 3 7 -6 -6 -2 -4 6 -5 -1 -6 -13 -5 -2 2 -4 -9 4 -6 -5 -3 -5 -7 -7 -2 -8 -6 -1 -11 4 -11 -12 0 -5 9 -2 11 0 6 4
6954 4 -6 -4 -1 -1 -2 -3 -8 2 2 -7 4 -6 -10 -14 -8 -6 -15 -5 -12 -1 -2 -7 -1 -12 -6 -4 -9 0 9 -7 -5 1 6 0 3 -3 -1 -2 4 5 -3 1 -11 3 -6 -2 -1 -3 -3 0 -5
7005 -5 -6 -6 -3 -14 -3 -12 -2 -4 -9 -2 -4 -4 -21 -5 -12 -5 -3 -4 -6 -7 9 2 -4 -11 -10 -1 2 -5 10 3 -3 3 4 -2 -3 -10 -4 3 -1 -4 -9 2 -7 -10 2 10 -6 -8 -12 -8 -5
$$ packed form
6660iJ0kNq%PnMjrQpJKMlJjnpJ3j3J2mlknJ7Jj4MkPKrJ5oK0k4RnJ0nRpknKkPj1
6711f%MqNnnJ2nQnoOj6J8onLNLNmqpJ2j4K5j7J3kK%%Lj0J2j1OnjMNqQj0JjKNj1
6760iR%qmnJ2nPKrOlLjjJ3j1KMjNj2J0J%lJ0Nj6PooNj0nJ5j2J3jmOKj0jlNj0J4
6808@kknJ1oKjJ0orJ0JMKmOoJOpmmK1lJmqNnpPjoJ0kqMLJ%Mj0nPj6J7j6NLKMr
6860iQQk2J4lOpJ0MnJLKpLlnLnNmkJ5j2j5J1JkJ5mmMlrj2J0KJOKj1JJ2lj0PQl
6908BLnkJ0j2PQqMj3%MkJ0j1MnpQLMonJ3j0JKkk%NoKNj0J5j5jJ2nJ4j1J3j1Ok
6954Dj0KL%jjnJ0%rJ1j0mmOKrJ0pJ1jnOj1OKnRRj6KONoLoKjOJqMj2J4rMJk%Ln
7005ej%Lj1J1rJ0knPk%j7J6pPKjkjJ6popJRLpJ5poOJojpOPmlnJ1rlJ2Qj6kmML
$$ plain form
7056 -5 -8 -11 0 4 -8 -2 -14 -2 -7 -8 3 -6 -10 -8 3 -12 7 7 8 -5 14 1 1 -5 6 3 0 -2 -7 -9 -12 -7 -11 -11 -3 -3 -5 -8 -5 0 -9 -8 -4 -13 -5 -4 -8 -9 -13
7105 -13 -3 1 1 -7 5 -8 -2 3 12 3 -3 4 0 13 -2 1 3 1 4 -3 -8 -4 2 -10 -3 6 -6 -1 -18 -6 -14 -8 0 -13 -8 -10 -10 -13 -7 -3 -3 -1 -6 0 -8 1 -3 0 -4 -4
7155 -4 2 1 8 -2 2 1 -4 -4 -4 -6 -1 -10 -8 3 -4 0 -11 -5 -4 -3 -6 -10 -4 -8 -13 -8 -7 -4 -7 -7 -4 -7 1 -6 -2 0 0 0 1 -1 -3 -4 -2 0 -7 -5 9 9 10 -6 2 0 11 9 5
7210 5 -3 -8 -1 -8 -5 -2 -17 -9 -5 1 -1 1 -7 -13 -3 -19 -6 -10 5 0 -8 4 -2 7 3 15 2 -6 -3 -5 -4 8 11 2 7 0 3 1 11 -3 4 0 4 -1 -8 -5 -5 -13 1
7259 1 -4 -6 -14 -13 -15 -7 -3 -11 -9 -6 -9 -7 -17 -8 -6 -4 2 6 5 1 2 2 -1 -5 1 -8 3 3 -5 1 -4 1 -4 -2 -2 -7 -7 -3 6 1 -9 -8 1 -9 0 -2 -7 -7 1 -1 -1 -5 -12 -2 6 3
7315 3 -3 6 -3 0 11 0 8 3 -2 8 10 7 -1 2 8 4 3 6 2 -4 -6 -1 -2 -1 -3 -14 -12 -3 -17 -5 -8 -9 -2 -2 0 -9 -2 -10 2 -5 8 -2 4 10 1 2 4 -1 -1 10 2
7366 2 1 1 7 -2 3 4 1 -6 -4 -1 -4 -5 -2 0 -4 -10 1 -8 -13 -9 -10 -8 -2 -2 -4 1 -15 -9 -2 6 -2 -12 6 9 5 -12 -12 11 13 16 4 -1 0 1 -7 7 -1 2 3 -8 8
7417 8 -5 -6 -18 -2 1 -9 -12 -4 -12 -7 -15 -13 -5 -4 -22 -7 -10 -8 -4 -4 4 2 -1 -6 -2 0 -5 -5 6 5 4 -1 1 2 -1 2 -11 8 4 -11 -12 -12 1 -12 -14 -12 -6 -5 -5
$$ packed form
7056ellJ1Mj2Oj2J2njJ1rmKJ1j5J9%Jj3J9j3%oJ1llknklNm%Q%klLNrJMrQJmjm
7105a3J0M%qJ2j3ONRroPmJ3j5LKkLpnMOj2PRj2Nj7J2qOQj3Nk%lOM%KnOqRmLm%
7155dOjPj0Mjn%%kNrKJ1pMj1OJJlmOmnNJLl%LlQpMK%%JkkjKKpKJ4%Jj6QkJ1km
7210EqnPpLLj5QMOkKqoJ0j6J3mJ5nqJ2oRmJ2j3qLkJJ2LrNpLkJ0j4PmMnpL%qJ4
7259AnkqJkQMqKLlKj0RKKOMjmJ%lmOrJ1%qOnNnK%n%MRnj0JRj0Rkn%Qk%mpJ0Ql
7315CoRrLJ1j1QnnJ0KlqLOmjLmokNjJkj1KRj4J2ljP%KrPqJ2pJ3j0OOrJKn%J1q
7366Bj%OrNJlpKLljLKmoJ1rnMjKO%kNj6OPQqj0J8Lmj7%K3KLj2nJJqJ4qLJj1J6
7417Hj3jj2J6Lj0lQqNqKQJj8J5lKM%QklnMKn%J1jjnKJlLj3J9mj5j%J3j3kKOJ%
$$ plain form
7466 -5 5 1 -3 -10 -12 -1 -8 -9 -6 -10 -3 0 -13 -1 -6 3 3 0 2 2 10 -1 7 7 8 -4 -2 15 -3 -6 5 1 0 -3 -2 -11 -12 -4 -5 -2 -5 -16 3 -9 -2 -9 -2 -7 8
7515 8 5 -5 -1 8 -2 -9 9 -3 -5 -13 -4 1 -8 2 0 3 -2 9 5 -6 2 -7 9 4 5 -9 -5 0 0 -12 1 -4 -9 -3 -14 -10 0 -2 -7 2 -5 -16 -4 -7 -1 6
7561 6 -8 -5 11 -7 3 3 -4 1 12 0 -1 3 -4 6 4 -1 2 1 -3 -6 -5 -14 -9 -5 -1 -2 -10 1 -7 -5 4 -12 -13 -2 -17 -12 -7 -10 -7 0 -6 -2 -2 -9 -3 -11 -5 -10 -4 -7
7611 -7 -8 7 -5 -6 -2 6 3 -4 11 4 -1 1 -4 -1 2 -11 -10 -6 5 -10 -4 -7 -1 3 0 -4 -7 -3 -12 -1 -6 -10 -6 -3 -9 4 10 0 -1 6 8 3 4 10 3 8 -7 1 4 -3 4
7662 4 -5 1 3 5 -12 -3 -15 -15 -7 -5 -10 3 -8 -6 0 -3 -2 -3 -7 -1 3 -2 -5 7 -3 3 -4 -3 -2 1 6 2 1 8 7 0 -1 -1 4 2 9 2 2 -4 2 -4 1 -6 3 -7 1 -4 -7 5
7716 5 0 -4 -5 0 -20 -8 0 -4 -15 -5 0 -4 -1 -4 9 0 -13 3 -5 7 1 -2 3 8 5 2 8 14 -6 -4 -4 6 -12 5 -6 -10 -11 -5 -1 2 -2 -8 -7 1 -9 -11 -4
7763 -4 1 7 -2 -2 1 -5 -1 4 -2 5 1 -2 9 3 -9 -2 0 2 1 -6 14 14 -9 -10 4 3 -8 -7 0 -14 0 -4 -11 -3 -5 -12 -1 -5 -8 -1 1 2 -2 -6 -6 4 -11 -6 -6 1
7813 1 3 8 7 -5 -1 0 -7 -2 2 1 -4 -2 1 0 6 -1 -5 -2 -6 3 -6 -3 -10 -6 -7 -7 1 -6 5 0 1 2 -7 1 -2 0 -2 -4 2 -4 5 -1 -1 4 -2 2 12 9 12 8 6 3 -3 0 7 3 3 6
$$ packed form
7466eJ0mmpkJ1pjLmPLj3J2nR%lK%Qj1Q%Jj2KJ7j8lJ1mjlJrjQjLlj1J9j2PpPnJ5
7515Hlj0MRj0pJ8j2kqRNrJ0kLnJ1mj1QrJ6nJj4MN%j2J3nnOj1MJ0knRpj1J2lOP
7561Fj4LJ6j8J0%pNJ1j2jMpJ0knLjmlJrNMMjqJ1qKRj6jJ1j5NNlLPoM%pOqOnOl
7611gjJ5j2jMQlpJ5pnKnLLj3JMJ1j5OlOMlmlMrJ1nmMLoJ3Oj0jPKnJOpNj5QLpP
7662DrOKKj7Rj2%QKnJ3j1KOlJjmOMnlJ2j0OpJJLNmjPjpj%NkPp%oOoNpRj0QnlJ2
7716EnmjNk0J2Qmj1J0NmLlJ3rj3J6qJ2olNNllOOk0K%J0j8J7j1mjOMLmoJQj0kP
7763dNOr%LoMNoPmlJ1oj2PKKjpK0%k3jJ4jj1JPj4J4mpQkpJ1mlPKJmm%J0j5N%P
7813AKNjj2MJpNMjnKLjOpmLmRrLpMj%QpJ1nJJrQlKkkOoRo%NoMJ0lLmkloLPm%L
$$ plain form
7871 6 2 2 0 -3 3 -6 -6 11 3 -1 -2 -1 -14 -9 -7 7 -3 -5 -4 -4 2 -10 -6 -6 8 0 -4 7 -7 -3 13 4 2 14 2 1 2 -2 3 1 -1 1 1 4 0 -1 -2 -10 -11 -3
7921 -3 -6 -3 -11 -10 1 -9 -1 9 -2 3 3 -3 -7 -11 3 0 -1 9 5 -5 6 3 2 -5 8 -3 3 2 0 -1 9 0 0 1 -7 -8 -8 -7 -5 -2 -9 -6 -3 -8 -16 -8 -12 -4 -9 2
7971 2 4 -5 11 -4 -1 2 -1 3 -3 -1 -2 2 10 7 1 3 7 3 -1 2 1 0 1 -8 6 3 -8 -1 -3 -1 0 1 2 -3 -9 -1 -4 -4 -5 -3 -7 -2 -7 6 -1 3 0 2 18 -1 0 1 7 -2
8025 -2 8 12 -5 0 13 -7 2 -1 0 -1 -4 2 -8 -7 -17 -3 -3 -2 -8 -11 -10 -1 -3 -7 -10 -4 -10 -4 -6 -8 -1 -11 -1 -4 -8 -4 -5 4 -1 4 4 6 -1 2 3 5 -8 1 -8 4
8075 4 1 3 9 -6 -6 -13 -5 -3 -2 -2 -4 -15 -4 -16 -2 -7 -11 -11 -2 -15 -8 -10 -10 -3 4 1 -7 1 -4 -1 -6 0 4 4 6 7 13 -3 -6 -2 -1 7 5 2 -2 -7 -2 -10 -11 -13 -4 -6 -6 -5
8129 -5 -4 -11 -1 2 -9 -2 2 -1 -1 -4 -5 -5 -3 4 0 7 -6 -4 2 -4 4 12 5 10 4 -1 4 -6 -9 4 0 -4 -5 -7 -8 0 -11 -12 1 -6 -12 1 -13 -5 -10 -6 -4 -10 2 -6 -3
8180 -3 -6 -5 -3 3 4 -2 6 0 -3 9 -4
$$ packed form
7871Fm%klOr%J7qmjJj3NKJ4j0kJ%Oj2M%J4qmJ1j4MJ6rkJ2j2jJmNkkK%LmjjqjQ
7921clLqJJ1j0QJ0j1N%ommJ4ljJ0mj0J1ljpJ3j1OjkjJ0r%Jqj%JKLpLLnqQmQnJ1
7971BKrJ6j5LLlMoKjMQloKMmmLjjJrJ4lj1PkKJJJnoQl%jKmNnJ3pMlKJ6j9JJOr
8025bJ0Mj7NJ3k0RlJjlOj0Jj0J4%JolJRkmlOoOkkPj0J0lmMjRnN%KpLJKj3RrJ2
8075DlKOj5%pQKJ%kj1J1j2J4nm%Rj3Pk%PPlqQnLnOM%KJOj6lMJQklmnNqjkRk%J
8129eJpJ0Lj1PMl%lj%KPmPj3KOoQQpNonNj0lJ3mmjkjQj1jJ3poJ3j4QnMKoJ2qL
8180clJKOJoQolJ2j3
8191d
$$ Imaginary data points
##PAGE= N=2
##DATA TABLE= (X++(I..I)), XYDATA
$$ plain form
0 0 0 0 0 0 0 0 0 0 0 0 0 -8 8 -8 8 -16 16 -24 24 -32 40 -48 56 -64 72 -88 96 -112 135 -152 176 -200 224
33 224 -256 288 -326 366 -408 456 -510 567 -630 700 -774 856 -947 1046 -1152 1270 -1399
50 -1399 1540 -1697 1871 -2064 2281 -2524 2803 -3121 3491 -3930 4451 -5092 5899 -6948 8379
65 8379 -10449 13729 -19718 34190 -142787 -44220 248199 -84405 -182325 110500 159963 -169138
77 -169138 -112836 194549 111874 -184809 -59845 163072 17129 -155783 24020 131558
87 131558 -49156 -114374 64433 81681 -66202 -50126 68793 18679 -59953 4204 48186
98 48186 -22871 -28197 32647 6711 -38466 16223 36041 -35586 -28503 52383 14945 -63660 1612
111 1612 70267 -20057 -70423 37549 65243 -53197 -54905 65164 41059 -72678 -25057 74878
$$ packed form
0@%%%%%%%%%%%qJ6j6J6k4L2m0M8n6P2q8J04j20J36j60J84k08K47k87L28l76M24
33B24m80N44o14O92p74Q64r66J077j197J330j474J630j803J993k198K422k669
50a399K939l237L568l935M345m805N327n924O612p421Q381r543J0991j2847J5327
65H379j8828K4178l3447N3908j76977R8567K92419l32604r7920K92825M9463l29101
77a69138N6302L07385q2675k96683J24964K22917j45943j72912J79803J07538
87A31558j80714o5218J78807J7248j47883J6076J18919n0114p8632O4157M3982
98D8186p1057n326O0844k5936m5177N4689J9818p1627P083Q0886l7438p8605O5272
111A612O8655r0324n0366J07972K7694j18440j708J20069k4105j13737M7621R9935
$$ plain form
123 74878 8854 -71999 6141 64376 -18433 -53011 26780 39254 -30472 -24665 29311 10686
135 10686 -23511 1156 13688 -9595 -1054 13770 -13216 -13196 27714 7652 -40885 2493 51327
148 51327 -16397 -57932 33069 59822 -51151 -56429 69126 47770 -85472 -34185 98771
159 98771 16445 -107752 4291 111451 -26574 -109390 48798 101550 -69400 -88268 86822
170 86822 70401 -99763 -49221 107295 26187 -108987 -2899 104751 -18991 -95070 37994
181 37994 80757 -52961 -63029 62982 43229 -67612 -22926 66785 3557 -60926 13557
192 13557 50733 -27285 -37217 36808 21630 -41676 -5236 41820 -10649 -37436 24783 29127
204 29127 -36112 -17802 43873 4479 -47592 9607 47089 -23276 -42615 35337 34697 -44865
$$ packed form
123G4878o6024q0853P8140N8235q2809l4578P9791J2474o9726N807N3976j8625
135A0686l4197K4667J2532k3283Q541J4824k6986K0M0910k0062m8537M3378M8834
148E1327o7724m1535R1001K6753j10973n278J25555k1356j33242N1287J32956
159I8771q2326j24197J12043J07160j38025q2816J58188N2752j70950j8868J75090
170H6822j6421j70164N0542J56516q1108j35174J06088J07650j23742p6079J33064
181C7994M2763j33718j0068J26011j9753j10841M4686Q9711o3228o4483P4483
192A3557L7176p8018r932P4025j5178o3306L6440M7056n2469k6787O2219M344
204B9127o5239J8310O1675l9394n2071N7199L7482p0365j9339P7952o40p9562
$$ plain form
216 -44865 -24157 51091 11971 -53645 614 52420 -12564 -47752 22817 40181 -30573 -30559 35216
229 35216 19874 -36528 -9143 34573 -620 -29687 8537 22513 -13933 -13881 16421 4671 -15885
242 -15885 4191 12425 -11794 -6427 17398 -1446 -20455 10432 20578 -19712 -17695 28297 11964
255 11964 -35381 -3862 40197 -6039 -42217 16877 41047 -27730 -36719 37620 29424 -45717
267 -45717 -19671 51253 8183 -53662 4143 52712 -16324 -48435 27436 41107 -36527 -31278
279 -31278 42943 19808 -46222 -7532 46152 -4574 -42819 15610 36551 -24743 -27907 31368
291 31368 17611 -35029 -6530 35557 -4464 -33021 14550 27721 -22966 -20148 29061 10951
303 10951 -32476 -934 32959 -9121 -30552 18337 25513 -26003 -18277 31503 9545 -34408
$$ packed form
216d4865K0708P5248l9120o5616N4259N1806o4984l5188P0569J7364p0754J4O5775
229C5216j5342n6402K7385M3716l5193k9067L8224J3976l6446N2L0302j1750k0556
242a5885K0076Q234k4219N367K3825j8844j9009L0887J0146m0290K017M5992j6333
255A1964m7345L1519M4059m6236l6178N9094K4170o8777q989P4339q196p5141
267d5717K6046P0924m3070o1845N7805M8569o9036l2111P5871J3671p7634N249
279c1278P4221k3135o6030L8690N3684n0726l8245N8429K0941o1294l164N9275
291C1368j3757n2640K8499M2087m0021k8557M7571J3171n0687K818M9209j8110
303A0951m3427L1542L3893m2080k1431M8889P176n1516P726M9780k1958m3953
$$ plain form
315 -34408 -12 34521 -9448 -31849 18055 26705 -25041 -19570 29909 11104 -32209 -2062
327 -2062 31848 -6743 -28943 14568 23804 -20753 -16932 24828 8975 -26510 -708 25726 -7214
340 -7214 -22645 14059 17585 -19310 -11060 22565 3645 -23588 3991 22309 -11185 -18884 17321
353 17321 13672 -21867 -7078 24469 -273 -24850 7792 23025 -14768 -19098 20632 13419 -24825
366 -24825 -6447 26998 -1163 -26925 8775 24635 -15758 -20313 21473 14319 -25456 -7209
378 -7209 27378 -445 -27078 7967 24645 -14738 -20312 20183 14457 -23957 -7613 25716 337
391 337 -25422 6747 23111 -13066 -19020 18168 13560 -21621 -7157 23209 424 -22841 6174
404 6174 20583 -12025 -16642 16663 11380 -19722 -5244 20949 -1200 -20260 7403 17712 -12812
$$ packed form
315c4408L4396L4533m3969k2401M9904Q650n1746N471M9479j8805m3313L0147
327b062L3910l8591k2200M3511R236m4557L821M1760j5853l5485K5802K6434l2940
340g214j5431L6704L526l6895Q250L3625j8920k7233K7579J8318l3494p699L6205
353A7321l649l5539J4789L1547k4742k4577L2642J5233l7793m330L9730p213l8244
366b4825J8378L3445k8161k5762L5700J5860m0393m555M1786p154l9775J8247
378g209L4587k7823k6633L5045J6678l9383n574M0495n726l8414J6344L3329k5379
391C37k5759L2169J6364l6177n954L7188m608l5181J4464L0366k2785k3265K9015
404F174J4409l2608m617L3305n283l1102J4478K6193k2149j9060K7663J0309l0524
$$ plain form
417 -12812 -13566 16939 8159 -19461 -2043 20117 -4284 -18897 10188 15851 -15207 -11362 18852
430 18852 5772 -20842 385 20994 -6585 -19335 12263 16013 -16959 -11326 20287 5717
442 5717 -21973 380 21937 -6413 -20151 11940 16837 -16487 -12210 19714 6671 -21367 -715
455 -715 21306 -5224 -19557 10627 16264 -15102 -11726 18219 6282 -19804 -407 19647 -5402
468 -5402 -17816 10636 14466 -14885 -9897 17759 4497 -19050 1219 18656 -6786 -16637 11713
481 11713 13191 -15603 -8645 18128 3426 -19082 2024 18490 -7235 -16387 11784 12996 -15310
494 -15310 -8639 17531 3673 -18352 1440 17651 -6316 -15581 10536 12316 -13797 -8182 15795
507 15795 3434 -16449 1398 15630 -5989 -13519 9902 10233 -12838 -6122 14511 1520 -14808
$$ packed form
417a2812p54L0505q780k7620J7418K2160k4401j4613K9085N663l1058L845L0214
430A8852j3080k6614K1227K0609k7579j2750L1598L750l2972N633L1613j4570
442E717k7690K2353K1557k8350j3738L2091M897l3324M277L1924j3043k8038K0652
455g15K2021k6530j4333L0184N637l1366L376K9945j1937k6086J9397K0054k5049
468e402j2414K8452L830k9351M988K7656j3262k3547K0269J7437k5442r851K8350
481A1713J478k8794O958K6773j4702k2508K1106J6466k5725r152K8171J212k8306
494a5310O671K6170j3858k2025J9792J6211k3967r265K6117J780k6113N615K3977
507A5795j2361j9883J7847J4232k1619p530K3421L31k3071O716K0633j2991j6328
$$ plain form
520 -14808 3141 13720 -7440 -11327 11030 7860 -13525 -3658 14771 -900 -14632 5413 13149
533 13149 -9460 -10453 12690 6821 -14850 -2546 15751 -1984 -15306 6368 13597 -10256 -10799
546 -10799 13302 7095 -15329 -2849 16110 -1642 -15632 5956 13926 -9806 -11137 12848 7488
559 7488 -14835 -3287 15635 -1119 -15161 5382 13493 -9118 -10710 12070 7136 -13934 -3042
572 -3042 14606 -1226 -14013 5271 12232 -8748 -9461 11383 5947 -12949 -2023 13302 -1986
585 -1986 -12502 5680 10589 -8792 -7795 11014 4363 -12238 -615 12330 -3131 -11321 6565
598 6565 9324 -9378 -6499 11373 3112 -12373 571 12305 -4213 -11166 7546 9073 -10259
611 -10259 -6181 12150 2739 -13021 987 12820 -4642 -11561 7921 9328 -10562 -6321 12310
$$ packed form
520a4808J7949J0579k1160l887K2357l170k1385R867J8429j5671j3732K0045P736
533A3149k2609r93K3143n869k1671J2304J8297j7735j3322K1674P229k3853n43
546a0799K4101o207k2424J2480J8959j7752j3990K1588P970k3732j331K3985n360
559G488k2323J1548J8922j6754j4042K0543Q111k2611j592K2780m934k1070J0892
572c042J7648j5832j2787J9284O961k0980p13K0844n436j8896J0926J5325j5288
585a986j0516J8182M909j9381R97J8809o651j6601J1623J2945j5461q190J7886
598F565K759j8702K879J7872q261j5485J2944J1734j6518o953J8712J527j9332
611a0259M078J8331r411j5760J4008J1833j7462o919J9482J407j9890M241J8631
$$ plain form
624 12310 2797 -13027 907 12641 -4515 -11220 7655 8841 -10120 -5791 11613 2287 -12140
637 -12140 1318 11592 -4760 -10029 7717 7629 -9978 -4593 11352 1185 -11752 2318 11142
650 11142 -5623 -9605 8506 7267 -10706 -4298 12079 969 -12503 2472 11957 -5756 -10517
663 -10517 8591 8252 -10805 -5421 12174 2204 -12651 1095 12166 -4238 -10792 6903 8663
676 8663 -8940 -6021 10142 3046 -10474 -68 9891 -2686 -8536 4943 6502 -6559 -4048
689 -4048 7389 1395 -7395 1192 6616 -3525 -5130 5353 3088 -6536 -709 6974 -1812 -6644
703 -6644 4214 5560 -6315 -3855 7902 1624 -8869 889 9065 -3519 -8489 6000 7142 -8129
717 -8129 -5184 9700 2716 -10581 18 10668 -2802 -9943 5394 8459 -7568 -6318 9142
$$ packed form
624A2310r513j5824J3934J1734j7156o705J8875J186j8961M329J7404r326j4427
637a2140J3458J0274j6352n269J7746q8j7607N385J5945j0167j2937J4070Q824
650A1142j6765l982J8111j239j7973O408J6377j1110j3472J4975R485j7713m761
663a0517J9108l39j9057N384J7595r970j4855J3746J1071j6404o554J7695J760
676H663j7603K919J6163p096j3520J0406R959j2577n850J3479J559j3061K511
689d048J1437n994q790Q587N424j0141j605J0483k265r624N827P683q786m832
703f644J0858J346j1875K460J1757o278j0493R758Q176j2584m970J4489J142j5271
717h129K945J4884o984j3297J0599J0650j3470p141J5337L065j6027J250J5460
$$ plain form
730 9142 3748 -9916 -927 9905 -1869 -9084 4441 7521 -6526 -5356 7980 2793 -8716
743 -8716 -38 8646 -2692 -7809 5187 6260 -7223 -4146 8651 1629 -9402 1086 9368 -3808
757 -3808 -8593 6297 7121 -8411 -5060 9920 2596 -10763 101 10867 -2798 -10211 5316
770 5316 8874 -7431 -6967 9010 4646 -9887 -2113 10068 -396 -9515 2688 8339 -4602 -6648
784 -6648 5957 4616 -6688 -2453 6762 322 -6223 1561 5125 -3078 -3627 4045 1851 -4502 -9
799 -9 4348 -1757 -3652 3273 2486 -4412 -976 5071 -737 -5200 2498 4785 -4129 -3856 5513 2491
815 2491 -6477 -816 6949 -1032 -6867 2875 6232 -4554 -5081 5909 3515 -6805 -1665 7155 -298
830 -298 -6932 2195 6132 -3874 -4829 5161 3142 -5951 -1234 6185 -761 -5842 2641 4920 -4273
$$ packed form
730I142n394j3664Q989J0832j1774p215J3525L080j4047J170J3336n187j1509
743h716Q678Q684j1338n117J2996J073j3483L077J2797p022j1031J0488Q282j3176
757c808m785J4890Q24j5532L351J4980p324j3359J0864J0766j3665p413J5527
770E316L558j6305M64J5977m364j4533P774J2181j0464r119J2203N651j2941k046
784f648J2605j341j1304M235R215o440o545P784L564q203n49P672k194o353M493
799iM357o105j895O925p87o898L436O047n808m463P698K287q914K73R369l022
815B491q968N661P765p981n835R742L357j0786n27J0990k394j0320N140Q820p453
830b98o634R127L937j0006r55R990k019r093M717P419o946n081Q483K279r193
$$ plain form
845 -4273 -3549 5494 1814 -6225 141 6384 -2134 -5978 4035 5036 -5670 -3612 6945 1839 -7701
860 -7701 160 7927 -2233 -7572 4228 6657 -5977 -5270 7338 3497 -8234 -1489 8563 -612
874 -612 -8312 2626 7499 -4406 -6221 5776 4562 -6676 -2692 7036 761 -6841 1070 6145
888 6145 -2648 -5006 3875 3550 -4646 -1925 4923 272 -4701 1289 4048 -2598 -3006 3586 1704 -4162
904 -4162 -249 4283 -1209 -3967 2557 3235 -3681 -2182 4457 885 -4860 523 4833 -1946 -4394
919 -4394 3204 3516 -4238 -2378 4915 989 -5188 447 4994 -1849 -4401 3066 3420 -3992 -2179 4543
935 4543 774 -4677 682 4367 -2014 -3644 3154 2600 -3954 -1323 4380 -88 -4390 1496 3980
950 3980 -2783 -3203 3844 2106 -4583 -806 4940 -618 -4916 2026 4457 -3315 -3655 4392 2510 -5173
$$ packed form
845d273P24R043l680q039O366O243q518l844J0013J001j0706K058J0557n106r540
860g701P861P767j0160n339J1800K429j2634P07J2608l841j1731O745J0052r175
874f12p700J0938M873j1905j815J1997j214j1238L984R728o275p602P911N075
888F145q793k358Q881l25q196K721O848m651m973N990K759o646m08O592j882n866
904d162L913M532n492k758O524O78o916J499O639l572n745N383M310o779k448
919d394P598L12p754J860P293l926o177N635M547o843k552P467L54p412J813O722
935D543l769n451N359L685o381j630O798n54o554K631N703m468m302N886K484
950C980o763m20P047j738o689L777N746n558m298O942K431p772l40Q047j882p683
$$ plain form
966 -5173 -1167 5528 -305 -5499 1771 5045 -3105 -4215 4218 3064 -5011 -1680 5387 205 -5340
981 -5340 1258 4891 -2571 -4038 3648 2924 -4372 -1589 4707 190 -4638 1173 4170 -2377 -3370 3328
997 3328 2300 -3969 -1065 4223 -225 -4130 1456 3639 -2545 -2872 3402 1841 -3949 -681 4149
1012 4149 -546 -3991 1714 3501 -2744 -2679 3533 1649 -4004 -473 4144 -742 -3912 1900 3355
1027 3355 -2865 -2480 3594 1404 -3997 -210 4056 -991 -3745 2087 3108 -3005 -2210 3658 1134
1042 1134 -3983 29 3964 -1194 -3609 2220 2959 -3076 -2071 3641 1024 -3919 88 3870 -1168
1057 -1168 -3498 2162 2865 -2935 -1998 3492 991 -3722 107 3667 -1148 -3270 2117 2615 -2853 -1730
1073 -1730 3341 707 -3530 364 3396 -1406 -2957 2298 2226 -3006 -1340 3390 292 -3507 754
$$ packed form
966e173M006O695n833n194P270L274q150j110Q433j154q075L331P067n182n545
981e340O598L633p462j467P686p24p296K783O296m517m828N811K997o547r93O698
997C328j028o269K904N288m448l905N586K183o184l27O274j561n790L268M830
1012D149m695l445N705J787o245O5O212j884n653L531M617m886l170N812J455
1027C355o220L85O074k190n401L787M266n047k754N832J021o113P95N868k524
1042A134n117M012L935n158k415N829P39o035J005N712k617m943M007L782n038
1057a168k330N660P03n800R37N490k501m713L829L560m815k122N387M98n468J123
1073a730N071k634m237L894L032m802j551N255p2n232J666M730l098l799M261
$$ plain form
1088 754 3288 -1736 -2779 2573 2034 -3167 -1119 3498 116 -3530 892 3271 -1807 -2735 2569 2002
1104 2002 -3086 -1103 3377 125 -3369 827 3076 -1709 -2537 2418 1796 -2927 -903 3163 -84
1119 -84 -3121 1023 2784 -1908 -2216 2586 1403 -3059 -483 3241 -524 -3134 1487 2738 -2363 -2100
1135 -2100 3038 1251 -3450 -276 3592 -719 -3446 1704 3020 -2523 -2336 3184 1513 -3561 -559
1150 -559 3712 -406 -3561 1331 3148 -2138 -2540 2747 1747 -3145 -870 3284 -43 -3172 911
1165 911 2802 -1684 -2229 2250 1490 -2630 -664 2740 -203 -2600 1016 2228 -1704 -1641 2210 913
1181 913 -2503 -116 2552 -711 -2342 1447 1919 -2065 -1301 2495 587 -2676 210 2654 -958 -2390
1197 -2390 1656 1928 -2182 -1310 2529 588 -2663 142 2579 -878 -2304 1492 1818 -1981 -1217 2283
$$ packed form
1088G54K534n024j043N352n39n201K048M617l382l646M422K379n078r28N304n67
1104B002n088J983M480l252l494M196K249m785q28M955o22m723K024M066l247
1119h4l037M144J761m692l08M802j183m462K576L724l765k610M621J251n101K63
1135b100N138j787m701L174L868m311k727N150J316n543J87N520j671n074L002
1150e59M271m118l155M892J817n286m02N287j000m892K275M154l327l129M083
1165I11J891m486n45M479p60m120J966L404k943k397L616J212l932O3L851j297
1181I13l416K387K668l263j631L789M72l984P64L796j908l263K886K444l612j432
1197b390M046K72m110Q72L839j941l251K805K437l457j426L796L26l799P64L500
$$ plain form
1213 2283 501 -2385 237 2262 -924 -1938 1522 1433 -1964 -786 2234 65 -2270 686 2099
1228 2099 -1378 -1708 1980 1140 -2380 -428 2605 -338 -2595 1107 2341 -1820 -1895 2402 1272 -2796
1244 -2796 -547 2983 -245 -2948 1018 2683 -1722 -2237 2271 1636 -2694 -926 2893 162 -2876
1259 -2876 584 2656 -1276 -2250 1836 1692 -2249 -1026 2457 321 -2464 422 2278 -1059 -1892 1607
1275 1607 1360 -1975 -718 2159 41 -2161 648 1927 -1246 -1528 1710 999 -2047 -376 2160 -289
1291 -289 -2086 894 1813 -1455 -1404 1860 861 -2114 -271 2169 -357 -2063 932 1781 -1414 -1350 1778
1308 1778 841 -1982 -257 2023 -325 -1887 868 1593 -1323 -1175 1666 648 -1822 -72 1840 -499
1324 -499 -1675 1022 1334 -1464 -898 1756 336 -1906 249 1839 -836 -1634 1332 1258 -1755 -760 2005
$$ packed form
1213B283j782k886K622K025l186j014L460q9l397J178L020k169k335K956J413
1228B099l477l30L688q40l520J952L033k943k257L702J234m161p5M297j130m068
1244b796K249L530l228k703L966J665m405n15M508o35m330J768L819k731l038
1259b876L460K072l932r74M086j44l941J223L483k136k785K886J856l337q33L499
1275A607k47l335J257K877k118k202K809J279l173k82L238p11l046J671K536k449
1291b89j797K980R19l268N1L264r99k975J843K440k526j706K995Q49l195O4L128
1308A778r37k823J725K280k348j562K755P25k916J48K841j018k470J750J912k339
1324d99j176K697L12k798N66K654j420k242K155J590k675p98K966p4l013R95K765
$$ plain form
1341 2005 174 -2093 425 2001 -999 -1747 1495 1346 -1879 -835 2114 266 -2187 336 2098
1356 2098 -891 -1843 1379 1454 -1752 -972 1991 405 -2089 164 1995 -711 -1766 1206 1388 -1573
1372 -1573 -923 1798 371 -1888 179 1807 -710 -1566 1159 1188 -1502 -729 1703 184 -1748 342
1388 342 1632 -838 -1365 1257 982 -1539 -512 1695 1 -1685 494 1543 -954 -1252 1315 854
1404 854 -1570 -395 1685 -93 -1659 563 1487 -993 -1201 1340 813 -1569 -368 1663 -120 -1621
1420 -1621 575 1445 -1016 -1153 1332 754 -1547 -301 1636 -197 -1581 667 1377 -1064 -1049 1382
1436 1382 636 -1570 -144 1623 -321 -1521 787 1291 -1165 -940 1453 518 -1616 -53 1627 -428
1452 -428 -1522 844 1268 -1230 -951 1489 519 -1639 -67 1647 -398 -1545 809 1310 -1168 -990
$$ packed form
1341B005j831k267K518J576l000p48L242j49l225J044K949j848k453K523J762
1356B098k989r52L222P5l206P80K963j586k494K253J831k706j055K972J82k961
1372a573O50K721j427k259K067J628k517q56K725K9k690P73K432j519j932K090
1388C42J290k470n27K622k75k521J027K207j694j686K179J049k497k98K567m61
1404H54k424J175K080j778j566K222R24k480k08K541n27k382J201K031j783j501
1420a621K196Q70k461j37K485n78k301J246J937j833j384K248P10k441J5K431
1436A382p46k206J426J767j944j200K308N04k456K25K393r35k134J563J680k055
1452d28j094K366M24k498K79K440r70k158J572J714k045j147K354N01k478J78
$$ plain form
1468 -990 1424 578 -1583 -152 1605 -303 -1497 697 1267 -1053 -960 1305 562 -1425 -123 1453
1484 1453 -292 -1317 680 1076 -990 -746 1192 359 -1294 37 1247 -445 -1111 783 835 -1051
1500 -1051 -516 1209 121 -1260 252 1201 -621 -1020 943 749 -1175 -416 1300 39 -1337 352
1516 352 1257 -707 -1064 1016 795 -1252 -431 1379 67 -1387 327 1288 -695 -1096 998 791 -1239
1533 -1239 -449 1334 48 -1351 340 1231 -718 -1023 984 686 -1205 -341 1297 -57 -1285 441
1549 441 1138 -776 -911 1063 614 -1231 -236 1318 -135 -1280 509 1153 -817 -917 1087 638 -1260
1566 -1260 -281 1341 -79 -1314 440 1194 -757 -983 1009 696 -1188 -358 1268 -7 -1248 339
1582 339 1110 -661 -904 892 610 -1049 -293 1100 -49 -1048 382 922 -637 -682 857 413 -955
$$ packed form
1468i90K414q46k161J431J757j908j194K194N70k320R3K265p43j987J302J576
1484A453j745j025J997L96k066K44J938q33j653J331J210j692o66J894N2j886
1500a051N35J725j088j381J512R49j822l99J963j94j924P59J716j261j376J689
1516C52R05j964l57K080k21k047Q21J810j312j454J714R61j983m01K094k07k030
1533a239P90J783j286j399J691Q91j949l05K007k98j891Q64J638j354j228J726
1549D41O97j914j35J974m49j845R95J554j453j145J789O44j970j00K004m49j898
1566a260R79J622j420j235J754P54j951k26J992l13j884Q30J626j275j241J587
1582C39P71j771k43J796k82j659P56J393j149r99J430N40j559m5J539m44j368
$$ plain form
1599 -955 -79 994 -213 -897 511 747 -742 -501 917 237 -996 61 988 -360 -904 626 729
1616 729 -841 -499 999 217 -1062 77 1045 -366 -953 643 766 -862 -536 1002 232 -1068 77
1633 77 1041 -374 -915 663 726 -850 -461 985 174 -1016 149 982 -440 -833 713 626 -876 -353
1651 -353 1006 56 -1017 240 952 -519 -812 761 602 -943 -338 1040 34 -1054 248 982 -518
1668 -518 -848 750 636 -937 -392 1024 95 -1040 201 991 -449 -834 697 657 -847 -381 950
1685 950 111 -958 180 902 -420 -738 648 542 -802 -289 873 27 -870 240 774 -491 -634
1702 -634 661 416 -789 -184 836 -77 -818 325 721 -535 -563 706 379 -810 -137 852 -106 -805
1720 -805 344 719 -536 -551 717 366 -789 -113 846 -109 -800 344 692 -539 -520 702 313 -782
$$ packed form
1599i55Q76J073j207o84J408K36j489K41J418o80j233J057R27j348n44J530J03
1616G29j570L42J498p82j279J139R68j411n87J596J23j628L26J538p70j300J145
1633G7R64j415n41J578O3j576L89J446q11j190J165Q33j422l93J546q7j502N23
1651c53J359r50j073J257P12j471k93J573j59j545O05J378j006j088J302P34j500
1668e18l30J598j14j573N45J416r29j135J241P90j440l85J531m0j504M66J331
1685I50q39j069J138P22j322l18J386j06j344N13J162q46q97J110N34j265j43
1702f34J295k45j205O05J020r13p41J143L96j256k8J269l27j189O73R89r58o99
1720h05J149L75j255j5J268l51j155O76R59r55o91J144L48j231J9J222l89j095
$$ plain form
1738 -782 -57 807 -172 -757 392 618 -595 -450 710 216 -787 11 785 -255 -714 477 573 -624
1756 -624 -395 734 179 -792 54 786 -265 -688 477 572 -625 -370 742 181 -775 47 767 -267
1774 -267 -680 455 554 -602 -359 715 153 -756 57 728 -288 -650 474 494 -616 -327 711 98
1792 98 -740 117 701 -334 -606 524 456 -646 -261 724 57 -728 169 698 -362 -568 526 434 -635
1811 -635 -238 707 37 -704 166 653 -344 -556 502 402 -616 -229 680 39 -685 159 635 -341 -525
1830 -525 495 364 -603 -199 659 -8 -655 198 592 -374 -487 532 338 -609 -136 656 -40 -633 237
1849 237 570 -402 -449 534 302 -601 -120 642 -61 -619 235 538 -381 -441 491 275 -566 -116 588 -59 -559
1870 -559 212 473 -360 -374 458 237 -528 -67 548 -96 -507 257 432 -394 -301 491 158 -540 14 540 -173
$$ packed form
1738g82P25Q64r79n85J149K26j213J45J160m94j003P98P74j040m59J191R6j197
1756f24K29J129n55r71Q46P32j051m23J165R5j197K55J112n61r56Q22P20j034
1774b67m13J135R9j156K43J074n62r09Q13O71j016l62J124K0j110K89J038o13
1792I8q38Q57N84j035k72J130o8j102L85R85o67p85Q97N29j060k06J094r2j069
1811f35L97R45o70p41Q70M87r97k12J058j00j018L87R09o41p24Q44M76r76j84
1830e25J020j31r67M04Q58o67o47Q53L94r66j13J019j94r47M73P92o96n93Q70
1849B37L33r72m7R83k32r03M81P62p03n58Q54L03r19o0R32k16q41M50P04o47n00
1870e59P71K61q33j4Q32k21p65M61O15o44m11P64J75q26R3P92l33o98N54N26p13
$$ plain form
1891 -173 -488 331 399 -451 -265 529 107 -576 57 560 -231 -520 368 395 -489 -270 553 97 -606 45 554
1912 554 -226 -511 338 391 -476 -269 530 99 -566 55 539 -201 -472 345 379 -444 -236 521 85 -534 80
1933 80 522 -226 -446 368 349 -466 -203 541 48 -552 107 511 -274 -455 388 327 -502 -202 532 40 -559
1954 -559 103 513 -250 -447 373 326 -447 -208 502 56 -507 78 472 -208 -403 321 308 -392 -179 440 43
1975 43 -435 86 405 -196 -323 307 220 -380 -109 399 -27 -406 144 348 -258 -280 351 158 -412 -51 422
1996 422 -97 -414 207 346 -323 -262 400 141 -448 -18 443 -122 -416 231 362 -319 -241 413 146 -433 -17
2017 -17 452 -95 -399 222 333 -306 -252 388 135 -421 -13 411 -127 -384 226 308 -339 -237 386 88 -439
2038 -439 23 426 -157 -385 268 311 -361 -195 421 83 -453 48 454 -160 -396 281 319 -355 -200 423 95
$$ packed form
1891a73l15Q19O8q50J86P94m22o83O33N03p91k89Q88K7q84K19Q23m56p03O51N09
1912E54p80k85Q49N3q67K07P99m31o65O21M84p40k71Q17L4q23K08P57m36o19O14
1933H0M42p48k20Q14j9q15K63P44m93o00O59M04p85j81Q43o1q29L00P34m92n99
1954e59O62M10p63j97Q20m7p73K39P10m46n63N85L94o80j95P24j3p00K13O19l97
1975D3m78N21L19o01j27O30q7o00K71N08m26l79N50K04o06k2O31j93n70L61M73
1996D22n19l17O21J39o69O1O62k59n89M30M61n65k94O47J31o81P8O54k67n79M16
2017a7M69n47l04O21J11o39N4O40k53n56M08M24n38k57O10Q2o47J02O23k98n27
2038d39M62M03n83k28O53M3o72J66O16l38n36N01M06o14k36O77L8o74J55O23l28
$$ plain form
2059 95 -435 29 431 -138 -382 238 308 -325 -223 382 111 -398 2 371 -121 -357 194 259 -278 -190 314
2080 314 72 -349 23 336 -132 -291 214 208 -281 -121 323 18 -327 93 319 -181 -249 275 169 -310 -67
2101 -67 353 -41 -345 132 289 -221 -246 285 149 -340 -62 346 -52 -347 131 291 -228 -243 274 143 -340
2122 -340 -68 334 -46 -323 138 285 -215 -226 287 141 -331 -32 340 -50 -309 155 288 -240 -208 306 121
2143 121 -341 -15 354 -95 -323 187 270 -258 -199 302 102 -354 -16 342 -101 -331 175 266 -271 -204 298
2164 298 103 -350 -19 336 -79 -327 152 281 -220 -201 281 127 -293 -24 303 -64 -283 147 243 -213 -169
2185 -169 255 85 -270 4 272 -85 -249 155 187 -225 -122 254 36 -289 46 259 -134 -221 188 158 -250
2206 -250 -97 263 6 -281 74 266 -160 -215 214 161 -255 -79 286 9 -264 82 256 -150 -209 221 153
$$ packed form
2059I5n30M64M02n69k44O20P0o33J02O05k71n09M00L69m92k36N51O5n37Q8N04
2080C14k42m21L72L13m68j59N05om89J60M44l05l45M20K26n00o8N24j06m79K43
2101f7M20l94l04M77J57n10k5N31j36m89K78M08l98k95M78J60n19j5N17j31m83
2122c40K72M02l80k77M61J47n00j1N13j46m72K99L72l90k59M64J33n28L2N14j85
2143A21m62L26L69m49k28N10Q3n28N9N01k00m56L38L58m43k30N06R1n37O7N02
2164B98j95m53L31L55m15k48M79J29n01J9M82j54m20K69L27l67k19M30R6m56M4
2185a69M24j70l55K74K68l57j64M04L2m12J03L76k18l25L35K13l93q7M09l0m08
2206b50J53L60k57k87L55J92m26n5M29n3m16J76L65k77k73L46J74m06n9M30o8
$$ plain form
2227 153 -249 -87 271 5 -269 75 259 -143 -205 209 134 -270 -64 272 -11 -282 92 228 -186 -186 211
2248 211 112 -278 -48 269 -37 -267 118 239 -191 -182 248 113 -269 -35 286 -52 -272 114 235 -181 -194
2269 -194 232 116 -256 -44 269 -37 -256 94 215 -162 -177 194 107 -236 -57 231 -29 -243 91 184 -160
2290 -160 -147 183 89 -224 -25 216 -58 -207 126 167 -166 -106 202 47 -223 28 225 -75 -178 145 156 -190
2312 -190 -94 213 26 -232 36 218 -104 -196 152 133 -201 -98 219 21 -227 26 207 -106 -196 138 141 -185
2334 -185 -91 207 8 -225 42 201 -109 -175 155 133 -181 -70 226 6 -212 62 201 -120 -161 171 117 -200
2356 -200 -56 220 -15 -227 74 197 -137 -173 170 100 -215 -59 217 -19 -229 73 193 -131 -166 158 111
2377 111 -197 -52 204 -5 -206 57 195 -106 -148 153 106 -193 -40 201 -9 -191 58 168 -123 -129 156
$$ packed form
2227A53m02J62L58k66k74L44J84m02o2M14p5m04K06L36k83k71L74J36m14%L97
2248B11r9l90K30L17l06k30L85J21m30RM30j35l82K34L21l38k20L86J21m16j3
2269a94M26j16l72K12L13l06k19L50J21l77j5L71q7l43J79K88k60k14L34R3l44
2290a60J3L30r4l13J99K41k74j49L33M1l33O0L08j55k70K51J97l00j03L23J1l46
2312a90R6L07j87k58K68J82l22r2L48j9l34J03L17j98k48K53J81l13r0L34Ll26
2334a85R4K98j99k33K67J59l10o6L30k2l14J11K96k20k18K74J39l21m1L32n4l17
2356b00J44K76k35k12L01J23l34l6L43p0l15J56K76k36k10L02J20l24l5L24m7
2377A11l08J45K56k09k01K63J38l01m2L01m7k99J53K41k10j82K49J10k91oK85
$$ plain form
2398 156 84 -180 -28 177 -41 -179 78 144 -132 -114 148 49 -193 -20 167 -57 -181 85 138 -141 -97 171
2420 171 47 -189 2 178 -47 -165 102 130 -124 -96 170 48 -180 -5 174 -60 -158 102 123 -143 -99 151
2442 151 25 -179 8 166 -74 -155 102 104 -159 -79 160 7 -181 24 168 -89 -144 118 102 -154 -68 184
2464 184 8 -171 52 180 -87 -134 129 99 -164 -56 163 5 -177 28 155 -76 -140 101 102 -153 -70 162
2486 162 13 -174 19 155 -99 -132 119 87 -157 -61 151 1 -158 27 140 -98 -119 130 82 -155 -40 149
2508 149 -9 -160 50 132 -97 -97 132 75 -153 -11 144 -17 -147 54 128 -103 -101 122 56 -148 -31 152 -35
2531 -35 -156 64 117 -112 -94 113 42 -141 -17 136 -29 -140 60 112 -101 -93 131 51 -143 5 148 -44 -127
2554 -127 79 114 -107 -66 139 31 -147 10 146 -60 -136 84 94 -121 -75 116 25 -156 1 121 -61 -134
$$ packed form
2398A56p2k64J52K05k18j38K57O6k76J8K62r9k42J73J87k24j24K66N3k79M4K68
2420A71j24k36J91J76k25j18K67K8k54K8K66j22k28J75J79k34r8K60K1k66M4K50
2442A51j26k04J87J58k40q1K57Kk63Q0K39j53j88K05J44k57n5K62j6k56Q6K52
2464A84j76j79K23J28k67m7K63l0k63J08K19j58j82K05J27k31o4K41Jk55Q3K32
2486A62j49j87J93J36k54l3K51l2k44R6K12j50j59J85J13k38k1K49m8k37J15J89
2508A49j58j51K10Q2k29%K29n7k28J42J55j61j30K01P4k31KK23o6k04J17J83j87
2531c5j21K20N3k29J8K07p1j83J24J53j65j11K00N2k13QK24q0j94J48J43j92q3
2554a27K06L5k21M1K05j08j78J57J36k06p6K20J0k15M6J91r1j81J57J20j82p3
$$ plain form
2576 -134 76 91 -114 -74 130 24 -140 16 149 -53 -111 87 89 -113 -57 146 16 -142 15 137 -52 -104
2598 -104 92 95 -126 -55 138 2 -140 25 121 -71 -120 87 62 -122 -55 128 -8 -140 22 125 -77 -106 91
2621 91 67 -126 -47 127 3 -129 32 120 -74 -99 99 74 -116 -28 129 2 -129 40 126 -74 -89 101 64
2644 64 -116 -29 125 -13 -126 44 93 -94 -93 104 43 -117 -28 115 -33 -127 52 93 -82 -70 98 35 -119 -10
2668 -10 115 -31 -111 61 87 -85 -67 110 33 -117 -2 108 -38 -108 67 88 -88 -62 100 37 -113 4 109
2691 109 -46 -103 56 83 -96 -66 92 11 -133 -3 102 -55 -107 69 77 -96 -52 111 10 -120 21 118 -53
2714 -53 -88 83 81 -91 -43 110 15 -102 12 108 -42 -101 70 64 -102 -41 103 10 -119 23 101 -58 -93 72 57
2739 57 -95 -38 101 11 -103 13 99 -54 -95 78 67 -97 -30 110 8 -100 23 100 -52 -74 90 59 -90
$$ packed form
2576a34K10J5k05M0K04j06j64J56J33k02n8J98Kk02N6K03j30j58J57J22j89n2
2598a04J96Lk21P1J93j36j42J65R6j92m9K07k5j84O7J83j36j32J62J03k02k9J97
2621I1k4j93P9J74j24j32J61Q8j94k5J98k5j90Q8J57j27j31J69Q6k00j5J90l7
2644F4j80Q7J54j38j13J70M9j87JJ97o1j60Q9J43j48r4J79M1j75J2J68o3j54J09
2668a0J25j46q0J72K6j72J8J77p7j50J15J10j46p0J75K1j76K6J62o3j50J17J05
2691A09j55n7J59K7j79L0J58q1j44J30J05j57n2J76Qj73M4J63j01j30J41R7j71
2714e3l5J71kj72M8J53r5j17J14R6j50n9J71oj66O1J44r3j29J42P8j59l5J65j5
2739E7j52N7J39r0j14J16Q6j53m1J73j1j64O7J40j02j08J23P7j52k2J64l1j49
$$ plain form
2762 -90 -15 116 -5 -88 46 87 -53 -68 72 44 -97 -12 100 -13 -96 36 76 -58 -66 76 37 -98 -18 95
2786 95 -21 -90 49 76 -60 -59 87 40 -80 -2 106 -18 -87 51 80 -67 -53 94 31 -89 9 96 -25 -88 43
2811 43 72 -80 -54 88 15 -95 -6 89 -36 -89 52 64 -83 -53 76 24 -92 2 85 -31 -76 64 57 -74 -35
2836 -35 103 25 -75 23 90 -39 -79 61 76 -82 -35 99 20 -86 16 98 -34 -74 67 58 -82 -41 89 14 -94
2861 -94 4 86 -52 -75 68 54 -82 -33 86 3 -79 18 77 -34 -67 63 50 -68 -6 93 2 -67 32 83 -41 -50 85
2888 85 49 -74 -17 89 -4 -84 25 70 -54 -62 68 32 -80 -21 82 -3 -78 34 63 -52 -63 64 30 -82 -6
2913 -6 83 -10 -67 37 79 -50 -47 67 31 -73 6 79 -17 -74 47 58 -56 -37 66 37 -71 -3 75 -20 -63 50 56
2940 56 -61 -51 71 16 -89 8 62 -27 -71 44 52 -47 -43 72 19 -80 4 78 -28 -65 34 49 -60 -30 72 13 -67
$$ packed form
2762i0P5J31j21q3J34M1j40j5J40k8j41Q5J12j13q3J32M0j34qJ42l9j35Q0J13
2786I5j16o9J39K7j36JJ46m7j20P8J08j24o9J38K9j47J4J47o3j20R8Q7j21o3J31
2811D3K9j52K6J42p3j10Q9R5j25n3J41J2j47L0J29n2j16R4Q3j16m5J40pj31L9
2836c5J38p8j00R8O7j29m0J40J5j58M7J34p9j06J02Q2j32m0J41rj40M1J30p5j08
2861i4R8Q2j38k3J43j4j36M9J19q3q2R7N9j11l3J30j3j18O2R9r1o9R9N1j24rJ35
2888H5l6j23N7J06r3q0J09M5j24qJ30l6j12N9J03q5p5J12K9j15j1J27l4j12P6
2913fQ9r3n7J04M2j29LJ14l6j04P9P3r6n7J21J1j14J9J03k9j08O8P8r5m3J13O
2940E6j17J0J22n5j05R7N4q9m4J15Qr9MJ15n3r9Q4P4j06l7R9J5j09L0J02n9q0
$$ plain form
2967 -67 16 73 -32 -60 55 43 -63 -28 72 6 -79 9 68 -34 -62 55 39 -65 -37 62 -4 -73 7 72 -42 -59
2993 -59 40 41 -64 -29 62 4 -68 13 73 -33 -54 45 44 -57 -13 67 3 -65 20 68 -45 -54 49 33 -66 -17 57 -12 -66
3022 -66 24 48 -50 -49 39 26 -77 -12 62 -20 -59 22 50 -43 -52 46 29 -60 -8 81 -6 -56 20 64 -31 -45 55 37 -64 -10
3052 -10 62 -14 -56 25 49 -52 -52 46 23 -58 -7 54 -20 -60 27 45 -51 -41 52 5 -74 -3 62 -32 -63 36 39 -51 -29 58 12
3083 12 -62 7 54 -19 -53 39 52 -48 -27 54 20 -52 15 60 -16 -53 31 38 -61 -35 51 4 -59 7 47 -31 -60 32 20 -57
3113 -57 -30 53 7 -60 8 48 -36 -51 42 27 -55 -17 57 12 -56 23 47 -30 -41 45 31 -52 -19 54 -2 -52 18 50 -28 -50
3143 -50 45 29 -53 -20 57 -3 -57 15 46 -32 -38 41 26 -58 -17 58 -4 -45 19 47 -34 -39 42 24 -39 -7 45 -7 -44 22 47
3174 47 -26 -26 43 21 -42 -8 58 -8 -48 21 32 -42 -35 41 3 -57 -16 44 -9 -54 18 27 -36 -40 30 12 -42 -15 39 -15 -48 22
$$ packed form
2967f7Q3N7j05k8J15j2j06L5J00o6q5Q8N9j02k8J17j6j04K8R9o6o9Q0O5j14j7
2993e9R9Jj05L5R1n8p2Q1O0j06k1R9jj01M4Q0o4o8Q5M8j13rJ03j6r9M9P4o9n4
3022f6R0K4r8JQ8j3j03O5P4q2l9Q1K8r3rR8j7q9N2Q9q7n0P6M4r5j4J00j8j01N4
3052a0P2p6m2Q1K4j01%R8k3q1N1O1p4m0Q7J8r6J0R3m7p9P1O5r4l1R9Lr0K2Q7m6
3083A2p4O9M7p3l4R2J3j00K1Q1l4p2O7M5p6l7Q4Pr9K6Q6m7o3O6M0p8k9R2j2p7
3113e7K7Q3m6o7O8M0q4j5R3j5q2L8P4m5o8P9K4p7j1Q6j4q3L3P3n6n0P0L2p8k2
3143e0R5j6q2L3P7o0n4P2L1p8oP9j5q4M1P5o2m1O4K8q1nQ1j8o3L2N2n2l7O6K5
3174D7p3%O9k2o3L4O6o6m0O9J1p4PP6l8o0M1O0n3m5P2Ro3mP0j8n4K7N4n4l3P0
$$ plain form
3206 22 39 -33 -29 52 14 -49 16 58 -11 -33 36 39 -27 -18 45 21 -45 7 45 -15 -39 22 18 -48 -29 44 -4 -56 6 35 -20 -49
3238 -49 20 23 -35 -18 43 -1 -49 2 42 -17 -39 27 27 -34 -11 47 5 -32 14 41 -8 -23 38 31 -37 -11 44 10 -48 2 36 -20
3270 -20 -36 25 22 -44 -19 43 -11 -48 8 34 -29 -41 34 18 -42 -12 27 -3 -44 18 40 -24 -22 42 19 -40 1 46 4 -40 20
3301 20 34 -41 -34 30 29 -43 -15 29 -16 -46 17 28 -28 -23 21 3 -48 -6 38 -16 -42 14 28 -31 -16 36 8 -43 -2 38 -15 -32
3333 -32 26 35 -35 -10 47 21 -28 18 48 -6 -30 15 41 -22 -21 26 -2 -39 0 35 -15 -37 7 17 -32 -24 30 -7 -37 12 29 -12
3365 -12 -29 23 19 -38 -17 32 2 -30 15 33 -16 -24 34 25 -30 -12 42 10 -33 18 31 -20 -32 25 22 -30 1 33 -5 -29 6 14 -27
3398 -27 -33 22 12 -39 -19 22 -6 -35 9 21 -21 -31 29 24 -26 5 49 0 -28 16 31 -22 -13 33 27 -24 2 32 3 -28 16 31
3430 31 -20 -24 37 7 -36 -3 24 -6 -47 16 19 -30 -26 21 3 -44 -8 25 -11 -35 16 15 -26 -17 32 19 -29 9 37 -1 -31 25 24
$$ packed form
3206B2J7p2MQ1l8o3O5M2o9k2O9Lo6RO3k4o6N2L8o0k4O1mo6J9P3m8n2O2K9n5k9
3238d9O9Ln8J7O1m4m8N1M0n9k2O6%o1K3N8m2l7M6K7m9j5O1po8K6N5l4n8N0L4n6
3270b0j6O1lo6K5O2n4l7N6K6o3j2P5j6o0L0L9l0m1O2K2o4KO4k3n9M1M5m2m4O0
3301B0J4p5PO4jp2K8M4m5l0O3J1n6NM4j8n1M2M4n4k6N6J4n9J5N2k8n1M1M0n3j7
3333c2N8Rp0K5N7k6m9M6L0n4k4M5K6o3JM7k8l7L9L5n0k2M4J0m9QN4l7l0M9J7m1
3365a2j7N2mn7K1M9l0l2M5J8m9qN8rn5J8N4l2m3N1J3n1j2N7ln2L1L2l8k4L5Qm1
3398b7oN5j0n1K0M1k8k9M4J2m2j0O0nn0L1M4m9k8M4J5n3RM6on1K6L0k9l1M4J5
3430C1n1mO1l0m3L3K7l0m1O3Lm9MM7j8m7L6L3l6k4N1jm1RM9j3m8L8K8l8l0N6j
$$ plain form
3463 24 -17 -10 32 10 -24 4 27 -8 -36 10 14 -33 -25 27 -2 -30 -7 26 -20 -29 15 4 -32 -17 19 -1 -44 -1 13 -14 -22 18 7
3496 7 -26 -7 22 -4 -25 0 28 -13 -18 24 17 -25 -16 27 0 -36 9 36 -20 -26 23 2 -32 -6 20 -4 -36 8 14 -27 -36 10 -1 -36
3530 -36 -5 28 -5 -24 12 26 -8 -14 38 17 -17 8 26 -2 -15 14 26 -9 -20 20 13 -26 3 29 -2 -29 19 20 -24 -19 10 4 -36
3563 -36 -15 23 -21 -34 3 20 -20 -29 13 10 -22 5 31 -7 -25 15 28 -25 0 17 3 -25 10 29 -13 -14 23 10 -22 -17 25 8
3595 8 -14 -5 18 -12 -24 15 14 -32 -21 14 -7 -39 6 19 -24 -20 6 11 -28 -18 18 0 -27 6 19 -7 -21 17 13 -19 -1 34 3
3628 3 -21 5 31 -9 -16 20 11 -27 -7 19 -1 -32 11 13 -17 -23 13 17 -33 -10 17 -11 -25 12 16 -20 -19 17 13 -32 -9 22 -1 -26 18
3663 18 19 -13 -14 22 16 -24 -2 29 -9 -22 20 26 -13 -22 17 1 -23 -5 31 -14 -24 2 11 -29 -16 13 -2 -38 -5 12 -20 -29 1 12
3697 12 -23 -15 22 13 -31 -9 28 -8 -14 13 17 -28 -14 20 9 -6 1 20 -2 -23 10 16 -15 -7 16 0 -26 -10 12 -16 -39 5 5 -13
$$ packed form
3463B4m1PM2k2l4K8K3l5k8M6Mm7QN2k9k8K3L3m6rM4j1l6J5L6k0m3M3J4k7qM0j1
3496Gl3J9K9k6k1K5K8m1nM2pm2RM3k7l6M5K7n6oM9k1l4K6K6k4l2M4Om1rM6j1l5
3530c6L1L3l3j9L6J4l4oN2k1l4K5J8k8j3K9J2l5j1M0pl9K9K6l1k7M8Jm4NK9om0
3563c6K1L8m4j3L7J7m0rM2ll2K7K6l8j8M0J3n3K5J7j4k8L5J9m2jL7j3l2NM2j7
3595Hk2RK3l0j2L9jm6J1L5k1l2M5J3m3MK6Nl9J0L6j8k7L3J3k6j4L8ml2J8L5l1
3628Ck4K6K6m0pL6rl8K0K6k0l1M3Kl0oL6Mn0K3K7k8j4L7Ml6JL6mm5K3L1k3k5M4
3663A8Jl2jL6om0K2L1l8j3M2Ol9rL9j6k4J8L6m5j0K6Rm0J3K9j5l6L3J7l2rL0J1
3697A2l5QL7rm4K2L7l6oK7Mm5J4L4j1j5PJ9k2k1L3Ol1QK3j6k6J6K2k8k3M4%j8
$$ plain form
3731 -13 -14 -3 -4 -30 2 9 -20 -28 19 12 -26 -9 18 -2 -13 11 19 -8 -8 21 16 -12 5 18 1 -12 0 19 -20 -28 10 7 -32 -19 26
3766 26 1 -24 -5 6 -21 -20 10 8 -29 -23 19 -10 -33 6 8 -16 -20 7 13 -18 2 13 1 -24 16 23 -4 -11 19 1 -22 -8 13 -5
3800 -5 -13 12 11 -20 -12 20 0 -23 -21 22 -18 -28 8 7 -21 -18 12 1 -25 -14 15 -7 -16 9 10 -15 -4 27 -2 -29 10 26 -9 -11 24
3835 24 4 -3 -10 11 4 -13 -11 24 -4 -16 7 6 -21 -17 7 11 -21 -2 5 -22 -28 2 7 -25 -7 6 0 -25 -3 16 -16 -15 20 14 4 -7 19
3872 19 7 -8 0 22 1 -6 23 1 -11 0 16 7 -15 -1 17 -5 -21 9 1 -22 -1 18 -15 -19 -7 9 -17 -23 -1 -1 -13 -8 13 -4
3906 -4 -14 7 15 -19 -23 9 0 -18 1 22 -1 -14 9 8 -16 -15 17 1 -23 -10 17 -12 -15 5 8 -23 -16 1 -6 -26 -4 1 -17 -21 1 8 -28
3943 -28 -8 -1 7 -21 -6 4 -9 -11 11 5 -16 -4 18 -1 -13 13 20 -8 -2 18 11 -12 -12 7 -6 -17 -1 14 -10 -21 8 5 -20 -7 10
3978 10 -7 -18 1 17 -13 -20 10 6 -5 -11 18 3 -18 2 15 -4 -6 26 13 -10 -11 22 3 -17 13 14 -2 -4 15 5 -9 -7 12 -7
$$ packed form
3731a3jJ1jk6L2Pk9qM7pl8J7K7k0j1K4Qk7%K9nk8J7J3j7j3J2J9l9qL8ll9J3M5
3766B6k5k5J9J1k7JL0kl7OM2k9k3L9Kk4mK7Ol1K0J1j2k5M0Pk7pL0j8k3J4K1j8
3800eqK5jl1QL2k0k3KM3m0j0L6jk8LL0j1k6J1K9k2rK5Jk5J1L1k9k7L9J6l5kL5
3835B4k0ppK1pj7KL5k8j2K3jk7MK4Ml2J9Pk7oL0Nl2J8J3ok5K2J9l2JL5oj0j1K6
3872A9j2j5QK2k1pK9k2j2J1J6rk2J4J8k2j6L0qk3K1J9l3mJ2J6k6oK2%j2NK1j7
3906dj0K1Ql4mL2rj8J9K1k3j3K3jk4JL2j6k4J3K7k9lK0Ll1PJ7pk0K2Nj8mK2Pl6
3943b8K0PQk8J5J0j3kK2ok1J2K2j9j2K6Pk8OK0pk3%J9j3j1J6J5k4j1K9lk5J3J7
3978A0j7j1J9J6l0pL0mj1oK9j5k1K0J3j9kL2j3k3jL3j9k0L0Jj6kJ9j0j4KJ9j9
$$ plain form
4012 -7 -20 4 3 -16 -22 -3 5 -24 -4 12 -10 -31 -1 4 -19 -12 12 0 -14 -17 8 -14 -12 8 12 -9 -10 11 -2 -8 -4 10 0 -13 -3 9
4048 9 -5 -9 8 -6 -28 -3 -2 -15 -28 -5 0 -13 -14 3 -8 -25 -7 3 -18 -19 6 6 -23 -15 13 -10 -14 5 6 -12 -17 18 20 -6 -9 7 1
4085 1 -13 4 14 -15 -14 1 7 -15 -9 11 -6 -31 -7 6 -11 -24 5 -5 -21 -8 11 3 -18 -4 8 -17 -18 3 5 -13 -14 15 5 -9
4119 -9 4 15 -6 -5 12 6 -9 -1 23 -9 -9 3 14 -16 -16 7 -3 -18 -12 7 -9 -21 -11 -1 -10 -19 -1 -17 -25 -12 -2 1 -18 -1 17 -7
4155 -7 -9 -1 -3 -9 -1 20 -13 -3 7 11 -1 1 19 1 -10 -2 11 -1 -16 -3 3 -8 -15 4 -1 -23 -7 0 -10 -16 5 3 -18 -18 -5 -6 -16 -8 3
4194 3 -13 -9 11 7 -6 -2 8 0 -21 8 12 -11 -16 7 10 1 -3 17 -1 -12 -4 8 -7 -23 4 4 -10 -14 2 -11 -16 -8 2 -15 -27 -1 14 -13
4232 -13 -8 -3 4 -19 -4 0 -5 -13 2 -4 -11 -15 13 13 -13 8 5 -13 -3 10 5 -7 -8 11 3 -4 -7 11 -15 -17 2 -6 -15 -11 3 -10 -22 9 5 -8 -16
4273 -16 4 -4 -24 -7 11 -4 -14 2 1 -6 9 15 11 -12 -3 12 6 -7 6 7 -7 4 25 5 -4 4 5 -13 -14 1 8 -8 -15 13 0 -18 -9 8
$$ packed form
4012gj3K4jj9oJ9Qk9K0J6k2k1L0Nk3PK4j2j4lK5k2KK0Mk1jK1j3oMJ4j0j3J0J2
4048Ij4mJ7j4k2K5Jj3j3K3Nj3jJ7j1j7J8J0k1jK5%k9QK8k3mJ9Jj8nL5Kk6lJ6o
4085Aj4J7J0k9JJ5Ok2OK0j7k5K4J3j7j3K9j0j6J3J9qk1J4J2k5jK1Kj8jK9j0j4
4119iJ3J1k1JJ7oj5QK4l2%J2J1l0%K3j0j5OJ9j6j2J0J0rrJ8j6qJ3J0Lj9J7J8k4
4155gkQkoQK1l3J0J0Mj2KJ8j8j1QJ3j2j5J3Oj1pJ9nk2J6Pj0oK1kk1%J3jj0QJ1
4194Cj6MK0mj3MJ0qk1K9Mk3nK3LrmK0j8j1QJ2j5j6K7%j4mJ6j3nQJ0j7j2K6J5k7
4232a3NNPk3J5MnqJ5opmK8%k6K1lj8J0J3nj2jJ9qplJ8k6kJ9qrMJ4j3j2L1mj3q
4273a6K0qk0J7J8j5j0J6jpJ5Omk3RJ5oj3J3Jj4J1K1k0rQJj8jJ5Pj6pK8j3j8RJ7
$$ plain form
4311 8 -8 -25 -4 4 -6 -7 8 -2 -17 -6 2 0 -7 7 16 -8 -4 1 0 -9 7 14 0 -9 9 1 1 1 6 -5 -10 2 -4 -3 -2 -4 3 -12 -3 3 -9 -19 -10
4354 -10 -1 5 -12 11 -2 -20 -3 1 0 -14 1 2 -5 -2 8 2 -10 1 14 1 -2 13 16 -12 -6 5 -1 -7 -7 1 -4 -25 -3 -3 -13 -16 -6 -13 -16 -9 -6
4395 -6 -7 -21 -4 -2 -13 -20 -7 2 -19 -6 3 -17 -10 3 11 -9 -6 6 14 -15 7 13 5 -8 -3 3 -5 4 9 -6 -13 -12 3 -13 -17 -13 -6 -15 -21 7 -6 -21
4437 -21 -10 4 -18 -9 1 1 -9 -8 5 5 -6 1 12 -7 -8 10 5 -14 -3 15 -11 -10 11 7 -7 -6 11 2 -9 0 9 -4 -16 -6 -9 -4 -13 -7 -10
4476 -10 -30 -7 -7 -21 -16 -11 -7 -9 -16 -4 2 -13 -9 4 3 -5 18 4 -4 10 3 2 -10 6 14 -6 -16 -9 5 -5 -16 3 -11 -18 -5 0 -6 -24 -4
4515 -4 -1 -22 -20 4 -8 -17 -7 -5 -8 -12 -2 2 -8 -10 12 -6 -2 -4 12 -1 -9 -4 8 -4 9 11 8 -9 -5 11 -2 2 7 4 -3 -12 11 -8 -11 -1 -1 -2
4557 -2 -22 -9 3 -7 -16 5 7 -11 -4 11 -8 7 14 -7 -3 2 20 7 -5 6 6 -8 -9 19 0 -1 -7 3 1 -14 5 6 -19 -10 14 3 -10
4594 -10 -6 4 -10 -22 -9 0 -12 -18 -6 1 -21 -8 5 -5 -10 -7 14 -1 1 4 12 10 5 2 3 -9 2 5 2 6 10 11 -11 -3 18 2 -7 -2 -4 -5 -12 1
$$ packed form
4311Hj6j7K1Qj0jJ5j0j5J1QkpJ4Rk4MNjrJ6Pj4rJ8q%%Nj1nJ2oJJkPj5ROj2j0R
4354a0ROj7K3j3j8J7Mjj4J5JpLJ0oj2J1J3j3lJ5Lk8OJ1oo%Qnk1K2%j0lJ0plPL
4395fjj4J7Kj1pJ3Rk1J3Rk0PJ3Qk0LJ2Qk9K2Oqj3NOqRNj5pJJ5j6mMProK8j3j5
4437b1J1J4k2RJ0%j0JJ3%j1PJ1j9jJ8nj9J1J8k6JK1mj4JJ7rj1RRj3j2J0lNrOl
4476a0k0K3%j4NNMkpJ2Oj5MJ3jqK3j4qJ4pjj2J6Qk0j0PJ4j0j1J9j4pJ3Noj8K0
4515dLk1KK4j2rJ0KlmJ0Mj0kK2j8MkJ6j3qNJ2j2J3Klj7MJ6j3MNlprK3j9lJ0%j
4557bk0J3J2j0rK1Kj8PJ5j9J5Pk1MNJ8j3j2J1%j4jK8j9joJ0kj5J9Jk5RK4j1j3
4594a0MJ0j4j2J3Rj2oJ2Pk2J3J3j0nLK1j5KLQknlJj2J1LlMMJk2QK1j6rNkjpJ3
$$ plain form
4636 1 -11 -14 -5 9 -11 -14 -5 1 -4 -16 -6 -14 -11 -16 8 -4 -8 3 9 -13 3 14 13 6 3 17 7 4 7 8 0 -2 12 5 3 7 11 7 4 -6 -10 -10 -12 2 -5
4681 -5 -13 -12 0 2 -17 -4 -1 -7 -12 3 3 2 3 19 3 -6 9 -1 2 -5 15 3 1 7 15 9 -8 -1 4 0 -5 6 6 -4 1 6 -5 -12 0 -11 -19 0 1 -2
4725 -2 -17 -5 8 -2 -9 6 13 -14 -3 2 4 -2 -4 4 -19 -15 7 8 6 -10 8 1 -6 0 5 2 -9 0 -6 -18 -8 3 -7 -2 -3 -4 -16 -13 2 -2 -16 -4
4767 -4 -5 -11 -12 -1 9 -10 3 14 1 3 6 8 -8 -3 10 15 3 -7 13 6 -13 -1 13 1 -3 7 8 -3 3 6 6 -13 -7 -4 -4 -8 -5 0 -5 -9 -3 3 -15
4810 -15 -2 5 -9 -15 -4 8 2 -9 7 9 -2 -3 5 4 7 -3 14 7 6 21 12 -8 -4 -6 2 -8 1 11 -9 -9 -4 3 -11 -11 -9 -18 -6 2 -3 -9 -21 -4
4852 -4 -10 -28 0 -4 -11 -10 -1 1 -8 -7 6 5 -4 -4 9 -9 13 2 8 -5 3 5 12 0 -8 10 -2 -3 5 5 -11 -13 -3 4 -8 -8 0 -16 -12 -6 -4 -12 -7 9 1
4897 1 -13 2 -4 1 6 10 9 6 0 1 3 8 8 17 2 -6 6 1 -4 3 13 -4 -14 -8 -3 -8 -3 1 2 -9 -11 -6 -11 -14 -1 -7 -6 -12 -2 1 -12 0 7 -6 -9 10 2
4944 2 1 3 2 12 -7 -6 5 0 8 -5 4 -4 -1 -1 8 -4 -5 -5 -9 -17 -14 -1 -17 -16 2 -10 -22 -5 5 -7 0 2 1 -8 -10 -3 -1 -8 -1 -3 -10 0 13 1 -3
$$ packed form
4636Aj2lRJ4k0lROnj2J0qLnK4j2mJ1Ok2J6J1jplJ4j0lLJqkJ4pkMMmlj0m%kJ4p
4681eqJJ2Kj9J3LonJ5%jJJ6j6rJ5j0LpK0j2kOQoj7PNmnJ1%j0NNj1pJ2j1qJ9Jl
4725bj5J2J3j0pJ5Pk7J1NKokQk3MK2Jkj6J8ppONlj1Roj2J0J1j0Njjj2LJ5mj4J2
4767djojJ1J0j9J3J1j3KLKj6NJ3Nj2j0K0pj9J2J4j2mJ0Jj1OL%j9OL%mLNnmOOj8
4810a5J3Pj4oJ1J2oj1J6Kj1jQjLj0J7pjJ5rk0MkQj0RJ0k0%NPj4%KrJ2Qnoj2J7
4852doj8K8mpJRKrJJ3jr%J3j8K2j1Oj3QKPj2qJ8j2jQ%j6kJ0Pj2%Qj6MOKqNJ6q
4897Aj4J5oNNMjloJKN%Rj5qJ2nnPJ0j7j0ONnNMJj1kNnlJ3oJoJ0Lj3J2Pj3lJ9q
4944BjKjJ0j9JJ1nQj3RqL%Rj2j%mqLJ3j6JJ8j2j2J7J0j2PKjrkPKpPkpJ0J3j2m
$$ plain form
4989 -3 -3 1 -6 4 4 7 -3 -8 7 6 -2 -7 -1 -3 -13 -4 3 -10 -18 -9 -8 -10 -14 -2 -4 -4 -10 -7 -8 -7 -5 -11 -5 -11 -6 -9 -4 -5 4 4 -13 3 10 3 5 6 -2 1 9 -1 10
5040 10 7 6 1 -7 -3 0 -17 -13 -10 -9 -15 -11 -4 -7 -12 -10 -7 -3 -15 -8 -2 -1 -4 -3 5 -7 -6 4 10 2 7 11 15 6 9 -3 0 11 13 2 -5 7 10 7 3 2 7 -8 -9 6
5090 6 9 -3 1 -5 -17 -9 -6 -6 -19 -8 -3 -9 -4 3 0 -9 9 -3 3 -6 11 5 -3 1 6 6 -1 4 5 8 -9 -8 2 -2 -4 -5 0 -9 -7 1 -7 -5 1 1 -2 -19 -15 -4 -12 -13
5140 -13 -1 -17 -4 2 9 -2 -4 6 10 -2 -8 16 5 -6 4 3 3 2 -3 13 6 11 19 4 -6 6 1 -3 2 -8 2 -1 3 9 1 -4 0 -2 -12 -12 -11 -3 -9
5183 -9 2 -5 5 5 -4 2 3 13 15 11 2 9 12 15 8 8 11 3 5 15 6 -1 14 -1 -2 2 9 -5 -2 -4 -2 -2 -5 6 -12 2 -2 -6 4 -14 -5 -2 -11 -7 -4 -5 12 4
5231 4 1 9 -11 9 8 12 1 6 14 10 7 8 13 6 1 -2 8 -3 3 -1 -5 -9 -4 -7 -19 -19 1 -6 -10 -4 -1 -5 -5 -2 -6 0 -7 -10 2 -8 -6 7 3 0 11 11 2 -7 9
5280 9 5 5 9 10 3 4 8 6 9 -2 -1 1 -10 -6 6 -5 -12 3 -14 -10 -8 -2 -1 -5 2 -1 -11 -10 -1 -1 -3 -8 2 1 3 5 -2 9 5 0 13 5 4 13 1 -4 6 11 9
5329 9 -6 2 -7 4 10 11 1 -2 -6 -3 -19 -12 -4 -8 0 -2 -6 -4 -15 -5 -6 -13 -3 2 -6 2 -10 4 2 -8 13 10 2 10 14 10 7 15 7 -2 8 5 12 -5 -3 0 0 4
$$ packed form
4989c%MpJ0%Lj0nJ5jqnOkj0RPj3qRJkmJ2k%oLjJKoOoNlNjR%j7J6PpKJqLQj0J1
5040A0ljnqMLj7MLJoMPlnKLMj2POJlJQj2JJ0OqNMMrLj2LJ1Kj1pJ2LlmjNj5jJ5
5090FLj2Moj2QL%j3J1NoNPlrJ8j2OrJ7oqMN%pNJLj7JJ0mkjNrKQqKO%lj7MJ1qj
5140a3J2j6J3OPj1kJ0Mj2oK4j1j1J0j%jnJ6pNQj5j0J2nmNj0J0lMOqnMkj0%JQo
5183iJ1pJ0%rOJJ0KmrPLLp%LqKJ0rpJ5j5jMPj4LkK%lJ1j8J4mmJ0j8RLrMLjJ7q
5231DlQk0K0jMj1NQmlJNpnlJ0j1OmmmNlj2%K0pmOLm%LmOplJ2j0KJ3mlJ1%rrJ6
5280Im%MJpJMkLj1JKj1MJ2j1pJ5j7MKOJmPlj0JR%knJ0jKKpJ1mnJ3qjRj2nJ0Nk
5329Ij5QrJ1OJj0lmLj6PQmQkmKj1J0jpJ0NqQj2J4kj0K1lqQMmlQqrJ0lPj7KL%M
$$ plain form
5377 4 -2 0 -10 -7 -4 -12 4 -9 7 -8 -2 1 8 3 -7 -6 -3 1 -6 7 -6 -9 -6 5 -1 5 10 12 6 4 5 6 1 9 7 5 -1 4 -3 -9 -13 4 -8 -15 -1 -6 -2 -23
5425 -23 -6 3 -14 -13 3 -9 -10 -14 -1 2 1 3 1 -10 -3 6 3 0 6 5 3 6 5 4 14 -2 -1 0 -3 -6 -3 4 5 11 0 -2 -9 -7 -3 -12 0 -10 -2 -11 -10 -2 -7 -1 0
5474 0 -9 -3 -4 7 -11 7 -6 -12 1 -2 3 -6 7 -9 2 -2 -2 9 7 5 4 7 0 -5 -6 -6 4 -3 -11 -4 -1 0 -5 -3 -12 1 -8 0 2 -20 -8 -6 -3 -4 -2 -2 2 -3
5522 -3 8 1 6 0 -4 2 3 2 2 13 11 14 2 7 8 11 10 5 -4 -2 -7 -1 -5 -2 -3 -11 -10 -6 -4 -7 -6 -7 -1 -5 -11 1 -5 -11 2 3 -7 -4 7 8 -1 15 11 5 -3 6 3 6 3
5575 3 -2 8 -6 -1 1 -7 2 -6 -4 -2 -7 -3 -10 -10 -9 -9 3 -10 -2 -19 -10 -1 -11 -4 -12 6 9 0 -1 7 4 6 4 14 6 7 8 5 3 -3 -6 -2 1 -2 11 2 8 5 3 5 -4 2
5627 2 -2 -5 5 -8 -8 -4 -12 -13 0 -6 1 -2 -1 7 5 -8 4 7 7 7 -8 2 15 7 7 14 9 -4 10 13 7 12 -1 7 -3 2 3 9 0 3 2 -13 3 1 -2 -11 -3
5674 -3 -3 5 -11 -6 0 -13 2 4 1 0 -4 3 5 -1 -1 13 7 6 10 8 5 9 13 8 10 12 1 -5 -5 6 1 -9 -2 4 -8 -2 -6 -1 -3 1 0 -4 -9 -12 4 -4 -4 -1 11 -2
$$ packed form
5377DoKj0LLqJ6j3J6j5OLPnj0JLMpJ3j3lLJ1oONKokJJnQkkoNpomJ7j2pJ4nMk1
5425b3J7Rj7JJ6j2jmJ3LjKkj1PRllOjkLjjJ0j6JJllLPJOj1kpKMrJ2j0QrJQnOJ
5474@rOjJ1j8J8j3oJ3lNrJ3j6J1m%J1kkjLpnj%J0pqPLJnKrJ3rQKk2J2KLjK%Mn
5522cJ1pNomOJj%J1kLj2NJLjnrKnOmLjqJMKlJjOmoJ2ooJ3Jj0LJ1JrJ6moqRlLl
5575CnJ0j4NKqRqKKnMp%J%J2j3Qj7RRj0PqJ8LrjQlKkJ0qJJlkolMLlJ3rOlkKrO
5627BmlJ0j3%MqjJ3oPlJQkj3J2L%%j5J0J3q%Pnj3J4LoNj3Qj0NJOrLjj5J6klrQ
5674c%Qj6NOj3J5KljmPKo%J4ojMklMMnKKj1o%J1nj0POj2OmNkMjmnlJ6q%LJ2j3
$$ [...]
8191@
##END NTUPLES=NMR FID
##END=
