##TITLE=1H_ES-AN-IPC-st
 
 8 sc, 
 21.1.2022
##JCAMPDX= 6.0         $$ Bruker NMR JCAMP-DX V2.0
##DATA TYPE= NMR FID
##DATA CLASS= NTUPLES
##ORIGIN= UXNMR, Bruker Analytische Messtechnik GmbH
##OWNER= root
$$ XWIN-NMR		Version 3.5
$$ Fri Jan 21 12:45:53 2022 Russian Standard Time (UT+4h)  she@DPX200
##.OBSERVE FREQUENCY= 200.131346
##.OBSERVE NUCLEUS= ^1H
##.DELAY= (6, 6)
##.ACQUISITION MODE= SIMULTANEOUS
##.ACQUISITION SCHEME= undefined
##.AVERAGES= 8
##.DIGITISER RES= 18
##SPECTROMETER/DATA SYSTEM= spect
##.PULSE SEQUENCE= zg30
##.SOLVENT NAME= DMSO
##.SHIFT REFERENCE= (INTERNAL, DMSO, 0, 15.7039)
##AUDIT TRAIL= $$ (NUMBER, WHEN, WHO, WHERE, WHAT)
$$ ##TITLE= Audit trail, XWIN-NMR		Version 3.5
$$ ##JCAMPDX= 5.01
$$ ##ORIGIN= Bruker BioSpin GmbH
$$ ##OWNER= she
$$ F:/spectra/data/she/nmr/H-F/1/audita.txt
$$ ##AUDIT TRAIL=  $$ (NUMBER, WHEN, WHO, WHERE, WHAT)
(   1,<2022-01-21 12:44:44.85 +0400>,<she>,<DPX200>,
      <created by zg, POWCHK disabled, PULCHK disabled
       configuration hash MD5:
       00 E9 B6 7A A2 85 ED C7 34 08 36 98 17 FE 4E 26
       data hash MD5: 16K
       10 EE 1D 73 27 E8 95 87 C5 79 02 72 70 A9 33 86>)
$$ ##END=
$$ 
$$ hash MD5
$$ 6C 4E C4 B0 4F FE 39 45 9A 05 27 B3 45 A7 5E 93
##$RELAX= 
##$RELAX= 
##$RELAX= 
##$RELAX= 
##$RELAX= 
##$RELAX= 
$$ Bruker specific parameters
$$ --------------------------
##$DU= <F:/spectra>
##$EXPNO= 1
##$NAME= <H-F>
##$PROCNO= 1
##$TYPE= <nmr>
##$USER= <she>
##$AMP= (0..31)
100 100 100 100 100 100 100 100 100 100 100 100 100 100 100 100 100 100 
100 100 100 100 100 100 100 100 100 100 100 100 100 100 
##$AQSEQ= 0
##$AQ_mod= 1
##$AUNM= <au_zg>
##$AUTOPOS= <>
##$BF1= 200.13
##$BF2= 200.13
##$BF3= 200.13
##$BF4= 200.13
##$BF5= 200.13
##$BF6= 200.13
##$BF7= 200.13
##$BF8= 200.13
##$BYTORDA= 1
##$CFDGTYP= 0
##$CFRGTYP= 5
##$CHEMSTR= <none>
##$CNST= (0..31)
1 1 145 1 1 1 1 1 1 1 1 1 1 1 1 1 1 1 1 1 1 1 1 1 1 1 1 1 1 1 1 1 
##$CPDPRG= <>
##$CPDPRG1= <>
##$CPDPRG2= <>
##$CPDPRG3= <>
##$CPDPRG4= <mlev>
##$CPDPRG5= <mlev>
##$CPDPRG6= <mlev>
##$CPDPRG7= <mlev>
##$CPDPRG8= <mlev>
##$CPDPRGB= <>
##$CPDPRGT= <>
##$D= (0..31)
0 1.2 0 0 0 0 0 0 0 0.06 0 0.03 0 0 0 0 0.0002 0 0 0 0 0 0 0 0 0 0 0 0 
0 0 0 
##$DATE= 1642754684
##$DBL= (0..7)
120 120 120 120 120 120 120 120 
##$DBP= (0..7)
150 150 150 150 150 150 150 150 
##$DBP07= 0
##$DBPNAM0= <>
##$DBPNAM1= <>
##$DBPNAM2= <>
##$DBPNAM3= <>
##$DBPNAM4= <>
##$DBPNAM5= <>
##$DBPNAM6= <>
##$DBPNAM7= <>
##$DBPOAL= (0..7)
0.5 0.5 0.5 0.5 0.5 0.5 0.5 0.5 
##$DBPOFFS= (0..7)
0 0 0 0 0 0 0 0 
##$DE= 6
##$DECBNUC= <off>
##$DECIM= 32
##$DECNUC= <off>
##$DECSTAT= 4
##$DIGMOD= 1
##$DIGTYP= 9
##$DL= (0..7)
0 120 120 120 120 120 120 120 
##$DP= (0..7)
150 150 150 150 150 150 150 150 
##$DP07= 0
##$DPNAME0= <>
##$DPNAME1= <>
##$DPNAME2= <>
##$DPNAME3= <>
##$DPNAME4= <>
##$DPNAME5= <>
##$DPNAME6= <>
##$DPNAME7= <>
##$DPOAL= (0..7)
0.5 0.5 0.5 0.5 0.5 0.5 0.5 0.5 
##$DPOFFS= (0..7)
0 0 0 0 0 0 0 0 
##$DQDMODE= 0
##$DR= 18
##$DS= 0
##$DSLIST= <SSSSSSSSSSSSSSS>
$$ [...]
##$SUBNAM2= <"">
##$SUBNAM3= <"">
##$SUBNAM4= <"">
##$SUBNAM5= <"">
##$SUBNAM6= <"">
##$SUBNAM7= <"">
##$SUBNAM8= <"">
##$SUBNAM9= <"">
##$SW= 18.0517287032376
##$SWIBOX= (0..15)
0 0 2 0 0 0 0 0 0 0 0 0 0 0 0 0 
##$SW_h= 3612.71676300578
##$TD= 16384
##$TD0= 1
##$TE= 0
##$TE2= 300
##$TE3= 300
##$TEG= 300
##$TL= (0..7)
0 120 120 120 120 120 120 120 
##$TP= (0..7)
150 150 150 150 150 150 150 150 
##$TP07= 0
##$TPNAME0= <>
##$TPNAME1= <>
##$TPNAME2= <>
##$TPNAME3= <>
##$TPNAME4= <>
##$TPNAME5= <>
##$TPNAME6= <>
##$TPNAME7= <>
##$TPOAL= (0..7)
0.5 0.5 0.5 0.5 0.5 0.5 0.5 0.5 
##$TPOFFS= (0..7)
0 0 0 0 0 0 0 0 
##$TUNHIN= 0
##$TUNHOUT= 0
##$TUNXOUT= 0
##$USERA1= <user>
##$USERA2= <user>
##$USERA3= <user>
##$USERA4= <user>
##$USERA5= <user>
##$V9= 5
##$VALIST= <valist>
##$VCLIST= <CCCCCCCCCCCCCCC>
##$VD= 0
##$VDLIST= <DDDDDDDDDDDDDDD>
##$VPLIST= <PPPPPPPPPPPPPPP>
##$VTLIST= <TTTTTTTTTTTTTTT>
##$WBST= 1024
##$WBSW= 4
##$XGAIN= (0..3)
0 0 0 0 
##$XL= 0
##$YL= 0
##$YMAX_a= 261744
##$YMIN_a= -263964
##$ZGOPTNS= <>
##$ZL1= 120
##$ZL2= 120
##$ZL3= 120
##$ZL4= 120
##$ABSF1= 10
##$ABSF2= 0
##$ABSG= 5
##$ABSL= 3
##$ALPHA= 0
##$AQORDER= 0
##$ASSFAC= 0
##$ASSFACI= 0
##$ASSFACX= 0
##$ASSWID= 0
##$AUNMP= <proc_1d>
##$AZFE= 0.1
##$AZFW= 0.1
##$BCFW= 1
##$BC_mod= 2
##$BYTORDP= 1
##$COROFFS= 0
##$CY= 11.3945322036743
##$DATMOD= 1
##$DC= 2
##$DFILT= <>
##$DTYPP= 0
##$F1P= 2.36226072786647
##$F2P= -0.459571619588291
##$FCOR= 0.5
##$FTSIZE= 0
##$FT_mod= 4
##$GAMMA= 1
##$GB= 0.15
##$INTBC= 1
##$INTSCL= 1
##$ISEN= 128
##$LB= 0.24
##$LEV0= 0
##$LPBIN= 0
##$MAXI= 10000
##$MC2= 0
##$MEAN= 0
##$ME_mod= 0
##$MI= 1.114404
##$NCOEF= 0
##$NC_proc= 0
##$NLEV= 6
##$NOISF1= 3.799351
##$NOISF2= 2.8
##$NSP= 1
##$NTH_PI= 0
##$NZP= 0
##$OFFSET= 15.70392
##$PC= 1
##$PHC0= -15936
##$PHC1= -4.799225
##$PH_mod= 1
##$PKNL= yes
##$PPARMOD= 0
##$PSCAL= 0
##$PSIGN= 0
##$REVERSE= no
##$SF= 200.130013532006
##$SI= 16384
##$SIGF1= 3
##$SIGF2= 2
##$SINO= 400
##$SIOLD= 16384
##$SREGLST= <1H.CDCl3>
##$SSB= 0
##$STSI= 0
##$STSR= 0
##$SW_p= 3612.71676300578
##$SYMM= 0
##$S_DEV= 0
##$TDeff= 0
##$TDoff= 0
##$TI= <>
##$TILT= no
##$TM1= 0
##$TM2= 0
##$TOPLEV= 0
##$USERP1= <user>
##$USERP2= <user>
##$USERP3= <user>
##$USERP4= <user>
##$USERP5= <user>
##$WDW= 1
##$XDIM= 8192
##$YMAX_p= 0
##$YMIN_p= 0
$$ End of Bruker specific parameters
$$ ---------------------------------
##NTUPLES= NMR FID
##VAR_NAME=  TIME,          FID/REAL,        FID/IMAG
##SYMBOL=    X,             R,               I
##VAR_TYPE=  INDEPENDENT,   DEPENDENT,       DEPENDENT
##VAR_FORM=  AFFN,          ASDF,            ASDF
##VAR_DIM=   8192,          8192,            8192
##UNITS=     SECONDS,       ARBITRARY UNITS, ARBITRARY UNITS
##FACTOR=    0.0002768,     1,               1
##FIRST=     0,             0,               0
##LAST=      2.2672688,     0,               0
##MIN=       0,             -263964,         0
##MAX=       2.2672688,     261744,          0
$$ Real data points
##PAGE= N=1
##DATA TABLE= (X++(R..R)), XYDATA
$$ [...]
717i714K8005l9680L0138P69k6642L3328k9977J8040Q465l4443L7115k0392J762
730c226J6784l4487L5150j2820j2875K6231l0801K6279n262k2030L3789k6986
742a0254J3300M793k6137L5600k3053P68J6552k7889L0758j6752q601K6396k8912
755a3431K1895o881j5198L1117k8394J2392N153k0695L0132k4192L937J5878k5333
768a3620K5331j5742l627K2400k7636J9248n037j1035K4492k6009J2941M944j7936
781a1286K3702k0275N962J2225k2598K1383j2261j811J6668k3680J7883m241r495
794g824J9228k1362J2790K680j5662K0374j6751O060Q392j9068J9694j1203j239
807c891J3086j9693J6798n416p783J6536j8137J1854M10j2574J8083j4992N698
$$ plain form
717 -9714 18291 -21389 8749 9518 -17124 16204 -13773 4267 12732 -21711 15404 -4988 -3226
730 -3226 13558 -20929 14221 1401 -11474 14757 -16044 10235 4973 -17057 16732 -10254
742 -10254 3046 7839 -18298 17302 -5751 -4983 11569 -16320 14438 -2314 -10915 15481 -13431
755 -13431 8464 1583 -13615 17502 -10892 1500 6653 -14042 16090 -8102 -4165 11713 -13620
768 -13620 11711 -4031 -7658 14742 -12894 6354 1317 -9718 14774 -11235 1706 6650 -11286
781 -11286 12416 -7859 -1897 10328 -12270 9113 -3148 -4959 11709 -11971 5912 1671 -7824
794 -7824 11404 -9958 2832 5512 -10150 10224 -6527 -467 7925 -11143 8551 -2652 -3891
807 -3891 9195 -10498 6300 884 -6899 9637 -8500 3354 3764 -8810 9273 -5719 -21
820b1N964j5197J7151j0679l56J0515j5833J4119n679n412J3409j4840R715l74
834B482r149J4214j2322M832M390j1368J3109q702L06P858j2056J0729m606l562
848c845R897j1410P641n68o559J0536r568M194K928q437R954o928Q05N527r136
863d969Q457l963k171P140q709O255j021m503P773p392L663J605n950P391n387
878a781J038L551o320O114l133j134M637n819M315r81k626M834m666K394P72l349
894b154M246l163P17J836l321L202j683m57K223k807K058m96j097K041j962J001
910A84K52j186J473j093K99M76q69P81l94k3K85l11J60k4M6k08L25k68n2N40r03
931e10Q60l00n49J286j503R78J29j333K049j847P06R05k268K670j777n3K009l168
$$ plain form
820 -21 5943 -9254 7897 -2782 -3138 7377 -8456 5663 -16 -5428 7981 -6859 2856 2482
834 2482 -6667 7547 -4775 57 4447 -6921 6188 -2514 -2208 5650 -6406 4323 -283 -3845
848 -3845 6052 -5358 2283 1715 -4844 5692 -3876 318 3246 -5191 4763 -2165 -1360 4167 -4969
863 -4969 3488 -475 -2646 4494 -4215 2040 1019 -3484 4289 -3103 560 2165 -3785 3606 -1781
878 -1781 -743 2808 -3512 2602 -531 -1665 2972 -2847 1468 487 -2139 2695 -1971 423 1195 -2154
894 -2154 2092 -1071 -354 1482 -1839 1363 -320 -777 1446 -1361 697 201 -896 1145 -817 184
910 184 436 -750 723 -370 -71 405 -464 317 -77 -100 185 -126 34 10 56 -152 173 -95 -147 393 -510
931 -510 350 50 -499 787 -716 262 391 -942 1107 -740 -34 871 -1397 1273 -504 -557 1452 -1716
949a716K878j161j259L233l761K529k8k628M179l805J602J460l992M754l286J83
965h18L155n140M774k117j658M789n770M052l71l606O020n680K652J723n445O718
981C278m865O81L979o902O656l276j743O074p660N683r97m245P630p513L845J691
997B316o547Q439o406J324M479q292Q279m376j655O988r124P026j590m662Q816
1012E015q910M839J553p317R740p632J913M789r332R576n347j453P689j0386Q242
1027B979k274m833R821j0302N961J235p926J1030r086K840M865j0370J1087o682
1041a655q72Q181j1786R861l342m730J0718j1843P416N86q312J2168j0511L979
1055a42M610j1128J2344p812k30Q265j2645J1048m134m597J1051j2561Q349rq454
$$ plain form
949 -1716 1162 1 -1258 1975 -1786 743 715 -1913 2266 -1539 63 1523 -2469 2285 -1001 -818
965 -818 2337 -2803 1971 -146 -1804 2985 -2785 1267 896 -2710 3310 -2370 282 2005 -3440 3278
981 3278 -1587 -906 3073 -3829 2827 -449 -2192 3882 -3778 1905 908 -3337 4293 -3220 625 2316
997 2316 -4231 4208 -2198 -874 3605 -4687 3592 -784 -2439 4549 -4575 2451 861 -3801 5015
1012 5015 -3895 944 2497 -4820 4920 -2712 -799 3990 -5342 4234 -1113 -2566 5123 -5263 2979
1027 2979 705 -4128 5693 -4609 1352 2587 -5339 5691 -3395 -555 4310 -6060 5027 -1655
1041 -1655 -2527 5654 -6132 3729 387 -4343 6375 -5468 1948 2534 -5778 6390 -4121 -142
1055 -142 4468 -6660 5684 -2128 -2358 5907 -6738 4310 176 -4421 6630 -5931 2418 2409 -6045
1070f045J2765j1116M572M163j1303J3112q510P6Q143j2832J1826m995m392J1399
1084F863j3028R056r02q226J3540j2099N198L670j1194J4051r980Q07Q273j3235
1098g206J2725o514l486J1988j4199R951j857p427J4077j3755O332L432j1024
1111f963J4318j1422K257Q236j3835J2950p161k129J1554j5174J0643j861o789
1124e376J3210j4309P595L251j1243J3642j1159L532P263j4376J3265o617j626
1137b948J0075j5173J1966k119p172J2365j3628R017J744j1754J4338j0702M046
1150E5N351j4117J5115p505j955R230j4226J3584m425p278J3250j3145R382o97
1164B619j0706J6050j1747L579M349j2252J5960r878j823R982j2950J2729o545
$$ plain form
1070 -6045 6720 -4396 176 4339 -6964 6148 -2362 -2286 5857 -6975 4851 -144 -4536 6863
1084 6863 -6165 2891 1989 -6237 7303 -4796 402 4072 -7122 6929 -3051 -2244 6029 -7206
1098 -7206 5519 -995 -4481 7507 -6692 3259 1402 -6025 8052 -5703 629 4061 -6963
1111 -6963 7355 -4067 -1810 6426 -7409 5541 -1620 -3749 7805 -7369 3274 1413 -5376
1124 -5376 7834 -6475 1120 4371 -6872 6770 -4389 -857 6406 -7970 5295 -1322 -2948
1137 -2948 7127 -8046 3920 1801 -5371 6994 -6634 2383 4127 -7627 6711 -3991 55
1150 55 5406 -8711 6404 -1101 -3056 6174 -8052 5532 1107 -6171 7079 -6066 3316 2619
1164 2619 -8087 7963 -3784 -205 4144 -8108 7852 -2026 -3849 6133 -6817 5912 -633
1177f33n523J4296j3628P908j087q025J5576j3526L433N457j0549J3762j1143
1190c682J54J0746j3375J0588o014k788J3111j5256P906M59o720J2929j4385N825
1204e02N969j1517J1925j0284K954R048j5199J1355m576j827J0224j5806J0812
1217B576M12p900J1240j3010Q477L572j2903J2810q522L358N715j4650J3834m657
1231C52l289Q385j3155J2304k049q820J1869j0400P539N40j1324J4386q226J195
1245f93M410j1202J3952o720m033R254j0467J0327m347o845J3075j0392N224O
1259A549p996J3969j0337R11N595r153J1817q661j708J0226j1050Q400m461l670
1273d569J2199j2478N450J210o352J1521j1631L356O081r745R797p980J041Q633
$$ plain form
1177 -633 -6156 8140 -5488 2420 1333 -6692 8884 -4642 -1209 4248 -6301 7461 -3682
1190 -3682 -3528 7218 -6157 4431 -1583 -4371 8740 -6516 1390 1849 -4871 8058 -6327 -502
1204 -502 5467 -6050 5875 -4409 -1455 7593 -7606 3749 -827 -2654 7570 -8236 2576
1217 2576 2988 -4912 6328 -6682 1795 5367 -7536 5274 -3248 110 5825 -8825 5009 352
1231 352 -2937 5448 -7707 4597 2548 -6272 5597 -4803 2736 3276 -8048 6338 -1888 -693
1245 -693 3717 -7485 6467 -253 -4286 4968 -5499 4828 481 -6364 6711 -3681 1543 1549
1259 1549 -6447 7522 -2815 -1904 3691 -5462 6355 -2306 -4014 6212 -4838 3562 -899 -4569
1273 -4569 7630 -4848 602 1812 -4540 6981 -4650 -1294 4787 -4958 4839 -3141 -2100 6533
1287F533j2328Q411k879k560R240j2378P134J614o909R220r725M921M355j0235
1301e586R366n802J139N895j1233R251k363l396P338r985P720J25p140Q978p696
1316c389M418K198q965R999n550K60M610r069R457l782l371P331q430P068j648
1331A137n711R340p673L665J294o889R668o641M73M565p587Q267m736k016P154
1346D310q011N913j822l902Q234p747L402J503n554P867o410J168M263o866O681
1361C029m056r45N921p472N197j197l077O524o978L578J346n002O485n488J703
1376d32L252o291O067l458m86M576o649N226j374k651N435o067L783N37m373N868
1392B963m857J849K203n338N712l357k59L650n527M811j677k106M644n060L295
$$ plain form
1287 6533 -5795 2616 -263 -2823 6417 -5961 1173 2787 -4122 5098 -4627 294 4649 -5586
1301 -5586 3780 -2022 -883 5012 -6221 3030 667 -2729 4609 -5376 2344 2469 -4671 4307 -3389
1316 -3389 1029 3227 -5738 4261 -1289 -1029 3581 -5488 3969 187 -3184 4147 -4283 2785 1137
1331 1137 -4574 4766 -2907 758 2052 -4837 4831 -1810 -1337 3228 -4359 3908 -828 -2844 4310
1346 4310 -3701 2212 390 -3512 4722 -3025 377 1880 -3674 4193 -2217 -1049 3214 -3652 3029
1361 3029 -1027 -1972 3949 -3523 1674 477 -2600 3924 -3054 524 1870 -3132 3353 -2135 -432
1376 -432 2820 -3471 2596 -862 -1348 3228 -3421 1805 431 -2220 3215 -2852 931 1468 -2905 2963
1392 2963 -1894 -45 2158 -3180 2532 -825 -1084 2566 -2961 1850 173 -1933 2711 -2349 946
1407I46M8l398M982m154J545J657m143M680k928j23K937m338L801j488j534L720
1423B210m080K606k0k566L931l417J334J261l202L682k464R9K234l458L095j342
1439i7r90K834l316K252k04j857L041k819J302P71k418K897k077L32J531k626
1455a444K462j176n78K005k470J776k99j240K151k039J001M32j616K000j432K41
1471b26R86j698J598p71l67J271j526J072j82p25J265j176N59K53r03J100p88
1488b58J48N15q84Q17l97j61N86o88M80r2k86N02m83K40P1k73L13k26L9J13j57
1509h1J00j0k9J3O0j13P9N5k23L09k38K1K58m53M45k01j85N28o56M78k9m83Q05
1532D50p77L61K85q38J022p28M6O98j158J092m89l74J095j342R64r5q73J465j386
$$ plain form
1407 946 994 -2404 2578 -1576 -31 1626 -2517 2163 -765 -888 2049 -2289 1512 24 -1510 2210
1423 2210 -1870 736 716 -1850 2081 -1336 -2 1259 -1943 1739 -725 -626 1608 -1850 1245 -97
1439 -97 -1087 1747 -1569 683 479 -1378 1663 -1156 146 917 -1501 1396 -681 -349 1182 -1444
1455 -1444 1018 -158 -736 1269 -1201 575 276 -964 1187 -852 149 581 -1035 965 -467 -226
1471 -226 760 -938 660 -111 -478 793 -733 339 157 -568 697 -479 80 333 -570 530 -258
1488 -258 -110 405 -479 338 -59 -220 366 -322 158 66 -220 282 -201 39 110 -163 150 -76 -37 76 -81
1509 -81 19 9 -20 -7 53 -60 19 74 -149 160 -78 -57 201 -252 193 -8 -193 335 -321 157 128 -355 450
1532 450 -327 34 319 -519 503 -225 -179 519 -639 453 -36 -410 685 -657 307 212 -661 804 -582
1551e82O47M37j357J673j199J38J028j750J675p96m89J593j994J479k52j166K071
1568A156k014J003N14j825K308j711L16J263k315K293j178n05J986k572J968m29
1584B58j358K544k546J338N24k178K839k176M81J460k744K761j496m90K294l046
1600a535K379n98j496K950l035J694M52k416L285k629P24J544l110L253j899l73
1616h10K519l525K888r08j506L277l559K155K79k572L707l161J104J522l443L742
1632A709k332j57K630l903L316j172j488L479l923K514J53k726L991l441J328
1647b2J483l648M037k528q6K673m131L662j382j509L622m123K795o2k788M243
1663B236l693J542J308l716M416k906Q2K626m232M039j844j347L793m394L133
$$ plain form
1551 -582 65 502 -855 818 -381 -243 785 -965 710 -86 -575 1018 -976 503 251 -915 1156
1568 1156 -858 145 659 -1166 1142 -569 -253 1010 -1305 988 -190 -695 1291 -1281 687 258
1584 258 -1100 1444 -1102 236 760 -1418 1421 -755 -274 1186 -1558 1203 -293 -783 1511 -1535
1600 -1535 844 246 -1250 1700 -1335 359 811 -1605 1680 -949 -225 1319 -1791 1462 -437 -810
1616 -810 1709 -1816 1072 164 -1342 1935 -1624 531 810 -1762 1945 -1216 -112 1410 -2033 1709
1632 1709 -623 -780 1850 -2053 1263 91 -1397 2082 -1841 673 826 -1900 2091 -1350 -22
1647 -22 1461 -2187 1850 -678 -764 1909 -2222 1440 58 -1451 2171 -1952 843 781 -2007 2236
1663 2236 -1457 85 1393 -2323 2093 -813 -731 1895 -2337 1702 -142 -1489 2304 -2090 1043
1678A043m87k610M556m161J839J101l607M701l497M25K674m335M222k294r73L909
1694B506m716L277o45k313M537m558K106J143l536M532l693Q13K654m508M137
1709A736k259o20L672m984L506n36k223M202m649K579J034l726M430l620J289
1724a69K232m759M498k249m54L184n016M186r11k316M054m489L167K86l813M848
1740B279l593J434J509m500N127k675n83K936m513M509j704k266M370m214K959
1755A075l53l283N211l854J057J414l752N035l285n57L301m105L929k118j649
1770a934M623m456K430k40k464M917m478J188J852l404M325l668K80L451m494
1785b072L462j948p14M120n148K823J27k178M063m747K237J770l845L919l333
$$ plain form
1678 1043 556 -2054 2502 -1659 180 1281 -2326 2375 -1122 -697 1977 -2358 1864 -430 -1403 2506
1694 2506 -2210 1067 422 -1891 2646 -1912 194 1337 -2199 2333 -1360 -547 2107 -2401 1736
1709 1736 -523 -1143 2529 -2455 1051 515 -1708 2494 -2155 424 1458 -2268 2162 -1458 -169
1724 -169 2063 -2696 1802 -447 -901 2283 -2733 1453 542 -1774 2280 -2209 958 1244 -2569 2279
1740 2279 -1314 120 1629 -2871 2256 -419 -1002 1934 -2579 1930 226 -2040 2330 -1884 1075
1755 1075 722 -2561 2650 -1204 -147 1267 -2485 2550 -735 -1292 2009 -2096 1833 -285 -1934
1770 -1934 2689 -1767 663 423 -2041 2876 -1602 -414 1438 -1966 2359 -1309 -1029 2422 -2072
1785 -2072 1390 -558 -1272 2848 -2300 523 650 -1528 2535 -2212 25 1795 -2050 1869 -1464
1800a464J185K659m994L894j494n93L106n009L694rk608L568l989K739R35m099
1816b479M177k614R37J696m510M477j523j209K712l989L820p43k823L891l229
1831a409K227J07l460M653k719K81J464l443M435k359j191L098l386L232j538
1846hj954M253l555J713Nk385M417l580N30J805k947L721k901k62L214l669K692
1863A089j386j013L719m058J857M23j998L466l617J203J864l129L002k352L59
1878e71K572l878K675p78q96K783l766K279M88k250K852k888J532J263l238L038
1894A217j787L02J756l483L051q50j111K319l090K521j67k194K943k504J445N48
1910I16k734L281j937J46J426k787L016j373r63K330k646K203o11j668K931k469
$$ plain form
1800 -1464 -279 2380 -2614 1280 -214 -807 2299 -2710 984 975 -1633 1935 -2054 685 1620 -2479
1816 -2479 1698 -916 21 1717 -2793 1684 161 -1048 1664 -2325 1495 752 -2071 1820 -1409
1831 -1409 818 925 -2535 2118 -601 -320 1144 -2299 2136 -223 -1414 1684 -1702 1530 -8
1846 -8 -1962 2291 -1264 449 454 -1931 2486 -1094 -564 1241 -1706 2015 -886 -1148 2066 -1603 1089
1863 1089 -297 -1310 2409 -1649 208 631 -1367 2099 -1518 -315 1549 -1580 1422 -930 -571
1878 -571 2001 -1877 798 20 -876 1907 -1859 420 908 -1342 1510 -1378 154 1417 -1821 1217
1894 1217 -570 -268 1488 -1995 1056 206 -905 1414 -1676 845 678 -1516 1427 -1077 368 916
1910 916 -1818 1463 -474 -328 1098 -1689 1327 -46 -1009 1321 -1325 878 267 -1401 1530 -939
1926i39J161L84k064K953k111J69J461k313K457j430n85K213k487J753m92j160
1942a030K472k392J039N22j732K373j960M05J329k185K075j229k52J779k353J675
1958E36l91r37J986k193J217L32j543K047j760O30R15j955J955j125j04J349k049
1975a090J698n09p69J641j858J213Q8j297J802j482N58O36j584J728j020q4J090
1992G61j627J430n13o33J396j506R65J3j016J503j234M40N02j224J401r04j5Q79
2010F18j304J153m99m09J122j269Q40o3p31J197j099M75L41r52J128p98R9O29
2028D78j038R58m56k35Q07r99P10j12n12R00q65M16K00o91Q39o04R4M38p41P03
2048B90l38j63N60o97N12q0l68O23n87K87J28m71N66l92O0K77m59M35k08q9L32
$$ plain form
1926 -939 222 606 -1458 1495 -616 -447 1014 -1299 1158 -272 -857 1356 -1131 622 130 -1030
1942 -1030 1442 -950 89 611 -1121 1252 -708 -303 1026 -1159 916 -313 -565 1214 -1139 536
1958 536 145 -792 1194 -999 218 550 -993 1054 -706 -76 839 -1116 839 -286 -390 959 -1090
1975 -1090 608 99 -670 971 -887 326 414 -883 919 -563 -5 631 -953 775 -245 -329 761
1992 761 -866 564 51 -582 814 -692 273 286 -730 773 -461 -21 481 -743 658 -246 -261 618
2010 618 -686 467 -32 -441 681 -588 252 189 -542 655 -444 31 372 -580 548 -250 -151 478
2028 478 -560 398 -58 -293 514 -485 225 113 -399 501 -364 52 252 -439 400 -204 -110 328 -413 290
2048 290 -48 -211 349 -348 164 84 -284 339 -248 39 167 -304 262 -130 -70 207 -252 183 -25 -114 218
2069B18m21L17o8k01L41l29J81N0k47K96k04M0J21k18K09j07k7J40j64J20l8o3
2091e4J12r9L6L2o4N4k1j5K6mk5M2k2k4O7r3P0J4r5J42j19L5Q5j80J95j09m8J89
2119A27k52K00l6j59K82k86J43O5k59L57k83O0K04l90M06k28p4L56m70L62q4k56
2141b15M93m94K66Q8m23N74m53J15K85n68O00l40r3N01o85N48j45l43O77o85L90
2162I3Q4n49P50o12J84L49p35P85m57r1O04q38O87k06l93Q18q58N04P4o34R20
2183D79p62K42L95q54R28n75o3O97j004Q48l19l79R30j032O53J6o92J061r39L72
2203BL82r69J102p38K4P14j142J011l96l74R98j185P97l7p34J171j066M68L66
2222C94j038J206q17O6P52j237J121m66l84J055j273Q99p6p77J248j154N60L32
$$ plain form
2069 218 -203 114 46 -155 186 -143 38 88 -159 137 -67 -27 94 -124 85 -22 -49 91 -73 47 9 -54
2091 -54 58 -41 -5 27 -37 17 -4 -19 7 3 -22 20 -2 -26 41 -52 18 32 -63 79 -40 -5 80 -100 95 -14 -62 127
2119 127 -125 75 39 -120 162 -124 19 84 -175 182 -101 -41 163 -227 179 -49 -123 233 -237 125 41 -215
2141 -215 278 -216 50 138 -285 289 -164 -49 236 -332 268 -72 -165 336 -349 199 54 -289 388 -297 93
2162 93 177 -372 378 -234 -50 299 -436 349 -108 -199 405 -433 254 48 -345 473 -385 119 193 -441 479
2183 479 -283 -41 354 -500 428 -147 -210 487 -517 331 12 -367 563 -469 184 200 -492 569 -370 2
2203 2 384 -585 517 -221 -197 517 -625 386 -10 -384 614 -571 226 189 -545 626 -440 28 394
2222 394 -644 562 -255 -189 563 -674 447 -19 -403 652 -621 278 202 -575 673 -481 79 411
2240D11j105J326r13J25P12j290J270o03l47J080j336J039k20p59J358j279O50
2257A19K30j073J468j093J99P01j306J380p81k61J140j406J084l35o62J416j407
2274e87P11K04j016J487j230K77P61j333J356q58j43J152j501J098l19n81J353
2291H31j515Q09K52j034J398j270M45P30j438J381q37j7J034j619J275l45n60
2308d80J252j556J064J16j112J434j264O22N08j474J543q51qQ64j563J493m91
2325I7o31J238j438J152j17j120J579j213N54L22j328J700r95r4Q54j355J477
2342F82p10o07J384j352R87k68q84J670j339M19L69j084J609j217j8J003j291
2359f47J286q62k98J436j550R07k28n99J523j613O08M73j036J368j321L53R67
$$ plain form
2240 411 -694 632 -281 -156 556 -734 536 -67 -414 666 -670 369 149 -610 748 -531 119
2257 119 349 -724 744 -349 -150 551 -755 625 -156 -417 723 -683 401 66 -596 820 -587
2274 -587 124 328 -688 799 -431 -154 607 -726 630 -228 -371 781 -720 378 59 -522 831
2291 831 -684 125 377 -657 741 -529 -84 646 -792 589 -248 -265 769 -850 425 80 -480
2308 -480 772 -784 280 396 -716 718 -546 76 584 -890 653 -198 -206 658 -905 588 97
2325 97 -534 704 -734 418 301 -819 760 -453 101 423 -905 795 -200 -294 560 -795 682
2342 682 -28 -635 749 -603 384 116 -768 902 -437 -18 351 -733 876 -341 -359 644 -647
2359 -647 639 -223 -521 915 -635 272 44 -555 968 -645 -37 436 -600 768 -553 -200 767
2376G67j474J188p36k5J159j719J087q7n79J193j568R48L68j187J265j107N35
2393B8O69j574J347n43j15Q57j561J306j51p87J119j261J009Q8j239J409r04L77
2411G4L77j342J541o74k92Q12j227J314m73p53J265j098Q12j65r58J555j058K35
2429e5L52r98J475r83j89R37j096J105o88m12J330j253O66j19o12J372j300L51
2447a17N18r12J149j022J16R31j204R01n04j81J082j365P28O7o00J064j205N52
2465bM76j007R96q06K51O90j249R82l65j87P98j235R15j4o73R34r93O55K25r95
2485f04J069p01K20M42j081J106m74k27O93j021R45k32o18R66q62N50M7p97J107
2504E28p43J34L97q56J019n67k09P26q73P64k87m35R26q63M33Q0o09R55p82J62
$$ plain form
2376 767 -707 481 -255 -280 879 -840 247 160 -419 774 -794 154 522 -665 600 -507 28
2393 28 697 -877 470 -73 -188 669 -892 414 263 -524 595 -666 343 431 -808 601 -303 74
2411 74 451 -891 650 -24 -316 496 -731 583 110 -643 622 -476 336 171 -787 768 -290 -55
2429 -55 297 -701 774 -209 -398 539 -557 548 -140 -552 778 -475 191 72 -540 832 -468 -117
2447 -117 401 -511 638 -384 -268 663 -541 360 -144 -325 757 -608 120 187 -413 651 -554 -2
2465 -2 474 -533 463 -343 -92 598 -651 331 -34 -221 577 -658 257 243 -430 504 -489 166 391 -604
2485 -604 465 -236 -16 426 -655 451 -23 -250 443 -578 367 135 -483 483 -379 171 218 -579 528
2504 528 -215 -81 316 -540 479 -88 -297 429 -444 320 33 -402 524 -339 94 174 -435 520 -262 -100
2524a00M25p51Q35n70o0O69q48O42k56k75P79q60M69P5n09P69p32K75L28o93P27
2545C39n14N5N12p98O37k40k08O06p62N18om50O76o24K98K05o09O71m46N6L74
2566B90o57O12k46j88N07o19M48n1l78N88n17K54J28m79N87l93M2K94n12N06k47
2587c1j44M45n20L87q4k70M87m53K20Q0l53M78l73Q7K37m39M31k31p0L37m39L42
2609A24r6j76L71m04K32M2k71L67k95P8J70l33L34j78m7K39l34K64o0j48K78k80
2631a23J52K6j92K67k02N5J08k30K40j36k1J71k34J83m7r4J79j86J12J6j42J93
2653I5j44M6N9j31J39p9j9J05j32R4k2n5J00r7N7lo0Q2o1K1K4n9O0k5j3L7l6K7
2681A0Nl6L0qj2K1onRj9J7J3k9M1l5JL8o9N4Lo1P6p3L5M1r1J05o0j4Q3j29J11
$$ plain form
2524 -100 325 -426 409 -161 -221 448 -400 242 -14 -289 490 -370 99 174 -335 434 -298 -23 305 -388 339
2545 339 -175 -120 392 -406 231 -9 -217 389 -373 145 139 -311 365 -259 39 244 -365 306 -140 -84 290
2566 290 -367 245 -1 -189 318 -301 147 96 -282 306 -211 43 171 -308 279 -114 -72 222 -290 216 -31
2587 -31 -175 270 -250 137 53 -217 270 -183 37 117 -236 242 -131 -44 193 -246 185 -46 -116 221 -218 124
2609 124 28 -148 223 -181 51 93 -178 189 -106 -28 142 -191 143 -35 -82 157 -177 87 27 -121 157 -123
2631 -123 29 55 -137 130 -72 -17 91 -139 101 -35 -56 115 -119 64 17 -77 102 -84 28 44 -98 95
2653 95 -49 -3 56 -75 64 -15 -34 71 -61 33 11 -44 56 -41 16 13 -47 35 -26 -5 19 -40 20 -5 -18 19 -17 10
2681 10 15 -21 9 1 -11 10 4 -1 8 -11 6 19 -10 31 -4 -3 35 -34 20 23 -38 38 -35 0 41 -50 55 -5 -19 64 -65 46
2713D6m2m8J15j37R7kj01J57j44O2N7j59J97j37qJ34j95J89q6o6J83k21J58kj46
2738i9K26k10R9P3k17K50j61qJ76k70K44j10r3K70l18K07rj89L07l00J44R5k77
2761a70L23k36K3K13l41L20j56q4K94l71K79n5k00L79l70J79R0l03L90l08O9K13
2783A78m00L98k05q7L41m52L50r1k16M16m15K23P5l42M58l49P7K35m51M54k42
2804d5p4L58m84L88j08k26M66m76K74O4l97N25m10J33K14m85N15k83n3L55n20
2825b69M45j46k25M79n10L17L9m00N61m53J50K03m99N75l59l7L99n61N02k11k22
2846b22N36n77L66jl84O08n21J72K11m84N91m17JM16n94N14k36j80N44o31L85
2867I7rl51N98n76K29K19n05N82m44O8L95o36N27k26j36N03o69M65l6l52N73n86
$$ plain form
2713 46 4 -44 71 -66 31 29 -72 85 -59 3 60 -99 98 -39 -47 87 -108 81 -5 -71 112 -109 49 47 -99
2738 -99 127 -83 16 89 -128 122 -39 -47 129 -141 103 -7 -100 170 -148 59 50 -139 168 -132 12 107 -170
2761 -170 153 -83 -60 153 -188 132 -24 -108 186 -185 94 39 -161 218 -152 27 117 -186 204 -104 -35 178
2783 178 -222 176 -29 -116 225 -227 123 32 -184 232 -183 40 115 -227 231 -118 -41 194 -257 197 -45
2804 -45 -119 239 -245 143 35 -191 275 -201 73 137 -260 265 -145 -12 202 -283 232 -51 -104 251 -269
2825 -269 176 30 -195 284 -226 91 130 -270 291 -162 -12 191 -308 267 -92 -129 270 -291 211 0 -222
2846 -222 314 -263 103 102 -282 326 -195 -23 188 -296 295 -122 -121 295 -299 215 -21 -201 343 -288 97
2867 97 88 -263 335 -241 -12 207 -298 284 -160 -92 303 -333 194 -32 -168 335 -334 131 95 -257 316 -270
2889b70L18J69n44N99m27J23L26o65O31k74j32M63o60N35q5l78N73n60L60Q1n40
2910c57O71m47J00K61o13O88l29j67M75o10N48j81l60O59n59L03L5m73P23n27
2930a60Q0L08n66O67m21j19N38o16M93k16k60O77o58L05O5l93O73o34J66L36n43
2951b78N75m49MN26o97M81j83j71N82p24L96R1m02N75o20K99K73o05N67l80Q2
2972e8L87p16N60j33k06M86o84M99M5m60N46m96K92J73o20O45l38K1L04o36O47
2993B58k07k62M66n50M91r4m34O34m82K45P7m93O82m18k0L10n07O06l34k17N36
3014B87n30M25j57l04O39n51K04R9l76O14n01L4L62m95N01l51p3N15n91L65j03
3035A3k11N47n99K57J50l80N04m78J28L23n28M55k66j3L89n85M01n5k09M34n41
$$ plain form
2889 -270 48 217 -327 272 -155 -32 294 -371 260 -14 -146 317 -343 192 107 -271 302 -258 102 183 -357
2910 -357 314 -133 -33 228 -385 303 -26 -193 282 -328 220 39 -321 338 -221 82 117 -356 367 -160
2930 -160 -80 228 -338 329 -92 -211 327 -289 204 -12 -272 405 -253 52 117 -276 397 -237 -71 265 -278
2951 -278 297 -152 -148 378 -319 162 -21 -192 390 -334 62 153 -249 326 -294 5 278 -327 240 -140 -58
2972 -58 329 -387 173 40 -166 320 -364 135 180 -280 266 -230 62 235 -385 260 -78 -57 247 -389 258
2993 258 51 -211 255 -295 196 102 -332 302 -180 65 142 -351 331 -87 -107 203 -304 302 -32 -249 287
3014 287 -243 182 25 -279 360 -191 13 112 -264 350 -151 -117 245 -250 251 -100 -173 342 -249 116 13
3035 13 -198 349 -250 7 157 -223 281 -197 -69 254 -274 181 -85 -98 291 -294 107 52 -157 277 -264
3056b64L27J03m10M72m00J89J99n13M96k50j5K91n07M56j16k33M00m54L52%l73
3077b50M83l67J57J18m28N12k84m5K81m19M24j73k00M14m07K73k6k84M68l71J21
3098cJ16l37M49l06mK75l82L59j89j18L58l77K32k1k13L87l66J33J21k83L45k80
3120a04M5K23l45L08j53o1K72l76K63l5j79L21l24J57Q9k71L15k28N1J61k99K81
3142A11j26n8K28l16K46l5j64K68k75J57M5k31K89k02M6J30k57K60j34n0J92k62
3164a38K18o5j15K26k26J24K0j68K44j88M2J02j97K16j26j4J39j98J62n6p3J89
3186A18k05J15Qj29J90j45N0P5j69J77j18MJ05j56J35o1l7J23j54R9pq8J48j32
3210e4N4N1j33J36q5J0O7j16J08m7l4J00j07Q0rp1J14j03M0L5o7Q1o4RN3q4O7
$$ plain form
3056 -264 63 166 -244 228 -172 17 216 -297 199 -51 -66 225 -282 174 58 -175 225 -229 123 123 -250
3077 -250 233 -134 23 141 -287 225 -59 -104 177 -242 182 9 -191 223 -184 89 63 -221 247 -124 -3
3098 -3 113 -224 225 -81 -85 190 -192 167 -22 -140 218 -159 73 52 -161 226 -140 -7 114 -169 176 -104
3120 -104 -59 164 -181 127 -26 -87 185 -191 72 37 -142 179 -145 12 101 -170 145 -83 -32 129 -170 111
3142 111 -15 -73 155 -161 85 50 -114 154 -121 36 81 -150 139 -63 -17 113 -144 116 -18 -68 124 -138
3164 -138 80 15 -100 126 -100 24 44 -124 120 -68 -26 76 -121 95 -31 -45 94 -104 58 2 -71 118
3186 118 -87 28 36 -93 97 -48 2 77 -92 85 -33 -29 76 -80 55 -6 -43 80 -74 25 18 -70 78 -54
3210 -54 0 51 -82 54 -31 -21 46 -70 38 -9 -43 57 -50 30 21 -50 64 -39 1 36 -31 50 -14 -5 48 -36 31
3237C1k8k5N8o3M3j2l7O1m8K5J0l2L6k7rK9l2M7j8k1L3k5LjpK1j2JJ3j0kKqJ0
3271FqmK4j3j2K0k1K1mj4K7l1KJ7k6L1k0oK6m7M8j3l2M8m3J8K4m9N4m6MM5p0P6
3305C2l0j6O6r1O9j0m3P2q4M5L0q9J05p8J4N6r0Q8n0k0P8j10R6k6p0J16j12N8
3333FJ8q2J28j10K8O7j34J38p7qR9j45J19l3p1J32j47Q9K4j15J62j37M7P4j54
3358h2J62r6k1J19j68J41l7p9J55j73R9K7j33J96j66M7P1j65J85j07j6J31k05
3381a15J68n5q1J94k10J30J1j45K11j81Q7O6j98K12j23jJ31k18J97q0p1J94k22
3404i9J45j0j41K26k09R7O0j93K35j62J1J30k22K23j00p6J98k21J74l4j43K45
3426A34k30J07N3j98K71j96J5J50k35K35j25n7K14k54J74k9j28K51k50J20N5j91
$$ plain form
3237 31 3 -22 36 -27 16 4 -33 28 -20 5 15 -17 19 -8 -17 12 -20 27 9 -12 21 -4 -1 -2 -9 12 0 1 14 4 2 4 -4 6
3271 6 -2 -6 18 5 -7 13 -8 13 9 -5 22 -9 -7 10 -16 15 -5 -11 15 -32 16 3 -29 19 -24 -6 18 -31 23 -23 -19 26 -44 32
3305 32 2 -14 52 -39 30 20 -23 49 -35 10 40 -49 56 -22 -8 48 -42 46 -4 -24 54 -56 40 14 -56 60 -52 6
3333 6 24 -58 70 -40 -12 55 -79 59 -18 -26 73 -72 47 14 -57 75 -72 17 41 -74 88 -49 -2 72 -82
3358 -82 80 -16 -37 82 -86 55 18 -61 94 -79 20 47 -86 110 -56 -9 62 -103 82 -25 -41 90 -115
3381 -115 53 -2 -83 111 -99 31 42 -103 108 -73 14 80 -118 94 -29 -30 101 -117 80 0 -71 123 -99
3404 -99 46 36 -105 121 -88 9 69 -124 111 -51 -40 90 -132 91 -9 -85 113 -108 66 32 -111 134
3426 134 -96 11 64 -134 137 -59 -44 106 -129 106 -19 -76 138 -116 58 29 -99 152 -98 22 77 -114
3448a14K53k12N3J30k46K36j42k3K06k91K07m1j14K38k75J65L8k02K71k39Q1J36
3470A15k65K52j35pJ80k94K44o1j29K41k70J86L7k21K76k38R4R7k61K72j37l2
3492e6J76k70K49q1j32K51k60J82qk00L04k40Q3Q7k44L16j91l5J95k62K48j28
3514a6j08K81k78J85l5j58L07k73Q7Q5k05K80k20NK09k67K32j36n4K44k90J66
3536D1j8j24K54k77J18R8k23K62k13N3J74l01K36j02l8K12l15K16Jj59K39k70
3558a36J66Q0k43K52j87P4J14k87K73j06m8J57k68K50l4j87K52k29J59J6k28K86
3580A26j73M9P5k40K96j53n4J84k40K32q4j41K60k21J17Rj72K81k14L8J09k04
3602a20K60j73m3K09k40J93r0q7K49k50J29mj33K56k47O8J15k01K17j69J2J80
$$ plain form
3448 -114 139 -73 -20 110 -136 100 -42 -65 141 -150 57 16 -98 140 -135 30 68 -134 137 -102 -21 115
3470 115 -150 102 -33 -40 140 -154 90 29 -100 141 -129 57 94 -127 149 -89 5 102 -159 113 -24 -56
3492 -56 120 -150 99 18 -114 137 -123 59 51 -149 155 -85 -2 85 -159 157 -34 -69 126 -136 112 -16
3514 -16 -124 157 -121 64 29 -129 178 -95 -8 77 -128 152 -68 -63 146 -121 111 -25 -79 165 -125 41
3536 41 23 -101 153 -124 -6 92 -131 131 -82 -29 145 -156 80 -22 -60 152 -163 53 54 -105 134 -136
3558 -136 30 110 -133 119 -68 6 120 -167 106 0 -48 109 -159 91 57 -130 122 -107 52 68 -160 126
3580 126 -47 2 77 -163 133 -20 -74 110 -130 102 18 -123 137 -84 33 42 -130 151 -63 -25 84 -120
3602 -120 140 -33 -76 133 -107 86 -4 -91 158 -92 37 33 -100 156 -91 -23 92 -109 108 -61 -49 131
3624A31k54J85p6m6K02k64J49J9j30J99k14J09Q7k19K12j20J0J29k40K09p3o1
3646e6J67k19J79j8j44J95j81J16L1j97K25j24OR8j94K07q3p1J61j93J45l1j16
3669i7J95j61Q8J5j46K06j23NR1j71J91j10m5J51j65J16k6r2J88j75Q2L2j24J73
3693I8j43K6R4j55J63j04qJ23j75J15l5o3J42j47P9L0r9J33j21L4P5j34J29q1
3717b4oR2j37J22m1m7J16j44R6Kq9J21j10O0M3j13J14o5rQ4j28J12l3n5J06j12
3743d5P4pp9J11r9M6L5q8J10p8qO9r8R3m9k7Q7q7N4jm9Q8q2L4K7p7R5p0J6N0q4
3774c9P4m0k3P0p6N3ll5N6o4L3Pm7O6n7J2M2o5O4l2j7M9n4M6pl7N5n6L3Ql7M5
3806B4m3PL1m7M6k2nK9m0L5j1j4K8k6J7lj6K5k7K0Pj8J5j4j0J4kN%j5J4qQmj0
$$ plain form
3624 131 -123 62 -14 -60 142 -122 27 46 -84 115 -99 10 97 -122 90 -30 -20 109 -131 78 5 -56
3646 -56 111 -108 71 53 -91 104 -77 39 70 -127 98 -26 -20 78 -116 91 8 -63 98 -95 50 19 -97
3669 -97 98 -63 25 40 -106 100 -23 -18 73 -98 93 -17 -62 89 -76 40 14 -78 110 -65 17 49 -75 98
3693 98 -45 -19 75 -80 83 -21 -29 94 -81 34 -1 -64 78 -69 10 40 -59 74 -47 -13 62 -72 57 -24
3717 -24 -30 62 -75 47 6 -41 75 -69 27 29 -60 61 -49 11 54 -59 55 -10 -19 65 -63 49 16 -39 67 -45
3743 -45 29 22 -57 54 -45 1 36 -52 58 -20 -28 41 -57 36 -13 -40 47 -40 14 13 -36 52 -30 4 31 -46 49 -21 -5 45 -39
3774 -39 35 -5 -28 42 -34 19 16 -19 37 -27 6 13 -34 32 -25 -13 29 -36 28 -4 -21 28 -26 20 13 -24 31 -25 8 16 -21 24
3806 24 -19 -12 19 -28 18 -4 -9 20 -20 15 4 -10 18 -8 9 6 -10 15 -12 8 15 -3 12 -2 -12 2 0 5 5 -10 4 -4 4 0 -10
3841a0J0j2J7lrOjPLpKOqkQmQjnlPrJ6k0NnqJ6j3K1j6rK9k8J6J2l3K4rmJ7l5L5
3884A1j2pJ9j9J0Oj9L2j5%J6l4L8k9OK0l9K1Nk2L7l7J2J3l2M5m1NJ3l8O3k7j0
3917iK7n4N9l2k0M9n0M4Kn1O5n0K5K6o2O6l5j2N5o3N3l3k5O7p4M3J8n9P7p0K4
3948AL0o9P5n8OM7p2O9l3k5P0q7O4ln1Q1p0J4L8p6Q8m9LN6r5Q2l2k5P1r1O9j7
3980A1m3R6r6M8K2q8R6n8JM2q9Q6l3j5P7j11P3rn8R7q4L6K2q3J17p9J3M9r4R6
4010D2n4k3R3j07Q8j6p2J13j05N1K5p9J02q7J8O3j04J13o8j3P1j00Q1k3n1J07
4036F5j10N2K6q7J08r5L6N4j16J18o1KP1j24R1j8m9Q8j00O2K0p9J16j06M6N2j21
4063e9J11o4MP4j31J07k5m4R1j26Q7Lq9J32j02M0L0j11J20o8pO7j13J12m2m5J05
$$ plain form
3841 -10 0 -12 5 2 -7 -1 -2 5 8 1 3 9 1 -1 7 3 11 10 5 2 9 0 16 -4 1 -4 -12 4 -9 12 -4 -13 16 -12 4 16 -17 7 -2 -6 11 -24 11
3884 11 -1 -8 11 -8 2 8 -11 21 6 6 22 -12 26 -3 3 23 -16 5 10 -12 25 -12 0 13 -19 26 -15 -10 3 -35 28 1 -9
3917 -9 18 -36 23 -9 -29 20 -30 14 16 -35 30 -20 5 31 -31 35 0 -12 43 -20 33 0 -25 42 -32 11 29 -30 47 -23 1
3948 1 31 -38 37 -21 -15 32 -40 29 -4 -29 41 -46 18 15 -36 45 -25 -11 27 -49 39 -10 -7 49 -46 36 4 -21 50 -41 28 11
3980 11 -32 64 -32 16 38 -50 46 -12 -11 31 -58 28 -5 -20 57 -54 19 10 -48 49 -35 1 23 -60 57 -22 -9 40 -54 42
4010 42 -12 -35 58 -49 39 23 -49 64 -41 10 35 -44 58 -29 -11 52 -52 61 -7 -20 51 -49 32 9 -42 65
4036 65 -45 7 33 -54 54 -41 -5 49 -67 51 -10 -8 63 -61 30 12 -37 51 -49 13 33 -46 70 -36 10 62 -59
4063 -59 52 -12 -8 66 -65 42 17 -27 64 -62 25 28 -61 71 -31 9 39 -72 48 -20 -27 40 -73 39 -3 -48 57
4090E7j12Q1pp7J24j14M8L1r8J42r3lO5j06J13o4k2J07j19Q4j5p0J22j18M1M0
4116C7r1J28j16J8Q9j12P9n5j5J06j26Q1rn0R8j14N7M0r1R5r6M9O3j28J14o2l
4143a4P8j25R7j5n0Q7j01O4K3r9J07q6M2M1j25J32n6l0P2j15J18l9n7J00r6P2
4169B5j4q0J28q2J9L7r0J14o2k0P8r5Q7m6l5J00j03O6j3o4J26j03K8L9q3J15q5
4196a3j0P6j00Q3m4l2R8j15O6J2o8J02r2L7M0q3R0p7PO7j06R7l9j4P0j00O9Km3
4225b0O6q4N2K4r1J00n7J1N7j13J01m0l3P7q6P0j9n5R8q8L8J6p7R7o2J6M0r1P9
4254B6l7k6P1p7O6j1m8P9o8M5Mo0Q7o8RM0n2N6n0KN7q0O5k6l0P4q3M7On8P9o7
4286b8K3L6p4N9l4NL5n4N5k1k4O0p0M4pm1P0n1K5J8m8O0m3JL2m7L6k2j8N1m4L2
$$ plain form
4090 57 -55 26 19 -58 66 -48 0 31 -67 75 -18 -21 44 -62 51 -13 -35 72 -47 37 22 -48 74 -44 -3 37
4116 37 -54 74 -42 -24 65 -47 32 -23 -38 68 -58 23 14 -36 62 -52 5 45 -46 49 -47 2 65 -63 51 -11 -14
4143 -14 64 -61 36 21 -29 58 -43 21 44 -55 52 -34 8 49 -76 56 0 -30 42 -73 45 6 -51 49 -47 25
4169 25 11 -69 59 -23 -4 33 -57 57 -5 -25 53 -42 45 -1 -36 64 -39 27 14 -50 76 -27 1 40 -43 72 -13
4196 -13 -23 53 -47 36 -8 -40 58 -57 9 21 -47 55 -37 0 40 -43 47 -30 -23 44 -62 35 -4 -18 52 -48 21 23 -20
4225 -20 46 -38 14 38 -53 47 -10 1 58 -55 46 6 -27 50 -36 34 15 -40 58 -30 8 24 -53 44 -18 -2 38 -53 26
4254 26 -11 -37 34 -43 23 12 -36 43 -25 20 24 -36 51 -17 -8 32 -20 36 -14 -12 45 -35 30 4 -26 48 -35 12 18 -40 39 -28
4286 -28 -5 31 -43 16 -18 -13 22 -32 23 2 -22 38 -32 12 5 -36 34 -17 8 26 -22 38 -5 -4 28 -19 17 -5 -23 28 -16 16
4318A6%m5M8m2J9J6m7N1k9MK6m6M3k2j5M8m3L4j3k6L9l4RJ9k8L8k5kK7m0M2k3
4350aqL1l7K4Ok5K8l1K1Kk7M0l4QK3l4L0k6oL2k5K5j1k0L0m2K0J5k6K8k5NK2k4
4384a2K9l0PL%J8j6qK0j4JJ0j4J8j1NJ2k5J6rLKj1J1j1PNrQ%j3J5j6RoPMj4J0
4423Am%Qj0jJ9p%JpJj%KMlNKKj7PjmRmJLrKRj3Mj1J2Qj7L%kJ3pMPj6kRJJ0j1k
4473bMoJ5kqRpMj0JJ0j3MPj1J2roJ5j9K2Jl0K1k5K4J0k7K1j4LJ1k3K6j8PK1k3
4511eJ5kj5K7k5J4Pj9K2k8K2kj8L1k5NJ0l0L4j4lK3m3L2j1j4K8l2L6k4j9L3k4
4544a4RJ9m9N0j5nK7m5L8rpL0m4K4Jl2N1l2OJ8l2K9k6JL0m6M5j9k1L6l0K2%l2
4578b2M4l3QJ8l6L4j4LJ8l6L3j5j7L9l4J3Ml4N4l4J3K3m2M3k4kK6l8L4j7l0M9
$$ plain form
4318 16 16 -29 19 -23 -4 12 -35 16 -13 -9 17 -29 14 -8 -23 25 -18 16 3 -23 16 -18 -9 10 -18 20 -5 -7 20 -20 22 -1
4350 -1 -9 22 -15 9 15 -10 18 -13 8 10 -17 23 -11 -3 20 -14 16 -10 -16 16 -9 16 5 -15 15 -27 -7 8 -18 10 -15 -10 12 -12
4384 -12 17 -13 -6 -3 -3 15 -1 -9 11 -3 -2 8 -6 12 1 6 18 -7 9 0 3 5 -6 5 -6 1 6 -3 5 5 -8 7 -9 0 -6 1 5 -9 1
4423 1 -3 -3 5 -5 -6 13 6 6 7 0 1 0 0 2 6 3 8 10 12 -5 2 1 -3 6 2 3 6 -3 -1 8 -5 -1 -12 0 8 -9 -6 -6 -8 5 -2 2 9 -7 -9 0 1 11 0 -2
4473 -2 2 -4 11 9 1 10 3 7 -3 -2 8 -5 -1 6 -5 7 -2 -8 7 -12 10 11 -19 2 -23 1 11 -16 5 -9 -6 5 -18 8 -10 -3 18 -5
4511 -5 10 8 -7 20 -5 9 16 -3 19 -9 13 11 -7 24 -1 4 14 -16 18 4 1 24 -19 13 2 -12 16 -16 20 -4 -23 10 -14
4544 -14 -5 14 -35 15 0 -5 22 -23 15 6 -1 29 -15 9 10 -22 29 -3 3 21 -11 18 -8 -7 23 -23 22 3 -18 18 -12 10 10 -22
4578 -22 22 -11 -3 15 -21 13 -1 2 20 -16 17 2 -15 24 -10 3 7 -27 27 -7 6 29 -13 30 6 4 30 -8 26 9 -21 28
4610B8m6L2Kl6M3l3MK3m0M9m1LL6n1M1k0j0M0n7L4jk8N4m3L2jl4M9l2kK7m3N7
4643C6l5jK8l8L1nk2N5n3J7Kl5N2m6J7Ql8N2k3j9L4m5N5k5l4M5l6K8Ll7O3n5K4
4676CJ3l8M7k6KK0l8K8Nk4M4n2L0%l8O3m8NK5m0M0l0jL9m8K6roL8o7L8Kk2M9n9
4711b9K8J1k8M5l7RK9n8M1qj6M9n2M1j7k2L4n1M6Jm6N9m1LL2n3O2l7j4K6m5N7
4743A9j2l3N7n8K8Nm2N0k9QPl8P0m0j0L2l5N2m0pM7m4J9oj6N3m3NJ7l4M2k4kL9
4777C7n5L1j1j0L8m2K6qk5M5m2J1J7l2M3l0rL7m9M3j3j3L6m3K9Kk7M6m8J8K1l8
4809a5M3k5kL5n6M7j7j6L3m5K8oqK3m2K0J1l0L6k1NJ3k8L9k5rL3m1K6mj8M0l1
4842gJ5J0k9M1k9RJ2l1K8k2QK0l1K5ok1K9l5L0%k7L9k6mPj2K0k1pK3l4K8kj1J6
$$ plain form
4610 28 -18 14 16 -20 23 -10 -6 17 -23 26 -15 -12 24 -27 14 -6 -16 24 -33 1 0 -28 26 -17 15 14 -20 29 -3 -5 22 -21 36
4643 36 1 0 28 -10 21 16 -6 49 -4 13 15 -20 32 -14 3 11 -27 25 2 -17 17 -28 27 2 -32 13 -23 5 8 -29 34 -21 3
4676 3 16 -22 25 -1 1 21 -17 11 16 -8 36 -16 14 14 -24 39 -9 -4 21 -19 21 -9 -10 29 -19 7 -2 -8 30 -37 1 3 -19 30 -29
4711 -29 -1 10 -18 27 -10 -1 28 -30 11 3 -13 36 -16 25 8 -14 20 -31 15 16 -30 29 -12 -9 23 -30 32 -5 -19 7 -38 19
4743 19 7 -26 31 -27 1 6 -36 14 -15 -7 0 -38 32 -8 -18 14 -21 31 -9 -16 31 -13 6 0 -16 37 -6 -1 16 -18 24 0 -2 37
4777 37 -18 13 2 -8 30 -12 14 6 -19 26 -16 -5 12 -20 23 -7 -16 21 -28 15 2 -11 25 -18 11 13 -14 32 -16 2 23 -15
4809 -15 28 3 1 36 -20 27 10 -6 27 -18 10 4 -4 19 -23 -3 8 -22 14 -7 -2 11 -17 22 -3 -12 21 -20 6 2 -16 24 -7
4842 -7 8 18 -11 30 1 10 22 -9 19 -3 5 25 -6 19 13 -8 21 -14 16 16 -11 28 2 -2 5 -7 13 -8 -15 8 -26 2 0 -11 5
4877Ek8K6Lk4L3k1JJ1k4L6j9LJ5l3K7j2KJ3j8J2%j5J6j0J1pj5J6qOkrJ4j3PJ1
4913A0k8J5j%J2j8QPrK4k4NQqJ7k2LJ1j6QmPJ0j2JJnJ1j2J0%j5J8qqOj1J6lj3
4953iJ9j0lJ0rJ2j0mRj1PjJ1j0oJ5qoJ5pKNrOj0J6Kj7RnlMJkmJOqLOookjMpK0
5000Ikj3Mj1PJ0jLj2JJ4j4J6rJRpmMLmKj6QP%OrnLNnj0OJ1j2klJ8j0n%lkJ6j3
5046iJ6mrJ5rL%jJ1pMJ0j5%pN%oOKJ0Jj4%J0j9QJ1qKrRj1JLmrMj4K4j2lJ6nLj2
5092a3QPmJ8Nk0J3j6RKj7J8knPrQj2J3Nk1PmKPj6RJj3K2j5PNj5N%nMlJ1jmKj3
5136a3K2lpJ4j6PJ1j6J6j6LJ4k4J5MrQj2Pj1kK7k0rJ1jQj9J0Pj6J8j5NQqLj7O
5175a0K5k1J3Mj6K1j2%J8k3K1k1J6Jk3K2rlQk0K1Nl1K3j4kJ3k1K6j7kJ2rQ%k1
$$ plain form
4877 5 -23 3 6 -18 15 -6 -5 6 -18 18 -1 2 17 -16 11 -1 1 14 -4 8 8 -7 9 -1 10 3 -12 4 -4 2 0 -9 5 -8 -1 10
4913 10 -18 -3 -4 -4 8 -10 -2 5 -4 20 -4 1 9 1 18 -4 -1 10 -6 2 -2 5 15 3 4 5 0 11 -1 9 9 -6 12 4 -4 2 -9 7 4 -9
4953 -9 10 0 -3 7 -2 10 0 -4 5 -6 1 0 11 1 -5 10 2 -4 11 4 6 11 2 8 -2 14 16 -1 8 3 0 4 5 3 -1 0 6 -2 1 7 1 -5 -7 -8 -4 -11 9
5000 9 7 -6 -2 -13 -6 4 3 6 -6 -5 9 -5 11 2 3 12 5 1 5 8 4 6 -10 -2 5 5 11 2 -3 0 5 0 -10 -4 7 -5 -7 -10 8 -2 -7 -7 -10 -12 4 -9
5046 -9 7 3 -6 9 0 3 3 2 13 6 10 20 5 5 -2 3 3 -3 3 5 15 16 2 2 12 -7 1 12 4 6 -3 6 -5 -4 -1 -5 -14 -10 -24 0 -12 -15 1 -4 -1 -13
5092 -13 -5 2 -2 16 21 1 14 -2 7 9 -8 10 8 3 10 1 9 -3 10 15 -6 1 -3 -1 6 -10 -1 0 -13 9 -6 1 6 -9 -4 -4 -9 -5 -8 3 2 -2 0 -13
5136 -13 9 6 -1 13 -3 4 15 -1 15 -1 2 16 -8 7 11 2 10 -2 5 -6 -8 19 -1 -10 1 0 8 -11 -1 6 -10 8 -7 -2 6 -2 1 -16 -10
5175 -10 15 -6 7 11 -5 16 4 4 22 -1 20 -1 15 16 -7 15 6 3 11 -9 12 17 -14 9 -5 -7 6 -15 11 -6 -8 4 -5 3 3 -18
5211a8K7j6J6qpK0k5PJ2j8K2j1KJ9m0L4mk1L2k2J9k2k0M0j4jlqJ9j9QJ5j8J5j6
5246dj2K6j8J7qoJ8l6K6%j1K8l4J5J4k2K4j4kJ7l5L3lj4J7k0J8Kj7J9k3RNl0L7
5281A6k4RNj9K0k0NK0k8J6Lk0K4j1nK0l1K8j2jJ9l1L6j1j1J7k5K6oj1K5k5K0K
5315B0l2L3j9%J2k9L2pj6J7k9K8rj3K5l2J4Lj7L1j9MK3m1L9j7lK5k8J0Nj6K6k8
5349hK0Mk3K3j3KJ0k1J6lj1J9j8J4rj0J8j3Ppj6L8k8PJj4J7mJJ4k5J5j0%K3k6
5385a0PJ1j7J8qNNj2J2j7jJ1j5K2qj0K0k7J7l%J0k0J4Ql1L5k4lJ0j2K4j7qK1j2
5421eLLoQj9J6J1j6K0j7J3Ok2K9j9J0qj3K4nj1Qj0Lm%J5j5LQk7J4nKJ6j6LMj5
5460a4J9j4MOj3K1pJNj7J8mLKj7K1j5J6Jj8PjpMl%NlPj4lJ5qnJnJ5j4jJ5qOj%
$$ plain form
5211 -18 9 -7 9 1 -6 14 -11 -4 8 -10 12 1 3 22 -18 16 12 -9 23 1 20 -2 -22 18 4 3 0 -8 11 -8 0 15 -3 12 -4
5246 -4 -16 10 -8 9 1 -5 13 -23 3 3 -8 20 -14 1 15 -7 17 3 1 18 -17 16 13 -1 16 -4 14 16 -1 18 -5 4 9 -21 16
5281 16 -8 1 6 -13 7 -13 -8 12 -16 0 3 -17 7 -4 -9 11 -20 8 -4 -5 14 -17 19 8 -3 14 -11 15 9 -2 23 -2 18 20
5315 20 -12 21 2 2 14 -15 17 10 -6 11 -18 10 1 -12 13 -19 -5 -2 -19 12 -7 -3 20 -21 18 1 -2 23 -5 5 10 -6 20 -8
5349 -8 12 16 -7 16 3 5 15 -6 10 7 -4 15 -3 11 2 -8 10 -3 4 -3 -19 19 -9 -2 -1 -15 2 -2 -1 13 -12 3 -7 -7 16 -10
5385 -10 -3 8 -9 9 1 6 11 -1 11 -6 -7 4 -11 11 3 -7 13 -14 3 0 0 10 -10 4 12 -19 16 -8 -11 -1 -13 11 -6 -14 7 -5
5421 -5 -2 1 -5 3 -16 0 11 -5 15 -2 11 17 -5 24 5 15 7 -6 18 13 2 10 0 3 -1 -1 14 -1 2 10 -17 -3 -8 -6 10 -6 -3 1 -14
5460 -14 5 -9 -5 1 -12 9 2 3 8 -9 9 5 8 10 -7 14 -1 15 16 -2 5 4 -3 1 -2 -2 3 0 7 -7 -10 5 -3 -8 -7 -12 3 -11 -12 3 -5 1 0 0
5504@JjJ2j1j2K1oJ3j0mJ3j7jJ6k2K4j2LjjPj2mRpQ%JOj9MjoJ5j3NJ2j4QqpK0
5546Ij0J%mJ8j0kjJOq%J7j1KKlLKpJOmj3J7ql%oLKrJ3pnLOLmj1J8j0NOLoLpNP
5596A3%Lj5J4%j3KmK0j4KlKjpMPj1pJ5njj4MOJkQj0KmRoJ6oorQMpJ1j0RlnJ3o
5643DmJLoJ3%kkQj0qOmkJ2o%j1J6mnLjKNoNKmJj6K5j1JJ1j4J7rnQ%qJ0oJrMJ0
5691A5j8J1jkKj9J8j2nPkPJj2J0j2OJ1j0J0o%J1j8PMj0K2j6NMj6J8j0%Rj2K0o
5730A1jjj2J4mrRj6K5j2j0K4l2J2Nj6J7j1JJrJ3Lj3K3j9J0KrPnJ0Rk0J6j3OJ1
5768A7k6K3lnJ1oOj3j4K1j8LJ1j9K8j9jJ1j4LmjJ2k2J9lpJ9k2K2olOj0J8mj3J4
5806A1mJRj6J9j6LJ6k7K3j1j6K5ojpnRj4lJ2j5J7p%J8l0J5qjK0j9JJ9j8J9j5k
$$ plain form
5504 0 1 0 12 1 -11 10 4 17 7 3 16 -1 -2 14 -8 16 4 7 6 5 12 0 -4 5 -2 6 6 7 13 -6 -2 -3 -9 6 -7 -2 10 -4 4 -4 -11 9
5546 9 -1 0 0 -4 14 4 2 1 2 8 0 0 17 6 8 10 7 10 12 5 6 12 8 -5 12 4 1 1 -5 -2 0 -9 4 -3 -8 -5 1 4 0 -11 7 -3 2 8 11 5 8 1 6 13
5596 13 13 16 1 15 15 2 4 0 20 6 8 5 7 6 -1 3 10 -1 -8 7 2 1 -13 -9 -3 -2 -4 4 -6 -4 -8 1 -5 11 5 -1 -10 -2 2 -5 6 -4 5 2 -3 10 4
5643 4 0 1 4 -2 11 11 9 7 15 5 -3 3 -1 -3 9 3 3 -8 8 4 -1 2 1 3 8 2 7 9 5 6 -10 15 4 5 16 2 19 10 5 13 13 5 15 9 10 1 5 15
5691 15 -3 8 7 5 7 -12 6 -6 -11 -4 -6 1 2 -10 0 -12 -6 5 -5 5 -1 -1 10 -8 -1 3 -7 15 -1 4 8 -8 10 0 0 9 -3 17 11
5730 11 10 9 -3 11 7 -2 7 -9 16 4 -6 18 -14 -2 3 -13 4 -7 -6 -5 -14 -1 2 -11 12 -7 3 5 -4 3 -2 8 17 -3 13 0 6 17
5768 17 -9 14 11 6 17 11 17 4 -10 11 -7 -4 7 -12 16 -3 -4 7 -7 -4 -8 -9 3 -19 0 -3 -10 9 -13 9 3 0 6 -4 14 10 -3 11
5806 11 7 8 17 1 20 4 7 23 -4 19 8 -8 17 11 10 3 -2 7 -7 -10 2 -13 4 -3 -3 15 -15 0 -8 -9 11 -8 -7 12 -6 13 -2 -4
5844dK2k0QJpJ8j5O%j2J8qoRk7K8k0NK3l2QPj1J0j2J0qoK9k2NJ1l2M0j6rJ6j1
5882dJ5j1qK1k3J8MmQj5J4kj6J6j2NLj2J8j3pJ6j9K0j0jJ3k2PnpJ9k4K2mLkLq
5921dJ4pPj2j0L1k5NONJ0kmOj6J6j3NJ0k5J6omPoj%qRJkMpNJrPj6K6qj%j0J9O
5966B0k6K1j3%K0j6J2pkQpOpnLj5K1j4LQrnRqJ3qKkj1PKKJ1k0PNj2K3j1J2j6j0
6008iJ7pJ2lj5K4j9MJ1rJ4nqJ4j9J2nj4J1n%J6k4QQj6J0j7K4lqKJj1J5j6J5j2
6046gJ3l%PLJMj2J3roJ3j0J4mmkj4J0J1j2Rj6LJ0rj0J5nMj2RLj3J8j6oJ0oJ5o
6087CNpnKMLNkjOj1J7k1RMkKj4KJ3j5J5j7J1LqQqqRlLQj6LqJ2krJ1Qmj1LNj4J9
6134GjqMNMPqkKnJ0nm%KqjOqKKl%Mj2J3mlLmJMlJ0krNKPqKNrJ4NnjPj4Mj1J9j4
$$ plain form
5844 -4 18 -2 6 7 0 18 3 9 9 -3 15 7 1 10 -17 11 -9 -4 19 -13 -5 2 -9 1 -11 -1 -9 -15 14 -8 -3 8 -24 16 0 -9 7 -4
5882 -4 11 0 -8 13 -10 8 12 8 16 1 15 13 -3 13 1 6 9 -3 15 2 -5 11 -8 12 2 1 14 -8 -1 -6 -13 6 -18 4 0 3 1 4 -4
5921 -4 10 3 10 -2 -12 19 -6 -1 5 10 20 18 14 20 4 20 7 12 22 -3 13 7 3 10 4 3 3 -5 4 5 3 7 0 5 6 -3 4 -12 14 6 5 5 -5 14 20
5966 20 -6 15 2 2 22 6 18 11 9 17 10 16 9 4 7 -8 13 -1 2 10 1 -4 5 -3 10 2 4 2 -9 -2 0 2 13 -7 0 5 -7 16 5 17 1 -9
6008 -9 8 1 13 10 -5 19 0 4 15 6 20 15 7 21 2 14 9 -5 6 1 1 17 -7 1 9 -7 3 -14 10 7 -1 1 2 -9 6 -10 5 -7
6046 -7 6 3 3 10 13 14 18 6 19 10 4 17 7 21 17 13 11 -3 7 18 6 15 -1 2 12 3 -7 8 3 7 -5 4 7 -6 12 -4 -10 0 -6 9 3
6087 3 8 1 -4 -2 2 5 10 8 7 13 2 19 -2 7 11 9 11 -3 -1 12 -3 12 -5 6 9 1 9 1 -7 2 -1 2 10 -6 -3 -11 1 -1 -10 1 9 5 -6 -3 2 -12 7
6134 7 6 -2 2 7 11 18 10 8 10 5 15 10 6 6 8 0 -1 5 -3 -1 1 -2 -2 2 -10 3 -1 -4 -1 -5 -4 0 -3 7 5 -4 1 3 10 2 4 9 0 14 19 14 13 20 6 10 -1 18 4
6187Dj1J4lJ1mpoJ2Lj5%OJllRoJ%jlnQoOnRoJ5rmJ3j6J1pOqKMNj0J2j1LlkOpO
6236FkmLlkNoRj3PPk2J0QpQoNj1J8%j2NqLMqJ8loJ2j4RmrO%MKqKJqJ0loPrJ2M
6286A1j3Oj5J1jkL%LqjK0j5QJ3k5J5oMJ4k4RMj5K0j9kJ1oRJLlq%jjQqJ0j0mMn
6330ejNMNj2J4rJJ1j4PKrOQj2MjJ5jrJjLMj1Qj3NJ6k5OJkQj4OmqRKlKrJ8j6QN
6378EoPoPM%kQk0K4oj3MLJkpJ5k0J1%pJ0j7J2pKJ4j4kLrJ1j2RMk2K0rJJ5j2Qo
6422aPjmLJ2j7OlkJ5j6QJRmj1QqKMk1J4NnNj2KNoJ6rj7J9p%lNJ2k1J6qKQj7NJ3
6468Ij0J7rJLj0MOoKqJ1mlJ8k4JJ0j5J2j8J9kj2NoJ2jrJ4%k0K2rJ2m%KpNJ6k8
6510dQLlK0k1J5j6LJ3j6lOrJ7j0JJj5J7rjPljrLJ0rNKj7J6oJ1JlJ2j1LoKQj3M
$$ plain form
6187 4 -7 7 4 15 11 4 -2 10 13 -2 -2 4 5 2 -1 8 2 3 3 2 -1 -6 2 -4 2 -3 6 0 15 6 2 15 -1 10 3 9 1 3 7 12 2 14 3 6 3 1 7 0 6
6236 6 4 0 3 0 -2 3 -3 6 -7 0 7 -15 -5 3 -4 4 -2 3 -8 10 10 -2 3 -5 -2 2 -6 12 9 3 15 1 10 6 -3 3 3 7 9 1 3 4 -4 6 3 -3 4 -5 7 11
6286 11 -2 4 -11 0 -1 -3 0 0 3 -5 -6 14 -1 7 20 -5 10 4 8 22 -2 7 11 -4 16 -3 -5 6 0 9 10 13 10 2 2 1 0 8 0 10 0 -4 0 -5
6330 -5 -6 -1 3 8 -4 10 1 2 13 -1 6 8 -1 5 13 1 5 4 19 18 9 10 9 12 16 5 13 0 5 21 -4 2 3 1 9 -5 1 -3 -11 -2 0 -3 -1 -10 8 -8 0 5
6378 5 -1 6 0 7 11 11 9 17 -3 21 15 2 6 9 10 8 1 16 -4 7 7 0 10 -7 5 -2 0 14 0 -2 1 -8 3 -9 0 4 -18 2 -7 -6 9 -3 5 -1
6422 -1 6 5 1 4 16 -1 5 2 0 15 -1 7 8 17 13 2 10 2 4 8 -13 1 6 1 6 -6 -4 1 -5 11 2 -15 4 -3 -3 -6 -1 11 -10 6 -2 0 8 -9 -4 9
6468 9 -1 16 7 8 11 1 5 11 5 7 -1 10 6 3 21 -3 -2 8 -7 5 -13 6 4 -8 -3 -9 3 2 -7 7 7 -13 9 0 12 8 8 10 3 8 24 -4
6510 -4 4 7 4 24 3 18 2 5 18 2 -1 5 -4 13 3 4 5 -10 7 -2 -3 4 1 0 -9 -6 4 -5 0 2 -15 1 -5 6 7 4 16 5 8 2 4 12 -1 3
6554CMmJ1j3KK1j7JmlJ0j5jMkjKmJ5j5J6lrPj0NPk2J8mpJ6j1JPj0J6j2mR%%NJ
6598A0Jj1MnJ3mnJ1j1lJ4jk2J5j0jKNKrmJ0j4NRoMlJ0kkJ2j2joJ2MlJnjJ1jNq
6643A0oRj4J%MOlrjkJ1oJnJ1Jk1J6mpKQnRrJJJKnQpjQoJ0jmKmnJ4j3J2jjj3J0
6692ENj8J0P%j3RkKmloP%mmKlMMLJ1j1j1J5lj1J1j0J6pL%OLj0KmOj2J0j2PLj1
6737hRrJ5jrpJ4JkqPJnJ%mNRjpLjKlJMqJ6qjRpkrjjQmJ1jj4MKJkMj7J1KmQmrP
6791bnOJ3j9QpJ4jj0J0j8J9pJ2qlQqMkkPqRJj0Kj6J1KJOnj2J1oJKmJJ3q%%lMO
6838Gq%LLjmMOJj2PJ0jrkJ2j0KPj4%mJ2o%qLj2QKLlpPQ%Lj0J1qkJ6molOMj1J9
6887A9jj3Nj1J4LnmkRopjKMjrKjQqMLKj8J4JLkj4K7j4RkqLL%jpQkJPqMQj0J1l
$$ plain form
6554 3 7 3 14 1 3 24 7 8 4 1 11 -4 -5 -1 -3 -4 -2 -6 9 -6 10 7 -2 5 -5 0 7 -15 3 -1 -8 8 -3 -2 5 -5 11 -1 -5 4 4 4 9 10
6598 10 11 0 4 -1 12 8 3 14 3 0 14 13 -9 6 -4 -5 -3 2 4 -5 -9 1 -13 -8 1 -5 -1 -4 6 4 2 14 2 1 -5 7 11 8 9 4 3 14 13 18 10
6643 10 4 13 -1 0 0 4 10 7 -2 -3 -5 6 0 1 -4 7 8 -13 3 -1 -8 -6 2 -3 6 -3 -2 -1 0 2 -3 5 -2 -3 5 -1 9 8 4 6 2 -3 11 -2 10 9 8 -5 5
6692 5 10 -8 2 9 9 -4 5 3 5 1 -2 -8 -1 -1 -5 -9 -7 -10 -6 -2 1 12 1 -10 5 2 -9 2 -8 8 1 4 4 10 13 3 5 1 7 -5 5 -7 0 3 -8
6737 -8 1 -8 7 6 -3 -10 4 5 3 -5 2 3 -2 -1 -1 -5 0 9 8 1 4 3 5 2 3 7 -1 15 7 6 15 8 6 -3 -4 -5 3 -1 10 9 -5 -1 1 2 0 4 -13 -2 0 -4 4 0 -9 -2
6791 -2 -7 -1 12 -7 1 -6 8 7 -3 7 -11 8 1 13 5 2 10 2 6 4 2 9 1 10 11 1 3 -13 -2 0 1 7 2 -10 1 -5 -4 -2 -6 -5 8 0 0 0 -3 1 7
6838 7 -1 -1 2 5 4 0 4 10 11 -1 6 16 15 6 4 16 6 8 15 1 1 -3 9 3 3 -5 -2 -14 -6 -4 -1 -4 -11 -4 4 4 7 -3 8 0 -2 14 10 4 1 7 11 0 19
6887 19 18 5 10 -1 13 16 11 7 5 14 8 1 0 2 6 5 -4 -2 -3 5 -3 1 4 6 -12 2 3 6 4 -10 17 3 12 10 2 5 8 8 7 0 8 6 7 14 6 10 18 8 19 16
6937A6j4J1j3J3j1mjJlMrLJ0KmMJj1NPKnmoJ0rRoPLqQJ0qJ%rPqJ1o%Rj2j0QOm
6985Ckj4NmJ5j8J9nj0J7j2lJ7j3J8j2J1jpMMj0KlJ2ln%jmJ6j1J0k2J5Oj7QllR
7026Hj5J0JmKn%JmJ0r%QqMPj2NjkQj1R%kJ5j7OJ0j0Rj0MPnLllj0J1%j1KJ1j6J2
7072EmjPj2MkkQmKjpO%NjnJ1JJj0NnJ0j1KmJQjKKj6P%LkkjjNmmjlNJ0olQnMj3
7125iJ7nkJ3j7KNJQkjkOQpoMm%mmMJKPj7Pj2NKj0NOj2J9j1Pj1nJ0OqlJ2nJjNj
7174DjqJ5Kj0J1mMmonLK%kJ5qLqLj0%J2j3N%J1n%j9J0oLJ1KoRrRojPmlLqO%JO
7224A1j2J9j0%klLkj0J3oj3J7j8LKQPj5MmLQj1RnlNlQLj0J3KpLqRJj2J5Kj2On
7269CJmMJoPmj2OO%koJ1j1JMLomJ5qPoKkJnLJ2j0LRj2RJNkrKqNJkkkKQj0KmQo
$$ plain form
6937 16 2 13 0 13 2 -2 -3 -2 -5 -1 -10 -7 3 5 1 5 6 -5 0 7 9 4 0 -6 4 -5 4 -2 5 8 0 8 18 10 11 11 2 9 1 12 6 6 15 3 -7 1 7 3
6985 3 1 -13 -8 -12 3 -15 4 -1 -11 6 -6 -9 8 -5 13 1 12 11 4 8 12 2 4 1 13 10 5 5 4 0 16 5 15 -7 8 14 -3 5 2 -1 8
7026 8 -7 3 4 0 2 -3 -3 -2 -6 4 -5 -5 3 -5 -1 6 -6 -1 -2 -4 4 -7 2 2 0 15 -2 4 14 4 13 3 7 14 9 12 9 6 -4 7 7 -4 -2 9 -7 5
7072 5 1 0 7 -5 -1 -3 -5 3 -1 1 0 -7 -1 -1 4 3 -2 9 10 11 1 6 1 11 0 2 -2 -1 7 6 8 10 -6 1 1 4 2 0 -1 -2 3 -1 -5 -6 -9 -4 6 0 -3 5 0 4 -9
7125 -9 8 3 1 14 -3 -1 4 5 13 11 10 8 14 22 15 9 13 9 9 5 1 5 6 8 15 -2 5 -7 -2 0 -10 -5 1 -11 8 -3 4 -7 -12 -2 4 -4 -7 5 0 1 0 5 4
7174 4 3 -5 10 12 2 13 9 13 9 3 -2 1 3 3 1 16 8 11 3 6 -4 -4 8 -5 0 0 11 6 6 -13 -3 -9 -6 5 7 1 10 1 10 4 3 10 6 3 6 -2 4 4 5 11
7224 11 -1 18 8 8 6 3 6 4 -6 7 1 -12 5 -13 -10 -8 0 7 -8 -4 -8 -5 3 -8 1 -4 -7 -2 -5 3 6 -4 9 11 4 7 -1 8 9 -3 12 14 2 8 3
7269 3 4 0 4 5 -1 6 2 -10 -4 2 2 0 -6 5 -6 -5 -1 2 -4 -8 7 -1 6 0 2 0 1 -4 -1 11 1 4 13 1 10 11 16 14 5 7 -1 4 5 3 1 -1 1 9 -1 1 -3 5 -1
7322aKJJ4l6J6mJ0l%%JRnj6J1J0mKNLj3LqOMPpNpNlmLmoNj4RjRj4LNRlrOj2J1
7371@oRj2KjK0%qkKNpMqPnkJ5j0NkOknjJ1j3j0J0pJjLJmlQRmj0RllJrQ%j5K6o
7421CkLNj1J0j%NpKJjJ4j2jjkQnkj3OlK%OqMNnj5RRj0jPKNpPOpoJ3j0JKPj0oJ3
7472IJmQonkJJ%llOnmKOrMpMO%%Ojj9J5j3MJ0ljPMmMj3J1lkKjJlQJj3pJ5lJ3j7
7524bkNqJ2ll%pOmlKkQkmKJ1oKrJ8lnL%NqoJ2j5J3%oMmj1J2Ojnj3K5j7RpJ%ml
7574gMkK%KJj2K0j1jPkoRlJ1j4J1jqlRJ0rLj0JKOpMKj9J0Lj2MpJ1J1k2%MmJ3K
7620BrmJ6qKNrJ6nKmpNK%MmOpokPmJ0pLmKKk%j0LLj1RmOjj%pJ4j0RJmlJ2j6NQ
7672EqRJmJjKJ2j8JNnQKj5MqMJ1qLoJ1npjLnJj%jRjj0LPmkJ4JjKLj0KL%MOj6Q
$$ plain form
7322 -1 1 2 16 -20 -4 -8 2 -1 -1 -1 0 9 4 -12 -1 9 5 7 12 15 2 5 -3 3 7 14 7 12 5 10 7 3 6 2 -4 1 -13 -4 -5 4 -10 -7 -2 7 4 -5 1 -11 0
7371 0 -6 3 -9 -7 -8 12 12 4 2 4 9 2 6 -2 5 0 -2 13 3 8 6 12 10 5 4 15 2 -8 2 -5 -4 -5 -2 -1 -5 -8 0 9 5 -5 4 1 -2 -1 -10 -2 -2 -17 9 3
7421 3 1 4 9 -2 8 7 7 12 5 7 8 7 21 9 8 7 5 13 8 6 -7 -1 -4 -2 -2 4 -4 0 5 0 -15 -6 3 -7 -8 -1 1 6 -1 6 12 5 -1 12 2 3 5 12 2 -4 9
7472 9 10 6 14 8 3 1 2 3 3 0 -3 3 -2 -6 -4 2 -7 -3 -10 -6 0 0 0 6 5 -14 1 -12 -8 2 -1 -2 5 9 5 9 -4 7 4 2 4 3 4 1 9 10 -3 -10 5 2 15 -2
7524 -2 -4 1 -7 5 2 -1 -1 -8 -2 -6 -9 -7 -9 -1 -3 -7 -5 6 0 2 -7 11 8 3 6 6 11 3 -3 9 -6 7 7 1 5 1 -10 2 8 7 2 -11 14 -3 6 -1 0 0 -4 -7
7574 -7 -3 -5 -3 -3 -1 0 -12 8 -3 -4 3 1 -5 4 1 12 -2 9 8 0 -3 6 16 7 10 0 1 3 9 2 6 8 -11 -1 2 -10 -6 -13 -2 9 -13 -13 -9 -13 0 2
7620 2 -7 -11 5 -3 -1 4 -5 11 6 8 4 -3 2 4 4 8 4 10 3 -3 -5 2 -2 8 1 4 0 2 4 2 2 -8 -5 -2 -13 -4 -8 -2 -3 -4 -4 -11 3 -7 2 3 -1 -4 8 -8 -3 5
7672 5 -3 6 7 3 4 3 5 17 -1 0 5 0 8 10 -5 -1 -9 -5 6 -2 1 -5 6 1 -6 -7 -4 -9 -8 -9 -9 -10 -1 -2 -12 -9 -2 -6 -8 6 7 6 8 11 1 3 6 6 10 16 0 8
7724Hj1QpKPJq%Omj4QLpJ0j1nmK2jj0OMoQpPoLJ1jnKj7K0r%MJ%jlJ2j1%Oj4LJ
7773AjKrJ2nj0J3j7K1j6J3mm%J0j2Pm%J1j3J3lmJ0oKqQJ2j8%RmJllkPj0KNlpO
7818apKRqMml%QrKQoJLkPrOoQL%mQKJKKj8J3JMnppJ0moKkOpJ0jj6J1kRj0qJ1P
7871Hj8J0LQj3LKKKkoJ3j2LjJ1kjoJMLj4K%kNjJOj4nLpJ0nJ0j8J3%j2J2J4j3q
7916a1NNQqLPnRrQo%Oo%MnlmNlklQqKQMjj5LJ0rLj4J8mrJ1JpkJ1jNnJ1jOj4Rn
7968A0mJ1oqmNnkMMkkLn%Mkj0OjmPnPoMPj0Kj1J7oNkJ2oj2J3KpoP%jJ4llQj7k
8018@RnN%okmPnkmmMQJrkL%%nQMqQlmJ1mMlqJ0oJ1m%%MnLnjj3J7%pNj1KQj4QO
8072Bj4K0j6Qj0RrjLmNM%oQpOP%lLJ0pkKJ1j1KrJ0lj8J2nRj3QPj3olMRj4J3Nk
$$ plain form
7724 8 -3 5 -2 0 7 8 0 0 6 2 -12 -4 -1 -8 2 -9 -14 -18 4 3 -7 -1 3 -3 5 -2 5 -1 2 13 12 7 9 -8 12 3 3 7 8 8 7 4 16 5 5 11 -3 0 1
7773 1 0 2 -7 5 0 -10 3 -14 7 -9 4 0 -4 -4 6 -6 1 -3 -3 8 -5 8 5 1 11 5 7 -1 7 19 1 1 10 6 7 4 1 -1 6 -4 -2 3 0 -7 -1
7818 -1 -8 -6 3 -5 -1 -5 -8 -8 0 -9 -7 1 -5 -4 -1 -3 4 -5 1 -5 3 6 6 2 10 12 13 15 17 -1 12 13 17 12 5 -2 8 4 -2 0 -2 4 -3 7 6 -10 1 -1 8 -2 -10 1 8
7871 8 -10 0 3 11 -2 1 3 5 7 5 -1 12 0 3 2 13 11 10 4 5 9 12 -2 0 0 -2 3 2 3 9 -5 -10 -7 -14 -4 -9 1 -17 -4 -4 -16 -4 10 -3 -11
7916 -11 -6 -1 7 -1 2 9 4 13 4 12 6 6 12 6 6 10 5 2 -2 3 0 -2 -5 3 -5 -3 5 9 8 -7 -4 6 -3 0 -14 4 0 -9 2 3 -4 -6 5 4 9 4 15 14 20 6 15 10
7968 10 6 17 11 3 -1 4 -1 -3 1 5 3 1 4 -1 -1 3 1 -9 -3 -4 -8 -1 -6 1 -5 -1 6 -4 -2 -13 4 -2 3 1 13 7 -5 8 10 3 -3 4 4 3 17 14 11 19 2 0
8018 0 9 4 9 9 3 1 -3 4 -1 -3 -7 -11 -7 1 2 -7 -9 -6 -6 -6 -11 -3 1 -7 1 -2 -6 5 1 5 2 -6 4 -2 9 5 5 5 9 4 7 2 1 -12 5 5 -2 3 -8 -6 2 -12 -4 2
8072 2 -12 8 -8 0 -10 -1 -10 -11 -8 -12 -7 -3 -3 -9 -1 -8 -2 5 5 2 5 15 8 6 8 19 8 10 1 11 8 -10 2 -3 6 -7 1 8 -5 -11 -14 -10 -1 -15 -2 3 1
8119AmoMNnJNj3%J5j0R%jMkOJNmpPqLnlNnOpLJj0jJ7k0J1j0LQj5J6rMLOlJ0j5
8168dOM%MqMJkOnkkJ1Jj7QmjNmkjQ
$$ plain form
8119 1 -3 -9 -5 0 -5 -4 1 -12 -12 3 -7 2 2 1 5 3 9 10 15 11 4 11 3 6 1 -2 3 -2 4 -3 0 1 -9 -10 7 -13 -2 -12 -9 -1 -16 0 -9 -5 -2 4 1 11 -4
8168 -4 2 6 6 10 2 6 7 5 11 6 4 2 13 14 -3 5 1 0 5 1 -1 -2 6
8191F
$$ Imaginary data points
##PAGE= N=2
##DATA TABLE= (X++(I..I)), XYDATA
0@%%%%%%%%%qJ6j6J6k4L2m0M8n6P2q8J12j36J60j92K24k62L04l54M10m70N40o16
32c28P02p98R02j016J144j285J440j609J792j993K215k454K717l005L319l663
48a920M037m448M897n392N939o546P223p980Q835r808J0924j2221J3752j5590
62h298J7844k0684K4387k9441L6810m8727P2325j92618K54666r2824r0285L03215
74B26370m87504M18969j53427j89752M02054l50362K38350l5673l32989M76868
84B12904l11968J05744J15172l37493M18021k61102n8018K86721l37677L27316
94A59620j75697j52225L69927l38106J96405j5782k11323L83776l33740Q3565
104c3580J41394k60014L31094k61339m270K55362l19163K55245j31321p7518L00006
$$ plain form
0 0 0 0 0 0 0 0 0 0 0 -8 8 -8 8 -16 16 -24 24 -32 40 -48 64 -72 88 -104 120 -142 162 -192 218 -252 288 -328
32 -328 374 -424 478 -538 606 -679 761 -848 944 -1049 1166 -1288 1429 -1576 1743 -1920
48 -1920 2117 -2331 2566 -2826 3113 -3433 3790 -4190 4645 -5163 5761 -6460 7292 -8298
62 -8298 9546 -11138 13249 -16192 20618 -28109 44216 -148402 106264 13440 -76845 226370
74 226370 -261134 157835 4408 -185344 216710 -133652 104698 69025 -263964 212904
84 212904 -99064 6680 121852 -215641 202380 -58722 -116740 169981 -167696 159620
94 159620 -16077 -168302 201625 -136481 59924 44142 -167181 216595 -117145 -33580
104 -33580 107814 -152200 178894 -82445 -86715 168647 -150516 104729 -26592 -104110 195896
115A95896l45252J82228J4853j65104K93908l06366J18293J27962k54948K66263
125A27733k07422M0819J91594l08587K36400q9485n9720K18702k99299J97004
135D7739R051j62653K32328k37356J30306P6719k32652K39541j55658L4914J25270
146A07549k50448K27648q1855o5932J68774k25779J82028k1587j42693K06121
156A03826j83118J04862L5553j81269K21241j39291J7332R6580j88723K00576
166H7569r4346n6082J53195j80922J48060m0056j05157J88202j65901Q1843K5047
177D1452j34984J90190j39189J9702Q8882j53079J62563r4861l0736J34326j60246
188g5980J19703l6392p1498J52851j51248P4183K3764j05197J47758j22147L0135
$$ plain form
115 195896 -149356 32872 47725 -117379 176529 -129837 -11544 116418 -138530 127733
125 127733 -79689 -38870 152724 -155863 80537 -8948 -68668 150034 -149265 47739
135 47739 56790 -105863 126465 -110891 19415 96134 -136518 103023 -52635 -17721 107549
146 107549 -142899 84749 2894 -63038 105736 -120043 61985 40398 -102295 103826
156 103826 -79292 25570 61123 -120146 101095 -38196 -20864 75716 -113007 87569
166 87569 -6777 -62859 90336 -90586 57474 17418 -87739 100463 -65438 16405 41452
177 41452 -93532 96658 -42531 -22829 66053 -87026 75537 -19324 -50060 84266 -75980
188 -75980 43723 7331 -64167 88684 -62564 11619 35383 -69814 77944 -44203 -14068
199a4068P1950j28483J28006p7427j2434J01417j35446J01082k8075n2387J14070
210F8205j23848O9366J6082q5376J14892r7031L2756N0363j05327J06418o2353
221a5853o217P4581j09296Q8778k6815m2011Q9911r9329O2238O082o8865R5740
233D8944p9747K9731L4806q3472R0466n4710l056N7392q6079P4620k7377l0785
245b9267P1556p8978N1335j90n0489P5487o4371K5173K3755o1093O9440m4859
257a2501O43M1470o3253N6054k3269j9493N1430n8283L8640k389l3970N3625m7686
270a8982K0103J5261m2261M9211l3442K827K7820m4449M0251j7995j1667L4939
282B1616m1302K8551l336k2343L6784l3862J5630Q891k8216L3784k3728L449J7326
$$ plain form
199 -14068 57882 -70601 57405 -20022 -32456 68961 -66485 34597 6522 -45865 68205
210 68205 -55643 13723 29805 -55571 59321 -37710 -4954 45409 -59918 46500 -15853
221 -15853 -22070 52511 -56785 31993 5178 -36833 53078 -46251 15987 22069 -46796 48944
233 48944 -30803 -1072 33734 -49738 40728 -13982 -17038 40354 -45725 28895 1518 -29267
245 -29267 42289 -36689 14646 14456 -36033 39454 -24917 256 24011 -37082 32358 -12501
257 -12501 -11858 29612 -33641 22413 -856 -20349 31081 -27202 11438 9049 -24921 28704 -18982
270 -18982 1121 16382 -25879 23332 -10110 -7283 20537 -23912 16339 -1656 -13323 21616
282 21616 -19686 8865 5529 -16814 19970 -13892 1738 10629 -17587 16197 -7531 -4082 13244
295A3244k9173K7197j2996o293K1557k6131J8677l258j2648K1690k0231R809M131
308E575j5077J8333j3039K399Q167j3978J3020o411k314Q916j0660P461j492m233
322c333P183o394K897J088l601L860k321K37J071j043K22L80q5j044K272k495
338a106J041J695m340N290l593m18N072p897P075k514l945R244j0605O838P67
353B604q755J3194j1608M227N853j3940J5864j0242p19J2105j8440J6262o111
366B94p542J8324k0903J3622N42j5109K3116k0478Q022Q775k2104K5478j6887
379d850l8J7556k7377K4580j0023r754K5536k9723J9977n35j9698L1218k8352
392a1483J2069J0333k8502L3752k3260J518K1501l4984L2340j4409j0745L1431
$$ plain form
295 13244 -15929 11268 -1728 -8021 13536 -12595 6082 2824 -9824 11866 -8365 1444 5575
308 5575 -9502 8831 -4208 -1809 6358 -7620 5400 -1011 -3325 5591 -5069 2392 900 -3333
322 -3333 3850 -2544 353 1441 -2160 1700 -621 -384 687 -356 -134 246 161 -883 1389 -1106
338 -1106 -65 1630 -2710 2580 -1013 -1431 3641 -4256 2819 305 -3640 5604 -5001 1837 2604
353 2604 -6151 7043 -4565 -338 5515 -8425 7439 -2803 -3522 8583 -9857 6405 294
366 294 -7248 11076 -9827 3795 4337 -10772 12344 -8134 -112 8663 -13441 12037 -4850
379 -4850 -4888 12668 -14709 9871 -152 -9906 15630 -14093 5884 5349 -14349 16869 -11483
392 -11483 586 10919 -17583 16169 -7091 -5573 15928 -19056 13284 -1125 -11870 19561
404A9561l7793K6526k571k3080L8435l6091J6771J0803l3846M1456k9784L952
416e661K4209m1514L9646j9140j0648L5862m4635L2652n209k5029M3896m2449
428a8020K1186J0218l7213M7121l5092O510K5358m5705M4953k3161r733L8348
440B4770m9262L7307p855k5620M7480m7272K4966R090l9240N1525l9870R314K5851
453B1184m9163M9892k7478q159M0497n4051M2402j1126k5572N1030n2939K9820
465F337P354m1036N6062m5477J3323K5683n2632N4901l2076n575M1425n8331M7459
478A7417j4426k4698N2604n6892L4399M889m1494N8188m8584J6966K3537n3607
490c1701N7686l4679l251L9712n9080N0675j7360k3411N2043n7494L7461J308
$$ plain form
404 19561 -18232 8294 5723 -17357 21078 -15013 1758 12561 -21285 20171 -9613 -5661
416 -5661 18548 -22966 16680 -2460 -13108 22754 -21881 10771 5562 -19467 24429 -18020
428 -18020 3166 13384 -23829 23292 -11800 -5290 20068 -25637 19316 -3845 -13578 24770
440 24770 -24492 12815 4960 -20660 26820 -20452 4514 13604 -25636 25889 -13981 -4667 21184
453 21184 -27979 21913 -5565 -13724 26773 -27278 15124 3998 -21574 29456 -23483 6337
465 6337 13691 -27345 28717 -16760 -3437 22246 -30386 24515 -7561 -13136 28289 -30042 17417
478 17417 2991 -21707 30897 -25995 8404 13293 -28201 29987 -18597 -1631 21906 -31701
490 -31701 25985 -8694 -11945 27767 -31313 19362 2002 -21409 30634 -26860 10601 11909
502A1909m0576N9512n0102J9242K0306n2651O0596l8159j610L8548n8735N3839
514B2119k2320k1677N3676n9235L9854l003l8362O2634n4657K1341J8641n0959
526c1948O3067m4247J578L9492n9390N4830k7087j7034N4807o2777M0855m672
538G474l3862O1417n9108K4659J8801m9011N9774m6575P424L8093o0555N2760
550B1291k6325j1336M9795o4593M3074l456l1494N4930n8546L0478J6638n0229
562b9773N6591m3462J2735L1420o2044N5859k4397j0243M2548o3037N0137o750
574I584l3977N2821n4490L5672Q241n1473O1444m1723J2512K3404n8321O3091
586B6785k9122j3164M0712n6319N2938j6335l3155N7084n1034L2213L21m3818
$$ plain form
502 11909 -28667 30845 -19257 -15 20291 -32360 28236 -9923 -11533 27015 -31720 22119
514 22119 -201 -21878 31798 -27437 12417 9414 -28948 33686 -20971 370 19011 -31948
526 -31948 31119 -13128 -11550 27942 -31448 23382 -3705 -20739 34068 -28709 12146 7474
538 7474 -26388 35029 -24079 580 19381 -29630 30144 -16431 -9007 29086 -31469 21291
550 21291 -5034 -16370 33425 -31168 11906 8450 -23044 31886 -26660 3818 20456 -29773
562 -29773 26818 -16644 -3909 27511 -34533 21326 -3071 -13314 29234 -33803 16334 9584
574 9584 -24393 28428 -26062 9610 17851 -33622 27822 -13901 -1389 22015 -36306 26785
586 26785 -2337 -15501 25211 -31108 21830 5495 -27660 29424 -21610 10603 10924 -32894
598c2894O5483m5477Q155K2166m7935O0696l7200j1211M4243n0648M4777k1786
610a631k3305N8347n3603K5629J681l2304N9433n2093J0271K7093m3158N0110
622B6470m0157p87M5003n4879L8339j7755j2899N0873o0506K9693P471l0230M8632
635B9268n3329K1704K6342m9091M5342l4336Q232L5453o0338M3794j2093j2746
647a1798L9127n7886L9920M929l5604M3499m4004K7456J5132n0817M9085k6970
659g931N595K3182n2779N0133j4073j8490L3967m4855M0667n273l5352M6212l5178
672a4175K0974N126m1021N2748k8694j229K0675l9585M7699k3051j7379L7893
684A9981l8017L2609j2339k5444M8941l8457J4874N412k9759M8672l6651J204
$$ plain form
598 -32894 32589 -12888 -4733 17433 -30502 30194 -7006 -18217 26026 -24622 20155 -1631
610 -1631 -24936 33411 -20192 5437 7118 -25186 34247 -17846 -7575 19518 -23640 26470
622 26470 -13687 -14474 30529 -24350 13989 -3766 -16665 34208 -26298 3395 10866 -19364 29268
635 29268 -24061 -2357 23985 -25106 20236 -14100 -5868 29585 -30753 13041 948 -11798
647 -11798 27329 -30557 9363 14292 -21312 22187 -21817 5639 20771 -30046 19039 -7931
659 -7931 -2336 20846 -31933 18200 4127 -14363 19604 -25251 15416 10143 -25209 21003 -14175
672 -14175 6799 11925 -29096 23652 -5042 -6271 14404 -25181 22518 -533 -17912 19981
684 19981 -18036 14573 2234 -23210 25731 -12726 2148 7560 -22199 26473 -10178 -8974
696h974K5017l5088L9144k7258p634L8661m1312K7063r980j5718M2383m3339J7141
709A06R521k5986L8362l6477R076K3884l6487L2185k1690n58L0224m2002K7130
722G288m812j3517L1306l8880K1616Q365k6857L1269k8438J2364J6204l5318L1419
735A2009j6000r70K1302l6211K9455n721j5090K6517l1203K2426K214k5386L1300
748A4642k4037J0606R863k9737L2674j7157k496J8310k9473K8502j0297j3103
760a1703K6126k7127J9423j886j9726L0240k3654Q442P989k3006K8905j8577j225
773e779J7186k4459K3171j1092q537K3178k4444J5524j677j4139K4745k1999P994
786c28P538j8548K2716j6671J217J4439k1451J8916r234n250J8371k1886J4281
$$ plain form
696 -8974 16043 -19045 20099 -7159 -14793 23868 -17444 9619 -361 -16079 26304 -17035 106
709 106 9627 -16359 22003 -14474 -5398 18486 -18001 14184 -7506 -8064 22160 -19842 7288
722 7288 2476 -11041 20265 -18615 3001 11366 -15491 15778 -12660 -296 15908 -19410 12009
735 12009 -3991 -4961 16341 -19870 9585 3864 -11226 15291 -15912 6514 8728 -16658 14642
748 14642 -9395 1211 11074 -18663 14011 -3146 -5642 12668 -16805 11697 1400 -11703
760 -11703 14423 -12704 6719 4833 -14893 15347 -8307 135 8124 -14882 14023 -4554 -5779
773 -5779 11407 -13052 10119 -973 -9510 13668 -10776 4748 3071 -11068 13677 -8322 -328
786 -328 7210 -11338 11378 -5293 -4076 10363 -11088 7828 -1406 -6656 11715 -10171 4110
799D110j306j1364J9749j9354Q919N624j6249J9310j4470K797J0875j8923J7414
812G132q461l674J4506j8892J3862k307r438J6488j6400Q776L235j3365J6628
825H090j2384K963P826j5053J4879p642k587J1208j4734J1447k702o997J2924
838G238j2784P009J880r802J2867r822K495N659j1089J1335o286j522Q316j1075
852e581Q771k517m791R668r931N665J004p036R706p854K462L871q235Q735n259
867a322n15N881q398O982k422l059O943p532M672K29m805O959n857K191K303n551
883c301O093l819k8L628n392M613j770j691M130m523K867o5k581L845l252J256
899A0J098k758L057j951M8J658k441K073q30o44J641j750J086p2q12J192r76L97
$$ plain form
799 4110 2804 -8560 11189 -8165 754 6378 -9871 9439 -5031 -2234 8641 -10282 7132
812 7132 -1329 -5003 9503 -9389 4473 2166 -7272 9216 -7184 1592 4827 -8538 8090
825 8090 -4294 -1331 6495 -8558 6321 -1321 -3908 7300 -7434 4013 1311 -5686 7238
838 7238 -5546 1463 3343 -6459 6408 -3414 -919 4740 -6349 4986 -1300 -2822 5494 -5581
852 -5581 3190 673 -4118 5550 -4381 1284 2288 -4748 4958 -2896 -434 3437 -4798 3937 -1322
867 -1322 -1837 4044 -4354 2628 206 -2853 4090 -3442 1230 1459 -3346 3613 -2244 -53 2250 -3301
883 -3301 2792 -1027 -1055 2573 -2819 1794 24 -1667 2463 -2060 807 742 -1839 2006 -1246 10
899 10 1108 -1650 1407 -544 -496 1162 -1279 794 -36 -680 961 -789 297 225 -587 605 -371 26
917B6K02n41N61l33N2R1l9p5P4J12l99O15n36P4O13j147J181o12l86J374j810
938i03J388k38j180K197k264J209N35k203K957k342N38J699l287L365j827o77
954a033L012m031L183p69k128M169m336K458O95l662N031m062J124K468n041N330
970B408l092o97M293n988M912j489k757N850o299L802N51m796O923n847J976K936
986B686o616P288m547m03N288p802O690k435l047P233q104N197K07n624Q516p456
1002b929K886L124p770Q838n774m2N932r120Q061l221l193Q216r457O303j57o177
1018d480R700q725L651L189q648J0146o888L50O391j0240R402m171l124R066j0835
1033e216P588p96o499J0935j0289M794K970r419J1607q427J221O650j1432J0982
$$ plain form
917 26 228 -313 248 -85 -33 58 19 -56 18 130 -269 346 -190 -116 497 -650 531 -81 -467 907 -903
938 -903 485 247 -933 1264 -1000 209 744 -1459 1498 -844 -306 1393 -1894 1471 -356 -1033
954 -1033 1979 -2052 1131 362 -1766 2403 -1933 525 1220 -2442 2589 -1473 -349 2119 -2922 2408
970 2408 -684 -1381 2912 -3076 1836 347 -2410 3440 -2859 943 1494 -3302 3621 -2226 -250 2686
986 2686 -3930 3358 -1189 -1592 3696 -4106 2584 149 -2898 4335 -3769 1428 1635 -3989 4527 -2929
1002 -2929 -43 3081 -4689 4149 -1625 -1667 4265 -4855 3206 -15 -3208 5008 -4449 1854 1697 -4480
1018 -4480 5220 -3505 146 3335 -5313 4833 -2055 -1705 4686 -5554 3848 -323 -3447 5619 -5216
1033 -5216 2372 1576 -4923 6012 -4277 517 3487 -5932 5675 -2752 -1531 5119 -6313 4669
1047D669n473k689R748j2275R044j659o504J1824j1718O000K575r857J2589r610
1061c336K080O611j2162J1894o236k201R822j3025R939k136o430J2028j2330O832
1075A350K182j0106J3052j0127K749O220j2562J2757o844j868R666j3491J1085
1088D063l010o421J2438j2946P936J163j0249J4154j1133L518N509j2729J4221
1101F514q357j393R746j3826J2297m680n910J3233j3776Q653pr535J5003j2515
1115d553M037N244j2143J4513r828n17J0042j3851J2047n526m601J3295j4554
1128f395Q543K7q351J4304j3488M852N570j1890J3480j0212J103R745j4672J1844
1142D460n209l247J2097j5595R898K30q289J3145j3849P058M735j2911J3671r917
$$ plain form
1047 4669 -804 -3493 6255 -6020 3024 1365 -5139 6685 -5033 967 3542 -6315 6274 -3336
1061 -3336 -1256 5355 -6807 5087 -1149 -3350 6472 -6553 3386 1250 -5180 6848 -5482 1350
1075 1350 3532 -6574 6478 -3649 -900 5320 -7242 5515 -1329 -3197 6469 -7022 4063
1088 4063 1053 -5368 7070 -5876 2060 3223 -7026 7128 -4005 -487 5022 -7707 6514
1101 6514 -1843 -3236 6510 -7316 4981 301 -5609 7624 -6152 2501 2494 -7041 7962 -4553
1115 -4553 -516 4728 -7415 7098 -2730 -3247 6795 -7056 4991 -535 -5136 8159 -6395
1128 -6395 2148 2175 -6176 8128 -5360 -508 5062 -6828 6652 -3560 -2457 7288 -7384 4460
1142 4460 -749 -3996 8101 -7494 2404 2634 -5655 7490 -6359 699 5434 -7477 6194 -3723
1156c723K698P899j5571J3745n336l159J0512j5400J2330j251r073J3138j2885
1169f076Q367K224j3058J5274r585K240N863j4076J5369o683m099J0243j3149
1182g146J2347l716q619J4322j1838O777M81j0643J6051j0734R13O078j1357J4365
1196G281q918l285J1580j2339J0232m962n843J4826j3479N743J140q086J4697
1209H587j3190K452P434j1136J2273r950m9J1596j4349R606m036l284J2724j5589
1223f911P694K339q000J1980j3216N658O757j2824J1286q013J941Q640j5275J1082
1237C138k426l744R516j4060R965J509r506J0803j0194O427L726j2891J2443o191
1251a485O73N821j2970J2668l436n284Q928j0988R985j410r163J2232q952M898
$$ plain form
1156 -3723 -1025 6874 -8697 5048 -288 -3447 7065 -8335 3995 2744 -6329 6809 -6076
1169 -6076 2291 4515 -8543 6731 -2854 -614 5249 -8827 6542 -141 -4240 6003 -7146
1182 -7146 5201 1485 -7134 7188 -4650 2127 2608 -8035 8016 -2718 -1805 4273 -7084 7281
1196 7281 -1637 -4922 6658 -5681 4551 -411 -6254 8572 -4907 836 1976 -6110 8587
1209 8587 -4603 -2151 5283 -5853 6420 -3530 -3579 8017 -6332 3274 -762 -4046 8678 -6911
1223 -6911 783 3122 -4878 7102 -6114 -456 6301 -6523 4763 -3250 -1309 7331 -7944 3138
1237 3138 712 -3032 6484 -7576 2389 3898 -5608 5195 -4999 1428 5154 -7737 4706 -1485
1251 -1485 -812 5009 -7961 4707 1271 -4013 4915 -6073 3912 2502 -6661 5571 -3381 1517
1265A517J412j0347J3774p739n13N724j0203J2293o323m372J0284j0182Q295l212
1279D08o324J2858j0439L844J699p602J2430r783N32O795r279R824o909j729J0029
1294F354j0962O807k109m039J0623j1170M438K821o925R548r065K391O194r691
1308d785Q264n192l23P716j0984P214j030l883Q161j0024N803K095p347Q502p465
1323c278L295M100r490Q821m479l66N697r697Q244j916m103P374q462O186K23
1338B149o713Q723o709K870K526p830Q959m934o40N023p821P569k925l397P106
1353C956p289N030m69n111Q034o412K196K266o096P603m992l07M759o663O117
1368B622k889k264O288o732M220l65l851O721o141K363K075n229O349m721N23
$$ plain form
1265 1517 2929 -7418 6356 -1383 -1896 3828 -6375 5918 -405 -4777 5507 -4675 3620 408
1279 408 -5916 6942 -3497 347 2046 -5556 6874 -2909 -2377 4418 -4861 4963 -1946 -3675 6354
1294 6354 -4608 2199 90 -3949 6674 -4496 -58 2763 -4162 5386 -3679 -1288 4906 -4785
1308 -4785 3479 -1713 -2036 5680 -5304 1910 880 -3003 5158 -4866 937 3032 -4315 4187 -3278
1323 -3278 17 4117 -5373 3448 -1031 -1397 4300 -5397 2847 931 -3172 4202 -4260 1926 2149
1338 2149 -4564 4159 -2550 320 2846 -4984 3975 -959 -1599 3424 -4397 3172 247 -3150 3956
1353 3956 -3333 1697 1228 -3883 4151 -2261 -65 2201 -3895 3708 -1284 -1591 3168 -3495 2622
1368 2622 -267 -2531 3757 -2975 1245 880 -2971 3750 -2391 -28 2047 -3182 3167 -1554 -1031
1383a031L978o151N469k681j373N080o270M262n22l164N568n558K744J392m571
1398b828N527m167R11K935n310M974k431j009L982n198L882o96k587M528m465
1413a952K392Q70l662M588l380P38K204m125M056k054p83L130m031L107p22j977
1429a601L637l578J940N34k753L671k826P17J608l159L262j865l87K388l220K574
1445I42q02j295K761k922J727K21j997K815k321P70J082k348K506j523j14J642
1461A144k351J946o73q40J895k037J248Q0j317J881j540N20O74j499J584r46q2
1478c13R97j405J154l96m95J090j152O95L7p03J003q19K84L31p50P87m57l3M45
1497C00o03N01j87j73L86l90K32j3j67K44j72M0N5o2J4L5m1k3J35k14J46L9k51
$$ plain form
1383 -1031 2947 -3204 2265 -416 -1789 3291 -2979 1283 761 -2403 3165 -2393 351 1743 -2828
1398 -2828 2699 -1468 -557 2378 -2932 2042 -389 -1398 2584 -2614 1268 572 -2015 2513 -1952
1413 -1952 440 1310 -2352 2236 -1144 -406 1798 -2327 1729 -325 -1108 2022 -2009 1098 376 -1601
1429 -1601 2036 -1542 398 932 -1821 1850 -976 -259 1349 -1810 1452 -413 -800 1588 -1632 942
1445 942 140 -1155 1606 -1316 411 632 -1365 1450 -871 -101 981 -1367 1139 -384 -498 1144
1461 1144 -1207 739 66 -774 1121 -916 332 412 -905 976 -564 -44 630 -869 715 -231 -313
1478 -313 684 -721 433 37 -458 632 -520 175 212 -491 512 -307 -23 308 -442 345 -112 -145 300
1497 300 -303 198 11 -162 224 -166 66 53 -114 130 -42 -2 53 -9 5 40 -1 -24 111 -103 43 82 -169
1520a69L75l29Q8K36n00N53l30r3N18p52O29j72m02Q41r09N38J33p85J106q96
1540c20K52N53j150J227p14j56J000j416J183l63o77J444j555R27J67j237J755
1557I20j466M82P68j715J879j155j37J391k046J756o20q56J974k195J383J04j579
1574a112K351k031P49R15k200K487j591o6J713k594K284q77r85K421k718J758
1590E04L1j848K832k499R97R96k566K959j970M0J935l048K755j159j012K729l190
1607a514K177j45k013L256k980J310R79k854L457k448K65K059l446L267j571r15
1623a116L019l710K692m21k073L644l516J721Q86l055L856k892N20K132l763L638
1639A562j874p94L162m050K994n63k099L840l849J983Q48l212M064l122P24K134
$$ plain form
1520 -169 206 -123 -35 201 -299 254 -76 -169 349 -403 226 54 -348 493 -416 122 255 -530 576 -320
1540 -320 -68 485 -665 562 -152 -308 692 -724 459 96 -581 863 -692 235 402 -835 920
1557 920 -546 -64 704 -1011 868 -287 -424 967 -1079 677 57 -799 1175 -1020 363 467 -1112
1574 -1112 1239 -792 -43 872 -1328 1159 -432 -498 1215 -1379 905 28 -957 1464 -1254 504
1590 504 535 -1313 1519 -980 17 1013 -1553 1406 -564 -524 1411 -1637 1118 -41 -1053 1676 -1514
1607 -1514 663 518 -1495 1761 -1219 91 1070 -1784 1673 -775 -510 1549 -1897 1370 -201 -1116
1623 -1116 1903 -1807 885 464 -1609 2035 -1481 240 1126 -1929 1927 -965 -445 1687 -2076 1562
1639 1562 -312 -1106 2056 -1994 1000 437 -1662 2178 -1671 312 1160 -2052 2012 -1110 -386 1748
1655A748l997L903k036o95L206m322L330p16k121L943m097K372O31l341M365l408
1671a235J034J927m172M375k429n03L130m496L852j196k062M129m335K780J59
1686I58l282M731l773J256J693m114M747k894l94L175m464M022j653j841M340
1701B507m469K739l0k977M841m084J258J739l845M620l237j10L317m522L836j793
1717b10j388M312m835K809K7k644M582m518J787J757l921M427l466O14L072m950
1733b545M049j808q96L825n238L529q0k673M239m574K588J312m249M546l230R96
1749b09K332n014M632j794j049L271m824M066n28k981M240l984K634N57m112M978
1765B215l050N86J840m366M944k239j387L372m114L870j311k678M712l875K107
$$ plain form
1655 1748 -2249 1654 -382 -1077 2129 -2193 1137 421 -1700 2243 -1854 518 1149 -2192 2173 -1235
1671 -1235 -201 1726 -2446 1929 -500 -1003 2127 -2369 1483 287 -1775 2354 -1981 799 958
1686 958 -2324 2407 -1366 -110 1583 -2531 2216 -678 -1072 2103 -2361 1661 8 -1833 2507
1701 2507 -1962 777 747 -2230 2611 -1473 -215 1524 -2321 2299 -938 -1048 2269 -2253 1583 -210
1717 -210 -1598 2714 -2121 688 715 -1929 2653 -1865 -78 1679 -2242 2185 -1281 -667 2405 -2545
1733 -2545 1504 -304 -1200 2625 -2613 916 836 -1837 2402 -2172 416 1728 -2521 2025 -1205 -209
1749 -209 2123 -2891 1741 -53 -1102 2169 -2655 1411 883 -2098 2142 -1842 792 1349 -2763 2215
1765 2215 -835 -249 1591 -2775 2169 -70 -1457 1915 -2199 1671 360 -2318 2394 -1481 626
1780F26J18l268N240l727L87K028l627M626l129q16L831m159L336j727j613M765
1796B891m654K056L54k486M627m469J105K378l689L888l218K45L580m744L121
1811I85j167r94L839m956K594P76k637L682m052J884K050m161L591k348N39K604
1827B229m806L613p03j338K942m293L239L46l118L551l162K013J023m069M191
1842A658k097J42J804m014M185j366j676K967l478L209p19k760M071l033J575
1857D68L51l121M459k725r2J884l158L825k165j221L307l261K520j014j820L994
1873B231l385J204O30k316L743l072K43K196k954K919k044m57L070l483K106n50
1889H1j239L199l520J497R13k249K934k811Q82J855l143K684j615k3K278l498
$$ plain form
1780 626 744 -2524 2716 -1011 -624 1404 -2223 2403 -726 -1542 2289 -1870 1466 -261 -1874 2891
1796 2891 -1763 293 647 -1839 2788 -1681 -576 1802 -1887 2001 -1217 -972 2608 -2136 985
1811 985 -182 -1176 2663 -2293 301 1077 -1560 2122 -1930 -46 2004 -2157 1434 -914 -375 2229
1827 2229 -2577 1036 333 -1005 1937 -2356 883 1229 -1889 1662 -1500 513 1536 -2533 1658
1842 1658 -439 -297 1507 -2507 1678 312 -1364 1603 -1875 1334 615 -2145 1926 -1107 468
1857 468 819 -2302 2157 -568 -660 1224 -1934 1891 -274 -1495 1812 -1449 1071 57 -1763 2231
1873 2231 -1154 50 680 -1636 2107 -965 -722 1474 -1480 1439 -605 -1062 2008 -1475 631 81
1889 81 -1158 2041 -1479 18 931 -1318 1616 -1195 -313 1542 -1601 1083 -532 -555 1723 -1775
1905a775K482m33j230K533l154K007M70k334K779k373J122J131k941K880j489
1920c25r4J712k947K634p23j263K314k575J903j4k044K749k080Q23P77k347K741
1937A241j536k44J590k353K256r20j021K222k241J489j35j527K480k021O74P45
1953F99j871K319j586k5J467k085J902r52n92J906k154J395j67j134K066j983
1969g95Q39N97j611J959j500K60J144j903J720q70l47J495j923J327j81r51J681
1986I41j687Q58M00j371J649j216K70Q47j567J482p19k99J172j521J162k15p86
2003f00J355j326P16K53j097J388j016K27O32j228J241o67k00R31j231R92k89
2020H1n61J105j123O39J05p97J118r05K94M24r25J001o17o2O84r62P92k76l49
$$ plain form
1905 -1775 707 274 -956 1577 -1577 430 900 -1434 1345 -1028 94 1225 -1716 1164 -325
1920 -325 -419 1293 -1654 980 257 -1006 1308 -1267 636 622 -1422 1327 -753 70 847 -1500 1241
1937 1241 -295 -539 1051 -1302 954 34 -987 1235 -1006 483 348 -1179 1301 -720 -46 699
1953 699 -1172 1147 -439 -464 1003 -1082 820 -132 -724 1182 -972 423 256 -878 1188 -795
1969 -795 44 641 -970 989 -511 -251 893 -1010 710 -160 -507 988 -935 392 211 -740 941
1986 941 -746 112 512 -859 790 -426 -156 691 -876 606 -113 -412 760 -761 401 186 -600
2003 -600 755 -571 145 398 -699 689 -327 -100 532 -696 545 -122 -322 609 -622 370 81
2020 81 -480 625 -498 141 246 -551 567 -338 -44 380 -545 456 -161 -223 461 -501 291 15 -334
2039c34Q12q63N27M7n70Q00o64K28K86o40P08m33k3M50o64N43j86k36N33n76L52
2060I7K5l62N06m25J49J77m14M45k73nK59l82L28j23j20K85l13K02kj76K55k20
2082h7Q6Q3j83J99j26KJ05j39J16m1l7R3q5K6J4l8K0J4l2J0J4l8N7m4j1P3j11
2109f0P8Jr0J53j49P5N7j82K12j42j7J85k70K50q6j27K90l27K21Pk49L82l41J40
2133A1J45l78M43k93KL03m85M33j79j75M60n42L58ol70N83n38K49J79n43O49m56
2155a50M5M06o69O17k59k32O23p44N20l5m61P57o98L21K24o88Q35n78M2N15q51
2176d60P93l51k48P45r05O29p8n20Q95q63M23K15p80R92p31J30N23r52R50n03
2196i6k07Q19j045Q08j79n52J031j038N60J94q43J122q90K07N82j084J104o16
$$ plain form
2039 -334 478 -385 142 189 -381 419 -245 -17 269 -371 337 -96 -119 331 -333 210 24 -212 321 -255 97
2060 97 122 -240 266 -159 -10 167 -247 198 -75 -80 179 -203 125 2 -118 167 -146 56 54 -122 133 -87
2082 -87 -1 82 -101 98 -28 -26 79 -60 56 15 -22 71 -14 12 26 -12 8 22 -10 0 14 -24 33 -11 -22 51 -60
2109 -60 18 19 -71 82 -67 8 65 -117 95 -47 -64 121 -149 101 15 -112 178 -149 72 79 -170 212 -129 11
2133 11 156 -222 221 -72 -70 233 -252 181 2 -173 287 -255 103 97 -273 310 -228 21 200 -343 306 -150
2155 -150 -105 301 -368 249 -10 -242 381 -363 157 122 -339 418 -280 41 265 -423 412 -166 -124 391 -460
2176 -460 333 -18 -266 479 -426 203 125 -395 500 -363 60 275 -505 487 -244 -114 409 -543 407 -96
2196 -96 -303 516 -529 279 100 -452 579 -459 101 295 -548 574 -316 -109 473 -611 493 -123
2214a23j65Q88j187R30k60n40J116j164O38J83r00J218r99K78N93j158J171o92
2232a73j24R26j285J013k90n41J153j270P60J46r61J323j108L97N44j239J322
2249E93p90n4Q96j381J203m18n22J189j366R44j2r51J402j195N16M24j264J465
2267F79r07j7Q57j383J324n61n10J248j391R95j27r21J509j283N01M07j203J531
2285G48j039kR14j351J316o72m31J323j447R51j55q04J517j418N55M34j135J478
2303G82j196J69R54j454J295p29k30J278j644J075j58o84J387j575P99M23j201
2320g09J413j217M21Q07j581J385o72j34J071j680J281j59p74J284j469R83K54
2337E04j315J465j051M24N73j542J565o71k57R39j483J396l43q71J352j280R35
$$ plain form
2214 -123 -288 600 -587 343 83 -457 659 -505 133 316 -584 634 -365 -87 506 -652 519 -173
2232 -173 -297 629 -656 357 67 -474 679 -591 169 315 -646 677 -431 -34 510 -729 593
2249 593 -197 -251 645 -736 467 49 -473 716 -650 294 282 -669 733 -462 54 478 -786 679
2267 679 -228 -245 612 -771 553 -8 -518 730 -661 334 207 -714 795 -488 13 420 -783 748
2285 748 -291 -293 621 -730 586 -86 -517 806 -641 310 155 -649 868 -550 5 439 -696 782
2303 782 -414 -245 709 -745 550 -179 -409 869 -775 300 142 -542 845 -730 69 492 -709
2320 -709 704 -513 -92 715 -866 519 -153 -287 784 -896 385 226 -548 736 -733 250 504
2337 504 -811 654 -397 27 600 -942 623 -48 -305 634 -849 547 204 -667 685 -595 340
2354C40k4j200J662j088K77M43j278J669r47k98J028j280J327o73o48J515j348
2371e23P84j36q63J687j382L00N49j065J474j196j7J131j358J114o94k89J436
2388I52j594P91J3o75J396j527N42O81j176J199j071K67J001j547J084m28k01
2405b93J092j616J001J46q18J139j322P78M78j317J220q19L22O37j503J335m11
2422D9l27Q46j362J232j43r02J168j068P91Q6j184J436q37J84M32j198J440o66
2440b3l88R07j101J097m16p31J312j048N57%q48J416j005Q7N68r61J215q33k21
2459d16J030j084Q26m00m38J222j167M80J43o74J163j087K42O30r51R61p62L3
2477b49Q71j172Q14k93k94R67j223O86J40o69R50r95M83M29j000R63o45J35O16
$$ plain form
2354 340 316 -884 778 -310 -33 410 -868 801 -146 -444 584 -696 631 -42 -690 825 -523
2371 -523 261 125 -738 949 -433 -133 416 -649 825 -371 -388 743 -615 499 -195 -484 952
2388 952 -642 149 162 -513 883 -644 -102 579 -597 602 -469 -202 799 -748 336 -92 -293
2405 -293 799 -817 184 330 -488 651 -671 107 585 -732 488 -331 -9 628 -875 460 49
2422 49 -278 568 -794 438 295 -607 561 -507 284 370 -814 622 -215 -31 401 -797 643 -23
2440 -23 -411 496 -605 492 76 -655 657 -391 166 166 -682 734 -271 -184 384 -577 638 -195 -416
2459 -416 614 -470 356 -44 -482 740 -427 53 196 -478 685 -402 -160 470 -481 480 -282 -249
2477 -249 622 -550 264 -29 -323 644 -579 107 247 -422 528 -467 16 445 -555 408 -237 -102 514
2496E14j136R38k72l12P52j016P58J0o80R00q00M51K28q91R85n62L7M74r16R09
2516C71l45l41P24q23O56j09n83R02p32L28J75p04R17o12L0M78p79Q00m14k23
2536b84P06p81N70j57m01P97p40L46J34n54P93o55J50L87o74O68m03q0N59p43
2556c62N52j49k98O43o99L77J12m90O46n53J74L14o11N92l36n4M36o22M90j26
2576C6k64N26n73L51O0m16N59m56J76K19n06N24k96m8L62n22M51j53k06M39m79
2597b16L17j5l04M62m04J62J45l85M49k93lK65m03L68j68j16L33l93K72j8k22
2618a67L55l17J41J04k98L44k29J9K02l14K82j27p7K38k87J89pj67K58k26Q8Q4
2640H8k11K29j61K7J26k11J79p5n9J55j78J27k4r4J54j33P2L1j16J43r6J0P4j20
$$ plain form
2496 514 -622 316 44 -268 484 -532 226 236 -444 456 -344 107 335 -556 429 -133 -96 378 -538 371
2516 371 26 -315 409 -414 242 133 -450 452 -280 48 223 -481 436 -176 -146 332 -447 353 -61 -284
2536 -284 422 -359 211 54 -347 450 -290 56 190 -364 429 -226 -76 311 -363 305 -98 -178 381 -362
2556 -362 190 41 -257 386 -313 64 176 -314 332 -221 -47 267 -344 248 -88 -142 294 -328 162 36
2576 36 -228 298 -275 76 136 -280 279 -177 -1 218 -288 236 -60 -108 254 -268 183 30 -176 263 -216
2597 -216 101 86 -218 244 -160 2 147 -238 211 -82 -85 180 -223 145 -23 -139 194 -199 73 55 -167
2618 -167 188 -129 12 116 -182 162 -67 -48 154 -160 122 -5 -82 156 -131 58 51 -116 142 -84 4 88
2640 88 -123 106 -55 -28 98 -113 66 -9 -68 87 -91 36 12 -82 72 -61 11 42 -74 69 -27 -17 57 -63
2664f3J08n3k1O8q6P2pm2Q5p9K2K0m6N3l3jK6m1K5Lj9J4%j6J5mqJ9k0J0Lm1M7
2697A0l4KN2p3O8k7l1P7q3M4L1q0J07r4L0N8j18J17o0k2J03j51J25k1q9J67j82
2724g4Q2L9j41J83j49M0R5j95K09j22l3J77k32J85m6j32K47k38J32L4j91K64j96
2747f2M0J44k73K81j54m6K17l01K48o9j52L02l02J76M7k62L56l00Q8J55l22L56
2769A67k25k5K54l66L01j03j51L54l89K49kk57L97l49J34J37l45M09k73J3K75
2790B05m33L80j54j46M08m55K82Nk87M52m03J55J58l99M63l25QL29m97M32j89
2811a1j45M29n13L34j4l10M89m59K13J54m42N11l60N3L04n31M99k27j32M47n66
2832b77M16n9l12N31n24K88J15m71N76m14R3K85n59N59k81j25M44n80M65j15l18
$$ plain form
2664 -63 45 -8 -29 39 -47 25 18 -24 61 -18 4 24 -22 31 -2 -3 23 -18 7 10 -9 5 5 -11 4 0 -8 11 -9 1 4 -37 10
2697 10 -24 -22 30 -43 25 -2 -33 44 -39 5 36 -44 63 -31 -1 57 -61 56 -4 -26 77 -74 51 30 -59 108 -74
2724 -74 8 47 -94 89 -60 -20 75 -120 89 -33 -66 111 -121 64 18 -114 133 -105 27 61 -130 134 -62
2747 -62 -22 122 -151 130 -24 -70 147 -154 94 25 -127 175 -127 49 96 -166 190 -110 -22 133 -189 167
2769 167 -58 -83 171 -195 106 3 -148 206 -183 66 64 -193 204 -145 -11 126 -219 190 -83 -70 205
2790 205 -228 152 -2 -148 260 -195 87 92 -195 257 -146 9 167 -232 231 -94 -86 243 -254 178 -11
2811 -11 -156 273 -240 94 80 -230 259 -200 13 167 -275 236 -124 -71 233 -298 201 -26 -158 289 -277
2832 -277 139 80 -232 299 -225 63 178 -293 283 -131 -38 247 -312 247 -34 -159 285 -295 170 55 -263
2853b63N70n43K96P6m63O29m49Q1K77n35O01l46j11M75n92M88j68k85O10n94K94
2874D8Q1m27O46n29J23K99n41N94l97n5M98o47M89j82k24N94o65L61O2m09O14
2895C33n91K28K88n92N98m13L6M41p00N38j63j93N24o78M49O1m51N99n58K78K24
2916B58o23O34l70K2L83o94O27j81k68N13o19M92l4m70O44n09K65J22n85P18m08
2937h3j6L25n91O51l03k46N52n72M81j51l97P13n69K35R0m64P14n12PL88n49N86
2959B89l84j28N89o30M19j52k51O59o72K48J77m31O28n86J17M14o06N25l45l1
2979a51N28p09M28m8k50N41o74L52J90m93N50n02K18L23o68N60k63k3M06o84N33
3000A64p9k76M70n89M43N1m99N76m35K19J84o11O43k91o6L16n55N66j94k76M92
$$ plain form
2853 -263 307 -236 60 136 -327 302 -147 -66 211 -324 277 -69 -180 295 -297 191 23 -262 348 -246 48
2874 48 129 -298 348 -181 -58 241 -300 294 -103 -158 340 -307 182 0 -224 370 -295 66 128 -281 333
2895 333 -258 -30 258 -334 264 -149 -113 328 -372 166 3 -190 334 -344 105 166 -285 314 -244 34 258
2916 258 -365 269 -101 -79 304 -390 237 56 -212 301 -318 174 140 -330 314 -195 70 192 -393 325 -83
2937 -83 -99 226 -365 286 -17 -263 289 -283 198 47 -350 363 -206 29 119 -345 369 -143 -136 252 -297 289
2959 289 -95 -223 366 -264 155 3 -248 411 -261 -13 164 -267 361 -225 -108 306 -300 225 -120 -151
2979 -151 377 -332 96 48 -202 339 -335 17 207 -286 264 -238 -20 303 -365 195 -68 -91 315 -369 164
3000 164 85 -191 279 -310 133 184 -315 261 -174 45 229 -382 261 -30 -96 220 -335 231 37 -239 253
3021B53m91L74n1m22O37m47J36J40m50O35m05o3L76m88M90k51k12N50n17L03m7
3042E0k94N79m99J36J81l78N15m19QM01n05M00k34r7M80n66L08Lk53M78n27K44
3064A1J70m16M60l87J07K93m99M15j87o7L43n11L70k3k60M09m33K59J13m08M43
3085B02l07R9K07m58M37j84q8L07m55L87q1k50L92l72K25M4l42M43l07Q3J54l66
3107b30M12k16p8K86l74L19j20j77L82l53J96J3k37L93l24P9J63l07L50k38j3
3128g4K48l35K75j17j11L11l42J94J7j98L19k94J01J20k68L00k13NK04l01K40
3149H1q8r7K52l02J99Oj76K57k38J05Q8k38K71j63J0J56k62K32q3p8J99k34J71
3172F8k4j39K14j97J01L9j81K26j54J9J12j98J91j04l3J56j97J41k0j14J88j72
$$ plain form
3021 253 -238 136 85 -337 300 -147 -11 129 -321 314 -91 -154 222 -266 224 -27 -239 311 -206 97 50
3042 50 -244 335 -164 -28 153 -225 290 -129 -121 280 -225 175 -59 -156 324 -242 66 69 -184 294 -233 11
3064 11 181 -235 225 -162 -55 238 -261 154 -33 -100 243 -268 102 79 -181 228 -205 54 167 -241 202
3085 202 -105 -6 201 -257 180 -4 -92 215 -240 147 66 -184 208 -164 61 105 -237 206 -101 -18 136 -230
3107 -230 182 -34 -112 174 -200 119 -1 -178 204 -149 47 60 -177 216 -108 -29 134 -173 177 -61 -74
3128 -74 174 -161 114 -3 -114 197 -145 49 66 -132 187 -107 -6 114 -154 146 -67 -62 142 -159 81
3149 81 -7 -104 148 -154 45 51 -125 132 -106 -1 87 -151 120 -43 -33 123 -139 93 10 -68 131 -103 68
3172 68 44 -95 119 -78 23 62 -119 107 -47 -28 84 -114 77 -27 -60 96 -101 40 20 -94 94 -78
3194g8Q4M0j38J78j26J7Q9j52J43p9k5J28j51J12j8p1J21j17M5L6r3J26r6J9N8
3219E2j12J11o3j4Q2j13P9j5m8R0q7L9J2o4P8o4L2L1o6O9m4%M0n6M7j6k1M1m0
3248b0L1jk4L8l0J2K9m6L2j7jK1k6J0jpJ2j1lJ3j5MJoj2J0j1J6j4KK1k6RMj4K0
3284@j7J3J8l7M2k9J3L3n0L3j1k0N0m9L0km0O8o3J8L1q0Q8m7k1P0p4M9j8l5P2
3315C5r1O6Oo9R8q1L5L6r2J09p6KP4j11J03m7m6J14j16Q0kr5J44j15M9N1j35J45
3343G1r1RQ4j55J40o0n2J29j58J20k3r4J65j53P4M6j52J77j24K1R2j57J47p4l9
3368e7J51j91J36j1j09J86j74R3L2j53J94j47L7J00j85J90j03m9J66k01J48l6
3390A7r4J89k08J07M6j69K16j72M0J11k14K15j20l0J69k33J83l9j04J98k11J29
$$ plain form
3194 -78 6 46 -92 86 -40 -23 66 -86 57 -22 -47 81 -70 42 24 -47 74 -43 2 38 -55 71 -25 -6 52
3219 52 -60 51 -12 -26 56 -57 22 7 -41 49 -38 1 13 -51 27 -37 -5 26 -40 29 -15 -15 25 -31 16 0 -21 20 -20
3248 -20 11 10 -14 24 -6 6 35 -11 21 4 3 24 -2 8 7 0 12 1 -2 11 -4 0 1 -5 -17 -7 -18 -2 -16 -14 7 -19 -10 -6 -20 0
3284 0 -17 -4 14 -23 19 -10 3 36 -14 19 8 -12 38 -11 19 17 -23 45 -18 0 31 -49 39 -8 -29 41 -33 16 -2 -37 35
3315 35 -56 10 16 -53 45 -36 -1 35 -57 52 -24 -22 52 -59 44 -3 -49 65 -51 29 27 -68 76 -39 10 61 -74 71
3343 71 -20 -11 73 -82 58 -2 -54 75 -83 37 14 -80 85 -68 6 52 -100 77 -47 -26 66 -91 56 -18 -57
3368 -57 94 -97 39 28 -81 105 -69 24 56 -97 97 -50 -13 87 -98 92 -11 -60 106 -95 53 17
3390 17 -77 112 -96 11 57 -112 104 -68 -28 83 -131 84 -36 -66 103 -130 53 14 -90 108 -103 26
3412B6L1j74K46k03P7R3k26K37j37pJ61k42K09p4j05K04k22J48J0j76K49k06P5
3435fR0k27K58j55k6J70k54K36r7j01K41k49J72k7j51K73k38Q0R1k15K74j85k
3458d8J73k58K41j15p9K33k59J72j9j50K67k60R4J02k28K66k16N5J59k76K36j26
3480c6m6K24k90K06k2j53K59k74J34R0k42K67j94O1J46l03K71j09n2K02k97K39
3502H1k3j63K39k41J63L0k38K89j97M5J15k71K96j27p4J91k67K43o8j67K74k43
3524a13J48J1k17L16k24M3J21k42K94j85m4K18k49K25r8j16K85k65J25Rj66K97
3546A73k58N9J36k31K53j83j0K22k89J94p9p1K51k97J49L0j57K45k67J10J31k54
3568a43K36j67K8J82k99K34p4o9K08k84K01J7j80K33k29J39P3k49K53j44L0J29
$$ plain form
3412 26 57 -117 129 -74 3 96 -130 107 -30 -37 124 -118 91 17 -88 116 -106 42 52 -124 125 -81 -6
3435 -6 84 -143 115 -40 -66 104 -150 86 -11 -112 129 -120 52 25 -126 147 -91 -11 80 -135 139 -46 -48
3458 -48 125 -133 108 -7 -86 147 -112 60 41 -109 158 -102 -8 94 -134 132 -84 -29 130 -146 90 -36
3480 -36 -82 142 -148 58 36 -117 142 -132 2 92 -150 117 -77 -16 130 -173 98 -11 -63 139 -158 81
3502 81 58 -105 134 -107 56 86 -152 137 -60 -15 100 -171 125 -2 -76 115 -152 91 23 -144 130 -113
3524 -113 35 46 -171 145 -79 -36 85 -157 137 -48 -92 126 -123 102 4 -112 173 -92 33 42 -124 173
3546 173 -85 -26 110 -121 132 -51 -61 161 -128 66 -13 -84 167 -130 19 49 -108 137 -130 -20 111 -143
3568 -143 93 -74 -46 136 -163 71 -3 -72 136 -148 53 70 -110 123 -106 33 106 -143 110 -34 -4 125
3590A25k76K63q7r8J94k50K16l6j80K56k09J15L2k23K86j73RJ16k22K58j31q4
3612i9K09k18J78o2j25K60k20Q8M1j61K54j94J4J33j99K19j39m6K04k32J52m9
3634Hq9K20k24J04N0j53J99k07O1J27k04J90j31kJ58k37J76m4p0J75k16J30L9
3657F0j64J97j79R5Q8k11K11j24kJ23j93J76l9r4J68k04J36Kj35J90j56P2N3j68
3681i8J96j20k3J12j61J53n0p7J48j56J15k8j03J71j38N6M8j39J75j16mR8j30
3704g1J35p9m4J44j51R9j2p5J41j37O0L5j15J48j09J7R1j49J30o2m2J19j49J02
3728B6j0o5J07j21N6M6j09J20r0K9O1j22J12n2k2Q8j15R0j4n4R5r9O1J6q6J10
3754E8q3K7N1j05Q8m7j6P9r9P3k6l8P9q0M4J1o9Q8p8K8L9p5Q4m1j6M3n9N8k7j8
$$ plain form
3590 125 -151 112 25 -73 121 -129 87 51 -129 127 -82 33 65 -158 128 -45 -36 80 -142 116 -15 -99
3612 -99 110 -108 70 8 -117 143 -77 11 52 -109 145 -49 -35 98 -101 118 -21 -67 137 -95 57 8
3634 8 -81 139 -85 19 69 -84 115 -92 -31 96 -108 82 -49 -51 107 -130 46 2 -68 107 -109 21 60
3657 60 -104 93 -86 9 97 -114 97 -27 -29 94 -99 77 38 -56 112 -92 44 46 -89 101 -55 17 70 -98
3681 -98 98 -22 -45 67 -94 59 9 -68 80 -76 39 11 -92 79 -59 -3 45 -94 81 -35 -39 59 -71
3704 -71 64 -15 -59 85 -66 33 21 -54 87 -50 10 45 -70 78 -31 -14 77 -72 58 -4 -46 73 -76 26
3728 26 16 -49 58 -63 -7 39 -70 50 -40 -11 50 -72 40 -12 -34 54 -61 29 15 -39 56 -43 18 34 -52 58
3754 58 -25 2 53 -52 36 -11 -27 52 -47 26 0 -38 41 -39 5 16 -53 35 -43 -15 24 -51 33 -8 -24 19 -40 18 -9 -27
3784b7N8n1K4Ql8O8o5J3N0o8O1m2PL8m7L4pl5M7m7M0j3l9N6n2K1J7l3M3j9k2L5
3816A5m3L1lj3K6k6J6mj4K5j2RQk0J5j2JK0j9J6j2jPnK2j7qJ2j9NJ7k3J6j3lj
3852gjJoLJOj4J2On%qRRj1J0mJJ3k0J4Lk1L1k3J5Pk8L3k2QQk9K5qj5K3l7L4j0
3892Ck1K8k2J0J6m0L6k3%L3l6K9k0j6M2l6K3lj7M1m6K9Rl5N4l6MM0p4N6k5rM8
3925D2o6N2j6l4O5n9K5Lm4O2m9OL2m9N8m0j0N7p6M8j0l7P4o3L5J9n0O6o8K0L9
3956C2n3O7m7nO2r0O0j8j9O2q1N1J3p4Q9q2K1N5r5R0m9j5O2r8P6j2m1Q7j07O4
3986EJ9p4R8q2K8N0j03R6n0nO8r8R6m3m0J01j04O9Mp8J07r6M6L6j06J08o5k1P7
4015D3j04R4l5m0Q6r8O8lo8R7p7K9L0q4J11o0k2Q2r7R4l8m1R9j10P9k1n9J19j06
$$ plain form
3784 -27 31 -20 4 12 -26 42 -23 -10 40 -28 33 -9 -2 36 -11 23 16 -19 28 -19 21 8 -31 25 -27 -6 11 -22 21 2 -20 15
3816 15 -28 3 0 -13 13 -13 3 -1 -15 10 -2 7 15 -5 10 -2 -1 19 0 16 4 3 10 5 27 10 2 14 -5 0 17 -6 10 -3 -6 -7
3852 -7 -8 -7 -13 -10 -9 -3 -17 -5 1 -4 -4 -12 -3 6 -5 5 1 2 15 -5 9 12 -9 22 -1 14 21 -7 26 4 12 20 -9 16 8 -7 16 -21 13 3
3892 3 -18 10 -12 -2 14 -26 10 -13 -13 20 -16 13 -7 -23 19 -17 6 3 -14 27 -19 10 19 -16 38 2 6 46 -28 28 3 -6 42
3925 42 -24 28 12 -22 43 -16 9 12 -32 30 -19 -13 19 -30 28 -12 -22 35 -41 7 -3 -40 34 -29 6 25 -25 41 -27 -7 32
3956 32 -21 46 -1 -6 56 -34 26 8 -11 51 -30 21 34 -40 49 -33 -12 43 -52 38 -11 -26 36 -62 14 2 -39 48 -59 5
3986 5 24 -50 48 -34 -6 44 -59 37 -13 -18 50 -48 48 5 -35 66 -38 31 35 -43 64 -32 14 50 -56 52 -13 -34 43
4015 43 -61 33 -2 -42 44 -54 14 11 -57 40 -37 -8 22 -62 49 -11 -33 49 -48 46 8 -33 66 -44 35 14 -45 74 -32
4044c2N0J7p7J06q7J4P2j14J04m6m3J16j30Q2k2n7J02j07N3L2q8J08r6K4P9j26
4070f6J10o2k1R3j20Q9j5n7J01j03O6K3r7J17q3K3N4j21J30n6k0P6j25J04j6p2
4096d8J04j09Q0Jr5J17q0K7L1j07J39o4k2P2j06R5l9n2J06q8N9kp9J27r3K3M0
4123C7q4J17q4j0Q5j04R3n0l2J03j03O2oo1J13j28M6N7j10J20r7NR0j21Q1k2l4
4150c7J03j30O5J7o4R5j02N9M0j04J11q1K9N9j19R4k6k5Q3j22Q9np1R4r0P2J0
4177D4j03J15p5J2M3j04J15m4l9P1r1R7l5p5J25r8N1Qq2J27q7MN2q5J05n7l0R1
4205E5r5Q2k3n9J07r9N7ko0J11r2OM5p1P9o2nP1r0O3k4l7Q8j09N7J8n4R0q2K1
4235a4N0r1Q8n1J0N3r6P2k4j6O3r1O8Po4Q9p0L2K7q2Q2m6NM3q1Q2l2l8O4q1N1
$$ plain form
4044 -32 18 35 -42 64 -23 -9 63 -51 53 7 -36 80 -50 32 10 -47 55 -52 1 33 -55 53 -43 -19 60 -66
4070 -66 44 -18 -39 54 -66 23 8 -49 52 -51 15 38 -59 58 -25 -2 52 -69 61 5 -15 61 -64 40 24 -48
4096 -48 56 -53 27 28 -67 50 -30 -3 28 -79 60 -4 -26 46 -60 35 -4 -56 50 -38 21 19 -60 67 -26 -3 37
4123 37 -47 70 -14 -24 61 -43 50 0 -32 71 -32 30 24 -37 76 -52 -6 51 -59 61 -36 -31 59 -62 19 -3 -37
4150 -37 66 -64 1 18 -46 49 -53 6 46 -58 53 -28 1 60 -59 35 9 -16 67 -55 34 29 -42 52 -38 34 44
4177 44 -59 56 -19 -7 36 -68 47 3 -36 35 -56 41 6 -69 56 -42 9 17 -65 62 -25 -21 31 -54 51 -6 -36 55
4205 55 -40 42 19 -40 67 -32 25 23 -37 74 -18 -12 33 -38 41 -21 -26 45 -45 18 -6 -43 45 -64 -7 11 -43 47 -35 -14
4235 -14 36 -55 33 -18 -8 45 -51 21 -3 -19 44 -47 21 28 -36 53 -17 15 42 -40 42 -4 1 44 -37 45 13 -25 39 -42 9
4266IPn3P3p2L0K6o9Q5n7JN1p2P9m0j7O3q1M2%l3O8m8J9J2m6O0n4J5L5n5N1l1
4298bj1N6o6M0rl7O1n5K3Om6O7n9K0L8o3N3l7lL8n1M3j0j7N0m9J9Pk6L2j9J0L3
4331C6n2M9k7oL2m4K9lk5L9m4K9nk7M2l4J6lk3L4j6LJ4m3L0lj3L4l7PLmK4k3P
4366dJ5k2K1j7J1J0j9K1j6qL0k3L0j6k4L3j8J1%l0K3LnMk1J6omJ0j4JJ0k0K0j1
4401iJ0J0j0kJjOj3J3J2mPj7J1lmKnJ3pkMpJJ0oLj2OJk1J1LrpJ2nK%K%%mJJ0n
4447bJLpJ5pmjJ0pNMrPKNKj7J3pj0Rj4J8%rkkKNj5J3pj6L0j6LNj5Qj0J9Nj4K2
4491A5j9pJ8j5K0qKQj0J4j2j5J8k0K3Jk0K8l1J7Mm1N0j8j2K0k6J8jj4K4k8J5j
4525cj8K6k3K1%k9L4j5nL5l1L8k0j5L6l8L0mk9M7l6J1J8m0K7j5QJ2l9K5j5mK7
$$ plain form
4266 9 16 -37 36 -36 -6 20 -49 36 -21 -20 31 -41 38 -2 -19 44 -37 5 5 -28 40 -8 11 23 -23 37 -17 -2 33 -22 29 -2
4298 -2 -13 43 -23 17 8 -29 32 -23 0 6 -40 27 -32 -12 26 -37 16 -21 -24 14 -37 6 -4 -21 29 -20 -1 6 -20 12 -7 3 36
4331 36 -16 33 6 0 32 -12 17 14 -11 28 -16 13 8 -19 23 -11 5 2 -21 13 -3 0 14 -29 1 -2 -15 19 -18 -11 -8 -12 12 -11 -4
4366 -4 11 -11 10 -7 4 14 -5 16 0 -8 22 -1 29 13 -11 22 4 15 15 -15 8 11 6 10 -11 5 -1 -5 5 -9 -8 2 -18 2 -9
4401 -9 1 11 1 -1 0 -1 5 -8 5 17 13 20 3 14 11 7 9 4 17 10 8 12 5 6 16 10 13 1 7 8 -13 -2 1 -8 -15 -3 -8 -6 -6 -4 -4 -4 -8 -7 3 -2
4447 -2 -1 2 -5 10 3 -1 -2 8 1 6 10 1 8 10 15 17 0 13 6 -4 5 -9 9 9 0 -2 -4 -2 3 -12 1 -6 -22 8 -8 -5 0 -15 -7 -17 2 7 -7 15
4491 15 -4 -11 7 -8 12 4 6 14 4 18 6 -9 9 -11 12 13 -7 21 -10 7 11 -30 20 2 -10 10 -16 2 1 -13 11 -17 -2 -3
4525 -3 -21 5 -18 3 3 -26 8 -7 -12 23 -8 30 10 -5 31 -7 23 19 -10 37 1 12 30 -10 17 2 10 22 -17 8 -7 -11 16
4558A6m1K6jk1L7l8J5J5k8L9l3J4K9n1L0kj8K9l7L4Nl7L8k1J8J0l2L1k8QJ8l3
4590iL5k5MJ6l6L9j4l1M3l7K4pk3L4k2mK5m7M1j3k5M5m4M0j8k1N2l2J9pj8M6k8
4623BkK6m1M8l3j1N0m8K2qk5M6m4J9Ql4N0l9J1K3n6N1l4J0L9q1N2j3mM0n0L3M
4656A1k8M5n7L4K5n2M9l0%L4m6M3k6pL2o1O1j2k9M3n6M5pm2N5l9JL4n0M2j1k0
4688a9L2m4K4Pl8N9l8K3Mm0N9m4J5L2n5N1l5jM3m6L2k5oL8m2K4Kk8N3m9J4K5n9
4721c2M5k7MM1n9K8oj1L3m9L9j1j9M0m6K5K0m2N0l5mL7m4L3qlK7m8L3Jl2M8l2
4754dK0Om5M0l0J4J8m3M2j4k2L9n5L7Pk9L3m4L5J7o4O9m8J0K7m0L5k2lM6m1K3
4786A4j5j7N8n4K0J6l5M9m9K1J6m0N1m6MK1l4K6rj9M0m3K8Jk4L7l7QK5l6L3k4
$$ plain form
4558 16 -25 1 0 -21 16 -22 -7 8 -20 19 -14 0 29 -22 8 6 -12 17 -20 14 19 -18 20 -1 17 27 -5 26 -2 6 24 -9
4590 -9 26 1 5 21 -15 24 10 -21 22 -15 9 2 -21 13 -9 -13 12 -35 6 -7 -32 13 -31 9 -9 -30 22 -10 9 2 -16 30 2
4623 2 0 26 -15 33 0 -11 39 -9 13 5 -20 26 -18 1 9 -25 25 -14 -3 20 -36 15 -19 -9 30 -51 1 -12 -16 24 -26 7 11
4656 11 -17 28 -29 5 30 -22 27 -3 -3 31 -15 28 2 -5 27 -34 27 15 -14 29 -27 18 11 -31 24 -15 -14 20 -30 12 1 -19
4688 -19 13 -31 -7 0 -38 21 -17 6 10 -30 29 -15 0 32 -23 28 -7 -8 35 -11 21 -4 -10 28 -14 10 12 -16 37 -12 2 27 -32
4721 -32 13 -14 -10 31 -28 0 -6 -17 16 -33 6 -5 -24 16 -30 -5 15 -27 23 -12 -16 21 -23 10 2 -1 26 -22 11 12 -20 28 -4
4754 -4 16 22 -23 17 -13 1 19 -24 18 4 -18 21 -34 3 10 -19 14 -30 5 22 -42 27 -21 -11 16 -24 11 -11 -14 32 -9 14
4786 14 -1 -18 40 -14 6 22 -13 36 -13 8 24 -16 35 -11 -7 14 -20 6 -3 -22 18 -25 3 4 -20 17 -20 -12 13 -23 10 -14
4818a4jL3m9K6Nj7L2l2L2j4j6M2l4J9Nl7M6k1jJ4k9L4j8j4K3l3K9Jl5M7l1KOk2
4852b2L4k9NK4l2L0j7PRk3K1j3lK4k1J6%k3L7k6MK5l2K2j7lK9l8K6mk1L2l7J3
4886cJ0j7K0k1KJ8k2J1mrK1k5K0mj6K0k5K7oj5L6l0J2J1j5J6njLj0K2k0j0K7j9
4921aJ4qj2J7j0Rlj3K4k0j3K6k6J6j5J2J2k3RMj1J9j0JNqJ7j6J1Pj5K2j6lL1l4
4957aJ8prJ9j7J3Nj3J4j5LKnJKj4L%LJ0rnjJ4j0r%RqjLJ2oJ2pqOKkJ7qj1J6j4
5001DJ0lLj3lNjnOqJ2pkLj0QlnjLjJ0j0Ojlj1RKNlKOMo%%MJkPjpjMj1PL%jj4N
5053dOj0RKj6KJ0j7J9rjLnkJ4j1J3j1ROj7K2j1jQqRnoJ2j3J1Pj8K5j9jJ1j5%L
5094ApJ8k2J6mj0J4j9jOj2J3j3JJ5qQj1J0J3k3J7Oj3K2j7J0KkKj7K3mj5J8j8Q
$$ plain form
4818 -14 -15 18 -31 -5 0 -17 15 -17 15 1 -15 27 -7 12 17 -20 26 5 4 18 -11 23 5 -9 14 -19 10 11 -24 23 -8 -6 0 -22
4852 -22 12 -17 -12 12 -20 10 -7 0 9 -14 7 -6 -9 15 -6 10 10 -13 24 -2 2 27 -5 17 0 -3 26 -12 14 10 -11 21 -16 -3
4886 -3 7 -10 10 -11 -9 9 -13 -2 -6 -15 6 -19 1 -3 -19 1 -24 3 -3 -18 18 -12 0 11 -4 12 7 6 9 -1 21 1 -9 18 -1
4921 -1 13 5 -7 10 0 9 6 -7 17 -3 -16 10 -16 0 -15 -3 9 -14 -5 -1 -12 7 -3 -2 3 -5 12 -4 7 14 -1 21 5 2 33 -1
4957 -1 17 10 1 20 3 16 21 8 22 7 10 12 7 8 10 -4 -1 -1 2 12 3 -2 -3 11 1 -8 -8 1 -7 -8 -5 7 1 13 6 -2 4 6 4 21 13 2 18 4
5001 4 14 11 14 1 -2 3 2 -3 3 -5 7 0 -2 1 -9 -1 -4 -9 -10 -7 -8 2 -8 -2 -3 -6 -17 -8 -6 -1 -4 -2 4 8 2 2 2 6 7 5 12 11 4 3 7 -4 3 6 6 5 -9 -4
5053 -4 2 -8 1 3 -13 -11 -1 -18 1 -8 -9 -6 -11 -13 1 -10 3 -8 1 7 -10 12 1 0 8 0 9 4 -2 10 -3 8 15 -3 22 3 2 13 -2 -2 1
5094 1 -6 12 -10 6 2 -8 6 -13 -14 -8 -20 -7 -20 -19 -4 -12 -4 -15 -5 8 -15 2 8 -5 17 0 10 12 10 12 -5 18 14 -1 17 -1 7
5131GJ1k1MLJ0nk2J8j7JJ5k3J4Nj1J3j5MJ5k3K5j4mJ2j2J8j1lJ0rJ5lqL1k7kJ0
5168A1k3K5qrK4j1Jj8OJ9k6J5nj2NpNKj7K2j7J8Ok4K6j1rJ5j6K2j2j6L2k5J5J3
5204A6k2J6rRJj2J2j0lK8l0J7j3j5K6k2J4Rk5K0k2MK2k5K8k9JK2k4J2mlJ6j8P
5239fJ4k4L4j4O%j6K6j6OJ7k7J9j5rK5l1J1Qj4K5k3lJ0j9L1j5j3QqK0k2pK0j1
5274a3K1k1j2K9j0MJ1l0L3j9J2J7l5L2j6nK1j6J3prK6l7J8J9l5K2k0PMm0M9k5
5307a2J0J5l8K2jj2J4j7J9rj2J8j2J9kk4L2rjJ6k5J7Kj4K3k7K3j9lK3rOMk7K4
5342A4k5%K0k4J8j3j2K1j7Olj6L2k2RKj0L3k9J0J7l2L4j0j3K0k3J9Rk2L3l0RO
5376A1j9L1j8oK4l2J8j3LJ8k9J7mj1K2k2J1Kk3K8k1PJ2k5K0j0J3kj5K0Kj0J5j2
$$ plain form
5131 7 18 -3 1 4 14 9 -13 5 -12 -11 4 -19 -5 0 -11 2 -13 -9 6 -17 8 -6 -10 2 -10 8 -3 -6 4 -5 10 7 -1 30 3 1 11
5168 11 -12 13 5 -4 20 9 10 -8 -2 17 -9 6 1 -11 -6 -13 -8 -6 -23 -1 -18 0 6 -18 8 -3 -12 3 -13 9 -3 -19 13 -12 3 16
5204 16 -6 10 1 10 11 -1 11 1 -2 26 -4 13 0 -15 11 -11 3 12 -13 7 -15 -11 11 -14 14 -15 -14 8 -16 -4 -8 -11 5 -13 -6
5239 -6 8 -16 18 4 10 10 -6 20 4 10 27 0 19 4 -5 20 -11 0 8 -6 19 -4 -7 3 -16 15 0 -13 -5 -13 7 -15 -22 -2 -13
5274 -13 8 -13 -25 4 -6 -2 9 -21 12 -7 5 22 -13 19 3 -2 19 3 16 9 0 26 -11 7 26 -9 13 -7 0 4 -36 13 -12
5307 -12 -2 13 -25 -3 -4 -16 -2 -19 0 -9 -21 -3 -15 4 2 -22 10 1 0 16 -9 8 10 -4 19 -8 15 -4 -7 16 7 13 17 -10 14
5342 14 -11 -11 9 -15 3 -10 -22 -1 -18 -12 -15 -31 1 -21 -12 -10 -20 13 -16 -6 11 -21 13 3 -10 10 -13 6 15 -7 26 -4 5 11
5376 11 -8 23 5 -1 23 -9 9 -4 -1 17 -12 5 1 -10 12 -10 1 3 -20 8 -13 -6 6 -19 1 -9 4 2 -13 7 9 -1 14 2
5410BONk7K9j0jJ6j7K3k2pK1k0J3oj0J6j8J3Jk3K4j8mPj6K9k3J2MoPmj0K2k8L0
5447A0j1LJ0k2J4Mj5J9j4%J4j9K8j0oJ5k8J1Lj9J9j3J1nj5J9k4ROj9K4pJOj0J2
5483Aj3nJ9j3J2LrK2rj2J6j4J4lrLjJ8j1k%jQonJ0pNj1pJ1j0LNr%jJJ2k9K0N%
5526Ak%QkmJKj3K0j4J3m%J%OkpkLkPmjj6J0kLj0%KOnOJj3PM%jpkRlLJJ1j5KK0
5576A6k2QJKRkjKjoLoJjjkJ4j2lMOoqQqQj0mQqJ4lj2J4Omjj1OJ2j0kRqPOlnJn
5626@PQrlJ2j2kMjnkNKq%J0j4NqNloJ0pRnMMlQmj0J5kqK0j3J0oqJ7j6J1pnQj3
5673fRMj2MqOLpJ2j5JPnMoQNj1KOoKmKPj1J8%kKj9K7oj3K0j6J2mj7J6Kj5Rj2J0
5718C%j4J2pMkJjmpJ4lRqj1J4j2J4pkJ9j6OQj2J9k2J6onJ6j2JJ7k5J4lmNj5J1
$$ plain form
5410 2 8 13 -14 15 5 4 20 3 26 4 -3 18 -2 11 5 -5 11 -7 6 7 -16 8 -10 -14 -7 -23 6 -17 -5 -1 -7 0 -4 -14 8 -20 10
5447 10 -1 2 12 -10 4 8 -7 12 -2 -2 12 -7 21 11 5 20 -8 3 6 -13 6 -7 4 -1 -16 3 -21 -12 -6 -25 -1 -8 -7 -1 -11 1
5483 1 -12 -17 2 -11 1 4 -5 17 8 -4 12 -2 12 9 0 3 2 20 9 7 7 6 14 8 3 13 6 11 0 -7 4 -6 -3 2 -7 -7 -8 -7 5 -24 -4 1 1
5526 1 -1 -1 7 5 1 2 4 -9 11 -3 10 6 6 7 7 13 11 4 2 5 3 10 6 5 -11 -1 -3 0 -10 -10 -8 -2 -7 -1 0 -13 -6 -2 -2 -3 -10 -12 -3 -6 -3 -2 9 -6 -4 16
5576 16 -6 2 3 5 14 12 11 13 12 6 9 3 4 3 2 0 14 2 -1 3 9 3 -5 3 -5 3 -7 -11 -3 -11 3 0 -12 2 8 4 3 -8 -2 10 0 -2 7 -1 6 12 9 4 5 0
5626 0 7 15 6 3 15 3 1 5 4 -1 -3 2 4 -4 -4 6 -8 -3 -11 -6 -9 -15 -5 -12 -3 -8 -4 0 -3 5 1 -9 6 4 -4 16 3 13 7 -1 16 0 11 4 -1 7 -6
5673 -6 3 7 -5 -1 -9 -3 0 -7 5 -10 -9 -2 -7 -3 -9 -1 4 -7 -5 1 -5 -3 -7 -5 2 -9 9 9 7 9 -10 17 11 -2 18 2 14 10 -7 9 11 -4 5 -7 3
5718 3 3 -11 1 -6 -2 -4 -3 -4 -8 -15 -1 -4 5 -3 -14 0 -12 2 -5 -7 12 -4 2 10 -2 17 -5 11 5 0 16 4 5 22 -3 11 8 4 9 -6 5
5759Eo%Nk0J0Lj1J4j0QqjNOj3J2qJ8qmJ1mJ2j3jK0k3J2Qj7RnRjj7J9oj2J0j3K
5800cjqJ1nQJk4K4k7J6Oj8K0mj7J5jkPrJ9j5J8Jk7K0nJK2l2J9nlJ1j6K2j0nNj0
5840aJ3ok1J7j3J1J0l1K2q%Pj9J5Mk6L9k7LK0j9J7j3QJ1j9J2%lJ1k1K0%j4K0j6
5876CNjj2J9j7NJ5k5J5pqJ0j1J3oqJ9k4J4rj9L8j4kJkJ7j1ONj3K1j3%J2j4K0j5
5914GpK0k6NJ4j3Nj6PJ3j7J3oj4K5k2RoqJ4j0NJ6k8K2j3LJ1j3MlOJ0j7J0Rj2J6
5952A3k2J4Nj9K2j0oJ7k2J6mj5J9j4J2j0nK3k4Jjj4K4omjqK1j7NMrJ1QKJqLKj8
5992a4L3k2lJ6k2K9lrQj6K0j2kMj2l%j1J6j1jKMJ0pkJ0j9jMMJ2j0L%JJ0o%Kj1
6033iK6k3J0Rj4PmqK3k1J0Oj3J5k0LLj9J1lNPj8RkoRrRkqK1j3oJ2lJ0pPjj0J1
$$ plain form
5759 5 -1 -1 4 -16 -6 -3 -14 0 -10 -2 -10 -11 -6 0 -13 -1 -9 9 1 -3 8 4 16 3 2 22 -1 11 19 2 11 6 15 14 -3 16 10 -2 8 -5 -3
5800 -3 -4 -12 -1 -6 2 3 -21 3 -24 -8 -2 -20 0 -4 -21 -6 -7 -9 -2 -11 8 -7 11 12 -15 5 0 1 23 -9 10 5 2 13 -3 19 9 4 9 -1
5840 -1 12 6 -15 2 -11 0 10 -21 1 -7 -7 0 -19 -4 0 -26 13 -14 -11 9 -10 7 -6 2 13 -6 6 6 3 14 -7 13 13 -1 19 3
5876 3 8 7 -5 14 -3 2 17 -8 7 0 -8 2 -9 4 -2 -10 9 -15 -1 -10 -29 9 -5 -7 -6 -8 9 -2 4 9 -4 17 4 4 16 2 22 7
5914 7 0 20 -6 -1 13 0 5 -11 -4 9 -8 5 -1 -15 10 -12 -3 -9 -17 -3 -13 -8 8 -20 2 -11 -8 3 -10 -6 -9 -3 7 -10 0 9 -3 13
5952 13 -9 5 10 -9 13 3 -3 14 -8 8 4 -11 8 -6 6 -4 -9 14 -10 -9 -10 -24 0 -6 -10 -11 -19 2 -15 -10 -6 -15 -4 4 6 7 -1 2 4 -14
5992 -14 19 -3 -6 10 -12 17 14 5 13 -3 17 5 3 7 -5 -8 -8 -19 -3 -14 -15 -13 -9 1 -6 -8 2 -17 -18 -14 -10 2 -8 -5 -5 -4 6 0 0 2 -9
6033 -9 17 -6 4 13 -1 6 2 -6 17 -4 6 12 -1 14 -6 -3 0 -19 -8 -11 -6 1 -17 -8 -10 -16 -7 -16 -7 -9 -17 4 -9 -15 -3 -6 4 -3 4 3 -7 4
$$ [...]
8191c
##END NTUPLES=NMR FID
##END=
