##TITLE=1H_ES-AN-IPC-c2
 
 8 sc, 
 21.1.2022
##JCAMPDX= 6.0         $$ Bruker NMR JCAMP-DX V2.0
##DATA TYPE= NMR FID
##DATA CLASS= NTUPLES
##ORIGIN= UXNMR, Bruker Analytische Messtechnik GmbH
##OWNER= root
$$ XWIN-NMR		Version 3.5
$$ Fri Jan 21 12:36:37 2022 Russian Standard Time (UT+4h)  she@DPX200
##.OBSERVE FREQUENCY= 200.131346
##.OBSERVE NUCLEUS= ^1H
##.DELAY= (6, 6)
##.ACQUISITION MODE= SIMULTANEOUS
##.ACQUISITION SCHEME= undefined
##.AVERAGES= 8
##.DIGITISER RES= 18
##SPECTROMETER/DATA SYSTEM= spect
##.PULSE SEQUENCE= zg30
##.SOLVENT NAME= DMSO
##.SHIFT REFERENCE= (INTERNAL, DMSO, 0, 15.7039)
##AUDIT TRAIL= $$ (NUMBER, WHEN, WHO, WHERE, WHAT)
$$ ##TITLE= Audit trail, XWIN-NMR		Version 3.5
$$ ##JCAMPDX= 5.01
$$ ##ORIGIN= Bruker BioSpin GmbH
$$ ##OWNER= she
$$ F:/spectra/data/she/nmr/H-F/1/audita.txt
$$ ##AUDIT TRAIL=  $$ (NUMBER, WHEN, WHO, WHERE, WHAT)
(   1,<2022-01-21 12:35:14.29 +0400>,<she>,<DPX200>,
      <created by zg, POWCHK disabled, PULCHK disabled
       configuration hash MD5:
       00 E9 B6 7A A2 85 ED C7 34 08 36 98 17 FE 4E 26
       data hash MD5: 16K
       91 33 0C ED 7F F5 DB CD 7C 73 D9 6C 6A 61 2B 1B>)
$$ ##END=
$$ 
$$ hash MD5
$$ FB DF 3D 60 CA 56 95 1A 93 16 8E 38 2C 65 89 9E
##$RELAX= 
##$RELAX= 
##$RELAX= 
##$RELAX= 
##$RELAX= 
##$RELAX= 
$$ Bruker specific parameters
$$ --------------------------
##$DU= <F:/spectra>
##$EXPNO= 1
##$NAME= <H-F>
##$PROCNO= 1
##$TYPE= <nmr>
##$USER= <she>
##$AMP= (0..31)
100 100 100 100 100 100 100 100 100 100 100 100 100 100 100 100 100 100 
100 100 100 100 100 100 100 100 100 100 100 100 100 100 
##$AQSEQ= 0
##$AQ_mod= 1
##$AUNM= <au_zg>
##$AUTOPOS= <>
##$BF1= 200.13
##$BF2= 200.13
##$BF3= 200.13
##$BF4= 200.13
##$BF5= 200.13
##$BF6= 200.13
##$BF7= 200.13
##$BF8= 200.13
##$BYTORDA= 1
##$CFDGTYP= 0
##$CFRGTYP= 5
##$CHEMSTR= <none>
##$CNST= (0..31)
1 1 145 1 1 1 1 1 1 1 1 1 1 1 1 1 1 1 1 1 1 1 1 1 1 1 1 1 1 1 1 1 
##$CPDPRG= <>
##$CPDPRG1= <>
##$CPDPRG2= <>
##$CPDPRG3= <>
##$CPDPRG4= <mlev>
##$CPDPRG5= <mlev>
##$CPDPRG6= <mlev>
##$CPDPRG7= <mlev>
##$CPDPRG8= <mlev>
##$CPDPRGB= <>
##$CPDPRGT= <>
##$D= (0..31)
0 1.2 0 0 0 0 0 0 0 0.06 0 0.03 0 0 0 0 0.0002 0 0 0 0 0 0 0 0 0 0 0 0 
0 0 0 
##$DATE= 1642754113
##$DBL= (0..7)
120 120 120 120 120 120 120 120 
##$DBP= (0..7)
150 150 150 150 150 150 150 150 
##$DBP07= 0
##$DBPNAM0= <>
##$DBPNAM1= <>
##$DBPNAM2= <>
##$DBPNAM3= <>
##$DBPNAM4= <>
##$DBPNAM5= <>
##$DBPNAM6= <>
##$DBPNAM7= <>
##$DBPOAL= (0..7)
0.5 0.5 0.5 0.5 0.5 0.5 0.5 0.5 
##$DBPOFFS= (0..7)
0 0 0 0 0 0 0 0 
##$DE= 6
##$DECBNUC= <off>
##$DECIM= 32
##$DECNUC= <off>
##$DECSTAT= 4
##$DIGMOD= 1
##$DIGTYP= 9
##$DL= (0..7)
0 120 120 120 120 120 120 120 
##$DP= (0..7)
150 150 150 150 150 150 150 150 
##$DP07= 0
##$DPNAME0= <>
##$DPNAME1= <>
##$DPNAME2= <>
##$DPNAME3= <>
##$DPNAME4= <>
##$DPNAME5= <>
##$DPNAME6= <>
##$DPNAME7= <>
##$DPOAL= (0..7)
0.5 0.5 0.5 0.5 0.5 0.5 0.5 0.5 
##$DPOFFS= (0..7)
0 0 0 0 0 0 0 0 
##$DQDMODE= 0
##$DR= 18
##$DS= 0
##$DSLIST= <SSSSSSSSSSSSSSS>
$$ [...]
##$SUBNAM2= <"">
##$SUBNAM3= <"">
##$SUBNAM4= <"">
##$SUBNAM5= <"">
##$SUBNAM6= <"">
##$SUBNAM7= <"">
##$SUBNAM8= <"">
##$SUBNAM9= <"">
##$SW= 18.0517287032376
##$SWIBOX= (0..15)
0 0 2 0 0 0 0 0 0 0 0 0 0 0 0 0 
##$SW_h= 3612.71676300578
##$TD= 16384
##$TD0= 1
##$TE= 0
##$TE2= 300
##$TE3= 300
##$TEG= 300
##$TL= (0..7)
0 120 120 120 120 120 120 120 
##$TP= (0..7)
150 150 150 150 150 150 150 150 
##$TP07= 0
##$TPNAME0= <>
##$TPNAME1= <>
##$TPNAME2= <>
##$TPNAME3= <>
##$TPNAME4= <>
##$TPNAME5= <>
##$TPNAME6= <>
##$TPNAME7= <>
##$TPOAL= (0..7)
0.5 0.5 0.5 0.5 0.5 0.5 0.5 0.5 
##$TPOFFS= (0..7)
0 0 0 0 0 0 0 0 
##$TUNHIN= 0
##$TUNHOUT= 0
##$TUNXOUT= 0
##$USERA1= <user>
##$USERA2= <user>
##$USERA3= <user>
##$USERA4= <user>
##$USERA5= <user>
##$V9= 5
##$VALIST= <valist>
##$VCLIST= <CCCCCCCCCCCCCCC>
##$VD= 0
##$VDLIST= <DDDDDDDDDDDDDDD>
##$VPLIST= <PPPPPPPPPPPPPPP>
##$VTLIST= <TTTTTTTTTTTTTTT>
##$WBST= 1024
##$WBSW= 4
##$XGAIN= (0..3)
0 0 0 0 
##$XL= 0
##$YL= 0
##$YMAX_a= 230149
##$YMIN_a= -241231
##$ZGOPTNS= <>
##$ZL1= 120
##$ZL2= 120
##$ZL3= 120
##$ZL4= 120
##$ABSF1= 10
##$ABSF2= 0
##$ABSG= 5
##$ABSL= 3
##$ALPHA= 0
##$AQORDER= 0
##$ASSFAC= 0
##$ASSFACI= 0
##$ASSFACX= 0
##$ASSWID= 0
##$AUNMP= <proc_1d>
##$AZFE= 0.1
##$AZFW= 0.1
##$BCFW= 1
##$BC_mod= 2
##$BYTORDP= 1
##$COROFFS= 0
##$CY= 11.3945322036743
##$DATMOD= 1
##$DC= 2
##$DFILT= <>
##$DTYPP= 0
##$F1P= 2.36226072786647
##$F2P= -0.459571619588291
##$FCOR= 0.5
##$FTSIZE= 0
##$FT_mod= 4
##$GAMMA= 1
##$GB= 0.15
##$INTBC= 1
##$INTSCL= 1
##$ISEN= 128
##$LB= 0.24
##$LEV0= 0
##$LPBIN= 0
##$MAXI= 10000
##$MC2= 0
##$MEAN= 0
##$ME_mod= 0
##$MI= 1.114404
##$NCOEF= 0
##$NC_proc= 0
##$NLEV= 6
##$NOISF1= 3.799351
##$NOISF2= 2.8
##$NSP= 1
##$NTH_PI= 0
##$NZP= 0
##$OFFSET= 15.70392
##$PC= 1
##$PHC0= -15936.59
##$PHC1= -3.999225
##$PH_mod= 1
##$PKNL= yes
##$PPARMOD= 0
##$PSCAL= 0
##$PSIGN= 0
##$REVERSE= no
##$SF= 200.130013532006
##$SI= 16384
##$SIGF1= 3
##$SIGF2= 2
##$SINO= 400
##$SIOLD= 16384
##$SREGLST= <1H.CDCl3>
##$SSB= 0
##$STSI= 0
##$STSR= 0
##$SW_p= 3612.71676300578
##$SYMM= 0
##$S_DEV= 0
##$TDeff= 0
##$TDoff= 0
##$TI= <>
##$TILT= no
##$TM1= 0
##$TM2= 0
##$TOPLEV= 0
##$USERP1= <user>
##$USERP2= <user>
##$USERP3= <user>
##$USERP4= <user>
##$USERP5= <user>
##$WDW= 1
##$XDIM= 8192
##$YMAX_p= 0
##$YMIN_p= 0
$$ End of Bruker specific parameters
$$ ---------------------------------
##NTUPLES= NMR FID
##VAR_NAME=  TIME,          FID/REAL,        FID/IMAG
##SYMBOL=    X,             R,               I
##VAR_TYPE=  INDEPENDENT,   DEPENDENT,       DEPENDENT
##VAR_FORM=  AFFN,          ASDF,            ASDF
##VAR_DIM=   8192,          8192,            8192
##UNITS=     SECONDS,       ARBITRARY UNITS, ARBITRARY UNITS
##FACTOR=    0.0002768,     1,               1
##FIRST=     0,             0,               0
##LAST=      2.2672688,     0,               0
##MIN=       0,             -241231,         0
##MAX=       2.2672688,     230149,          0
$$ Real data points
##PAGE= N=1
##DATA TABLE= (X++(R..R)), XYDATA
$$ plain form
0 0 0 0 0 0 0 0 0 0 0 0 0 0 0 -8 8 -8 8 -8 16 -16 16 -20 24 -28 32 -38 42 -48 56 -61 68 -76 86 -100 108 -124
36 -124 137 -150 166 -184 201 -222 245 -269 296 -326 356 -392 430 -472 519 -573 633 -701 781
55 781 -872 977 -1103 1256 -1445 1682 -1988 2401 -2970 3800 -5098 7322 -11737 23216 -101287
70 -101287 -192780 160640 -157989 150255 42261 -156771 230149 -164860 19980 60967
80 60967 -149160 229676 -145164 -36195 122767 -154976 174249 -108245 -47790 174326
90 174326 -175062 110037 -46816 -57677 180301 -187008 75430 25407 -88107 154327
100 154327 -167389 62711 75549 -133294 131125 -115841 41864 91183 -165124 127390
110 127390 -58044 -3342 90945 -162534 128842 -20608 -59321 100112 -132673 110788
$$ packed form
0@%%%%%%%%%%%%%qJ6j6J6j6K4l2L2l6M4n2O0p0Q0r0J04j17J29j44J62j86K08k32
36a24K61k87L16l50L85m23M67n14N65o22O82p48Q22r02R91j092J206j334J482
55G81j653J849k080K359k701L127l670M389n371O770q898J2420j9059L4953j24503
70a01287r1493L53420l18629L08244j07994j99032L86920l95009J84840M0987
80F0967k10127L78836l74840J08969J58962k77743L29225k82494O0455K22116
90A74326l49388K85099j56853j0861K37978l67309K62438n0023j13514K42434
100A54327l21716K30100J2838k08843K64419k46966J57705M9319k56307K92514
110A27390j85434N4702R4287k53479K91376j49450l8713J59433k32785K43461
$$ plain form
120 110788 -4647 -98757 122364 -100985 67289 9927 -108636 138287 -83835 16864
130 16864 38236 -100754 130022 -75015 -18319 74410 -95214 99999 -57391 -33726 99840
141 99840 -98668 66186 -24418 -41813 103416 -101134 43252 13524 -55469 91398 -90110
152 -90110 30330 41183 -74710 78346 -64513 16182 53083 -88499 71818 -35135 -6188
163 -6188 56343 -87938 67200 -13145 -32143 60808 -75332 55726 108 -51650 68509
174 68509 -60057 35026 11379 -59583 73046 -48313 11302 25736 -59250 68341 -38845
185 -38845 -7428 41224 -57173 55229 -26905 -18975 52051 -56009 39573 -10724 -26750 54788
197 54788 -53107 26174 6311 -34043 51150 -45542 15557 19540 -40936 45403 -33649 5421
$$ packed form
120A10788j15435r4110K21121k23349J68274n7362j18563K46923k22122J00699
130A6864K1372j38990K30776k05037N6696R2729j69624J95213j57390K3665J33566
141I9840j98508J64854r0604j7395J45229k04550J44386k9728o8993J46867j81508
152i0110J20440J0853j15893J53056j42859Q0695L6901j41582J60317j06953K8947
163f188O2531j44281J55138q0345j8998R2951j36140J31058n5618n1758J20159
174F8509j28566R5083k3647p0962J32629j21359N9615J4434q4986J27591j07186
185c8845L1417M8652r8397J12402q2134P930P1026j08060R5582n0297j6026Q1538
197E4788j07895P9281j9863m0354Q5193r6692O1099L983o0476Q6339p9052L9070
$$ plain form
209 5421 27446 -44943 39971 -20499 -5723 31682 -44194 34162 -9033 -16606 34454 -39391
221 -39391 26437 9 -24867 36365 -32918 16711 7810 -29503 36275 -26254 6504 15152
233 15152 -31098 33178 -19372 -2425 21342 -30770 27545 -11893 -9332 25287 -29073 20709
245 20709 -4050 -14526 26466 -25824 13780 3226 -18226 25277 -21023 7274 8953 -20311
257 -20311 22607 -15326 1402 12841 -20700 19094 -9488 -3764 15107 -19480 14982 -4164
269 -4164 -7864 16011 -17031 10584 340 -10592 15761 -13975 6225 3982 -12089 14579 -10599
282 -10599 2226 6775 -12484 12513 -7092 -1166 8514 -11856 9883 -3763 -3711 9201 -10436
295 -10436 7082 -876 -5400 8969 -8476 4338 1436 -6203 7952 -6184 1884 2922 -6119
$$ packed form
209E421K2025p2389Q4914o0470J4776L7405p5876P8356m3195p573N1060p3845
221c9391O5828k6428k4876O1232o9283M9629q901l7313O5778o2529L2758Q648
233A5152m6250O4276n2550J6947K3767n2112N8315l9438K561L4619n4360M9782
245B0709k4759j0476M0992n2290L9604j0554k1452M3503m6300K8297J679k9264
257b0311M2918l7933J6728J1439l3541L9794k8582N724J8871l4587L4462j9146
269d164l700K3875l3042K7615j0244j0932K6353k9736K0200k243j6071K6668k5178
282a0599J2825M549j9259K4997j9605N926R680k0370K1739j3646N2J2912j9637
295a0436J7518p958m524J4369j7445J2814k902p639J4155j4136Q068J038r041
$$ plain form
308 -6119 6416 -3930 -16 3590 -5351 4659 -2029 -1213 3601 -4209 2959 -586 -1778 3079 -2878
323 -2878 1475 311 -1715 2141 -1577 430 631 -1195 1091 -538 -113 464 -408 85 172 -181 -122 525
341 525 -729 484 190 -970 1418 -1212 321 921 -1932 2130 -1311 -257 1908 -2836 2523 -979
357 -979 -1181 3007 -3574 2540 -195 -2381 4050 -3955 2037 919 -3634 4832 -3882 1110 2286 -4840
373 -4840 5289 -3374 -175 3780 -5827 5294 -2369 -1753 5226 -6455 4803 -944 -3466 6429
387 6429 -6608 3800 769 -5133 7303 -6267 2398 2652 -6645 7745 -5407 573 4631 -7869
401 -7869 7649 -4013 -1497 6458 -8616 6968 -2200 -3664 7986 -8828 5745 -42 -5774
414 -5774 9111 -8435 3958 2320 -7664 9641 -7372 1767 4671 -9099 9523 -5723 -664
$$ packed form
308f119J2535j0346L914L606q941J0010o688Q16M814p810P168l545j192M857n957
323b878M353j164k026L856l718K007K01j826K286j629M25N77q72M93Q7l53N9O47
341E25j254J213k94j160K388k630J533O00k853M062l441J054K165m744N359l502
357i79k02M188o581O114k735k186O431q005N992j118m553Q466q714M992J176p126
373d840J0129q663L199L955r607J1121p663O16O979j1681J1258n747k522R895
387F429j3037J0408l031n902J2436j3570Q665K54r297J4390j3152N980M058j2500
401g869J5518j1662K516P955j5074J5584r168j464J1650j6814J4573n787n732
414e774J4885j7546J2393j638r984J7305j7013R139K904j3770J8622j5246N059
$$ plain form
427 -664 6811 -9992 8742 -3608 -3187 8611 -10257 7351 -1151 -5627 9901 -9822 5402
440 5402 1479 -7752 10596 -8763 3046 4054 -9455 10688 -7147 403 6525 -10629 10077
453 10077 -5021 -2343 8673 -11157 8767 -2516 -4989 10339 -11064 6883 303 -7406 11352
466 11352 -10272 4519 3214 -9459 11604 -8706 1835 5952 -10978 11102 -6434 -1019 8228
479 8228 -11781 9962 -3738 -3930 9934 -11727 8195 -851 -6679 11089 -10778 5848 1937
492 1937 -8923 11658 -9167 2983 4529 -10384 11545 -7255 -98 7040 -11122 10594 -5058
505 -5058 -3002 9339 -11310 8753 -2448 -5428 10984 -11110 6424 584 -7478 11656 -10384
518 -10384 4001 3770 -9375 11374 -8752 1613 6540 -11064 10527 -6122 -959 8434 -12022
$$ packed form
427f64P475j6803J8734j2350M21J1798j8868J7608q502m476J5528j9723J5224
440E402l923r231J8348j9359J1809J008j3509K0143j7835P550O122j7154K0706
453A0077j5098K678J1016j9830J9924j1283k473J5328k1403J7947o580p709J8758
466A1352k1624J4791j305j2673K1063k0310J0541M117j6930K2080j7536N415R247
479H228k0009K1743j3700j92J3864k1661J9922r046n828J7768k1867J6626l911
492A937j0860K0581k0825J2150J546j4913K1929j8800P157P138j8162K1716j5652
505e058K056J2341k0649K0063j1201k980J6412k2094J7534n840q062J9134k2040
518a0384J4385k31j3145K0749k0126J0365M927j7604K1591j6649N163R393k0456
$$ plain form
531 -12022 9441 -3009 -3909 9549 -11722 8044 -171 -6936 10398 -10205 5855 2095 -9242
544 -9242 11140 -8136 2716 4137 -10243 11309 -6286 -751 6438 -10170 10235 -4651 -3615
557 -3615 8927 -9878 7864 -2533 -5360 10728 -9826 5043 506 -6542 11041 -9622 2785
570 2785 4007 -8036 10005 -8267 1221 6773 -9949 8666 -5404 -545 8033 -11313 7843
583 7843 -1938 -3250 8264 -10982 7214 741 -6523 8669 -8965 5635 2242 -8985 9625
596 9625 -6479 2527 3381 -9600 10302 -4762 -1206 5239 -8751 9434 -3836 -4007 7806 -7887
610 -7887 6798 -2495 -5151 9782 -7901 3622 232 -5396 9883 -8157 1467 3735 -6261 8307
624 8307 -7235 584 6382 -8082 6572 -4553 -311 7200 -9633 5828 -1129 -2412 6802 -9428
$$ packed form
531a2022K1463j2450r00J3458k1271J9766q215o765J7334k0603J6060l760j1337
544i242K0382j9276J0852J421j4380K1552j7595N535P189j6608K0405j4886J036
557c615J2542j8805J7742j0397k827J6088k0554J4869m537p048J7583k0663J2407
570B785J222j2043J8041j8272R488N552j6722J8615j4070M859Q578j9346J9156
583G843r781j312J1514j9246J8196o473p264J5192j7634J4600l393j1227J8610
596I625j6104R006Q54j2981J9902j5064L556O445j3990J8185j3270j71J1813j5693
610g887J4685r293k656J4933j7683J1523l390n628J5279j8040R624K268r996J4568
624H307j5542P819N798j4464J4654j1125M242P511j6833J5461o957j283R214j6230
$$ plain form
638 -9428 5711 1332 -5414 6691 -7418 4787 2298 -7775 7524 -4925 2232 2772 -8258
651 -8258 8375 -3371 -1148 4007 -7214 7825 -2805 -3653 6126 -6094 5550 -1995 -4486 7873
665 7873 -5910 2697 63 -4401 7984 -6174 759 2898 -4754 6546 -5559 72 5086 -5983
679 -5983 4897 -3497 -445 5748 -7164 4103 -801 -1838 5315 -7083 3946 1195 -3970 5024
693 5024 -5602 3342 2003 -5735 5440 -3703 1597 2322 -6203 5968 -2401 -770 3093 -5509 5616
708 5616 -1819 -2627 4427 -4646 4096 -1166 -3379 5555 -4303 2137 169 -3438 5677 -4224 639
723 639 1984 -3627 4772 -3684 -88 3423 -4220 3674 -2368 -610 3977 -4788 2954 -690 -1507 3875
739 3875 -4692 2556 646 -2715 3700 -3845 1988 1388 -3710 3802 -2730 924 1826 -4071 3917 -1801
$$ packed form
638i428J5139m379o746J2105j4109J2205k489j0073J5299j2449P157N40j1030
651h258J6633j1746K223N155j1221J5039j0630q48R779j2220J1644p545k491J2359
665G873j3783Q607k634m464J2385j4158O933K139p652J1300j2105N631N014j1069
679e983J0880q394L052O193j2912J1267m904j037P153j2398J1029k751n165Q994
693E024j0626Q944j339p738J1175r143N300P25q525J2171q369J631L863q602J1125
708E616p435q08P054r073Q742n262k213Q934r858O440j968l607R115r901M863
723F39J345n611Q399q456L596L511p643P894o042J758M587q765P742l644q17N382
739C875q567P248j910l361O415p545N833o00n098P512o532L654R02n897P988n718
$$ plain form
755 -1801 -441 2368 -3853 3576 -1182 -1587 3060 -3408 2711 -537 -2224 3588 -3060 1590 326
770 326 -2482 3641 -2744 621 1313 -2673 3207 -2216 -64 2101 -2880 2581 -1407 -605 2490 -2973
786 -2973 2026 -476 -1189 2545 -2801 1543 318 -1777 2502 -2325 1009 874 -2220 2428 -1733 370
802 370 1263 -2402 2286 -1164 -305 1624 -2339 1981 -661 -909 1914 -2127 1503 -157 -1301 2075
818 2075 -1871 936 356 -1535 2025 -1555 392 816 -1668 1811 -1143 -81 1160 -1705 1468 -675
834 -675 -453 1355 -1600 1117 -208 -758 1396 -1419 764 183 -996 1340 -1137 415 486 -1121 1233
851 1233 -831 75 691 -1137 1063 -527 -221 836 -1094 856 -255 -440 926 -969 615 11
867 11 -593 910 -811 360 214 -686 835 -618 132 370 -703 698 -413 -48 476 -650 545
$$ packed form
755a801J360K809o221P429m758m05M647o468O119l248j687N812o648M650j264
770C26k808O123o385L365O92l986N880n423K152K165m981N461l988Q02L095n463
786b973M999k502p13L734n346M344j225k095M279m827L334j35l094M648m161K103
802C70Q93l665M688l450Q59J929l963M320k642k48K823m041L630j660j144L376
818B075l946K807n80j891L560l580J947M24k484L479k954J062J241k865L173k143
834f75K22J808k955K717j325n50K154k815K183n81j179K336k477J552P1j607K354
851A233k064R06O16j828K200j590L06J057j930J950j111j85J366j895J584o04
867A1o04J503j721J171j46r00J521j453P50K38j073J401j111L65N24j126J195
$$ plain form
884 545 -201 -198 505 -555 384 -44 -291 473 -446 216 80 -321 404 -293 89 154 -304 312 -179 -16 173
905 173 -254 207 -82 -66 165 -190 110 -19 -75 116 -107 35 15 -61 59 -47 2 8 -23 -10 13 -9 -17 42 -76
930 -76 46 -5 -51 112 -109 53 47 -127 191 -127 28 121 -199 227 -115 -30 199 -267 242 -80 -118 283 -320
953 -320 226 -13 -216 354 -343 172 87 -321 422 -321 84 208 -409 451 -268 -17 331 -480 449 -199 -140
974 -140 441 -542 403 -63 -290 545 -548 314 72 -430 620 -512 207 234 -563 638 -449 49 393
993 393 -657 628 -355 -118 532 -720 566 -184 -309 650 -725 468 -7 -472 729 -680 331
1010 331 189 -620 788 -588 153 390 -730 773 -444 -56 551 -792 711 -286 -264 706 -836 607
1028 607 -84 -460 813 -825 444 112 -637 881 -733 254 331 -780 901 -614 50 535 -890
$$ packed form
884E45p46LP03j060R39m28k47P64r19O62j36m01P25o97L82O5m58O16m91J63J89
905A73m27M61k89J6K31l55L00j29n6J91k23J42k0p6J20j06M9Ol1J3K3k2qN9j18
930g6J22n1m6J63k21J62oj74L18l18J55R3l20M26l42Q5K29m66N09l22l8M01o03
953c20N46k39k03N70o97N15q5m08P43p43M05J24o17Q60p19K51L48q11R29o48N9
974a40N81r83R45m66k27Q35j093Q62k42n02J050j132P19K7p97J201j087M98L44
993C93j050J285r83K37O50j252J286p50j25R59j375J193m75m65J201j409J011
1010C31j42q09J408j376P41K37j120J503j217L88O07j343J503r97K2R70j542J443
1028F07o91l76J273j638J269l32p49J518j614R87P7j111J681j515O64M85j425
$$ plain form
1045 -890 848 -445 -176 710 -941 746 -217 -394 863 -922 586 25 -596 927 -858 398 249
1062 249 -772 946 -726 177 467 -911 921 -528 -73 656 -965 821 -315 -342 803 -953 678
1079 678 -92 -555 924 -896 484 128 -732 994 -798 248 373 -851 981 -654 6 616 -921
1096 -921 901 -475 -204 823 -999 749 -223 -404 938 -1005 588 54 -614 969 -917 411
1112 411 305 -825 952 -740 198 511 -976 927 -504 -83 658 -1015 852 -266 -378 797 -947
1129 -947 711 -73 -621 924 -832 462 114 -758 1021 -724 191 362 -815 1005 -631 -66 626
1146 626 -855 849 -476 -249 842 -933 660 -222 -383 936 -969 488 109 -564 911 -905
1162 -905 360 372 -800 862 -694 207 523 -967 835 -424 -54 606 -1000 810 -190 -371 695
$$ packed form
1045h90J738j293K69Q86j651J687r63j77J257j785J508n61o21J523j785J256j49
1062B49j021J718j672R03K90j378J832j449M55P29j621J786j136k7J145j756J631
1079F78p70m63J479j820J380l56q60J726j792J046J25j224J832j635O60O10j537
1096i21J822j376K71J027j822J748r72j81J342j943J593n34o68J583j886J328
1112D11j06j130J777j692R38L13j487J903j431M21P41j673J867j118j12J175j744
1129i47J658p84n48J545j756J294l48q72J779j745R15J71j177J820j636N65O92
1146F26j481J704j325K27J091j775J593q82j61J319j905J457l79o73J475j816
1162i05J265J2j172J662j556R01L16j490J802j259L70O60j606J810j000j81J066
$$ plain form
1179 695 -875 688 -34 -624 846 -709 454 94 -735 952 -594 120 297 -747 926 -537 -145
1196 -145 576 -733 755 -427 -270 788 -786 514 -188 -363 868 -863 346 123 -481 806 -814
1213 -814 256 388 -689 690 -606 158 510 -859 673 -325 -33 538 -887 683 -94 -328 594
1230 594 -753 603 22 -579 692 -586 378 94 -675 796 -465 82 249 -646 796 -413 -175
1247 -175 469 -595 628 -338 -281 663 -619 421 -151 -319 734 -663 247 119 -398 669 -647 171
1265 171 352 -540 577 -472 93 456 -679 514 -248 -47 471 -715 511 -54 -264 483 -626 452
1283 452 47 -472 552 -465 280 120 -550 609 -354 66 219 -533 609 -280 -139 373 -493 480 -206
1302 -206 -245 514 -474 318 -70 -284 558 -471 176 108 -332 512 -442 90 251 -419 425 -329 10 355
$$ packed form
1179F95j570J563p22n90J470j555J163l60q29J687j546P14J77j044J673j463L92
1196a45P21j309J488j182J57J058j574J300p02j75J231j731J209k23o04J287j620
1213h14J070J32j077J379j296P64L52j369J532r98K92N71j425J570p77k34R22
1230E94j347J356n81o01J271j278R64k84p69J471j261N47J67q95J442j209K38
1247a75O44j064J223r66N7R44j282J040n72j68J053j397R10j28n17J067j316Q18
1265A71J81q92J117j049N65L63j135J193p62K01N18j186J226n65k10P47j109J078
1283D52m05n19J024j017P45j60o70J159r63M20J53p52J142q89J41N12q66R73o86
1302b06l9P59r88P92l88k14Q42j029O47o8m40Q44r54N32J61o70Q44p54L39L45
$$ plain form
1322 355 -479 370 -166 -84 369 -494 338 -31 -216 379 -441 268 63 -328 401 -347 161 124 -385 413 -254
1343 -254 33 198 -390 397 -169 -94 287 -353 306 -94 -171 349 -329 210 -4 -223 360 -292 115 92 -251
1364 -251 335 -242 20 187 -290 282 -165 -34 245 -294 234 -88 -107 258 -293 186 -4 -160 264 -257
1384 -257 136 75 -203 264 -191 80 111 -232 248 -144 -3 148 -231 218 -76 -65 188 -220 168 -10 -121
1405 -121 202 -189 98 29 -146 193 -160 41 77 -161 177 -113 -2 119 -168 154 -76 -36 137 -164 123
1426 123 -18 -72 140 -135 87 20 -91 141 -108 45 64 -113 129 -84 8 72 -119 113 -53 -18 96 -118
1448 -118 90 -23 -48 98 -105 52 -7 -70 94 -95 36 17 -73 79 -63 15 44 -70 69 -43 -7 52 -63
1471 -63 50 -21 -21 59 -56 37 4 -39 44 -55 13 13 -32 34 -27 -5 24 -40 35 -14 -8 15 -37 8 -17 -21 13 -14 0 5 -4 9
$$ packed form
1322C55q34Q49n36Q2M53q63Q32l69j85N95q20P09k05l91P29p48N08l7n09P98o67
1343b54K87J65n88P87n66P5L81o40O59m00p7N20o78N39k14k19N83o52M07k3l43
1364b51N86n77K62J67m77N72m47J31K79n39N28l22j9L65n51M79j90j56M24n21
1384b57L93o1k78M67m55K71L1l43M80l92J41J51l79M49k94J1K53m08L88j78j11
1405a21L23l91K87o9j75L39l53K01L6k38L38k90J11J21k87L22k30M0J73l01K87
1426A23j41n4K12k75K22o7j11K32k49J53J9j77K42k13R2O4j91K32j66L5J14k14
1448a18K08j13k5J46k03J57n9o3J64j89J31j9r0J52j42P8K9j14J39j12L6N9j15
1471f3J13p1%Q0j15R3l3m3Q3r9O8%m5O6o1K2K9o4P5m9OK3n2M5k5mL4k7J4NrJ3
$$ plain form
1503 9 -14 -4 6 -5 -4 4 -6 6 -2 6 8 4 12 14 -9 10 6 -2 31 -11 8 5 -8 30 -16 1 4 -27 24 -25 7 36 -31 27 -9 -8 25
1540 25 -42 26 -1 -42 39 -40 22 21 -43 51 -40 5 34 -55 55 -26 -4 57 -59 53 -5 -20 66 -59 46 16 -50 77
1568 77 -57 21 28 -78 72 -57 11 48 -70 86 -35 -27 63 -84 64 -16 -45 73 -86 53 4 -47 98 -76
1592 -76 34 40 -78 94 -74 -2 63 -81 99 -50 -13 73 -93 88 -25 -38 91 -99 63 -4 -75 100 -98
1615 -98 47 31 -84 113 -73 26 53 -115 100 -77 -20 71 -109 104 -31 -42 99 -109 77 -4 -67 121 -113
1638 -113 52 26 -84 121 -75 20 54 -93 119 -58 -3 89 -122 108 -40 -41 104 -126 74 -12 -74 116 -117
1661 -117 60 18 -95 117 -94 30 44 -111 118 -78 -7 72 -126 115 -54 -28 95 -126 104 -19 -58 119
1683 119 -115 76 1 -90 133 -103 46 33 -110 135 -85 4 67 -127 132 -70 -22 108 -131 101 -32 -52
$$ packed form
1503Ik3J0J0j1JQj0J2qQKmQKk3J9mqL3m2J9lj3L8m6J7Ll1N1m9L2K9o7N8l6JL3
1540B5o7O8k7m1Q1p9O2jo4R4r1M5K9q9J10q1K2O1j16J12n8j5Q6j25J05l0o6J27
1568G7j34P8Pj06J50j29O8L7j18J56j21QR0j47J48q0k9J18j59J39m9n1J45j74
1592g6J10Oj18J72j68P2O5j44J80j49L7Q6j66J81j13j3J29j90J62o7p1J75j98
1615i8J45j6j15J97j86R9K7j68K15j77N7R1j80K13j35j1J41k08J86q1o3J88k34
1638a13J65k6j10K05j96R5L4j47K12j77N5R2k11K30j48jJ45k30K00q6o2J90k33
1661a17J77m2j13K12k11J24J4j55K29j96P1P9j98K41j69K6J23k21K30j23l9J77
1683A19k34J91p5r1K23k36J49j3j43K45k20Q9O3j94K59k02M8J30k39K32j33k0
$$ plain form
1705 -52 123 -131 84 12 -84 123 -125 45 36 -100 126 -101 30 70 -125 136 -50 -11 107 -136 119 -20
1727 -20 -44 117 -137 104 5 -78 124 -119 73 18 -113 147 -91 21 58 -124 140 -77 -17 85 -120 116
1749 116 -55 -59 124 -129 80 -12 -73 143 -126 64 36 -81 136 -117 33 75 -102 127 -92 -2 104 -134
1771 -134 109 -51 -24 107 -147 95 6 -69 122 -129 76 23 -107 129 -102 49 55 -125 124 -78 -1 77 -131
1794 -131 137 -61 -47 90 -118 100 -27 -72 128 -102 83 5 -86 138 -109 36 43 -101 140 -86 0 91 -112
1817 -112 106 -71 -23 107 -124 77 -15 -41 111 -130 61 15 -84 101 -114 41 42 -112 107 -77 12 65 -132
1840 -132 108 -53 -25 75 -122 100 -19 -66 108 -104 78 13 -87 114 -90 47 21 -91 121 -73 10 55
1862 55 -98 111 -65 -31 79 -107 81 -33 -61 96 -98 56 -10 -57 106 -106 42 39 -80 96 -74 8 50
$$ packed form
1705e2J75k54K15p2r6K07k48J70rj36K26k27J31M0j95K61j86L9J18k43K55j39
1727b0k4J61k54K41r9q3K02k43J92n5j31K60k38J12L7j82K64k17O0J02k05K36
1749A16j71mJ83k53K09r2o1K16k69J90k8j17K17k53J50M2j77K29k19R0J06k38
1771a34K43j60K7J31k54K42q9p5J91k51K05n3j30K36k31J51Oj80K49k02P7P8k08
1794a31K68j98J4J37k08K18j27m5K00k30J85p8r1K24k47J45Pj44K41k26Q6R1k03
1817a12K18j77M8J30k31K01r2k6J52k41J91m6r9J85k15J55Jj54K19j84Q9N3j97
1840a32K40j61K8J00j97K22j19m7J74k12J82o5j00K01k04J37k6j12K12j94Q3M5
1862E5j53K09j76L4J10j86J88j14k8J57j94J54o6m7J63k12J48lj19J76j70Q2M2
$$ plain form
1885 50 -94 86 -49 -5 72 -105 87 -17 -27 74 -95 71 -1 -64 82 -84 52 21 -78 92 -71 14 35
1908 35 -91 92 -56 -9 47 -82 70 -29 -36 67 -80 61 -8 -44 86 -74 42 13 -57 95 -68 8 36 -60
1932 -60 77 -54 7 65 -70 62 -25 -13 60 -76 55 -3 -31 72 -77 29 20 -57 68 -54 32 21 -71 76 -51
1957 -51 5 31 -76 54 -36 -13 48 -52 59 3 -26 50 -56 44 -5 -36 64 -39 28 24 -30 63 -30 1 36 -46 53
1984 53 -26 -3 33 -49 42 -10 -18 43 -44 29 3 -31 47 -40 19 16 -55 45 -37 14 30 -41 44 -23 -2 29 -29 29 -14 -12 35
2015 35 -20 39 9 -9 32 -29 24 4 -12 41 -28 5 7 -28 28 -14 0 11 -29 26 -21 -1 10 -28 11 -3 -9 13 -27 10 2 -14
2047 -14 20 -16 20 4 -10 23 -12 1 9 -13 20 -6 7 12 -11 5 1 -5 17 -1 15 11 -9 17 1 16 6 -15 7 -22 -1 5 -2 4
2081 4 -9 2 1 -6 -4 -1 -7 -3 -5 1 0 5 -3 16 7 9 13 -1 15 11 4 7 0 9 10 4 8 -5 -3 7 0 11 -15 -6 2 -10 7 -10 3 2 -14 8 -16 -12 16
$$ packed form
1885E0j44J80j35M4P7j77J92j04j0J01j69J66p2o3J46j66J36l1r9J70j63Q5K1
1908C5j26J83j48M7N6j29J52r9pJ03j47J41o9l6J30j60J16k9p0J52j63P6K8r6
1932f0J37j31O1N8j35J32q7J2P3j36J31n8k8J03j49J06rp7J25j22Q6j1r2J47j27
1957e1N6K6j07J30r0K3O1j00J11n6k9P6j06J00m9l1J00j03O7mn4R3r3L1L5q2R9
1984E3p9K3L6q2R1n2qO1q7P3k6l4P8q7N9lp1J00q2N1J6p1Q5o7K1L1n8N8m3KM7
2015C5n5N9l0j8M1o1N3k0j6N3o9L3Kl5N6m2J4J1m0N5m7K0J1l8L9j4oK2m0L7qj6
2047a4L4l6L6j6j4L3l5J3Qk2L3k6J3Nk3J6moK2j8J6mk0K6j6J5j0k1K2k9K1OpO
2081Dj3J1jpKLoMkOjNqJ9rKMj4J6mpLpRJoMj3KJ0pJ1k6RQj2J7j7J3jj6K2k4MK8
$$ plain form
2126 16 -11 13 -2 -11 18 -8 3 5 -8 18 -14 6 19 -10 30 3 9 20 -23 30 -7 0 28 -9 19 6 -11 17 -21 8 -1 -13 24
2159 24 -27 9 4 -30 20 -26 5 9 -27 32 -17 -8 10 -29 26 -13 -13 19 -26 21 -4 -18 30 -24 14 2 -20 41 -31 5 19 -36
2191 -36 32 -15 7 23 -37 25 -16 3 24 -33 25 -15 -24 17 -39 23 0 -27 30 -34 22 7 -25 41 -31 6 20 -31 42 -18 6
2222 6 39 -43 48 -3 2 56 -38 36 1 -10 48 -30 27 15 -22 38 -24 25 16 -37 44 -24 5 35 -48 41 -22 -11 34 -42 35 -7
2254 -7 -13 40 -42 32 2 -21 57 -32 14 12 -27 43 -29 26 25 -29 49 -16 3 36 -46 39 -13 -14 25 -48 32 -1 -29 45 -43 27 12
2287 12 -23 46 -36 13 13 -45 47 -23 2 24 -38 44 -17 -5 40 -41 37 -5 -17 50 -40 25 16 -19 47 -34 22 27 -29 58 -29 22
2319 22 26 -52 44 -27 -10 35 -52 43 -11 -18 30 -52 43 -8 -36 40 -37 14 6 -38 51 -28 19 21 -45 49 -17 -7 27 -51 39 -16
2351 -16 -11 44 -46 34 7 -18 42 -42 23 6 -28 46 -38 9 20 -43 36 -26 -4 23 -47 30 -19 -2 34 -41 35 -21 -11 38 -39
$$ packed form
2126A6k7K4j5rK9k6J1Kj3K6l2K0J3k9M0k7OJ1m3N3l7PK8l7K8j3j7K8l8K9rj2L7
2159B4n1L6nl4N0m6L1Ml6N9m9RJ8l9N5l9%L2m5M7k5j4M8n4L8j2k2O1p2L6J4n5
2191c6O8m7K2J6o0O2m1J9K1n7N8m0rM1n6O2k3k7N7o4N6j5l2O6p2L7J4n1P3o0K4
2222FL3q2R1n1NN4r4P4l5j1N8p8N7j2l7O0o2M9rn3Q1o8K9L0q3Q9o3J1M5p6P7m2
2254goN3q2P4l0k3P8q9M6kl9P0p2N5jn4P8o5J9L3q2Q5n2jL9p3Q0l3k8P4q8P0j5
2287A2l5O9q2M9%n8R2p0K5K2o2Q2o1J2M5q1P8m2j2O7r0O5rl5O6q1N6Nn6Q7q7N1
2319B2Mp8R6p1J7M5q7R5n4pM8q2R5n1k8P6p7N1qm4Q9p9M7Ko6R4o6J0L4p8R0n5
2351a6NN5r0Q0k7k5O0q4O5j7l4P4q4M7J1o3P9o2K2K7p0P7m9J7L6p5P6n6J0M9p7
$$ plain form
2382 -39 27 0 -29 50 -26 25 20 -34 48 -33 14 20 -45 45 -27 -10 34 -34 45 -4 -15 35 -31 27 -9 -27 49 -30 11 3 -23 38
2414 38 -40 14 13 -33 22 -30 -6 26 -37 32 -20 2 38 -35 38 -2 -6 46 -32 23 8 -18 26 -41 17 24 -12 45 -18 10 19 -31
2446 -31 36 -26 -3 21 -44 20 -9 -15 28 -28 20 -5 -20 28 -23 10 4 -21 41 -25 -3 19 -29 31 -18 5 29 -23 34 0 -9 35
2478 35 -33 27 5 -17 27 -26 15 13 -20 30 -25 12 6 -33 19 -28 -5 11 -25 27 -5 0 20 -35 22 -9 -13 20 -38 15 0 -18
2510 -18 29 -28 4 1 -19 26 -20 3 17 -14 17 -13 -16 22 -25 16 -1 1 30 -28 17 -7 -6 22 -19 8 1 -24 13 -19 15 8 -18
2543 -18 21 -13 5 12 -23 14 -6 1 18 -12 13 10 -4 13 -14 7 0 -5 22 -9 11 4 -10 22 -21 -1 9 -18 19 -12 -8 1 -10 14
2577 14 -2 -6 5 -20 -2 -8 -15 12 -19 11 1 -5 17 -16 3 13 -7 12 4 -2 15 -1 24 9 4 13 -12 7 1 -6 10 -7 8 -1 -9 7
2613 7 -7 -2 2 -4 14 -9 1 0 -8 13 -4 -3 -5 -23 2 -16 -12 -3 -6 7 1 -1 2 -6 -6 5 -1 8 3 -4 9 -7 2 -1 8 0 -8 4 -6 -8 0 -11 2 2
$$ packed form
2382c9O6k7k9P9p6N1nn4Q2q1M7Oo5R0p2J7M4o8P9m9j1N0o6N8l6j8P6p9M1qk6O1
2414C8p8N4jm6N5n2K4L2o3O9n2K2L6p3P3m0mN2p8N5j5k6M4o7N8Pl6N7o3K8Rn0
2446c1O7o2K3K4o5O4k9oM3n6M8k5j5M8n1L3ok5O2o6K2K2m8O0m9K3K4n2N7l4rM4
2478C5o8O0k2k2M4n3M1kl3N0n5L7ol9N2m7K3J6l6N2l2NK0n5N7l1mL3n8N3j5j8
2510a8M7n7L2lk0M5m6K3J4l1L1l0lL8m7M1j7KK9n8M5k4JK8m1K7pk5L7l2L4pk6
2543a8L9l4J8Pl5L7k0PJ7l0K5lj4J7k7K1pnK7l1K0pj4L2m3K0J0k7L7l1MRj1K4
2577A4j6mJ1k5J8opK7l1L0j0oK2l3J9J0k0J9qoJ7j6K5j5nRk5J9opJ6j7J5rqJ6
2613Gj4NMoJ8k3J0jqK1j7Jkj8K5j8MRlJ3okLq%J1oRnpJ3j6RlRqqJ2j0kQj1J3%
$$ plain form
2657 2 -10 3 0 -2 -3 -9 12 3 -6 -4 4 -10 -7 -3 -8 2 14 8 -6 0 5 2 12 2 -6 -5 -6 8 3 8 -3 2 1 2 -2 2 6 -8 1 -1 -6 0 -12 0 -3 5 0
2704 0 0 7 2 0 -13 -8 -2 -6 -5 -6 -7 1 1 1 11 1 6 11 6 16 0 7 5 -3 2 -9 14 6 -14 16 -1 -5 8 -6 3 -13 -9 -1 -9 2 -2 -2 6 -12 2
2749 2 2 -7 6 -3 2 -1 -13 8 -17 -1 2 -3 12 -8 5 7 -12 -3 -13 5 7 -16 13 -4 -3 7 -9 4 -2 -13 10 -9 -3 -6 -12 4 -10 -13 8
2788 8 -22 13 -8 9 18 -14 11 -11 -9 9 -19 9 0 0 22 -9 12 8 -16 26 -15 7 11 -12 12 -7 -2 6 -16 9 5 -6 8 -20 6
2823 6 -4 -10 6 -17 -8 -10 -18 7 -19 7 5 -21 14 -13 -4 7 -15 14 -8 -4 18 -16 14 1 -7 8 -14 9 -2 -23 16 -23 -2 9 -15
2858 -15 18 -16 4 12 -9 21 -7 9 15 -25 10 -12 -7 12 -17 4 -6 -21 21 -19 8 15 -14 21 -6 12 13 -18 15 -4 5 19 -4
2891 -4 25 -4 -7 16 -7 9 9 -9 22 -22 6 -3 -12 14 -13 0 9 -9 11 -8 -5 9 -27 13 -5 0 7 -23 10 0 -20 13 -13 5 3
2926 3 -19 23 -4 7 9 -9 30 2 5 17 -6 13 -6 -8 15 -14 13 -2 -11 15 -22 14 1 -3 20 -21 -3 7 -25 10 -17 -7 8
$$ packed form
2657Bj2J3lkjoK1rrKQj4LMnJ0J2oj4ONlJ0j0qJjJ4nNj1NjJmMMj4RknOj2J2lQn
2704@%Pnkj3NOmJjjQ%%J0j0NNnJ0j6PkqNj1K3qk0L0j7mJ3j4Rj6MQqJ1m%Qj8J4
2749B%rJ3rNlj2K1k5J6LnJ5k0J3Kj9Rj0J8Kk3K9j7JJ0j6J3oj1K3j9OloJ6j4lK1
2788Hl0L5k1J7Rl2K5k2KJ8k8K8r%K2l1K1mk4M2m1K2Mk3K4j9NQk2K5mj1J4k8K6
2823Fj0oJ6k3RkqK5k6K6kk6L5k7RJ1k2K9k2MK2l4L0j3qJ5k2K3j1k1L9l9K1J1k4
2858a5L3l4K0Qk1L0k8J6Om0L5k2NJ9k9K1j0j5M2m0K7Pk9L5k7J8Jl1L3j9RJ4k3
2891dK9k9lK3k3J6%j8L1m4K8rrK6k7J3Rj8K0j9LJ4l6M0j8NPl0L3j0k0L3k6J8k
2926Ck2M2k7J1Kj8L9k8LJ2k3J9j9kK3k9K7j5rK6l7L6j3mK3m1J8J0l2L5k7J0J5
$$ plain form
2959 8 -9 11 -3 -1 27 -13 18 10 -6 15 -18 4 0 -3 19 -10 8 15 -11 31 1 9 7 -8 19 -3 1 9 -16 5 -15 -14 10 -10 7 -13
2995 -13 -16 17 -20 5 -13 -19 10 -11 0 16 -7 12 -7 -1 11 -13 9 -1 7 13 -12 15 0 3 28 -7 5 15 -16 20 -15 0 2 -14
3029 -14 3 -14 -8 4 -14 7 -4 -8 10 -15 12 -4 -5 6 -8 6 -7 -15 20 -16 6 1 -16 7 -7 0 9 -1 15 -1 -2 15 -13 19
3063 19 0 1 25 -7 -1 1 -11 9 -18 0 0 -18 11 -6 -8 10 -21 13 2 6 5 -16 6 -3 -2 9 -12 10 4 -7 15 -11 2 4 -4 -6 -8
3100 -8 -7 12 -10 6 -8 -4 4 -9 13 -5 -9 5 -10 2 -5 -21 4 -15 8 -4 -12 8 -7 3 -3 -13 -6 -11 1 -6 -16 10 -1 6 20 4
3136 4 13 1 9 4 -13 9 1 -3 5 -3 9 4 -8 13 -10 -2 3 -6 3 -4 -9 -11 -16 -4 -10 -10 -11 -2 2 -3 -2 -1 -3 -7 -1 -11 4 -5 7 -4 -10 10 0 9 0 -1 10
3183 10 7 -5 12 -14 3 2 -10 0 -17 0 -7 0 -1 -11 0 -14 -6 -10 -8 -3 -3 -2 4 -7 4 -7 -1 11 4 11 12 -8 1 0 1 -1 6 7 10 3 4 10 11 2
3227 2 2 11 5 2 6 -3 6 0 4 -5 -5 0 -3 -4 0 1 -3 -5 -2 -18 -6 0 -5 1 3 -10 -1 1 -12 -3 8 5 0 0 2 6 2 4 3 7 3 5 10 5 -10 6 -4 0 -3 7 -3
$$ packed form
2959Hj7K0j4KK8m0L1qj6K1l3K2mlK2k9J8Pk6M2l0Qkj5K7k2MQk5K1k0JK4k0J7k0
2995a3lL3l7K5j8oK9k1J1J6k3J9j9OJ2k4K2j0QOk5K7j5LK5l5J2J0l1L6l5J5Kj6
3029a4J7j7OJ2j8K1j1mJ8k5K7j6jJ1j4J4j3qL5l6K2nj7K3j4PRj0J6j6jJ7k8L2
3063A9j9JK4l2OKj2K0k7J8%j8K9j7kJ8l1L4j1Mjk1K2rJJ1k1K2oj1K2k6J3Kqkk
3100hJJ9k2J6j4MQj3K2j8mJ4j5J2pj6K5j9K3j2qK0j5J0oj0PnJ2pj0K6j1PJ4j6
3136DRj2Qnj7K2qmQqJ2nj2K1k3QNrRpnknJ2o%jRMnJJkmOj0J5rJ2j1oK0j0RrjJ1
3183A0lj2J7k6J7jj2J0j7J7pPjj0J1j4QmKN%JOj1J1j1OJ2pPJk0RjJkPJLpJOJr
3227B%RolMrRoMr%NljMJmkLj6J2OnOKj3RKj3RJ1ln%KMmKjMmKNnj5J6j0MlJ0j0
$$ plain form
3278 -3 14 9 2 -5 3 3 1 3 -3 -6 1 -8 -10 0 -6 1 1 -5 12 6 7 5 7 6 12 8 -5 7 19 6 3 8 -4 16 3 0 -9 0 -4 6 1 -2 -12 20 9 7 -1
3325 -1 2 8 -10 -2 -1 -11 5 -11 3 3 -9 2 8 9 0 -9 4 9 -2 -3 -1 9 -1 1 10 9 4 5 2 -3 6 3 0 -2 5 0 -4 10 -2 -3 9 -3 9 1 2
3370 2 2 3 1 8 1 8 -3 1 9 7 12 1 7 6 2 7 1 0 8 8 4 -6 0 1 12 7 8 1 0 -6 -4 -10 -6 6 -8 -6 -6 -6 10 3 2 1 -1 4 -1 5 5 -12 15 6 -4
3421 -4 11 5 17 -2 8 13 4 2 15 7 11 5 8 2 2 5 -2 2 10 11 6 -6 5 0 -13 0 -4 -16 -1 -14 2 -6 -10 9 -7 2 1 -2 -5 -12 5 3 5 17
3465 17 -11 2 5 5 10 -10 7 13 -2 6 7 -2 2 -1 8 0 -12 9 4 10 6 -6 0 -5 -10 2 -6 -4 -8 -2 -4 -11 5 0 -9 6 -16 0 5 -9 1 -4 18 4
3509 4 16 8 -1 14 12 -4 9 3 4 9 -6 5 5 -4 10 -3 -5 -5 -4 0 -12 -2 -1 -8 -4 -7 11 2 -3 5 -3 4 0 -10 5 -4 7 -7 -3 -2 -1 -1 9 -7
3553 -7 4 -1 4 10 -3 14 -2 7 6 11 7 1 -5 3 -7 -4 -1 -4 10 -16 3 1 -3 -5 -12 -2 6 0 0 -6 -8 5 0 -3 3 -7 5 -7 8 -2 13 7 -5 2
3597 2 5 2 9 3 -2 -1 -6 8 -5 -8 3 2 -3 -8 -8 -6 -7 -7 -5 0 2 -6 2 -13 -13 -6 -9 4 -1 -10 1 3 1 7 6 5 4 -1 7 -5 3 7 -3 10 7 5 12 5 1 2 0 8
$$ packed form
3278cJ7nppQ%kKolPrkJ0oP%oJ7oJkKjOmj3J2J2j3lNj2K0j3lrRmJ0nlj0L2j1kq
3325aLOj8QJj0J6j6J4%j2J1OJrrJ3Nj1jKJ0j0KRjnJlnRllkPnmJ4j2jJ2j2J2qJ
3370B%JkPpPj1MQkNj1OjmNojQ%mj0OJJ1nJpjoKoMJ2j4K%%J6pjjkNnO%j7K7rj0
3421dJ5oJ2j9J0NrkJ3qMoLo%LpMQJnj2J1nj3J3mj2J5j3J6qmJ9j6RjllpJ7kKJ2
3465A7k8J3L%Nk0J7Oj5QJrMlRqj2K1nOmj2OnnJ2qKmOkpJ6nrJ5k2J6Nj4J0nK2j4
3509DJ2qrJ5kj6J3oJNj5J1%rJ4j3k%JMj2J0JpMlJ8rnQqPmj0J5rJ1j4MJJ%J0j6
3553gJ1nNOj3J7j6RjNmooQj0LLlJ4k6J9kmkpJ0Qo%okJ3nlOj0J2j2J5j0J5oj2P
3597BLlPonJnJ4j3lJ1jnn%Kj%KNKqQj5%PlJ3nrJ1KkOjjjnQj2QMj0J3lkPpmJkQ
$$ plain form
3649 8 -3 -1 -6 -5 -2 -1 -11 -5 -7 -1 0 -5 6 5 -7 -5 2 -12 -1 -3 1 -5 10 -4 11 0 4 6 4 5 6 7 12 -4 10 10 0 -1 1 -3 8 -7 3 -14
3693 -14 2 -4 -6 -4 -10 -1 0 1 5 -3 -4 7 -16 -6 -6 -6 -4 -3 1 2 3 -3 -1 9 4 1 5 -1 -9 -5 6 -3 -4 -4 -2 1 -3 2 -5 -6 4 1 -5 -10 -1 2 -4 -1 -19 -6 1
3744 1 -9 -11 -8 -4 -9 -7 0 -5 3 -11 -4 -6 4 14 10 9 6 1 0 2 -2 -3 -5 -7 8 -4 0 -2 -2 -5 -7 -9 -6 -9 -2 -7 -2 -11 -10 -3 -17 0 -1 -15 -16 -9 3 -1 -10 3
3794 3 -2 0 -3 -3 8 0 -4 11 9 4 6 -4 5 8 2 -11 6 0 3 11 5 8 -2 -6 -1 -9 -5 -6 3 -5 -16 -17 -6 -2 -7 11 -1 -4 -8 2 3 -4 2 4 -8 11 6 0
3842 0 0 6 3 9 1 0 9 -4 6 6 -9 2 8 2 4 2 -1 -3 -4 -7 -10 -3 -2 -5 -5 -14 -4 1 -14 -7 -4 -8 0 6 8 -1 6 -1 -2 -1 2 3 -3 11 1 0 4 7 -9 -6 -6 -3
3894 -3 4 3 -1 3 -14 -4 -3 -12 -7 1 -3 -6 -8 3 0 -9 -13 -11 -8 -1 -9 -6 -3 -2 4 -2 1 -4 -6 -8 -1 5 -1 -1 -3 -10 9 -2 -11 -8 -3 -1 -9 -14 -12 -8 -8 -3 -9 -6 -1 -11 -1 3
3948 3 -4 -4 -4 5 -16 -13 -20 -7 1 -6 -4 -5 3 -4 5 -1 -3 -12 3 3 -3 7 -7 -7 3 1 4 1 -1 1 3 2 7 6 -7 -13 -1 -15 -9 -6 -1 2 -1 -4 0 2 -1 -8 2 -2 -3
3999 -3 4 0 4 -6 4 1 16 6 12 -2 1 3 6 14 9 1 -3 4 -2 0 -1 1 10 -5 -3 -4 1 0 -9 1 2 1 -4 -2 -8 -9 -4 -7 -6 5 -2 -1 -7 -4 -6 2 10 9 9 6 7 5 2
$$ packed form
3649Hj1KnJLJj0OkOJnJ1jj2KPj4J1kMoJ5j4J5j1MKkJJJNj6J4%j0jKmJ1j5J0j7
3693a4J6okKoRJJMqjJ1k3J0%%KJMJJoKJ0nlMoqMJ1rj%KLmNpjJ0lonRLoLj8J3P
3744Aj0kLMnKPnQj4PkJ0J0mjlnjKmjkkJ5j2Mk%lkkLlPnNrJPj4J7jj4jPJ2mrJ3
3794CnKl%J1qmJ5knKj0RLoj3J7oLQoLj0mNqMjRqj1jJ1MnJ8j2lmJ0JpOKj2J9no
3842@%OlOqjRj3J0%j5J1OoKklkjllPJl%rJ0Nj5PLmQOKrPpjJLJoJ4j0jMLj6L%L
3894cPjmMj7J0JrNQmlkJ1lrmKLPqLLJOoLnkkPOo%kpJ9j1rLNKqnKM%NoLNj0J0M
3948Cp%%Rk1LpJ3QpKjQpRokrJ5%oJ0j4%J0kLlkKKjNjj3oJ2j4OLNLllMKlpJ0mj
3999cPmMj0J0lJ5j0Oj4LKLQnqmPoKjKRj5KjNjrJ0JjnKojNlJJ1pJoLkQQj%lJkl
$$ plain form
4052 2 11 3 5 0 0 13 -6 6 -2 0 9 1 -3 -8 -3 -1 1 1 -6 3 8 1 -15 1 -13 2 -6 6 -2 -7 1 -3 -1 -3 1 -3 8 -2 3 9 7 1 11 5 4 2 4 -4 -7 2
4102 2 -2 5 -16 -9 1 -3 -3 -12 0 3 -11 -3 -16 -2 -7 0 -5 -5 1 -21 -5 -2 -1 -8 -5 -15 4 5 -9 0 11 0 8 -3 15 -4 -5 -4 -1 2 1 -2 -7 5
4146 5 2 -10 -1 2 -9 -4 0 -5 -3 -12 -9 0 -2 -1 -4 -10 7 -5 -11 -1 -4 -5 6 -1 -6 -4 -6 -6 1 6 14 1 9 2 -1 0 -1 -8 -5 -6 -12 -8 13 -4 -4 4 0 8 -5 2 -10
4197 -10 -8 4 -3 -4 -6 -7 -5 -3 -2 -5 7 -4 6 -1 7 0 1 13 10 3 -4 7 9 11 5 -1 6 -7 11 5 -10 -7 -4 -3 0 -10 -3 0 -6 -8 1 0 -10 -7 -11 -4 0 -14
4245 -14 -5 -2 -6 -4 -1 -1 10 -7 0 -1 -2 3 0 0 -16 -1 2 -1 7 10 12 0 -1 2 0 -15 -7 3 -11 -1 -10 -3 2 -1 -2 0 -2 3 -7 -8 5 -10 -5 1 6 0 6 1
4293 1 0 8 8 3 0 2 5 -1 -1 8 -1 -7 7 -2 6 2 -1 -1 5 -4 -11 -9 0 -10 4 -1 -6 -5 -4 -3 -4 4 -7 -1 -8 0 -2 0 1 2 2 -7 6 4 9 6 -3 4 11 -3 -3 2 -5 2 13
4348 13 3 4 7 10 4 -10 0 2 -2 -2 -4 -7 6 -8 -3 -5 -10 -12 7 4 -7 -9 0 -11 -11 4 -10 9 5 -4 -2 7 -2 6 3 13 -2 -1 8 3 -2 -3 -2 2 -2 1 5
4395 5 2 5 3 0 -5 -4 -5 -5 -5 -6 -3 -12 8 -2 -9 -10 -10 6 -6 1 -4 -2 1 -8 -2 -6 2 11 8 6 2 5 -5 12 10 9 6 7 4 4 3 -6 -5 4 -4 -6 -7 -4 0 -3 -1 1 -6 1 -2
$$ packed form
4052BRqKn%J3j9J2qKRqmnNKK%pRNpj6J6j4J5qJ2qnQmKkMmJ1j0NOkoJ0ojkKqlR
4102BmPk1PJ0m%rJ2Lj4Qj3J4nPn%Ok2J6LJpLj0J9Jj4RJ1j1Qj1J8j9jJLLjlnJ2
4146Elj2RLj1NMnKrLRkJloJ7j2oJ0ljJ1pnKk%PNQj3QplJjpLjoMK1j7%QmQj3Pj2
4197a0KJ2pjkjKKJlJ2j1J0pQpJJ2lppJ1KKooPj3J8oj5LLJLj0PLokRjj0LmPMj4
4245a4RLmKL%J1j7PjjNl%j6J5LlQLKj2jLkj5QJ0j4J0rPNljKkNj0jJ3j5NONoOn
4293AjQ%nlKLo%RroJ4rQml%OrpKRj0J4nnJJJjQj1OpQkKJJ%rJ3kNlrPPj4%NpPJ1
4348A3j0JLLoj4J0Km%klJ3j4NknkJ9lj1kRj1%J5j4J9mrKRrQlJ0j5JRnnjJMmLM
4395ElLklnJj%%jLrK0j0pj%J6j2PnKLrOmQRlkmLj0J7kjlJl%jrJRqkjLMlKKpPl
$$ plain form
4450 -2 2 2 2 7 -2 1 -3 7 -4 2 1 -4 3 20 1 -1 6 2 7 2 4 -5 5 9 -1 11 -11 -5 -2 -2 11 1 3 3 6 4 -6 1 -7 -7 -5 -6 -5 -5 -5 -6 4 3 2
4499 2 1 21 3 1 2 13 16 8 12 3 -1 6 5 6 1 -4 -1 9 -1 5 1 1 0 1 1 9 4 2 5 3 -6 5 -4 -5 -5 0 -7 0 3 -1 12 6 -7 10 4 -5 1 6 -1 12 5
4550 5 9 14 10 17 11 11 -5 12 10 -2 -9 0 2 -3 -3 -4 2 -3 6 -10 -1 -4 2 4 -1 -5 -2 4 10 7 1 -3 11 -5 -2 6 5 7 -10 -6 5 10 1 6 4 0 9 4 -3 9 7 4
4602 4 10 -5 6 -3 -7 -3 -5 1 -7 1 -8 3 -8 -10 -2 -3 4 -2 -3 -10 2 8 6 8 6 1 -2 1 4 -1 12 1 1 1 1 10 1 -8 18 -3 4 2 0 2 5 12 0 1 -5 6
4652 6 -7 -4 0 10 -1 -3 -6 1 -7 0 -5 -5 1 7 1 5 8 6 -1 11 3 5 13 9 7 11 2 4 7 2 3 6 -4 -5 -9 -1 -7 -2 -7 -4 -10 -10 -5 4 -1 -10 -5 2 -2 1 -1 -5 -11 1 6
4707 6 -11 -3 2 -3 0 1 -8 6 -6 12 11 7 11 8 -2 7 3 4 -6 6 -9 -1 -7 1 -14 1 -12 -5 9 -1 -8 1 -9 -16 2 -4 4 2 0 1 4 -1 -1 -2 9
4752 9 -9 1 -4 4 10 5 3 0 1 6 2 10 1 3 9 9 12 3 -1 7 -6 -13 2 -1 5 -9 -8 -4 -4 -6 -2 -6 -11 -4 2 8 -5 2 -3 -5 -1 6 2 10 2 -4 -3 -8 -2 5 -1 -1 -6 -12 -6
4807 -6 2 -4 2 -3 0 -1 11 -3 -4 -8 -6 -2 -12 -8 -12 -10 -9 -4 -5 -7 -6 -1 3 3 -1 -1 15 10 0 2 -3 4 5 4 8 0 -1 1 -6 -1 3 8 -5 -7 1 -2 0 -10 5 -1 -15 -1
$$ packed form
4450bM%%NrLmJ0j1OjnPJ7j9kPmNnKrJ0Mj0J2k2OL%J3j0K%Lkj0Pq%KjJ%%jJ0jj
4499BjK0j8kJJ1LqMrmPjJnnLJ0j0Om%jJ%QnkLkrJ1rj%NpPLmJ3oj3J7orONpJ3p
4550EMNmPo%j6J7kj2pRKn%jOnRj6RlOKnmLOOlomJ4j6LQjKj7MJ1NrNkmRnpJ2kl
4602DOj5J1rmMkOqQrJ1j1kQjPojpJ2OkKknlLLnJ3j1%%%RrrK6k1PkkKLPj2JoJ1
4652Fj3LMJ0j1klPqPn%OOoMLkpJ2qKQmkMrKLnJLj0jmQoNnLo%NRnrNPmLkmoJ2N
4707Fj7QNnLJrJ4j2J8jmMlj0RmJj0J2j5QoQj5J5j3PJ4j0pRj0pJ8oQkkJLn%jJ1
4752Ij8J0nQOnklJNmQrKO%LrmQj3pJ5lOj4JM%kMmnPOOj3PnkMPmQqoJnOPo%noO
4807fQoOnLjJ2j4jmKMj0MmKJNjkJNM%m%J6nj0KnPJjMqjKpNMNj3kQlKj0J5oj4J4
$$ plain form
4859 -1 -5 -8 -2 -4 -2 -6 5 1 1 0 5 -5 9 7 5 11 2 2 -4 -11 10 15 10 2 -4 6 4 9 3 2 -3 3 3 1 -4 6 4 2 -4 -1 -3 -3 -8 -9 -9 0 -4 -7 0 0 -7 0 -5 2 -3
4914 -3 8 4 12 1 7 1 -1 4 9 5 5 7 2 -2 8 10 -4 -7 -1 -3 1 -8 3 2 1 6 0 7 -5 -10 -3 1 6 3 -9 5 -3 -7 -3 15 -3 0 1 9 0 -6 2 9 3 7 3
4965 3 -2 -2 8 0 3 8 5 6 0 10 2 1 -3 4 -7 -4 -1 0 -7 -7 -2 -6 -12 -1 -9 -5 -4 -1 -10 -10 -9 -10 -5 -6 -2 -11 2 2 0 0 7 -2 -4 11 7 2 -8 10 2 -2 2 3 -1
5018 -1 0 -5 -7 -20 -3 -9 -9 -6 -7 -9 -5 3 -2 4 -10 -5 1 4 -10 3 2 3 -4 2 0 9 9 -1 0 -2 -1 12 4 7 9 14 11 -4 6 5 6 -1 -4 -3 0 3 2 -8 -6 3 5
5069 5 -7 -11 1 1 -8 -2 -1 -6 -9 2 10 3 4 -7 -4 0 2 8 3 16 6 5 13 2 0 9 2 -2 10 5 5 13 4 -2 4 -6 -1 9 2 -1 2 -6 -1 10 -9 -1 4 6 -1
5118 -1 6 2 2 -5 4 2 -3 4 1 5 5 8 -3 8 7 3 5 6 7 13 11 2 0 -4 -4 1 -6 9 -7 -1 -5 -6 -8 -9 0 -11 -6 -5 -11 -10 -1 -1 4 4 -4 -6 10 12 1 -3 7 -3
5170 -3 8 6 -6 2 -4 7 11 8 -2 8 5 6 -1 5 4 -2 0 -2 2 -5 -3 0 -6 2 4 0 1 -5 -7 1 -2 -5 3 4 3 12 10 -5 2 0 3 4 1 21 -5 6 1 2 1 -2 1 1
5222 1 0 -1 2 -1 0 9 -11 2 2 -5 2 -1 -1 1 6 5 1 -7 15 -5 8 -1 -2 4 -1 5 6 3 9 -3 2 8 3 2 0 -3 5 2 -2 2 5 10 1 6 10 -5 -6 4 1 -13 -2
$$ packed form
4859amlOkKmJ1m%jNj0J4kkOr%opK1NnqoJ0kNojnO%knJ0kkoLk%nj%RmlP%pPnPn
4914cJ1mQj1OokNNm%KnmJ0Kj4lOkMrJ1jjNoPj2nPMNlj2J4qmMJ8j8LJQroQPoMm
4965Cn%J0qLNlJoJ0qjmPj1LLJp%NmoJ1qMJLr%JjNjMrJ3%k%PrkJ5mnj0J8qmMJm
5018aJnkj3J7o%LjkMQnOj4NOLj4J3jJpOkR%j0JkJJ3qLKNlj5J0jJplJLLjj0KRK
5069Ej2mJ2%rOJnlJ1QpJj1LMKOnJ3j0jQj1kRpmJ2n%QroOj0NJ0plLqNJ1j9QNKp
5118aPm%pRknPlM%Lj1J1jmKJJOkrkm%NpJ5j6OmjkjRj1NJoJR%N%qkJ6Kj1mJ0j0
5170cJ1kj2QoJ1Mlj0J0lJpOjoKkMpKLoQKmJokQllQJjRkj5PkLJlK0k6J1nJjlL%
5222AjjLlJRk0J3%pPl%KNjmqK2k0J3rjOnOJlOj2NOnjklQlmMLNrNMj5jJ0lj4J1
$$ plain form
5273 -2 1 -8 -4 -4 2 -4 1 1 -4 0 6 -5 -3 0 7 -2 1 -3 12 8 -2 2 1 -3 2 11 9 6 5 -2 5 21 8 0 3 6 -3 1 -5 -2 6 8 -9 -6 -5 1 -2 4 -8 1 8 1 4 0
5327 0 -4 5 8 -4 2 -3 0 -1 5 8 9 11 10 1 -3 3 12 9 4 -10 8 5 3 -4 -8 8 -4 -3 -6 -5 -6 -10 -2 2 -4 -8 -2 1 -8 -4 1 -16 0 8 -2 1 2 -2 1 -1 -5 3 7
5380 7 4 -2 -4 -3 -3 8 7 3 2 -1 8 -4 -13 3 -5 -5 -13 -8 -2 -11 -25 -7 -9 -16 -2 -6 -1 -13 -8 -11 -9 -2 -3 -10 -2 -4 -11 0 1 -3 3 6 -2 4 -4 11 2 12 8 5 2
5431 2 -5 2 0 -2 -1 -1 11 -4 0 -10 -8 -1 -6 -4 -3 3 0 6 1 3 4 3 -2 -3 3 1 3 1 -15 -3 -4 -8 7 2 5 3 -8 3 7 -5 5 -10 -2 -8 0 -6 -3 1 -11
5480 -11 -8 -4 -7 -7 -14 -11 -10 -9 -8 -12 6 -2 3 -12 -7 -13 -4 -5 -2 -2 -1 1 -11 -9 6 4 -1 1 -5 1 -1 5 11 6 0 -5 6 10 3 2 8 -9 -9 10 -8 -2 -15 -9 -2 -6 -12
5531 -12 -11 -5 -4 -1 -10 0 4 5 6 13 9 -2 8 8 0 1 8 6 17 5 7 7 1 2 5 -9 -10 4 -9 -5 -6 2 -3 -8 -2 -2 -1 2 1 2 -2 -11 -9 -10 -12 -5 -11 -9 -6 4 3
5582 3 -1 2 -8 3 -2 10 7 7 9 8 -4 -7 -2 -4 10 2 -4 -7 -13 2 9 3 1 -1 -8 -13 -4 2 -5 -2 -4 -3 -1 -15 -2 -1 -14 -3 1 1 2 -6 -1 -5 -7 4 10 -6 1
5631 1 4 4 -2 -9 -2 8 -5 5 7 -8 3 -3 -5 -16 -11 -4 -7 -8 -10 -11 -10 -11 -13 -9 -16 -11 -9 -11 -5 -5 -2 -4 -6 5 2 0 8 -1 0 -1 -4 -5 -3 -2 -4 -6 2 2 11 7 1 -1 7 -7
$$ packed form
5273bLrM%OoN%nMOj1KLPrLmJ5mj0MjmNRkljpPJ6j3qLLrMoLQKj7LJOlOj2RPpLm
5327@mRLj2OnLjOLJKjrmORlnj4J8lkpmJ6j2JlJjmQMomOLrMNj7J6Qj0LJmLkmQM
5380GlokJ%J1jmjlRj2rJ6q%qNOrj4J8kpJ4mNj2NlKPjpQkpJ1JmOLqOqJ5rJ0mll
5431BpPkkJ%J2j5Mj0KPnKJOlOnKJjnjOkKkj6J2jmJ5nLkj1J1Mj2J0j5QoQoLMj2
5480a1LMl%pLJJJmJ8qNj5NoRjL%JKj2KJ5knKoOkOOnonJ1MpjOj7%J9j8Oj3OPmo
5531a2JOJLrJ0MJJPmj1J0%qJPkJ1j2K%oJLj4jJ4j3MjQnnO%JLjJmrKjkPoKLJ0j
5582CmLj0J1nJ2l%Kjj2lNkJ4qoloJ5PokkpnROpLkJKj4J3Jj3J1M%JqNmkJ1Oj6P
5631AL%opPJ0j3J0Kj5J1okj1NPljkjJjkMpNKkO%LkkJ1lkQrJjljKJkkQ%RmokQj4
$$ plain form
5685 -7 -4 -10 2 11 -4 -3 -12 -4 -6 -8 -2 -7 -5 -8 -2 5 -1 -5 -5 7 -2 -1 4 1 9 6 8 7 10 6 -7 -4 -1 1 4 3 -2 2 -4 1 -6 4 3 3 -3 -11 -15 -4 2 1 -10 -8 -3 1
5739 1 -4 -1 0 1 3 -2 1 1 3 16 6 5 1 -3 0 4 10 10 7 -1 8 0 3 4 3 3 4 -2 12 1 -5 -7 -2 -2 0 -3 1 -6 -5 -3 -2 7 -2 9 -3 4 1 -13 2 -4 1 7 9
5792 9 5 7 2 12 13 9 9 2 -9 11 8 -6 1 3 -9 -3 -2 8 -9 -6 6 1 1 -8 4 -2 -22 -12 -10 1 4 2 5 -6 7 -5 1 6 -1 0 -2 -2 6 12 6 4
5838 4 -2 11 4 2 9 -5 7 5 10 -4 5 0 1 1 -2 1 -3 -4 -11 -5 2 -11 -5 -13 -7 0 -7 -13 3 -6 0 2 -2 1 -2 5 7 2 -2 0 11 12 4 6 4 -1 4 2 0 -1 3 1 -4 4
5892 4 1 -12 -8 -1 -4 6 4 -1 -5 -12 -3 -9 -9 1 5 -4 4 -2 2 10 5 3 -5 1 4 8 8 9 1 5 -9 -4 5 15 -3 7 8 4 -6 -10 9 -1 4 -3 -9 -9 -10 1 0 1
5942 1 -6 -3 -7 -5 -9 -6 3 -2 -13 -7 4 1 -2 1 14 5 4 -1 -1 0 1 5 12 -2 4 6 5 1 0 4 5 2 -9 -12 0 3 -11 -5 -1 1 -1 -10 -6 -3 -5 5 -2 -11 2 0 -2 -3
5994 -3 -4 -6 3 2 8 13 3 5 10 7 13 1 2 5 -2 1 4 -7 -2 -1 -3 -3 -7 1 -11 -7 -5 -6 -3 -11 0 -2 -10 -7 -4 -5 -7 -7 -5 -9 -9 -5 -2 12 15 2 6 6 6 -2 -1 6 5 14
6048 14 7 3 -1 9 1 4 6 3 0 -7 1 1 4 -1 -1 -9 -4 1 -3 -9 -4 1 5 -1 5 -4 8 -4 -2 -3 2 1 2 -5 -5 15 6 4 7 15 16 5 10 11 3 4 2 17 10 0 -3 -8 -7
$$ packed form
5685gLoJ2Rj5JrQkkOnKlOPom%J2rJNlQlKjLmj3LLKLjnMoNpJ0j%oqmJ1Ojj1KNM
5739AnLJJKnL%KJ3j0jmmLMO%lqRqLJj%JoJ4j1okN%KlMpJKJRrJ1j2Plj4J5oNOK
5792ImKnJ0Jm%pj1K0lj4PKj2OJJ0j7LJ2n%rJ2ok0J0KJ1LkLj1J3j2ONpJk%QOok
5838DoJ3pkPj4J2kNj4RnJ%lLmjpOPj3OqOPpoJ6rOKmLlPKnmKJ1JqKknNkkjMknQ
5892Dlj3MPlJ0knmpRo%J0MrQoMQnkqOLM%JqMj4NRJ0j8J0Jmj0mJ9j0Npo%jJ1jJ
5942ApLmKmLRnj1OJ1llLJ3rjn%JJMPj4OKjmjMJlj1lJ2Lj4OMKkrMLkJ0prJ3kkj
5994cjkRjONj0KNlOj2JLpLLj1NJk%mQj2MKjLqJ1kqLLjk%Km%MLJ4Lj3M%%qJPjR
6048A4pmmJ0qLKllpQ%Ln%qNNmoNNMoOrJ2j2KjNjJp%K0rkLQJj1NJqJkJ5pj0lnJ
$$ plain form
6101 -7 3 3 -2 -9 3 2 4 2 0 -9 -8 5 3 3 5 15 2 10 6 2 -6 5 10 3 8 4 1 2 0 6 10 -1 7 5 1 4 3 6 8 7 -12 -4 14 -5 0 -1 -7 -7 3 -4
6151 -4 -2 10 -9 -7 3 -3 -5 6 -5 -6 -1 2 7 -2 3 10 8 -2 13 7 10 18 11 8 -6 7 -2 13 1 -4 0 3 0 -3 3 -1 -1 9 -2 5 -8 1 -12 4 0
6196 0 -12 -1 -4 7 -1 3 4 -2 -3 4 -7 8 13 0 8 3 23 0 12 -1 1 1 7 6 5 -3 -3 2 -6 -4 0 -11 -4 -7 -8 2 10 -7 -2 -2 -11 -2 5 -6 1 -1 4
6243 4 2 -1 -6 0 2 -2 16 -3 7 -3 15 -1 7 -4 7 -12 5 3 1 2 -9 11 -5 -3 -4 4 4 -10 -1 -4 -2 6 1 -8 -5 -5 1 1 5 -5 0 -1 4 1 1 8
6289 8 18 14 0 9 -2 -4 2 1 4 -5 15 2 1 10 -3 -1 3 1 -4 -3 -6 -16 -8 -10 5 -8 6 2 -3 -5 -6 -3 -5 -5 -7 -4 0 -7 2 1 4 0 11 3 7 0 0 6 6 8
6339 8 5 5 4 3 -6 7 3 -2 -13 6 -3 -6 6 -4 -10 5 1 -1 6 -7 1 -1 3 -1 -3 -9 -6 -1 -6 -3 14 -4 5 -10 8 15 4 15 8 5 2 -1 6 -3 3 -2 0 4
6387 4 5 -5 0 -2 -2 6 0 -3 -7 -5 -4 7 2 -4 -5 -5 1 0 -4 -5 -3 1 -2 11 -3 2 9 4 9 9 11 2 13 0 2 9 7 14 3 1 -5 3 -4 -1 0 1 4 5 -1 5 0 -3 -11 -8
6441 -8 0 -14 -6 0 -7 6 5 2 7 12 -2 1 0 -2 10 0 9 12 13 14 -1 17 14 18 14 10 4 4 7 2 2 5 4 1 4 1 0 4 4 -5 6 -4 -6 -1 -4 -9 -7 0 1 -4 5 1
$$ packed form
6101gJ0%npJ2jKkkrJJ3k%KJ0j3QmmqJ1NpNmlJkOMj1QkmLjLKjj9QJ8j9Njo%J0p
6151dKJ2j9KJ0okJ1j1jNLNrNPkj0J5oLQplj4J3rJ5j2nMLllOm%J0j1Pj3Rj3J6m
6196@j2J1lJ1qMJojPj1J5Nj3QnK0k3J2j3K%Ojjq%NqKMj1PljJ0Qj7N%rRPj1PkN
6243DklnOKmJ8j9J0j0J8j6Qj1J1j9J7kkJj1K0j6KjQ%j4RlKQnrL%O%Mj0NjNl%P
6289HJ0mj4Rj1kOjLrK0j3jRj3KMknJlj0QkJ5j3J4mnkjLk%kLMpRjLmJ1qMp%O%K
6339Hl%jjrJ3mnj1J9rlJ2j0oJ5mkPj3QkMmkoLNnLJ7j8Rj5J8Pj1J1plllPrOnKM
6387DJj0Nk%QolmKJJ1noj%OjmjKMlJ3j4NPnN%KrJ1j3KPkPj1koQpLJJLJoOnlqL
6441hQj4QOpJ3jlNNj4LjkJ2j0RLJJj5J8lMmmo%Ln%LjlLljM%rJ1j0kNlnKPJnRm
$$ plain form
6493 1 0 -3 3 5 6 -2 7 18 6 15 10 8 4 5 8 1 10 -4 1 -17 -2 6 -4 -3 -10 -7 -7 -1 -4 -4 -3 1 -5 3 -4 -5 2 5 12 0 3 3 -4 1 10 -7 4 5 3 -3 3 3
6545 3 9 -1 6 0 4 14 7 7 16 -1 8 1 -2 1 1 2 1 5 3 -5 -7 -14 -2 2 -4 -2 -4 -14 2 -1 -2 4 2 0 2 -5 13 1 3 -4 13 11 -1 -9 8 4 5 11 5 4
6595 4 9 1 6 -9 3 -10 3 8 -2 4 -9 -9 -5 -8 9 7 -5 1 0 1 4 -3 -4 -4 -2 4 7 2 1 5 4 1 12 7 2 -2 6 8 5 2 4 2 -2 5 5 -6 6 -11 6
6644 6 -6 -1 4 3 -4 11 -4 4 -3 -12 14 5 4 4 1 10 3 7 4 -2 6 10 3 2 12 9 6 6 -1 6 -7 -2 -5 4 -1 -10 15 -6 -1 3 -7 -4 1 4 8 4 -2 1 0 -5 -1 -9
6696 -9 3 -8 1 7 3 4 2 -2 9 -5 11 5 9 9 6 7 10 4 15 11 6 4 -7 1 2 4 10 -3 2 4 -8 -2 -4 -3 -13 4 3 1 -14 -8 -8 0 -7 -1 -1 -6 -10 1
6744 1 4 1 0 6 11 7 -1 5 12 12 1 0 2 -7 3 2 13 1 4 0 -1 2 -1 -4 -4 3 0 -1 -10 1 -9 -2 -3 -2 5 1 3 0 4 -6 2 12 -4 7 8 5 -1 3 2 14
6794 14 9 8 7 4 10 8 2 6 3 -3 0 1 6 -13 -5 3 2 5 2 -10 -3 -10 -1 2 -2 -2 6 -3 15 10 -3 9 5 -3 17 4 4 0 6 -3 2 1 4 11 3 11 3 -1 11 2 7 1
6846 1 -1 -2 10 3 -13 3 -2 -6 -7 -10 -1 -3 4 -4 -7 -15 0 -1 10 7 -5 7 4 11 4 4 -3 -1 -3 1 2 1 -3 1 6 1 5 3 -4 2 -1 3 -3 3 8 11 -6 -8 -2 8 1 -12
$$ packed form
6493AjlOKJqRJ1j2RnkmJLpRj4Nj8J5Qj0JpL%Ol%JMoQpjPLPj2L%pNRj7J1JkoO%
6545COj0PoMJ0p%Rj7RplL%JjMkqkpJ2MoKkj0J6ljOkkKpJ8j2KpJ7kj2qJ7mJOoj
6595DNqNj5J2j3J3Nj0Oj3%MlJ7kj2OjJLpj%KOLnjMjlJ1nnmQKllKkmP%j1J2j7J7
6644Fj2NNjpJ5j5QprK6rj%lRpMloQMpjJ0ll%pPj3NlRnrK5k1NMj0LNLMmoLjnMq
6696iJ2j1ROmJkmJ1j4J6oM%lJLoJ1mnkj1QJKOj3NKj2OkJj0J7jkj5O%QpO%nmJ1
6744ALljONmqOP%j1jKrJ0jJ1j2LmjLll%PljrJ1j0PjJPmKlMj0QJ0j6J1JloMjJ2
6794A4njjlOkoMloLJNj9QQjLlj2PpRLm%QrJ8nj3J2mqK0j3%mOrNjLPqQqmJ2rNo
6846AkjJ2pj6J6nmjlRkPqlqJ5jJ1lj2J2lPp%pKkMJjmMNnMkpOlMoONLj7kOJ0pj3
$$ plain form
6898 -12 -2 -8 -3 -10 -3 6 3 -4 -6 -4 -4 -1 3 -2 0 -5 4 -1 11 1 12 7 7 2 0 9 -2 8 -6 -12 -13 1 3 -5 -11 3 -1 -4 1 -3 -12 0 -1 -12 1 -4 -1 -9
6946 -9 -2 6 3 3 -2 -3 10 0 4 6 9 4 5 3 13 2 9 2 7 6 -1 -5 12 7 2 2 -5 2 -12 -4 -2 0 -9 -6 -13 -7 -2 4 -2 13 4 -3 1 1 5 2 10 1 -6 0 4 0 5 6
7000 6 -3 -2 14 -2 10 1 1 10 -1 6 -3 1 -2 4 3 8 -4 7 0 -3 -7 -11 -3 0 -1 -7 -4 -7 0 -9 8 2 -5 -1 1 14 1 0 3 2 12 10 11 9 3 2 1 0 1 10 8
7051 8 4 -1 -7 0 -5 -6 -11 -11 -5 -14 1 -18 -9 -10 -2 -9 -11 -15 -11 -9 -4 -6 -7 -6 -10 -2 -8 8 -9 6 -5 2 -1 -1 4 0 2 -5 -5 -5 -4 -2 -2 1 -5 -5 -7 -7 13 10 -3 3 -8
7104 -8 -9 -17 -7 -4 1 -6 -7 -4 -10 1 -3 -14 -2 -3 8 5 -1 2 3 -4 1 3 5 9 4 2 3 -3 1 1 -9 1 -3 5 3 -1 -8 -4 -8 3 -4 0 -8 1 -5 -10 -6 2 9 10 9 -3
7156 -3 -8 9 4 7 4 7 5 0 7 7 6 -2 8 11 10 -1 11 -8 4 4 2 -2 14 2 6 0 9 -9 -2 -11 -7 -9 -8 -1 -12 -11 -10 3 3 -6 -7 -5 -1 3 11 12 -6 1 7
7205 7 4 10 4 -1 9 7 10 11 7 2 2 0 2 6 -1 2 3 -9 -4 -2 -3 0 4 -12 -1 2 -6 -6 2 -1 -5 -17 -6 0 -6 -5 -2 -1 -12 5 6 9 3 0 15 15 2 0 9 5 8
7256 8 12 11 6 -1 5 7 10 2 -6 -11 0 -4 -3 -11 -4 -1 7 -3 2 1 3 -7 -10 8 -4 0 -5 3 7 3 -3 9 11 10 -3 1 -1 8 6 10 0 0 9 8 3 -1 -1 -5 -3 4 -11 -18
$$ packed form
6898a2J0oNpPRlpkK%LMnKnRnJ2j0J1n%nkRj1J0j4ojJ4KqoJ4mlNmrJ2jj1J3nLq
6946iPQl%njJ3j0MKLnJkJ0j1PpNjpmJ7nn%pPj4QKKrLpONOoJ5rpM%MlQrpOMmNJ
7000FrJJ6j6J2r%Rj1PrMlOjNj2J1plmmQLjoLlPrJ7opMKJ3j3jLjJ0kJkojjjJRk
7051HmnoPnjn%OrJ5j9RjQpkmMKNkjJmQoJ6j7J5j1Pl%NmKp%%JK%Lo%k%K0lj3Oj1
7104hjqJ0LNpjLoJ1mj1J2jJ1loLJpNKKMnkJoM%j0J0mQkmpMmJ1pMqRonMQPJjj2
7156cnJ7nLlLknP%jqJ0Ljj1J2j9J2%kmJ6j2MoRj8PrMkJPj1JJJ3%rjKMMQJj8PO
7205GlOonJ0kLJmn%kKMpLJj2NKjLMj6J1Lq%Qlmj2J1OoJLJj1J7JLolJ5%j3kRmL
7256HMjnpOKLqqnJ1mJqPLQj0NjKj0lJ8j2MnQMmoJ2Kjj3MkRkMj0%Rjnm%mKPj5p
$$ plain form
7308 -18 -8 -6 -8 -11 -5 2 -3 5 -8 -9 -3 -4 -1 -1 8 2 10 11 1 4 -3 7 8 9 6 -2 8 0 1 2 2 -5 3 -3 0 7 -5 13 6 2 1 -8 -8 -10 -1 -7 -3 -6 -2 -11 -9 -9 -5
7361 -5 3 3 -21 0 -1 6 13 2 11 7 2 5 13 4 7 7 -1 4 -9 1 13 2 5 4 1 -4 -6 -5 -5 15 5 1 -2 -10 -8 -5 -6 -4 3 -9 -2 -9 6 4 1 2 3 1 2 6
7411 6 -1 2 11 8 3 2 -4 7 12 -3 -7 6 4 9 9 3 4 -7 1 1 -13 -7 -3 -3 -9 -7 -4 -4 -4 -4 0 -12 -2 6 -4 -11 6 6 -3 4 3 5 2 8 2 -2 9 8 0 4 5
7462 5 3 -3 1 0 -4 -8 6 -9 -1 -10 -6 -8 -11 -1 1 10 -1 -19 -9 -10 -6 -10 -3 -14 -10 3 -1 0 5 -1 5 4 -5 6 -2 2 0 -6 2 3 2 5 -5 8 9 13 5 6 0 -9
7512 -9 5 -3 -5 4 3 -3 -6 -7 -5 0 -6 -7 -12 2 -7 -7 -6 -7 -5 7 -6 7 5 4 1 7 2 6 6 4 13 1 6 1 2 -5 4 5 -4 0 -7 0 -1 3 7 -15 -3 -7 -5 -6 -1 -13
7564 -13 4 -9 -8 -2 -7 -1 -8 -2 -7 0 3 1 2 -3 -7 1 6 7 -1 9 2 8 4 7 8 10 10 1 1 3 3 -9 -6 -3 7 -5 -9 -17 -4 -5 3 0 3 0 4 4 -3 -3 2 -3 7 9
7616 9 5 -1 1 3 -3 12 -3 3 0 11 10 6 5 -11 14 3 2 3 -2 -3 1 -10 -4 -8 -4 -9 -14 -5 -4 3 -9 1 3 -5 -1 2 9 10 3 -4 -1 10 4 6 10 6 10 8 8 8 7
7667 7 18 10 11 6 5 -5 8 2 8 1 -10 1 5 -1 -5 3 -9 -7 0 -5 -3 -5 -3 -1 0 -6 -8 -3 -10 -1 0 0 -4 6 4 7 4 7 3 10 -2 2 12 11 -1 11 6 8 -4
$$ packed form
7308a8J0KklOPnQj3jOjL%RoQJj0LpJ0JJlqJ0qJJ%pQoLPj2J8pmjr%kRoMlMrK%M
7361eQ%k4K1jPPj1RmnLQrL%qNj3J0J2j1LjlnkJ%K0j0mlqKLjKPj2PpJ5klJJkJM
7411FpLRlnjoJ1Nj5mJ3kN%oJj1Q%j4OM%oKL%%%Mj2J0Qj0pJ7%rPjKlOomJ1jqMJ
7462EkoMjmmJ4j5QrMklJ0KRj1j8J0jMmPj1MJ3mJNoOjrJ1qMkoQJjLj0J3JMqJor
7512iJ4qkRjoljKNojnJ4r%JjKJ2j3J3kjlOnM%kRj2NnJpRJrMpPjMMk2J2mKjNj2
7564a3J7j3JOnOpOnPLkJnmQNJqJ0pOmLJK%r%K%j2LLJ0j2mqJ3jQlLlM%p%NnJ0K
7616ImoKKoJ5j5OlJ1jmjj6K5j1jJnjMj1OmMnnRJPj2J0KqMLPJppLJ1oKMmMk%%j
7667GJ1qJnjj0J3oOpj1J1MomQj2KPnKkKKJokNpRJ%mJ0kLlLmPj2MJ0jj2J2nKj2
$$ plain form
7716 -4 8 2 0 -3 -11 -1 -9 -4 4 4 1 0 -4 -11 -7 -6 -1 -3 0 0 -3 0 5 4 1 -1 -1 0 14 5 1 11 6 2 7 5 9 6 7 7 1 7 11 1 5 -2 -4 -1 5 0 -4 0 -6 -8 -11 -14
7772 -14 0 -2 -1 -4 -13 2 -1 12 3 1 5 6 8 4 1 6 2 6 2 8 -2 1 -1 5 2 2 -4 8 0 -1 -2 1 6 -6 -13 -13 -6 -6 -13 0 -8 -7 -9 -6 1 -7 0 0 -4 3 -8 4
7824 4 -2 8 2 0 7 4 7 1 0 6 4 5 12 -4 9 11 -10 0 -4 -3 3 -1 -6 -1 -5 -7 -2 -1 -13 -11 -5 -6 -10 -8 -1 -10 -18 -8 3 0 -5 -5 -11 1 5 3 5 8 2 -2 -4 4
7876 4 -1 8 12 10 -5 10 -14 -5 -1 -6 -2 -10 -6 -1 -10 -5 0 2 3 -8 0 -7 -6 -9 -10 -5 -7 -6 0 -4 5 -5 7 5 8 2 -4 -11 7 3 13 4 2 2 1 -2 -6 -2 0 -7 -6 -13 -5
7929 -5 -1 3 -1 -6 0 -8 2 -7 -11 -9 7 -11 -1 0 -7 -10 -13 9 -1 7 1 6 9 3 3 8 12 10 6 3 2 7 -1 7 -2 3 1 -3 14 1 -11 -2 -6 -9 0 -3 3 1 -3 -2 -7 -6
7981 -6 -1 -9 -1 -1 -17 -1 -5 11 -2 0 8 5 9 -4 4 8 0 3 15 2 8 -3 -1 0 6 2 3 1 5 4 5 8 -3 -1 6 -6 -16 -2 -1 4 1 4 13 -2 3 8 5 1
8029 1 3 -2 -1 -3 4 3 10 12 1 0 11 9 20 16 4 13 5 3 1 2 4 -5 -7 0 9 -4 -3 -6 -7 1 -7 -5 -8 -7 -2 5 -3 5 1 0 5 -6 -1 6 4 -1 8 2 3 3 10 6 9 7 10
8084 10 5 13 10 -1 16 -2 6 2 14 0 6 2 3 -9 -10 -4 6 1 -4 -2 -6 -4 -6 -13 2 -1 2 0 5 8 7 -6 -2 14 0 -8 9 -7 2 2 9 9 8 10 -2 -6
$$ packed form
7716dJ2oklqJ0qNQ%ljmpMJNkL%lLNjlk%JJ4rmJ0nmNkMlJ%oOMj0MpkLOnmMokll
7772a4J4kJlrJ5lJ3rkMJKmlNmMmOj0LkOl%oJ2qjjLNj2p%P%pJ3qJkLPqP%mPj1J2
7824DoJ0okPlLojOkJPj6J3Kk1J0mJOmnNmkNJj2KOjmKPrqJ0J1ln%oJ2MkKLomkQ
7876DnRMkj5J5k4RMnMqMNrNNKJj1QpJljNkJOmRj0J2kLoopJ8mJ0rk%jlmMKpJpQ
7929eMMmnOqJ0rmKJ6j8J0JpllK2j0QoNLo%NMkmljNqQrNkmJ7j3j2RmlRlOkmJnJ
7981fNqQ%j6J6mJ6j3KQlMj3QMqLJ2j3Oj1KJOmJkMjJLj1KPj2j0J4JNlLRj5NNlm
8029AKnJkPjPKj1jJ1kJ1mj2RqkkJKrkPRj3JljQqKlJNPqQmjNj1NPknRoJ%PmLkL
8084A0nQlj1J7j8QmJ2j4OmJj2jOJ0nnKmKkpJ5lLkNLjj3MJ6j4qJ7j6R%P%jKj2m
$$ plain form
8130 -6 -5 -1 -3 -6 -6 -8 -6 -3 -4 -6 -7 -9 -10 -15 -4 -9 -15 -6 -10 -8 -4 -6 -3 1 -5 -5 -2 -6 1 1 1 0 -2 7 13 5 3 7 1 -1 2 18 6 2 -7 5 -7 0 1 -8 2 8 -3 -1
8184 -1 -1 -7 -1 -12 -1 -5 -9
$$ packed form
8130fJMkl%kKLjkjkjnJ1noRmKMkLMo%LmP%%jkROqkMokLJ6j2mrJ2j2PJrJ0Oj1K
8184a%oOj1J1mm
8191i
$$ Imaginary data points
##PAGE= N=2
##DATA TABLE= (X++(I..I)), XYDATA
$$ plain form
0 0 0 0 0 0 0 0 0 0 0 -8 8 -8 8 -16 16 -24 24 -32 40 -48 56 -72 80 -96 112 -134 153 -179 208 -240 272 -312
32 -312 353 -400 454 -510 574 -643 721 -803 895 -994 1104 -1224 1352 -1495 1650 -1819 2006
49 2006 -2209 2433 -2678 2951 -3253 3592 -3971 4401 -4892 5459 -6121 6908 -7861 9042
63 9042 -10549 12548 -15340 19542 -26673 42126 -144047 75610 -2932 -66398 186808 -241231
75 -241231 162356 -14552 -135476 186130 -142556 117466 19570 -195878 208962 -121872
85 -121872 46656 49736 -171526 206219 -104701 -34305 108748 -149977 174144 -92993 -67663
96 -67663 156239 -143557 110518 -49526 -76205 178179 -155947 61646 12890 -83969 160225
107 160225 -152036 36985 71936 -112254 129059 -117923 24431 100035 -144121 108942
$$ packed form
0@%%%%%%%%%qJ6j6J6k4L2m0M8n6P2q8J04j28J52j76K08k46K87l32L87m48N12n84
32c12O65p53Q54r64J084j217J364j524J698j889K098k328K576k847L145l469L825
49B006m215M642n111N629o204O845p563Q372r293J0351j1580J3029j4769J6903
63I042j9591K3097k7888L4882m6215O8799j86173K19657p8542o3466K53206m28039
75b41231M03587j76908j20924L21606l28686K60022r7896k15448M04840l30834
85a21872J68528L080k21262L77745l10920P0396J43053k58725L24121k67137K5330
96f7663K23902k99796K54075j60044k6679K54384l34126K17593m8756r6859K44194
107A60225l12261J89021L4951j84190K41313k46982J42354P5604k44156K53063
$$ plain form
117 108942 -62697 -2230 101383 -154963 104132 -14683 -46239 97710 -134842 94978
127 94978 10929 -88403 105101 -99726 65905 22209 -108036 117631 -71438 21832 37295
138 37295 -104004 117793 -56397 -18137 62437 -91691 97264 -44098 -40425 87216 -85244
149 -85244 65059 -22483 -48169 97792 -84701 36749 8507 -54142 91007 -79356 19403
160 19403 37555 -65570 76085 -61653 7679 54294 -77827 63872 -35515 -7402 58968
171 58968 -81595 56428 -11162 -27724 59551 -73274 47528 5375 -46712 61703 -57850
182 -57850 31977 15870 -57010 63910 -43011 11632 25689 -57904 61142 -31570 -7235
193 -7235 36854 -54092 51087 -20963 -20177 46251 -49831 36656 -8430 -27529 50079 -45708
$$ packed form
117A08942j71639O0467J03613k56346K59095j18815l1556J43949k32552K29820
127I4978q4049r9332J93504k04827J65631m3696j30245K25667j89069R3270J5463
138C7295j41299K21797j74190L8260Q0574j54128J88955j41362L673J27641j72460
149h5244J50303q7542k5686J45961j82493J21450k8242o2649J45149j70363R8759
160A9403J8152j03125J41655j37738O9332M6615j32121J41699r9387K8113O6370
171E8968j40563J38023o7590j6562Q7275j32825J20802m2153n2087J08415j19553
182e7850Q9827j6107p2880J20920j06921N4643J4057q3593J19046r2712K4335
193g235M4089r0946J05179p2050P86O6428r6082Q6487m5086j9099P7608r5787
$$ plain form
205 -45708 22711 5562 -32479 47894 -39626 11619 18074 -37018 42226 -30177 2381 26524
217 26524 -40197 35872 -18644 -6632 30810 -40175 29700 -7574 -15579 32730 -36484 22763
229 22763 1535 -23092 33397 -30366 14385 8840 -27617 32544 -23372 5354 14893 -29020
241 -29020 29538 -16413 -2876 19743 -28164 24387 -9448 -9340 22810 -25760 18016 -2621
253 -2621 -13811 23577 -22231 11494 3522 -16627 22333 -17827 5559 8407 -18047 19728 -12806
266 -12806 380 11776 -18093 16320 -7711 -3949 13560 -16839 12577 -3111 -7278 14146
278 14146 -14676 8733 802 -9559 13781 -11896 4907 3926 -10681 12465 -8770 1460 6149
291 6149 -10719 10439 -5640 -1319 7401 -9904 8036 -2768 -3357 7712 -8416 5478 -328
$$ packed form
205d5708O8419j7149l8041Q0373q7520N1245O455n5092P9244p2403L2558K4143
217B6524o6721P6069n4516J2012L7442p0985O9875l7274q005M8309o9214N9247
229B2763k1228k4627N6489o3763M4751n545l6457O0161n5916K8726R539m3913
241b9020N8558m5951J3537K2619m7907N2551l3835J08L2150m8570M3776k0637
253b621j1190L7388m5808L3725p972k0149L8960m0160K3386K848k6454L7775l2534
266a2806J3186J1396k9869L4413k4031L762J7509l0399K9416j5688m167K1424
278A4146k8822K3409p931j0361K3340k5677J6803r81j4607K3146k1235J0230M689
291F149j6868K1158j6079M321Q720j7305J7940j0804n89J1069j6128J3894n806
$$ plain form
304 -328 -4552 7172 -6493 3089 1394 -4900 5988 -4469 1159 2357 -4541 4537 -2629 -219
318 -219 2649 -3709 3029 -1147 -1002 2376 -2553 1624 -160 -1122 1676 -1371 583 288 -791 761
334 761 -347 -79 258 -83 -194 433 -257 -205 818 -1071 802 14 -1005 1723 -1663 772 673 -1992
352 -1992 2516 -1904 300 1630 -3023 3085 -1751 -569 2793 -3914 3272 -1088 -1753 3944 -4488
367 -4488 2982 -30 -3072 4960 -4659 2244 1319 -4434 5692 -4405 1078 2893 -5667 6033 -3629
382 -3629 -463 4485 -6584 5824 -2380 -2203 5941 -7108 5115 -787 -4011 7158 -7165 3944
396 3944 1107 -5793 7992 -6672 2310 3169 -7356 8312 -5600 316 5209 -8515 8078 -4036
410 -4036 -1889 7084 -9174 7242 -2032 -4162 8614 -9245 5793 318 -6324 9615 -8622
$$ packed form
304c28m224J1724j3665R582j695o294J0888j0457N628J198o898R078p166K410
318b19K868o358O738m176J45L378m929M177j784r62K798l047J954k95j079J552
334G61j108K68L37l41j11O27o90N2J023j889J873p88j019K728l386K435r9k665
352a992M508m420K204J330m653O108m836J182L362o707P186m360o65N697q432
367d488P470l012l042Q032r619O903r25n753J0126j0097N483J815q560J1700r662
382c629L166M948j1069J2408q204J77Q144j3049J2223n902l224J1169j4323J1109
396C944k837o900J3785j4664Q982Q59j0525J5668j3912N916M893j3724J6593j2114
410d036K147Q973j6258J6416r274k130J2776j7859J5038n475o642J5939j8237
$$ plain form
423 -8622 3822 2765 -8145 9987 -7395 1490 5143 -9524 9719 -5584 -1063 7297 -10331
436 -10331 8767 -3312 -3646 9026 -10466 7232 -778 -6065 10238 -9945 5220 1873 -8220
449 -8220 10883 -8771 2772 4524 -9897 10909 -6995 51 6961 -10980 10197 -4800 -2760
462 -2760 9098 -11396 8787 -2214 -5471 10742 -11142 6693 666 -7823 11648 -10178 4132
475 4132 3613 -9726 11697 -8517 1385 6351 -11087 10954 -6177 -1445 8598 -11819 9586
488 9586 -3333 -4256 10156 -11676 7738 -332 -6897 11032 -10635 5484 2448 -9144 11480
501 11480 -8887 2739 4937 -10682 11387 -6767 -408 7224 -11335 10532 -4534 -3444 9379
514 9379 -11255 8753 -2126 -5989 11124 -10834 6209 695 -7897 11957 -10044 3444 3907
$$ packed form
423h622J2444j057j0910J8132j7382Q885L653j4667J9243j5303M521Q360j7628
436a0331J9098j2079l34J2672j9492J7698q010n287J6303k0183J5165l347j0093
449h220J9103j9654J1543J752j4421K0806j7904P046O910j7941K1177j4997K040
462b760J1858k0494K0183j1001l257J6213k1884J7835o027q489J9471k1826J4310
475D132n19j3339K1423k0214R902M966j7438K2041j7131M732J0043k0417K1405
488I586j2919r23J4412k1832J9414q070o565J7929k1667J6119l036j1592K0624
501A1480k0367J1626K198j5619K2069j8154O359P632j8559K1867j5066J090J2823
514I379k0634K0008j0879l863J7113k1958J7043n514q592J9854k2001J3488M63
$$ plain form
527 3907 -9423 11572 -8558 907 6881 -10774 10282 -6056 -1410 8923 -11736 8756 -2788
540 -2788 -3921 9861 -11664 7245 462 -6723 10159 -10191 5395 2907 -9229 10433 -7824
553 -7824 2716 4627 -10588 10662 -5473 -738 6317 -10533 10084 -3695 -4016 8427 -9719
566 -9719 8102 -2075 -6177 10502 -9100 5061 324 -7175 11404 -8850 2135 3675 -7934
579 -7934 10561 -8014 158 6922 -9218 8664 -5690 -1201 8750 -10644 7003 -2142 -3065 8964
593 8964 -10947 6042 1266 -5851 8507 -9317 4974 3314 -8616 8559 -6456 2727 4132
606 4132 -9950 9155 -3911 -759 5029 -9353 9042 -2538 -4171 6886 -7814 7172 -1711
619 -1711 -6013 9074 -6912 3932 -19 -6250 10055 -6969 988 3011 -6231 9027 -6739
$$ packed form
527C907j3330K0995k0130R465N974j7655K1056j6338M646J0333k0659K0492j1544
540b788j133J3782k1525J8909o783p185J6882k0350J5586k488j2136J9662j8257
553g824J0540J911j5215K1250j6135M735P055j6850K0617j3779l21J2443j8146
566i719J7821j0177m102J6679j9602J4161m737p499J8579k0254J0985J540j1609
579g934J8495j8575Q172O764j6140J7882j4354M489R951j9394J7647r145r23J2029
593H964j9911J6989m776p117J4358j7824J4291j660j1930J7175j5015R183J405
606D132j4082J9105j3066L152N788j4382J8395j1580j633J1057j4700J4986q883
619a711m302J5087j5986J0844l951o231J6305j7024P957K023r242J5258j5766
$$ plain form
632 -6739 -559 6162 -7171 6837 -4919 -1191 7814 -8660 5102 -1685 -2278 7610 -9236 4466
646 4466 1483 -4583 6762 -7872 3994 3219 -7134 6562 -5180 2377 3607 -8364 7118
659 7118 -2752 -532 3964 -7709 7237 -1582 -3485 5243 -6147 5780 -1090 -5058 6982 -5097
673 -5097 3072 22 -5106 7825 -5000 536 2237 -4831 6986 -4896 -791 4653 -5282 5175
687 5175 -3644 -1232 5978 -6277 3672 -1285 -1901 5882 -6733 3038 1099 -3402 5191 -5823 2653
702 2653 2518 -5134 4884 -3921 1562 2913 -6066 5075 -2107 -361 3153 -5705 5045 -1085 -2371
717 -2371 3875 -4662 4052 -524 -3559 4869 -3811 2271 274 -3779 5309 -3468 553 1635 -3666
732 -3666 4816 -3155 -507 3080 -3834 3735 -2283 -1055 3944 -4226 2729 -848 -1586 4052 -4330
$$ packed form
632f739O180O721j3333J4008j1756L728R005j6474J3762o787n93R888j6846J3702
646D466k983o066J1345j4634J1866p75j0353J3696j1742P557J230j1971J5482
659G118r870K220M496j1673J4946q819j903Q728j1390J1927o870l968J2040j2079
673e097Q169l050n128J2931j2825N536J701p068J1817j1882M105N444r935J0457
687E175q819K412P210j2255R949m957o16P783j2615R771j939m501Q593j1014Q476
702B653j35p652J0018q805N483J351q979J1141p182J746L514q858J0750o130j286
717b371O246q537Q714m576l035Q428q680O082j997m053R088q777M021J082n301
732c666Q482p971K648L587o914P569o018J228M999q170O955l577p38N638q382
$$ plain form
747 -4330 2108 589 -2441 3765 -3798 1598 1573 -3371 3562 -2756 825 2087 -3906 3463 -1652 -322
763 -322 2409 -3823 3183 -847 -1462 2806 -3326 2520 -216 -2231 3213 -2777 1518 433 -2528 3326
779 3326 -2325 511 1206 -2598 3019 -1863 -234 1924 -2642 2461 -1223 -764 2383 -2647 1856 -429
795 -429 -1222 2514 -2520 1323 344 -1665 2428 -2162 821 914 -2042 2276 -1636 268 1311 -2254
811 -2254 2060 -1042 -330 1585 -2213 1765 -521 -859 1784 -1983 1343 -33 -1246 1868 -1680 805
827 805 406 -1469 1825 -1321 294 796 -1523 1617 -934 -127 1083 -1502 1308 -523 -467 1252 -1404
844 -1404 975 -122 -738 1267 -1225 620 203 -911 1213 -990 308 461 -1022 1092 -712 22
860 22 644 -1034 931 -452 -223 766 -965 735 -189 -408 815 -842 523 44 -524 788 -681
$$ packed form
747d330O438j519l030O206p563N396k5m944O933o318L581J262n993P369n115J330
763c22K731o232P006m030o15M268o132N846k736k015N444n990M295j085k961N854
779C326n651K836O95l804N617m882J629K158m566N103l684M59L147n030M503k285
795d29p93L736n034L843r79k009M093m590K983R3k956M318l912J904J043l565
811b254M314l102P12J915l798L978k286l38K643l767L326j376j213L114l548K485
827H05l99j875L294l146J615N02k319L140k551Q07J210k585K810j831N6J719k656
844a404K379j097o16K005k492J845m17j114K124k203J298J53j483K114j804P34
860B2O22j678J965j383K29R89j731J700r24k19J223j657J365m79n68J312j469
$$ plain form
877 -681 288 235 -584 712 -482 93 349 -575 572 -302 -63 401 -526 420 -139 -182 395 -438 275 -10
897 -10 -238 345 -328 139 78 -250 269 -205 46 116 -207 198 -110 -22 107 -149 120 -37 -45 89 -72 57
919 57 21 -25 45 1 3 21 8 -7 46 -12 -3 53 -86 81 -9 -60 126 -143 78 8 -135 195 -191 69 67 -210 253
946 253 -184 20 162 -289 290 -147 -60 252 -345 294 -86 -142 358 -372 263 15 -258 437 -379 195 135
967 135 -386 488 -351 98 258 -475 506 -300 -43 389 -557 486 -195 -195 490 -605 414 -71 -342 596
987 596 -607 331 88 -479 657 -553 193 258 -612 691 -449 27 433 -684 669 -325 -153 581
1005 581 -736 594 -155 -339 709 -750 473 26 -511 783 -697 310 232 -663 796 -594 119
1022 119 425 -774 783 -457 -102 587 -851 717 -281 -306 735 -872 605 -70 -495 853 -833
$$ packed form
877f81R69n3q19J296j194N75K56r24J147q74K39M64r27R46n59m3N77q33P13k85
897a0k28N83o73M67o1l28N19m74K51P0l23M05l08Q8J29k56K69j57qJ34j61J29
919E7l6m6P0m4KJ8j3j5N3n8RN6j39J67r0n1J86k69K21p0j43L30l86K60kk77M63
946B53m37K04J42m51N79m37Q7L12n97O39l80n6N00p30O35k48k73O95q16N74o0
967A35n21Q74q39M49J60p33R81q06K57M32r46J043o81%O85j095J019m85k71R38
987E96j203R38k43n67J136j210P46O5q70J303j140M76M06j117J353r94J72P34
1005E81j317J330p49j84J048j459J223m47n37J294j480J007p8q95J459j390P13
1022A19L06j199J557j240L55O89j438J568r98k5J041j607J477o75m25J348j686
$$ plain form
1039 -833 444 135 -674 926 -732 259 368 -812 932 -601 30 584 -902 865 -427 -211 754
1056 754 -954 723 -217 -430 888 -931 554 43 -639 931 -859 355 296 -792 937 -703 123
1073 123 520 -916 897 -508 -109 680 -984 817 -267 -345 835 -959 694 -53 -593 954 -879
1090 -879 480 174 -764 1019 -764 231 388 -884 1007 -638 -33 622 -958 904 -459 -276 813
1107 813 -982 735 -226 -472 952 -978 542 70 -632 994 -894 345 367 -807 948 -717 147
1124 147 579 -951 869 -461 -91 701 -1027 810 -204 -357 807 -962 681 8 -642 890 -822
1141 -822 483 173 -815 968 -686 181 353 -869 993 -561 -103 587 -881 886 -439 -316 820
1158 820 -882 666 -219 -447 973 -901 454 81 -558 971 -874 284 393 -713 865 -699
$$ packed form
1039h33J277l09q09J600j658R91J09j180J744j533O31N54j486J767j292K16R65
1056G54j708J677r40k13J318j819J485n11o82J570j790J214n9j088J729j640Q26
1073A23L97j436J813j405L99P89j664J801j084p8J180j794J653p47n40J547j833
1090h79J359l06r38J783j783R95J57j272J891j645O05O55j580J862j363J83J089
1107H13j795J717r61k46J424j930J520m72p02J626j888J239K2j174J755j665Q64
1124A47M32j530J820j330L70P92j728J837j014j53J164j769J643o73o50J532j712
1141h22J305l10r88J783j654Q67J72j222J862j554M58O90j468J767j325J23J136
1158H20j702J548q85k28J420j874J355l73o39J529j845J158J09j106J578j564
$$ plain form
1174 -699 141 599 -909 761 -418 -53 667 -989 705 -127 -328 697 -912 632 58 -621 752
1191 752 -722 451 173 -791 867 -540 154 286 -810 901 -440 -154 509 -752 814 -357 -348
1208 -348 759 -716 567 -199 -418 884 -750 329 79 -482 874 -769 175 389 -603 732 -629
1225 -629 84 572 -782 590 -354 -48 604 -885 549 -68 -286 590 -797 519 117 -536 639 -599
1243 -599 382 196 -687 715 -401 123 272 -694 744 -286 -155 426 -602 662 -233 -326 613 -563
1261 -563 443 -135 -389 730 -584 233 65 -428 711 -590 84 312 -499 578 -491 15 469 -618
1279 -618 484 -273 -85 517 -683 427 -42 -239 495 -630 371 119 -421 502 -474 278 194 -540 543
1298 543 -315 82 256 -547 557 -214 -132 341 -487 475 -136 -263 449 -439 314 -55 -333 522 -423 153
$$ packed form
1174f99Q40M58j508J670j179L65P20j656J694q32k01J025j609J544n74o79J373
1191G52j474J173k78r64J658j407O94J32j096J711j341K86O63j261J566j171R
1208c48J107j475J283p66k19J302j634J079k50n61J356j643R44K14r92J335j361
1225f29P13M88j354J372r44L06O52j489J434o17k18Q76j387J316m02o53J175j238
1243e99R81j86q83J402j116N24J49r66J438j030J31N81j028J264q95r3R39j176
1261e63J006n78k54J119j314Q17j68m93J139j301O74K28q11J077j069N06M54j087
1279f18J102p57J88O02j200J110m69j97P34j125J001k52n40R23r76P52q4p34J083
1298E43q58L97J74q03J104p71Q2M73q28R62o11j27P12q88P53l69k78Q55r45N76
$$ plain form
1318 153 84 -350 507 -390 45 243 -380 444 -297 -29 341 -437 351 -171 -96 384 -456 291 -25 -192 385
1339 385 -420 241 100 -298 382 -332 150 169 -369 373 -221 18 205 -393 342 -137 -102 253 -362 260 -63
1360 -63 -196 300 -308 182 12 -230 336 -258 83 99 -255 326 -197 15 179 -263 278 -150 -34 232 -263
1381 -263 221 -75 -95 249 -266 157 3 -151 238 -239 98 59 -207 228 -198 35 108 -222 203 -122 -27
1402 -27 138 -219 174 -73 -85 170 -191 145 -1 -106 197 -150 94 45 -134 199 -130 46 91 -146 168
1423 168 -77 -2 116 -160 138 -43 -32 126 -138 98 -16 -82 123 -130 57 17 -102 124 -115 24 38 -116
1445 -116 108 -75 -9 70 -109 92 -47 -29 87 -93 88 -5 -37 91 -75 54 13 -44 93 -70 29 33 -60 72
1469 72 -40 9 44 -69 46 -33 -22 47 -62 36 -14 -34 36 -58 14 -3 -34 39 -44 7 8 -31 26 -15 5 19 -20 36 -2
$$ packed form
1318A53o9m34Q57q97M35J98o23Q24p41K68L70p78P88n22P5M80q40P47l16j67N77
1339C85q05O61j41l98O80p14M82J9n38P42n94K39J87n98P35m79L5L55o15O22l23
1360f3j33M96o08M90j70k42N66n94L41J6l54N81n23K12J64m42N41m28J16K66m95
1381b63M84k96k0L44n15M23j54j54L89m77L37l9k66M35m26K33P3l30M25l25R5
1402b7J65l57L93k47j2K55l61L36j46j05L03l47K44m9j79L33l29J76M5k37L14
1423A68k45P5J18k76K98j81J1J58k64K36j14o6K05k53J87m0j19K26k39J39J4j54
1445a16K24j83O6P9j79K01j39J8J16j80J81r3l2J28j66J29m1n7J37j63R9Mr3J32
1469G2j12M9L5j13J15p9J1O9j09R8n0k0P0r4P2j7l1P3q3N1Jl9N7m1K0J4l9N6l8
$$ plain form
1498 -2 2 23 -6 23 3 -2 15 -10 5 15 11 9 2 1 5 1 0 10 -15 -3 8 -15 -4 -14 -18 15 -26 16 -5 -15 26 -32 7 11 -33 26
1534 26 -24 11 28 -45 40 -8 4 44 -39 37 -7 -15 57 -37 35 11 -42 60 -47 22 25 -59 56 -48 -13 35 -70 47
1562 47 -33 -35 59 -76 54 -20 -35 69 -85 44 13 -52 83 -65 19 39 -68 90 -49 10 60 -68 85 -28
1586 -28 -23 85 -76 83 -6 -41 96 -85 59 17 -68 91 -79 28 37 -84 89 -79 1 47 -99 81 -59 -20
1610 -20 77 -101 73 -21 -44 99 -98 72 2 -56 123 -88 49 43 -71 125 -72 31 81 -105 123 -55 -13
1633 -13 88 -98 96 -30 -38 103 -112 87 0 -77 109 -113 39 22 -95 126 -98 13 62 -113 117 -74
1655 -74 -18 88 -115 105 -32 -36 120 -107 88 -4 -62 128 -100 73 48 -81 141 -95 37 62 -105 134 -77
1678 -77 -1 79 -130 113 -43 -27 98 -129 96 -19 -74 118 -119 60 6 -90 114 -117 32 49 -114 135 -74
$$ packed form
1498bMK1k9K9k0nJ7k5J5J0mkpjMmjJ0k5J2J1k3J1j0mL3m1M2k1j0M1n8L9Mm4N9
1534B6n0L5J7p3Q5m8J2M0q3P6m4qP2r4P2k4n3J02j07O9Lq4J15j04L5M8j05J17
1562D7q0kR4j35J30p4j5J04j54J29l1o5J35j48Q4K0j07J58j39N9N0j28J53j13
1586b8NJ08j61J59q9l5J37j81J44m2q5J59j70J07Rj21J73j68Q0M6j46J80j40L9
1610b0R7j78J74r4k3J43j97J70p0n8J79k11J37oj14J96j97J03N0j86K28j78M2
1633a3J01j86J94j26qJ41k15J99q7p7J86k22J52j7j17K21k24J11M9j75K30j91
1655g4N6J06k03K20j37mJ56k27J95r2n8J90k28J73k5j29K22k36J32K5j67K39k11
1678g7P6Q0k09K43j56J6J25k27K25j15n5J92k37J79n4r6K04k31J49J7j63K49k09
$$ plain form
1701 -74 -3 74 -125 128 -55 -29 113 -107 110 -25 -56 144 -113 77 20 -81 140 -111 50 47 -111 124 -97
1724 -97 -5 79 -139 108 -70 -19 105 -151 106 -24 -56 118 -149 81 9 -95 121 -112 64 41 -117 139
1746 139 -105 28 65 -121 141 -56 -12 109 -118 129 -30 -48 135 -117 91 -8 -81 144 -119 46 26 -111
1768 -111 134 -113 9 62 -115 116 -100 -27 99 -144 92 -54 -34 119 -141 76 13 -61 119 -124 79 50
1790 50 -86 128 -86 51 67 -124 122 -60 12 83 -136 126 -30 -42 98 -115 98 -17 -79 113 -123 55
1812 55 6 -98 128 -100 12 33 -115 130 -79 -16 84 -102 112 -43 -37 126 -102 90 -12 -44 130 -115
1834 -115 58 30 -64 121 -94 36 69 -94 107 -71 18 82 -117 92 -43 -26 89 -137 87 -17 -70 92
1856 92 -119 71 11 -94 101 -96 41 36 -89 114 -71 11 61 -93 120 -38 -18 96 -85 94 -11 -43 104
$$ packed form
1701g4P1P7j99K53j83K6J42k20K17j35l1K00k57J90n7j01K21k51J61lj58K35k21
1724i7R2Q4k18K47j78N1J24k56K57j30l2J74k67K30p2j04K16k33J76k3j58K56
1746A39k44J33L7j86K62j97M4J21k27K47j59j8J83k52K08r9p3K25k63J65k0j37
1768a11K45k47J22N3j77K31k16P3J26k43K36j46K0J53k60K17o3p4J80k43K03k9
1790E0j36K14k14J37J6j91K46j82P2P1k19K62j56j2J40k13K13j15o2J92k36J78
1812E5m9j04K26k28J12K1j48K45k09O3J00j86K14j55OJ63k28J92j02l2J74k45
1834a15J73k8r4J85k15J30L3j63K01j78Q9O4j99K09j35J7J15k26K24j04n3J62
1856I2k11J90o0j05J95j97J37nj25K03j85Q2N0j54K13j58K0J14j81J79j05l2J47
$$ plain form
1879 104 -79 54 11 -58 118 -83 31 47 -69 105 -67 3 67 -95 77 -59 -26 71 -92 62 -24 -41 76
1902 76 -101 49 2 -55 77 -86 49 38 -65 90 -52 22 52 -65 100 -24 2 70 -77 83 -9 -33 83
1925 83 -69 54 5 -53 81 -70 40 10 -62 78 -55 5 29 -77 70 -48 -13 49 -74 56 -33 -25 65 -65
1949 -65 53 2 -27 79 -48 41 20 -42 76 -39 32 41 -62 73 -28 10 51 -67 54 -21 -14 49 -65 42 -11
1974 -11 -33 47 -64 36 -8 -37 48 -45 21 17 -46 41 -44 -7 39 -38 57 -19 -2 42 -39 50 -5 -13 44 -31 31 9 -13 53
2004 53 -28 19 16 -21 45 -30 8 27 -36 25 -22 -1 29 -38 30 -16 -18 26 -36 18 -19 -23 19 -43 6 6 -22 19 -18 -1 8 -16 34
2037 34 -14 18 23 -30 29 3 4 24 -20 24 -3 1 24 -31 16 2 -10 12 -17 4 0 -17 15 -16 -9 -3 -6 1 -13 -10 7 -9 14 -4 -7
2072 -7 -3 -3 3 10 4 17 1 5 16 1 2 7 16 4 11 19 7 9 13 10 5 2 -2 -4 2 -11 -15 4 -14 4 -13 -9 -3 -15 -1 -9 -3 3 -15 -3 -2 -14 6 -9
$$ packed form
1879A04j83J33m3o9J76k01J14J6j16J74j72P0O4j62J72j36L3R7j63J54q6j7J17
1902G6j77J50m7n7J32j63J35j1j03J55j42P4L0j17J65j24K6O8j47J60r2k4J16
1925H3j52J23m9n8J34j51J10l0p2J40j33O0K4j06J47j18L5O2j23J30q9QR0j30
1949f5J18n1k9J06j27Q9k1o2J18j15P1Rj03J35j01L8M1j18J21p5PO3j14J07n3
1974a1k2Q0j11J00m4k9Q5r3O6mo3Q7q5L7M6p7R5p6J7M4q1Q9n5qN7p5O2k2k2O6
2004E3q1M7ll7O6p5L8J9o3O1m7K1L0o7O8m6kM4o2N4l7mM2o2M9%k8M1l7J7Rk4N0
2037C4m8L2Nn3N9k6JK0m4M4k7MK3n5M7j4j2K2k9K1mj7L2l1POlPj4LJ7j6K3j8l
2072gM%OPoJ3j6MJ1j5JNRj2PQj2KMlnlmkOj3mJ9j8J8j7MOj2J4qOOj8J2Jj2K0j5
$$ plain form
2116 -9 4 6 2 27 1 0 8 12 21 -5 1 21 -8 19 4 -3 23 -18 12 -2 -6 19 -22 11 -3 -15 17 -14 -7 5 -12 14 -7 4 16 -20
2152 -20 20 -9 3 15 -14 26 -3 2 33 -15 31 10 -9 36 -8 25 16 -11 31 -8 9 30 -29 34 -11 -5 12 -32 26 -5 -11 22
2184 22 -30 18 0 -17 20 -38 15 -2 -22 34 -27 -1 24 -33 37 -14 4 28 -29 37 -3 5 39 -31 42 -1 -2 41 -31 28 13
2215 13 -12 49 -28 24 13 -36 29 -29 6 13 -31 32 -27 -13 23 -48 32 -24 -14 36 -38 26 -1 -22 50 -41 29 18 -27 43 -23
2246 -23 11 32 -35 47 -12 0 30 -40 48 -18 -1 45 -37 33 -11 -21 26 -48 19 -1 -34 40 -46 8 9 -40 36 -40 3 15 -52
2277 -52 38 -18 -10 31 -37 47 -4 -25 37 -47 37 5 -23 49 -30 33 13 -34 53 -30 16 27 -49 43 -28 -4 30 -47 39 -23 -25
2308 -25 26 -59 29 -9 -28 33 -55 11 -4 -35 53 -36 12 16 -39 42 -28 -1 30 -40 37 -13 -5 48 -44 49 7 -12 51 -34 31
2339 31 8 -26 48 -44 12 8 -39 31 -28 8 11 -39 55 -28 -13 24 -53 35 -14 -24 20 -47 29 -2 -23 42 -39 21 6 -18 61
$$ packed form
2116iJ3KmK5k6jQMRk6OK0k9K7j5pK6m1L0j4mK5m1L3j4j2L2l1PJ2j7K6k1J1J2l6
2152b0M0k9J2J2k9M0k9NL1m8M6k1j9M5m4L3rk7M2l9J7K1n9O3m5OJ7m4N8l1oL3
2184B2n2M8j8j7L7n8N3j7k0N6o1K6K5n7P0n1J8K4n7O6m0QL4p0P3m3jM3p2N9j5
2215A3k5O1p7N2j1m9O5n8L5Pm4O3n9J4L6p1Q0n6J0N0p4O4k7k1P2r1P0j1m5P0o6
2246b3L4K1o7Q2n9J2L0p0Q8o6J7M6q2P0m4j0M7p4O7k0l3P4q6N4Jm9P6p6M3J2o7
2277e2R0n6QM1o8Q4n1k1O2q4Q4l2k8P2p9O3k0m7Q7q3M6J1p6R2p1K4L4p7Q6o2k
2308b5N1q5Q8l8j9O1q8O6j5l1Q8q9M8Mn5Q1p0K7L1p0P7n0QN3r2R3m2j9O3q5O5
2339C1k3l4P4r2N6mm7P0n9L6Ln0R4q3J5L7p7Q8m9j0M4o7P6l1k1O5q1O0j5k4P9
$$ plain form
2370 61 -27 16 29 -33 41 -26 12 41 -28 41 -18 -2 44 -43 35 -11 -17 42 -40 20 10 -29 38 -38 14 11 -38 36 -34 13 10 -48
2402 -48 39 -18 -7 26 -38 46 9 -4 47 -25 35 9 -17 42 -22 19 14 -21 52 -24 9 17 -31 42 -28 -2 20 -43 31 -20 -23 27
2434 27 -40 20 -4 -18 27 -44 16 -2 -27 37 -39 10 9 -33 35 -19 9 23 -31 45 -3 1 33 -29 35 -5 -6 37 -22 28 10 -11
2466 -11 34 -22 21 23 -31 33 -28 7 17 -24 21 -16 -2 25 -27 25 -6 -3 31 -26 16 -8 -7 30 -23 12 16 -14 36 -14 14 14 -19
2499 -19 24 -14 13 30 -28 32 -1 -2 30 -19 27 3 -15 25 -30 12 -3 -17 16 -28 6 7 -35 19 -27 -1 9 -29 22 -15 2
2530 2 18 -12 21 1 3 29 -9 31 11 -2 24 -8 21 15 -4 24 -16 16 8 -10 14 -16 6 11 -24 16 -19 -4 10 -34 10 -7 -14
2563 -14 0 -33 -3 0 -9 11 -30 15 3 -11 19 -16 4 5 -7 25 0 11 11 -8 19 -3 1 21 -1 6 -1 -5 12 -7 0 -2 -17 13 -20
2598 -20 -11 -5 -12 5 -25 -9 -3 -20 3 5 -3 -3 -15 6 -5 -4 10 -12 0 7 2 18 4 9 16 -8 19 -1 13 21 -4 13 -3 -4 2 -5 3 -3 -4 1
$$ packed form
2370F1q8M3J3o2P4o7L8K9o9O9n9J6M6q7P8m6oN9q2O0j0l9O7p6N2lm9P4p0M7ln8
2402d8Q7n7J1L3o4Q4l7j3N1p2O0k6k6N9o4M1nl5P3p6L3Qm8P3p0K6K2o3P4n1lN0
2434B7o7O0k4j4M5p1O0j8k5O4p6M9jm2O8n4K8J4n4P6m8ML2o2O4m0jM3n9N0j8k1
2466a1M5n6M3Kn4O4o1L5J0m1M5l7J4K7n2N2l1LL4n7M2k4JL7n3L5Ml0N0n0K8%l3
2499a9M3l8K7J7n8O0l3jL2m9M6k4j8M0n5M2j5j4L3m4L4Jm2N4m6K6J0l8N1l7J7
2530BJ6l0L3k0KK6l8M0k0j3K6l2K9oj9K8m0L2qj8K4l0K2Nl5M0l5J5J4m4M4j7p
2563a4J4l3L0LrK0m1M5j2j4L0l5K0Jj2L2k5J1%j9K7k2MK0k2PpmJ7j9Pkj5L0l3
2598b0ROpJ7l0J6Oj7K3Kq%j2K1j1JJ4k2J2PnJ6j4NPk4K7k0J4Qk5J7j6jOpQojN
$$ plain form
2638 1 -3 0 -7 -20 -1 -10 -6 -11 -10 -1 -8 1 -5 -7 5 -2 2 5 1 7 9 10 2 -1 6 17 9 -4 12 11 6 11 10 11 -2 6 10 -3 -3 9 5 -7 4 8 3 4 2 -1 -8 -7
2688 -7 0 -3 -10 9 -8 -5 2 -7 5 11 2 15 1 5 10 7 1 12 5 15 -4 3 6 2 17 -5 1 4 -12 -2 -10 -7 -2 -11 -1 -8 -8 3 -20 5 -6 -11 4
2731 4 -5 -1 1 -3 3 -6 9 10 -6 16 -8 -5 9 -10 22 4 14 18 -4 11 0 6 18 2 12 -5 1 14 -15 2 -2 -9 0 -13 -5 0 -22 4 -12
2770 -12 -11 0 -18 5 -14 -8 18 -2 8 -4 7 14 -2 11 16 -2 27 -7 14 9 -8 18 -2 10 22 -18 18 -6 -6 12 -12 15 0
2803 0 -11 12 -5 -9 3 -14 16 -5 12 -9 -14 12 -14 2 3 -2 10 -12 0 17 -16 17 -3 3 22 -11 23 16 -1 22 -11 16 10 -11
2837 -11 25 -2 4 7 -19 13 -10 -4 9 -24 11 -14 -13 0 -27 3 -7 -16 7 -15 2 -7 -8 10 -13 10 10 -6 31 -6 6 25 1 29
2871 29 6 -2 20 -2 28 0 6 20 -10 7 1 -11 9 -18 1 5 -14 14 -17 -12 15 -20 1 -12 -12 5 -31 19 -1 -6 14 -21 9 1
2905 1 -11 25 -9 13 11 -4 22 2 15 15 -4 32 1 2 26 0 19 1 -3 13 -15 2 -6 -6 15 -12 4 13 -24 16 -18 -3 3 -19 16
$$ packed form
2638AmLpj3J9rMnJRpRokJ2pMLmOKJqlPJ1qj3J6jnNjJj3QMj3%J2mj2J1MnJklpJ
2688gPlpJ9j7LPrJ2OrJ3j4MNloJ1pJ0j9PLmJ5k2OLj6J0qLNrJ0p%J1k3K5j1nJ5
2731DrMKmOrJ5Jj6K2k4LJ4j9L2j8J0Mk2J5j1OJ2j6J0j7OJ3k9J7mpRj3QNk2K6j6
2770a2JJ1j8K3j9OK6k0J0j2J1Pj6J3Nj8K9l4K1nj7K6k0J2J2m0L6k4%J8k4K7j5
2803@j1K3j7mJ2j7L0k1J7k1nK6k6J6JnJ2k2J2J7l3L3k0OJ9l3L4pj7K3l3K7ok1
2837a1L6k7OLk6L2k3OJ3l3L5k5JJ3k7L0j0rK3k2J7rjJ8k3K3%j6L7l7J2J9k4K8
2871B9k3qK2k2L0k8OJ4l0J7oj2K0k7J9Mj9K8l1NK7l5K1j3%J7l6N0k0nK0l5L0q
2905Aj2L6l4K2kj5K6k0J3%j9L6l1JK4k6J9j8mJ6k8J7q%K1k7J6Rl7M0l4J5Ok2L5
$$ plain form
2940 16 -10 -4 10 -7 22 0 2 18 -8 21 14 5 34 1 19 14 -1 29 5 14 15 -3 31 0 11 14 -17 24 3 -7 13 -17 -3 -7 2
2975 2 5 -17 2 4 -14 11 -19 4 6 -7 20 -7 3 17 -11 22 5 9 21 -12 26 6 8 28 1 24 13 2 18 -7 12 5 -4 18
3009 18 -14 3 4 -11 11 -15 -2 6 -24 12 -3 -6 8 -13 0 1 -2 30 -18 14 8 -5 19 4 17 16 1 26 6 7 14 -4 27 0 10
3044 10 25 2 20 7 -9 12 -15 10 -8 -20 15 -17 -5 -10 -25 8 -10 1 1 -11 12 -11 -6 2 -11 15 4 -9 24 -6 19 4
3076 4 3 18 -9 19 17 6 19 0 11 24 1 29 -4 2 6 -13 12 0 -5 16 -16 -7 -4 -10 5 -9 0 -14 -28 5 -14 6 4 -8 18 -1
3112 -1 7 5 1 15 7 4 10 5 7 -3 4 26 1 13 15 5 10 -3 2 7 -4 4 -12 -7 0 -12 -2 0 -6 4 -14 -4 -6 -3 9 -1 7 0 0 -1 -18 9 7
3155 7 5 13 -1 10 4 -4 11 2 7 16 1 5 -1 -2 4 1 11 7 2 -1 -8 7 -1 -3 3 -10 -19 5 -15 -2 -14 8 -3 -8 -2 0 8 -1 -4 -4 0 3 7 3 16 8 14
3202 14 21 5 11 14 8 12 3 5 2 10 20 1 2 6 0 16 2 8 3 -1 -1 -4 -7 -3 8 -7 0 -2 2 8 7 5 1 7 -2 8 3 -2 8 7 2 10 5 10 13 4 10 3 6 10 -2
$$ packed form
2940A6k6OJ4j7K9k2KJ6k6K9prK9l3J8nj5L0k4RJj8L4l1J1Ll1M1k1j0K0l0J4mR
2975BLk2J9Kj8K5l0K3Kj3K7k7J0J4k8L3j7MJ2l3L8k0KK0k7K3j1j1J6k5J9prK2
3009A8l2J7Jj5K2k6J3Ql0L6j5lJ4k1J3JlL2m8L2oj3K4j5J3jj5K5k0JPj8L1k7J0
3044A0J5k3J8j3j6K1k7K5j8j2L5l2J2nj5L3j8J1%j2K3k3NQj3K6j1j3L3l0K5j5
3076DjJ5k7K8kj1J3j9J1J3k3K8l3OMj9K5j2nK1l2RLoJ5j4Rj4j4L3j9K0kj2K6j9
3112aQkmJ4qlOnKj0PK2k5J2Kj0Nj3NNj1Qj6NPj2J0KoJ0j8J0kLJ2j0Qp%jj7K7k
3155GkQj4J1oqJ5rNRj5MojOlJ0mnlpJ5qkOj3rK4k0J3j2K2j1nOKQrl%MLMmJ3qO
3202A4Pj6OLoMrKlQJ0j9JMoJ6j4Onm%llMJ1j5PkMOjkmOrJ0nnJ0jnQnNLrOpLMj2
$$ plain form
3253 -2 12 -1 1 3 9 7 10 3 -8 -7 -11 -1 -13 -7 0 1 -5 -8 1 -6 -4 -2 7 -2 5 -8 2 -4 0 1 6 5 0 11 9 5 4 22 5 3 2 4 -6 1 -2 -3 -13 -3
3301 -3 -2 1 -4 -4 -13 -7 0 -6 -6 0 -9 0 -6 -4 1 -6 0 1 -6 2 9 2 6 16 3 12 21 17 11 3 11 3 7 8 0 -3 2 0 -1 0 1 -1 0 9 -3 -8 -4 0 -11 -8 2 -4 -8 -4 -10 -6
3357 -6 4 -2 4 6 13 5 -1 6 10 13 8 2 6 2 10 5 0 8 10 13 25 -6 8 -7 -1 4 4 7 -2 -3 3 -10 -9 -7 -13 -5 -6 -1 0 0 6 -1 2 2 -2 21 0 9 13 16 22 19 10
3410 10 26 12 14 7 9 14 -3 5 8 5 15 1 4 6 0 -4 -6 3 1 -6 1 -5 -8 7 -2 2 -6 2 -6 -1 6 7 -8 -9 -7 8 10 6 8 8 11 9 6 23 11 11 13 -1 8
3459 8 4 3 12 -8 -2 5 -2 1 -3 5 -5 -10 -10 -15 0 -4 -8 9 8 -10 4 -9 -3 -1 -2 7 -10 8 -4 5 3 9 7 2 5 14 3 12 -2 2 8 11 0 14 3 4
3505 4 -1 -9 8 -6 -5 -6 -4 -5 -12 -2 -8 -8 2 -6 -2 -9 -4 3 4 -1 6 -5 18 -4 4 -4 -7 9 4 25 12 6 15 2 12 22 1 8 -1 -2 8 -3 4 4 -4
3550 -4 6 -11 1 0 -13 -3 -22 -12 -13 -12 -13 -7 -4 -9 -6 -1 9 -7 18 11 -3 7 2 9 9 1 4 13 15 7 12 12 -5 12 -6 1 9 -13 1 4 1 10 -9
3593 -9 2 -9 -8 2 -1 3 5 -6 -1 0 -3 0 -3 4 6 2 7 5 6 7 9 -1 -7 5 4 -12 17 5 6 7 -10 6 1 -2 -6 -1 4 1 -2 6 -23 1 -11 -5 1 -6 1
$$ packed form
3253bJ4j3KKOkLpj1JmJ0j2OPJolRpKKRrPj3J0oMJNjnJ1kmjJ8j7kjKj0Pljj0J0
3301cJLn%rOPo%OrRoKNpOJpQPpMJ0j3RRmoqQqMJqlNkjJJkJRj2nMMj1LJ0omMoM
3357fJ0oOKPqoPMLnoMmQnnQKLJ2l1J4j5ON%LrjOj3JKoQjNJ%OpL%mK3k1RMLOlr
3410A0J6j4KpKNj7QLlJ0j4LKomkRkpPolJ5rMqQqNPJj5jKJ5KmK%LklJ7j2%Kj4R
3459HmjRk0OPpLmQj0n%nJ5mmJ7jj8J4j3OKjRj7J8j2RkOknLRj1Rj4MOLj1J4j1J
3505DnqJ7j4JjKjpJ0o%J0qMpNPJnPj1K3k2QqlJ6nK1j3oRj3J0J0k1PrjJ0j1P%q
3550dJ0j7J2jj3J0j9J0jJjOLnLNJ0j6K5pj4J0nP%qLRKqN%j7J7j8PQk2J4LlRj9
3593iJ1j1JJ0lMKj1NJlLlPKmNkJJKj0oJ2jj6K9j2JJj7J6nlmNNllQk9K4j2OOpP
$$ plain form
3640 1 -6 -5 0 -9 -1 -4 -10 -7 -8 6 -3 4 6 14 21 8 -1 2 5 1 9 -2 9 6 7 11 -2 5 -4 1 6 -2 -5 -8 -10 -12 -8 -12 -6 -14 7 -8 -4 -1 -11 -1 4 -13 -3 -5
3690 -5 -11 1 -7 5 -1 11 16 7 15 2 6 17 -2 6 15 5 16 1 11 4 3 -1 -7 9 -1 -3 -13 -12 -9 -11 -11 -2 3 -4 -1 -4 -9 1 -12 -5 -5 -7 -8 -8 -10 -2
3736 -2 8 -2 2 6 7 9 4 0 1 6 1 -2 0 3 -8 -1 6 -4 -4 -5 7 -7 -9 -16 -10 -15 -7 -3 -11 -4 -9 1 -7 -7 2 -3 -2 -3 5 3 -3 13 1 -5 12 -1 -3 13 9
3785 9 15 0 -5 5 10 8 12 1 3 5 -3 1 -11 -1 -8 1 -18 -13 -7 -22 -24 -13 -5 -5 1 2 5 -8 0 -6 1 7 -3 -3 -8 4 7 -2 3 3 9 3 1 3 15 4 7 2
3833 2 -6 10 -4 -6 1 -2 -7 -6 -3 -4 -2 -10 -2 -14 -18 -3 -11 -8 -15 -5 -2 -8 -18 -9 -4 1 -5 -2 4 7 1 5 -5 3 4 7 11 15 -2 10 6 -6 -4 5 0 -8 3 -5 -3 -17
3883 -17 -8 -5 -11 -11 -16 5 -1 -11 -9 -11 -9 -2 -1 -5 0 6 6 11 7 10 -9 9 10 1 -4 2 9 19 6 -1 19 7 -6 -7 1 1 2 1 1 -12 -7 -6 1 1 -4 -7 -7 -8 -14 -5
3933 -5 -17 -4 -15 -7 0 -5 -5 -4 7 -7 6 -5 -7 0 1 3 -2 -6 -1 6 0 10 2 -6 6 2 -2 5 3 -3 -1 -8 -2 -7 -1 -5 -4 -17 -2 3 -13 -3 3 -5 -11 -12 -4 -5
3981 -5 4 5 8 9 7 5 7 11 3 0 9 -4 6 4 15 13 9 6 7 0 7 4 6 2 4 -2 -8 -4 -5 3 -17 1 1 -7 0 -6 -10 -8 -5 -5 -7 -5 -6 -3 -10 3 12 -2 8 3 9 4 4
$$ packed form
3640ApJNrQloLjJ4rPKQPj3rLLmQj1J1lJMj3PrNNqllkkMmOqK1j5MLj0J0Nj7J0k
3690eoJ2qJ2oJ2NrQj3MJ1j9QRj0J1j5J0pjmoJ6j0kj0JLk%RNpLlnJ0j3P%kj%kQ
3736bJ0j0MMJKnmJNnlKLj1PPj0%jJ2j4kpOnQMqPnJ0q%RnJjQkoJ6j2oJ7j3kJ6m
3785IOj5nJ0NkMj1KKqMj2J0pRj9NOj5kJ1Q%OJLj3QoPOj0%nJ2LrN%OokKJ2j1Ln
3833BqJ6j4kPlnJLjKqQj2mJ5qLpJ0Loj0RNNoLOLoMj0QJLMMj7J2mj2KRnqJ1qKj4
3883a7RLo%nK1oj0KkKPJmNO%NmLj9J8JrnOPJ0j3pK0j2j3jQ%Jj%j3NJP%nl%joR
3933ej2J3j1QPn%JJ1j4J3j1kPJKnmNPoJ0qqJ2mmPkoKpOnOmJj3J5Nj6J0OqojQj
3981eRJLJkkKMqlRj3J0kJ1kmlJpPlKmKooMjQk0J8%qPomKL%kKjLpJ3Rj4J0nOn%
$$ plain form
4034 4 5 2 -6 -1 0 6 8 7 2 -1 11 8 10 14 -3 -2 -6 -10 -6 4 -8 -14 -3 -5 -11 -11 -12 -1 -6 -9 7 -7 1 -3 6 12 0 16 12 3 6 5 1 10 14 -1 5 4 4 1
4084 1 11 -1 8 10 -1 -9 -4 -10 -5 -3 -10 -5 -7 -3 -4 0 -5 -8 -14 1 3 3 1 5 -7 -4 0 4 11 2 3 8 3 9 2 6 14 6 3 -7 3 7 3 1 4 -4 1 -5 -10 -2 -14 -6 -15
4137 -15 -8 -2 -18 -8 -5 -13 -6 -8 -3 -7 0 -16 -2 -4 -2 -6 5 -2 -1 9 -2 6 -2 10 10 -3 -5 0 2 6 -1 -1 2 15 -10 -11 -6 -16 -11 -9 -18 -12 -10 -12 -7 -6 -9 -9
4185 -9 -3 4 -2 -12 -3 -4 -3 2 -4 3 -6 2 2 4 12 -3 13 1 10 13 5 4 7 7 2 -4 -2 -12 -7 -11 -1 -6 -11 -2 1 2 -11 -13 -7 -8 -17 -11 -4 -6 -2 0 -9 0 5 -8 3 9
4237 9 7 2 5 -2 2 8 11 3 1 2 10 1 6 -4 0 -1 -8 -8 -17 -9 -10 -7 -13 -14 -5 -8 -4 -7 -9 -2 -10 -1 -4 2 4 1 6 -5 -1 8 -2 -1 0 1 6 1 13 3 -4 0 5 2 -7 -10 1
4292 1 4 -1 -2 0 -5 -11 -9 -3 -20 -3 -7 -1 0 -12 -5 0 -4 -11 -9 -4 -2 0 -5 12 10 1 4 5 8 9 8 10 17 6 3 11 10 6 5 7 5 -5 5 3 -4 -11 0 -8 0 -8 -12 4
4344 4 0 -1 -7 -8 2 -17 -8 -9 -3 -1 -7 -4 -3 9 -4 4 6 16 7 5 13 8 11 3 8 5 2 9 5 6 -3 -6 4 0 -9 -9 -10 -5 -4 -11 -3 -5 -11 -5 -9 -6 -8 -8 -4 -5 -1 4 1 -9
4398 -9 -4 -1 -10 4 2 11 2 11 19 5 3 10 7 23 15 7 18 6 18 1 2 3 1 -4 0 -13 2 3 2 -6 -12 -6 -9 -3 4 -6 0 1 0 0 9 8 6 2 2 1 4 9 8 7 3
$$ packed form
4034DJlqNJOKjnlJ2lKMj7JmmMJ0j2oJ1ko%jJ1nlJ6j4QmROj2J6mrLjmRMj5Oj%l
4084AJ0j2RKj1qNoNKpNkMjMnloJ5K%kMj2LMMPrJNnOpMQqlj0J0MmkLqNonQj2Qr
4137a5POj6J0LqPkNmPj6J4kKmJ1pJJ0j1QqJ2%j3kNKMp%LJ3k5jNj0NKrOKkNJl%
4185iOPoj0RjJNoPrQ%KQj5J6j2RLqjL%noKj0NmJ0nnRLJj3kOjrOPkMKrRNj3J1O
4237IknLpMOLqkJQrNj0Mjp%rQjLojRlMlkPqRlOKlNj1MRj0JJJNnJ2j0pMNlrlJ1
4292ALnjKnoKOj7J7mOJj2PNmpKNKKnJ7krLJLJjKPj1lQjmjKkj0J0kppJ1qQqmJ6
4344DmjojJ0j9RjOKoLJJ2j3QKJ0rkQnLqNllPmJrlJ0mr%jNJpQkoOmLk%MjMNlj0
4398iNLrJ4kRrRQj4kPlJ6qqJ1j2J2j7JJknMj3J5JjqoOlOPj0OJj%Rjkm%jLNjjm
$$ plain form
4449 3 13 8 17 3 11 15 14 15 14 7 9 0 -4 4 6 3 -1 -9 5 -10 -7 2 -8 2 -2 -1 5 1 3 3 8 3 -4 4 -3 8 1 7 1 14 -6 10 14 12 3 0 -1 7 -6 0
4499 0 1 3 5 -3 5 4 1 -3 6 -4 -10 -5 -3 -9 -4 -13 1 -5 -1 16 1 -2 -10 -8 0 -2 -1 3 7 1 11 10 14 8 5 6 7 3 -2 11 0 3 0 1 2 3 -1 0 -1 3 -3 -6 -3 11
4553 11 -6 -16 -13 -13 -4 -3 -9 4 -1 1 3 -12 7 2 10 3 -1 7 14 14 10 15 -1 8 14 5 12 5 -1 4 -6 -7 2 6 -10 1 -9 1 -11 -8 -2 -16 -1 -10 -6 -8
4599 -8 -11 -7 -3 1 -2 5 -2 -7 -2 1 -3 13 3 11 12 -1 -9 3 9 4 5 8 6 2 -1 3 -7 -2 -6 -12 6 -1 0 3 -2 6 -15 4 -4 -8 -12 -8 -2 -3 -5 -3 -9 -4 2 1 -6 1 8
4652 8 10 3 3 5 1 11 10 1 7 -8 1 16 11 1 4 2 6 -5 -8 6 -5 -9 2 -14 -4 -13 0 -12 -9 -8 -4 -10 -3 -2 -7 9 -1 2 0 10 8 14 1 2 9
4697 9 7 16 8 0 3 1 15 9 14 7 -3 -5 -3 -2 -10 -15 -14 -10 -5 3 -7 0 4 -7 -4 -4 -7 -10 -10 -4 -5 -6 0 -2 -2 -13 4 3 9 7 14 10 9 7 -4 9 4 5 1 1 -3 1 9
4750 9 3 -3 -2 -2 -3 -6 -11 -7 -14 -6 -8 -8 -12 -7 -11 -6 -13 -6 -4 -6 3 6 -4 0 0 9 11 6 9 7 14 9 15 -1 0 7 2 3 8 -3 -3 -5 0 -2 -14 -4 -4 -1 -10 -4 -15 -26 -1
4803 -1 -4 -17 -9 -3 -7 -7 -15 -1 5 -5 5 8 1 5 -2 4 2 1 2 14 7 6 7 4 6 -4 -3 4 5 -9 -2 2 -14 -3 9 -10 -15 -2 -11 -1 -10 -12 -7 -10 -10 9 -10
$$ packed form
4449CJ0nRj4QMjJjpKrmQKlmqJ4j5LRj0J0mJOmK%NnpQpJ1pOoJ3k0J6MkrljQj3O
4499@JKKqQjlmRj0oNKoNrJ4oMJ7j5lqKQkJMMoJ0jMolJJmnJ3j1LlJJJmJjMolLJ4
4553A1j7j0L%RJoJ3nKKj5J9nQpmQP%mNj6ROrPpoNj0jRMj6J1j0J0j2LOj4J5rMk
4599hlMMMlPpnNLmJ6j0QJj3qJ2OnJLkmlMj0NmoJ8pJLnQk1J9qmmMOjkKoNOjpPP
4652HKp%KmJ0jrOj5RJ5nj0LkMj1lJ4j1mJ1j6J0rJ3j2LJMoPJnJ6j0LkJ0kOj3JP
4697IkRqqLkJ4oNpj0kKJqnJMNQj0PMj1L%ll%OjjOk%j1J7jOkPmjkj1J3nJm%mMQ
4750IooJ%jlnMpQk%mNmNpPKkRLj0M%RKnLkPnOj6JPnJNj1%kNkj2J0%LrOj1j1K5
4803alj3QOm%qJ4Oj0J0LpMpOkjJJ2pjJlKj0JPJj4PMj6J1J2j9nJ3rJ0rkNl%J9j9
$$ plain form
4850 -10 -11 -7 2 -5 2 0 -5 3 -3 0 5 2 6 11 2 5 14 6 3 11 14 11 5 7 -11 0 2 2 -7 -4 3 -5 0 -4 4 -20 -15 -8 -7 -12 -6 -8 4 -4 -5 2 1 12 9 7 2 15 6 6
4904 6 4 0 -2 7 4 8 4 3 2 2 -1 -7 -5 -7 -7 -4 -1 1 -1 -6 -7 -10 -6 -4 -13 -9 -2 -7 -4 -13 -9 3 -1 -7 0 10 -3 5 8 9 11 -2 0 4 0 3 -6 15 -2 -8 -1 -8 8 7
4958 7 -3 -9 0 -5 4 -8 -8 2 1 -8 -11 -13 0 -2 -3 0 3 -13 -4 -2 5 -10 -3 -1 9 7 1 15 7 1 -5 2 4 8 8 4 12 5 11 8 -2 3 5 1 -8 1 7 7 -5 -3 0
5009 0 -11 -4 2 -1 7 -2 6 -2 8 -1 -2 -3 1 1 1 11 -8 12 10 8 -4 11 4 3 -2 -9 14 3 2 7 -2 9 -3 -9 1 -4 -11 -8 -14 -13 -6 -7 -5 -3 -6 -14 -1 -5
5057 -5 -15 -4 1 -7 -8 -10 -9 5 6 1 -3 0 8 8 15 9 7 3 0 2 2 5 2 -8 -5 -5 7 4 -12 4 -4 -3 -8 -2 -11 -9 -13 -10 -12 -4 -5 -4 -7 7 2 -5 -2 -6 2 5 3 8 4
5110 4 11 17 12 13 12 3 11 6 9 -3 -1 3 3 1 4 4 -1 -4 1 -5 -14 3 -1 9 -14 1 -11 9 -1 10 -4 -1 4 0 2 7 0 -2 13 -2 1 10 10 4 12 0 11
5157 11 21 12 12 -9 -4 13 8 10 -1 -12 0 -2 11 2 -6 6 -8 6 -13 -13 -4 0 -12 -17 -8 8 3 -2 6 9 11 1 2 3 11 -3 13 14 17 12 11 12 -1
5200 -1 9 7 5 3 13 2 -5 12 7 2 -16 -8 0 4 4 -3 2 -4 -3 -15 -15 -6 1 -9 -5 1 5 3 0 1 -4 6 0 0 -11 7 6 4 -3 3 3 -1 3 1 -3 4 -1 -3 -6 -7 -11
$$ packed form
4850a0jMRpPknQoLNlMNrLRqlQLloKj8J1K%rLPqNmQk4NPJnOkJ2qjPjJ1lknJ3r%
4904FkmkRlMmjj%loKk%LLKknjlMKrMPnLrMJ2moPJ0j3QLJKj3KMmLrK1j7oPpJ6j
4958Gj0oRnRj2%J0jrlkJ3kjLLj6RKPj5PKJ0koJ4qooPKM%mQpOlj0NKmrRO%j2KL
5009@j1POlQrQqJ0rjjM%%J0j9K0kkj2J5pjnpK3j1jNrJ1j2oJ0npLoJPjKKlqJ3m
5057ej0J1NqjkJJ4JnmLQ%PokmlK%Llj0L%J2lj6J6qJnOrKmLkQjJlJ4npLmQLkNm
5110DPOnJjrQnLj2KM%kL%nlNorJ7mJ0k3J5j2K0j0J1j4LNmKNpkJ5j5LR%oQj2J1
5157A1J0r%k1NJ7nKj1j1J2kJ3rqJ2j4J4j9%RMj2nRJ6nnQLKj0JJQj4J6JLnjJj3
5200aJ0kkkJ0j1pJ7nnj8QQM%pNoJj2%RPj0MOMklJnJ0o%j1J8jkpO%mMkmPnkljm
$$ plain form
5251 -11 -6 -2 2 5 10 -5 -4 -6 -15 -2 -16 -7 1 -12 -14 -4 -3 -1 6 8 -3 -3 2 8 1 5 5 10 3 -3 4 8 13 3 12 11 18 5 8 -2 -1 -2 -7 -6 5 -9 -6 -7 3
5300 3 -10 -13 1 -15 -6 -8 2 -6 0 -5 -1 -6 -2 7 -4 -4 2 -5 2 -6 2 -6 12 5 6 2 2 1 7 2 -1 1 -9 2 -11 -9 -2 -10 -5 4 -18 -7 -13 -7 -13 -4 -9 0 -11
5349 -11 0 -11 -4 1 -14 -4 -1 -1 5 6 9 5 7 11 -1 1 -2 3 0 0 -7 -5 -3 5 9 7 -7 -9 -5 -9 -9 -14 -14 0 -3 -15 -18 -8 -10 -5 -4 -14 -4 -3 1 6 0 2 1
5398 1 5 -2 17 11 8 2 2 8 6 7 5 5 4 3 -7 10 1 -5 -3 3 4 -6 -4 -3 -5 -9 -5 -4 -9 2 -8 -6 -5 -7 8 -4 -8 -9 -6 10 5 4 2 4 5 0 19 19 3 1
5448 1 -2 10 -4 1 8 7 7 5 4 2 -6 6 -3 4 -1 -13 -4 -8 -8 -11 -7 -8 -6 -9 -3 0 -2 1 -6 -5 4 2 -2 -6 2 3 -8 -1 7 9 1 9 -1 3 -12 4 8 -3 -14 -1
5498 -1 -15 -2 0 -9 -2 -6 -15 -10 -14 -13 -17 -14 -10 -11 -11 -6 -16 -4 -2 -7 -1 10 9 2 3 6 5 4 1 1 4 7 8 -1 1 1 -8 -1 -5 -3 -1 -9 -10 -6 -9 -5 -8 -16 -7 -18 2 -10 -8
5551 -8 -20 -2 -10 -5 -15 -4 0 -9 0 0 6 1 -3 10 -7 -6 -6 3 0 6 7 13 6 -7 -3 5 -2 1 -5 -2 0 3 -9 -18 -5 -6 -7 -5 -7 -2 -3 -15 -14 -14 -8 1 -1 -4 -8 -8 -5
5602 -5 -1 6 12 2 -8 7 2 9 0 4 -9 7 4 7 -1 -6 1 2 12 -4 4 -4 -6 -12 -15 -13 -2 -13 -7 -6 -10 -4 -13 -7 -7 -1 -15 -1 0 -4 4 9 -3 9 3 -1 6 12
$$ packed form
5251a1NMMLNj5JkrJ3j4RQj3kJ0JKPKj1%NOpM%NpoPMNj0RjPj3Lj0JjnJJ1j4LjJ0
5300Cj3lJ4j6RkJ0qOnMnMRj1%OpPqQqJ8pJm%jOnlKj0J1j3KPqNRk2J1oOoRnRj1
5349a1J1j1PNj5J0L%OJLmKMj2KlNl%pKKQMkj4kMm%n%J4lj2lJ0kNJj0J0JMNoKj
5398AMpJ9olo%OkJk%jjj0J7roKOJj0KJkmMJnJ1j0KJkJ5j2mjLJ6njkKJnJ9%j6k
5448AlJ2j4NPj%kjkqJ2rPnj2Rm%lMjKlOLkLpJRkmmQJj1PQKqQj0Mj5J6Mj1j1J3
5498aj4J3KrPmrNmJmLMj%Nj0J2KnOJ1jpJLjjl%LLJrK%rPmKKqjMlMlqRj1K0j2K
5551hj2J8qNj0J1MrR%OnmJ3j7J%RlOJOpj3MQpLoLKLj2rJ3jjKkNjj2J%ORklm%L
5602eMPOj0j0J5nPrMj3J6lLqnPJJ0j6QqkolKJ1j1OJmOrO%Oj4J4JmQNj2J2omPO
$$ plain form
5650 12 15 3 -1 7 15 -4 6 3 8 -1 0 1 1 5 -2 -6 -3 1 -5 -14 4 -4 -3 -5 3 4 -8 -5 -7 -5 -1 -5 2 8 -7 -1 -10 10 16 7 9 9 6 15 2 9 2 7 8 -7 9
5701 9 -1 -15 2 -4 -4 -11 0 1 -3 1 -11 -7 -10 -6 -4 4 -8 -3 -5 -7 1 6 -13 -2 2 -1 2 -4 10 2 7 12 8 -2 13 3 11 9 5 0 6 3 5 3 -2 13 3
5748 3 4 -1 -2 0 -8 -7 -13 -13 -10 -4 -1 -7 -6 -5 -2 -7 -9 -3 3 -1 1 -3 4 -1 -2 -4 -2 2 10 18 4 7 17 0 1 9 7 5 2 15 3 7 1 -6 -12 -7 -17 5 -1 -9 -10 4 -8
5801 -8 -8 4 -9 -1 2 1 -2 4 6 9 10 8 7 12 9 4 11 5 12 12 2 17 3 6 7 0 -4 6 5 8 -1 6 9 2 -3 3 -5 -7 -4 -11 -11 -1 -14 1 2 -10 0 -3 0 -3
5851 -3 -1 9 0 5 2 7 -1 4 -4 12 12 7 12 16 1 13 13 0 -2 10 -10 -6 0 -6 -8 -1 -4 0 5 -2 -11 -7 -11 -4 -9 5 2 -15 -4 -13 -11 3 0 -2 3 5 7 6 6 -3
5901 -3 7 8 12 8 8 8 2 4 2 13 1 6 4 -5 -9 1 -5 -1 6 -5 0 -4 -13 5 1 -14 1 0 -6 -1 -4 5 -6 1 3 10 7 9 18 1 -2 12 8 1 6 -7 9 -1
5949 -1 9 10 1 6 -1 -7 0 4 3 7 -6 -1 -4 -2 -8 0 -1 -7 -9 -8 -6 -6 -7 -3 -5 -6 5 7 -2 2 3 5 10 0 -2 14 6 1 -5 7 12 1 -7 1 4 -1 -6 0 0 -3 -4 -2 -7 -4
6003 -4 -9 4 -6 6 6 -1 1 0 6 0 2 4 1 -2 1 2 3 0 2 5 5 4 12 8 17 4 10 5 7 12 8 0 2 4 0 8 7 -5 -1 3 -16 3 0 -9 -8 -10 -5 -4 2 8 0 -5 13
$$ packed form
5650A2Lj2mQQj9J0lNrJJ%MpmLMorJ8qJkQJj2LkKMmPOj5OrK0OrK%lRj3PpNJj5J6
5701Ij0j4J7o%pJ1JmMj2MlMKQj2NkkQNj9J1MlLoJ4qNNmj0J5j0QkmnOlKknJ5j0
5748CJnjKqJo%LOLoJJLnkOOmKmPnjkKMQQj4LJ0j7JQkklJ3j2MopoNj0K2oqjJ4j2
5801h%J2j3QLjlOKLJkjNlnPoP%j0J5j4LJpmJ0jLrPLpnOqkLp%J0j3J5Jj2J0lLl
5851cKJ0rNlNqNqJ6%nNMj5J2%j3kJ2k0MOokPlMNprMmPnJ4lj7J1rKJ4lkNKKj%r
5901cJ0JMm%%oKkJ1j2NkrmJ0oMPj1NmrJ8mj5J5joNlRj1PKPlKRj7lJ4mpNj3J6j0
5949aJ0JrNpoPMjMj3NlKoQjokJK%jMkjJ1KrMJKNj0kJ6qnoJ2Nj1qQLnnO%ljKnL
6003dnJ3j0J2%pKjOoKKllLJJlKL%jQmRj3OnKNmqKKmQjj2MMj9J9lrJkNJOOqnJ8
$$ plain form
6056 13 8 2 5 -3 5 3 3 11 -4 13 -1 2 5 1 -9 2 0 10 1 -2 3 -2 15 -7 -4 -8 -15 0 -7 -5 -4 -13 -11 -8 -12 -8 -11 -9 -8 6 6 -4 -2 -9 3 4 -7
6103 -7 11 16 11 4 -1 9 8 4 13 11 -1 -1 3 -5 -8 7 4 0 -2 -1 -10 8 -5 -1 2 3 -1 -4 -11 -1 -3 -1 6 1 -10 -1 -7 5 2 1 1 2 3 1 -1 4 9 4 5 1 5 7
6155 7 8 0 -1 0 4 4 1 7 2 -7 -1 -3 -2 -5 0 -1 -4 -9 -6 0 -2 -2 -9 -7 -4 -9 -3 5 10 2 5 3 -2 -2 2 3 3 2 13 -6 7 12 8 14 -4 -4 10 -5 -5 0 -4 -4 -7 -2 -7
6210 -7 -8 -9 -6 -17 -10 -9 -6 -3 -20 -8 -19 -10 -1 -3 10 -6 -3 2 -10 -8 5 10 3 3 0 5 3 -10 -3 7 9 3 6 -2 -2 -10 -6 1 -10 -5 -9 -10 -15 -6 -8 2 -9 0
6258 0 -14 -5 -12 -10 -10 -16 0 -3 3 0 -1 2 8 14 6 6 3 17 5 1 16 0 -7 5 8 1 3 -6 -1 -8 -3 -13 -3 -2 -14 -16 -5 2 -14 -7 -11 0 -1 2 -1 -7 -1 4
6306 4 2 -2 -14 -4 4 -9 3 -4 6 5 -3 0 8 2 -3 3 4 -2 0 -4 0 0 5 -5 -7 -20 -19 -5 -9 -10 -10 -4 -8 -5 -7 -3 -12 -7 2 8 -5 4 -10 0 4 4 -3 6 2 -6
6356 -6 4 -2 3 3 -1 -7 -4 4 -3 3 -10 -5 3 -5 -5 -6 1 -20 -8 -5 -13 -20 -20 -9 -2 -10 -3 -6 -11 1 -6 -4 -5 -16 -6 3 -1 5 1 2 -3 3 9 -2 9 8 -2 -1 -3 6
6406 6 -4 -15 -2 5 -9 -5 -4 -2 -1 -1 -11 -15 -8 -4 -11 -10 -17 -1 -6 -5 -10 -2 3 -13 -4 -5 4 -4 -5 -5 2 -1 5 13 4 -4 1 -1 11 14 2 15 7 11 12 2 -3 1 -5 -7
$$ packed form
6056A3noLqQk%Qj5J7j4LLmj0J1kJ0rlNnJ7k2LmpJ5pKJrKLmMlKJJ4%j0KpJ2Jj1
6103gJ8NnpnJ0jmRkj2%MqlJ5lmkJrJ8j3MLJmlpJ0kKPnj1RoJ2lj%JJkkNNnJmMK
6155GJqjJM%lOnrOkJlNjlnLOk%pKLnOQNqLkn%MJ%jJ1j9J3NmOj8%J4j5%Nm%lNn
6210gjjLj1PJLLj7J2j1RRkJ3j6LNj2KJ3Np%lNkj3PJ0KoLq%qMPj1NmjnRkJ0j1R
6258@j4RpK%oJ6lOljLOOq%lJ4j2mJ5j6pJ2LpKrNpNj0J0Jj2kJ1Pj6PmJ1jLloON
6306Dkmj2J0Qj3J2pJ0jqLQonOJoKmM%Nj0kj3JJ4mj%OmLkMrNROj3Rj4J0M%pRmq
6356fJ0oN%moLQpOj3NQq%jPk1J2Lqp%J1PqPlnJ2pKjj1J0RmOmJnOOj1J1jj0JkR
6406Fj0j1J3Pj4MJKJ%j0mPMpJpJ6nJnQNj6RjRqj%PlOQrqNkJ2Lj2J3qMJj0nMok
$$ plain form
6456 -7 1 0 -7 -9 -10 -3 -10 3 -9 -16 -10 -11 -4 1 5 3 -1 1 -3 9 -1 7 4 0 0 5 3 9 12 8 14 8 6 -1 0 9 0 -5 -6 -11 -4 -6 -9 3 -6 -10 -1 -8 5 -7 -15 -7 -2 -7
6510 -7 3 0 3 0 -5 3 9 0 6 -2 4 1 6 7 4 -2 20 1 5 -3 9 -4 -2 -2 3 4 0 6 -5 -13 -23 -7 -5 -12 -12 -5 -2 -15 -12 -3 -8 -11 -2 -10 -8 -3 1 5 0 9 8 -2
6562 -2 5 8 2 10 7 -1 10 4 0 6 0 4 -1 -5 3 -4 -14 -5 -4 0 -10 3 -15 -12 -10 -12 -3 -10 -17 -7 -6 -5 -7 0 1 -7 -7 7 0 1 5 -4 -5 0 -5 1 9 -2 7 11 13 -7
6614 -7 5 -3 5 5 2 -4 -9 -10 -9 -8 -10 -9 -10 -4 -10 -1 -9 -10 -12 -20 -9 0 -10 -1 3 2 -3 2 -2 0 6 -5 0 12 4 4 -3 -3 5 7 1 3 -7 4 6 6 -11 -12 -6 -16 -8 -6
6666 -6 -11 -8 -8 -2 -10 -20 -5 -10 -4 -7 -3 6 -6 -3 -5 -2 -10 5 -2 0 12 4 17 8 5 10 3 2 -5 -3 0 5 -1 -5 5 -6 -7 -8 -6 -3 -4 -7 0 -7 -9 -5 0 0 -9 -3 -3 0 -1
6719 -1 -4 -3 -3 -1 -3 4 -1 2 4 1 4 -4 10 6 2 7 -2 1 1 10 -1 11 -3 1 3 -4 0 11 -6 -11 0 -3 -4 -1 -9 4 -5 1 3 -8 -2 7 -1 2 -2 7 -3 -2 14 7
6769 7 9 4 11 6 10 4 14 13 11 15 10 -1 1 -1 -2 -1 2 0 -14 -5 0 -12 -4 9 -11 -15 -15 -5 -26 -2 -4 -7 -11 0 6 -2 5 5 1 -2 -3 -2 -3 14 -3 4 1 3 7
6818 7 6 -8 11 2 -3 10 2 -13 -1 -7 -8 2 -9 -10 -1 -7 -17 -16 1 -19 -13 -8 -10 -6 -2 5 -3 2 -2 7 0 0 5 3 9 8 -1 -5 2 5 7 -4 6 3 -4 -1 -5 -2 -2
$$ packed form
6456gQjpkjPpJ3j2pOjPNMkmKmJ2j0Qlm%NkOLmOokpJRrnjnPklJ2rmRpJ3j2qQNn
6510gJ0lLlnQOrOqOlNJloK2j9MqJ2j3K%NJmOj1qj0J6Kp%PLj3LRnlRqKNMMnRjj0
6562bPLoQlqJ1omOoMnmQpj0RJMj0J3j8LKkRppJ0JJkPJq%J4pJMrjNnOQj1RMKk0
6614gJ2qQ%lonjJJkJjOoRqjkqJ1Rj0RMjnNmKOj1NJ2q%p%QKoKj0J1K%j7jOj0QK
6666fnL%Oqj0J5nOlMRj2LkLqJ5pKJ2qJ3rlNpjpKLNomJ0j1jjKLjlPpkMN%rO%Lj
6719alJ%KkPnLKlLqJ4mmNrL%Rj1J2j4MKpMJ1j7nJ1ljLqJ3rOKj1ORqLmRj0JJ6p
6769GKnPnMoJ0jkMnj1KkjJLkj4RNj2QJ3k0m%J0k1K4klmJ1OqP%mljJjJ7j7PlKM
6818Gjj4J9rnJ3qj5J2ojJ0j1jRoj0JJ7k0ONkMMPqNmRp%NkOjrmPLKj1J0lpLmL%
$$ plain form
6867 -2 -9 -4 0 -2 -5 -11 1 -7 -10 -21 -8 4 -9 -12 -8 -14 0 0 -14 -3 1 5 -8 4 -3 7 14 -6 8 5 4 8 9 -1 3 -2 4 5 1 12 -2 -1 5 2 -3
6912 -3 -4 -8 -4 -2 -6 -17 -13 -6 -9 -1 -8 -13 -2 11 -2 -8 1 -1 11 5 4 3 -6 1 10 11 10 4 6 -8 -3 3 10 -3 -2 -3 2 9 3 -5 -3 -6 1 -7 -9 2 -1 -9 -6 -13 -22 -19 -1
6965 -1 -6 0 11 -11 0 -6 -2 -2 -4 -5 -1 14 9 -1 2 3 -6 -4 1 6 -11 -5 3 7 -6 -2 3 -1 -5 -9 -18 0 -2 -2 -12 -10 -9 0 -4 -5 -3 4 -7 -4 1 2 7 0 -2 2 0
7016 0 -7 0 6 -4 -2 0 -5 2 1 14 1 1 5 5 4 3 -6 -3 -1 9 1 0 -7 1 -5 -14 -1 -2 -6 -6 -1 -6 -2 -9 8 6 -2 -6 -2 5 8 9 -2 -2 9 12 8 4 11 14 15 12 5
7069 5 7 6 7 9 4 3 3 3 -1 -1 -10 5 1 -4 -3 -11 -7 -16 -8 -10 0 13 3 7 -2 4 -2 6 2 9 10 0 -1 -2 14 16 9 6 -1 7 1 14 8 8 2 -11 3 4 2 0 2 -5
7121 -5 -5 0 1 -14 -4 -8 -2 2 -4 -4 -8 -1 4 -1 -4 -7 -4 14 0 0 1 1 10 -1 1 -6 4 -4 6 1 8 9 2 -1 -7 7 -7 -6 2 2 -6 -5 -6 3 -11 -9 -12 -2 -7 -3
7171 -3 -6 2 3 -4 -2 -4 2 6 11 -6 2 -2 -2 5 3 7 8 -3 0 -8 -7 -4 8 -1 9 -1 -4 4 -7 -3 -13 -3 -6 -4 -8 -5 -3 -1 5 -7 -1 -14 -7 -15 -6 -8 -13 -16 -3 -1
7221 -1 -7 0 -5 10 12 0 4 10 -1 -8 2 -3 1 0 0 -1 0 6 -5 -7 -6 -2 -6 -7 -7 -21 -16 -4 -10 -12 -3 -3 -2 1 -4 -5 -2 -13 5 -1 3 -1 -2 1 -8 7 3 4 2 3 2
$$ packed form
6867bpNMkloJ2qlj1J3J2j3lMoJ4%j4J1MMj3J2pJ0Pk0J4ljMJj0MnOJmJ1j4JOln
6912cjmMKmj1MPlQpnJ1J3j3oRkJ2ojjrPRJjoKj4NOPj3JjNPoqKlPqkJ1lqLprLJ8
6965anOJ1k2J1oM%kjMJ5nj0LJrKNNj7OQMj3MNmmmrJ8k%j0KJRmjKPj1LNJNpkMk
7016@pPOj0KKnPjJ3j3%M%jjrLKJ0qjpQorJ3jm%NnMpJ7kqmMPLJj1%J1LmmPLJlp
7069EKjJKnj%%m%rJ5mnJqMrQkJ0J3j0MrOoQmPJj0jjJ6KplpQoJ3o%oj3J4JkkKp
7121e%NJj5J0mOMo%mPNnllLJ8j4%J%Rj1KpJ0qJ0nPJploJ4j4JQ%qJjRj4KlJ0nM
7171clQJpKkOMNj7Qm%PkMJj1LqJLJ2rJ0j0lQj1Mj0J0lKmLKKOj2Oj3PqRknlJ3K
7221aoPnJ5Kj2MOj1pJ0nMj%jJOj1kJMmj%j4NJ2okR%JLnjLj1J8oMmjLrJ5mJkJj
$$ plain form
7272 2 -2 -7 1 -3 6 7 7 3 -8 -14 7 -6 -3 0 -3 -6 -10 -1 -8 -2 -4 0 -5 0 -7 -3 -5 2 4 -5 -9 -2 -6 -4 8 5 3 2 6 4 5 1 2 1 -8 -2 4 -7 -9 -5 -7 -5 -3 -6 -6 -11
7328 -11 -6 -6 -8 -9 -11 -19 -13 -7 -9 -7 -9 -8 -15 -10 -8 -9 -10 0 7 5 -8 6 1 -4 4 5 11 7 7 -9 -13 5 0 -6 5 -1 -9 2 3 1 -5 -2 -14 -6 -5 -8 -22 -8 -6 -16
7378 -16 -7 -11 -12 -6 5 -4 -4 -12 -7 -2 -3 -8 3 2 0 -1 4 5 1 -3 2 -8 -1 1 2 -2 -7 -1 -4 -5 -5 -5 -5 -3 -5 2 -14 -10 -9 -3 -6 -15 -5 -3 3 -7 -8 0 -9 -7 2 1 -3 5
7432 5 0 -3 6 0 7 3 7 -2 1 0 2 -4 -1 -4 -5 0 -4 0 -10 6 -4 -10 2 -5 -6 -3 -5 -9 -13 -8 4 -17 -13 0 2 -5 -8 -3 -2 0 1 5 2 5 -1 -9 2 -7 -2 7 -2 8
7484 8 1 -5 1 -15 -11 -6 -10 -4 -2 -6 8 -2 -6 -4 -12 -8 -16 -15 -6 2 2 -6 -11 -10 -3 -5 -2 11 1 -2 2 1 1 3 -2 -6 7 7 2 0 -7 6 9 4 10 -5 -2 -11 3 -9 -8
7535 -8 -5 -11 -9 -12 -12 -1 -15 -5 -3 -3 3 3 2 1 -6 5 -8 -8 3 1 -2 11 14 4 4 0 8 0 7 7 1 3 8 6 13 8 5 5 3 -9 -3 4 -2 -2 -5 -11 -7 -2 3 -5 -12 -8
7587 -8 -3 -5 -6 -10 -2 -4 -1 -5 11 3 2 4 2 -2 1 3 4 5 -2 7 -2 -1 -3 -3 1 -5 3 7 -4 -7 -14 -17 -12 -8 -5 1 -9 -9 -10 -12 -4 -2 -6 4 -1 -9 -7 -8 -5 2 -7 0 4 10 3 11 9
7644 9 5 11 2 -5 4 -12 -1 -9 3 0 -7 7 2 3 -6 -9 -8 -9 -5 -5 -15 -7 -8 -12 -5 -8 2 -9 -6 2 -3 -6 -7 -8 2 -11 6 -2 -3 -1 -4 -1 1 -2 3 9 8 10 -1 7
$$ packed form
7272BmnQmRJ%mj1oK1j3LLllmRpOkMnNpMkPKrmPmKJ2lkjMkJmJjrOOj1kMkKKl%n
7328a1N%kjkqOOkKkJpNKjjJ0Pkj3J4nnQJOm%j6mJ8noJ1oqJ1JkoLj2QJlj4J4Kj0
7378a6RmjOJ1r%qNNjnJ1jkjNJmmNj0PKJmnOlj%%%KkPj6MJOlrJ0KOj0jQrKRjmQ
7432EnlRoPmMrLjKoLljNmMj0J6j0oJ2pjLkmmNJ2k1MJ3KplNJKJMlLoqJ1rNRrJ0
7484HpoOj6MNmOKmJ4j0mKqMqJRQ%qnJPkLJ3j0lMj%KnmJ3%nkpJ3LnOj5LrJ4j2J
7535hLoKl%J1j4J0K%O%jjpJ1j3%J1klJ3Lj0%mQqP%oKNkPnl%kj2OPo%loMNNqpM
7587hNkjmQkLmJ6qjKkmLKJJpRrJk%MoQMj1lplNMLOj0%jkQKmJ0nqKjLPrPMOpQk
7644ImOrpRj6J1qJ2lpJ4nJrlJjM%j0QjmPlJ0j1LQnljjJ0j3J7qjKlLKlNOjKj1Q
$$ plain form
7694 7 -4 -4 8 1 -1 6 -4 -4 -9 -17 -7 -20 -9 -5 -3 -5 -17 -2 1 -3 -2 -9 2 -5 -3 1 5 8 10 6 4 8 -6 -4 4 -10 1 11 3 6 0 -3 -3 4 -7 -9 4
7741 4 5 3 -11 -5 -16 -5 -4 2 -17 -3 -14 -12 -8 0 -9 -7 0 -2 -6 -4 0 4 11 -7 5 4 2 2 -1 11 18 16 15 2 4 -4 -2 0 -2 1 -6 5 -1 2 6 -2 2 -3 -13
7790 -13 -10 -10 -2 2 -8 5 4 2 -3 -7 -10 3 5 12 4 8 7 4 3 -4 -6 4 9 -4 4 10 2 7 5 4 -6 -9 -2 -2 1 -4 -11 -12 -7 -3 -1 -12 -5 -15 -5 6 -9 -7 -1
7839 -1 -9 4 -4 -2 5 -5 11 12 9 -2 0 2 -5 9 -1 2 7 7 1 0 1 -1 1 2 0 2 -3 -14 -5 0 -5 -1 -21 -14 -8 -2 -4 -4 -11 -12 2 -4 -2 3 2 -4 -6 -3 9 5 8
7890 8 7 4 11 2 8 -4 -1 11 0 8 5 7 1 -1 -2 -3 7 2 -6 -9 2 3 -6 -10 -11 4 3 -7 -1 -1 3 -8 -4 1 -1 7 8 -4 5 4 10 8 5 12 15 2 7 10 -3 -9
7940 -9 8 -3 -2 12 5 -3 -3 -12 -11 -2 -11 -7 -15 -15 -4 4 -1 0 5 -8 -11 -7 -3 -1 1 2 -2 -5 10 8 -6 -8 7 3 -1 3 0 1 -2 5 9 -1 8 14 5 1 -2 1 2 3 7 0
7992 0 -5 -11 -12 -9 -1 -10 -6 -10 -14 -3 -6 1 4 -2 0 3 12 -4 0 7 7 -2 13 11 14 13 3 8 4 1 4 11 -3 12 2 3 -2 11 4 7 -6 -6 4 -3 -10 -15 0 -10 10
8041 10 -8 6 -5 -8 -6 0 -13 1 -9 -1 0 -4 3 8 3 1 3 1 3 3 8 2 11 8 4 2 0 3 7 0 2 -8 3 -3 -2 -13 -9 -6 -13 -4 -2 -6 -8 -5 -9 2 -1 5 1 -14
$$ packed form
7694Gj1%J2pkPj0%nqJ0j3J1MKkj2J5LmJpJ1pKMMLKmkMj4KQj4J1J0qLol%Pj1kJ3
7741DJkj4Oj1J1JOj9J4j1KMQrKPkmKMMPj8J2jk%lJ2Pkjj3KqKKkLpJ1oLMqMnj0
7790a3L%QMj0J3jknmlJ3KPqMjljpkJ0Nj3QOqNkjj0lP%LnpjNMKj1Pj0J0J1j5KO
7839aqJ3qKPj0J6Jlj1KKpJ4j0LN%ojJkKJkKnj1RNnMk0POOk%pjJ4oKNjokLJ2mL
7890HjlPrOj2LJ2j1QlKokjjJ0nqlJ1JrmjJ5jj0O%Mj1MNkQJj2RjOklPLj3NLj3o
7940iJ7j1JJ4pq%rJRrMq%J1QnJNj3lMMKKJmlJ5kj4kJ5mmMlJlPMj0ROrmlLJJMp
7992@nojLQrMmmJ1lPLoKLRj6MP%rJ5kLjj0NmlLPj4J5j0JnJ3pLj3%J0ppnJ5j0K0
8041A0j8J4j1lKOj3J4j0QJmPNnkKkK%NoRlmkkLMpKj0J1oJj1MLpRKmkLmJ1lOmj5
$$ plain form
8091 -14 -7 -7 10 3 8 9 4 7 10 4 14 5 2 -2 -4 12 8 -2 -4 -1 -1 -1 0 5 -1 -5 -9 -11 0 1 -5 -5 -1 -7 1 -4 -11 3 4 -4 -4 -4 2 11 5 -1 -3 7 -5 -2 2 0
8143 0 7 0 2 5 -1 5 7 0 -3 -2 5 -1 0 -13 -14 3 -7 -3 -5 5 -6 4 -12 -9 -3 -14 -6 -3 -8 0 -10 7 -2 0 7 -2 4 -2 14 0 7 6 0 3 3 4 -1 8
$$ packed form
8091a4P%J7pNJnLLoJ0rlmkJ6mj0kL%%JNommkJ1Jo%MoQnpJ4Jq%%ORookJ0j2LMk
8143@PpKLoOKplJPoJj3jJ7j0MkJ0j1J0j6LOj1QLnQj0J7rKPrOoJ6j4PjoL%JnR
8191H
##END NTUPLES=NMR FID
##END=
