##TITLE=1H_ES-AN-HMPTA
 
 8 sc, 
 13.04.2022
##JCAMPDX= 6.0         $$ Bruker NMR JCAMP-DX V2.0
##DATA TYPE= NMR FID
##DATA CLASS= NTUPLES
##ORIGIN= UXNMR, Bruker Analytische Messtechnik GmbH
##OWNER= root
$$ XWIN-NMR		Version 3.5
$$ Wed Apr 13 10:14:35 2022 Russian Standard Time (UT+4h)  she@DPX200
##.OBSERVE FREQUENCY= 200.13135
##.OBSERVE NUCLEUS= ^1H
##.DELAY= (6, 6)
##.ACQUISITION MODE= SIMULTANEOUS
##.ACQUISITION SCHEME= undefined
##.AVERAGES= 8
##.DIGITISER RES= 18
##SPECTROMETER/DATA SYSTEM= spect
##.PULSE SEQUENCE= zg30
##.SOLVENT NAME= CDCl3
##.SHIFT REFERENCE= (INTERNAL, CDCl3, 0, 15.7039)
##AUDIT TRAIL= $$ (NUMBER, WHEN, WHO, WHERE, WHAT)
$$ ##TITLE= Audit trail, XWIN-NMR		Version 3.5
$$ ##JCAMPDX= 5.01
$$ ##ORIGIN= Bruker BioSpin GmbH
$$ ##OWNER= she
$$ F:/spectra/data/she/nmr/H-F/1/audita.txt
$$ ##AUDIT TRAIL=  $$ (NUMBER, WHEN, WHO, WHERE, WHAT)
(   1,<2022-04-13 10:12:10.00 +0400>,<she>,<DPX200>,
      <created by zg, POWCHK disabled, PULCHK disabled
       configuration hash MD5:
       00 E9 B6 7A A2 85 ED C7 34 08 36 98 17 FE 4E 26
       data hash MD5: 16K
       80 FF EE 9F F8 64 D6 D3 5B 80 E6 AA 78 E0 00 FD>)
$$ ##END=
$$ 
$$ hash MD5
$$ DB E6 E7 7D 2B B2 EC F7 94 B3 C9 69 A3 7C EB 7A
##$RELAX= 
##$RELAX= 
##$RELAX= 
##$RELAX= 
##$RELAX= 
##$RELAX= 
$$ Bruker specific parameters
$$ --------------------------
##$DU= <F:/spectra>
##$EXPNO= 1
##$NAME= <H-F>
##$PROCNO= 1
##$TYPE= <nmr>
##$USER= <she>
##$AMP= (0..31)
100 100 100 100 100 100 100 100 100 100 100 100 100 100 100 100 100 100 
100 100 100 100 100 100 100 100 100 100 100 100 100 100 
##$AQSEQ= 0
##$AQ_mod= 1
##$AUNM= <au_zg>
##$AUTOPOS= <>
##$BF1= 200.13
##$BF2= 200.13
##$BF3= 200.13
##$BF4= 200.13
##$BF5= 200.13
##$BF6= 200.13
##$BF7= 200.13
##$BF8= 200.13
##$BYTORDA= 1
##$CFDGTYP= 0
##$CFRGTYP= 5
##$CHEMSTR= <none>
##$CNST= (0..31)
1 1 145 1 1 1 1 1 1 1 1 1 1 1 1 1 1 1 1 1 1 1 1 1 1 1 1 1 1 1 1 1 
##$CPDPRG= <>
##$CPDPRG1= <>
##$CPDPRG2= <>
##$CPDPRG3= <>
##$CPDPRG4= <mlev>
##$CPDPRG5= <mlev>
##$CPDPRG6= <mlev>
##$CPDPRG7= <mlev>
##$CPDPRG8= <mlev>
##$CPDPRGB= <>
##$CPDPRGT= <>
##$D= (0..31)
0 1.2 0 0 0 0 0 0 0 0.06 0 0.03 0 0 0 0 0.0002 0 0 0 0 0 0 0 0 0 0 0 0 
0 0 0 
##$DATE= 1649830329
##$DBL= (0..7)
120 120 120 120 120 120 120 120 
##$DBP= (0..7)
150 150 150 150 150 150 150 150 
##$DBP07= 0
##$DBPNAM0= <>
##$DBPNAM1= <>
##$DBPNAM2= <>
##$DBPNAM3= <>
##$DBPNAM4= <>
##$DBPNAM5= <>
##$DBPNAM6= <>
##$DBPNAM7= <>
##$DBPOAL= (0..7)
0.5 0.5 0.5 0.5 0.5 0.5 0.5 0.5 
##$DBPOFFS= (0..7)
0 0 0 0 0 0 0 0 
##$DE= 6
##$DECBNUC= <off>
##$DECIM= 32
##$DECNUC= <off>
##$DECSTAT= 4
##$DIGMOD= 1
##$DIGTYP= 9
##$DL= (0..7)
0 120 120 120 120 120 120 120 
##$DP= (0..7)
150 150 150 150 150 150 150 150 
##$DP07= 0
##$DPNAME0= <>
##$DPNAME1= <>
##$DPNAME2= <>
##$DPNAME3= <>
##$DPNAME4= <>
##$DPNAME5= <>
##$DPNAME6= <>
##$DPNAME7= <>
##$DPOAL= (0..7)
0.5 0.5 0.5 0.5 0.5 0.5 0.5 0.5 
##$DPOFFS= (0..7)
0 0 0 0 0 0 0 0 
##$DQDMODE= 0
##$DR= 18
##$DS= 0
##$DSLIST= <SSSSSSSSSSSSSSS>
$$ [...]
##$SUBNAM2= <"">
##$SUBNAM3= <"">
##$SUBNAM4= <"">
##$SUBNAM5= <"">
##$SUBNAM6= <"">
##$SUBNAM7= <"">
##$SUBNAM8= <"">
##$SUBNAM9= <"">
##$SW= 18.05172834244
##$SWIBOX= (0..15)
0 0 2 0 0 0 0 0 0 0 0 0 0 0 0 0 
##$SW_h= 3612.71676300578
##$TD= 16384
##$TD0= 1
##$TE= 0
##$TE2= 300
##$TE3= 300
##$TEG= 300
##$TL= (0..7)
0 120 120 120 120 120 120 120 
##$TP= (0..7)
150 150 150 150 150 150 150 150 
##$TP07= 0
##$TPNAME0= <>
##$TPNAME1= <>
##$TPNAME2= <>
##$TPNAME3= <>
##$TPNAME4= <>
##$TPNAME5= <>
##$TPNAME6= <>
##$TPNAME7= <>
##$TPOAL= (0..7)
0.5 0.5 0.5 0.5 0.5 0.5 0.5 0.5 
##$TPOFFS= (0..7)
0 0 0 0 0 0 0 0 
##$TUNHIN= 0
##$TUNHOUT= 0
##$TUNXOUT= 0
##$USERA1= <user>
##$USERA2= <user>
##$USERA3= <user>
##$USERA4= <user>
##$USERA5= <user>
##$V9= 5
##$VALIST= <valist>
##$VCLIST= <CCCCCCCCCCCCCCC>
##$VD= 0
##$VDLIST= <DDDDDDDDDDDDDDD>
##$VPLIST= <PPPPPPPPPPPPPPP>
##$VTLIST= <TTTTTTTTTTTTTTT>
##$WBST= 1024
##$WBSW= 4
##$XGAIN= (0..3)
0 0 0 0 
##$XL= 0
##$YL= 0
##$YMAX_a= 293290
##$YMIN_a= -303377
##$ZGOPTNS= <>
##$ZL1= 120
##$ZL2= 120
##$ZL3= 120
##$ZL4= 120
##$ABSF1= 10
##$ABSF2= 0
##$ABSG= 5
##$ABSL= 3
##$ALPHA= 0
##$AQORDER= 0
##$ASSFAC= 0
##$ASSFACI= 0
##$ASSFACX= 0
##$ASSWID= 0
##$AUNMP= <proc_1d>
##$AZFE= 0.1
##$AZFW= 0.1
##$BCFW= 1
##$BC_mod= 2
##$BYTORDP= 1
##$COROFFS= 0
##$CY= 11.3945322036743
##$DATMOD= 1
##$DC= 2
##$DFILT= <>
##$DTYPP= 0
##$F1P= 2.36226072786647
##$F2P= -0.459571619588291
##$FCOR= 0.5
##$FTSIZE= 0
##$FT_mod= 4
##$GAMMA= 1
##$GB= 0.15
##$INTBC= 1
##$INTSCL= 1
##$ISEN= 128
##$LB= 0.24
##$LEV0= 0
##$LPBIN= 0
##$MAXI= 10000
##$MC2= 0
##$MEAN= 0
##$ME_mod= 0
##$MI= 1.114404
##$NCOEF= 0
##$NC_proc= 0
##$NLEV= 6
##$NOISF1= 3.799351
##$NOISF2= 2.8
##$NSP= 1
##$NTH_PI= 0
##$NZP= 0
##$OFFSET= 15.70392
##$PC= 1
##$PHC0= -18477.88
##$PHC1= 22.20078
##$PH_mod= 1
##$PKNL= yes
##$PPARMOD= 0
##$PSCAL= 0
##$PSIGN= 0
##$REVERSE= no
##$SF= 200.130013532006
##$SI= 16384
##$SIGF1= 3
##$SIGF2= 2
##$SINO= 400
##$SIOLD= 16384
##$SREGLST= <1H.CDCl3>
##$SSB= 0
##$STSI= 0
##$STSR= 0
##$SW_p= 3612.71676300578
##$SYMM= 0
##$S_DEV= 0
##$TDeff= 0
##$TDoff= 0
##$TI= <>
##$TILT= no
##$TM1= 0
##$TM2= 0
##$TOPLEV= 0
##$USERP1= <user>
##$USERP2= <user>
##$USERP3= <user>
##$USERP4= <user>
##$USERP5= <user>
##$WDW= 1
##$XDIM= 8192
##$YMAX_p= 0
##$YMIN_p= 0
$$ End of Bruker specific parameters
$$ ---------------------------------
##NTUPLES= NMR FID
##VAR_NAME=  TIME,          FID/REAL,        FID/IMAG
##SYMBOL=    X,             R,               I
##VAR_TYPE=  INDEPENDENT,   DEPENDENT,       DEPENDENT
##VAR_FORM=  AFFN,          ASDF,            ASDF
##VAR_DIM=   8192,          8192,            8192
##UNITS=     SECONDS,       ARBITRARY UNITS, ARBITRARY UNITS
##FACTOR=    0.0002768,     1,               1
##FIRST=     0,             0,               0
##LAST=      2.2672688,     0,               0
##MIN=       0,             -303377,         0
##MAX=       2.2672688,     293290,          0
$$ Real data points
##PAGE= N=1
##DATA TABLE= (X++(R..R)), XYDATA
$$ [...]
$$ plain form
202 26951 9552 -28750 1079 26718 -10619 -21872 17382 14432 -21363 -5943 22298 -2151
214 -2151 -20099 9170 15776 -13836 -9667 16240 3116 -16298 2691 13859 -7438 -10046 10152
227 10152 5263 -11030 -664 10128 -2907 -7524 5446 4406 -6259 -1111 5615 -1576 -3915
240 -3915 2992 1322 -3421 981 2374 -2825 -360 3667 -1977 -3040 4457 1468 -5967 1271 6443
255 6443 -4473 -5606 7375 3125 -9776 284 10620 -4614 -9931 8983 7540 -12485 -3275
268 -3275 14874 -1916 -15180 7740 13362 -13265 -9499 17393 3536 -19839 3352 19609 -10637
281 -10637 -16745 17207 11454 -21942 -3968 24395 -4461 -23709 13023 19894 -20597 -13405 25852
294 25852 4593 -28351 5142 27299 -14838 -22757 23293 15321 -29089 -5377 31782 -5515
$$ packed form
202B6951j7399l8302K9829K5639l7337j1253L9254k950l5795J5420K8241k4449
214b151j7948K9269O606k9612M169K5907j3124j9414J8989J1168k1297k608K0198
227A0152m889j6293J0366J0792j3035m617J2970j040j0665N148O726p191k339
240c915O907j670m743M402J393n199K465M027n644j063P497k989p435P238N172
255F443j0916j133J2981m250j2901J0060J0336j5234n317J8914j443k0025R210
268c275J8149j6790j3264K2920N622k6627L766K6892j3857k3375K3191J6257l0246
281a0637o108L3952n753l3396J7974K8363k8856j9248L6732O871m0491P192L9257
294B5852k1259l2944L3493K2157m2137p919M6050p972m4410K3712L7159l7297
$$ plain form
306 -5515 -30547 16268 25477 -25619 -17225 32040 6306 -35014 5696 33708 -17534 -28206 27795
319 27795 19172 -34862 -7277 38107 -5796 -36736 18599 30766 -29669 -21040 37266 8292
331 8292 -40692 5644 39193 -19231 -32838 30847 22554 -38758 -9240 42270 -5241 -40657
343 -40657 19228 34139 -31142 -23606 39273 10080 -42882 4638 41367 -18808 -34858 30944
355 30944 24365 -39284 -10790 43116 -4033 -41822 18418 35462 -30825 -25026 39457 11371
367 11371 -43574 3635 42471 -18314 -36207 30997 25669 -39915 -11854 44156 -3407 -43110
379 -43110 18296 36750 -31142 -26091 40100 12147 -44286 3199 43139 -18001 -36675 30718
391 30718 26044 -39452 -12227 43477 -2826 -42260 17284 35886 -29615 -25518 38058 12136
$$ packed form
306e515k5032M6815R209n1096Q394M9265k5734m1320M0710K8012n1242j0672N6001
319B7795q623n4034K7585M5384m3903l0940N5335J2167o0435Q629N8306k8974
331H292m8984M6336L3549n8424j3607O3685q293o1312K9518N1510m7511l5416
343d0657N9885J4911o5281P536O2879k9193n2962M7520L6729o0175j6050O5802
355C0944o579o3649K8494N3906m7149l7789O0240J7044o6287N799O4483k8086
367A1371n4945M7209L8836o0785j7893O7204n328o5584K8061N6010m7563l9703
379d3110O1406J8454o7892N051O6191k7953n6433M7485L9940o1140j8674O7393
391C0718m674o5496K7225N5704m6303l9434N9544J8602o5501M097O3576k5922
$$ plain form
403 12136 -41958 2435 40813 -16403 -34735 28346 24757 -36628 -11894 40479 -2224 -39541
415 -39541 15804 33737 -27524 -24114 35702 11574 -39596 2260 38726 -15641 -33061 27207
427 27207 23574 -35270 -11189 39041 -2479 -38101 15655 32404 -26917 -22934 34702 10762
439 10762 -38176 2619 37057 -15327 -31352 26125 22074 -33448 -10285 36583 -2534 -35388
451 -35388 14607 29818 -24802 -20990 31671 9801 -34632 2297 33491 -13723 -28282 23377
463 23377 19960 -29966 -9419 32884 -2088 -31912 13011 27078 -22303 -19167 28745 9104
475 9104 -31627 1995 30811 -12548 -26165 21568 18531 -27807 -8800 30577 -1907 -29722
487 -29722 12070 25186 -20689 -17794 26567 8447 -29079 1715 28136 -11282 -23794 19280
$$ packed form
403A2136n4094M4393L8378n7216j8332O3081l589o1385K4734N2373m2703l7317
415c9541N5345J7933o1261L410N9816k4128n1170M1856L6466n4367j7420O0268
427B7207l633n8844K4081N0230m1520l5622N3756J6749n9321L983N7636k3940
439A0762m8938M0795L4438n2384j6025N7477m051n5522K3163M6868l9117l2854
451c5388M9995J5211n4620L812N2661k1870m4433L6929L1194m7214j4559N1659
463B3377l417m9926K0547M2303l4972k9824M4923J4067m9381L136M7912j9641
475I104m0731L3622K8816m3359j3617M7733l037m6338J9007L9377l2484k7815
487b9722M1792J3116m5875K895M4361j8120l7526L0794K6421l9418j2512M3074
$$ plain form
499 19280 16773 -24719 -8057 26946 -1393 -26014 10189 21972 -17505 -15537 22471 7592
511 7592 -24542 1032 23778 -9053 -20137 15804 14337 -20434 -7097 22440 -786 -21830
523 -21830 8215 18595 -14510 -13311 18862 6626 -20789 699 20267 -7613 -17279 13438
535 13438 12349 -17501 -6162 19251 -637 -18719 6977 15884 -12281 -11335 15881 5691 -17370
548 -17370 442 16818 -6097 -14225 10775 10118 -13877 -5132 15112 -196 -14567 5071 12324
561 12324 -9056 -8791 11741 4555 -12755 -10 12304 -4102 -10420 7470 7490 -9767 -3929 10654
575 10654 84 -10315 3384 8699 -6226 -6230 8139 3247 -8860 -36 8525 -2867 -7156 5176
589 5176 5027 -6682 -2541 7148 -89 -6780 2383 5595 -4133 -3783 5226 1828 -5419 218 5012
$$ packed form
499A9280k507m1492J6662L5003k8339k4621L6203J1783l9477J968L8008j4879
511G592l2134K5574K2746l2831j1084L5941j467l4771J3337K9537k3226k1044
523b1830L0045J0380l3105J199L2173j2236k7415K1488J9568k7880r666L0717
535A3438j089k9850J1339K5413j9888j8082K5696Q907k8165R46K7216j0190k3061
548a7370J7812J6376k2915q128K5000o57k3995Q745K0244j5308j4371J9638P253
561A2324k1380K65K0532p186j7310J2745J2314j6406o318J7890K0j7257N838J4583
575A0654j0570j0399J3699N315j4925mJ4369m892j2107Q824Q561j1392m289J2332
589E176j49j1709M141R689p237o691R163L212r728L50R009l398p247N637M794
$$ plain form
604 5012 -1858 -3970 3058 2574 -3697 -1147 3701 -274 -3266 1329 2426 -1994 -1417 2245 470 -2048
620 -2048 348 1607 -864 -1001 1024 323 -968 116 557 -435 -142 432 -314 -164 649 -236 -709 814
638 814 541 -1278 -41 1573 -672 -1619 1391 1267 -2145 -616 2649 -314 -2790 1470 2567 -2514
654 -2514 -1804 3425 698 -3923 661 3905 -2172 -3435 3485 2325 -4547 -846 5044 -925 -4960
669 -4960 2738 4221 -4312 -2834 5517 1011 -6084 1084 5880 -3227 -4997 5053 3332 -6423 -1197
684 -1197 7046 -1248 -6778 3717 5702 -5784 -3789 7310 1332 -7972 1443 7653 -4218 -6409
698 -6409 6521 4203 -8171 -1448 8836 -1614 -8429 4623 6991 -7114 -4592 8827 1569
711 1569 -9517 1685 8984 -4890 -7442 7463 4892 -9262 -1727 9952 -1679 -9424 4997
$$ packed form
604E012o870k112P028m84o271K550M848l975k992M595J097m420N77L662j775k518
620b048K396J259k471j37K025p01j291J084M41r92K93N74p46J50Q13q85m73J523
638H14k73j819J237J614k245r47L010j24l412J529L265k963k476M260J097n081
654b514P10N229k727m621M584L244o077j263O920j160o872L701N890n969m035
669d960P698J483q533J478Q351m506p095P168M796r107j770J0050j721r755N226
684a197Q243q294n530J0495J985j1486J995J1099n978r304R415O210j1871k191
698f409J2930k318j2374O723J0284j0450o815J3052K368j4105K522J3419p258
711A569j1086J1202P299j3874k552J4905k571j4154P535J1679j1631p745J4421
$$ plain form
724 4997 7800 -7688 -5172 9560 1909 -10301 1636 9804 -5086 -8155 7947 5437 -9936
737 -9936 -2036 10746 -1667 -10250 5285 8543 -8292 -5710 10374 2133 -11235 1729 10688
750 10688 -5533 -8893 8611 5924 -10743 -2226 11564 -1764 -10976 5604 9087 -8721 -6065
763 -6065 10821 2339 -11630 1654 11013 -5461 -9125 8570 6141 -10634 -2444 11475 -1452
776 -1452 -10870 5235 9065 -8304 -6161 10413 2532 -11275 1317 10754 -5082 -9039 8175
789 8175 6169 -10318 -2587 11242 -1304 -10773 5076 9033 -8222 -6188 10364 2555 -11301
802 -11301 1332 10788 -5118 -9026 8235 6147 -10336 -2522 11212 -1317 -10638 5022 8864
815 8864 -8027 -6039 10033 2511 -10824 1182 10267 -4732 -8562 7598 5866 -9503 -2528
$$ packed form
724D997K803j5488K516J4732p651j2210J1937Q168j4890l069J6102k510j5373
737i936P900J2782j2413q583J5535L258j6835K582J6084q241j3368J2964Q959
750A0688j6221l360J7504k687j6667Q517J3790j3328r212J6580L483j7808K656
763f065J6886q482j3969J3284R359j6474l664J7695k429j6775Q190J3919j2927
776a452r418J6105L830j7369K143J6574p881j3807J2592R437j5836l957J7214
789H175k006j6487P731J3829j2546r469J5849L957j7255K034J6552p809j3856
802a1301J2633R456j5906l908J7261k088j6483P814J3734j2529r321J5660L842
815H864j6891J988J6072p522j3335J2006R085j4999l830J6160j732j5369O975
$$ plain form
828 -2528 10283 -1008 -9802 4378 8202 -7152 -5673 9002 2460 -9818 904 9371 -4178
841 -4178 -7875 6877 5448 -8723 -2362 9518 -918 -9108 4124 7635 -6770 -5245 8540
854 8540 2214 -9285 1008 8854 -4097 -7373 6637 5016 -8294 -2064 8953 -1020 -8475 3932
868 3932 7029 -6301 -4782 7806 1998 -8414 860 7930 -3585 -6599 5765 4514 -7196 -1970
882 -1970 7741 -684 -7363 3197 6148 -5257 -4271 6597 1910 -7175 564 6865 -2922 -5743 4882
897 4882 4027 -6152 -1793 6744 -524 -6453 2753 5414 -4606 -3760 5813 1655 -6339 523 6022
912 6022 -2613 -5030 4289 3475 -5396 -1535 5819 -491 -5529 2351 4561 -3878 -3162 4811 1390 -5210
928 -5210 375 4896 -2040 -4080 3360 2825 -4197 -1293 4545 -253 -4298 1731 3592 -2894 -2522 3652
$$ packed form
828b528J2811j1291q794J4180L824j5354J479J4675o542j2278J0722Q467j3549
841d178l697J4752j429j4171O361J1880j0436q190J3232L511j4405J525J3785
854H540o326j1499J0293P846j2951l276J4010j621j3310O230J1017r973p455J2407
868C932L097j3330J519J2588n808j0412R274P070j1515l014J2364j251j1710N226
882a970R711q425o679J0560K951j1405R86J0868m687r085P739O301r787k821J0625
897D882q55j0179M359Q537p268n929R206K661j0020Q46R573m158p994O862N499
912F022q635k417R319q14q871L861P354o310n038P880K210q439P16P973l421o600
928e210N585M521o936k040P440n35p022K904N838m798m045O029J861o486L72O174
$$ plain form
944 3652 1182 -3975 199 3792 -1480 -3171 2554 2250 -3229 -1053 3523 -177 -3354 1303 2777
959 2777 -2246 -1964 2792 905 -3025 148 2851 -1115 -2355 1879 1635 -2338 -755 2484 -115 -2329
975 -2329 873 1878 -1476 -1296 1793 606 -1901 67 1754 -621 -1381 1055 956 -1262 -429 1323
991 1323 -45 -1199 425 909 -728 -605 812 240 -819 54 695 -285 -481 427 270 -446 -50 366
1009 366 -121 -258 171 83 -208 37 110 -139 25 158 -158 -69 292 -42 -313 247 304 -422 -172 557 -43
1030 -43 -638 288 572 -574 -432 799 178 -931 171 955 -519 -805 866 549 -1147 -192 1253 -291
1048 -291 -1262 726 1021 -1168 -663 1464 178 -1589 407 1543 -951 -1247 1474 772 -1804 -166
1064 -166 1922 -538 -1826 1188 1456 -1752 -879 2149 165 -2244 662 2111 -1388 -1649 2017 987
$$ packed form
944C652k470n157M174L593n272j691N725l04n479K176M576l700l177M657J474
959B777n023K82M756j887l930L173K703l966j240M234k44l973J583L239k599k214
975b329L202J005l354J80L089j187k507J968J687k375p60K436r9k218Q33J752
991A323j368j154J624M84j637J23J417n72j059Q73O41r80j96R08j57p16L96M16
1009C66m87j37M29q8k91K45P3k49J64J33l16Q9L61l34k71N60N7p26K50P29o00
1030d3n95R26K84j146J42J231o21j109J102P84j474k86J671l17j696R55J445j544
1048b91r71J988K95k189N05K127j286j767J996J136k494k96K721p02k576J638
1064a66K088k460j288L014K68l208Q73L028j984k409K906J449l499k61L666j030
$$ plain form
1080 987 -2412 -183 2511 -728 -2341 1521 1811 -2195 -1090 2609 210 -2718 745 2507 -1602
1095 -1602 -1984 2317 1190 -2779 -246 2875 -765 -2668 1698 2106 -2459 -1258 2962 264 -3062
1110 -3062 840 2849 -1841 -2223 2668 1306 -3185 -224 3291 -946 -3021 2021 2349 -2873 -1358
1125 -1358 3385 195 -3481 1029 3163 -2135 -2452 2993 1402 -3538 -222 3599 -1049 -3272 2167
1140 2167 2529 -3041 -1487 3574 269 -3655 1001 3321 -2136 -2603 3029 1554 -3585 -346 3704
1155 3704 -951 -3389 2131 2688 -3040 -1602 3632 396 -3762 944 3474 -2147 -2743 3103 1650
1170 1650 -3704 -398 3839 -960 -3541 2165 2783 -3141 -1698 3739 418 -3872 934 3559 -2141
1185 -2141 -2804 3080 1735 -3679 -472 3796 -834 -3510 2018 2801 -2936 -1759 3542 577 -3681
$$ packed form
1080I87l399K229K694l239j613L862K90m006J105L699k399k928L463J762m109
1095a602l82M301j127l969K533L121l640j903M366M08m565J201M220k698l326
1110c062L902K009m690l82M891j362m491K961L515m237k075N042L28n222J515
1125a358M743l190l676M510K134n298l17N445j591m940L316L821m648k223N439
1140B167L62n570J554N061l305l924M656K320n457m67N632j475n139L239M050
1155C704m655k438N520N57n728J438N234l236m158M706K530n621n96N846j453
1170A650n354L306M237m799k581N706O18n924J443N437l321m290M806K625n700
1185b141o63N884j345n414L207M268m630k676N528P83n737J177N301k965m258
$$ plain form
1200 -3681 713 3431 -1855 -2759 2769 1776 -3383 -624 3553 -606 -3339 1750 2710 -2677 -1778 3280
1216 3280 622 -3485 573 3258 -1730 -2663 2614 1710 -3237 -614 3412 -591 -3182 1698 2580 -2571
1232 -2571 -1655 3138 570 -3298 569 3060 -1630 -2474 2446 1596 -2962 -576 3113 -501 -2880 1488
1248 1488 2344 -2244 -1540 2740 581 -2897 411 2687 -1349 -2221 2052 1455 -2556 -595 2686 -380
1264 -380 -2550 1229 2062 -1943 -1379 2399 519 -2554 374 2388 -1220 -1950 1870 1257 -2297 -445
1280 -445 2436 -395 -2255 1179 1831 -1783 -1167 2168 408 -2284 381 2092 -1106 -1688 1630 1078
1296 1078 -1990 -404 2060 -316 -1908 971 1540 -1453 -1006 1768 392 -1858 244 1710 -826
1311 -826 -1404 1276 925 -1565 -360 1666 -198 -1547 735 1274 -1143 -831 1428 333 -1499 189
$$ packed form
1200c681M394K718n286r04N528r93n159K759M177m159k733N089R60n387Q99N058
1216C280k658m107M058K685m988r33N277r04m947K623M026m003k591M880Q82n151
1232b571R16M793k568l868L867K491m690q44M920q50m558K386L689l614k379M368
1248A488Q56m588P04M280k159l478L308K276m036q72M273n97m011J961L281l066
1264c80k170L779Q33m005N64L778j880l073K928K014l608p30L820o13l554J852
1280d45K881k831j860L434O52l614O16L335j760k692K665J711l198n82L318n52
1296A078l068J586K464k376j592K879N69k993M47K774j376k250K102J466k536
1311h26n78K680l51k490J205K026j864j349K282N39k417L12K259j095j832J688
$$ plain form
1327 189 1401 -665 -1139 1054 745 -1274 -282 1352 -188 -1235 610 1003 -925 -657 1106 239 -1174
1344 -1174 136 1058 -514 -861 759 566 -926 -233 972 -91 -867 399 708 -585 -470 725 213
1361 213 -759 50 698 -267 -572 432 393 -540 -185 574 -4 -520 193 435 -303 -283 378 139 -406 -14
1381 -14 336 -116 -289 177 186 -219 -100 222 25 -182 46 140 -64 -86 45 27 -50 -28 8 34 17 -55 -12 107
1405 107 30 -123 31 174 -83 -153 171 139 -228 -82 280 -15 -317 126 302 -247 -246 343 130 -416 -1 452
1427 452 -148 -413 313 326 -453 -209 535 -2 -576 178 520 -385 -419 540 243 -652 -6 699 -226 -623 454
1448 454 495 -642 -270 751 17 -791 261 726 -501 -540 724 329 -845 -26 867 -254 -794 532
1466 532 598 -776 -385 897 48 -950 258 856 -570 -678 818 395 -978 -74 1017 -289 -927 606
$$ packed form
1327A89J212k066m74K193l09k019R92J634j540j047J845L93j928K68J763q67j413
1344a174J310R22j572l47J620j93j492O93J205j063p76J266L09j293J15J195n12
1361B13r72Q09O48r65l05J004l9r33L55P59n78n16P13K42p38K0O61k39n45L92
1381a4L50m52j73M66Rm05J19L22j97k07K28R4k04k2J31j8p7K2L6K6j7p2M3J19
1405A07p7j53J54J43k57p0L24l2l67J46L62k95l02M43J76n49JN89k13n46M15M53
1427D52o00k65P26J3p79K44P44n37n74P54L42r05l4R59k97q95O46P05r25l97J077
1448D54M1j137L72J021p34q08J052M65j227l9J264l95j174Q19Q93j121n40J326
1466E32O6j374L91J282q49r98J208N98j426j08J496m23j373R04J091j306o38J533
$$ plain form
1484 606 727 -890 -414 1044 65 -1074 322 983 -652 -749 936 438 -1098 -55 1140 -330 -1014
1501 -1014 705 772 -979 -454 1133 56 -1166 343 1038 -696 -798 977 453 -1150 -76 1159
1517 1159 -339 -1064 698 812 -1003 -475 1147 64 -1182 340 1068 -705 -816 1006 478 -1174
1533 -1174 -47 1201 -377 -1089 758 813 -1062 -446 1230 19 -1242 432 1103 -820 -811 1122 433
1550 433 -1279 5 1265 -463 -1119 838 801 -1147 -439 1275 -19 -1290 449 1129 -840 -831 1121
1567 1121 444 -1278 -14 1277 -432 -1137 814 852 -1090 -464 1262 32 -1263 416 1130 -786
1583 -786 -833 1096 478 -1253 -29 1267 -406 -1125 785 833 -1091 -466 1243 17 -1249 397 1100
1600 1100 -800 -830 1080 429 -1228 -31 1224 -409 -1100 764 803 -1047 -454 1185 36 -1192 369
$$ packed form
1484F06J21j617M76J458r79j139J396O61j635r7J685m98j536J043J195j470o84
1501a014J719O7j751N25J587j077j222J509O95j734j02J775n24j603J074J235
1517A159j498p25J762J14j815N28J622j083j246J522P28j773j11J822n28j652
1533a174J127J248j578p12J847N5j875O16J676j211j261J674O71j923RJ933o89
1550D33j712J284J260j728o56J957l7j948P08J714j294j271J739O80j969RJ952
1567A121o77j722J264J291j709p05J951L8j942O26J726j230j295J679P14j916
1583g86m7J929o18j731J224J296j673p19J910M8j924O25J709j226j266J646P03
1600A100j900l0J910o51j657J197J255j633o91J864L9j850N93J639j149j228J561
$$ plain form
1617 369 1059 -717 -798 990 469 -1131 -66 1141 -314 -1022 657 791 -920 -476 1067 108 -1084
1634 -1084 276 991 -607 -766 867 447 -1020 -108 1031 -276 -946 577 717 -845 -445 968 76
1651 76 -994 260 898 -553 -692 786 403 -925 -77 937 -237 -834 522 634 -716 -378 841
1668 841 89 -862 197 770 -467 -600 653 361 -761 -103 765 -169 -703 385 542 -588 -338 677
1686 677 85 -695 134 628 -364 -498 529 299 -624 -79 629 -156 -576 342 428 -484 -255 565 66 -575
1706 -575 144 518 -328 -389 443 228 -506 -48 516 -145 -453 282 337 -391 -204 450 41 -456 104 394 -240
1727 -240 -293 330 175 -388 -59 379 -94 -351 193 248 -291 -160 324 51 -320 73 300 -157 -216 232 127
1748 127 -272 -39 270 -54 -240 142 196 -171 -98 218 36 -215 56 186 -101 -147 142 79 -166 -40 145
$$ packed form
1617C69O90j776q1J788n21j600J065J207j455p08J679J34j711M44J543r59j192
1634a084J360P15j598j59J633m20j467R12J139j307o70J523J40j562M00J413q92
1651G6j070J254O38j451j39J478l83j328Q48J014j174n97J356J12j350L38J219
1668H41p52r51J059N73j237j33J253k92j122O58Q68r34n34J088J57j130K50J015
1686F77n92p80Q29M94r92j34J027k30r23N45P08p85m20R18Q6r12K29Q20m99o41
1706e75P19L74q46o1Q32k15p34M58N64o61l08P35N5p28J87O54m09m97N60K90o34
1727b40n3O23j55n63L29M38m73k57N44N5n39J31M84k73l71L93K27m57n9M48j05
1748A27l99K33L09l24j86L82N4l67P3L16j82k51K71J30k87m6K89o3k45J26J85
$$ plain form
1769 145 -30 -143 48 92 -90 -68 91 39 -91 -3 76 -19 -70 24 32 -38 -42 27 19 -28 -11 38 20 -17 -19 32 30 -40 -15
1798 -15 51 26 -71 -11 82 -19 -88 54 78 -87 -75 116 29 -149 8 145 -67 -143 107 98 -163 -65 174 -8 -198
1823 -198 79 191 -147 -146 197 100 -246 -11 271 -60 -236 159 200 -225 -117 290 40 -303 72 275 -169
1844 -169 -240 254 158 -318 -50 341 -78 -333 176 273 -287 -191 336 50 -378 60 372 -184 -311 310 197
1865 197 -377 -78 413 -63 -406 209 334 -311 -235 402 105 -454 57 434 -205 -367 337 253 -415 -121 451
1886 451 -35 -465 179 391 -332 -301 414 139 -477 10 469 -182 -404 307 294 -432 -160 483 -11 -479 169
1907 169 418 -322 -321 426 155 -486 1 486 -179 -425 317 307 -426 -160 488 -18 -486 166 404 -324 -310
1928 -310 431 158 -479 1 470 -177 -418 317 309 -416 -172 460 -5 -464 158 409 -302 -318 404 165 -463
$$ packed form
1769A45j75j13J91M4j82K2J59n2j30Q8P9r5n1R4Qp0mO9qm7J7M9j8l7kN1kp0K5
1798a5O6k5r7O0R3j01o9J42K4j65J2J91q7j78J57J37k12p6K50rk61R8K39j82j90
1823a98K77J12l38JL43r7l46K35K82l31j76L95M1m25J08M07k50l43L75K03m44
1844a69p1M94r6m76K68L91m19k55N09R7n60R6N27k86m28M38L12n56j27O21j13
1865A97n74K99M91m76l43O15J25o45P6O37k97n59N11L77o39j62P04q4o68K94N72
1886D51m86m30O44K12p23L1P15k75o16M87M59o51k22P11j3p26K72O43m94m68O48
1907A69K49p40JP47k71o41M87M85o65k46P42j0p33K66O48n06m68O52K38p28J4
1928c10P41k73o37M80M69o47k41P35qp25K44O32m65m59O22K51p11j6P22k39o28
$$ plain form
1949 -463 0 466 -156 -392 302 299 -394 -153 458 6 -456 161 401 -301 -282 400 151 -441 13 451 -164
1970 -164 -387 307 271 -412 -153 442 -25 -456 170 367 -307 -292 388 144 -452 5 422 -167 -379 285 265
1991 265 -382 -141 411 -11 -418 141 355 -265 -269 366 148 -408 -2 393 -124 -349 255 259 -340 -139 388
2012 388 -5 -390 132 330 -258 -259 335 120 -375 -2 375 -138 -330 236 231 -327 -117 360 -13 -371 123
2033 123 311 -240 -234 301 111 -346 2 338 -111 -300 214 220 -287 -120 325 15 -315 97 290 -175 -213 270
2055 270 123 -305 -7 294 -94 -276 160 204 -236 -121 264 22 -287 66 235 -164 -185 206 110 -252 -26
2076 -26 249 -72 -226 136 160 -201 -99 225 25 -220 58 190 -120 -149 159 86 -180 -17 189 -43 -162
2097 -162 99 127 -144 -78 155 22 -160 29 124 -91 -107 111 58 -145 -11 120 -36 -127 64 78 -102 -51 104
$$ packed form
1949d63M63M66o22k36O94lo93K41O11m52m62O17K40p02J9O82k49n92M54M38o15
1970a64k23O94l6o83K59N95m67m31O26J97o74J5O80k44n96M57M17n89k12O64k0
1991B65o47K41N52m22m07N59K14o20mO35k18n56M06L95n17k25O04Mn99K01N27
2012C88l93l85N22J98n88jN94k15m95L73L77n13j92N66nn58K10M77l73l58M94
2033A23J88n51ON35j90m57L48L36m49j89N14On07J67M45l10l30M12J93m65l8M83
2055B70j47m28K98L01l88j82M36M4m40J15L85k42l09L53J69l99k1L91r6l62K26
2076b6K75l21j54L62K4l61J02L24k00k45K78J32l10k9L08p3k66J63K06k32j19
2097a62K61K8k71O6K33j33j82J89R5k15j6K18n3k03J34J31j56r1J91J4j80N1J55
$$ plain form
2120 104 4 -113 39 102 -61 -57 88 38 -87 -8 83 -32 -65 51 38 -72 -21 79 -14 -66 39 39 -60 -31 55
2145 55 8 -60 10 45 -33 -31 31 10 -44 -5 30 -32 -27 23 5 -26 -7 20 -8 -26 18 16 -17 0 18 -6 -11 15 6 -26 -9 26 -11
2178 -11 -8 17 2 -20 9 29 -17 -22 22 -2 -39 3 23 -34 -35 28 4 -41 4 30 -24 -35 27 8 -50 -9 47 -24 -56 28 28 -45
2210 -45 -17 63 0 -61 27 60 -47 -33 61 17 -81 14 77 -38 -64 65 41 -78 -9 92 -27 -92 56 53 -82 -56 91
2237 91 8 -125 27 97 -65 -89 97 46 -113 -4 118 -38 -122 61 105 -103 -51 130 13 -129 40 132 -73
2260 -73 -99 127 63 -135 -13 160 -32 -130 69 112 -126 -76 144 7 -173 23 155 -105 -129 132 67 -168 -24
2283 -24 163 -42 -163 94 127 -151 -87 164 22 -190 35 162 -90 -131 149 83 -180 -36 187 -29 -180 96
2305 96 139 -152 -109 185 46 -196 34 190 -89 -160 140 109 -186 -53 187 -29 -204 79 148 -144 -120 169
$$ packed form
2120A04j00j17J52O3j63MJ45n0j25P9R1j15l3J16j3j10N1J00r3n2J05%r9K9Q6
2145E5m7o8P0L5p8KO2k1n4L9L5o2NN0j8l1J9K7k8j8M4kl3J7J8k4nK6rl2J7L5l7
2178a1LK5j5k2K9K0m6nM4k4l7M2K0n7jO3k4m5M5K6n4j1O2j9n8M1N6p1l2Q4%p3
2210d5K8Q0o3o1Q8L3j07J4R4m4r8R5O3j15k6J29k4j19O9J01j19o5J48lj35K6J47
2237I1q3j33J52P0j62k4J86n1j59J09J22j56q4J83M4k08N2J81j17j42J69R2k05
2260g3k6K26o4j98J22J73j92r8J99M3k38N0K20j37j80J96J32k60k4K61o5k35J44
2283b4J87k05j21K57L3k78O4K51j42k12K25J27k52m1K80o6k63J44K23k16j51K76
2305I6M3k91M3K94j39k42K30J56k79p1L00l1k95J33K40k16j75K83O9k92K4K89
$$ plain form
2327 169 54 -193 14 180 -83 -163 127 104 -172 -52 187 -7 -179 82 146 -116 -101 170 56 -191 12
2348 12 167 -75 -149 124 104 -166 -44 175 4 -168 62 152 -126 -114 154 51 -180 4 160 -67 -151 109
2370 109 104 -157 -58 159 -12 -168 56 137 -106 -110 134 51 -151 4 161 -63 -132 110 96 -139 -63 156 2
2393 2 -152 66 129 -106 -103 130 43 -143 6 145 -62 -130 96 94 -133 -55 131 -9 -136 49 123 -84 -84 111
2417 111 46 -136 6 131 -46 -121 80 84 -116 -54 129 8 -132 35 105 -73 -90 111 46 -124 6 108 -51
2440 -51 -111 76 71 -109 -46 107 -6 -115 29 96 -79 -78 87 33 -121 -14 105 -37 -100 61 65 -83 -41 94
2464 94 4 -96 25 83 -59 -57 75 45 -93 -8 87 -23 -86 33 61 -70 -44 69 13 -77 12 63 -37 -66 51
2489 51 28 -64 -23 61 -13 -71 14 51 -48 -40 45 26 -58 -1 56 -24 -27 39 32 -43 -23 36 -7 -46 12 36 -9 -28 29 6 -35 -12
$$ packed form
2327A69j15k47K07J66k63q0K90k3k76J20K39j94j72K61O4k62J5K71j14k47K03
2348A2J55k42p4K73k0k70J22K19j71j72K30R0k78J2K68j03k31J84J56k27q4K60
2370A09nk61R9K17j71j56K24Q1k43mK44q3k02J55J57k24o9K42j4k35P6K19j54
2393Bj54K18O3k35LK33q7j86J49J39k07o8K26kk27P8J86j40j27J85P4k07%J95
2417A11o5j82J42J25j77p5K01Mk00O2J83j21j40J67P0j78j7K01o5j70J30J02j59
2440e1o0J87nj80O3J53j13j09J44O7j75JJ65n4j54J07J19j42o3J61Mj48M2J35
2464I4r0j00J21N8j42KJ32l0j38Q5R5j10o3J19K8j31K6J13n6r0Q9N1j00k9J17
2489E1k3r2M1Q4p4n8Q5L7r9QQ5j9q4N7N7q0lO6pp5K0N9m3l9N8K4m5j9N7k3m1K3
$$ plain form
2521 -12 28 -1 -25 4 28 -13 -19 27 5 -28 -11 17 -4 -24 -1 3 -18 -1 -1 1 -11 -4 4 0 -1 -2 4 6 -2 -7 0 6 -9 5 7 1 -14 22 15
2560 15 -9 -12 24 10 -17 9 25 -8 -21 14 7 -34 -24 32 -4 -27 3 16 -16 -27 23 5 -31 1 43 -12 -28 24 21 -31 -23 31
2592 31 3 -39 7 43 -19 -27 39 25 -31 6 58 -5 -39 21 36 -28 -19 40 5 -50 2 40 -31 -38 39 15 -42 -7 39 -6 -41 14
2624 14 28 -31 -25 33 8 -53 12 50 -30 -30 40 23 -42 -9 44 -18 -38 27 22 -30 -9 62 17 -60 17 50 -35 -27 47 15 -46 -7
2656 -7 43 -14 -58 30 33 -57 -17 44 -11 -64 24 43 -56 -42 44 12 -52 13 51 -20 -40 48 34 -62 -12 59 -11 -51 37 56 -57
2687 -57 -24 52 9 -64 13 60 -26 -41 44 33 -57 -14 73 -12 -57 33 51 -48 -36 70 7 -64 -9 59 -40 -57 48 41 -61
2716 -61 -19 65 -2 -68 29 53 -48 -44 69 22 -69 16 74 -24 -53 54 48 -54 -22 79 3 -64 24 52 -50 -39 49 15
2744 15 -67 9 70 -26 -58 45 32 -69 -37 60 2 -69 21 54 -46 -44 55 22 -61 5 69 -21 -52 41 44 -59 -16 77 6
$$ packed form
2521a2M0k9k4K9K4m1oM6k2l3J7K8k1k0K3Mk1J7%Kj2PQmjjOKqnPOj5J4Koj5L6p
2560A5k4lL6j4k7K6J6l3j3L5pm1J0N6l6k3L0J3l2j1N0j8l6L2M2n5j6N2ln2QN4
2592C1k8m2M6L6o2qO6j4n6L7N2o3l4O0J5o4RN9l5n5N2L8p1pP7k4n7L5M6m5l5N5
2624A4J4n9ON8k5o1O5L8q0%P0j7o5L3N3o2k0O5nn2K1P1m5p7P7L3q5QP4l2o1L9
2656gN0n7m4Q8Lr0M0O1n5n3Q8J9r9J4Q6l2o4O5L8p1k0Q8j4r6N0P1p0m0Q8J9j13
2687e7L3P6m3p3P7M7q6j5Q5j1r0M3Q7q5m5R0J8r9J2J06o3p1N5O8r9j7J05pj02
2716f1M2Q4o7o6R7K4j01MJ13m7r1Q5N8r8k9J07oj02L2J01p6o7Q8K8j02J1Q8l4
2744A5q2P6O1r6l2J03j3j01L2R7n8p1R0L3j00KR9l3q3O6O4r0l1R3Lj03M3R3p1
$$ plain form
2773 6 -49 31 57 -42 -30 54 25 -64 -6 57 -19 -48 42 33 -54 -21 52 0 -57 22 42 -33 -39 50 18 -51 -2 49 -23 -42 44 24
2805 24 -44 -15 53 -5 -54 17 32 -30 -37 43 4 -41 5 36 -19 -23 33 31 -45 -15 47 -6 -46 18 26 -32 -21 37 4 -46 0 36
2837 36 -25 -40 23 20 -31 -10 30 -14 -37 15 28 -27 -12 36 12 -42 7 32 -25 -27 32 30 -32 2 37 -8 -27 22 24 -29 -19 27
2869 27 1 -39 7 32 -20 -33 29 11 -15 -6 21 3 -26 17 20 -20 -26 29 7 -28 -7 35 -13 -25 25 28 -15 -3 30 5 -28 1
2901 1 19 -17 -21 19 9 -15 1 12 -1 -18 3 11 -12 -10 12 3 -22 -4 3 -11 -28 9 2 -16 -8 1 4 -27 -2 7 -8 -22 5 6 -7 0 15
2938 15 10 -12 -6 4 -3 -11 9 19 -7 -12 15 4 -20 -6 6 -4 -15 -6 3 -11 -3 -6 -1 -17 -13 2 -13 -17 -10 11 -4 -25 -1 8 -14 -12 16 9
2976 9 -21 1 27 2 -14 13 11 -17 2 20 2 -10 2 26 0 -17 20 16 -13 -10 18 -6 -28 0 14 -21 -12 15 2 -33 -14 20 -15
3009 -15 -27 8 14 -19 -17 21 8 -31 -7 32 -6 -27 7 11 -27 -10 28 -7 -27 1 26 -22 -32 23 13 -32 0 23 -19 -21 14 25
$$ packed form
2773Fn5Q0K6r9J2Q4k9q9N8O3p6k9R0rq7L3P3n2n7P9K0p5oQ9l2o9M9N1p2j9Q6k0
2805B4o8K9O8n8m9P1J5o2pQ0l9m5M6L1n5mN6kp6L0O2n3m0O4Qn8J1N8l3n0M6L6
2837C6o1j5O3ln1K1M0m4k3N2J3n5J5M8k4n4M9K5n7kN9ko2L4L5m5j9M9Kn3J0M6
2869B7k6m0M6K5n2j3O2j8k6RK7j8k9M3Lm0oN5k2l5K1M2m8j2N0Lm3J2L3k5l3K9
2901AJ8l6mM0j0k4J6J1j3j7K1Qk3KK2rk5J8Pj4j7L7pj8QRLl1K5Rj5j4K7Jj3PJ5
2938A5nk2OJ0pqK0J0k6nK7j1k4J4J2j0j1RRj4QlNj6MJ5j5mPK1j5k1K4Rk2KK8p
2976Il0K2K6k5j6K7kk8J9J8j8j2J2K4k6j7L7mk9LK8k4k2K8J4l5RK7j3l5J9L4l5
3009a5j2L5Ol3KL8j3l9K4L9l8k1L4Ml8J7L8l5k0K8K5m8j0N5j0m5L2K3m2kL5J1
$$ plain form
3041 25 -32 -23 13 -4 -36 8 16 -24 -22 24 10 -32 -10 35 -17 -34 18 7 -20 -8 32 -13 -31 3 18 -23 -27 15 8 -29 -3 26 -6
3074 -6 -22 17 23 -18 -5 39 -8 -34 13 27 -23 -20 21 12 -25 1 23 -16 -29 20 17 -36 -15 26 -1 -34 4 20 -21 -18 25 13 -26
3107 -26 -5 32 -16 -20 18 17 -15 -11 31 -1 -32 11 31 -22 -24 34 7 -33 3 19 -18 -26 11 20 -21 -13 24 -9 -25 3 28 -10 -20 20
3141 20 13 -34 -4 27 -4 -25 18 23 -24 -3 40 4 -25 8 27 -29 -22 17 11 -26 6 34 -5 -23 18 14 -21 -13 10 7 -35 -9 15 -25
3175 -25 -29 10 3 -29 -14 18 -3 -29 8 19 -14 -15 8 11 -24 -1 15 -11 -21 17 3 -20 -14 23 -3 -13 12 14 -19 -18 8 -5 -23 -7
3209 -7 16 -20 -22 4 16 -13 -12 4 2 -19 0 -1 -21 -2 12 3 -16 3 13 -5 -21 6 2 -8 -9 4 9 -16 1 4 -3 -8 13 3 3 -6 15
3246 15 -4 -14 2 2 -9 0 2 1 -1 7 2 -13 -4 2 4 -5 1 -1 -11 -4 14 -2 -25 5 3 -5 -7 1 -6 -4 -4 2 -9 9 11 8 0 8 8 3 -2 0 6 -6 2 -2 6
3293 6 -4 -1 4 -4 -3 11 -3 -14 5 5 -1 1 7 -1 2 -5 -5 8 -13 -1 7 -15 -10 0 1 -5 -10 -7 1 0 4 19 1 -3 -3 -2 0 4 2 -13 -7 3 0 -8 0 -3 -12
$$ packed form
3041B5n7RL6j7l2M4Qm0KM6j4m2K2M5n2j7N2j1k7J2M0m5j8L4J5m1mM2pl7K6K9l2
3074fj6L9Om1J3M4m7k6M7J4n0LM1rl7K6K2l9j3M9ln3K1M1k7l3L8J6m1LM3j2l9
3107b6K1L7m8mL8jl2MM2l2l1M3K0n3kN8k7m0L6J6l7qL7Rm1QL7l3j6K8K5l8j0M0
3141B0pm7L0L1l1k1M3Nm7K1M3l6k9L3J9n6PL9ol7L2K8l9j8M1ml5QK3lm2K6K4m0
3175b5mL9pl2J5L2k1k6L7J1l3jK3Ll5K3J6k6j0L8j4k3OL7k6j0K5Kl3JK6j3j8J6
3209gK3l6kK6J2k9JJ6kk1J9jk0J9J4rj9J9J0j8j6K7mj0jJ3Nk5J7LpnK1j0%rK1
3246A5j9j0J6%j1RKjkQnj5ROKrOkj0PJ8j6k3L0kqkQpK%Oj1J8KlqQ%nnKOj2QmQ
3293Fj0LNqJJ4j4j1J9%oKOqLp%J3k1J2Qk2NJ0JonLQjMJ5j8m%JKMkj5OJ0lqQlr
$$ plain form
3340 -12 -2 7 -3 -2 -10 0 -4 -13 -3 0 -4 -1 -7 -3 -10 7 0 -3 7 10 -3 -10 7 -1 -9 -6 -8 0 -11 1 -2 -5 0 -1 1 7 -1 4 -10 4 -3 -9 -5 -6 -2 -10 -5 -4
3388 -4 -9 -11 4 -3 -2 -15 2 1 -8 1 19 -1 -4 3 0 -7 -5 13 1 -7 8 12 1 -7 2 8 -5 0 5 -9 -5 8 9 -13 1 4 8 -13 3 16 -8 -9 8
3431 8 0 -14 -5 0 -2 -6 -3 18 -9 -7 13 -1 -10 4 13 -13 -13 8 10 1 11 12 4 -6 10 7 -6 -5 11 6 -15 2 19 -6 -7 2 9 -15 9 19 1
3472 1 -7 7 7 -2 0 7 2 -13 -6 -2 -11 -14 13 5 -7 -1 5 -16 -7 2 1 1 -1 23 1 -16 12 6 0 -4 0 3 -6 -10 2 -3 -16 7 8 -4 -2 7 2 -13 3 4
3518 4 -7 -20 4 -2 -9 5 14 0 -10 11 8 -10 -10 8 0 -12 16 5 -2 -6 11 10 -10 -3 5 1 -10 14 7 2 7 8 -3 -5 -8 2 -4 -7 13 5 -13
3559 -13 -13 3 -4 -10 -1 0 -11 -9 5 6 -11 -4 16 -18 -7 17 3 -4 -10 18 1 1 15 6 -10 10 13 5 -17 17 9 -1 3 16 10 -12 3 23 12
3598 12 -3 6 10 -8 -19 10 0 -16 -1 9 -5 -1 5 10 -3 1 9 1 -9 16 19 -1 -15 4 5 7 -4 9 3 -9 8 10 0 -4 6 -1 -9 3
3636 3 0 0 -5 7 0 -8 -1 -7 4 -3 5 5 -9 -14 3 -3 -3 1 -2 2 -10 8 2 1 -3 12 3 -4 8 9 5 -3 8 8 3 -5 8 9 8 -4 11 4 -10 1 0 0 -12
$$ packed form
3340a2J0Rj0JqJ0mrJ0LmLoMpJ7plJ0Lj3pJ7qqLkQj1J2llNjKOqNj4J4poMjMqNJ
3388dnkJ5pJj3J7jrRJ8k0lPlpKJ8j2qJ5Mj1qROj3NNj4MJ3Jk2J4LMk1J6J3k4jJ7
3431Hqj4RNkmLK1k7KK0j4rJ4Rk6%K1KrJ0Jqj0J6lj3JJ6nk1J7J7k5jRPk4K4J0j8
3472AqJ4%rKPnj5PMrlK7qj2OOk1RRj%kK4k2j7K8oomMLrmJ2nj3K3Jj2KRnj5J6J
3518Dj1j3K4opJ4Rj4j0K1lj8%J8qj2K8j1pmJ7jk0PQmj1K4pnNJj1klJ0olK0qj8
3559a3%J6poRJj1KJ4Jj7PK0l4J1K4j4poK8j7%J4rj6K0Lqk2L4qj0MJ3ok2J5K0j1
3598A2j5RMj8j1K9j0j6J5J0j4MONj3MQqj0K5Lk0j4J9JKj1J3oj2J7Kj0mJ0pqJ2
3636Cl%nJ2pqPoJ1pQ%j4nJ7o%MlMj2J8ojmJ5rpJ2JmqJ1%nqJ3Jjj2J5pj4J1j%j2
$$ plain form
3683 -12 2 10 4 -3 9 5 -4 4 1 6 -14 -1 5 8 8 -6 10 -3 -1 12 2 -7 4 0 2 5 3 5 -6 2 4 13 -3 2 2 1 4 -1 -1 -8 3 -8 2 -3 4
3728 4 -3 -7 -3 7 3 -10 -4 11 9 -3 6 8 -4 7 7 5 2 -5 7 1 -3 3 3 -1 1 1 3 7 14 6 11 9 0 3 -5 9 6 -3 3 -1 2 6 -4 -2 -2 -1 1 4 -6 -7 -1
3779 -1 -1 0 2 3 2 0 7 -2 -5 6 10 -7 -6 1 -1 -4 -2 3 2 -14 -11 -3 -1 3 4 -1 -8 -1 3 -2 -13 -1 -8 -6 -2 -8 -10 -6 -2 -4 -4 -5 4 3 -8 -9 -1 -3 -10 -11 6 -1 -1 8
3833 8 1 -4 5 -3 -6 -3 0 4 -3 3 14 -12 3 14 7 -8 3 8 0 -5 2 -1 -4 -1 3 2 -5 8 5 0 0 -5 5 -10 -9 -1 -2 -8 2 -1 -3 -9 1 -2 -5 10 10 -13
3881 -13 -7 5 2 4 -2 15 5 -1 2 7 -7 -1 12 8 1 1 -2 8 -6 -11 4 -5 -1 0 4 3 5 11 -4 -5 4 11 -2 0 1 5 4 -1 12 -3 -2 3 -8 -2 1 6 1
3928 1 -7 -2 1 -2 1 13 -2 -2 -2 -7 -6 -14 -5 -9 -9 1 0 0 0 -6 -2 -3 3 -10 0 -7 2 -3 -11 -6 0 3 -5 -11 -5 -3 3 0 -5 -1 -4 0 -7 -1 4 4 -4 1 2 4 -8 -9 1 -4
3982 -4 -5 -9 -2 -4 -9 3 -9 -4 4 7 -26 -11 3 -4 -10 -8 -10 -9 -2 -8 -7 -11 1 5 -3 -2 -3 -2 -1 -4 -10 0 -4 -4 -7 -12 -6 -4 -9 -7 7 -6 -14 4 -8 -4 -18 -6
4030 -6 0 4 -3 -1 -1 -3 -3 -5 -4 -13 -2 -8 -12 -1 11 7 1 -3 -3 -2 -9 -7 4 -2 0 2 -1 -1 1 -1 7 -6 1 2 2 -6 -5 -12 -3 -7 8 -3 2 4 -4 1 0 1 -1 -9 -4 -9 4
$$ packed form
3683a2J4QopJ2mrQlNk0J3OL%j4J6j3KJ3j0rJ1mKLkKj1QKRj6N%jLn%pJ1j1J0nP
3728DpmMJ0mj3OJ5kj2RKj2J1%klpJ2omO%mK%KMPqNkrLqJ4lrOmLMj0K%JKLj0jO
3779a%JKJjkPrlJ1Mj7JPklKNjj6LQKMJnpPMnj1J2pKMokMMk%jRjj1jQkpjJ7p%R
3833HpnRqlLLMpOJ1k6J5J1pj5J1NqnPllLMjpJ3ln%nJ0j5JQjoJ0lkoJ0llJ5%k3
3881a3OJ2lKoJ7j0oLNj4OJ3mp%lJ0j4nJ5rMJMjKOj5jRPj3KJMjnJ3j5JNj1OLNn
3928AqNLlLJ2j5%%nJqRm%J0j%%oMjOj3J0pRnqNOLqoOKOlnMlMpON%qNJKj2jJ0n
3982djmPknJ2j2NQLl3J5J4poKkJPoJmJ2MqJjJJloJ0m%lnOKnKJ4j3qJ8j2Mj4J2
4030fOMpK%k%kJrJ1omJ1J2mom%JpKJ1oKKl%KkQj3PJ%qJpRmJ5j1NKqNjJkqNnJ3
$$ plain form
4083 4 -5 -1 -2 -11 1 -4 -2 -3 -3 7 -3 2 -10 2 -9 -13 -4 -6 -3 -3 4 11 -5 -1 -3 -11 -7 -3 -5 0 -1 -6 -3 -8 -7 -3 -6 6 -7 0 -4 -8 -11 8 3 1 4 -2 -3 3 -2
4134 -2 -6 9 5 12 -4 6 6 -7 -6 -3 10 0 -3 -1 -1 -3 3 8 3 -11 -7 -5 -2 0 -12 10 0 -7 2 -4 -7 -1 -2 1 -2 -4 -5 -8 5 9 -11 7 1 3 -7 -1 -7
4181 -7 -1 -4 -5 5 0 -3 -5 -5 7 4 4 4 -8 3 -1 6 -4 -4 -5 -6 2 -7 -2 3 3 -6 -7 0 -1 -5 -10 -3 1 -5 -4 8 3 -2 3 3 -3 4 9 1 -12 -2 -2 -18 -6 -6 -11
4232 -11 -15 -9 -1 -9 -9 0 -4 -4 -9 -2 -5 -10 -7 -15 -2 2 -1 -3 -2 -4 9 -15 -9 1 2 -12 1 6 -5 -5 3 0 -4 4 8 -5 -9 -2 -2 -7 -3 0 -3 -7 -3 3 -10 -4 -14 -7
4282 -7 1 -11 3 -9 -7 -3 2 -14 4 -10 -1 -2 -9 8 -7 9 -6 -5 -5 -14 -3 -1 -9 -4 10 11 -4 4 3 -11 1 8 -6 -7 -6 -15 -10 -10 -4 -10 -8 -11 -1 -3
4326 -3 5 -2 -7 -16 -2 -2 2 -4 -8 9 9 -9 6 -13 1 1 3 2 -6 -14 2 -12 -4 1 5 -6 -10 0 -3 3 7 -5 -8 4 -9 -7 -3 -6 2 -4 -5 1 -4 -5 -4 -7 -4 -2
4374 -2 -1 1 -10 -3 4 -15 -4 0 6 6 -10 0 2 -6 -1 7 1 -1 -2 -6 -9 0 -7 -5 2 -10 1 -3 -13 -5 -13 -5 -6 2 0 -1 2 12 1 5 9 -9 -10 -11 -4 -1 0 4 0 -3
4424 -3 1 -3 3 5 -6 7 9 4 -5 -2 -1 -1 1 1 -4 3 5 8 9 2 0 7 -11 -10 2 8 -3 -6 1 1 4 -1 3 -7 2 -4 -3 -1 0 1 1 4 -1 0 2 0 -2 2 3 -4 -5 -9 -2 5 3
$$ packed form
4083DrMjrJ2nKj%J0j0Nj2J2j1mRkL%PPj6MkqMMkNjnLnJMlJ2j3PmmlJ9nkLojOn
4134bmJ5mPj6J0%j3JLJ3j0lK%kONnj4MKLKj2K2j0pRolOjLlkjlJ3Mk0J8oKj0Oo
4181gOljJ0nlk%J2l%%j2J1mPj0%jjQrNN%rjPjmnPMoJJ2nnN%oPNqj3J0%j6J2%n
4232a1mOQq%Rm%nPlnLqJ3MlkJkJ3k4OJ0Jj4J3Nj1%QlmQMj3mP%nMLlmMOj3Oj0P
4282gQj2J4j2KMNj6J8j4RjpJ7j5J6j5J%rJ1KqNJ4Jj5Qjj4J2Pj4jJrN%OoKlJ0k
4326cQpnrJ4%MomJ7%j8J5j9J4%KjqqJ6j4QNMj1mJ0lOMj2lJ2j3KMlQojOnjJlLK
4374bJKj1PPj9J1MO%j6J0KqNQokjmlRpKPj2J1mj0QqQjQkjLJ0j1MMj8jjPLJMml
4424cMmOKj1J3KnrLJ%K%nPKLJpkPj8JJ2Oj1lP%LnMj0RoJKJJ%LnJKkkMJpjmPPk
$$ plain form
4479 3 -3 -1 1 6 5 -3 6 -1 -2 3 -2 -4 -1 -8 3 -6 -1 -5 -13 -11 -8 -11 -5 -7 -4 -7 -4 -5 -5 3 1 3 -11 0 -2 -7 5 -4 -1 -3 4 -14 -1 -10 -13 2 -1 0 -12 -4 -9 -3 -6
4532 -6 -10 6 5 -5 -7 -2 2 -4 2 -4 7 -3 -7 0 -8 -5 -4 -3 1 -3 4 6 6 -3 3 -12 -2 1 5 2 2 3 7 0 -4 11 4 -2 -2 -3 -1 3 0 -4 -3 10 8 1 -3 3 -2 5 5
4585 5 2 -7 -6 10 -10 3 -2 5 -3 -6 -8 2 -9 3 10 1 -2 -2 4 7 0 5 2 6 2 2 -2 0 0 4 0 2 5 0 -9 -1 -3 -2 0 -1 0 -2 3 -1 4 1 -5 2 2 -1 5 1 -1 -4 1
4640 1 0 8 -5 -2 1 1 0 4 1 -8 -6 -4 -3 5 -5 10 5 5 -1 -5 -4 5 -4 9 3 1 6 4 -8 -1 -3 -11 0 2 5 -14 -7 4 -6 -1 3 -4 -1 -3 4 1 0 -6 -5 -2 -2 -10
4692 -10 0 5 8 -3 4 0 2 -3 7 5 1 4 8 -3 3 2 10 1 -10 5 0 0 5 2 -1 -3 -5 7 1 2 10 -1 -4 3 7 -1 -5 1 -3 1 -4 7 -6 -2 -2 5 -2 2 2 -5
4742 -5 4 -6 11 9 11 2 3 2 9 2 -5 1 4 9 2 -9 7 -2 -3 2 -1 5 7 1 -1 -3 -3 4 -3 5 9 4 9 -5 3 -2 3 -2 0 0 -1 3 8 2 -1 -2 8 -2 -2 5 2 -1 10
4795 10 1 1 -3 2 4 -2 8 0 -9 -3 9 -2 4 -13 7 4 1 0 2 4 -7 10 3 3 -5 0 1 2 -4 0 9 1 1 5 6 0 2 4 4 -2 -2 -6 2 -6 3 -2 -4 -6 -4 0 6 1 3
4848 3 -3 -9 -12 0 -7 -10 -3 -7 1 -1 -13 -2 -4 -1 -4 3 -8 -3 -4 0 3 0 -6 7 16 7 3 -3 -3 -10 -5 -6 10 -9 -7 -12 -4 -2 -11 0 3 11 -6 4 3 5 5 0 -2 7 -1
$$ packed form
4479CoKKNjqRpjNnkLpJ1rNmqKLlOkLlLj%QkKj4J1knJ2rLkPj8J3rlJ5lJj2QnOl
4532fmJ6jj0kNMoOoJ1j0mPqLJJMmPK%rOj5J0LMl%JMpmJ5po%jKMlmJJ3kpmOnP%
4585ElrJJ6k0J3nPqlkJ0j1J2Prl%OLpNlMm%mK%MmKLnrQkJKjJkNmNloP%lOmklN
4640AjQj3LL%jMlrKKJQj0J5n%omJRrJ3okNkj2PkqJ1KLj9PJ1j0NMpLkPljoJL%q
4692a0J0NLj1PmKnJ0kmLMj1OjQrj1J5n%NllkkJ2oJQj1lPMqmOmMnJ1j3M%PpM%p
4742eRj0J7kKrJjPppOLNpj1J6rjNlOKokk%PpQMnNj4QnNnK%jMNoljJ0j0%PllJ1
4795A0r%mNKoJ0qrOJ2j1Oj7K0lljKKj1J7p%qNJJoMRq%MJoKK%o%mQqRnkkKMOnK
4848CoolJ2plPmQkj2J1kLlPj1NjMLloJ3Rrmo%pNjJ6j9KnQKrJ1LQj7J0jK%nkRq
$$ plain form
4899 -1 3 2 5 1 -3 17 4 12 -1 1 -5 -4 3 -4 6 4 13 1 0 4 8 3 0 -5 5 5 1 9 6 6 -2 3 1 10 5 3 9 4 12 5 7 0 6 4 1 8 6 11 6 -8 -3 -10 -1 1
4953 1 -2 -2 -8 7 10 12 -2 10 3 -10 5 0 5 4 5 2 0 2 -2 -4 -6 -6 -9 0 0 -4 -8 1 -11 -8 4 4 -2 2 6 9 7 0 0 -13 -6 -4 4 4 4 -4 11 15 7 1 6 3
5005 3 10 -4 -9 6 -2 0 -7 0 12 -6 -3 -3 7 5 -11 7 -3 -8 -8 4 5 0 -5 -2 7 8 0 2 7 1 6 1 8 2 9 1 -5 -1 4 0 -3 5 -4 1 -3 1 -1 -5 -3 -3 -3 -10
5057 -10 1 9 13 6 1 5 4 -10 -7 0 -6 1 -1 -5 -2 8 10 -1 -2 3 1 8 -5 -8 -4 0 2 0 13 4 3 6 5 7 5 6 -6 -7 1 -6 -2 -6 -8 -3 -7 4 2 -12 -7 -1 9
5108 9 -4 4 -4 -7 -4 2 -2 -8 4 -2 -3 4 0 -5 0 -2 -7 4 4 1 4 -8 0 -1 6 -2 1 -5 -9 2 -10 -2 -3 3 -8 0 6 -4 -3 -4 2 5 -4 2 5 -2 -2 -4 7 -7 6
5159 6 4 -2 0 5 -3 0 -10 -1 3 -9 1 6 1 1 3 10 6 -2 -6 6 -8 -10 1 1 -7 1 -6 -12 2 3 -1 -6 -5 0 -6 -3 -17 -6 -5 4 -14 -7 -4 -2 2 1 2 -2 -7 -7 3
5210 3 -4 -5 -7 3 -3 10 -3 0 7 -7 0 0 -6 -1 -11 -4 1 7 -1 2 -6 -4 -1 1 3 -6 -8 9 -9 -2 2 -3 -8 -1 0 0 -11 5 2 1 5 6 14 0 8 -7 -5 -3 4 -1
5260 -1 -3 -2 3 6 -1 -7 -4 3 1 -2 -5 -12 2 -2 0 3 6 1 -1 5 11 3 0 0 -11 3 -7 3 1 4 3 -1 2 3 -2 7 1 -3 6 8 -1 10 5 2 2 5 19 -1 11 8 0 3
$$ packed form
4899aMjLmmK0j3Qj3KoJPpJ0kRj2jMMnlnJ0%mQl%qNkRnkOnQpKpOklPkNnj4NpRK
4953Al%oJ5LKj4J2pj3J5nNjJlkKmkk%lR%mmRj2LJ2%oMMLkp%j3PKQ%%qJ5MqoNl
5005CPj4nJ5qKpPJ2j8L%J0kj6J8j0n%J2JnnLRJqKNoNnPoPqoMNmlQrNmMkmK%%p
5057a0J1QMpnMjj4LPoPkmLJ0Kj1jNkPj3lMMKkJ3rjLjKkJj2jQpMmkNmJ1kj4NOJ0
5108Ij3QqlLOmoJ2ojPmnNknJ1%lLj2QjPqLomJ1j2QjOj1QOj0JjOLrOLp%kJ1j4J3
5159FkoKNqLj0RMj2J0Nn%KPmqmJ2j4kJ1%qQpoJ4JmnJNoLj4J1JRj8PLKMjJmn%J0
5210CpjkJ0oJ3j3LPj4P%oNj0PNOqLqKLKKrkJ7j8PMnnPJ%j1J6ljMJQj4Qj5KKPn
5260akJNLpoLPkllpJ4mKLLnkOOql%j1J4j0J0kLjmLJnRomRKrJ1nl%LJ4k0J2lqL
$$ plain form
5312 3 16 -3 2 -3 1 5 6 8 4 -2 -8 0 -1 1 0 -5 7 -2 2 8 10 8 3 2 -4 5 -3 11 2 2 -3 5 2 3 5 -6 6 -10 8 5 11 1 -4 -1 -5 -5 0 -14 0 -7
5362 -7 -10 6 7 2 -6 -15 -4 13 -2 -1 -6 5 2 -6 -6 -1 1 -2 2 -2 -3 -7 -6 -6 -1 -10 0 6 -1 9 -1 6 7 -2 8 -8 11 2 2 8 1 0 1 13 9 7 1 -8 1
5411 1 0 7 15 -4 -2 -10 0 4 3 9 5 -1 -5 10 2 0 -4 -5 -4 -9 -5 7 -4 5 6 -12 -11 -3 -3 0 -2 -2 -4 0 -8 -9 -6 -8 -7 -8 -1 6 11 -8 -3 -8 3 -2 -3 -2 0 -6 -5
5464 -5 -2 0 -15 4 -6 -6 2 -7 -4 -3 -5 -1 2 1 4 -2 -13 5 -10 -3 3 5 -11 -2 -6 -6 0 -10 -3 -4 1 -6 3 0 1 -8 -1 6 -11 -3 -7 -3 -4 -4 -3 -12 -1 -7 0 7 0
5515 0 -1 -3 -2 2 -1 5 8 -6 9 -5 -13 -5 5 -1 -8 -1 0 -1 10 5 -2 6 2 -3 -4 2 3 -3 -4 0 3 -1 4 -1 -2 6 1 2 3 9 6 3 -4 0 2 -2 14 10 11 -2 13 6 10
5568 10 -4 0 -3 1 8 -13 -2 9 -9 -3 -13 -9 -7 -12 -7 0 0 -3 13 -1 -6 -6 -2 -3 2 3 5 -2 -1 -5 1 4 -6 1 -3 3 4 2 1 -3 6 -3 -3 2 5 -4 3 -8 -1 -9
5618 -9 -8 0 3 8 -6 -4 -2 3 6 -1 2 -2 3 -6 -3 -2 10 5 14 -2 3 1 9 2 9 6 -9 -1 -1 7 -4 -10 -2 -5 -12 -6 -2 3 4 4 -4 0 6 -1 4 4 8 -1 1 -2 2 -5 6 4 9
5673 9 -4 -7 1 1 -8 2 4 6 8 5 -1 13 9 9 6 -6 -1 0 7 4 5 -3 1 -1 4 8 -3 1 -10 -4 5 0 -4 8 1 -3 0 5 -8 6 10 11 4 -2 2 7 -1 -1 -4 1 1 -2
$$ packed form
5312CJ3j9NnMMJKmooQjKjnJ2rMOKknjoRqJ4r%nQlJKj1J2j6J8lOj0nLm%Nj4J4p
5362glJ6JnqrJ1J7j5JnJ1lq%NKlMmjmJ%NrJ0OpJ0j0PJrJ0j6J9r%OpjJJ2mkorR
5411AjPQj9KqJ0MjOmomJ5qkmjJnMJ2j1RJj8JQ%Lk%kMqjLkJjPPNj9NnJ1njJKoJ
5464eLKj5J9j0%QrLJkMLjLoj1J8j5POKj6Rm%Oj0PjNpRlJrPPj7QmMj%JrJ1oPPp
5515@jkJMlOLj4J5j4qQJ0opPJjJ1npQmnjOJojMLmNnjQnJJOllpMKmJ6mJj3J5pM
5568A0j4MlMPk1J1J1j8Oj0MKnNP%lJ6j4n%MjNJKpJmOLj0PmOJkjmRr%NLrPj1Pq
5618iJQLNj4KKNLpLmNrLJJ2nRj6NkQpPlj5Q%Qj1oQlpOMNJ%qMOpN%MrKlMpJ1kN
5673Ij3lQ%rJ0KKKloJ4m%lj2NJPlJqMkNMj1Mj1ORnmJ2pmLNj3J4MJpoMNq%lN%l
$$ plain form
5725 -2 4 6 2 4 7 3 12 11 0 0 -2 1 0 5 -6 6 7 -3 -3 -1 -3 -11 3 -2 2 -7 -4 -7 -1 -5 -2 2 0 -11 5 5 1 0 -2 -7 1 -1 -6 -6 -1 6 0 -1 -1 2 1 -9 1
5778 1 2 -4 -10 -2 -5 -8 -10 -1 -5 -4 1 -5 0 -8 -11 -10 -7 -10 -2 1 -8 1 -2 -7 1 -7 -8 -11 9 -2 0 -3 -4 5 10 -3 -6 -8 -4 -7 -6 -6 -3 -15 -8 -8 1 -9 -1 -3 -10 -12 -9 -3 -6 1
5834 1 -11 -2 -7 -7 -9 -4 -8 -6 -8 3 -6 -7 0 -4 -10 -19 -10 12 -7 -8 9 9 3 -3 -3 0 -4 -12 -1 -1 5 4 9 -3 -8 -3 5 -7 0 8 -12 -13 1 -5 4 -3 -2 -13 -4 1
5884 1 -1 8 3 -5 -6 -3 -6 -1 3 -5 3 -11 -1 2 4 2 0 -9 -3 2 -10 -8 -3 -8 -6 -7 -2 -5 -13 0 3 2 -4 -7 -6 3 -10 -13 -8 -6 2 -3 7 -1 -7 4 2 3 10 -1 -2 -1 1
5937 1 3 6 -9 0 8 0 2 3 5 4 6 3 0 0 6 -2 -5 -1 3 3 12 10 5 1 2 2 1 1 1 -5 2 4 -1 12 -4 -5 -11 2 -4 -4 6 -1 4 -3 3 6 1 0 -3 5 -4 -9 -6 5 1
5992 1 2 -7 -9 1 -17 -5 2 3 -10 -5 2 -3 -5 -8 -2 2 2 2 3 -2 -5 -5 7 3 1 5 5 3 1 -5 2 3 5 3 -5 6 -1 6 3 11 3 0 4 -18 -7 3 0 -6 1 -6 0 -9
6044 -9 -7 -14 -3 -4 -9 -3 1 -4 -7 -6 3 -4 4 -1 -8 -2 5 1 2 7 -6 -10 -13 -11 -3 3 8 4 -5 -7 -2 1 3 -4 -3 6 2 -8 3 11 4 -2 -4 -7 -8 3 -8 -5 -4 -5 1 -5 0 0 3
6099 3 9 7 11 2 -1 5 3 -5 -2 0 10 1 -8 0 -2 3 1 -5 11 -1 1 -1 5 -7 1 -10 -5 -14 2 5 2 -4 -9 -3 -1 -12 -7 1 -1 1 -13 2 -9 3 4 3 -1 0 1 -2
$$ packed form
5725bOKmKLmRjj1%kLjNj1J2Jj0%KkqJ4nMrLlOmLMkj1J6%mjknQkn%NPoj%Ljj0J0
5778AJooQllkRmJNoNqlJLlQLrRlnQqjlK0j1KljRNj3lkMlJ%Lj2P%Rj0QkpkLOlP
5834Aj2Rn%kNmKkJ1rjPmorRK2j9jJ7%oo%LmqJ1%OjNj2nNQj2PQk0jJ4oRpJj1RN
5884AkRnqjLlNMqQj4J0LKkkrONj2KNnKjNlqJ3LjolJRj3lNKQnJ0qoJ1kJPj1jJK
5937AKLj5RQqKJKjKll%OqlMM%RknmJ%j%%oPKnJ3j6joJ3o%J0pNpOLnjlQrnLJ1m
5992AJrkJ0j8J2PJj3NPnklOM%%Jnl%J2mkM%kkoPJKkqJ1pPlQqlMk2J1J0loPpOr
6044iKpJ1jnOMnlJRpQnpOPmJNj3mlKQONmrkNLKpJRmj0J1QpokljJ1j1LJjOoN%L
6099COkMrlOkqLKJ0rrQkNkoJ6j2KkOj2Qj1NrJ6LlonOKj1NQkKj4J5j1J2JjmJJl
$$ plain form
6149 -2 0 9 -4 6 14 3 8 6 1 3 10 -8 2 10 5 3 -1 1 -7 -10 -3 -1 3 4 6 2 4 -2 4 -2 -10 5 -8 -1 4 -2 -2 -7 2 5 0 11 9 0 -2 -8 6 -2 0 2 -6 3
6201 3 2 0 -5 -7 -2 6 -7 -4 -6 1 -1 -10 -4 -6 4 4 2 0 3 -1 -11 -2 1 -13 -1 7 -7 10 -6 -2 -2 0 3 5 -5 -6 -2 -2 -2 8 2 6 9 -4 2 0 -1 8 11 -8
6251 -8 -11 -4 -1 -1 -7 -5 -2 0 -7 -5 3 -2 0 -6 -3 -8 -2 -2 4 3 0 3 6 -3 7 -4 6 4 8 -1 0 0 0 4 3 0 -2 2 -1 7 -5 0 -2 5 2 -2 -2 2 -14 -6 -1 -8 -2 -1 4 2
6307 2 -7 -5 -7 -5 3 -1 -2 0 10 -2 12 2 -4 5 -7 6 -2 -1 7 9 0 1 -1 14 -8 -6 -3 7 -3 -1 6 10 -1 -3 -2 9 -1 -2 -10 -3 4 -1 0 -3 6 -5 4
6354 4 -3 7 -7 2 11 4 -2 5 7 3 14 -3 -1 2 6 3 1 -4 0 8 -8 1 6 -4 0 8 7 3 -1 -12 -4 -5 1 -1 4 -2 2 2 -4 -1 -11 1 -8 -12 5 -4 -3 2 1 -1 7
6405 7 -1 2 3 4 3 5 10 -2 0 -5 -6 -2 0 -8 -2 -1 -7 -4 -9 -7 -7 -7 -12 0 14 -7 3 -4 7 -2 -1 9 12 0 3 6 3 1 -5 -2 8 2 19 7 10 4 0 4 0 11
6455 11 2 -3 5 10 -2 0 -5 0 2 1 2 2 -5 -9 -4 -1 -7 0 -3 3 7 -1 0 5 10 -7 -11 2 -2 0 -7 -6 6 -2 -1 2 -6 -2 0 -3 -1 5 1 -4 -2 3 1 1 -3 6 0 6 4 1 1 -6
6511 -6 8 5 -8 -6 0 -14 -8 -3 -1 2 8 -3 -3 6 -10 -4 -6 8 2 8 -2 4 1 1 -3 5 -2 2 -5 -5 -10 -10 -11 -5 -1 7 1 0 6 0 -2 -3 13 -4 5 3 -1 -1 -4 9 -5
$$ packed form
6149bKRj3J0Qj1NknKPj8J0QnkmKqlPKMJKmKoOoqJ5j3PNo%nRLnJ1krkoJ4qKKqR
6201CjknkNQj3LkPkrOkJ0%kkLmj0RLj4J2Qj4J7j6M%KLKj0jM%%J0oMLj3OkjRLj9
6251hlPL%oKLKpKQnKoLnO%OjlLLrJ0j1J0kMrJ%%MjlkMlQj2NkPlm%Mj6QNpOJNk
6307BrKkKQmjKJ0j2J4j0oRj2J3qJQKrJkJ5k2KLJ0j0KPMj1kJJ1j0jqPPnJlRj1R
6354DpJ0j4RRpoPKmJ1j7KLMlknMQj6RNj0MQjmmj1QjOkNoM%oLj0J2rmJ7rJNjkQ
6405GqLJJjKNj2KnjMKqOJoLnK%%nJ2J4k1J0pJ1rJJ0Lj2LLlkoLJ0oJ7j2LomMmJ1
6455A1rnQNj2KnNKjJ%pmNLoPlOMqJNNj7mJ3mKpJJ2qJLqMKlKOmnKNk%mRoOkl%p
6511fJ4lj3KOj4ONKLOj1%Rj6OkJ4oOj0Ol%mQpMp%n%jOMQojOokjJ6j7Rkm%lJ3j4
$$ plain form
6562 -5 7 -7 -11 0 0 -2 -6 9 0 0 2 4 -4 6 9 9 -3 5 6 15 2 1 -2 1 7 11 13 3 -4 3 3 -2 -7 5 7 -5 -8 -8 -7 -15 -6 -13 -9 -4 -14 0 6 -9
6610 -9 0 4 -7 -3 -2 -13 9 1 3 9 5 9 -1 11 -10 8 6 9 -2 -7 10 -2 3 7 11 3 4 3 -4 0 -2 -4 -6 -8 -13 -8 -8 -8 -1 0 -2 -6 -1 0 3 -5 -3 -2 10 2
6660 2 5 -6 6 2 7 8 1 11 -1 6 6 -1 3 -7 -11 8 -5 -4 7 10 1 2 -4 0 -6 3 -8 -3 -6 -2 -6 -17 -1 -1 4 1 -3 -8 2 14 2 0 8 -4 4 5
6706 5 -6 5 7 10 -3 -3 3 8 -13 -1 3 -7 2 -1 3 -2 -2 -4 -7 -10 6 -7 -1 -8 1 -9 -6 -8 -5 -5 0 -6 -10 -6 0 -9 -12 0 -3 7 6 -1 6 4 3 3 5 5 -2 -7
6756 -7 -1 -2 -3 -3 -2 -4 -3 -14 -13 -3 -2 2 -6 -9 -7 -5 -6 2 -3 -10 3 -5 -14 -6 1 -1 11 1 -7 9 1 6 -1 -6 0 3 0 4 2 5 13 3 7 -9 6 -2 0 4 -4 3 3 -3
6808 -3 1 10 -7 -6 -1 10 -4 5 7 -6 -1 9 13 -1 -1 4 -4 -7 -4 4 -1 4 7 2 2 6 7 7 9 7 20 -1 8 10 13 10 6 1 -5 11 5 1 0 -6 2 5 1 -3 1 -1 5 -1
6860 -1 1 1 -11 -1 4 5 1 12 -1 2 8 5 5 14 1 1 3 -10 9 3 7 9 1 6 6 -10 5 2 13 5 -4 9 -7 -3 -1 0 6 -2 4 2 0 5 -7 3 -4 3 3
6907 3 2 -3 4 10 12 8 9 8 3 -1 3 2 -6 11 3 5 -5 3 2 -2 5 -2 6 3 -4 -7 -9 7 4 8 3 7 8 -3 -1 2 5 -11 -5 -3 1 7 -5 -2 -4 5 4 -3 8 16 1 6 11
$$ packed form
6562eJ2j4mJ1%kmJ5r%KKqJ0L%j2QJRj3jlLOMKj0pP%nnJ2Kj2l%JqRpMNj0J4Oj5
6610iRMj1MJj1K2qKOmMj0J2k1J8kLj1nJ7j2NMMqJjpMkkkknN%%PJkmNJLqKJJ2q
6660BLj1J2mNJpJ0j2P%pMj0mJ9j3JJ1LrJoMoRj1NlMmj1J6%NlmnJ0J2j2kQj2QJ
6706Ej1J1KLj3%ONk1J2Mj0RlMn%kllJ6j3OpRj0LkL%NomMOrlJ2lJ0jpPkj%K%pn
6756gOjj%JkJj1JJ0JMqlKKjQnpJ3qrQPkJ2j0qJ6qNpnOLlMkLQj0Mj6J5qKMqP%o
6808cMRj7JNJ1j4RKj3NJ0Mj4%NqlLQnNLn%MJ%KkJ3k1RKLlmnoJ6omjoQLmmMkOo
6860aK%j2J0NJmJ1j3LOl%Rj3%Kj3J9oMKqN%j6J5lJ1qrJ3j6MKJOqOkkNj2J0pP%
6907CjnPOKmJjnmMjqJ7qKj0QjmPpQlplkJ6lMnMJj1KLLj6OKMOj2LkRjpJ1Qj5NN
$$ plain form
6960 11 9 4 5 2 7 7 8 2 11 6 -8 -2 2 -6 2 2 3 -12 1 -3 -7 -4 2 -11 -1 8 -1 6 -1 -4 -7 3 -6 -2 -6 -2 -6 -7 -3 -3 1 -3 5 1 -6 -2 6 2 0 6 4 12 -3
7013 -3 2 5 8 6 8 -5 -1 4 -6 -6 -1 -1 6 5 -6 1 -7 3 -2 3 5 1 -8 2 -2 -1 5 12 2 11 1 7 9 -6 -1 9 0 8 13 5 4 5 16 -3 10 12 10 3 6
7062 6 6 3 0 10 6 11 6 -1 5 -6 0 -1 -1 3 -2 -7 3 4 10 4 0 5 12 17 9 12 5 9 4 0 6 4 1 1 3 2 0 8 5 12 5 -8 4 -1 -13 1 1 -2 4 3 0 0 8 2
7116 2 0 1 -1 -2 -1 1 -6 2 7 -1 10 -6 11 12 13 10 3 3 0 -4 -2 -2 5 -2 7 8 1 3 3 6 1 10 7 -6 -10 -12 5 1 -1 2 0 3 -11 -3 -7 1 -2 7 -5 4 1 0 -2 -4
7170 -4 3 6 5 9 6 13 -1 2 -3 -6 9 7 0 0 5 6 12 8 -2 2 -5 9 1 -10 4 2 2 -1 0 4 7 7 12 -14 0 -8 3 8 -3 -2 -2 14 1 7 9 24 8
7217 8 -1 2 5 6 -10 2 4 -2 -4 4 1 7 10 -5 4 -4 0 -3 -2 -4 -1 -6 2 -1 1 8 -1 -12 2 -1 3 -10 -1 3 -4 -2 7 6 7 16 10 12 15 12 6 13 3 9 8 6 -6 -3 -6
7270 -6 2 5 -3 2 -5 3 2 1 -9 -14 5 2 -4 1 -7 14 -4 2 1 5 -1 6 -11 -5 -7 2 1 9 4 6 4 3 4 6 3 15 -4 4 13 10 4 1 6 8 8 14 6 5 -5 3 5 1 9
7323 9 6 12 -2 16 -2 -5 0 4 -2 -2 2 -6 -2 7 -7 -5 0 4 10 15 -4 19 7 -4 18 8 10 9 11 0 15 8 0 -1 -11 -3 -2 4 -2 0 -5 -2 -1 -3 4 -6 7
$$ packed form
6960A1knJlN%JoRnj4OMqQ%Jj5J3mmLOj3J0RrPpllJ0rMmMmjM%MmQmpMQmkOkQj5
7013cNLLkKj3MNj0%N%Pjj1PqJ0nNKmrJ0mJOPj0Rj0OKj5NJ0rQNqjJJ1j9J3KkpL
7062F%llJ0mNnpOj1Oj%MnnJ0JOomNPNqLpMnmOkl%KjkQlPpj3J2nj2J4%lOjl%Qo
7116BkJkjJKpQNqJ1j6J7JJlp%lmK%PpRJpK%LnRlj3mkJ7mkLkLj4QmQlRj2Rljkk
7170dPLjMlPj4LnlJ5kp%NJOmj0MpJ4qj1J4k%lJML%Nk6J4qJ1Nj1J%J6j3OKJ5j6
7217HrLLJj6J2KokQlOLj5RqMlJkLnQlKPrj1J4lMj3RMpKRjJRoKLloPj0Ojkj2Ll
7270fQLqNpQjjj0nJ9loNqK1j8OjMoPj7OkRjQnKkjJKlJ2j9QRlolNK%Oqjj0QKmQ
7323IlOj4J8j8lNMo%MqMRj4KNMONj9K3j2j1K2j0KjKj1J5pqjj0QJOoKnLJkPj0J3
$$ plain form
7370 7 0 -2 3 -5 9 -3 -4 4 2 -4 9 2 4 7 5 -5 -2 6 0 6 3 4 0 8 1 0 2 4 0 3 0 12 10 7 -3 2 -4 -4 0 -5 8 -1 -4 -6 -4 -5 3 -2 1 0 3 10 12 3
7424 3 6 6 17 4 10 11 -1 13 12 12 6 15 9 2 12 9 0 -2 3 9 2 6 4 5 5 -1 1 -7 8 -7 1 -3 -2 10 6 -1 5 6 7 2 10 2 -2 15 1 0 5 9 6 6 18
7475 18 7 4 11 8 3 2 1 -3 0 -2 15 -3 14 6 -3 2 3 -15 -5 3 -7 -6 4 -4 -6 8 9 -14 6 -3 4 -5 1 5 -2 2 6 3 14 3 10 13 8 13 12 5 7
7522 7 16 1 13 14 4 8 -2 -2 1 -2 -4 -1 -1 -10 -7 -12 6 1 3 -4 -6 2 9 -4 7 -2 9 11 8 3 2 -12 -10 0 12 4 0 6 9 4 18 9 9 12 6 8 -1 1 9
7571 9 -1 1 -1 -3 4 -5 -4 -5 -8 -9 4 -5 -5 8 -1 -3 -1 -1 14 15 9 1 2 6 6 0 6 3 7 4 12 1 4 3 4 0 3 7 6 7 9 3 -4 3 -5 4 0 -2 8 -1 3 2 -3 -12 -2
7626 -2 -10 -5 -1 -1 6 1 1 1 11 7 0 -5 5 0 6 11 -6 2 0 12 1 4 1 4 6 0 12 0 -4 2 -9 -6 1 -5 -6 -3 -7 -1 -4 3 11 1 -2 -6 -1 3 -2 5 -6 -4 -2
7677 -2 -7 4 1 4 -8 8 5 15 13 -7 6 4 12 7 11 5 -1 5 5 7 2 1 -6 -5 -10 -7 -5 -3 7 8 1 4 -7 -8 0 -1 7 -2 5 -2 -6 5 -1 -3 8 7 3 2 1 3 9
7728 9 5 9 8 2 8 11 9 11 10 6 4 -3 -5 -1 -1 -4 -6 0 0 -7 -3 -3 0 -4 2 2 -2 3 -5 2 5 4 -7 11 4 5 4 5 3 10 7 8 8 10 6 12 22 8 9 11 12 11 21 7 8
$$ packed form
7370GpkNqJ4j2jQkoJ3pKLkj0LQoOlJmQpjKKmLlJ2klj0No%MnJ3rlkKjQnLjLPKr
7424CL%J1j3OJj2J4j%oRopJ0lrkNOpMkJ%oKqJ5j5QmJJ2mpOJJnQqmJ7j4jNMl%J2
7475A8j1lPlnjjmLkJ7j8J7qrNJj8J0Qj0JJ0qkJ4Jk3K0rPrOMpMMlJ1j1PLnNjpK
7522GRj5J2Jj0Mj0%LlkL%rLnJ8nKpkQPj3J1rJ1Klnjj4KJ0J2qmOLnJ4r%LoKrKQ
7571Ij0KkkPrJjljJ3r%J3rkK%J5JoqJM%oOlMlQj1LjJmLMjJKopPqRmkJ0rMjnrJ0
7626bqNM%Pn%%J0mpnJ0nONj7QkJ2j1LlLKoJ2j2mOj1LPojLmOlPQj0lmNMnPj1KK
7677bnJ1lLj2J6lJ0kk0J3kQnMooO%KnjpJnLKKJ0JpLj1jQjQrPpmJ1okJ1jmjjKO
7728ImMjoOLkKjmkpkM%lkO%pM%LmO%mNqPLjj1J8pJjJkPlJ%KmOJ0j4JKJjJ0j4J
$$ plain form
7783 8 -1 0 12 -5 8 13 4 -7 1 5 5 0 0 3 -2 2 -10 4 5 1 6 7 5 7 -2 15 5 6 3 5 12 6 9 5 8 7 14 11 15 5 9 14 10 6 4 5 -1 8 14 1 6
7834 6 -2 -4 -1 9 -5 8 -5 7 3 7 6 6 4 1 10 12 9 1 0 9 6 9 11 4 9 1 5 3 5 -4 8 -5 10 2 9 2 6 6 -8 3 6 -6 7 8 8 5 2 -7 -5
7883 -5 -1 8 17 10 0 7 2 10 -5 13 11 3 14 8 1 6 10 10 14 14 5 12 13 14 7 3 10 3 8 8 -5 3 5 6 -7 1 0 2 1 8 7 10 0 -2 2 -2 -1 -1 7 9 9 12 4 5
7937 5 3 2 14 10 3 17 9 8 -1 3 3 11 4 10 8 0 1 9 8 -7 2 9 -2 1 5 11 -1 -5 3 -2 1 11 10 -6 4 3 -4 1 2 7 5 12 9 7 17 3 7 15 12 0
7987 0 5 7 9 3 9 1 7 1 4 11 5 5 9 3 4 -2 -1 -1 -2 -5 3 -1 11 4 11 -5 1 10 13 6 2 4 10 8 0 11 3 16 14 14 17 15 19 8 11 6 16 5 9 -2 4 3 2
8040 2 8 2 -2 -1 12 -1 -7 1 9 3 8 6 3 13 3 -12 7 10 -9 13 -1 -1 13 -2 2 10 20 6 7 7 15 11 12 6 9 12 12 3 15 14 7 8 1 10 3 -2 -4
8087 -4 5 5 3 -6 2 -6 5 -5 -1 12 6 8 12 10 -1 2 -1 16 21 17 14 15 16 8 4 10 7 9 6 22 17 14 14 14 19 0 1 6 5 13 8 -1 10 0 6 -2 -6 3 1 -2 -1 4
8139 4 3 12 12 3 7 10 16 18 16 19 6 7 6 18 17 17 15 11 15 7 12 8 9 8 8 16 2 5 9 12 9 1 6 -4 10 10 2 7 5 3 8 8 11 2 6 1 7 3 17 12 10 7
$$ packed form
7783HrJJ2j7J3Nrj1QM%n%LnMj2J4JmNJkKrJ7j0JlKPoLmLjPlMj0MNmmkJoROj3N
7834FqkLJ0j4J3j3J2mMj%klRKlqjRlLKpNqMkKrJ2j3J5qPpM%j4J1Lj2J3J%llrK
7883eMRRpj0PnQj5J8kqJ1opNM%M%rPJJpmPpN%j3QKJj3QjKjPjLj0kMmJ%QK%LqJ
7937EkjJ2mpJ4qjrM%QpOkqJQjj5RPj1LMOj2mQnLJ0jj6J0jpNJNkPlkJ0j4MQlj2
7987@NKKoOqOoLPo%MoJoJ%jlQmJ2pPj6ORLpmKOkqJ1qJ3k%LkMj1LnJ0j1Mj1Ojj
8040BOomJJ3j3oQQoNklJ0j0j5J9Lj9K2j4%J4j5MQJ0j4J%QmJoLL%rJ2jpJpRpnk
8087dR%krQqJ1j0MJ3oKMkj1LlJ7NmlJJqmOlKlJ6nl%%Nj9JNjQnrJ1j0OqmRklJN
8139DjR%rMLOKkLj3JjJ2j%kmMqNmJj%Qj4LMLlqNj0J4%qNkkN%LrMnOmJ4nkl
8191G
$$ Imaginary data points
##PAGE= N=2
##DATA TABLE= (X++(I..I)), XYDATA
$$ plain form
0 0 0 0 0 0 0 0 0 0 0 0 0 -8 8 -8 8 -16 16 -24 24 -32 40 -48 56 -64 80 -88 104 -120 136 -160 184 -208 236
33 236 -268 304 -340 382 -428 479 -534 594 -660 732 -812 898 -990 1092 -1207 1330 -1465
50 -1465 1611 -1778 1959 -2162 2388 -2644 2934 -3267 3654 -4109 4655 -5323 6162 -7253 8735
65 8735 -10872 14232 -20302 34657 -138177 25857 293290 -163823 -172661 235983 119345
76 119345 -299067 -32265 280816 -47803 -247477 148876 183807 -217600 -125312 258370
86 258370 46775 -247948 39108 220628 -132768 -180602 191168 129872 -215078 -48043
96 -48043 215475 -39236 -207756 111292 176030 -155303 -117179 184813 41171 -199756 28563
107 28563 192892 -87003 -158341 132598 104142 -165823 -41246 181331 -17691 -172760
$$ packed form
0@%%%%%%%%%%%qJ6j6J6k4L2m0M8n6P2q8J04j20J44j68J92k24K56k96L44l92M44
33B36n04N72o44P22q10R07j013J128j254J392j544J710j888K082k299K537k795
50a465L076l389L737m121M550n032N578o201O921p763Q764r978J1485j3415J5988
65H735j9607K5104l4534N4959j72834J64034K67433m57113q838M08644j16638
76A19345m18412K66802L13081l28619j99674L96353L4931m01407R2288L83682
86B58370k11595k94723K87056J81520l53396m7834L71770o1296l44950J67035
96d8043K63518k54711j68520L19048O4738l31333L8124L01992j43642k40927K28319
107B8563J64329k79895p1338K90939k8456k69965J24577K22577j99022j55069
$$ plain form
117 -172760 69997 139830 -114998 -92698 147870 41663 -160234 8469 148619 -58082
127 -58082 -120514 100813 83882 -127451 -41064 134972 -5131 -125633 49800 104466 -85196
138 -85196 -74218 106101 36416 -112629 4323 106409 -42146 -89805 70953 63837 -88098
149 -88098 -30466 94868 -4358 -91121 35385 76879 -59225 -53571 74619 24719 -81406
160 -81406 4130 77932 -29881 -64645 50564 44212 -64113 -19939 69469 -4071 -65321 25887
172 25887 53122 -43478 -35743 54364 15542 -57674 4486 53032 -22639 -42301 36784 27916
184 27916 -44668 -11279 46242 -5187 -41712 19715 32704 -30407 -20931 35698 7305 -36254
196 -36254 5840 32285 -16904 -24735 24702 15068 -28216 -4060 28216 -6078 -24643 14306
$$ packed form
117a72760K42757O9833k54828K2300K40568j06207k01897J68703J40150k06701
127e8082o2432K21327j6931k11333Q6387J76036j40103j20502J75433N4666j89662
138h5196J0978J80319o9685j49045J16952J02086j48555m7659J60758p116j51935
149h8098N7632J25334r9226q6763J26506M1494j36104N654J28190m9900j06125
160h1406Q5536P3802j07813l4764J15209o352j08325M4174Q9408p3540o1250R1208
172B5887K7235r6600P735R0107l8822p3216O2160M8546p5671j9662P9085q868
184B7916p2584L3389N7521n1429l6525O1427J2989o3111R476N6629k8393m3559
196c6254M2094K6445m9189p831M9437r634m3284K4156L2276l4294j8565L8949
$$ plain form
208 14306 18292 -19867 -10361 22097 1700 -21569 5905 18246 -11703 -12756 15450 6469 -16486
221 -16486 -29 15355 -5281 -12167 8950 7576 -10962 -3013 10685 -1328 -8991 4380 6065
234 6065 -5961 -2612 6222 -264 -4818 2481 2656 -3402 -175 2960 -2111 -1569 3315 -841 -3529
249 -3529 3281 2451 -5231 -98 6481 -2734 -6107 6039 4570 -8713 -1585 10321 -2481 -10594
263 -10594 6742 8880 -10908 -5610 13910 836 -15217 4916 14647 -10510 -11636 15553 6714
276 6714 -18921 -259 19963 -7110 -18602 14003 14343 -19872 -7894 23553 -104 -24354 8907
289 8907 22276 -16938 -16916 23553 9203 -27544 143 28186 -10154 -25526 19249 19359 -26564
302 -26564 -10533 30939 66 -31558 11085 28533 -21168 -21693 29238 11962 -34089 -435
$$ packed form
208A4306L986l8159R506L2458k0397k3269K7474J2341k9949j053K8206q981k2955
221a6486J6457J5384k0636o886K1117j374j8538P949J3698j2013p663J3371J685
234F065j2026L349Q834o486m554P299J75o058L227L135n071N42M884m156k688
249c529O810q30p682N133O579r215l373J2146j469j3283P128J1906j2802q113
263a0594J7336K138j9788N298J9520j3074j6053K0133R731k5157j126K7189q839
276F714k5635J8662K0222k7073j1492L2605L40l4215J1978L1447k3657k4250L3261
289H907J3369l9214K2M0469j4350l6747K7687K8043l8340j5372M4775J10m5923
302b6564J6031M1472l0873l1624M2643J7448m9701n25N0931j7276m6051L3654
$$ plain form
314 -435 34819 -11823 -31515 22905 24068 -31768 -13457 37079 882 -37934 12398 34355 -24425
327 -24425 -26317 33939 14908 -39613 -1447 40486 -12654 -36622 25365 28137 -35303 -16115
339 -16115 41178 2122 -42029 12457 38026 -25529 -29313 35715 17072 -41738 -2831 42682
351 42682 -11972 -38739 25232 30056 -35627 -17811 41882 3501 -43041 11455 39273 -24961
363 -24961 -30707 35639 18439 -42203 -4006 43606 -11179 -39971 25004 31417 -35966 -19013
375 -19013 42742 4360 -44245 11067 40575 -25095 -31911 36128 19354 -42907 -4604 44321
387 44321 -10837 -40549 24746 31850 -35596 -19364 42154 4802 -43454 10274 39682 -23832
399 -23832 -31184 34335 19022 -40685 -4961 41961 -9622 -38352 22758 30210 -32948 -18521
$$ packed form
314d35L5254m6642j9692N4420J163n5836J8311N0536l6197l8816N0332K1957n8780
327b4425j892O0256j9031n4521L8166M1933n3140k3968O1987K772o3440J9188
339a6115N7293l9056m4151N4486K5569o3555l784O5028j8643n8810L8907M5513
351D2682n4654k6767O3971M824o5683J7816N9693l8381m6542N4496K7818o4234
363b4961n746O6346j7200o0642L8197M7612n4785k8792O4975O413o7383J6953
375a9013O1755l8382m8605N5312K9508o5670o816O8039j6774o2261L8303M8925
387D4321n5158k9712O5295P104o7446J6232O1518l7352m8256N3728K9408o3514
399b3832p352O5519j5313n9707L5724M6922n1583k8730O1110P452o3158J4427
$$ plain form
411 -18521 39219 4956 -40555 9215 37192 -22019 -29384 32071 18055 -38285 -4766 39726
423 39726 -9133 -36446 21777 28792 -31678 -17594 37786 4472 -39127 9244 35792 -21657
435 -21657 -28129 31252 17029 -37058 -4168 38164 -9152 -34722 21096 27142 -30215 -16337
447 -16337 35629 3941 -36507 8766 33093 -20071 -25819 28636 15554 -33710 -3802 34566
459 34566 -8155 -31322 18897 24517 -27036 -14837 31967 3726 -32873 7686 29911 -17985
471 -17985 -23500 25874 14278 -30708 -3609 31692 -7403 -28888 17380 22721 -25039 -13808
483 -13808 29685 3497 -30599 7111 27833 -16685 -21853 23964 13256 -28300 -3397 29036
495 29036 -6635 -26307 15589 20600 -22318 -12523 26281 3364 -26883 5906 24312 -14114
$$ packed form
411a8521N7740l4263m5511M9770K7977n9211p365O1455j4016n6340L3519M4492
423C9726m8859k7313N8223P015o0470J4084N5380l3314m3599M8371K6548n7449
435b1657o472N9381j4223n4087L2890M2332m7316k5570N5818O046n7357J3878
447a6337N1966l1688m0448M5273K4327n3164n748N4455j3082m9264K9908L8368
459C4566m2721k3167N0219N620n1553J2199M6804k8241l6599M0559K2225m7896
471a7985n515M9374j1596m4986K7099L5301l9095k1485M6268N341m7760J1231
483a3808M3493k6188l4096L7710K0722m4518n168M5817j0708m1556K4903L2433
495B9036l5671j9672M1896N011m2918R795L8804k2917l0247L2789J8406l8426
$$ plain form
507 -14114 -19049 20287 11665 -23901 -3292 24516 -5138 -22237 12697 17508 -18375 -10807 21792
520 21792 3169 -22474 4577 20478 -11610 -16204 16911 10046 -20168 -2991 20852 -4221
532 -4221 -19021 10746 15069 -15688 -9336 18679 2786 -19291 3865 17534 -9834 -13824 14285
545 14285 8578 -16919 -2625 17376 -3326 -15704 8645 12366 -12511 -7666 14755 2463 -15076
558 -15076 2701 13607 -7245 -10728 10549 6709 -12461 -2272 12736 -2095 -11490 5944 9097
571 9097 -8751 -5739 10382 1995 -10658 1692 9609 -4955 -7593 7287 4762 -8635 -1622
584 -1622 8862 -1440 -7915 4164 6199 -6002 -3787 7049 1209 -7099 1255 6250 -3371 -4768
598 -4768 4754 2813 -5415 -768 5319 -1051 -4502 2554 3325 -3433 -1847 3757 389 -3574 819
$$ packed form
507a4114m935L9336q622l5566K0609K7808k9654j7099L4934M811l5883P568L2599
520B1792j8623k5643K7051J5901l2088m594L3115o865l0214J7177K3843k5073
532d221j4800K9767M323l0757O352K8015j5893k2077K3156J3669k7368l990K8109
545A4285n707k5497J4294K0001k0702j2378K4349L721k4877M845K2421j2292j7539
558a5076J7777J0906k0852l483K1277l840j9170J0189J5008j4831r395J7434L153
571I097j7848L012J6121q387j2653J2350P917j4564k638J4880k525j3397P013
584a622J0484j0302o475J2079K035j2201K215J0836n840q308Q354M995r621j397
598d768R522j941q228M647O087o370l451P056P71o758J586N604l368l963M393
$$ plain form
613 819 2840 -1755 -1969 2159 922 -2182 -28 1880 -611 -1274 1027 690 -999 -71 776 -323 -373
630 -373 446 -127 -347 502 -10 -708 534 689 -1035 -293 1492 -264 -1617 1040 1483 -1810 -997 2398
648 2398 147 -2792 863 2720 -2005 -2229 3030 1331 -3707 -10 4004 -1404 -3738 2849 2938 -4079
664 -4079 -1652 4833 -46 -5097 1821 4665 -3567 -3588 5007 2011 -5848 64 6096 -2159 -5512 4188
680 4188 4230 -5833 -2338 6810 -41 -7037 2488 6351 -4803 -4826 6670 2636 -7741 63 7964
695 7964 -2847 -7148 5423 5374 -7475 -2912 8605 -111 -8789 3145 7830 -5935 -5873 8116
709 8116 3161 -9279 72 9408 -3320 -8345 6267 6255 -8503 -3388 9725 26 -9851 3383
723 3383 8755 -6415 -6574 8783 3625 -10062 -118 10210 -3409 -9129 6594 6885 -9096 -3832
$$ packed form
613H19K021m595k14M128j237l104K154J908k491o63K301l37j689R28Q47j099n0
630c73Q19n73k20Q49n12o98J242J55j724P42J785j756j353K657M43l293Q13L395
648B398k251k939L655J857m725k24N259j699n038L697M014n408k334O587Q9p017
664d079K427O485m879n051O918K844q232k1Q595k996p859N912O032q255l353R700
680D188M2j0063L495R148o851o996R525L863j1154k3J1496m034j0377P804P901
695G964j0811m301J2571m9j2849M563J1517q716q678J1934M685j3765O2J3989
709H116m955j2440R351R336j2728n025J4612j2j4758N115J3113r699r877J3234
723C383N372j5170j59J5357n158j3687R944J0328j3619n720J5723K91j5981N264
$$ plain form
737 -3832 10470 175 -10679 3517 9535 -6866 -7225 9501 4018 -10950 -184 11140 -3672
750 -3672 -9941 7155 7509 -9835 -4161 11314 225 -11457 3742 10200 -7250 -7668 9951 4294
764 4294 -11373 -319 11511 -3607 -10223 7106 7714 -9769 -4372 11196 478 -11342 3405
777 3405 10120 -6859 -7705 9517 4439 -10999 -604 11187 -3267 -10055 6707 7690 -9420 -4458
791 -4458 10936 643 -11186 3249 10070 -6726 -7702 9458 4466 -10981 -603 11210 -3279
804 -3279 -10067 6755 7682 -9455 -4411 10927 598 -11086 3237 9919 -6601 -7538 9191 4346
818 4346 -10578 -662 10704 -3029 -9580 6250 7292 -8718 -4255 10032 753 -10182 2765
831 2765 9147 -5828 -6999 8234 4138 -9533 -779 9739 -2591 -8778 5598 6762 -7931
$$ packed form
737c832J4302j0295j0854J4196O018j6401l59J6726n483j4968J0766J1324j4812
750c672o269J7096L54j7344N674J5475j1089j1682J5199O458j7450m18J7619n657
764D294j5667J1054J1830j5118o616J7329O08j7483N397J5568j0718j1820J4747
777C405O715j6979q46J7222n078j5438J0395J1791j4454o788J6762R83j7110M962
791d458J5394j0293j1829J4435O821j6796r76J7160m992j5447J0378J1813j4489
804c279o788J6822R27j7137N044J5338j0329j1684J4323O682j6520r37J6729m845
818D346j4924R916J1366j3733o551J5830J042j6010M463J4287r279j0935J2947
831B765O382j4975j171J5233m096j3671Q754J0518j2330o187J4376J164j4693
$$ plain form
844 -7931 -3969 9254 732 -9440 2596 8526 -5508 -6509 7798 3793 -9047 -600 9204 -2625
858 -2625 -8251 5444 6260 -7599 -3599 8756 534 -8839 2545 7880 -5182 -5958 7189 3440
872 3440 -8238 -562 8282 -2295 -7380 4742 5616 -6595 -3272 7598 652 -7654 2010 6884
886 6884 -4274 -5255 6036 3139 -6991 -675 7115 -1789 -6412 3949 4949 -5623 -2957 6560
900 6560 648 -6682 1688 6031 -3728 -4635 5306 2742 -6178 -564 6264 -1619 -5634 3503 4285 -4939
916 -4939 -2524 5696 526 -5735 1485 5137 -3151 -3888 4439 2305 -5081 -511 5116 -1252 -4560
931 -4560 2741 3483 -3855 -2076 4454 531 -4455 1048 4029 -2329 -3075 3339 1881 -3882 -508 3921
947 3921 -872 -3547 2045 2741 -2936 -1652 3435 458 -3460 771 3120 -1795 -2386 2577 1448 -2978
$$ packed form
844g931L962J3223q522j0172J2036N930j4034j001J4307m005j2840Q447R804j1829
858b625n626J3695Q16j3859M000J2355q222r373J1384N335j3062p76J3147l749
872C440j1678P676Q844j0577n085J2122Q74j2211L323J0870o946q306R664M874
886F884j1158r81J1291k897j0130O316P790q904m623J0361J000j0572K666R517
900F560n912p330Q370M343r759r07R941k564q920N614O828p883m015R137P82r224
916d939K415Q220n170o261P220L652q288p37Q327k134p386M570N627o368l308
931d560P301P42p338J779O530l923m986N503K981o358p46O414j458n763L374M429
947C921m793k675N592O96n677J284N087k977l918M231K349m915n91M963j129m426
$$ plain form
963 -2978 -379 2987 -657 -2656 1535 2030 -2131 -1194 2479 352 -2409 541 2153 -1177 -1610 1673
979 1673 962 -1883 -274 1832 -373 -1585 869 1183 -1183 -682 1333 212 -1266 275 1085 -584
995 -584 -762 781 415 -848 -96 754 -194 -594 376 394 -436 -137 445 -14 -290 184 189 -183 -10 155 -94
1016 -94 -44 151 -89 -127 236 35 -312 152 340 -314 -227 518 82 -607 171 623 -435 -536 666 305 -881
1037 -881 -12 953 -347 -902 710 713 -1004 -367 1229 -44 -1276 511 1159 -965 -871 1321 424 -1553
1055 -1553 110 1598 -673 -1395 1245 1052 -1638 -456 1916 -166 -1891 866 1668 -1499 -1204 1963
1071 1963 520 -2246 231 2215 -1028 -1904 1727 1357 -2240 -589 2506 -270 -2454 1123 2090 -1904
1087 -1904 -1494 2423 654 -2709 269 2662 -1174 -2269 2012 1629 -2565 -718 2880 -241 -2822
$$ packed form
963b978K599L366l644j999M191M95m161R37L673k127k761K950J612l330m33L283
979A673p11k845J609K106k205j212K454L14k366N01K015j121j478J541Q10j669
995e84j78J543l66j263P52Q50r48m00R70J8q30K99N82m59k76M74Nl72J73J65k49
1016i4N0J95k40l8L63k01l47M64J88o54Q7P45m36o89P78M52j058j01J202l61j186
1037h81Q69R65j300n55J612Lj717O37J596j273j232J787O48k124R4K192q97j977
1055a553J663J488k271p22K640j93k690J182K372k082j725K757Q02l167K95L167
1071A963j443k766K477J984l243q76L631l70l597J651L095k776k184L577R67l994
1087a904M10L917j769l363K978K393l836j095M281l83m194J847L598l121k581
$$ plain form
1102 -2822 1254 2413 -2114 -1721 2743 774 -3075 300 3016 -1335 -2563 2304 1832 -2948 -782
1117 -782 3283 -360 -3208 1493 2713 -2487 -1894 3168 789 -3487 427 3385 -1592 -2836 2627
1132 2627 1987 -3296 -814 3632 -411 -3478 1630 2949 -2651 -2035 3352 894 -3665 372 3568
1147 3568 -1575 -2997 2632 2129 -3361 -955 3705 -304 -3605 1548 3077 -2632 -2198 3379 1021
1162 1021 -3756 275 3682 -1559 -3150 2669 2254 -3444 -1055 3829 -292 -3753 1571 3205 -2714
1177 -2714 -2285 3501 1086 -3855 266 3791 -1530 -3197 2659 2322 -3424 -1117 3798 -195 -3718
1192 -3718 1433 3193 -2522 -2324 3279 1188 -3640 84 3611 -1298 -3134 2356 2308 -3117 -1222 3527
1208 3527 -1 -3513 1187 3064 -2251 -2277 3037 1226 -3428 -12 3441 -1152 -3001 2222 2224 -2979
$$ packed form
1102b822M076J159m527L93M464j969l849L375K716m351j228M867m72m780K166
1117g82M065l643k848M701J220n200N93N062k379m276L914K958m977j244N463
1132B627o40n283K482M446m043l067N108J319n600O16N387k458m559M037L196
1147C568n143j422N629n03n490K406M660m009l301N153J529n709M34N577k358
1162A021m777M031L407n241j591N819m15n698K389M884m121l461N324J634n919
1177b714M29N786k415m941M121L525n321j667N856l37n746K307M915l993l523
1192c718N151J760n715J98N603k091m828L724L527m909j836N490m8n425J895M749
1208C527l528l512M700J877n315k6N314j811m654L416L453m593j849N223Kn203
$$ plain form
1224 -2979 -1179 3367 -6 -3346 1169 2931 -2172 -2144 2918 1142 -3254 18 3239 -1104 -2801
1239 -2801 2079 2066 -2750 -1097 3084 17 -3055 1004 2650 -1901 -1966 2543 1073 -2848 -68 2844
1255 2844 -874 -2479 1737 1870 -2338 -1030 2651 97 -2655 824 2350 -1620 -1739 2220 972
1270 972 -2504 -51 2527 -797 -2183 1586 1641 -2121 -872 2389 14 -2383 802 2076 -1507 -1510
1286 -1510 2031 798 -2248 5 2214 -749 -1921 1387 1393 -1851 -749 2045 28 -2026 658 1752
1302 1752 -1228 -1289 1641 727 -1825 -65 1831 -530 -1588 1071 1180 -1450 -664 1637 87 -1630
1318 -1630 485 1431 -941 -1047 1313 596 -1471 -62 1477 -428 -1291 876 952 -1181 -531 1319 41
1335 41 -1324 396 1127 -779 -827 1038 450 -1144 -31 1144 -330 -968 645 728 -861 -405 947
$$ packed form
1224b979J800M546l373l340M515J762n103K8N062j776m396L272L221m343j697
1239b801M880j3m816J653M181l067l072M059J646m551o5M509j470l921K780K912
1255B844l718j605M216J33m208J308L681k554k752L479J526l970j19L959j248
1270I72l476K453K578l324j386L769N5l762J249L261k375k397L185J274l583l
1286a510L541j233l046K253K209k963j172L308Ol244J102K794k017k054K684J094
1302A752k980o1K930r14k552J760J896k361j058K659J09k630P86K301j550j717
1318a630K115R46k372j06K360p17k067J409J539j905q63K167P6k133O50J850j278
1335D1j365J720P31j906m8J865n88j594J113J175j474o38J613Q3j589M56J352
$$ plain form
1352 947 68 -932 249 807 -496 -595 693 355 -746 -77 735 -163 -646 374 484 -508 -296 563
1370 563 73 -554 112 483 -245 -372 360 235 -394 -76 370 -62 -333 150 233 -215 -145 220 62 -203 17
1391 17 160 -37 -92 72 75 -38 -27 39 36 5 -46 -26 81 31 -122 2 148 -50 -154 133 165 -194 -108 267 31
1416 31 -308 68 302 -198 -285 286 190 -385 -86 431 -77 -437 247 391 -379 -273 497 104 -565 96 559
1437 559 -296 -484 473 333 -608 -121 695 -90 -659 361 576 -544 -383 724 155 -778 120 756 -394
1456 -394 -652 615 449 -783 -184 861 -111 -840 401 716 -659 -495 844 214 -932 104 925
1473 925 -423 -777 701 553 -913 -237 1019 -100 -968 472 853 -748 -568 980 253 -1067 127
1490 127 1045 -487 -878 808 611 -1034 -252 1135 -145 -1091 525 910 -847 -620 1068 252 -1173
$$ packed form
1352I47q79j000J181N58j303r9J288l38j101O69Q12q98m83J020J10r92K12Q59
1370E63m90o27O66L71p28j27P32j25o29L18M46m32k71M83Q3m48P0L65j58k65K20
1391A7J43j97n5J64Lj13J1O6ll1n1K0J07n0j53J24J46j98j04K87L2l59Q6L75k36
1416C1l39L76K34n00q7N71r6n75K99N17n08l60O84J44p70J06P70l93o69O61M63
1437E59q55j88R57j40r41M87Q16p85n69J020K15j120J61J107n69r33Q98O36j150
1456c94k58J267j66j232N99J045r72p29J241L15j375J64J339o30j146J036Q21
1473I25j348l54J478j48j466O76J256j119q68J440L81j601J80J548p27j320J194
1490A27R18j532l91J686j97j645P82J387j280r46J616L85j757K27J688q16j425
$$ plain form
1507 -1173 140 1114 -541 -941 849 637 -1082 -266 1180 -134 -1119 538 945 -858 -641 1098 289
1524 289 -1186 142 1137 -529 -957 881 658 -1103 -257 1224 -154 -1160 589 970 -927 -646 1156
1541 1156 227 -1262 197 1191 -639 -984 973 637 -1209 -218 1291 -237 -1218 668 987 -1023 -641
1558 -641 1231 213 -1297 235 1226 -644 -990 1011 656 -1205 -230 1308 -194 -1206 638 1007
1574 1007 -964 -657 1202 255 -1277 189 1214 -600 -1010 946 668 -1180 -265 1286 -185 -1203
1590 -1203 611 993 -963 -663 1178 237 -1264 191 1198 -616 -985 947 660 -1169 -238 1252
1606 1252 -190 -1170 607 971 -924 -631 1137 248 -1207 178 1150 -553 -933 874 652 -1065 -257
1623 -257 1167 -124 -1101 498 920 -813 -640 1003 278 -1096 70 1051 -452 -900 749 625 -950
$$ packed form
1507a173J313R74j655m00J790k12j719Q16J446j314r85J657M07j803K17J739q09
1524B89j475J328R95j666m28J838k23j761Q46J481j378j006J749L81j897K81J802
1541A156r29j489J459R94j830l45J957l36j846R91J509j528r81J886L19k010L82
1558f41J872j018j510J532R91j870l46K001l55j861R75J538j502j012J844L69
1574A007j971L07J859r47j532J466J025j814m10J956k78j848R15J551j471j018
1590a203J814L82j956L00J841r41j501J455J007j814l69J932k87j829R31J490
1606A252j442r80J777L64j895K93J768q89j455J385R72j703l80J807k22j717Q08
1623b57J424j291r77J599M22j733J73J643p25j374J166R81j503m48J649j24j575
$$ plain form
1640 -950 -279 1063 -75 -1013 440 851 -726 -582 924 263 -1001 91 964 -411 -798 699 560
1657 560 -840 -224 949 -68 -880 398 756 -632 -522 792 230 -860 54 830 -327 -690 566
1674 566 490 -704 -236 769 -33 -755 280 634 -499 -449 644 212 -698 27 683 -259 -555 456 407
1693 407 -581 -184 644 -32 -605 260 509 -416 -353 540 161 -577 46 549 -237 -447 394 313 -491 -134 523
1714 523 -48 -492 222 395 -353 -284 424 128 -460 33 428 -183 -357 298 249 -362 -116 398 -18 -366 147
1735 147 303 -228 -200 316 119 -321 23 317 -113 -264 210 197 -242 -76 270 -9 -266 95 217 -182 -163
1756 -163 204 63 -219 8 210 -77 -168 128 127 -152 -54 159 -5 -156 41 124 -76 -92 93 57 -82 -12 97
1779 97 -1 -74 36 55 -30 -27 39 25 -18 -12 29 15 -20 -15 25 28 -26 -16 51 25 -60 -13 83 -4 -85 37 89 -70 -76 97 50
$$ packed form
1640i50O71J342j138r38J453M11j577J44J506o61j264J092Q73j375l87J497j39
1657E60j400O16J173j017q12J278L58j388J10J314n62j090R14P76j157l63J256
1674E66p6j194M68J005q02p22J035L54j133N0J093m32r10P25O56r42k96J011m9
1693D07r88L97Q28o76n73Q65K49r25O3Q93l79p38O23N03p86k10Q41q1q04L57O57
1714E23n71m44P14J73p48O9P08k96n88M93L95o11j74O55m9o11K46N14m16l48N13
1735A47J56n31K8N16j97m40L44K94m30j51M74j3m39J66L46k79k57L61J22l99J9
1756a63L67j41k82K27K02k87r1K96jk79R8K13j64j51J97Q3k00j6J85l6j39P0J09
1779I7r8p3J10J9q5LO6j4m3OM1j4l5NM0Ln4J0O7k6q5M7R6q7q1J22N2j59oJ73m7
$$ plain form
1810 50 -127 -2 145 -34 -135 83 128 -130 -81 193 41 -202 37 214 -103 -166 187 139 -215 -46 263 -25
1832 -25 -245 122 231 -195 -159 262 78 -297 9 298 -120 -261 207 188 -291 -113 326 -5 -336 120 302
1853 302 -238 -235 316 138 -367 -3 379 -127 -339 257 273 -330 -142 411 19 -407 141 379 -250 -288 359
1874 359 171 -418 -20 447 -126 -402 256 319 -375 -205 451 48 -469 110 429 -256 -347 378 212 -461 -62
1895 -62 469 -106 -441 249 372 -369 -229 465 83 -485 96 468 -242 -360 386 251 -463 -77 485 -93
1915 -93 -458 259 377 -376 -225 476 75 -489 104 449 -254 -370 382 226 -466 -68 481 -85 -448 244
1935 244 367 -371 -245 450 80 -487 82 455 -240 -364 358 241 -434 -79 470 -61 -428 240 363 -348
1955 -348 -222 438 81 -454 94 442 -232 -342 362 225 -433 -79 460 -88 -432 234 336 -356 -213 440
$$ packed form
1810E0j77J25J47j79j01K18M5k58M9K74j52k43K39J77l17o3L53m8l54J69L09k88
1832b5k20L67J09m26L6M21j84l75L06K89m18j41M68j9m79J78M39l31l31M56J82
1853C02n40LN51j78n05L64L82n06k12N96J6o03J88N53l92m26N48K38o29l8O47
1874C59j88n89L98M67n73k76O58O3o94J70O56m03n17N79L19o85r1P25j66o73L99
1895f2N31n75l35O90J23p41J40O94l82n68N81L72p10j18P46j35p14L86N62n78
1915i3l65P17J18p53J51P01m01n64N93L45p03j16P52j56o92L98N49n66l63O92
1935B44J23p38J26O95l70n67N69L73o95j24P22j17o75L55N49n31l67O68J23p11
1955c48J26O60l57n35N48L48o74j10P04j37o58L54N39n48l44O66J02o92J43O53
$$ plain form
1975 440 59 -460 96 404 -241 -332 351 220 -423 -68 449 -79 -411 239 332 -331 -199 403 81 -415 76
1996 76 410 -197 -323 313 216 -387 -77 423 -65 -386 197 324 -307 -198 375 68 -395 69 376 -200 -309
2017 -309 288 187 -367 -64 377 -69 -349 196 285 -276 -178 350 65 -357 70 348 -168 -267 277 179 -329
2038 -329 -62 362 -50 -310 170 278 -248 -165 321 74 -322 43 321 -140 -253 238 183 -286 -71 304 -31
2059 -31 -303 126 242 -204 -162 254 81 -265 28 271 -107 -221 190 158 -231 -54 262 -13 -225 105 208
2080 208 -161 -124 217 69 -211 12 213 -97 -170 136 120 -173 -55 200 -14 -184 77 149 -127 -103 150 48
2102 48 -171 1 148 -69 -135 93 83 -137 -38 125 -12 -120 64 107 -76 -57 110 35 -104 16 112 -44 -71
2125 -71 86 49 -92 -11 103 -8 -82 42 60 -71 -31 61 0 -84 8 56 -40 -44 52 11 -67 2 51 -20 -44 31 30 -40
$$ packed form
1975D40l81n19N56L08o45r1O83j31o43L55N17n28l32O50R3o63J32O02l22m96M91
1996G6L34o07j26O36r7o03L10N00m88l21N83J27o31J09N73l07m63M64L07n76j09
2017c09N97j01n54L03M41m46k80N45Q9n61R8N28k85m22M27K78n16r9N44r8n08
2038c29K67M24m12k60M80J08n26Q3M86k47l96L65K78m61j13M91n5m69K15L75l35
2059c1k72M29J16m46M2M16j73l46K93K43l78j14M11l2l89J77L16k75k12L30J03
2080B08l69L7L41j48k80K23K01l10p3L06j6k93J18K55k14j70K61P2k76K4K53j02
2102D8k19J72J47k17o6K28j0k20R9J63j37j08J84M3j83J9J67p5j39J20R6j56k7
2125g1J57l7j41Q1J14j11p4J24J8j31M0R2o1q4R2M8r6mR6m1p8O9M9p1k4P5jp0
$$ plain form
2153 -40 -1 36 -10 -34 15 16 -32 -1 33 -4 -23 17 22 -13 2 46 9 -18 27 30 -2 2 27 -11 -20 20 19 -31 -1 22 -16 -27 25
2186 25 11 -37 6 20 -23 -28 23 23 -27 -1 45 -16 -24 39 30 -26 -6 50 -4 -60 35 45 -40 -10 65 17 -58 29 77 -42 -38 62
2218 62 38 -83 6 72 -16 -67 49 49 -87 -31 77 -12 -95 44 75 -78 -65 92 37 -100 2 113 -47 -93 91
2243 91 68 -99 -32 128 -10 -120 54 117 -77 -71 126 32 -130 27 132 -49 -103 102 89 -140 -46 147 0
2266 0 -147 66 127 -104 -93 139 41 -162 6 147 -74 -140 107 99 -162 -59 177 -1 -166 64 152 -125 -101
2289 -101 172 60 -186 4 184 -65 -151 125 122 -158 -61 194 0 -185 70 171 -120 -122 158 68 -187 -11
2311 -11 193 -64 -172 114 129 -167 -74 184 5 -194 47 170 -114 -147 157 88 -178 -18 199 -46 -177 106
2333 106 143 -150 -78 184 30 -183 46 173 -100 -132 146 81 -175 -16 180 -45 -171 93 124 -151 -90 164
$$ packed form
2153d0L9L7m6k4M9Jm8L1L4l7j9M0Nl5J5M4l7k7M5Ll2MK5l8rM0jn0L0K3l8j1N2
2186B5j4m8M3J4m3nN1%n0K6M6o1qO3rn6K0N6n4n6R5J0q5L0P5m8p5Q7M8j19MJ00
2218F2k4j21Q9O6q8n1J16%j36N6J08q9q3J39L1j53J3J57n5j37J02J11j60m6J84
2243I1k3j67O7J60j38j10J74O3j94OJ97r4j62J57J05j81n4K05j3k29R4J93j47
2266@j47K13O1k31J1K32r8k03J68J41k21o6K47qk61J03K36j78j65K30Q8k77K4
2289a01K73j12k46J90J80k49q6K76lk80R7K55j94j85K55J01k91kK80r0k55J76
2311a1K04k57j08K86J5k96R3K58j79j99K41J23k84l3L04o9k66J60K17k45j31K83
2333A06L7k93P2K62j54k13K29J27k73l2K78o5k56J59J96k25j26K64L1k75O1K54
$$ plain form
2355 164 15 -186 42 159 -91 -137 131 79 -171 -24 167 -38 -160 89 132 -133 -77 161 35 -158 31
2376 31 164 -74 -119 130 78 -144 -11 166 -32 -140 91 123 -115 -59 153 27 -151 20 141 -77 -110 126
2398 126 66 -148 -30 144 -37 -149 72 112 -117 -61 132 28 -137 26 124 -73 -85 114 69 -121 -25 140
2420 140 -19 -124 79 102 -95 -72 129 29 -124 31 130 -48 -105 106 56 -130 -32 113 -28 -122 64 94 -87
2443 -87 -56 109 5 -124 16 110 -63 -93 67 59 -106 -21 111 -6 -103 56 92 -66 -42 112 33 -93 23 118
2467 118 -34 -82 73 67 -76 -29 98 2 -77 31 71 -59 -49 66 22 -83 -3 82 -28 -70 49 51 -62 -23 59
2492 59 0 -73 15 50 -28 -46 48 18 -48 -7 56 -11 -60 19 41 -32 -25 50 12 -38 8 46 -19 -27 26 27 -23 -12 26 4 -30 5
2524 5 10 -16 -18 5 10 -31 -12 17 5 -18 13 13 -18 -10 3 -5 -2 -1 1 1 -12 5 6 -4 -4 -1 4 7 -1 13 12 -5 -16 8 6 -8 -12 20 1 -12
$$ packed form
2355A64j49k01K28J17k50m6K68n2k50J47J91k05j22K49M3k65N6K38j26j93J89
2376C1J33k38m5K49n2k22J33J77j98j08K31L2k38N6K12j26j78J71J21k18l3K36
2398A26o0k14J18J74j81j12K21M0k29N6J93j04j65J63R8j97j2J99m5j90R6J65
2420A40j59j05K03K3j97K3K01j00j53J55R9j78n7K11n0j86R8J45j41r4J86L0j81
2443h7L1J65j04j29J40R4j73l0J60qj65Q5J32j17r7J59L6j58K4J54p9j26J16R5
2467A18j52m8J55oj43M7J27r6p9J08M0j30J0J15m4j05Q0Q5j10m2J19Kj13L9Q2
2492E9n9p3Q8L5p8j8R4l0o6M1O3o7m9P9K2p3PP5l8n0M6L8o5qN3Jn0J1L8k2l4L5
2524ENk6kK3Nm1J9K9j2k3L1%l1QJ3qLJK%j3J7Jj0%LNLqJ4jj7j1K4kj4mL2j9j3
$$ plain form
2564 -12 -3 13 -1 -25 6 17 -27 -23 31 11 -40 5 24 -21 -35 24 20 -19 -11 41 4 -40 20 36 -32 -14 41 15 -38 1 41 -9
2596 -9 -28 35 24 -32 -5 50 -1 -37 23 38 -25 -34 39 6 -48 -3 43 -12 -35 30 21 -45 -10 53 -9 -44 21 52 -26 -29 45 13
2628 13 -46 16 66 -3 -32 46 34 -46 -8 62 0 -38 19 51 -37 -31 51 3 -47 12 48 -30 -45 32 20 -45 -12 34 -22 -51 26
2659 26 35 -43 -23 53 -8 -65 19 40 -28 -35 51 27 -50 -2 65 -7 -47 39 47 -47 -21 50 4 -59 22 57 -34 -42 53 27 -63 -2
2691 -2 58 -18 -61 38 48 -57 -26 61 2 -69 12 59 -45 -47 61 20 -70 0 61 -24 -54 45 53 -57 -23 77 14 -56 31
2720 31 72 -45 -47 70 32 -72 -3 69 -19 -57 44 57 -54 -39 75 5 -74 8 55 -45 -53 52 27 -66 -17 74 -14
2747 -14 -68 30 48 -42 -37 65 14 -54 16 68 -28 -42 55 46 -51 -8 71 -4 -49 42 51 -48 -29 53 19 -64 17 57 -30 -46 55
2778 55 18 -65 -27 44 -19 -45 28 36 -50 -32 49 8 -53 -2 52 -30 -39 44 29 -41 -4 49 -12 -50 35 44 -27 -15 54 9 -42 14
$$ packed form
2564a2RJ6j4k4L1J1m4MN4k0n1M5J9m5j4N9ml9QN2l7m4O0J6o8J8N5k6n3L9M0n0
2596ij9O3j1n6K7N5n1l6O0J5o3rP3l3n4M5M6n5k3O5ro6L5O3o2l5O5L1p8lP4l2
2628A3n9O2N0o9k9P8j2q0L8P0o2l8N7L2q8OQ2m8n0N9L6p8j5P7j2o5L3M6n6k9P7
2659B6Rp8K0P6o1n7Q4K1o8pQ6k4p7M8O7p2m0Q6Qr4K6P1m6o3Q1L5r1qR5k6r0O1
2691bO0p6m3R9J0j05L1Q7n9p1Q1M7j04kJ08m1r0P0O1q5l0R9Qj10L4J00o3p0Q7
2720C1M1j17kJ17l8j04O9P2q8l8J01J3j11J5J14p0p9Q2M7j00qJ05k5r3M9R1q8
2747a4n4R8J8r0NJ02n1o8P0N2r6j4R7rr7M3P9p5m5R1Rr9J9Q2l4q3Q1M0q7j6J01
2778E5l7q3L8P1o3k6P3Qq6J8Q1m1o1N1N4q2rQ3j5p0L7N3o1l8Q5Rp1J2O9m5n1N6
$$ plain form
2810 14 50 -18 -34 28 29 -57 2 50 -7 -43 22 24 -38 -26 37 -4 -51 9 30 -28 -22 40 10 -34 6 31 -23 -34 32 21 -28 -12
2842 -12 40 7 -28 16 48 -18 -15 54 13 -30 -6 40 -14 -26 17 24 -34 -21 37 10 -37 19 11 -40 -29 29 4 -38 -2 19 -17 -37
2874 -37 17 13 -33 -15 34 -4 -30 9 29 -18 -23 22 17 -24 -2 28 1 -16 18 26 -21 -7 24 14 -33 5 19 -8 -16 9 10 -20 -9
2907 -9 18 -4 -25 1 14 -24 -21 9 -1 -16 -3 18 -7 -20 18 8 -18 -10 12 -2 -13 -5 16 -7 -8 6 19 4 -8 6 5 2 0 12
2941 12 -8 -17 0 9 -1 -11 4 1 -10 -9 1 -1 -12 -9 3 -14 -21 -10 9 -10 -13 8 -5 -20 -3 8 -6 -17 9 8 -15 -14 15 10 -8 8
2977 8 21 5 -7 4 19 -5 -13 20 3 -16 2 21 2 -26 17 18 -11 -9 15 -8 -31 -1 16 -6 -23 17 12 -29 -4 28 4 -8 13
3010 13 25 -10 -14 26 17 -21 4 40 -2 -14 21 23 -11 3 29 10 -22 9 28 -22 -28 12 14 -24 -4 24 -16 -21 15 22 -26 -15 22 -5
3044 -5 -34 2 26 -29 -26 27 15 -27 2 31 6 -38 17 27 -25 -8 44 15 -20 14 37 -10 -16 18 14 -24 5 33 -6 -26 14 21 -28
$$ packed form
2810A4L6o8j6O2Jq6N9M8n7l6O5Ko2J2O3m1m7O0K1n8OO2l0m4M0K5n4j1O6j1m9J6
2842a2N2l3l5M4L2o6LO9m1m3K4M6n4j2M3Pn8J3N8k7m7N6qn1J1N8k5m2L6K1l6k0
2874c7N4mm6J8M9l8k6L9K0m7nM5nm1K2L0k7j7L4Qm7J4L1j0m7L8J4k7qK5Jl0J1
2907iK7k2k1K6J3l8LL0j0j5J3K1k5j3L8j0k6QK2j4j1QK1k3jJ4J3j5j2J4jlkJ2
2941A2k0rJ7Rj0j0J5lj1JJ0kj1LJ2j7pJ1J9j9lK1j3j5J7J1j4j1K6jk3JK9nj8J6
2977HJ3j6j2J1J5k4qL3j7j9J8J9j9k8M3Jk9KK4k3k3L0J7k2j7M0nm1K5L2k4j2K1
3010A3J2l5mM0rl8K5L6m2j2L5Kl4J4K6j9l2L1J9n0oM0Kl8K0K8m0nL6Pm8J1L7k7
3044ek9L6K4n5LN3j2m2K9K9k5m4N5J0n2J7N2k9l5L4K3m7oL4ml8K9K8l9k0M0Pm9
$$ plain form
3077 -28 -12 26 15 -34 0 28 -15 -36 26 10 -27 -10 28 -11 -31 9 34 -25 -15 29 1 -25 14 30 -7 -22 17 32 -18 1
3107 1 39 -1 -29 25 33 -17 -4 30 10 -38 8 24 -23 -28 23 2 -34 -17 19 -15 -31 6 20 -25 -10 28 13 -33 3 30 -8 -15
3139 -15 27 26 -23 -5 25 -4 -20 23 28 -9 -10 40 21 -21 6 35 -3 -13 35 16 -25 -13 27 -5 -17 7 20 -21 -24 19 12 -23 -2
3172 -2 27 -20 -23 17 30 -31 -4 28 3 -25 13 25 2 -12 24 28 -18 11 34 19 -9 10 25 -20 -3 25 -6 -22 3 18 1 -16
3204 -16 8 9 -18 6 14 -12 -24 3 6 -16 -17 10 4 -16 2 7 -4 -4 14 4 -6 7 18 7 -2 10 13 -1 6 12 5 -13 5 16 2 -1 2
3241 2 4 -6 3 12 -13 -12 -3 12 -5 -3 4 -2 -3 4 2 -12 -2 -4 -9 -15 0 7 1 8 8 8 10 6 17 4 6 10 12 15 16 10 16 9 14 6 -8 -1 9 4 -7 5 5 1
3289 1 1 -2 -2 -5 0 -7 -10 5 -2 -1 -6 2 -2 5 4 17 6 0 -1 6 8 4 16 10 1 6 11 9 8 8 14 -2 -5 12 9 10 9 13 -4 2 5 8 -8 -6 7 -3 -3 0 -2 -1 -8
3340 -8 8 -1 2 1 -8 -2 -2 -1 2 5 6 0 9 3 0 10 0 11 14 8 -5 14 7 2 5 5 5 8 5 13 -2 5 -12 0 -10 2 -5 -7 -7 1 -9 -11 9 -3 -3 -10 2
$$ packed form
3077b8J6L8j1m9L4K8m3k1O2j6l7J7L8l9k0M0K5n9J0M4k8k6L9J6l7j5L9J5n0J9
3107AL8m0k8N4Qn0J3L4k0m8M6J6m7nN1k1l6J7L6l4j6L7J4m5J5L8j5m6L6K7l8p
3139a5M2jm9J8L0k9j6M3Nl7jN0j9m2K7K9l8j0M8j9m1J2M0l2j2K4J3m1lM3pl5K1
3172bK9m7lM0J3o1K7L2k5k8L8J2k3j4L6Mm6K9K3j5k8J9J5m5J7K8l1j6K5J5j7j7
3204a6K4Jk7K4Qk6j2K7Lk2jK7ok0J8Nj1%J8j0j0J3J1j1rJ2Lj4POpj8J8J1j4lL
3241BKj0RRk5JRJ5j7KPojPkj4J0knoJ5PoP%%KmJ1j3KMKLJoOpNqj4PJ0nj1J2%m
3289A%l%lNplJ5pJnQmPjJ3j1ojPKmJ2orNNkj%Oj6lJ7lJjMj7OLLj6KJ3j0%LkJp
3340hJ6rLjrO%JLLJoRolJ0j0J1Loj3J9pnL%%LlQj5Pj7J2j0J2pk%Qj0kK0j2%pJ2
$$ plain form
3387 2 -2 -12 -1 -3 -13 5 5 5 7 4 2 14 4 12 9 2 6 6 3 7 16 15 -2 -2 9 13 -4 3 14 -13 -17 5 7 -18 -4 5 -3 -14 -12 -2 -6 -9 11 1
3431 1 -12 -3 13 1 -1 11 7 1 8 15 14 -2 21 29 -6 -3 16 22 -7 -4 14 4 -18 12 7 1 2 10 3 -14 -3 6 -10 -11 8 11 -13 -3 8 -1 -6
3472 -6 2 14 -13 -3 16 7 -11 8 12 12 -4 12 20 3 7 10 4 -9 14 26 1 -3 20 8 -14 -2 5 3 -11 9 6 -12 -1 8 1 -16 4 -1
3510 -1 -8 -6 8 1 -12 10 13 -5 -6 13 0 -6 -6 10 7 -2 13 13 -2 10 16 -3 -3 9 10 -6 -13 10 10 -5 7 8 -9 -6 -3 1 -15 -19 9 -14 -16
3551 -16 -6 -5 -5 -9 4 -7 -8 0 12 -1 -8 7 12 2 -8 12 4 -8 1 13 -4 -6 11 13 -6 13 14 0 -9 17 18 1 -6 2 2 -4 0 3 -6 -9 8
3592 8 3 0 -4 5 6 -10 5 2 -11 -10 16 14 -5 5 13 0 -8 11 15 1 5 18 8 -4 -1 26 5 -1 11 9 -7 -5 11 8 -11 8 8 -8 -11 0
3632 0 -9 -23 -6 8 2 -30 3 -4 0 -6 5 -2 -10 -6 0 11 -1 19 -6 -8 3 14 2 8 3 14 3 -1 8 3 -8 -3 6 -6 -1 2 8 -4 4 -3 -6 -6 1
3675 1 -5 -4 -12 -5 -2 -11 -7 -5 -12 -4 -9 1 -7 4 -1 12 1 7 -4 0 -6 1 18 10 7 2 1 6 -4 7 -4 -8 -5 -2 10 2 -10 5 -11 4 -9 4 5 0 9
$$ packed form
3387Bmj0J1kj0J8%%KlkJ2j0QlpM%lMRjj7%J1Mj7PJ1k7mK2Kk5J4Rqj1KJ0mlK0j0
3431Aj3RJ6j2kJ2moPPjj6K3Ql5LJ9Ok9LJ8j0k2L0noJQpj7J1Rj6jJ9Lk4J0J1rn
3472fQJ2k7J0J9rj8J9M%j6J6Qj7MLoj3K3J2k5mK3j2k2J2Pkj4K0lj8J1Rpj7K0n
3510apKJ4pj3K2Lj8jJ9j3o%J6lrJ5%j5J2Oj9%J2Jj6pK3%j5J2Jj7LLMj6mK8k3k
3551a6J0J%mJ3j1jQJ2j3pJ5Nj0j0K0qj2RJ2j7kJ7Kj9J9Jj4rK6Jj7pQ%oMLrlJ7
3592HnlmRJj6J5lj3JK6kj9J0Qj3qJ9Mj4MJ3j0j2LK7k1oJ2kj6KJ6lj9J9%j6lJ1
3632@rj4J7J4ol2L3pMoJ1pqMOJ1j2K0k5kJ1J1j2OnJ1j1mRnj1NRj2NLOj2Qpl%P
3675AoJqPLrMKpQnJ0qJ1nJ3j1Oj1MoPJ7qlnjNj0J1j1mLLJ2qj2J5j6J5j3J3JnR
$$ plain form
3720 9 -10 -11 -11 -2 -6 -4 -11 7 -3 11 10 3 -11 10 -1 6 -5 12 11 7 4 15 7 12 12 16 18 8 12 5 -10 -9 1 0 0 -5 3 -2 -1 -2 -1 -13 -2 -2 -4 -21
3766 -21 -1 -3 -5 -7 -4 1 -5 -7 0 -6 4 1 3 -3 6 13 8 13 11 18 1 -1 15 -2 6 9 -2 -3 -4 -3 7 -5 -6 -2 -15 -5 -3 5 -19 -12 -1 1 -8 -6 -3 -12 -5 -7
3814 -7 -2 -11 1 3 3 -7 6 4 1 4 2 -2 9 9 12 -6 -2 11 8 0 8 10 1 -11 -7 1 -6 2 0 5 -1 8 12 -4 -11 -6 -4 -13 7 -4 -12 -3 6 6 -6 5 9 -1
3862 -1 1 3 16 5 15 11 9 -1 10 24 2 0 14 21 9 1 12 1 3 9 10 -13 -12 2 -2 -9 -4 0 -1 -6 1 -9 -18 -21 -3 -5 -5 2 1 -1 -1 16 6 -4
3906 -4 2 11 12 1 5 9 9 0 17 6 11 12 11 10 -3 7 6 0 3 -1 -12 1 10 0 -5 -1 0 6 -14 2 -14 -2 0 -11 -2 7 6 7 2 13 6 3 4 10 5 13 8
3953 8 10 5 4 1 16 7 7 6 6 2 -8 3 1 -3 7 3 -8 -2 3 -1 -2 -3 -5 -6 -4 -7 3 -8 -6 6 -2 -2 -6 6 -2 -2 12 7 -1 13 16 9 8 20 9 3 18
4000 18 6 -4 9 9 2 -3 0 20 11 -5 -4 -4 -1 -12 -3 -15 -13 0 -4 1 -10 -3 -12 -4 9 3 -4 4 1 11 2 1 1 10 18 12 17 4 17 5 16 9 2 10 11
4045 11 3 3 14 -4 1 9 3 -8 9 0 0 -7 -1 10 3 -2 4 1 -5 -2 8 2 1 -1 6 1 4 13 5 7 3 7 14 7 -1 7 -3 6 1 12 10 6 1 9 2 12 14 2 2 3
$$ packed form
3720Ij9j%RmKpJ8j0J4jpj4K1j1Pj1J7jmlJ1qN%MKj0Mpj5JJ0j%nQnJjJj2J1%kj7
3766b1K0kkkLNokPoJ0lKoRPnNkPj7kJ6j7QLj1jjJJ0j2jMj3J0KQk4PJ1KrKLrPk
3814gNrJ2K%j0J3klLkmJ1%Lj8MJ3lqQKrj2MQpQkNoRMj6pNKrK0j1qRR%j2J1Mj0
3862aKKJ3j1J0mkj0J1J4k2kJ4Pj2qJ1j1KOJk3JJ4mpNMjnPj0rlJ8k%Pjk%J7j0j0
3906dORJj1MM%rJ7j1NJjjj3J0joLmj1J3Rj0nMJOk0J6j6J2Kj1RRjJnJ1plJOnQn
3953HKnjlJ5r%j%mj0J1kmJ0mj1ONmjjkjKlJ0j1KJ2q%mJ2q%J4nqJ4LpjJ2j1oJ5
4000A8j2j0J3%pnLK0rj6J%Lj1Rj2KJ3mNj1PrQJ3opQlJ0rj%RQoNj3J3j2J1ppQJ
4045A1q%J1j8NQoj1J7r%pOJ1pnOloLJ0ojkPnLRqKmMPpqQj0RnJ1kmnQpJ0Kj2%J
$$ plain form
4095 3 -3 7 -3 -2 -2 -2 1 -1 0 1 -4 4 -5 -8 6 2 -6 2 -4 -6 9 9 11 0 13 21 20 11 13 11 2 15 10 8 11 7 1 9 11 11 17 1 1 7 -1 1 -11 -2 -10 -15 -1
4146 -1 -5 -6 -2 -3 -2 3 -9 -4 -12 -2 0 2 2 -2 2 17 3 5 13 24 14 6 14 11 8 0 5 -2 5 11 8 3 9 -2 6 -4 2 2 -6 3 -3 -5 -2 -9 -7 -5 -4 4 2 -3 -6 -3 10
4199 10 3 5 -1 8 11 4 3 15 5 16 -5 5 6 11 17 12 9 7 8 6 7 -4 0 -1 3 -8 -3 1 -7 -6 4 -9 -5 -7 -8 9 -7 1 0 4 1 -2 -4 5 1 1 3 1 23
4248 23 7 5 14 17 7 13 19 12 -1 8 15 15 11 10 16 1 -4 4 5 -2 -3 6 2 -2 -4 2 0 -5 0 5 -10 -3 -1 -1 3 7 -7 1 4 -2 14 0 6 11 2 5 10 8 9 4 3 -1
4300 -1 7 13 7 14 12 7 -1 4 11 2 0 -3 -2 1 8 -3 -2 1 -2 -2 11 8 -4 -7 -10 -8 7 14 -8 0 10 4 -8 7 12 9 1 12 9 1 -1 8 3 4 -7 7 9 -1 5
4349 5 13 4 4 -3 0 -3 -3 -2 1 -9 -1 -13 -9 -6 2 -4 -10 -1 -1 1 -2 -9 -6 -10 7 17 2 6 0 15 2 15 18 14 6 7 4 14 12 6 5 9 -5 7 1 -6 -10 2 -8
4398 -8 -3 1 4 -7 -8 -3 -7 -5 -1 -2 -2 -2 0 3 -1 13 2 8 11 3 9 10 4 8 6 13 13 14 5 6 7 0 7 13 -1 8 2 4 8 0 8 8 8 8 -6 0 -7 -8 7 -3 8 0 13
4451 13 6 5 6 4 5 0 2 9 14 12 10 3 11 9 11 18 17 8 19 6 17 11 11 6 2 12 3 4 5 12 6 1 17 5 4 6 -7 -1 0 -6 0 -1 6 5 3 14 6 -3 -7 7 18
$$ packed form
4095CoJ0j0J%%LkJJnQrlJ4mqQokJ5%Kj1J3QjrKkrJ3nkLmoQK%Oj6%OqKj2RqnJ4
4146amjMjJNj2NqJ0KK%mMJ5j4KQJ1j0qQllqNpPOlnOj1Qj0O%qRokLpKKJQknlLJ3
4199A0pKoRLpjJ2j0J1k1J0JNOnlkJkJj1MjMj1NMqJJ0j3MkjJ7j6QjMllkRm%KkK2
4248B3j6kRLj0OOpj3RP%mjOj5nQJpjRmmkOknNNj5PK%MMj4QLoJ6j4ONrLNkJnjm
4300aQOoPknqNPrklJLPj1JLl%J3lj2llKJ5Pk2QJ0oj2J5NlqJ1lqkRnJj1J4Kj0O
4349EQr%pLl%JLj0Qj2MLQooR%KlpLmJ7J0j5MoJ5j3J3LmqJlJ0kojMj4J2opmJ2j0
4398hNMLj1jNmKMj%%KLmJ4j1OLqOJoMkP%JrJJpPOj4RoKMqQ%%%j4OpjJ5j0J1qJ3
4451A3pjJkJnKPNkkpQkKPjrJ1j3J1o%nmJ0rJJPonJ6j2jKj3OJoOjPjkJ1qrmJ4J1
$$ plain form
4502 18 3 6 12 8 16 12 17 15 12 21 16 15 14 8 12 4 -1 8 4 6 5 6 6 7 2 11 -3 0 -9 1 3 -7 -2 2 0 5 -3 6 3 1 6 2 6 17 3 6 7 16 7 10 12 12 23
4555 23 7 4 -2 10 -1 -1 5 4 -4 4 -4 -6 5 -8 6 -10 -6 -2 -7 0 -7 -3 -2 5 -1 4 7 11 19 -2 8 3 6 5 11 3 13 28 9 17 18 20 8 20 15 10
4601 10 8 12 15 -3 1 1 7 -1 4 8 -5 -3 10 4 3 -2 6 8 -3 2 4 4 -2 6 0 3 15 1 2 16 13 15 11 5 23 13 12 22 10 7 11 7 18 10 -5 10
4647 10 4 5 6 -4 3 2 1 10 -4 3 6 1 -4 -5 -1 -5 4 7 11 1 -9 -8 7 6 7 -3 12 3 10 17 18 12 18 12 8 10 8 13 2 7 6 8 6 -7 7 6 -1 -4 6
4696 6 11 -2 1 -3 1 -12 -1 -13 -1 -4 0 1 8 1 2 19 4 5 9 6 -2 7 7 4 3 5 3 12 13 14 4 11 13 -1 7 7 3 1 10 3 5 2 -10 -2 0 -3 2 -3 -1 -10 5
4747 5 -8 -7 0 -2 -3 0 3 5 16 5 8 15 -2 2 16 2 5 8 12 3 6 10 7 9 -2 13 10 7 7 2 2 -3 5 -1 -1 -3 -6 -6 6 -5 -1 -10 -10 -4 -6 -4 -5 1 -7 4
4797 4 8 4 6 6 9 -2 4 7 11 4 10 14 12 19 12 15 4 13 15 3 8 8 -1 7 -4 4 -10 6 -1 5 -2 -2 9 -3 -2 -3 1 -4 1 -1 0 -2 8 3 -1 7 21 11 4 10
4847 10 14 4 10 22 15 14 15 11 18 7 9 3 9 -2 15 -1 -2 4 -1 0 -3 -15 -4 -1 -8 5 -4 11 -9 3 -1 3 2 3 9 6 9 2 17 8 20 0 9 19
$$ packed form
4502A8j5LOmQmNklRnjjoMqnRmKjJ%JnRj4LrJ0Kj0NMkNqRlkNmMJ1j4LJRrLK%J1
4555B3j6loJ2j1%OjqQqkJ1j3J4j6MMnPpMJPoNLMQk1J0nLjOqJ0J5j9QJKj2J2nn
4601A0kMLj8M%OqNMj3KJ3ojnQKj1NK%oQoLJ2j4JJ4lKmoJ8j0jJ0j2lMmJ1qj5J5
4647A0oJJj0PjjRj4PLnnjMmRLMj0j0JJ5jJj0J5rPPJoOomKkNj1NjKkj3J4jplJ0
4696FNj3LmMj3J1j2J2lMJPpJJ7j5JMlqR%ljKkRJJj0PKj4Q%mkRpKlj2QKlNnKrJ5
4747Ej3JPkjLLKJ1j1LPj7MJ4j4LLMrLMlKj1J5ll%n%nQo%kl%J2j1Mr%OkKjOqJ1
4797DMmK%Lj1OLMpOMkPpLj1RKj2N%rQj1Qj4J6pOp%J1j2JjMnNkJkJ0nmQJ4j0pO
4847A0Mj0OJ2pjJmPj1KoOj1J7j6jOnJlj2J1LpJ3rJ5k0J2mMjJOlLpJ5rJ2k0RJ0
$$ plain form
4891 19 22 18 17 22 11 13 14 6 17 18 12 9 -8 4 4 3 -4 0 -7 -7 0 9 6 10 -8 0 -2 1 5 1 12 2 7 0 8 11 8 14 14 4 8 16 15 16 14 9 2 11 10 20 9
4942 9 4 20 9 7 7 4 9 -4 -2 2 -9 -4 -1 2 -5 -8 -1 2 -1 -7 -5 -1 9 1 -5 -6 3 2 4 9 8 5 8 10 10 2 10 9 5 7 8 5 8 8 4 6 9 10 4 -3 4 6 -1 -8 -1 -2
4998 -2 -8 -9 -6 -9 -5 -4 6 4 -11 -3 1 4 2 14 9 0 6 -1 8 0 9 15 7 5 5 18 12 14 4 13 5 6 16 -7 0 8 4 0 -6 -5 -4 -2 -5 -8 -6 -9 -2 -6 1 8 4 2 2 -2
5052 -2 -2 3 3 -1 5 2 17 10 6 3 8 9 18 19 2 -2 0 8 8 8 2 5 7 -3 7 9 2 -6 -12 0 1 -3 -2 7 -5 -2 -3 -3 3 -8 -2 -6 -4 -2 8 4 6 7 -5 12 21
5103 21 12 19 8 5 5 12 8 9 4 13 6 5 -5 9 6 5 4 2 4 -9 0 2 -2 -2 1 6 9 -4 2 8 -4 -1 4 11 5 7 4 9 10 1 9 6 3 18 20 19 9 13 11 10 19 10
5155 10 13 1 7 -4 10 8 -6 1 5 0 9 -5 -1 -1 -1 -2 1 9 9 13 -5 1 9 -4 14 1 7 4 15 9 6 8 10 16 13 11 11 8 11 20 10 12 5 -2 14 16 16 13
5203 13 13 6 -3 0 -4 2 -4 -6 -10 -2 -12 -4 -1 5 -4 8 4 6 11 0 -2 -1 9 11 9 15 17 20 26 18 13 17 20 15 13 7 8 9 4 1 4 12 16 12 -5 -6 1 2 -2 4 -10 -4 4 4
5257 4 3 0 8 6 -2 15 5 7 -3 11 8 3 3 8 9 5 10 16 5 10 18 17 8 16 18 22 -4 1 6 8 6 -1 0 3 6 -11 -8 -3 -9 5 5 0 -3 0 7 -3 -2 -3 2 3 12 9
$$ packed form
4891A9LmjNj1KJqJ1Jolj7J2%jpMp%PRlMj8QkLMmJ1j0NpQLlO%j0MQjJknpRjJ0j1
4942InJ6j1k%lNj3KMj1NLLplPLloKMJ0qojRjKNjlLK%qQjmKJlL%mKLJopPKppPj
4998bojLlMJJ0kj5QMLkJ2nrOpRqROqk%J3oKj0RqJJ0k3PQmmoJJKllKlPmPPmk%m
5052b%N%mOlJ5pmlNJRJj7mKQ%%oLKj0J0KpqoJ2JmJRj2Lj%Oj1OmKKJ0mKJj2J7R
5103B1rPj1l%PmJnRpjj0J4ljjkKj3RKm%LNLj3OOj2LNPoKlNJrQllJ5Kjj0MkjRr
5155A0Lj2Oj1J4kj4PMnRj4M%%jLQ%Mj8OQj3J8j3OlJ1olKKOlk%lLRj0KppJ6K%l
5203A3%prLmOokmQj0QLOrJ2mKNj1kJJ0KkOKLOqnMLnkoJJnlLQMmj7jPJmOj4OQ%
5257DjlQkqJ7j0Kj0J4ln%NJmNOj1NQjrQKMk6NNKkpJLLj7LNoJ4%nlLPj0JjNJRl
$$ plain form
5309 9 6 0 15 3 8 7 14 9 9 14 15 12 13 5 14 11 10 15 7 4 6 6 11 13 2 4 -2 0 -3 -1 3 -8 -1 -9 -9 10 -1 2 7 11 10 14 24 8 6 5 10 6 2 14 9 21
5361 21 13 16 12 9 12 6 17 5 10 -4 7 1 0 8 4 -1 4 10 2 0 -4 -5 -1 -5 -8 -9 -7 -6 -6 11 2 7 8 5 4 9 11 11 5 16 10 10 22 8 14 9 8 6 -8 8
5411 8 5 -2 5 -1 12 2 9 7 -1 -7 4 0 1 -3 6 -5 0 0 -1 5 -2 0 9 11 5 8 3 13 1 5 10 4 3 11 4 4 4 7 9 17 10 18 -1 4 5 -2 -1 -9 2 7 0 -1 0
5464 0 6 2 -7 2 -11 -2 -5 -3 0 -3 -3 3 -5 -4 7 6 1 -1 6 3 6 11 4 13 13 2 10 18 16 14 9 21 8 18 6 6 -2 -7 -6 -1 -7 -6 6 5 1 -1 -5 -6 1 9 -11 3
5516 3 -6 -1 1 -10 3 -6 5 18 9 0 8 6 7 4 -2 7 -1 5 9 5 7 9 19 5 10 5 3 9 -5 0 8 -4 -4 -1 1 3 -4 -2 -7 -4 -4 -1 -5 -10 -7 -12 4 17 5 10
5566 10 13 4 13 8 8 9 1 1 10 1 13 15 9 7 10 -2 -14 4 -9 6 8 -1 3 -7 0 -3 -17 0 1 3 0 -3 4 -11 -1 -10 2 2 0 1 -1 3 13 11 10 2 7
5613 7 7 9 10 5 10 14 20 8 6 13 1 13 11 2 15 8 -1 -4 -8 -3 0 -7 6 0 -2 -4 3 11 -2 4 -14 -2 1 -6 -4 7 7 13 19 13 12 9 4 13 18 13 3 15 3
5662 3 3 5 15 5 7 9 1 7 3 3 -7 -5 0 -8 -5 -2 -17 2 2 4 -2 -1 -3 7 -7 -6 -3 3 1 1 -1 -4 6 5 6 10 3 14 9 8 9 4 3 12 8 11 10 13 7 -4 4
$$ packed form
5309IloJ5j2NjPn%NJlJqRljNqlK%NKj1KoKlKMj1Pq%J9j1LNMjMJ0j6kjNmmJ2nJ2
5361B1qLmlLoJ1j2Nj4J1ojQmnNOqkmjMmljKJ%J7rNJljNK%oJ1o%J2j4Onjkj4J6
5411HlpPoJ3j0PkqoJ1mJmRj1N%jOpKRKoLnJ0j2MNojQp%%LKQpQj9NJpJqJ1NpjJ
5464@OmrRj3RlKLl%OqJJ1jnkPlLNpR%j1QQkknJ2j3J0j2%qnJNoJJ2jmkmjPQk0J4
5516CrNKj1J3rJ1J3rrQkJloRqOMmKKJ0j4NnkOj4NQj2%LKKpKnL%LmnLnJ6J3j2N
5566A0LrRn%Jq%RrJ2KokLj2j2J8j3J5KrMj0Plj4J7JKllPj5J0rJ2%kJkMJ0kjqN
5613G%KJnNMOj2kPj2J2krJ3prlmNLpJ3okkPQj3Oj8J2LpKJ1%OOojlnRNnj0J2j2
5662C%KJ0j0KKqOm%j0KNqLLj5J9%KoJkJ0j4JLOk%klJ0jJMpJ1njJnjRmLjLoj1Q
$$ plain form
5713 4 16 -8 2 5 -7 -2 -2 -8 -10 -2 -1 -5 1 -4 7 8 2 7 6 -4 5 -9 -1 2 4 4 7 15 14 13 10 11 9 13 3 2 14 6 16 2 0 1 9 -5 3 12 -3 1
5761 1 0 1 -2 0 -5 -5 -2 -6 -5 -7 1 -1 -12 -1 -1 2 3 9 -4 6 3 9 7 13 14 19 16 12 9 6 8 10 17 3 9 9 -1 5 4 0 -4 1 3 -8 -2 -10 -7 -1 -2 -4 2 0 -1 -3
5815 -3 5 1 -10 11 9 9 0 -3 22 11 6 16 5 13 5 14 14 9 10 13 0 10 10 12 3 2 4 10 8 -1 -9 -8 -5 -6 -4 -8 -5 1 -2 0 -2 8 -3 3 2 5 8 -5 4 12
5865 12 20 7 6 3 5 9 20 6 -2 13 12 8 12 11 6 6 12 2 10 2 5 6 -1 -10 -12 -4 -10 4 2 -8 3 3 4 5 -5 4 3 -4 5 9 2 -4 6 8 12 6 11 9 7 0
5915 0 0 21 13 5 8 2 -1 -3 -5 11 5 7 2 -1 8 9 -8 -12 1 -6 3 3 -4 -7 -2 -3 -5 -10 9 3 -5 0 12 0 11 13 18 18 11 10 7 7 19 12 10 8 9 1 7 15 13 0
5967 0 8 3 0 8 8 4 1 2 -9 -2 1 8 -2 -4 -16 -5 4 0 -11 4 1 11 2 -1 11 13 -5 4 16 9 6 15 10 13 7 4 23 7 6 18 4 10 8 12 9 4 5
6014 5 -6 1 1 -3 -8 -4 -6 -5 -4 2 -10 3 8 -13 3 6 2 -1 2 -2 4 5 18 10 5 14 0 7 0 12 10 2 19 15 -10 2 2 5 6 -6 1 -4 -9 -7 4 -11 -9
6061 -9 -5 -10 -16 -2 -12 -12 -7 -3 -12 -3 -1 6 13 6 2 -13 8 12 6 2 4 4 5 15 13 12 13 15 8 10 7 0 1 4 0 4 8 10 2 2 6 10 5 -3 1 -12 -3 1 -4 -14 3 5 9
$$ packed form
5713DJ2k4J0Lj2N%okQJmOnJ1JoNjj0Rj4QLK%LQjjlJkMj0jJ2qJ0j4kJQj4QRj5M
5761AjJlKn%LmJkQkj1J1%LJOj3J0lOkOJNlmllKKPj4O%j0OjmmNKj1OqLOjkOkjk
5815cQmj1K1k%rlK5j1nJ0j1QqR%nJLj3J0%KrjKOkrqJLjKmLOlKkJ0j1OjLLj3RQ
5865A2Qj3jlKMJ1j4qJ5jmMjn%Oj0QqLJprkQoJ4kj0J1%JJj0RjpRMpoJ0KMoNkkp
5915@%K1qqLolkkJ6oKnlRJj7mJ3pR%plNjknJ9oqNJ2j2J1KN%pjl%J2pkkJqOQkj3
5967@QnlQ%mlJj1PLPj0kj2J1Rmj1J5lJ0rlJ2Kj8RJ2plRnLolJ9j6jJ2j4OkMlnJ
6014Ej1P%mnMkJJOj2J3Nk1J6LmlLmOJJ3qnRj4PpJ2kqJ7mk5J2%LJj2PnnKJ1j5K
6061iMnoJ4j0%NMrRKPPpmj5K1MomK%JJ0kjJKpKlpJLmMMKq%MMnqMj3RMnj0J7KM
$$ plain form
6114 9 14 3 -2 4 14 7 3 14 9 8 9 28 5 11 8 7 14 6 8 5 -6 6 12 5 -12 -8 0 -1 3 9 7 -13 -4 -1 -7 -4 -12 -11 -3 -5 3 -7 6 -1 -1 3 8 6 5 1
6164 1 4 13 7 12 9 8 -1 18 2 13 8 10 8 -4 4 4 1 -2 9 -8 2 9 3 1 -2 -6 -8 -2 -3 -5 -11 -2 -2 -4 0 2 -1 5 0 -2 4 6 5 5 10 4 10 8 8 17 12 19 20 10
6218 10 12 15 12 24 5 5 2 4 13 11 -5 -4 0 -10 -4 -2 -6 10 -1 -2 4 -11 -1 -1 8 0 3 -6 6 5 4 12 12 17 5 5 4 10 1 14 1 16 15 5 1 -1
6264 -1 3 -5 4 7 -2 5 1 5 5 -4 -5 5 -3 1 -6 -6 -6 -6 -2 0 -10 -5 7 -7 9 17 5 5 1 11 -1 12 1 4 8 7 6 8 15 4 4 10 6 14 4 -7 8
6311 8 3 4 2 -1 -9 -5 -3 -7 -10 -10 -3 2 -1 -13 -10 -13 -6 6 -3 4 7 8 -1 4 14 6 2 2 11 15 10 9 8 4 0 1 2 -3 2 -10 -7 -3 1 -3 -1 -8 7 1 4 -3 3 -6 2 -12 -4
6366 -4 -2 -11 -4 -5 3 -5 3 -6 5 -3 7 6 -8 6 9 3 5 14 10 8 1 2 11 6 4 10 7 8 -1 4 1 -3 0 -3 -7 4 0 -1 5 0 -4 -3 1 -3 -1 -10 -8 3 -1 4 4 1 3 4 9
6421 9 7 11 7 3 10 5 11 6 13 18 8 11 22 9 6 -1 6 0 -4 1 -12 -1 -2 4 -3 -11 -8 -8 -4 -1 -15 -18 -3 -7 -10 -5 0 2 1 3 7 5 8 2 -5 1 1 3 -1 5 0 7 -1 8
6475 8 7 6 7 3 -1 -2 10 -2 0 -2 2 0 -5 1 -3 -1 -4 1 -12 -1 1 -2 3 0 -13 -8 -8 -1 -4 7 4 11 5 10 10 8 2 0 10 10 6 6 17 6 4 13 1 10 7 -5
$$ packed form
6114INj1nOJ0pmJ1njJJ9k3OljPqKlj1J2Opj7MQjMOkk0RLoLqJQkQj0J3p%MNkjm
6164ALRoNljrJ9j6J1nKkj2Q%llJ1j7J0PoklmkOjkoR%kMKlOnkOKj%NoOk%RnPJj0
6218A0KLlJ2j9%lKRkj6JMj0OKmJ6j1jOj5J0%RqLrJ2jjQ%Nj2%jOrJ3j3J5jj0mk
6264aMqRLrPmM%rjJ0qMp%%%MKj0NJ2j4J6Qj2%mJ0j2J3j1LMjjKPj1%OmQj0j1J5
6311HnJklqMKml%PNlj2LlPJ2rPLJrNJ0qm%RMnjjmmJJnNj2LMMmKpJ5oLpOrQj4Q
6366dKrPjQqQrJ1qJ0jj4J4LoKRmkpJRnkOlJrNlmLlmJ1mjOnmJMmKrKJ1mN%lKJN
6421IkMmmPnOnPNj0LJ1j3lpPomNj3J1jOpqL%MLj4lJ5mlNNKjKMkLopO%KmOnPqR
6475HjjJmmjJ2j2KkMknOmKlNj3J1KlNlj3N%PlJ1lPoN%kokJ0%m%J1j1kRj2Rlj2
$$ plain form
6525 -5 -6 -1 -10 2 1 -2 0 8 -3 -1 -8 -4 8 -7 -3 -7 3 5 -2 7 -1 -6 12 1 5 10 8 10 10 -4 14 4 1 6 12 3 -1 -2 -1 5 0 -2 -2 -8 -2 -6 -1 -18 -3
6574 -3 6 -1 6 -4 -3 -8 0 -6 2 1 -3 0 -11 0 14 5 -10 4 10 -2 3 12 15 12 10 7 -6 10 0 5 9 1 6 -3 -5 -7 0 -2 0 -14 -6 4 -11 -6 -1 -9 1
6621 1 -11 -12 -5 0 -3 6 1 -7 9 -3 3 13 6 14 6 8 6 20 9 10 11 2 6 -1 5 7 10 13 4 5 4 -8 -1 -6 5 -6 -8 0 4 2 2 -1 6 0 4 -10 -1 -4 -3 -4 0
6672 0 -7 1 10 1 1 8 -1 18 9 12 6 8 7 9 -2 -7 -3 6 0 14 9 -2 9 -5 -4 8 -8 -8 -9 4 -7 -6 -4 -13 -13 -9 2 -1 -8 -9 -6 -2 -5 10 4 -11 5
6719 5 -5 1 9 11 6 3 0 14 8 10 1 1 3 12 5 12 -5 8 -7 -12 4 -2 -5 -3 -2 -12 3 0 -12 -8 1 0 -2 -3 -9 -3 1 -2 1 -4 2 0 12 -3 1 6 12 6 2 6
6769 6 0 1 -3 8 1 1 -3 3 -4 -10 3 12 -4 -10 -1 1 -6 -5 -11 -2 -4 -12 -2 -6 -11 5 -9 -5 3 4 7 2 1 0 -1 0 8 4 8 8 3 -1 2 6 2 5 4 2 9 5 0 1 10 -1
6823 -1 -2 -4 -1 -8 -10 -1 -6 -10 3 -8 1 -6 -19 -2 -1 -2 7 -3 -3 2 -5 -6 8 -1 2 -2 9 -3 5 9 2 0 3 1 4 3 -3 1 -8 -11 1 -13 0 -2 8 0 -2 -1 -11
6872 -11 -9 -11 -3 -8 -5 -6 -11 -3 -12 -1 -1 5 -2 5 -10 12 5 5 10 4 2 3 9 3 19 10 7 0 -3 5 14 2 1 -2 -1 -5 4 0 1 -3 -4 3 -11 4 -7 -6 -3 3 1 -9 -9
$$ packed form
6525ejNrJ2jlKQj1KpMJ2j5MmJ0KpRqnJ8j1MNkK%j4J8j0lNOrmjJOnk%oOmNj7J5
6574cRpPj0JnQoQjmLj1J1J4rj5J4Oj2NRLlklj3J6j0NMqNrkkPkKj4QJ0j5NNqJ0
6621Aj2jPNlRnqJ6j2OJ0pQqKkJ4j1JJrMpOKLLrJjj2PnJ1j1kQMk%lPoMj4RlJjM
6672@pQRr%PrJ9rLoKjKj1nMRoJ4nj1J1j4JJ2j6%jJ3j1JKr%MJ1lpjLMlJ5oj5J6
6719Ej0OQKnllJ4oKr%KRpPj7J3j5nJ6olKJj0J5lj2MRjkjoOMlLnOkJ2j5MNOomM
6769FoJmJ1p%mOpoJ3Rj6oRKpJoRkqJ0mnJ6j4MQJLnjjjJQmM%nmLMmLjkPmnJRj1
6823ajkLpkRnmJ3j1Rpj3J7JjRj0%NpjJ4rLmJ1j2QMpkLkLjoMrlJ2j4J3kJ0qkJj0
6872a1KkQnLjnQrJ1%OpPj5K2p%NokJOoJ6rlplQRj2jlJmRmJmjPj4J5j1JLOkj0%
$$ plain form
6923 -9 1 7 6 -7 7 1 5 -11 11 6 2 2 8 15 6 13 6 6 6 9 -3 -6 -2 -2 -8 -2 7 3 -4 -7 1 -8 -5 -7 -3 -13 -7 -15 -14 -13 -10 -10 7 -4 -5 0 2 3 4 3 1 1
6975 1 0 2 1 1 4 -1 5 14 4 4 15 11 6 2 -7 8 -4 -1 -5 0 -4 -6 -15 -5 0 -6 -2 1 -3 -5 -1 -2 0 -1 1 8 0 10 8 1 7 15 11 11 14 10 15 8 5 9 15 1 2 -3
7029 -3 7 16 -9 2 1 5 4 -2 -3 4 -6 0 -4 -6 -11 -12 -8 -3 -3 -15 -14 -8 -11 -3 -1 2 2 7 2 1 5 -1 7 1 11 3 4 -9 -1 8 5 7 -4 8 7 -5 -4 -2 -5 2 2
7080 2 3 -2 -6 10 -12 -6 -13 -4 -8 0 -7 0 -5 -2 0 11 -6 -7 11 1 4 2 4 9 -2 0 6 11 12 7 1 5 11 0 5 1 5 -4 4 1 -3 -12 -6 -10 3 4 -3 1 -5 -3 -7 2
7132 2 -4 3 1 7 6 -3 10 5 -1 0 -2 -6 8 1 2 9 0 8 -2 8 7 11 4 2 -4 9 0 4 -3 0 8 4 -1 -2 -2 2 -1 2 -11 -12 -4 -1 -3 -1 -7 -12 -7 -5 9 -3 0 -5 0
7185 0 -4 9 3 0 6 7 3 7 13 2 11 -1 12 2 0 0 5 3 2 -12 3 -9 6 -7 -7 -3 -2 4 1 -7 2 8 0 -1 -15 -13 -9 -3 -10 2 0 -5 2 -9 -3 3 4 7
7233 7 4 2 12 -11 9 2 3 0 9 2 1 1 -4 10 5 -6 -5 0 5 5 -5 -3 -8 -12 -15 -10 -8 -19 -14 -11 -4 2 -7 -8 -1 -5 -11 0 9 9 -6 1 8 0 -6 -8 1 8 13 10 3 10
7285 10 -3 -6 -1 2 1 2 -1 -4 -14 -6 -15 -7 1 -14 -12 -14 -10 -5 -9 -4 -7 -14 -11 9 -7 4 4 -8 14 11 8 11 7 18 4 -1 14 -3 7 12 3 -2 2 -5 2 3 -2
$$ packed form
6923iJ0Ojj3J4oMj6K2nm%OPrPp%%Lj2lM%oORmplQrLkMj0OqJJL%J7j1jNKJJjk%
6975AjKj%LnORj0%J1mnmrJ5j2LmNmkrJ0NoMLmkMjKjKPqJ0kpOQm%LmNplMOj4Jn
7029cJ0Rk5J1jMjojPj0OmknjMN%j2JOlQKL%NnjMoQoJ0qJj3QRlKj1J2jj2JKlP%
7080BJnmJ6k2OpRmQpPnLKJ1j7jJ8j0LkKNj1KONJnoMOj1NmMrQlmrOmJ3JpMoKmR
7132BoPkOjrJ3noJkmJ4pJPrQj0J0jMpkoJ3rMpLQmnj%MlLj3jQLkKonNKJ4j2LnN
7185@mJ3olOJmMOj1Rj2J3j0k%Nkjj4J5j2J5j3%MJOlqROqjj4KMOpJ2knPj1OOJL
7233GlkJ0k3K0pJlRpj%nJ4nj1JNN%j0KnmlNKj1NLPOrjPmoJ1R%j5PPqokRPNlpP
7285A0j3lNLjJllj0QrQQj5KkMNmNlpLK0j6J1%j2K2llLmJ1j4nJ5j7J0NrnMpPJn
$$ plain form
7332 -2 2 -5 -8 -3 -8 2 -3 -12 -13 3 -8 -3 0 -5 -8 -14 -18 -1 -3 -2 -4 -12 1 -1 0 4 8 14 2 0 4 1 0 10 1 -1 13 7 -7 9 9 -4 0 3 1 7 7 -3 -14
7381 -14 -6 3 1 0 4 -12 -9 -4 -8 -5 -5 -11 -4 -1 -11 -10 1 1 -8 1 3 9 -2 -5 5 15 4 2 3 10 -3 -6 3 -1 1 -1 -1 0 1 4 -3 -2 -8 -5 -11 -17 -11 2 -1 -12
7431 -12 -2 -1 4 4 -10 -5 -14 1 3 0 -8 11 2 3 14 3 8 5 20 -2 0 11 3 7 -4 5 2 -3 -4 -3 1 3 2 -2 8 -4 4 -4 -1 -2 -8 -6 -3 3 -7 -2 1
7478 1 6 -9 -5 -1 2 -2 -7 0 1 5 20 8 12 7 -1 5 1 6 8 4 4 13 -2 -2 -5 1 0 -11 -9 -7 3 -3 -7 -3 -2 -4 0 -5 -6 -3 -2 3 -9 -1 1 -6 -8 3 4 4 4 4 -1
7531 -1 10 9 7 8 9 8 -1 6 11 4 3 10 7 6 0 2 1 -3 0 9 5 -5 -4 -5 -11 -1 -5 -6 0 -1 -12 1 -12 -7 -10 -5 3 15 9 8 -5 4 6 3 4 3 1 -6 8 0 -4 3
7583 3 -4 5 0 -3 -1 -9 -4 -8 -5 -7 1 -2 -15 -11 1 -5 -14 -9 -13 -3 -10 -7 -4 -8 0 10 0 4 -1 -2 3 -3 3 7 11 -3 6 3 -3 2 4 1 2 -8 5 -8 -7 6 3 7 3
7634 3 2 -2 -9 -5 3 -10 -6 -14 -4 -6 -3 -10 -5 -1 -3 -1 0 -3 2 9 5 -8 2 5 -4 -6 2 1 9 -1 2 -9 13 1 -3 3 -2 -9 -4 1 4 -10 -7 4 0 -2 -2 -10 -6 -6 -4
7685 -4 -5 -4 -2 5 -12 7 -2 11 5 0 -4 -3 -10 5 -5 7 2 0 11 4 1 1 8 3 8 8 0 -2 1 -8 -13 7 5 -4 -3 -5 0 0 0 -7 -5 -11 -10 -12 -12 -13 -17 -4 -1 -2 1 1
$$ packed form
7332bMplNnJ0nrjJ6j1NLnlomJ7kJkqJ3kJMMOj2kMljJ0rkJ4oj4J6%j3MLkO%j0j1
7381a4QRkjMj6LNmL%oPLj0JJ1%rRKOj1lJ0J0j1kJPj3lRmKk%JJLpJoLooOJ3lj1
7431a2J0JN%j4NrJ5KlqJ9rJJ1j1NlJ5k2KJ1qMj1RlnjJMKjmJ0j2QqLjoKLOj0NL
7478ANj5MMLmnPJMJ5j2MnqOmNKm%Rj5%lOjj1KKJ0omMJkMnjLJNj2QKpkJ1J%%%n
7531aJ1jkJJjrPNpjPljoKjmLRmj0JjoJ0mjOjj1J3j3NlNQJ2ojj3RKlJjkpJ4qmP
7583CpRnlKqNmLkQlj3MJ2orNmJ0pLLmQJ0j0MnjNoOMMj4RloNKlJj0J3j3JJ3lMm
7634CjmpMQj3MqJ0kLpNMkKJlNPmj3J0LrkQjQj0Lj1K2j2mOnpNNLj4LJ1mk%qM%K
7685djJKPj7J9rJ3onmJpJ5j0J2nkJ1pl%PnN%qkLrnK0krJkN%%pKoJk%jmJ3LjL%
$$ plain form
7737 1 2 9 14 11 4 6 12 15 -5 19 0 2 10 9 14 4 3 0 -10 4 -7 0 1 3 1 -9 -3 1 -6 -14 -7 -7 -10 -13 -12 -5 -8 -2 -4 4 0 7 -3 -5 -3 -2 11 -5 -3 1
7787 1 1 -8 -6 10 9 8 2 12 4 2 -3 -7 2 -2 -7 -5 -7 6 -3 -5 -2 -15 -17 0 -1 -8 -18 -6 2 7 -10 -8 -11 1 0 -3 12 3 3 1 2 -5 6 5 1 9 1 6 8 8
7837 8 11 4 3 9 -3 1 -1 -5 3 -3 2 -5 -2 -2 -9 -6 -1 -6 -12 -6 -4 -2 -6 -5 5 8 7 1 2 2 4 -5 -4 2 4 15 0 -1 8 14 5 8 2 6 11 7 9 -1 6 -5 2 3 8 -15
7891 -15 6 2 -5 -18 -8 -8 2 -12 -1 -4 -14 1 -9 -7 -9 -4 5 2 -4 -2 15 -1 -1 7 -2 9 4 -2 -2 -2 0 6 7 1 2 -4 -1 7 2 10 -11 5 -1 -1 2 2
7937 2 -5 -11 -9 -6 -4 -13 -6 1 -5 -2 9 5 -3 8 7 1 6 2 6 -1 13 0 -7 0 5 0 7 7 15 3 2 0 2 2 6 2 2 -7 -3 -10 -5 7 5 -1 -2 -1 -11 -4 7 -3 -11 1
7989 1 1 -2 5 -2 4 3 12 -3 -2 10 -5 3 0 10 10 6 5 14 12 0 4 6 3 4 22 -1 -2 -7 -6 -5 13 3 -4 -1 2 -4 -1 -3 4 0 5 -6 2 15 3 2 3 3 7
8038 7 4 4 -5 17 7 9 5 5 17 12 6 8 18 7 13 2 20 -4 -4 -5 4 -9 -6 -1 -9 -9 -9 -19 -8 -5 -8 -2 -14 -3 -6 1 -2 6 4 -2 3 6 1 8 2 1 4 5
$$ packed form
7737AJPNlpKOLk0K4j9KQjNj0jlj0J4j1PJKkj0OMpqP%llJPlOkQmPj0kKJJ3j6KM
7787A%rKJ6jjoJ0qknmRmnKkJ3rkLj3kJ7jpj0J2QNj7KlJ2jlJ5r%kJpJ1jmQqNK%
7837HLpjOj2MkmQoNpL%pLNnoOKKmJJ0LjoJ%KrJOKJ1j5jROrLoMNmKj0Pj1PJNk3
7891a5K1mpj3J0%J0j4J1lj0J5j0KkNRloKJ7j6%QrJ1no%%KOJoJoLQnQk1J6o%L%
7937BpoKLKrPPoLJ1mqJ1joNmMpJ4j3pPNnP%Qj2jkK%Mm%rMpNJ2kojJj0PJ1j0qJ2
7989A%lPpOjRj5JJ2j5QlJ0%mjRkj2MKlJJ8k3jnJJJ8j0pLLoLkPmNj1QJ3j2jJ%M
8038Gl%rK2j0Km%J2noKJ0j1Oj1J8k4%jRj3LNq%%j0J1LlOj2J1lPlQkoNLnPojLJ
$$ [...]
8191b
##END NTUPLES=NMR FID
##END=
