##TITLE=1H_ES-AN-EtCel-st
 
 8 sc, 
 21.1.2022
##JCAMPDX= 6.0         $$ Bruker NMR JCAMP-DX V2.0
##DATA TYPE= NMR FID
##DATA CLASS= NTUPLES
##ORIGIN= UXNMR, Bruker Analytische Messtechnik GmbH
##OWNER= root
$$ XWIN-NMR		Version 3.5
$$ Fri Jan 21 12:26:18 2022 Russian Standard Time (UT+4h)  she@DPX200
##.OBSERVE FREQUENCY= 200.131346
##.OBSERVE NUCLEUS= ^1H
##.DELAY= (6, 6)
##.ACQUISITION MODE= SIMULTANEOUS
##.ACQUISITION SCHEME= undefined
##.AVERAGES= 8
##.DIGITISER RES= 18
##SPECTROMETER/DATA SYSTEM= spect
##.PULSE SEQUENCE= zg30
##.SOLVENT NAME= DMSO
##.SHIFT REFERENCE= (INTERNAL, DMSO, 0, 15.7039)
##AUDIT TRAIL= $$ (NUMBER, WHEN, WHO, WHERE, WHAT)
$$ ##TITLE= Audit trail, XWIN-NMR		Version 3.5
$$ ##JCAMPDX= 5.01
$$ ##ORIGIN= Bruker BioSpin GmbH
$$ ##OWNER= she
$$ F:/spectra/data/she/nmr/H-F/1/audita.txt
$$ ##AUDIT TRAIL=  $$ (NUMBER, WHEN, WHO, WHERE, WHAT)
(   1,<2022-01-21 12:24:20.06 +0400>,<she>,<DPX200>,
      <created by zg, POWCHK disabled, PULCHK disabled
       configuration hash MD5:
       00 E9 B6 7A A2 85 ED C7 34 08 36 98 17 FE 4E 26
       data hash MD5: 16K
       66 7A 07 5F 82 1B E7 86 DC 32 F2 2F D6 60 52 B3>)
$$ ##END=
$$ 
$$ hash MD5
$$ DC 2D F5 25 77 03 E0 2E 01 52 48 E5 8A 58 70 15
##$RELAX= 
##$RELAX= 
##$RELAX= 
##$RELAX= 
##$RELAX= 
##$RELAX= 
$$ Bruker specific parameters
$$ --------------------------
##$DU= <F:/spectra>
##$EXPNO= 1
##$NAME= <H-F>
##$PROCNO= 1
##$TYPE= <nmr>
##$USER= <she>
##$AMP= (0..31)
100 100 100 100 100 100 100 100 100 100 100 100 100 100 100 100 100 100 
100 100 100 100 100 100 100 100 100 100 100 100 100 100 
##$AQSEQ= 0
##$AQ_mod= 1
##$AUNM= <au_zg>
##$AUTOPOS= <>
##$BF1= 200.13
##$BF2= 200.13
##$BF3= 200.13
##$BF4= 200.13
##$BF5= 200.13
##$BF6= 200.13
##$BF7= 200.13
##$BF8= 200.13
##$BYTORDA= 1
##$CFDGTYP= 0
##$CFRGTYP= 5
##$CHEMSTR= <none>
##$CNST= (0..31)
1 1 145 1 1 1 1 1 1 1 1 1 1 1 1 1 1 1 1 1 1 1 1 1 1 1 1 1 1 1 1 1 
##$CPDPRG= <>
##$CPDPRG1= <>
##$CPDPRG2= <>
##$CPDPRG3= <>
##$CPDPRG4= <mlev>
##$CPDPRG5= <mlev>
##$CPDPRG6= <mlev>
##$CPDPRG7= <mlev>
##$CPDPRG8= <mlev>
##$CPDPRGB= <>
##$CPDPRGT= <>
##$D= (0..31)
0 1.2 0 0 0 0 0 0 0 0.06 0 0.03 0 0 0 0 0.0002 0 0 0 0 0 0 0 0 0 0 0 0 
0 0 0 
##$DATE= 1642753459
##$DBL= (0..7)
120 120 120 120 120 120 120 120 
##$DBP= (0..7)
150 150 150 150 150 150 150 150 
##$DBP07= 0
##$DBPNAM0= <>
##$DBPNAM1= <>
##$DBPNAM2= <>
##$DBPNAM3= <>
##$DBPNAM4= <>
##$DBPNAM5= <>
##$DBPNAM6= <>
##$DBPNAM7= <>
##$DBPOAL= (0..7)
0.5 0.5 0.5 0.5 0.5 0.5 0.5 0.5 
##$DBPOFFS= (0..7)
0 0 0 0 0 0 0 0 
##$DE= 6
##$DECBNUC= <off>
##$DECIM= 32
##$DECNUC= <off>
##$DECSTAT= 4
##$DIGMOD= 1
##$DIGTYP= 9
##$DL= (0..7)
0 120 120 120 120 120 120 120 
##$DP= (0..7)
150 150 150 150 150 150 150 150 
##$DP07= 0
##$DPNAME0= <>
##$DPNAME1= <>
##$DPNAME2= <>
##$DPNAME3= <>
##$DPNAME4= <>
##$DPNAME5= <>
##$DPNAME6= <>
##$DPNAME7= <>
##$DPOAL= (0..7)
0.5 0.5 0.5 0.5 0.5 0.5 0.5 0.5 
##$DPOFFS= (0..7)
0 0 0 0 0 0 0 0 
##$DQDMODE= 0
##$DR= 18
##$DS= 0
##$DSLIST= <SSSSSSSSSSSSSSS>
$$ [...]
##$SUBNAM2= <"">
##$SUBNAM3= <"">
##$SUBNAM4= <"">
##$SUBNAM5= <"">
##$SUBNAM6= <"">
##$SUBNAM7= <"">
##$SUBNAM8= <"">
##$SUBNAM9= <"">
##$SW= 18.0517287032376
##$SWIBOX= (0..15)
0 0 2 0 0 0 0 0 0 0 0 0 0 0 0 0 
##$SW_h= 3612.71676300578
##$TD= 16384
##$TD0= 1
##$TE= 0
##$TE2= 300
##$TE3= 300
##$TEG= 300
##$TL= (0..7)
0 120 120 120 120 120 120 120 
##$TP= (0..7)
150 150 150 150 150 150 150 150 
##$TP07= 0
##$TPNAME0= <>
##$TPNAME1= <>
##$TPNAME2= <>
##$TPNAME3= <>
##$TPNAME4= <>
##$TPNAME5= <>
##$TPNAME6= <>
##$TPNAME7= <>
##$TPOAL= (0..7)
0.5 0.5 0.5 0.5 0.5 0.5 0.5 0.5 
##$TPOFFS= (0..7)
0 0 0 0 0 0 0 0 
##$TUNHIN= 0
##$TUNHOUT= 0
##$TUNXOUT= 0
##$USERA1= <user>
##$USERA2= <user>
##$USERA3= <user>
##$USERA4= <user>
##$USERA5= <user>
##$V9= 5
##$VALIST= <valist>
##$VCLIST= <CCCCCCCCCCCCCCC>
##$VD= 0
##$VDLIST= <DDDDDDDDDDDDDDD>
##$VPLIST= <PPPPPPPPPPPPPPP>
##$VTLIST= <TTTTTTTTTTTTTTT>
##$WBST= 1024
##$WBSW= 4
##$XGAIN= (0..3)
0 0 0 0 
##$XL= 0
##$YL= 0
##$YMAX_a= 218892
##$YMIN_a= -272939
##$ZGOPTNS= <>
##$ZL1= 120
##$ZL2= 120
##$ZL3= 120
##$ZL4= 120
##$ABSF1= 10
##$ABSF2= 0
##$ABSG= 5
##$ABSL= 3
##$ALPHA= 0
##$AQORDER= 0
##$ASSFAC= 0
##$ASSFACI= 0
##$ASSFACX= 0
##$ASSWID= 0
##$AUNMP= <proc_1d>
##$AZFE= 0.1
##$AZFW= 0.1
##$BCFW= 1
##$BC_mod= 2
##$BYTORDP= 1
##$COROFFS= 0
##$CY= 11.3945322036743
##$DATMOD= 1
##$DC= 2
##$DFILT= <>
##$DTYPP= 0
##$F1P= 2.36226072786647
##$F2P= -0.459571619588291
##$FCOR= 0.5
##$FTSIZE= 0
##$FT_mod= 4
##$GAMMA= 1
##$GB= 0.15
##$INTBC= 1
##$INTSCL= 1
##$ISEN= 128
##$LB= 0.24
##$LEV0= 0
##$LPBIN= 0
##$MAXI= 10000
##$MC2= 0
##$MEAN= 0
##$ME_mod= 0
##$MI= 1.114404
##$NCOEF= 0
##$NC_proc= 0
##$NLEV= 6
##$NOISF1= 3.799351
##$NOISF2= 2.8
##$NSP= 1
##$NTH_PI= 0
##$NZP= 0
##$OFFSET= 15.70392
##$PC= 1
##$PHC0= -15936.87
##$PHC1= -4.399225
##$PH_mod= 1
##$PKNL= yes
##$PPARMOD= 0
##$PSCAL= 0
##$PSIGN= 0
##$REVERSE= no
##$SF= 200.130013532006
##$SI= 16384
##$SIGF1= 3
##$SIGF2= 2
##$SINO= 400
##$SIOLD= 16384
##$SREGLST= <1H.CDCl3>
##$SSB= 0
##$STSI= 0
##$STSR= 0
##$SW_p= 3612.71676300578
##$SYMM= 0
##$S_DEV= 0
##$TDeff= 0
##$TDoff= 0
##$TI= <>
##$TILT= no
##$TM1= 0
##$TM2= 0
##$TOPLEV= 0
##$USERP1= <user>
##$USERP2= <user>
##$USERP3= <user>
##$USERP4= <user>
##$USERP5= <user>
##$WDW= 1
##$XDIM= 8192
##$YMAX_p= 0
##$YMIN_p= 0
$$ End of Bruker specific parameters
$$ ---------------------------------
##NTUPLES= NMR FID
##VAR_NAME=  TIME,          FID/REAL,        FID/IMAG
##SYMBOL=    X,             R,               I
##VAR_TYPE=  INDEPENDENT,   DEPENDENT,       DEPENDENT
##VAR_FORM=  AFFN,          ASDF,            ASDF
##VAR_DIM=   8192,          8192,            8192
##UNITS=     SECONDS,       ARBITRARY UNITS, ARBITRARY UNITS
##FACTOR=    0.0002768,     1,               1
##FIRST=     0,             0,               0
##LAST=      2.2672688,     0,               0
##MIN=       0,             -272939,         0
##MAX=       2.2672688,     218892,          0
$$ Real data points
##PAGE= N=1
##DATA TABLE= (X++(R..R)), XYDATA
0@%%%%%%%%%%%%%%Qj6J6j6J6j6K0k8L2l6M4m8N6o8P6q4R5j07J20j33J48j70J91
37A00k09K31k57K86l16L45l79M18m60N05n55O11o71P39q15R00r96J103j227J372
57G25j543J748j997K305k699L217l925M942o500R114j4175K6959j08284j82826
71b72939L77708K137p8791j49629J38563J99486m17120J06693K60456j19367r8951
82e1754j27841L21582j8429l29422K45094M2948o7415r9186j091L00184k56495
93d1825j09052K33634n1189m106j40585J29473J36463k91720J15156R1589n2949
104A4889j2236j16261K15549o0992j60696J80697n6972J3222m9110j6029J67695
115A19756j87128L1378J00593r8422O2816q0732Q0715K2688j52581J58628m3059
$$ y = [0, 0, 0, 0, 0, 0, 0, 0, 0, 0, 0, 0, 0, 0, 0, 8, -8, 8, -8, 8, -8, 12, -16, 16, -20, 24, -24, 32, -36, 40, -44, 51, -56, 64, -69, 79, -91, 100, -109, 122, -135, 151, -165, 180, -199, 219, -241, 264, -291, 320, -351, 388, -427, 473, -523, 580, -647, 725, -818, 930, -1067, 1238, -1461, 1756, -2169, 2773, -3727, 5387, -8788, 18171, -90113, -272939, 104769, 106906, 28115, -121514, 17049, 216535, -200585, -93892, 166564, 47197, -51754, -179595, 141987, 123558, -205864, 39230, 82178, 14763, -84423, -85514, 214670, -41825, -150877, 82757, 31568, 27462, -113123, 16350, 152813, -138907, -23751, 67838, 14889, 2653, -113608, 101941, 40949, -119747, 60950, 3978, 17200, -31910, -47939, 119756, -67372, -35994, 64599, -33823, 28993, -51739, 28976, 51664, -100917, 57711, 14652]
126A4652m7878N1760n5271J07236j11935p512J42255j36339L0837J1878J1833
137A1516L5709j44186J34270K5234j29465O9636o530N9340p8030o0875J80983
148I7602r4115n9924N8125J7112L9886j46580P1302J18980j45639O417L5349N6794
160E5309l9629j23584J63181O504j19238L2842L3790O5349j21740k5620J64880
171I2044q2142n7861K6309N7010K2077j46675P9359R0733j03050j1616J6931P7744
183F0863n0069r7856J28082J457o9409j412K7097O7210j02166j3291J04917m6959
195H464k6970r664M9974K2142j00979N1941M4014m3972q198r786O1511l0139n4680
208d6342O7276p431j6227j1860N143M6816n6088o1M0086k3532N666k0055K2187
$$ y = [14652, -33226, 18534, -36737, 70499, -41436, -48948, 93307, -43032, -12195, -317, 11516, 47225, -96961, 37309, 62543, -66922, 2714, -3816, 55524, -22506, -83381, 97602, 3487, -56437, 1688, 18800, 58686, -87894, -16592, 102388, -43251, -36834, -1485, 55309, 15680, -107904, 55277, 61781, -57457, -24615, 9175, 74524, -47216, -72836, 92044, 9902, -47959, -21650, 35360, 57437, -89238, -9879, 80854, -22196, -33812, -16881, 60863, 10794, -87062, 41020, 42477, -26932, -28344, -1247, 65963, -36203, -49494, 55423, 8464, -18506, -28170, 21804, 43946, -57033, -5092, 38922, -5050, -13248, -23034, 38477, 8338, -46342, 20934, 13503, -2724, -14584, -9441, 37375, -18713, -18774, 21312, -2220, 3446, -16609, 5578]
221E578J4424m3886K9246K14q978Q815j9277K6645j3073j0405K3651k2846J3479
234C587l21j0237J5185j8235J6926j826j9717K4026q464j884j688k851K1290k3876
248h085j612K0810r912k546r148J7052O685k9955J4143J3531q393j0025k102K5663
262A6106j2306k1480K0397Q472j0001j4919J2301J9710k4066q243K0255M836j4493
275c431j1324K2060O485k5007K293J8006l32j7734r32K2173n416j9333Q124J5307
289A0939o294j6415Q415J5825j1488j2062J0974J0573j0686j0334J2305Q417j3123
302b954n982J2719M231j1825l418J1419K935j2093r60J1719j306r592J267R040
316E200j347r722L524Q000m035o302K852P137m172o418N669L598m049l443L260
$$ y = [5578, 20002, -23884, 5362, 5576, -3402, 5413, -13864, 12781, -292, -10697, 12954, -9892, 3587, 3266, -6971, 8214, -10021, 6905, 5079, -14638, 9388, 924, -960, -2648, -5499, 15791, -8085, -9697, 11113, 1201, -1345, -10493, 6559, 13244, -16711, -2568, 10963, 2570, -7455, -9557, 16106, 3800, -17680, 2717, 11189, 1188, -13731, -1430, 18280, -5786, -14029, 6226, 11062, -3431, -14755, 7305, 13790, -11217, -8924, 9082, 8750, -8984, -9916, 12257, 6841, -12492, -4368, 10939, 4645, -11770, -3355, 12470, 982, -11080, -106, 10467, -219, -10553, 1752, 10169, -2954, -8936, 3783, 8014, -3811, -7229, 4190, 7125, -4968, -5928, 5791, 4485, -5107, -3840, 5200, 3853, -5869, -2345, 5655, 1620, -4682, -1830, 5307, 1135, -5283, 386, 3984, -65, -3508, -248]
331b48M525n146k852N344J029l694j684L865J652m427n16L681L55l348l14L452
347A674k67l143N72K958j000k473J021J981j99l115J211L185k953n46R81Q58M07
364A152l726L100J478l633J500l67K145j591l180N763k480j328J312j321M413
379C237n644O99N524o118K738j357J047L093q365P002L22m931M314m428O277l326
395H4n237J0535p333J460J080l375Q865j1334M199O574j0336P537n517L751L512
410D465j2831J3667m653m159P114q796J1558q553l470J4595j4511O981j112l492
424c197J1360j7317J1744K980j3449J3594j0078P517m46j2977K1066j3843p13
437c759Q908j1049J4732j5789M151J4674k2551J4418l737j396Q820k0968K2756
$$ y = [-248, 4277, -869, -3721, 1623, 2652, -1042, -2726, 1139, 2791, -1636, -2152, 1529, 1884, -1464, -1778, 1674, 1407, -1736, -1164, 1794, 794, -1679, -658, 1323, 1124, -1991, -780, 2405, -548, -1094, -113, 745, 1152, -2574, 526, 2004, -1629, -129, -496, 1649, 58, -3122, 2641, 161, -1167, 145, -1176, 3237, -2407, -1708, 3816, -2302, 436, -921, 126, 3219, -5146, 1856, 2178, -2753, 1561, -2867, 3410, 84, -5153, 5382, -1951, -491, 589, -2786, 6079, -5255, -1056, 5518, -4818, 2719, -2798, 953, 4465, -8366, 5301, 648, -3511, 3603, -5193, 6365, -2188, -5658, 8937, -5574, 1407, 295, -3197, 8163, -9154, 2590, 5570, -7879, 5715, -4363, 3154, 2708, -10269, 10797, -3046, -3759, 5149, -5900, 8832, -6957, -2806, 11868, -10683, 3735, -2, -1398, 7422, -13546, 9210]
450I210n438j4662J9029j3447J1892q724q134K7290k5674N541Q869j0572J5277
463A0457k4398J6804J0843k9698K2097p334L882J728k1961L4879j7336j2410K1788
476I341j4771J6048k0119J777K9744l6480J3094N799o125J2078l0683L0387K159
489A2249l1176K7051j0994J0159q257j7125M1720k9216n410J9828j3566J7882
501A3145k9422J4015K4880m1718K1424l78l00O371l1589M1252j0661k6270K9569
514A0318j5046J5875j8471p640M2579m0440N839J4847j1499J7074l5540K8066
526E962J3760m2716K9888p521N890k075k6711M8174k5421j6220K8648j7236J8776
539A3198k7028N661L5801m6626J7396P277p014J2361l5472L8269p61l5784L3045
$$ y = [9210, 3772, -10890, 8139, -5308, 6584, -2140, -10274, 17016, -8658, -3117, 5752, -4820, 10457, -13941, 2863, 13706, -15992, 6105, -1229, 2653, 4381, -17580, 17299, -37, -12447, 9341, -5430, 10618, -9501, -7724, 22020, -14460, -1366, 4433, -1692, 10386, -20297, 10090, 12249, -18927, 8124, -2870, 7289, -968, -18093, 23627, -5589, -10999, 8829, -4737, 13145, -16277, -2262, 22618, -19100, 2324, 1946, 1646, 8017, -23572, 17680, 7019, -19251, 10318, -4728, 11147, -7324, -14964, 27615, -12825, -6986, 7861, -3638, 13436, -22104, 5962, 19722, -22994, 6894, -627, 5263, 3188, -23523, 24651, -770, -16990, 11658, -5578, 13198, -13830, -8169, 27632, -18994, -1598, 5679, -1335, 11026, -24446, 13823, 13062, -22722, 10323]
552A0323j3513J1380j0521j6869M6571l5796l120K2372j6411J9102l1548J7713
564c17K3560m5280K6497k292j201O673l1090M3193j5307k3690L2146j8973J6324
577A0243j7349n663L9333m1914J1370J2651j4557J8492l2055K6764P986l7382
589b2081L2803j2728M307J552k2524M0721k7030p623K6472k2304J8433j9697N324
602d375K5272m0362K3294K041j1395J4472k5924L0233p643k4736L3572j8840P087
615B696l534j0421L2662l4035O475J9456k1421J5658j9254J5853J0447l6037L0187
628H732m931p228P274j7985L2087k0122j3657L0994j9816Q329r861J373K5061
641B0250l6983J4837J2258j5423J0602j9436K3591n6k9265K8918p932n52j601
$$ y = [10323, -3190, 8190, -2331, -19200, 27371, -8425, -11545, 10827, -5584, 13518, -18030, -317, 23243, -22037, 4460, 2168, 967, 7640, -23450, 19743, 4436, -19254, 12892, -6081, 10243, -7106, -12769, 26564, -15350, -3980, 8671, -5886, 12606, -19449, 7315, 15301, -22081, 10722, -2006, 2301, 3853, -18671, 22050, -4980, -12603, 13869, -8435, 9998, -9699, -4375, 20897, -19465, 3829, 5870, -5525, 8947, -16977, 13256, 5613, -19123, 14449, -4391, 2696, -838, -11259, 21403, -12632, -6157, 13299, -8122, 7536, -11718, 4135, 14582, -21455, 8732, 3801, -3427, 3847, -14138, 17949, -2173, -15830, 15164, -4652, 3677, -6184, -4811, 20250, -16733, -1896, 10362, -5061, 5541, -13895, 9696, 9640, -19625, 9293, 1361, 809, -792]
654g92j1245L1062k4381o101K2178j3851R107j5995Q548J8358l1492J4600M794
667D790n268M851j8841K5051m222k0203J9849p377O879q429p564K6210k0467j194
681e935J0282o494J0362j8856J0023J2600k1350J0768k797M057K292j7817K0710
694G845m582r516R369p744J2436j0184n646J7964j3265L024m32j589J0991j6588
708g917P464O039r691P291q060P569J615j2264J2550m787n51K643p187J1315p299
723a270k336P846p360O089m452q31P329r059N568r98k864O341p609M714K30l930
739b592O145o824L756K246n672M679l633L413N36o774P283j573j739M26j815O752
755D614n985k322O922k541p14l081L796M342r151K030N192j461l176k482Q184
$$ y = [-792, -12037, 19025, -5356, -11457, 10721, -3130, 5977, -10018, -1470, 16888, -14604, -4, 4790, -478, 4373, -14468, 10583, 6361, -13842, 6007, -1370, 5509, -2920, -10484, 15726, -4741, -5935, 4347, -2147, 8215, -10641, -618, 11982, -9368, 1400, -1397, 2660, 4952, -12865, 7845, 3263, -6253, 3116, -4628, 7808, -2376, -8022, 9942, -3323, -299, -731, -2320, 8671, -7917, -453, 5586, -4105, 3186, -4874, 2695, 4310, -7954, 4596, -191, -742, 1901, -5286, 6029, -1270, -3606, 4240, -3120, 2969, -1483, -2314, 5015, -4044, 1524, 526, -2338, 4003, -3606, 1108, 1338, -2592, 3553, -3271, 485, 2731, -2941, 1738, -1895, 1518, 2054, -4720, 2563, 990, -749, -323, -2138, 4614, -1371, -3693, 3229, 688, -26, -3107, 689, 5031, -4120, -2090, 3102, 1641, -1535, -4017, 4167]
770D167j259q218M637M276j692o206J897Q754o198n678N960M120m044o425O547
785F38N600q544k657P041K891p218l304R164J033q731K62P661P1q467J087Q703
801E230k875p479L232O922l455o968M494O245n186n292N434M527n682l734N826
816A239L018n997k185O056J221n667p22N482K28n508Q41M697j304l800J023L908
832B530j584l585K420K208j862j779J391J990j942j076J660K78o68o29P22M13
848D87q07M63k86j56Q29m66m91O9J022r7j754Q48J678j063j794J261K149j939
866d7j898K165J819k350k036L159J515l454j056L381J303m228o07M560m24l725
882a923j00M307j39n328K097M039k191l264J180M849k900m465M418K175k656l132
$$ y = [4167, 2908, -5310, -673, 3603, 1911, -4295, -2398, 6356, 158, -5520, 440, 4560, 516, -5909, 638, 6238, -2306, -4963, 2078, 4969, -2249, -5553, 3611, 4644, -4087, -3825, 3836, 3907, -4560, -3473, 5230, 2355, -5124, -1892, 5030, 1575, -5393, -899, 5346, 160, -5132, 302, 4829, -853, -4587, 1239, 4257, -1740, -3925, 2131, 3352, -2315, -3037, 2445, 2673, -2835, -1994, 2703, 1399, -2401, -1378, 2530, 946, -2639, -219, 1989, 127, -1652, -261, 1729, -213, -1289, 371, 649, -19, -648, 74, 487, -320, 143, -143, -299, 530, 64, -427, -358, 664, 567, -1187, -339, 1339, 276, -1518, -257, 1892, -47, -1945, 220, 2039, -311, -2347, 812, 2327, -1127, -2183, 1198, 2501, -1727, -2334, 2226, 1802, -1923, -2023, 2284, 2145, -3183, -1086, 2953, 762, -2502, -1322, 3527, 627, -3838, 580, 2755, 99, -3033]
898c033K834M330n652j401M570L12k312l097N103J721o580K039K781J24k898k081
914c240O810k453m263L409O83J082m799J218N970n992k2J871Q10P55o127N519
930A231J818n751K869q94K993k192m112P796l738j640K062j532M587o291J294
945a500N487o427L081j562J161K614p510O846p28l950M321m232N153k915l484
960c645Q099o523J994Q35k815O139p919M057L198p386O466m169K352J548p460
975e229R718n003j959N296n809O738n987j90Q234j0269N498n41j810N334j0028
990f007Q992j96p914Q571n745M669k062n807J2479r486M00M748n181P335r751
1005d955M408O948j2363P939k421P79K866j0634J3007m183o541Q814o356O807
$$ y = [-3033, -199, 4131, -1521, -2922, 1648, 1960, -352, -3449, 1654, 3375, -3205, -1166, 1615, 1739, -1159, -3240, 3570, 1117, -3146, 263, 946, 2028, -2771, -1553, 4417, -1575, -1597, 274, 1084, 1839, -4288, 1231, 3049, -2702, 167, -727, 2266, 74, -4038, 3758, 20, -1620, 442, -1090, 3497, -2794, -1500, 3987, -2440, 641, -921, 240, 2854, -4656, 2190, 1462, -2488, 1833, -2399, 2754, -161, -3645, 4454, -2069, -75, 760, -2055, 4084, -3835, 222, 3420, -3966, 2500, -1669, 683, 2231, -5229, 4489, -514, -2473, 2823, -2986, 3752, -2235, -2425, 5809, -4460, 1038, 497, -1313, 4021, -6007, 2985, 2789, -5125, 3446, -2299, 2370, 308, -5499, 6980, -2506, -2106, 2642, -2539, 4796, -4955, -547, 6401, -5962, 1977, -444, 335, 3201, -7433, 5574, 1391, -5150, 3664, -2692, 4115]
1019D115o184k600J3050j2816L542K692l509O824j2303R294L417j2442J0084m672
1033a508L579o41r098J5756r193l191Q026o567Q062r985K448J0958j5303P543
1047H86j9j360M667j2656J3784j953j0447J1224o305N652m577n156J5783j3359
1061c836J009O129n456P259j1976P643O699j5279J0058k291J061J200j0607J6087
1075G700p016o951J0567o517O540q013j64J3548j5662M892L408l358N371j2510
1089h165J1970J461j3170J1339m511L569k438p315J6388j1236k257Q188o088P109
1103D844j0359M360R371j5217Q137l43q65L299j1135J3655l492q701J0488o145
1117b103N349m776l424J3374j2567K389M614m974O373j0021P140L985j2071R619
$$ y = [4115, -2069, -4669, 8381, -4435, -893, 1799, -1710, 5114, -7189, 2105, 5522, -6920, 3164, -1508, 2071, 1430, -7668, 8088, -1105, -4296, 3730, -2837, 5225, -4760, -2312, 8646, -6657, 886, 867, -493, 4174, -8482, 5302, 3349, -7098, 4126, -2179, 3473, -1104, -6260, 9523, -3836, -2827, 3302, -2154, 5105, -6871, 772, 7471, -7808, 2250, -41, 1020, 2220, -8387, 7700, 684, -6267, 4300, -2217, 4323, -3690, -3854, 9694, -5968, -1076, 2332, -1026, 4345, -8165, 3805, 5266, -7904, 3435, -1076, 2493, 55, -7260, 9128, -2108, -4365, 3823, -2265, 4844, -5515, -1155, 8216, -7001, 1136, 793, -72, 3227, -7908, 5747, 2255, -6446, 4042, -2103, 3246, -1530, -4954, 8420, -4147, -1758, 2856, -2118, 4255, -5766, 1374, 5359, -6712, 2907]
1131B907l361R31J272p844J2511p258l367Q483o913N668n572N67Q592j2235O355
1146G36J226l807M883q214Q684j322p972J0009n609K156n65m007J0068r585J317
1161b002N898o500N097n637L683L890j0277Q205j383k160K773n646Q570m762m024
1176d275Q444n719K547k082o60O948r358L753L226m694L583m853N148L95p317
1191d914P637k553m57O79l296P284n879j056N702m637K800l047J300M198p555
1206c794M445O96k338K325m222N239j398m195N538l054J352p16j883N352n100
1221a753Q55K621l032K830l221J796K053m685L622j086l48J416l140L810j746
1236hj442K991k688K013j055r68L060l233J486L93j547K328k454J307O08j999
$$ y = [2907, -454, 477, 1749, -6095, 6416, -842, -4209, 4274, -2639, 3029, -2543, -1976, 6616, -5619, 736, 1962, -1845, 3038, -5176, 3508, 2186, -5786, 4223, -1386, 770, 205, -3802, 6266, -3319, -2002, 3896, -2604, 2493, -3144, 539, 4429, -5848, 2357, 974, -1186, 1587, -4059, 4511, -251, -4275, 4169, -1550, 997, -1085, -1745, 5203, -4155, -402, 2824, -1870, 1713, -3140, 2008, 2403, -4914, 2723, 170, -287, 392, -2904, 4380, -1499, -2555, 3147, -1490, 1310, -1737, -437, 3761, -3794, 651, 1347, -991, 1334, -2888, 2351, 953, -3242, 2296, -758, 594, -122, -2005, 3347, -1753, -898, 1723, -1309, 1521, -1700, 96, 2149, -2536, 1086, 0, -348, 1068, -2072, 1738, -8, -1450, 1541, -1147, 866, -189, -1157, 1903, -1330, 156, 549, -998, 1330, -1124, 183, 791, -1208]
1252a208K309j779O52Q02j951K159j391J72J035j932J982r41m69J316j530J415
1268F41p47n40J566j524P72j04m02J053j494R60K87j024R00p27O94l1j048J300
1286E32n27k01L33m13P33o96k4P26o47J92j12J79K06p15N65O9l58K19j70K91j80
1307Bk58M81j70j76J09O2N7k20P3J36j12j4L1N5r8JJ31p6j08J18P4j64N1N8m8
1332eJ1q6J83l8k76L07L6j99j4O2K17k95n7L46j54j41qL06l6n17M01K27l17j40
1356a87J09M09l46l84N78O8m37p3M54J20o30Q2N66j12n60P9P14l04o32M25M97
1377D36l94n47N47M55o10l87N93N01q55k99R64n7o50j21P35K29j159L21Q95m53
1397A44n68N3J048m88j027J018K91m43n52L49J109j311k74J176l05k53o21R47
$$ y = [-1208, 1101, -678, -26, 776, -1175, 984, -407, -235, 800, -1132, 850, -91, -560, 756, -774, 641, -106, -646, 920, -604, 168, 64, -338, 715, -779, 181, 468, -556, 344, -383, 311, 280, -768, 532, 5, -196, 137, -276, 457, -239, -263, 463, -184, 8, -104, 75, 281, -434, 131, 200, -158, 61, -109, 182, 2, -256, 225, 55, -121, -12, 50, 107, -113, -40, 96, -16, -30, 1, 56, -42, -41, 90, 14, -94, 24, 98, -66, -15, 43, -5, 6, -80, 103, 65, -211, 96, 132, -67, -81, -19, 198, -97, -154, 192, 38, -103, -111, 195, 159, -358, 43, 270, -47, -187, -78, 331, -15, -399, 179, 247, -190, -263, 191, 311, -319, -237, 329, 217, -343, -264, 450, 146, -486, -61, 436, 42, -505, 42, 497, -113, -500, 93, 594, -261, -560, 404, 347, -303, -424, 311, 540, -619, -298, 597, 144, -424, -371, 677, 189, -838, 180, 471, 28, -524, -175, 934, -377, -651, 525, 220, -33, -654, 293]
1415B93M89j632P39N40k80l10n06J536p45r66J281l88K20p27J28J452j821M41
1433b56P24o31N16j156J248J53j631J566n87J22L7q76J882j603%J356j506J116
1451D74r02L47J055k291J919k52r95J212j332J666j037r79K582k102N44K36n47
1468d02J745k845J639J193k598J761r88J123j07k541L695j520j177J473j043K240
1484A648k890J91L378l496J071j11M29J285m173L642N12l127K099j242K423j783
1500a44k383N145k918n73J018o11K792m693J823L243m375J857r14J661M67m812
1516c417N283q19k623K115j661L461l269j373N437m177O53K39j38K803n600L401
1532C15J992m321K781j890K460n27m151O103k756j288K045j969L807m443N50M481
$$ y = [293, 782, -850, -111, 429, 149, -161, -667, 869, 124, -842, 439, 51, 271, -456, -328, 1124, -697, -256, 468, -163, 353, -803, 445, 598, -1033, 533, -54, 68, 105, -771, 1111, -492, -492, 864, -642, 474, -428, -81, 974, -1317, 602, 350, -645, 567, -765, 901, -136, -1115, 1467, -635, -91, 145, -402, 1343, -1502, 137, 1330, -1268, 493, -495, 628, 521, -2020, 1675, 155, -1022, 451, -592, 1648, -1242, -1051, 2327, -1169, -98, -209, 220, 1505, -2668, 974, 1486, -1641, 458, -784, 1639, -144, -2527, 2618, -300, -873, 145, -466, 2326, -2367, -544, 2699, -1676, 181, -733, 928, 1395, -3417, 1866, 1047, -1576, 539, -1122, 2339, -930, -2303, 3134, -1043, -390, -151, -289, 2514, -3086, 315, 2307, -2014, 767, -1123, 1337, 810, -3341, 2762, 6, -1282, 763, -1206, 2601, -1842, -1292, 3189]
1548C189n243K470p11K76K049n492N243m63l655L766k704L001k030k324O172m970
1564a426O84J677j947L357n117L044K504n742M077j468Q50N21m420O482k957k406
1580b287M033k838K959l379N0N304o359K296J092j303K201n127N062L06n286M812
1596A536j997J478j124k770O783m992p50L508k483K721m434K322L706o681L684
1611E07q6l02J014m607O289j967l776M700k519K248k530r95N960n943J141K115
1627A249j902K441m688L806J594n644M310j304O55nl431O089l499j710L764k693
1643i68K506l037N83M100n693K664N97j274J879m008M355n64l788M333k301J283
1659F67p46j850M932m412M78K464k604K446l076J915J909m733L676q93m85J153
$$ y = [3189, -2054, 416, -295, -19, 2030, -3462, 1781, 1318, -2337, 1429, -1275, 1726, -304, -2628, 3544, -1426, -742, 935, -1012, 2345, -2772, 272, 2776, -2966, 1111, -357, 493, 1014, -3406, 3076, 119, -2287, 1746, -1092, 1867, -1512, -1462, 3842, -2517, -221, 871, -432, 1769, -3358, 1704, 2010, -3276, 1536, -461, 1017, -107, -2877, 3906, -1086, -1836, 1672, -811, 1910, -2524, -202, 3504, -3177, 507, 421, 119, 1133, -3474, 2815, 848, -2928, 1772, -747, 1501, -1029, -2024, 3936, -2007, -866, 1249, -653, 1788, -2900, 906, 2500, -3144, 1166, -138, 517, 512, -2919, 3170, -329, -2039, 1725, -968, 1538, -1499, -916, 3184, -2509, 155, 752, -522, 1357, -2651, 1704, 1140, -2648, 1685, -616, 667, -79, -1929, 3003, -1409, -931, 1533, -1071, 1375, -1701, 214, 2123, -2610, 1066, 173, -312, 841]
1675H41k955M254k269j712L684k784J683j306l59L366m408J978J059k018J991
1690A045k642K543P3l248L688j699J52M08j721L453k942j10K570k542J675j453
1706g50O14J776l579K573p4j236J386j988K502j066j687K979k003P00j63p78K405
1723A611k826J008J243j913J551j463J120N19k354K429r18l56Q01j355K002j470
1739c71l77J875j827J016m68j60J329k101J372K14j155J190j110J003j99j129
1755h98J767j144J37M10p78J263j270L06R10j317R27m67P4N56j210J164l18n03
1773c91P57p43P35m20l41R89r44M01O9l78O95q33M87J95o91P14m51J66J60n25
1793c49O67m27k4L59m73M31k71PL16n27M47q4k44L36l12K56r4k17M34l24QJ52
$$ y = [841, -2114, 2140, -129, -1841, 1843, -941, 742, -564, -923, 2443, -1965, 13, 1072, -946, 1045, -1597, 946, 1019, -2229, 1459, -240, -88, 320, -1401, 2052, -890, -1000, 1570, -972, 703, -750, -136, 1640, -1939, 634, 560, -676, 710, -1278, 1224, 158, -1529, 1450, -553, 147, -16, -794, 1611, -1215, -207, 1036, -877, 674, -789, 331, 850, -1504, 925, 7, -349, 452, -903, 1099, -371, -748, 1127, -700, 316, -152, -312, 1017, -1084, 288, 502, -653, 537, -573, 430, 231, -898, 869, -275, -138, 272, -506, 757, -513, -207, 703, -614, 313, -154, -80, 476, -734, 430, 112, -391, 366, -377, 358, -62, -403, 586, -358, 43, 112, -266, 429, -404, 83, 278, -413, 301, -150, 16, 176, -349, 318, -109, -133, 226, -247, 184, -87, -80, 236, -291, 156, 72, -172, 164, -148, 108, 14, -203, 231, -93, -85, 67]
1815F7r4J32k84J94J64l43J47L4L9n4j88L66j04k62K15N6m6j60M9K72k26j60K29
1838D3P3j41j44K46R7l00J1K35k8j88n0K97m1l18J68J91j45j38Q1K20j51k23K59
1861E4Q1j81j01J80J33k85qK10nj39m6J92J3k32J21J11r0p7K5J53j15q0J09K5
1885D8l9r1J23J7j34Q3kJ1l8l0J19j04LN8l7K3p2J05l6r8J89j31J9%l5J97k82
1912a34Q9J80k22J16q9J29K3l27L80q1j34O2r4L54l59q7M51l36R7j20R1K98o37
1935c50L68K02l48J68k66M90j83m93O93k82Oo5j30O73p79J01N59n23K78l98L90
1956A11K84r62P65n0k45J91m77Q86n64m01R14o12K79l00JQ37j212N26L77o12N22
1977B58p08P32K5j018J154m84j3J40n38J169j037l9R38r46O22n27K13P13j451
$$ y = [67, -27, 105, -179, 15, 179, -164, -17, 17, 56, 2, -186, 180, 76, -186, 29, 85, 39, -121, -72, 200, -26, -186, 43, 116, -25, -169, 77, 174, -126, -115, 120, 92, -96, -146, 151, 110, -208, -40, 151, 6, -132, -51, 169, 18, -205, 54, 135, -46, -147, 33, 166, -119, -127, 83, 78, -61, -107, 85, 98, -134, -13, 98, 8, -69, -44, 109, -6, -86, 23, 48, 9, -82, 41, 58, -76, 7, 5, 16, -22, -52, 67, -37, -34, 24, -13, 10, -62, 43, 7, -91, 98, -33, -14, -14, -49, 148, -134, -45, 135, -87, 29, -60, 69, 92, -235, 145, 64, -70, -8, -102, 252, -107, -194, 257, -79, 18, -102, -11, 287, -350, 18, 220, -128, 40, -226, 264, 81, -412, 281, -1, 5, -60, -190, 483, -296, -195, 364, -159, 119, -279, 111, 395, -567, 198, 148, -97, 94, -383, 503, -61, -462, 452, -160, 119, -181, -180, 657, -555, -29, 348, -264, 258, -450, 282, 307, -711, 443, -41, -54, 86, -452, 717, -320, -359, 579, -367, 255, -272, -59, 654, -797]
1996g97J089m6n84O77q73J073m96p44J438j046L47ol92J173j535O82O76j230R65
2015C71p73O51K02j454J736p15l76O71q38J317j213j11J522j582P21k31j1R04
2033G91j891J476J89j277J125q97J055m76j148K148j320q4N45o21J351j815O27
2050b22J288j868J037m78M51L96j957K170m72j074J129q96J342j194n32K218j904
2067e66M17K15k47J145k229J486P19j875J303p74R30k33j662K569j212n65R23
2084C44q00J484j803K40J887k162R03j87J37P77k237K064k1j556J400r38J178
2101G10p85j056K491j771N6O52o73J327j980R68J181k126J350n44M12K90j828
2118a326K337q65r26J357j072J255j201k43K022k140P49K61m45J020j946J603
$$ y = [-797, 292, 246, -338, 339, -534, 539, 43, -701, 737, -309, 38, 32, -360, 813, -722, -40, 636, -594, 371, -402, 249, 451, -1003, 733, 18, -358, 313, -525, 792, -421, -532, 990, -592, 129, -102, -113, 791, -1100, 376, 565, -712, 413, -484, 571, 95, -1053, 1095, -225, -309, 236, -385, 966, -849, -222, 1066, -802, 235, -243, 208, 604, -1353, 817, 345, -729, 400, -496, 846, -348, -880, 1338, -566, -149, 66, -181, 964, -1265, 221, 940, -935, 368, -406, 524, 291, -1371, 1198, -14, -579, 344, -456, 1028, -775, -535, 1352, -810, 93, -94, 43, 820, -1417, 647, 626, -930, 470, -468, 710, -75, -1131, 1360, -411, -355, 297, -376, 951, -1029, -61, 1120, -1006, 344, -200, 212, 502, -1326, 1011, 146, -780, 577, -495, 760, -441, -684, 1338, -802, -53, 208, -237, 783, -1163, 440]
2134D40K85j768J600q51O41k13j197K288j548k43J122r90J152j436N18J332k137
2151a005J208q4k17N90j584J903n06j263J602r37O99n97n00J926j861L31P86q05
2169c14Q88j406J046O08j853J410l70O9J25j139J907j049o29J301r05P57q76J03
2187c27J379j833P56L06m57O12j272J318m7j289J325o23L49j96o67J605j267m7
2205c75Q52p60P17r23M45P71j461R37j05j97L91r45J209m46o77J032p07M64l23
2224a01k86J091j154L75L63n70O33p88N80K23r36R08m12N6J86o09R33o42j17O66
2244C99o90N27l88K7N76r16O12ol49M52n67N70j56m84P58n13J67M0k92O19o64
2265b78K09L50n37M09l12J89K15o25N79j46j98K72l36M54k95j85N20m19J67n8
$$ y = [440, 725, -1043, 557, -294, 347, 134, -1063, 1225, -323, -566, 556, -434, 718, -718, -200, 1132, -1005, 203, 119, -98, 492, -1092, 811, 305, -958, 644, -293, 406, -191, -691, 1235, -626, -295, 491, -314, 574, -832, 214, 822, -1031, 379, 9, 78, 203, -936, 971, -78, -707, 594, -311, 446, -430, -327, 1052, -781, -25, 281, -176, 436, -836, 482, 435, -854, 471, -152, 197, 1, -666, 939, -328, -375, 477, -283, 434, -489, -44, 727, -734, 203, 98, -99, 292, -653, 556, 110, -567, 465, -242, 222, -101, -387, 704, -450, -75, 288, -282, 351, -437, 143, 366, -570, 338, -74, -18, 168, -441, 492, -150, -267, 399, -291, 236, -152, -125, 451, -465, 147, 141, -208, 244, -323, 247, 91, -393, 365, -148, 19, 59, -233, 386, -278, -69, 281, -256, 153, -159, 30, 245, -380, 199, 53, -145, 127, -209, 245, -50, -235, 285, -134, 33, -25]
2285b5o7L59n16K64J61l27K64k47K20L0l64L93j55k9P2j75L43k79m1K88k57J53
2307F5j33J7K23l34J79M4j20J31j93J87jj98K03q2L6j0j08K04j47k1J16j06J10
2330F2r8RJ27j68P4K1m3O4j11P9K8j03Q1m9L2J5q0J10n8j7M3o1Q6n8l1Q6o9L4
2358EMl0N3o0K5K0k8M4m1J4J2m7N0l9OM3o7N6nk5K6m5M6J0o3M9j9K7l1k2P7o6
2390b1J3J2JL1r0M6O5r5L5j5M0k0o1Q6j2l6PjQ1j05RP8p1L8o4N8M4j32R5j1j7
2421a2Om9J35q7l7Q8n9M2q4L0J22j71Q7Kl6Q5j65J59kj43J44j02R0m0j06K21j76
2448e8M1N1r4J82k28R5J23k25J89j33N3J00k63K77j05p7J51k08K68j81o2K70k99
2471a33J93q1o4K66l77K70J6k45L05k77J97qk70M26l20P5J14k49L80l75J10K59
$$ y = [-25, -92, 267, -249, 15, 176, -151, 113, -134, 86, 116, -248, 145, -10, -39, 33, -142, 201, -78, -119, 169, -88, 65, -68, -51, 172, -162, 17, 61, -59, 72, -121, 66, 65, -133, 70, -12, 24, 14, -94, 110, -37, -58, 58, -48, 62, -36, -27, 100, -68, 6, 27, -16, 48, -63, 16, 44, -59, 22, -27, 5, 20, -60, 50, -8, -25, 18, -43, 43, -15, -46, 40, -29, 5, 9, -21, 32, -28, -3, 17, -11, 33, -8, 6, 18, -29, 21, -18, -12, 31, -36, 20, 15, -10, 16, -29, 17, 27, -36, 13, -6, 21, -10, -32, 45, -21, -8, 4, 5, 36, -54, -8, 57, -38, -3, -18, 22, 2, -59, 27, 15, -21, -14, -15, 66, -39, -30, 48, -23, 15, -49, 9, 53, -79, 16, 5, -12, -6, -55, 80, -7, -44, 44, -15, 27, -57, -27, 95, -76, 11, 13, -23, 62, -103, 56, 54, -89, 55, -47, 43, 3, -103, 118, -58, -17, 34, -60, 122, -106, -11, 112, -113, 76, -57, -4, 96, -167, 110, 5, -72, 79, -129, 139, -42, -104, 166, -133, 60, -21, -85, 181, -196, 74, 90, -155, 150, -127, 70, 62, -208, 218, -102, -27, 87, -162, 218, -157, -47, 212]
2493B12m23L51k10M9K18m89M82j53k12L56l63L61k12j71N30n15K04L5j71M09o03
2514c15L66J68n03M68l33K48L1n10P25m04p3K92l55N18n33O9N23o69M00j66L4
2535a9L19p53O82o4m48M97m48M92k52m15Q80o44J26J27k68O09q04L57M20p45N37
2556A86l53K56J62q02R19l30k82M58m99O62n36j54Q37q35L67n7j08N21r37P00
2576A75J07o67O35m82M69j34o25J064o76%L16m51P16q07K45O03r10N92k63R4L10
2597C11r03R87k94m60O47n69O09m30k87J001r31K84J62l05O05r19O05K86q92P60
2617B67m20K81L4p21J112o26k05N73n50O25o58Q7P94j048N24j8j34M03r00R16
2637C36j10o92P79n16M52k78m30J092q95J17L68m23N90q27M72M34r60O92k59J15
$$ y = [212, -211, 140, -70, -21, 197, -292, 190, 37, -175, 181, -182, 179, -33, -204, 326, -189, 15, 50, -121, 288, -315, 51, 219, -284, 184, -149, 99, 130, -380, 345, -59, -132, 160, -195, 323, -210, -141, 382, -287, 113, -53, -19, 300, -453, 229, 165, -283, 214, -234, 258, 6, -409, 471, -173, -47, 80, -188, 421, -383, -26, 394, -351, 186, -167, 89, 251, -551, 368, 38, -244, 214, -285, 377, -159, -313, 524, -311, 56, -1, -109, 412, -525, 175, 282, -385, 250, -232, 237, 103, -522, 542, -134, -134, 182, -269, 447, -360, -115, 488, -422, 170, -93, 1, 311, -592, 395, 101, -359, 288, -281, 328, -102, -389, 612, -319, -35, 127, -178, 427, -492, 113, 399, -493, 267, -153, 128, 162, -559, 553, -73, -278, 295, -255, 370, -288, -201, 593, -455, 69, 51, -83, 320, -580, 336, 226, -466, 313, -203, 249, -29, -459, 633, -262, -145, 223, -200, 390, -437, 35, 469, -491, 201, -58, 57]
2657E7J42p55J033m59l64O50n28N21m78j00Q69r59L73J26k72M65p94O64Q5p33
2677d57P32m08K32k9n07R40o67l8M62n02N38n52J72N23q62N66j27j10L32o51P24
2698C11k36m03O34n09L69j96k33P25p57K69K17l93M57n34L63J67o33O27k88K1
2718b2J54m26O36m52r4M95m92L44k49NM23o65M21M1k80L28m07M10p5m03N65l43
2740h6Q1M0k25M96m96R6L07m00L18k63J42J91n01M38r1j42J90k89L92k34j58M06
2762B12l33J72p3p0L25m26K06J13k54K39k27J78L9l17L59j78OJ04j97K77k33O
2784g2K06k51J90j00j6J80k77J96j3j32J92j87J37l0j19K16j96P2N1j29J79j71
2806g4Q2N4j76J91j02JQ0j41J68j05m4J50j41P7m2MJ02j72J10K6r3Q0q5R4j9j14
$$ y = [57, 199, -556, 477, 18, -346, 304, -224, 297, -181, -281, 588, -371, 2, 128, -144, 321, -473, 191, 276, -457, 275, -133, 99, 70, -437, 503, -164, -202, 260, -242, 296, -256, -84, 439, -423, 143, 16, -94, 238, -413, 311, 75, -328, 306, -203, 166, -30, -263, 462, -295, -26, 191, -202, 255, -279, 84, 251, -382, 245, -43, -22, 132, -294, 342, -110, -204, 291, -201, 143, -106, -101, 322, -343, 78, 119, -161, 167, -240, 170, 95, -308, 257, -86, -5, 35, -190, 306, -190, -94, 213, -187, 131, -132, 10, 201, -300, 138, 47, -95, 95, -194, 198, -36, -194, 212, -121, 51, -22, -92, 233, -193, 13, 126, -128, 111, -116, 62, 101, -216, 143, -35, -29, 75, -122, 155, -78, -72, 134, -117, 73, -27, -43, 137, -140, 56, 43, -89, 103, -84, 53, 23, -96, 120, -76, -4, 47, -82, 97, -74, 8, 62, -114, 77, -25, -24, 56, -85, 83, -22, -66, 84, -57, 20, -22, -18, 84, -88, 22, 48, -45, 35, -50, 44, 25, -89]
2832h9J58p1j0J3m4J21j17OQ8p4J2j7L0M6j30R1K9p0L3m2Q4m1o5J20m9k7Nj1Q2
2861F1r7OP3n2Nj2M5lp4O6Nl9K2k6M8l2l0O8n5K3%pL2o2L0K0l3K6j0rK3m3N1l6
2895a6j4N4l5J9k2J5L2o9L8J7k9K2k7N1k9n4Q2j6k0lj6O7p9J3N1m6J5k4L5J9q5
2926e4P0kj9rk2P7n6k4Q3m8J7n7N0M1j04N3L3k9J4n9Q3k5o0P4l8K3l9kJ10j19
2956c8K1O2p2N3p9O5L9j31J04j7j7Qo3J30r6k0J10r8P7p1J9J07j84J15Qo3P5r9
2984e5J12l5j00J55j19M9pm9J58j92P7Q9j55J29j20J00L6k02K15p1o4Q0j18J97
3008A10j64k6J95j85R1m7QJ43k80J83M3j62J54j54J69m5k01L09j58j4O0j03K40
3031A66k74N9K08k57J48j19J02Q0l11K95n5j18J40j69K54j68j33L45k70P4j2k5
$$ y = [-89, 69, -2, -12, 1, -43, 78, -39, -33, 55, -19, -7, -24, 6, 52, -78, 13, 42, -28, 5, -37, 47, 6, -59, 61, 12, -15, -10, -21, 61, -36, -30, 43, -9, -4, -16, 29, 26, -48, 18, 23, -16, 6, -20, 28, -4, -34, 34, -21, 2, 2, -5, 27, -35, -5, 15, -18, 8, -2, -11, 12, -31, 20, -16, -30, 24, -11, 8, -14, 1, 33, -36, 2, 19, -10, 12, -15, 36, 7, -47, 35, 19, -1, -4, -20, 47, -32, -19, 32, -14, 1, -23, 12, 31, -54, 16, 14, -5, -14, -36, 41, -15, -39, 44, -4, 13, -44, 6, 47, -57, -4, 29, 0, 14, -45, 38, 13, -47, 27, -11, 12, -27, -29, 81, -38, -17, 45, -27, 26, -53, 12, 51, -80, 24, 7, -10, -2, -65, 65, -31, -51, 59, -39, 38, -33, -14, 93, -91, 24, 32, -31, 44, -55, 57, 22, -78, 77, -42, 7, 0, -49, 109, -83, -6, 83, -72, 57, -63, 37, 73, -129, 86, 15, -49, 31, -87, 110, -54, -80, 115, -70, 21, -26, -18, 125, -155, 28, 71, -91, 63, -91, 78, 33, -168, 141, -17, -31, 29, -74, 166, -108, -49, 159, -98, 50, -69, 33, 113, -198, 97, 42, -76, 64, -105, 149, -19, -152, 193, -77, -3, -15, -40]
3053d0K23l70K02J08k43J97j69J92j6l06L94j72n5J04j61K92k87OL09l22J61q4
3075c7M3J66m11L31Ok27K15k03K60j35k12M30k96L9O5j21K84l89J77K12l55K34
3097G6j56J37N8l79M43j50j39K11k05K96k73n2L88l85J41j1l4K17m24L27M9l09
3119a74K78k06K16q4k83M98k96l3J58j72K92l57J10K95m26K46q9L9J29m17M47
3140A71j00k52K95k23K54j84j48M66l99R0R1j22K45l98K63J38l90L05j58J20N
3161F9l15M76k54j01K24k03K58k89M0L43m32K15k0m0J71l78L60l8k78L18k10J63
3183G9q5j74M29l53M3J51j80K34l04J52J88l78K81r9K0Q1k92L87j68j51K72k15
3205h2J78j55n1L32l74J45O3j18J83k82K34M3k98K93j63R2j5j80L43k49j7J98
$$ y = [-40, 183, -187, 15, 123, -120, 77, -92, 100, 84, -222, 172, 0, -55, 49, -112, 180, -107, -101, 208, -114, 47, -37, 6, 172, -239, 92, 98, -129, 86, -117, 143, 8, -204, 226, -70, -31, 34, -87, 197, -192, -15, 197, -158, 76, -80, 57, 115, -264, 179, 29, -110, 101, -104, 192, -81, -133, 255, -130, 11, 0, -34, 183, -241, 86, 135, -174, 104, -102, 114, 30, -253, 245, -51, -84, 74, -98, 194, -163, -53, 242, -184, 62, -27, 12, 141, -276, 171, 71, -181, 114, -109, 145, -39, -187, 279, -120, -30, 61, -61, 184, -214, 49, 187, -203, 102, -56, 64, 69, -246, 230, -24, -125, 99, -104, 154, -135, -95, 248, -184, 31, 11, -29, 142, -236, 124, 86, -192, 126, -84, 79, -6, -180, 249, -104, -61, 90, -90, 144, -160, -8, 180, -198, 83, -16, 4, 85, -207, 180, 12, -139, 133, -82, 96, -59, -110, 222, -152, -7, 56, -62, 121, -161, 73, 116, -182, 111, -52, 40, 25, -155, 188, -61, -78, 120]
3227A20k00J82k06Q0J96l33K10k6o2J21k29K70r3j68K55j72J07n4j00K75k80R0
3249a7Q9j53J71j93J27Q8k71K34p4j1N7j55K31j47n2J73j61J25j02JJ70k36J37
3272C1K8j10J19j42J39j8j54K03j19K3K2q0J58j56K4J12j33J07j06N9P9j90J50
3295D6l1n3P8j08J28m9q2J58j23N7j9l8J08j30O2M7r7R1q0O5Jj08J46o9j4M9p4
3322c9R6q0j2R2j01P0k9rN9j06P8Ln2O3o3N2j9n0Q7p1J9L9n1P3p4K2M3p3N4l3
3352a2LK5n7N9ol3L9l8L9j6k6N4n0K0J5k5L2n4L1K2m6N2k7MJ1m0M3l2j1L1l3M2
3384A6k3pL6m0K1kj6K6k9L0Nl6L4k6QJ2k5L5k5NJ3k8K8k0OK2n0M2j7kK1l4K9j9
3418a0JL6m7L1oj8K3l0J9%k5L2j8J9qj4L3l9L2Kl1L2l2L2jl9M7k4%J7l4M7l9o
$$ y = [120, -80, 102, -104, -24, 172, -161, 49, 23, -39, 82, -147, 123, 30, -138, 117, -55, 52, -2, -102, 173, -107, -17, 72, -81, 90, -103, 24, 112, -159, 75, 1, -10, 47, -108, 123, -24, -76, 97, -64, 61, -41, -40, 130, -106, 31, 59, -51, 68, -74, 65, 47, -107, 96, -23, 0, 22, -58, 100, -56, -32, 80, -53, 54, -52, 7, 86, -104, 46, 15, -38, 40, -68, 60, 11, -71, 87, -36, 21, 2, -36, 72, -58, 4, 51, -46, 45, -35, 30, 31, -77, 69, 0, -14, 35, -39, 57, -23, -35, 57, -44, 26, -3, -12, 47, -59, 19, 22, -30, 33, -30, 22, 3, -47, 40, -31, -12, 27, -24, 49, -25, -3, 40, -33, 21, -12, -9, 16, -41, 18, 12, -21, 18, -20, 19, 3, -23, 31, -19, 1, 16, -9, 23, -31, 0, 22, -24, 28, 1, 5, 16, -24, 19, -13, -24, 7, -26, 16, -7, -14, 22, -18, 3, 1, -15, 11, -18, 12, 17, -19, 15, -11, -3, 9, -16, 19, -6, -1, 12, -16, 12, -8, -2, 20, -30, 12, -5, -7, 14, -20, 9, -10, -9, 27, -20, 11, 5, -13, 10, -20, -1, -1, -26, 6, -12, 7, -1, -15, 18, -21, 11, 13, -18, 14, -18, 14, 13, -26, 21, -3, -3, 14, -20, 27, -12, -18]
3452a8L2l6L7k1j9M9n8M3j0k1M0l7L6jm6N6m8K1%l1N9n3J2L5n0N0m3J9K9o8O6
3483B4k5k4M4n7P5l4k4N0n9M8k7j7O8r2N0J9o3O1n3O2Kq4R4n4J5Nl9Q5q2J4N5
3514C7p5N4m6K9N0r9Q4j6m0N0q2R6m8m4J10q9M4j6k3Q8j14N6M4q8P8q6N9J9j08
3543g6J32p3pM4o4J14j10lJ14j31Q5m8J0P6j52J26mo7Q3j02J17n4r5J68j12J4
3569a5J7l9J13j45N5P1j21J05p9O4K8j59J71n9m5P4r8J49j23l1J70j53O9k4j7
3594b2J07j81J19L2j17J00j00J08j8j33K07j14ML6p8J51j60K9J26j70J04o0M2
3617A2O8k04J97l8q9J02j07J37r6p2J95j67N1J6l0J15j81J10N0j46J27r9P5Mj52
3642a22K20j12l8R3j02J49j36KJ64j90R1k6oR6k01J61Kj24J28j03J01m4r3K10
$$ y = [-18, 14, -22, 15, -6, -25, 24, -34, 9, -1, -22, 18, -19, 17, 16, -30, 26, -22, -1, -1, -32, 27, -26, -14, 21, -29, 21, -22, -3, 26, -42, 24, -1, -25, 19, -38, 37, 3, -21, 29, -30, 18, -9, -26, 42, -50, 0, 19, -44, 17, -36, 26, 28, -56, 38, -16, -1, 4, -35, 50, -32, -18, 37, -38, 16, -30, -1, 49, -50, 34, 18, -22, 28, -54, 42, -6, -50, 60, -29, 15, -1, -24, 64, -50, 6, 50, -38, 40, -46, 13, 32, -76, 56, -17, -24, 20, -44, 70, -40, -43, 71, -60, 25, -23, -13, 63, -89, 37, 33, -34, 49, -53, 64, 10, -85, 83, -29, -15, 2, -37, 76, -69, -14, 57, -64, 41, -38, 26, 54, -105, 66, 7, -38, 36, -62, 87, -36, -67, 103, -50, 19, -5, -22, 85, -96, 23, 55, -62, 38, -62, 46, 28, -105, 102, -12, -8, 28, -50, 101, -59, -30, 96, -74, 30, -30, 12, 80, -124, 73, 35, -54, 48, -59, 78, -18, -90, 105, -62, -11, 5, -25, 90, -91, 19, 69, -77, 50, -49, 26, 30, -122, 98, -14, -52, 41, -61, 88, -48, -46, 118, -72, 19, -7, -13, 83, -118, 43, 45, -79, 49, -54, 47, 3, -90, 120]
3666A20j71L0M4n9J27j68P0R3j76J22o1M5L1j55J90o2p9R8q3J04j00j9J70j76
3690f5N3J0k9R7j65J20L1j52J35p5P2k6j03K03j40lP6q7J06j21L5J12j66J01k2
3715cj6O4j45J63m5q4J19q5O2m4m7J59j46L2M8n4P0j15Q5M4j48J24l9rL1j01J56
3742G6q4m0R6q1O5n8nR8j34P6K0n3O7j02R4kj03J11n7K6no1J13r5J1O7o9P5q3
3771c7L0O8j32R5j2k6L7o8Q6m4l7R2q1L3j6k3Q3r4M1L2n0M6o3M9J2p6Q9m3KJ6
3801Im4Q5o8oN7n9N0l4oN0p5M5J3l6L6m7M4jm9O5m2MK2l6O5n9J0L2m1L3k9J6J9
3834B3o4N8j7j7K1l0M0j5k0M4m3K3oj1L9l6K5Nl8M0k9OJ0k7L2k5lK2k3J9mnL6
3867C0m0J0mNJ9m4K9lk0K6j8J0J1k5L6l5J3K0l8J8j7J3J0k3RLlJ8k5L2j4mJ5l4
$$ y = [120, -51, -21, 23, -36, 91, -77, -7, 86, -90, 32, -29, 16, 47, -108, 82, 20, -59, 39, -44, 60, -40, -59, 111, -65, -12, -2, -31, 66, -99, 21, 52, -100, 35, -40, 32, 6, -97, 106, -34, -37, 39, -48, 58, -63, -28, 84, -82, 19, -3, -19, 45, -100, 63, 18, -66, 53, -32, 30, -14, -61, 98, -48, -16, 32, -22, 48, -67, 18, 62, -86, 38, -1, -10, 21, -80, 76, -8, -48, 48, -33, 32, -26, -31, 67, -67, 9, 29, -24, 43, -59, 35, 33, -70, 41, -16, 10, 5, -56, 57, -38, -27, 40, -29, 46, -37, -7, 61, -71, 24, 12, -14, 23, -45, 41, -3, -40, 52, -29, 4, -12, -35, 48, -46, -5, 27, -23, 23, -40, 9, 21, -55, 34, -9, -7, 9, -35, 50, -18, -24, 33, -26, 24, -10, -16, 34, -41, 4, 17, -19, 17, -30, 14, 13, -36, 29, -13, -9, 13, -23, 42, -17, -7, 25, -16, 17, -12, 4, 23, -41, 17, 0, -17, 4, -26, 14, -1, -21, 23, -20, 3, -3, -14, 25, -11, 14, 19, -19, 21, -8, -2, 8, -19, 13, -12, -15, 7, -16, 3, -1, -6, 30, -10, 0, -4, 1, 20, -24, 5, 2, -18, 8, -10, 0, 11, -14, 22, -13, 0, 20, -18, 0, -17, -4, 6, -17, -8, -5, -8, 10, -15, 17, 3, -1, 14, -20]
3901b0J7mJRj0J1oj6K7k0J0kk0L8k8NOj9L1j7LJ2j7LOrK3k3J4kj1J5k2K1Kj6K6
3938A8j5j2Rj1K3k9J6Rj8K8j6kKmQj1pK0k7K2k0RK0l0K1nj0K0j5J7j0j8L1k1K1
3973A3j4j1K9l4K7Lk5K2k0J2J4j9J0j6LLj9L9k4LJ1j9J9onK2m4L1Ok9K1j3J9j2
4007cj2M4l7J4Jk4L5m5L4Rk6K9l5K0Nm4N6k8JQj3L7m2NL8n1K9k1ML5o1L7J0k9
4041b0K6m3N3nn5P0l7NK4m0M8n4J5L9n0M3l1J1K6o9O7j5k4L8n4O0l4k8P7p5L3
4072ALj6M9q1M1K1m7M4m6M8jo3Q5m7mK6m9O9o1PN9p6N8m7K2N5j04P9j0m8M5n2
4104d0P1l6l8R4p8K6%j7P1j04M4L4p1O0l5L0K2q9Q7l4j7L5n5P3o1qQ2q2K9qpO7
4136D5j02P6J7p3N2n3O7j3o4J11p7MK3l2P4j00L4O6j03P4l6RK4r4J14k9m9N6n7
$$ y = [-20, -3, -7, -6, 3, -7, 4, -2, -18, 9, -11, -1, -3, -23, 15, -13, -8, -2, -21, 10, -7, -4, 8, -9, -6, 0, -9, 14, -9, 5, 3, -8, 7, -15, 6, 8, -8, 18, 3, -9, 0, -11, 12, -17, -1, 8, -10, 18, 2, 0, 2, -2, 6, -5, -12, 8, -19, 3, -17, -8, 12, -18, 3, -2, -12, 8, -7, 10, 0, -18, 13, -8, 13, -1, -12, 17, -17, 10, 13, -12, 10, -10, 2, 16, -3, 7, -9, -6, -3, -22, 17, -7, -4, 7, -12, 7, 1, -4, 18, -26, 5, 11, -18, 3, -10, 9, -3, -15, 29, -8, 6, 7, -17, 18, -27, 7, 16, -10, 19, -16, 4, 9, -35, 21, -7, -6, 2, -11, 26, -16, -11, 27, -24, 5, -16, -12, 23, -38, -1, 9, -20, 6, -37, 16, 11, -44, 26, -11, -6, 18, -22, 26, -28, -13, 26, -24, 19, -12, -1, 25, -44, 23, 8, -16, 22, -32, 28, -6, -34, 43, -32, 1, 4, -12, 37, -44, -3, 18, -29, 15, -31, 17, 16, -47, 38, -9, -13, 13, -36, 33, -28, -21, 38, -38, 20, -27, -5, 50, -54, 25, 15, -33, 12, -40, 31, -5, -43, 51, -27, -1, -1, -18, 53, -51, -7, 27, -44, 16, -19, 11, 33, -56, 31, -3, -20, 15, -40, 33, -28, -36, 46, -36, -7, -15, -22, 45, -57, 19, 36, -37, 15, -38, 29, 16, -48, 63, -14, -10, 13, -19, 55, -45, -11, 55, -48, 26, -10, -1, 23, -71, 43, 14, -35, 21, -36]
4165c6P6o5k0J01r1L8%k2O4r5O3K9r1P9n1L9Oq0J21o7k2M8m3N6p3QP8r3O2k0j2
4196a3M8r6Q7qn7P0n9M9l7n2J33j02K9K2m0O7p8L0M9r6P6m2L1No7R1n3j7M4l3
4226a9N7m8j2P4r0L8kpL5q5P2Oo3O7l5K6j4l0P9p7%L9n2N8n7M4K8q3N9kj2K4n6
4259c8P0k7l7O7n0L3l6pO3o1K2Qj9L7o5N0J2o4N8k7NOk7P0n5j1M7l6J9k3lM0o5
4292d4M9Nk9L0m3N2j3l6N3m6L2ok5N1m9J3K3k3J9l3J9J6n0N1j6j4J4l8N3k3j1
4323a9L9m2K1j4jL5l8J5Nj3K4k8J2Ql0L2rmOj2K5k7LL0m9L5k3OK7m3L0Kj8L1l0
4358a4J4%j1L4l7J3mnK0l0QK0k5K5j9J2Pk4L5k7j1L4k8J6j2kJ9j6J7lj1J4j7P
4392aNnJj2MJ1j9L1j3j6K5k5K2oj4J4j3J0JLPl4K7j0mJ8j5J5j2LNj4J3kjJ4j0
$$ y = [-36, 40, -25, -45, 56, -35, 3, 3, -19, 45, -50, 13, 42, -49, 30, -21, 18, 24, -56, 65, -2, -24, 24, -19, 37, -36, -28, 50, -43, 19, -1, -13, 35, -61, 26, 18, -39, 31, -28, 21, -16, -68, 65, -37, -8, 14, -26, 41, -37, -7, 42, -54, 22, -20, 11, 16, -51, 40, -13, -30, 14, -19, 38, -10, -22, 52, -38, 0, -2, -9, 26, -59, 13, 19, -44, 23, -12, 14, 0, -30, 49, -28, -28, 11, -41, 17, -40, 4, 32, -51, 8, 6, -6, 18, -38, 32, 5, -32, 35, -15, 18, -18, -25, 38, -23, -1, 7, -12, 25, -40, 10, 22, -42, 16, -11, -6, 0, -27, 43, -12, -23, 24, -12, 7, -16, -19, 21, -44, 5, 10, -19, 11, -32, 20, 7, -29, 24, -22, 10, 4, -21, 30, -19, -6, 17, -6, 13, -20, -1, 15, -35, 16, 0, -14, 0, -38, 15, -8, -19, 20, -22, -1, -15, -16, 19, -19, -4, 1, -12, 12, -16, -4, 4, -26, 6, -3, -7, -1, -13, 12, -15, -12, 18, -31, 4, -19, -13, 14, -29, 1, 3, -15, 16, -14, 0, 0, -11, 23, -14, -1, -5, -10, 10, -20, -12, 8, -17, 8, -11, 1, 8, -16, 19, -8, -19, 15, -13, 3, -9, -11, 8, -8, 9, 6, -5, 9, -8, -1, 4, -1, 0, -12, -8, 3, -16, 15, 2, -14, 11, -14, 8, 2, -12, 2, -11, -1, 0, 3, 10, -24, 3, -7, -11, 7, -8, 7, -5, -2, 3, -11, 2, 0, -1, 13, 3]
4429CrJ3j7J5poJ5j5J1j3JMj0K2mj1J7j8NmLJ0j1JJ1j6J9k8J4J1j2J3j9MJ0j5
4465a3J0%mJ4k4K0mqK1k3J0n%MrMJ0j7K6k3RNk6K7j0JJ2k8J9j7NJ5k1K1j3LJ9
4502A0l4K3jj1J8k1J8mj1J9k2J6rQJ4l2K0MqNk5L0nk6L0j6nN%J6j9%J4j3Lk%K0
4540Im0L3%j8J8j7L3j4k1K9k0NpjJ3k2J4J9l0J5j0J0J5m6M6k0JRk3L8k8mL8m1
4574a7K0rJ0J8m9K9jj4K6k8L7k0l2N1k9O%j9M3l9OL1m1K9j7JJ6l0M3l1mK2m6M8
4608A0k2rM6m6K2j5jM4o6M2Ql8L3l2K7Nl5M3k8NJ2k8M9m7KM1l9K7k3K1Mm9N0%
4642A3l7M0k4L3l5j6M5k9JOj8M6n9J8K6l9L5k0K2J1o0O7k5j8L1l8N2m7kM3m5L3
4674A0j6JK3n0M1J1m5K9k2L8k2k2M4m1J1J7j4M0m9J6J9m1L2j3NJ0m6N2j3j7L2
$$ y = [3, -6, 7, -10, 5, -2, -8, 7, -8, 3, -10, -9, -5, -15, 7, 3, -8, 9, -9, -4, -8, -5, 5, -6, -5, 6, -10, 9, -19, -5, 6, -6, 7, -12, -8, 2, -13, -3, -3, -7, 7, -17, 3, -1, -9, 12, -11, -1, -6, -6, -2, -11, -7, 3, -14, 12, -11, -2, 3, -23, 4, -6, -5, 7, -21, -2, -19, -14, 1, -20, 1, -12, -9, 10, -24, -1, -2, -13, 5, -16, 2, -2, -13, 6, -16, 0, -9, -1, 13, -19, 1, 5, -3, 2, -23, 7, 2, -24, 6, -10, -15, -10, -10, 6, -13, -13, 1, -12, -9, -11, -11, 9, -31, 2, 2, -16, 2, -15, 18, 4, -17, 12, -8, -3, -10, -11, 2, -20, -6, 13, -17, -2, -12, -2, 13, -33, 13, -7, -6, 3, -20, 18, -10, -14, 24, -17, 3, -6, 4, 22, -27, 2, 1, -13, 13, -15, 22, 2, -30, 21, -8, -2, -2, -21, 22, -17, -11, 20, -21, 8, -9, -8, 8, -22, 21, -10, -14, 8, -38, 10, -12, -21, 25, -21, 1, -14, -15, 29, -37, 5, 13, -25, 8, -24, 3, 8, -27, 16, -12, -7, 5, -23, 26, -21, -19, 22, -17, 10, -13, 8, 12, -37, 13, 13, -24, 16, -8, 25, -10, -26, 19, -10, -9, -3, -21, 25, -34, -16, 10, -29, 6, -14, 8, 19, -41, 26, 1, -17, 14, -24, 28, -19, -21, 22, -23, 10, -6, -5, 18, -32, 9, 20, -25, 4, -18, 20, -2, -24, 20, -21, -10, 7, -7, 33, -16, 0, 19, -22, 10, -3, 2, 12, -34, 18, 5, -12, 20]
4705B0l3K0j9j0N3m8J5kkK3l7K8J0n3M6k8K4ll7N1k5LJ8k2K0m5J5M8n3L4j4JK3
4738B1n2L7J0m4L7j9J7j0l0N3l8RRj6L8m4J4K4m8L8j7MK4m0N1k6j7L0k4K7l4l
4770a9M9n3L1lk1L0l7K9pl0M1l0QK0m0M8l6KL5k4J5k7J4L4n2L1pj4J4k3K8kl3
4803b9L7j3J7pk3L4l1J4Lj7K7l3J6Ok5L1qj1J9k9K3j6rL0k0J5pj1L2l6K1J0k4
4836a4K5k6K9j1k8M1j9lJ2k2K9k8NK4k5J3j4LJ5l2K5Mj5J2j1J0Rj9J8j0kOj4K4
4870A1k2JNj1J4qOJ7k4K0j5%J2j8K7j2j1J6j4JLpMLkJ0rPj8M%K%LLMo%JqJ3j1
4912iLKpJ5j7J2kmJ8j4Jjj0J3pJ%jMj0J7rj2J7qJ3Kk0J6j1KRj7QlMJ4k2J1joJ6
4954GrLJrJ8j1NKj9L1j3kJ0k5J2mqJ0j1K6k1nJ6j2K1j1j3K1k0J7ooJ5k5J9Ml1
$$ y = [20, -13, 7, -12, -22, 31, -17, -2, -4, -6, 17, -20, 8, 18, -35, 11, -17, 7, 4, -33, 18, -7, -4, 14, -8, 12, -33, -18, 30, -23, 11, -3, -2, 21, -31, 6, 16, -28, 9, -10, 7, -3, -33, 20, -18, -9, 0, -16, 22, -22, -8, 16, -32, 6, -11, -7, 17, -23, 28, 2, -15, 15, -9, 18, -16, -19, 30, -23, 8, 5, -16, 14, -23, 6, -1, -31, 10, -20, -12, 8, -32, 16, -20, -18, 17, -7, 8, -19, -5, 29, -23, 8, 1, -13, 1, -22, 6, 4, -29, 8, -5, 12, 5, -18, 16, -15, -1, 2, -15, 12, -21, -5, 1, -24, 7, -1, -12, 7, -22, 1, -15, -24, 6, -14, 1, -6, -17, 15, -21, 0, 10, -14, 11, -15, 14, 3, -25, 16, -3, -6, 6, -16, 13, -15, -10, 14, -11, 2, -12, -9, 6, -26, -1, 3, -12, 0, -11, -1, 8, -11, 7, -3, -5, 1, -13, 11, -11, -10, -5, -16, -2, -10, -4, 13, -11, 9, -6, -6, 6, -12, 15, 3, -8, 8, -6, -5, -2, -9, -5, -2, -4, 6, -3, 4, -14, -10, -10, -8, -8, -5, -2, 2, -4, -4, -3, -11, 2, -9, -6, -4, -11, 4, -13, -1, -3, -7, 11, -3, -2, -3, -13, 0, -7, -6, -6, -7, -3, -13, 4, -5, -17, 0, -8, 5, 7, -13, 3, -8, -6, 3, -14, -6, -9, -5, 9, -13, -2, -3, -9, 7, -2, 1, 2, -7, 11, 0, 5, 7, -12, 19, 6, 4, 14, -11, 1, -3, -11, -1, -12, 14, -7, -12, 4, -8, 13, 2, -11, 10, -10, 7, 1, -5, 10, -15, 4, 8, -23]
4991b3K4nKkNMj6RQk1K3%j6J8k1K1j0j2JJ1Pj6mJ6j0J5k3%J4k1K2Mn%k0K0%rJ1
5030A%lj3OK2j2pJ7j5J6j6%Pj1OJkLrJ5j2mJ3pJ1opK4k6RLj1Oj4L0j2j7L1k5K
5070fQj5K1k4OJ7k3K2j7PJ7k3K5j5oJ8k5K1ok9L7k6J5nrL1l0J5Nj7J8j8J5rj3
5105a8K2JqLk7L6k2nK7k2OoOJ6l3K1LkNj3J8j2mJ8k2PRk0L0l0MJ8j9J1lLJ6l1
5143a7J6%j0Mj0L1j9j8M3l5J2KrK2l0J0J1k2K1k2L1qk0K8j3JloL1l6KL2k9J9k0
5178a1K6Jl9K9nj0J7k1J5j3nK5k2J9j0j2L1l7J7J1k4J9oMKl0L5rj9K5j8L5l1o
5212a7L0k5J1oj1K8k5K4Mk9K7j5J1ml2M6k6J1jqK1l3J7J4j7Rj0%Mk2L3mj4J7j4
5247fK6k0j0K9k7JJ3j1Rj2MJ9l8K7j8J2J3l0L5k3PPj3J2j7QJ6k8J2mNNk1K3Kk5
$$ y = [-23, 1, -4, -2, -4, 1, 5, -11, -2, 6, -15, 8, 8, -8, 10, -11, 10, 0, -12, -11, 0, 7, -9, -13, 3, -7, 8, -15, -15, -1, -22, 0, 4, -1, -1, -21, -1, -1, -10, 1, 1, -2, -15, -9, 13, 1, -6, 11, -4, 12, -4, -4, 3, -8, -2, -1, -3, 0, -9, 6, -6, -10, 3, -4, 7, 1, -6, 18, -8, 1, 4, -7, -1, -15, 15, 3, -14, 17, -8, -6, 2, -13, 8, -16, -10, 7, -16, 6, -11, -4, 13, -10, 15, 0, -6, 12, -13, 8, 2, -27, 10, -16, -1, -6, -15, 16, -14, 1, 6, -11, 7, -11, 4, -5, -18, 4, 5, -3, 0, -27, 9, -13, -18, 9, -13, -7, -13, -7, 9, -24, -3, 0, -2, 3, -10, 8, -4, -8, 10, -12, -5, 4, -16, 14, -16, -12, 6, -13, -2, -5, -2, 14, -17, -1, -1, -11, -7, -17, 14, -5, -23, 20, -15, -3, -1, -10, 12, -18, -8, 3, -19, 2, -20, 11, 3, -17, 11, -2, -1, -4, -10, 21, -15, -13, 19, -10, 9, -11, 15, 16, -23, 6, 1, -9, 8, -13, 2, -11, -16, 9, -13, 6, -4, -16, 15, -22, -5, 6, -18, 1, -5, -1, 1, -29, 6, -3, -22, 3, -15, 20, -11, -17, 13, -12, -1, -7, -18, 10, -15, 9, 13, -16, 11, -4, 7, 3, -29, 17, -9, 2, 1, -7, 14, -19, -2, 12, -5, 4, -6, -6, -2, -24, 9, 5, -9, 8, -6, 20, 0, -10, 19, -8, -7, 6, -5, 4, -8, -4, 15, -23, 4, -14, -2, 11, -19, 16, -7, 0, 7, -6, 6, -11, -3, 13, -15, -3, -7, -2, 3, -18, 5, 7, -18]
5283a8J7mRjk1K9l3J5J1j3J8k0J0J6k8K6rOml0L6k1rK0%LrjJ4k1J3%qPj1J2Lk0
5321a6K0j1Mj0QJ7j3j7J0jLjJ2Oj9J2Nj3J8j9NJpJ0j3RnqK3j5Nlk0K1j8J1J2k1
5359a8K0qj3J2mRJj9J8KkKOQj9%MoJ3j6J0mQMj3KonJ2KqJ6j3Qk0J0Rj2J4rrJ1
5401cpN%j1J8nn%jJ7j4%K4k2Qj2PNj5J7Jj0Nj1PlpK0rJjrJ1j0J4jlJNj2J3k0K0
5444Hj0oRpLQmMqNnKPlMkOplJ0kj3J0pnNjJlNmpOJ%ooJ3JoJ3j3R%pJ0j8J5okJ2
5495FqMnmJ0qoJ4NJk1NLj3J4LqJ0jjKj2J5pMmoQpL%qJ6j1K0j2j2J6%j8J1Kl%J
5540bJ5j2Kj0J7qk3J8Lj4J1j3J4loJ4j2J1LnJ1j9pOoRjmOpJ8rnRrJ1j0NJnKMJ2
5583A2nj0J6qpPrJ0nrJ4j2LRpj0j1K1npJ1kOmj8K7j8j0J9qJ6kpNj1OlMOj3QkM
$$ y = [-18, -1, -5, 4, 3, -18, 11, -22, -7, 4, -9, 9, -11, -1, 15, -13, 13, 4, 10, 6, -24, 12, -9, -18, 2, 2, 5, -4, -5, 9, -12, 1, 1, -7, 0, -11, 1, 4, -16, 4, -7, -3, -13, -5, 12, -1, -18, -8, -9, -6, -7, 5, 11, -8, 4, 9, -4, 14, -5, 0, 1, -6, 4, -9, 0, -5, -13, 10, -5, 0, -3, -23, -2, -20, -9, 3, -18, 2, -6, -19, -7, -11, -2, -1, -20, -2, 0, -2, 0, 6, 14, -5, -5, -1, -7, 6, -10, 0, -4, 4, 8, -5, -3, -9, -14, -2, 0, -8, 8, -5, 3, -17, -7, 2, -10, 4, -5, -14, -3, -10, -5, -5, -16, 2, -3, -8, -8, -9, 8, -6, -6, 18, -4, 4, -8, -1, 4, -11, 6, 7, -3, 2, -9, -2, -5, -12, 8, -1, 0, -1, -10, 1, -9, 5, 4, 1, 2, 7, -5, 8, -12, 8, -2, -8, 1, -6, -3, 5, 1, 5, -3, 2, -3, -1, 6, 3, 7, 5, 11, 4, 1, 11, 9, -4, 6, -1, -6, -1, -2, -1, -4, 1, -3, -10, -4, -3, -3, -9, -15, -2, -1, -7, 6, -7, 2, 2, -5, 5, -13, 2, -4, -6, 6, -2, 2, -3, -7, 3, -5, -11, 3, 8, 9, -12, -7, -4, -17, -3, 0, -8, 2, 1, 0, 2, -10, 5, -2, 2, -2, -8, 0, -7, -4, -4, -12, 4, -7, 13, 1, -11, 5, 5, -13, -2, 0, -3, -3, -2, 13, 1, 3, -7, 10, 2, -21, -3, 0, -14, -3, -16, -2, -5, -11, 3, -9, 2, 5, 0, 11, -8, -15, -9, -15, -6, -7, -11, -5, -12, 6, -3, -8, 1, -8, 3, -7, -2, -1, -6, -4, 0, 12, 7, -3, 13, 5, -2, 5, -4, 6, 1, -8, 6, -6, -3, 6, -1, -11, -22, -1, -6, -13, -2, -4, 2, -2, -20, 7, -11, -21, -2, -10, 6, 4, -3, 2, -9, -3, -6, -2, 4, -9, -1, -3, 1]
5626AlpJ4orJ4rjjM%kmRj7J2nQKqRmj3J3mjKKklRKoJ5j8J0loKpJ1%j5K5j2j2J0
5673dLOj5KJ0j0KmoK5j9J5kj2MmPMrRMmnqK0k2J4Mj5J7l%Mj9J6j0PmKJ0qlQj4
5717gNNMkk4J9Jj0%LOpnK6k3J2lnK5l6J9J0k3%MLJ6k4J7Kj1OjkmlK6k3jLjJ0j3
5760fnJ4j6Pj4PKoJ8j3lN%J9j4lJ1j3J2Lj9J6j2J6j5%J3mJ5k0nK0j8OJ2j2Pj5
5798a0J3Qk0J6pJ1j4qK3j6qRoNjmQK%Qj4Nl%Rj2PpJ3j5nK0j1KQj7J0orJ2j7J3
5840hkOJj7K3loMmqOkJ5qj0JjJ5k%Mj4J5lpJ0%pMj6J3LKkoL%J7j4pJ2Kj5Rk0J7
5886@j7OMjJ6k0NmjJ1kpRnJ0jNpMmJj4MKMkJRj2J3knNoNL%rLj0KOnOmOpRj3NJ
5937coPjrJ1JKnJJ3nKj5NQrMKk%l%j0KJ4j7J4nNjkJJkJlJlKJ3rj0MkJMpNJONj
$$ y = [1, -2, -9, 5, -1, -10, 4, -5, -6, -7, -3, -3, -5, -9, 0, -17, -5, -10, -2, 0, -8, 1, -3, -16, -3, -7, -8, -6, -4, -6, -9, 0, 2, -4, 11, -7, 3, 0, -6, -4, -11, 0, 0, -15, 10, -2, -14, -4, -1, 5, -10, -8, 2, -8, -6, -10, -16, 9, -10, 5, 3, -9, -5, -9, -2, 2, -7, 2, 6, 2, -3, -11, 9, -13, 1, 5, -10, 7, 4, 4, 8, -11, 5, -5, 2, -2, 0, 10, 2, -1, 7, -7, -2, 3, 7, 5, -19, 0, 1, -9, -9, -6, 0, -7, -12, 14, -9, 3, 0, -5, 20, -16, 3, 13, -10, -10, -6, -3, 13, -11, 6, 8, -3, 3, 2, 0, -4, -7, 19, -4, -5, -2, -3, 7, -6, -11, 3, -13, -6, -20, -13, -11, -17, 1, -12, -15, -10, -10, 9, -5, -8, 3, -10, 2, 5, -14, 2, -10, 6, -9, -9, 4, 0, 15, -5, -10, 10, -8, -2, 10, -2, 5, -10, 3, 11, -9, 7, 0, 11, -3, -11, 12, -4, -12, -3, -9, -4, -5, -9, -1, 1, 1, 9, -5, 0, -3, -3, 6, -6, 1, -6, 7, -8, -13, 7, -4, -2, 6, -11, -1, -7, -16, -4, -21, -8, -10, -4, -3, -20, 3, 0, -6, -2, -6, -14, -8, -10, 5, -3, -13, -12, -13, 2, 0, 0, 4, -10, 5, 2, -5, 5, 5, -2, 2, -14, -1, 2, 4, 2, -4, -1, -1, 16, 2, -5, 7, 9, -6, 3, -17, 0, -17, -11, -7, -8, 8, -12, -7, -11, -12, -1, -3, -10, -1, -6, 4, 3, 8, 1, 5, 1, 2, -12, -8, -6, -2, -4, -3, 6, -6, 7, 5, 0, 5, -1, 4, 7, 7, -2, 1, -9, -7, -1, -6, 0, -4, 2, -5, 4, -9, -4, -3, -9, -2, -3, -12, -1, 0, 2, -3, -2, 11, 6, 8, -7, -2, 6, -3, 1, 3, 1, 1, -2, -2, -12, -10, 4, -13, 1, -4, 1, 0, -2, -1, 0, -2, -1, -4, -3, -6, -4, 9, 0, -10, -6, -8, -7, -3, -10, -5, -4, 2, 7, 6]
5989F%o%%qJ3lplNQoMj5NMJnJ0rJQj3RmNLPnjnJjNj7QKqJ0PqJ2j0Nn%MmRj6JO
6041@Kl%KJPokqMljmMLnNPnKj0N%MjnJ2Nj5RJj2JNNprJ3%MmKrkJJ0qJ2Oj5nlJ6
6094Fj6Q%oJlLkm%J2qRj4%PnJ2oMnJjJ0rlJ0krPJ1j8MJJrKJ8j0nOLNmnOj9LJ0
6143cJJj6J4LmJ0mpKpJ2pJ6j6LKNnKmPKpQj4nJ0rJ0lpJQPj6NoOMmP%j1kOKqK1
6192A0j4MlMj1J3nOKqNpJ0%j2N%JJkKj4QmjKPj8J4Kjlj3J7%j1MpJ5nPnpnOJ0L
6239BpOjoOj3RMl%jMmMljpQ%kolOj0J4NpJ3j7oKJJ1j2LNkJ0rJ0kj6K2rMKj5N%
6288fqK2mlJKkpJ0mj0N%l%JNlpNJ0mqKLj3J0j1J2Pj0J0j6J9Kj6RkmJ0j1OLqkP
6334aMlMJ0j3jj0MOlj3J3rJ5j3LNj3J5j2J6lj0lJ5j5J0oPnkJ2kPk3J0Lkj2J3k
$$ y = [6, 6, 0, 0, 0, -8, 5, 2, -5, -8, -3, 5, -1, 3, -12, -7, -3, -2, -7, 3, -6, -5, 3, -10, -1, -5, 0, 3, 10, 5, 4, -1, 0, -1, 4, -13, -5, -3, -11, -1, 6, -2, 10, 0, 5, 0, 0, 4, 0, 9, -7, -6, 0, 2, -1, -1, 1, 2, 9, 3, 1, -7, -3, -6, -7, -11, -7, -4, -9, -4, 3, -2, 0, -10, -5, -5, -1, -2, -7, 5, 10, -5, 4, 5, -7, -6, -1, 4, -3, -12, 1, 1, 5, 1, 3, -6, -8, -7, 3, -5, 7, 13, -2, -7, -10, 6, -10, -2, -2, -8, -7, -10, -7, -9, -13, -13, -1, -9, 0, -14, -14, -7, -12, 0, -6, -2, -7, -6, -7, 3, -6, -9, 1, -1, -10, -3, 8, -10, -6, -5, -4, -13, -11, 7, -3, -8, -2, 1, 6, 2, -3, 3, -16, -13, -3, -2, -1, -17, -3, 0, -4, 6, 2, -5, -3, -10, 2, -5, 11, -5, -2, 0, 5, 0, 2, -2, 5, 7, 0, 8, -6, -11, -1, -10, 0, -3, -10, -9, -1, 6, -10, -5, -11, -5, -1, -5, 2, 2, -9, -11, -5, -3, -11, 10, -4, 0, -3, 1, -10, 3, -2, 4, 6, -2, 3, -4, 6, 6, -6, -1, -1, 0, 1, -1, 1, -13, -5, -9, -10, -8, -1, -19, -5, -3, -4, -7, -20, -3, -3, -14, -10, -17, -2, -7, 0, -5, -12, -17, -11, -1, 2, -5, 1, 0, -6, 0, -13, -4, 0, -3, -3, -4, 0, -4, 0, -3, -4, -11, -3, -3, -5, -11, -14, -8, -18, -4, 1, -6, 7, -10, -16, -14, -13, -2, -14, -11, -6, -8, 2, -7, 3, 1, -15, 7, -2, 2, 4, -11, -6, -6, -14, 8, 4, 1, 2, 4, 2, -5, 5, 1, -9, -4, -4, -7, -7, -6, -1, -4, -11, -6, 4, 0, -8, -6, -3, -16, -6, -17, -5, 2, -8, 2, -14, 5, 7, -9, 0, -2, -6, 4, -7, -1, 2, -6, -8, -1, 3, 0, 4, 14, 1, 0, -10, -6, 0, -3, -16, -3, -12, 3, -10, -7, -2, -15, 0, -12, 4, 1, -9, -12, 3, -12, -2, -8, -1, -6, -8, 4, 2, 9, -14, -4, -1, -3, -15, -2, -4]
6375djjJNNj3PmmpJ1nQLj1R%pJ1lJkoRmQ%j3J5j5J2rkJ3nMrmNokjPJ5j6lKkQl
6425ckKJ1j4%L%Pj0Rj1MkN%nLmO%pQjmJ4j7LKRJokJ0j3MrJ1qqRKlMplROnj7J1
6475hlOpJ0kmNMj6MJJJ3j5J0JlOkjkMklKkjJlOkj2J2Lj1Pj0J0nKJj7J3LJjM%P
6524EnJ3j8J0jmJ4k1JKJnOOmjJ5j9N%mOonNnQLQqj5J1j0No%JOlOJJ1j1M%%nJo
6573hJ6orKRj2J0Moj0LKNoqJ1j3RPJkj4ROj8J4KpLKkLmjK%%NlNnKnOMkNjmmlJ5
6625Iolk%oLKJpOrnOj7L2ojJ1j9J0jj0KQmJJNPj5MpJ1%MnJKp%J0j0Qj2KJ3j0J3
6673A0rrKJ4j3rNLNnRqqJ5opLPmRnoK0j4RKrPj4J1Kj9J7q%KlkRpJ1j4J%P%onO
6722dj2J7%qPrLjPlpJ6j2LlJLkMl%J5j7lQolRjKj3J1Jj0J0Mj2Pkj3J1lPmkOpK0
$$ y = [-4, -5, -6, -5, 0, 5, -8, -1, -5, -9, -16, -5, -10, -2, 1, -10, -1, -1, -8, 3, 0, 1, -1, -7, 2, -2, 6, 6, -7, 8, -7, 5, -4, -6, 7, 2, 6, -3, -7, -2, -8, -10, -11, -4, 11, -5, -8, -6, -8, 0, -3, -5, -3, 8, -6, -6, -3, -3, 4, -6, 3, -8, -4, -6, -1, -1, -6, -3, -7, -1, -1, -8, 0, -1, -5, 9, -8, -5, -3, 6, 7, 1, -1, 9, -4, 0, -9, 2, -6, -14, -5, -3, -6, -2, -9, -12, -3, 3, -2, -19, -8, -11, -5, -12, -2, -4, -8, -3, 1, -15, -11, -10, -9, 4, -11, -1, 0, -3, 3, 1, 0, -2, 2, 0, -3, -1, -3, -4, -3, -6, 0, -2, -14, -2, 1, -10, -3, -13, -3, -8, -6, -5, -22, -9, -6, -5, -6, -2, -2, 5, 0, 13, -5, 5, 4, 0, 14, -7, -6, -4, -3, -8, -2, 4, 0, -1, 14, -5, 0, 0, -4, 2, -4, -9, -4, -9, -1, 2, 10, 2, -13, -2, -12, -7, -13, -13, -12, -6, -9, -3, -2, 9, -2, 2, 2, 2, -3, -2, -8, 8, 2, -7, -5, 4, -8, 2, 6, 0, -10, -7, -5, 0, -6, -14, -3, -16, -7, 0, 1, -1, -15, -6, 0, -18, -4, -2, -9, -6, -4, -6, -3, -7, -8, -6, -6, -6, -1, -4, 1, -4, -2, -7, -1, 3, 1, 6, 5, 1, -3, -6, 9, 3, 0, -2, -2, -8, -5, -3, -2, -9, -3, -12, -17, -11, -28, 4, -2, -3, 8, -11, -1, -2, -12, -10, -2, -6, -5, -4, 1, 8, -7, -3, -10, 1, 1, 5, 0, 1, 3, -4, -4, 6, -4, 4, -8, -6, 7, -3, 10, 1, -8, -6, 8, -5, -14, -9, -6, -1, -6, 3, -5, -13, 2, -4, -11, -8, -1, -5, 4, -1, -7, 13, -1, 8, 10, 1, 8, -6, 5, 7, -12, 5, -3, -3, -1, -4, -6, 3, -4, 7, -7, -6, -6, 1, 1, -5, -10, -4, -16, 1, 1, -7, 0, -9, -6, -7, 0, -3, -10, 6, -6, -3, -6, -5, -2, -4, 0, -3, -3, 12, -5, -8, 0, -6, -9, 0, -1, 1, -12, -1, 0, -10, 0, 4, -8, -1, -3, -16, -5, -8, -1, -5, -7, -1, -8, 12]
6770A2j9KMqOnRpLJj0J6Jj2J7rOJLj0%jkOMj1LpjNjJr%J0qKpNQlJ0j0LRMj4LJ
6819AmOj1pJ8JmnJ2mj0J0mJ1qj0QklJ2j1LjOJk2J7rlLJPpmJ5kjjNMj0J6j7JJ3
6864A1j2J1j5MNmjMrJ3j2J1nkJj3PMlNoJ1lJJj2J4mpJjjNmJ4rJ0oj4J3%lPkj1
6909fJ1j4mJ3MJj0LjJmmJ3j0%mRQmmm%J0j1J0p%J2j4QJ%oNPj1PjPrOj7MJ1lMj2
6956eJ2lj0jJ6j3KqRj5Q%jQ%lJMOplKPJkj2J4qJLkOk%jrQMj1JoJ2kj0Rj%qJ1j
7006Aj3J0Rj4J4j6NKkOj4QQojKLJ2j7MjkJ%ROj0%m%Kj0QkqOlQj5JJ1mJjoK1j7
7053hJ0kj4J3JOqLJqMnJOk0J9KkQk1PJ1%%rjQj2Rj3MOjNj3KOmJ1qj%jjJ4nMj5
7101a1PMQrNplNmPrjORm%j0J3okMMpnJ1oQj5KLLjlOkpnLLjMoMjJ1oJMj0J2r%q
$$ y = [12, -7, -5, -1, -9, -3, -8, 1, -6, -3, -2, -12, 4, 5, -7, 10, 1, 7, 8, 11, 1, 1, 0, -2, 4, 8, -3, 0, -7, -8, -3, -4, -3, -12, -12, -2, -10, -8, -15, -10, -2, -5, 5, -5, -2, 7, 11, -3, 0, 1, -3, 3, -8, -15, 3, 4, 0, -5, 7, 3, -7, 3, -1, 10, 2, -8, 0, -2, -5, 7, -4, -1, -2, 4, 5, -17, 0, -9, -12, -9, -8, -1, -8, -12, 3, 1, 0, -1, 4, 8, -2, 14, -3, -2, 11, -1, 10, -5, -1, 4, 0, -1, 3, -6, 7, -5, 6, 1, -1, 0, -13, -6, -2, -5, 0, -6, 5, 2, 3, 4, -8, 6, 2, -5, -4, -5, -6, -1, -5, 9, 0, 10, 4, -10, 3, 3, 0, 7, 5, -6, 5, -9, -13, 0, 4, 5, -5, -2, -3, -2, -6, -10, 3, -7, -7, -11, -2, 6, 2, -2, -6, -6, 4, -7, 3, -4, -4, 8, -6, 2, 3, 3, -3, 2, 9, -2, 5, 4, 11, 2, 8, -9, -5, 6, 3, 7, -5, 7, 4, -6, -7, 9, -4, -2, -10, -1, -16, -8, -8, -9, -1, -1, -4, -3, 1, 7, 0, -3, -1, 6, 7, 5, -7, 7, -1, 0, 3, 1, 7, 5, 5, 4, -5, 3, 7, -4, -3, -9, 3, 1, -9, 0, -1, -1, -9, 2, 1, -12, -2, 7, -7, 7, -9, -4, -2, -4, 2, -12, -4, 4, -2, -3, -1, 2, 14, -3, 1, 0, -2, -1, -1, 8, 14, 4, 4, 0, 0, 2, -8, 0, -2, -10, -4, -7, 1, -14, -13, -2, -6, -5, -6, -12, 9, -8, 2, 0, -14, -1, 0, 6, -2, 1, 2, -6, -2, -7, -6, 0, -20, -1, 1, -1, 7, -14, -7, 4, 4, 4, -5, -6, 2, -10, -1, -14, -10, -4, -5, 0, -13, -11, -5, -9, 2, -6, -7, -7, -8, -9, 5, 0, 4, -11, -4, 0, 8, -1, 4, -3, -6, -1, -5, 2, -7, -8, -2, 7, 3, 3, -7, 6, 0, -2, 2, 6, -1, -6, 5, -1, 7, -8, -6, -3, 0, -1, -4, 2, 0, -7, -12, -9, -6, -7, -3, -9, -5, -6, 5, -1, 0, 4, -6, 6, -3, -3, -11]
7154a1MOKMj5NMlmjLkj1NQnJ0rJ5j1mOkm%j3J0J0rKKMQj0OnLmoJ5KKqoJ4j5J6
7201HqnK2k9J1Pj9J3pKj0LkJ5njnJJ0kjKjkmllRRj3J2kMoj3J3mJ1j3NOpkJ3j7
7246hRopJ0j1J6pmoPj7J4PmOlQj1LkP%MOj1LjnP%nPoRk0%Qqj2K7mNj3MKpPMp%
7296elNrRQrqkOLL%j1J5JnRj1mJ8j2RjNj0RlJollOJm%kj0J3Kn%nPJoNqOmKMjM
7349BqLMj0J5rRrjRplRj0NnjLjRj3MKKqkRjpjKNNpjjoPN%Oj4J5j1PjQrlK%kMj2
7403a2PQl%QmnmllMJ0j2RppJ3rLJnJlNJJLLoMMojlP%qJ3plPjKj1OqJ1pNJ2j4%
7455dlnmJ5j2J3pmRrJ4j1Qj5OkJ0ojJ0kOj1J2mKJqLj0J1LmpJ1rRpLrMj2qK0kN
7501aj8J3lmMOM%pMpNjRpJLLjqJ0qJJjjKMoJK%JNpKPmqkklOjRqpRqLQj0NJJQm
$$ y = [-11, -7, -1, 1, 5, -10, -5, -1, -4, -8, -9, -6, -8, -19, -14, -6, -11, -1, -10, 5, -6, -10, -4, -6, -10, -10, -23, -13, -3, -12, -10, -8, -4, 4, -6, 0, -5, -2, -6, -12, 3, 5, 7, -1, -7, 7, -8, 8, 0, -5, 17, -12, -1, 6, -13, 0, -7, -5, -15, -12, -14, 1, -4, -5, -10, -9, 1, -1, -2, 0, -1, -3, -7, -10, -13, -4, 5, -8, 4, 2, 6, 0, -13, 0, -4, 7, -6, -1, 5, -2, -4, 9, -8, 1, -5, -12, -2, -13, 3, -4, -8, -14, -7, -24, -10, -3, -7, -1, -4, 4, -7, -4, -6, 1, 1, 5, 11, 0, 3, 2, -3, 4, 4, -1, 6, 0, 9, -11, -11, -3, -11, -23, 4, 0, 5, -8, -4, -2, -9, -2, 2, -5, -5, -8, -3, -12, -3, 5, -4, -12, -14, -8, -5, -2, -2, -13, 2, 3, -2, 7, -4, -8, 10, -2, 7, 6, 11, 1, 10, 7, 8, 2, -1, -4, 2, 3, -1, -1, -3, -13, 0, 2, -3, -3, -8, -1, 0, -6, -1, -9, -3, -7, -5, -1, -2, 2, -6, -3, 1, -9, 6, -3, 6, -3, -4, 5, -2, -5, 4, -6, -1, -6, -7, -4, -5, 4, -9, -5, -3, -1, -9, -11, -2, -3, -10, -11, -9, -4, 1, -6, -7, -8, -14, -7, -2, -2, 4, -10, 5, -6, 1, 0, 8, -1, -4, -2, -2, -4, 0, -12, -5, 3, 0, 0, 8, 4, -1, -5, -8, -11, -7, 3, -9, 0, -7, -14, -1, -10, -7, -6, -11, -10, -13, -8, -7, -6, -3, 0, -6, -2, 2, -4, -5, -8, -1, -1, -9, 4, -3, -6, 1, 0, 2, -9, -3, -11, 0, -7, -2, 10, -4, -4, -7, -12, -16, -1, -13, 0, -7, -11, -2, -11, 3, -8, 0, -15, -9, -11, -1, -7, -8, 2, 0, 6, -5, 7, 3, 5, 6, -2, 1, -9, 2, 5, 1, -6, 5, -4, 5, -2, 1, -8, -4, -16, -24, -4, -6, -1, -19, -6, -9, -13, -9, -3, 1, 1, -6, -2, -9, -4, -5, 4, -3, -2, 1, 4, 3, -5, 5, -3, -2, -1, -2, -3, -1, 3, -3, -2, 0, 0, 1, 6, -1, 1, 8, 4, -4, -6, -8, -11, -5, -6, 3, -5, -12, -3, -11, -8, 0, -10, -5, -4, -3, 5, 1]
7558AmkLkKoRRj6LoJ2q%%JOoPj0KLNj0KoRK%pmRjNJj2OnMMj4NoJ0nJ0RqNPkjo
7611DMQj5MoJNj1nQJ2j4NnMMMj2kNoMQJ%pNnpOnJ3kJMmmRj2M%%J5j0j6OOrMnJ
7662g%jj%Po%pK0j0ln%J3Mj5J0%kjPlJNj3mJ1qJkJ0PrNnKj2J5kJpJrlJMRjoQn
7713ej0QqJ7%j0JpJ5OmlNompJ0nOJmMlQojOqMpMmpjOJNnMkLNloJjJk%NJjPpJk
7769dOKoJ0j1pQKPnKKj7Rlj%kj1J7j0JRmKj2LNP%pOpKJ1kpKPrOjj2PNrpRj0NQ
7820dMj4RPlJmpMJrL%LOkl%NPmOrLJJ3pj0%%OKmOkj3JJ0j5M%RnnQj0jJ6%jj1M
7872dLj4RrnJ3LpNMJkJoNKqJ2qJ0q%jNmJQjnj5K0olKL%j1Oj1J7j0lNKKoOJmrP
7923gLnRj0J5qpLQmKpNknJ2j2K2j6J5j0NrJ2pjojMLNj5J0nmpRJokOLPj6QMlNj3
$$ y = [1, -3, -5, -2, -4, -2, -8, 1, 10, -6, -3, -9, 3, -5, -5, -5, -4, 2, -4, 3, -7, -5, -2, 3, -7, -5, -11, -2, 0, 0, -7, -11, -2, -3, 2, 3, -9, -3, -8, -4, 0, -14, -9, -15, -5, -10, 0, 9, 1, 6, 13, 11, 10, 4, 8, 16, 1, 5, -1, 0, 5, -6, -11, -3, 9, -5, 0, -5, -1, 3, 7, -5, -7, -2, -8, -4, 4, 5, 5, -2, 3, -2, -9, -3, -8, 5, 3, 4, 8, 4, 0, 9, -3, 1, 1, 1, 16, 6, -10, -4, 2, -7, -3, -8, -7, -7, -8, -9, -9, -2, -8, -8, -15, 5, -5, -8, -13, -13, 0, 4, -11, -1, -1, -3, -4, 3, 0, 1, 6, -7, -11, 0, -8, -7, -9, 1, 8, -1, 4, -1, 1, -11, 4, 2, 3, -4, -3, -12, -15, -14, -10, -1, -2, -8, 0, -5, -15, -7, -15, 2, 2, -8, -7, -14, 1, 7, 3, 0, 5, -1, -5, -12, -2, -7, -1, 0, -4, 0, -3, 5, -1, -2, 4, -4, 0, -7, -3, -7, -14, -15, -9, -8, -3, -8, -4, -6, -3, 2, -1, -7, -6, -7, -6, -8, -8, -3, -2, -3, 4, -3, -2, -4, 2, 4, -2, 8, -3, -10, -2, 0, 7, 2, 4, 6, -11, -2, -5, -6, -6, -8, -19, -2, -12, -11, -2, -6, -4, -16, -13, -8, -1, -1, -8, -2, -9, -7, 4, 2, -5, -3, 4, -5, 1, 0, -12, -5, 0, -9, -16, -7, -17, -12, -4, 0, -14, -5, 2, -1, 0, -4, -11, -7, -6, -15, -12, -12, -9, -3, -5, -8, -8, -3, 4, 0, 6, -3, 0, 1, 14, 7, -3, -3, -3, 3, 5, 1, 7, 5, -8, -7, 3, -12, -8, -8, 1, -4, -9, -1, -11, -12, 4, 4, 3, -8, -4, -1, -15, -6, -15, -20, -7, -4, -11, -6, -2, -1, -3, -2, -8, -3, -1, -9, 3, -5, 5, -3, -3, -4, 1, -3, -2, 6, 5, 0, -15, 5, -1, -4, -2, 1, 1, -10, -4, -15, 2, -8, -11, -6, -4, -2, -8, -2, -1, -5, -14, -7, -4, -9, 0, -10, 5, -3, -10, -7, 1, -3, -1, -8, -3, -5, -10, 2, -10, 12, -4, 11, 1, 6, -3, 9, 2, 1, -5, -6, -2, 1, 6, -9, 1, -4, -8, -15, -6, -5, -11, -13, -7, -4, 3, -13, -5, -1, -4, 1, -12]
7972a2J7j0MllQLrO%lJ3mnopJ1jqPn%qJ6jjkqLkOqQ%j%jL%J0pqJ5j5QOqQom%p
8024a1jKNoJ6Lk5J0Mj0J2j5NJoK2rkQnm%kN%oRoOj7K3MpQj2JMj2L%J4kj2PqJ7
8070A1k1J0pJ5k4RNj2MlMmLKPljlRLqLjJ5j7jlJ8onmP%j%KrJLjlQ%jOmpkkOLk0
8122a9J0J2KJqJ%pPOjLj6KjLRlJ0nkmnOjrjRojK%PLkj5J7j5J0JrJ0j2JPj1NMK
8171cL%LppPjKk%nJQoJ%KKpk
$$ y = [-12, 5, -5, -1, -4, -7, 1, 4, -5, 1, 1, -2, 11, 7, 2, -4, -11, 0, -1, -9, -2, -7, -7, -15, 1, 0, -1, -3, -11, -8, -10, -4, -12, -4, -4, -5, -5, -6, -3, -3, 7, 0, -8, 7, -8, 0, 6, -2, 6, 0, -4, -4, -11, -12, -10, -5, -11, 5, 8, -17, -7, -3, -13, -1, -16, -11, -10, -16, 6, -3, -5, 3, -2, -6, -6, -8, -3, -3, -9, 0, -6, 0, -17, 6, 10, 3, 11, -1, 0, 4, -8, -5, -5, 9, 7, -5, 2, -6, 11, -10, 0, -7, 8, -16, -7, -2, -14, -10, -13, -9, -13, -10, -8, -1, -4, -5, -8, 1, 4, -4, -1, -2, 13, -4, -5, -8, 10, 4, -1, -5, 2, 2, 1, 1, 3, -6, -5, -2, -3, -6, 2, 2, 1, 7, 3, -4, -6, -8, -2, 1, -19, -9, 3, 5, 6, -2, -1, -1, -8, -1, 5, 4, 7, -9, -7, -8, -5, 4, 1, 11, 6, 4, 0, -5, 1, 0, -9, -10, -1, -7, -8, -6, -6, 1, 4, 2, -13, 4, -11, -1, 0, -9, 1, -11, -10, -3, -14, -9, -5, -3, 0, 0, 3, -4, -11, -4, -5, -3, -5, -5, -10, -9, -1, -7, -6, -6, -4, -2, -9, -11]
8191a1
$$ Imaginary data points
##PAGE= N=2
##DATA TABLE= (X++(I..I)), XYDATA
0@%%%%%%%%%%Qj6J6j6K4l2M0m8N6p2Q8j04J24j48J76k08K40k80L26l74M24m80
32b56N50o28P10q00R00j010J131j263J408j565J736j925K132k358K605k872L164
49A659l486L839m228M659n139N672o267O941p711Q600r634J0855j2329J4150j6465
64h884J9516k3745L0054m0615O2731j85865J81504J56350k65199N034J9363K57655
76B07899l22940m2482L76415j72553j42424j5234J78987J19252l94461J80066
86b7475J75890j86186j4902j8341K27715j18625k51507L07047k2453r7441k8091
97e4369K0247J92788k49882l371K21712j36676K16o3136J11733O2523k39708J66598
109B8675L1648r8176M5585o4950J47145r6341r0376J88587j12035J0586R084k0135
$$ y = [0, 0, 0, 0, 0, 0, 0, 0, 0, 0, 0, 8, -8, 8, -8, 16, -16, 24, -24, 32, -40, 48, -56, 68, -80, 96, -112, 128, -152, 174, -200, 224, -256, 294, -334, 376, -424, 476, -534, 597, -666, 742, -823, 913, -1012, 1120, -1238, 1367, -1505, 1659, -1827, 2012, -2216, 2443, -2696, 2976, -3291, 3650, -4061, 4539, -5095, 5760, -6569, 7581, -8884, 10632, -13113, 16941, -23674, 39057, -146808, 34696, 191046, -74153, -69119, -49756, 207899, -115041, -157523, 218892, 46339, -96085, -111319, 67668, 186920, -207541, -27475, 148415, -37771, -52673, -71014, 156701, 38076, -213431, 93616, 71163, -26278, -54369, -34122, 158666, -91216, -94587, 127125, -9551, -9335, -72471, 39262, 101785, -137923, 28675, 60323, -37853, 7732, -57218, 89927, -6414, -96790, 91797, -20238, -9652, -568, -20703]
121b0703R6869j59080Q9375O3795j37821R1769l9132L9724j2097r4727J69253
132H7225r2868n2954R7077m7599M9085r8627M4650J12211j69680N3727M9241j6513
144A4975o085r5485J55355k1709j37645J07348O870R859q0426n293J64108j36201
156b4329m4111R8321J488q113j12936J07844P7588j66768M0232N9330J6848o1902
168a6508p1070J67564m0601j16079P3200L2746J7928j09060K0000J39305j14497
179a7072l5407N7970L2730j2976j08305J00825N1608j13168J8712L1082M1600
190D7599n9347n5747J22462l0863o2756K7101K2543L2432q5808J4788Q2824o3639
202h411j2062J0517L1720R83p2512O0211J9978m7239R632k209L7932l1517l0452
$$ y = [-20703, 76166, -82914, 6461, 70256, -67565, 24204, -14928, 24796, 12699, -82028, 87225, -5643, -58597, 38480, -9119, 39966, -58661, -14011, 98200, -71480, -17753, 31488, 14975, 8890, -86595, 68760, 47051, -90594, 16754, 23624, 33483, -46943, -52236, 111872, -24329, -68440, 29881, 31369, 23256, -89680, 18164, 95752, -71016, -30784, 28546, 45394, -16508, -87578, 79986, 39385, -76694, -3494, 29252, 47180, -61880, -41880, 97425, -17072, -52479, 5491, 38221, 25245, -83060, 17765, 69373, -43795, -25083, 5999, 47599, -11748, -67495, 54967, 24104, -38652, -11551, 10992, 43424, -42384, -27596, 55228, -8411, -20473, -9956, 21764, 22747, -49765, 10446, 30424, -16815, -7183, -9392, 28540, -2977, -33429]
215c3429N9896k3015j1339L472J28K8158m2158J0939K5503k7796J4224j2064J0186
228B705P758k7027K7054j1335n643J6961j9988J4834p170j068J4285k5734J8393
241D025M295j5979R234o666J5425j0609j5057K7876r151r202J284O035J2843k7445
255a3092N026K3468j5004p746M56J8159l015k6993J9515J3385j5635r588Q349
268b715J9646j9086j4795K4218M244j5799q390J7311J0713k5332j110K1698k421
281H182j6442j429K0404j875k1703P780J6701p119j5504O746J6746j0343j3947
294a1803J1548J0889j0519j0574J1421R563j2916p157J3019N003j2292l715J1474
307C941L254j1692k183J2199l71j0701J548Q955j012r512K340R179m210o830L351
$$ y = [-33429, 26467, 3452, -7887, -4415, -4287, 23871, -18287, -7348, 18155, -9641, 4583, -7481, 2705, 10463, -16564, 10490, -845, -6488, 10473, -9515, 5319, -1851, -2919, 11366, -14368, 4025, 8320, -7659, 1575, -5091, 10334, -275, -15332, 12544, 3393, -5809, -4525, 1510, 14353, -13092, -8066, 15402, 398, -7348, -6892, 11267, 8252, -18741, 774, 14159, -1476, -11064, -2715, 16931, -2155, -16950, 7268, 11512, -4287, -12677, 4634, 15347, -9985, -11095, 10603, 8182, -8260, -9689, 10715, 8840, -12863, -5083, 11618, 4499, -11005, -4259, 12487, 2144, -11803, -255, 10634, 115, -10459, 962, 10525, -2391, -9548, 3471, 8474, -3818, -7533, 3941, 7195, -4497, -6680, 5519, 5148, -5553, -4005, 4950, 3938, -5574, -3234, 5945, 1735, -5095, -1744]
322a744O563l143p241N245M954n124l045L219M191m106m020N659J632m471j166
337b597L487J916m305j039M132K95l368m48L445L4l325M43L023p48k807J171K084
354A393n73k383L62L541k329j937K414K6L13k506J038L362m289O91J545k57M51
371H62l798M368M50m493L363j371K205j711l315P461m846j041L358k826M379o074
387c029J876N935q416M262q49L92K713q656R310j792n825P093n714O164m142m447
403e125J2557j0809K373L072m887Q635j1786O378N658j2747J0384n569K771K652
417C557j2143J6352q354m242J0320j0540J0970q990j436J4871j8372R625P07n903
431c578J0372j6178J4468k26j5022J7695j1000N739q46j0638K2146j8839J472
$$ y = [-1744, 4819, 1676, -5565, -320, 4634, -490, -3535, -316, 3875, -231, -4251, 1408, 3040, -1431, -2597, 890, 2806, -1499, -2538, 1594, 1889, -1479, -1927, 1518, 1552, -1773, -1330, 1693, 945, -1862, -691, 1393, 820, -1563, -1201, 2340, 11, -1926, 488, 514, 827, -1679, -641, 2721, -1568, -877, 668, 411, 862, -2936, 1432, 1882, -2611, 752, -619, 1586, -125, -3440, 4021, -825, -1866, 1492, -1334, 3045, -3029, -1153, 4782, -3634, 628, -221, 171, 2884, -5772, 3538, 1746, -4079, 3014, -2700, 3464, -678, -5125, 7432, -3377, -1004, 2068, -2819, 5816, -5970, 408, 6066, -6681, 3703, -1866, 905, 3557, -8586, 7766, -588, -4830, 5490, -5050, 5920, -3070, -4506, 10365, -8007, 1618, 2325, -3578, 6794, -9384, 5084, 4858, -10164, 7531, -3469, 2270, 1424, -9214, 12932, -5907, -4435]
444d435J2468j4387J3438j4545P156J2342k6132J9306l043m961Q303j8086K4751
457A2175j1195j3943K4568j6491R178p787m007K6076l1771J0450J2204j5569J3735
470G623k0969J9927N222l1619K9162q294j314K053j6227L4535k5049q727K7712
483A4035j9556J2219j6567O717K4643m1245K0584P805j3008J0848k4028L1814
495A4261o271l0113L5003j3970M111o012j0161L8245l6980J383K4910k0652J4556
508H310k3442J8424J6860m4809L1011m25q250O550k3428M0631k0493k2119L7631
521A6451k0595R904j3904m25L5957m7189J5199J8225k0062J4778k7239L0241L657
534A4998m2050L9409j0043k255L90j7597M3520l4039q980L4456k4134J3789k0032
$$ y = [-4435, 8033, -6354, 7084, -7461, -305, 12037, -14095, 5211, 2168, -2793, 5510, -12576, 12175, 980, -12963, 11605, -4886, 4292, -3495, -7502, 18574, -13197, -2747, 9457, -6112, 7623, -13346, 6581, 11803, -19816, 9346, 1052, -262, 1791, -14436, 20099, -4950, -13677, 14035, -5521, 6698, -9869, -3152, 21491, -19754, 830, 8635, -4373, 6475, -17553, 14261, 7990, -22123, 12880, -1090, 3021, -2991, -13152, 25093, -11887, -10504, 14406, -6246, 8310, -15132, 3292, 20152, -24657, 6354, 5929, -2321, 4229, -19199, 21432, 939, -21180, 16451, -4144, 5760, -8144, -8569, 27388, -19801, -4602, 13623, -6439, 8339, -18900, 11341, 14998, -27052, 12357, 2314, 59, 449, -17148, 26372, -7667, -16647, 17809, -6325, 7464, -12568]
547a2568J0780K6642m9385K6934P759j5490J2144k6224L6907j0431l1723M0785
559A6130j8064M651o089r345L9735m1939N603K5442k4117J6664k3871K0074J4034
572A8908m4912L5533m664q634Q893k2985L9161k3091j7076L7045k5116J2266j1364
585f036j095L0880m3907K0055J2156k1541J8666k4253K5137j14l3060L8456j6777
598a433q54N647j6489L3770l0614j00K7502k8005J6618j3008O560J6947l8396
611b1855K9853o28j6778J6663j9366K5774j3236j8511L6594k3935L955J779o782
624f473K4984l4971J3878J8247k6867J6158j3056J4449L385l1879L5183r164j1336
637g462J0964j2830K6185k3542o971L1809k4444O634m483L011J7585l5319K0526
$$ y = [-12568, -1788, 24854, -24531, 2403, 10162, -5328, 6816, -19408, 17499, 7068, -24655, 16130, -1934, 2717, -3372, -12717, 27018, -14921, -9318, 16124, -7993, 8671, -15200, 4874, 18908, -26004, 9529, 4865, -3769, 5124, -17861, 21300, -1791, -18867, 18178, -6938, 5328, -6036, -7131, 23749, -20158, -103, 12053, -9488, 9178, -15075, 10062, 9948, -23112, 15344, -1433, -2287, 3360, -13129, 20641, -9973, -10073, 17429, -10576, 6042, -6966, -406, 16541, -21855, 7998, 7370, -9408, 7255, -12111, 13663, 427, -18084, 18510, -5425, -1470, 309, -6473, 18511, -16460, -2582, 15665, -11202, 4956, -8100, 6349, 9734, -22145, 13038, 3874, -7462, 3502, -9328, 16857, -6685, -13656, 18153, -6291, 343, -4140, -1129, 16456, -18863, 1663]
650A663J0035j9667J1435j3377K0732n487k4616L1562j0764l911J558o959K5009
663A7213k5628q77K2073j6988P133j0946R612J2191k9742J8277L710q395N074
676B707j4055K2477p739j6765K1358q942L970o136m077K1797k1289J812J0497
689E615p885Q419j5644J0767Q825k0057J2494k836J928J790j4089J8974o460q123
703f282R992p195R793r104l243J5168j3084L851J64j991Q767j3942P880L922r152
718d456P533o686N841Q51r691J1109n201j49K914o390R003o102q13N855p096O350
734B872l727j290N977p059N160k211k126O695p130K874P80j864M204p167M532
749E20K775n886K944j741L931j618n993Q213j436l467M35Q50N194p414j141Q023
$$ y = [1663, 11698, -7969, 3466, -9911, 10821, 5334, -19282, 12280, 1516, -2395, -837, -7796, 17213, -8415, -9292, 12781, -4207, 2926, -8020, 1592, 13783, -15959, 2318, 6028, -2367, 2707, -11348, 11129, 3390, -13375, 7983, -959, 3011, -3125, -7202, 14595, -6694, -4882, 5615, -2270, 6149, -9495, 1272, 10097, -9960, 2534, -302, 1626, 3416, -10673, 8301, 1841, -6282, 3710, -3485, 6308, -2796, -6039, 9129, -3955, -104, 60, -1931, 6836, -7106, 774, 4696, -4456, 3077, -3609, 2232, 3083, -6608, 4501, -700, -849, 2065, -4325, 4678, -1424, -2237, 3618, -3478, 2872, -855, -2145, 3832, -3227, 1933, -278, -2404, 4291, -2839, 35, 815, -1049, 3155, -4012, 520, 3295, -2591, 353, -1388, 2543, 925, -5068, 3145, 1709, -1758, -1323, -473, 4721, -2693, -3834, 4189]
765D189l035l015j095N484J470r320L816N951l500m423Q65Q131m164p654O825
780E25M186m601n229M841O662q071l937P959K374o677l446Q305K331r285m7P994
796C884p1p917K47Q854k123q125L202P041l239o990L939O717m933n722N314M896
812D974n570m119N763L368n886k643O094J646n864r04N499N41n543K77N235j236
828A632m130J146L775j159l934K137K910k295j804J479J955j632j676J994N23
843I21j126l84N73O81r10Q2L30m81P42k65o48L41O32M9j474M71J791j036j668
862a379J089K027j598k086K140J779k178j980K733J864l431j156L328J180l716
877a384j133M600n1m124K86L760K75n019J097M949k534l308J513L969j686n150
$$ y = [4189, 1154, -1861, -2956, 2528, 3998, -5322, -1506, 4445, 945, -3478, -2613, 5518, 1354, -6300, 525, 4711, 110, -5119, -278, 6384, -1687, -5624, 2335, 4709, -1968, -5414, 2891, 5222, -4063, -4110, 3884, 3813, -4104, -3857, 4997, 2874, -5251, -2049, 4992, 1753, -5237, -1298, 5419, 486, -5236, 78, 4974, -596, -4715, 1048, 4416, -1470, -4113, 1981, 3627, -2237, -3141, 2358, 2899, -2644, -2367, 2868, 1632, -2498, -1352, 2423, 1264, -2670, -533, 2377, 82, -1722, -243, 1712, 80, -1596, 398, 921, -205, -589, -16, 665, -245, -163, 167, -314, 428, 163, -485, -144, 488, 537, -937, -466, 1325, 289, -1379, -290, 1737, 139, -1947, 193, 1972, -206, -2186, 547, 2411, -1020, -2176, 1152, 2332, -1384, -2517, 2083, 2032, -2092, -1806, 1954, 2229, -2790, -1693, 3256, 722, -2586, -1073, 2896, 1210, -3940]
893c940M074L181l735k183K152M202m361l186N762J36k977j691L190L241o651
908b786N61M885j699j862j897N132K15o520M057J689j061k084j115O614m342l132
924c345M915j001P24m060J961N269p253J764K120o98Q97n263O111J84n845M718
940A198j679K161k008l168P932n554o08L251k865M256n834K288M658p597M711
955A142j361J24K359o734P624k386l857N836n012M591k957k367Q088q398L281
970b7J739l946N722p521N321J943q247Q222m342J460J225o320J0278p150j225
985b868O790o852O068n812J312P466j1932P294ml164M863q788R794k245p948J0539
1001D513o261L326j992l998J2056j1670J924O025o674O479q622N786N052j3374
$$ y = [-3940, 134, 3315, -420, -2603, -451, 3751, -610, -3796, 1966, 2102, -875, -2566, 624, 3865, -2786, -2225, 2660, 961, -901, -2798, 2334, 2549, -3971, 86, 1775, 714, -1370, -2485, 4129, -213, -3345, 1570, 569, 1293, -2767, -806, 4463, -2790, -1026, 1094, 396, 1293, -3970, 2141, 2325, -3520, 1198, -481, 1680, -328, -3496, 4436, -1118, -1726, 1525, -1340, 2916, -2918, -630, 4028, -3569, 1142, -219, -95, 2264, -4470, 3154, 768, -3089, 2747, -2265, 2326, -631, -2998, 5090, -3308, -27, 1712, -2234, 3488, -4033, 1288, 3231, -5016, 3206, -1136, 324, 1549, -4771, 5507, -1643, -2868, 3922, -2930, 3138, -2674, -1362, 6104, -5828, 1466, 1462, -1702, 3161, -5627, 4167, 1922, -6026, 4513, -1748, 1578, -414, -4412, 7644, -4026, -2102, 3923, -2751, 3728, -4894, 892, 5944, -7430]
1015g430J0287k270j065K574q584J3224o866n633J0880p575N349n458m23J1541
1029H551j4995O111L623n619O062j0347J0410N33j2592J2898n328J462l26o455
1043f012J4822j2068j068R823q518O574q237M367Q263j6498J0520K85l879M373
1057B747r820J3605n053r321J3709p504L336l349k448J3596j5491L709P310p779
1071b753O111r422Q683L440j5337J3122k761j627J615p478J4907j0072m816J2581
1085F193q431M717o149K041J0570j6929Q164L601n947N016r630J2016j858j2094
1099h720J3914n731J307j226m655J4122j3178M43R123q171N911p892N427O170
1113F844j5089J0753p36l146L598q353J2394n826o851J1912p510L603k997j574
$$ y = [-7430, 2857, 587, -478, 2096, -6488, 6736, -130, -5763, 5117, -2458, 2891, -2567, -2990, 8551, -6444, -333, 3290, -2329, 3733, -6614, 3796, 4329, -8263, 4635, -693, 769, 443, -6012, 8810, -3258, -4326, 5497, -3021, 3553, -4684, -317, 7946, -8552, 1968, 2253, -1626, 2747, -7073, 6532, 1479, -7842, 5867, -1637, 1699, -1650, -4098, 9498, -5993, -2284, 5026, -2753, 3358, -6064, 2619, 6059, -9278, 3844, 1083, -544, 1071, -6407, 8500, -1572, -6388, 6193, -2238, 2479, -3670, -1629, 8941, -7988, 176, 3777, -2170, 2846, -6784, 5232, 3374, -8720, 5194, -537, 770, -456, -5111, 9011, -4167, -3724, 5399, -2772, 3139, -4753, 674, 6844, -8245, 2508, 1772, -1374, 2224, -6129, 6265, 439, -6412, 5500, -2010, 1593, -1404, -2978]
1127b978J0550j3199M886M664o872N969p594P019J307j0913J1501m491p60K321
1141A410n759J0507q581j132Q907q451M928l741J251O008j1698Q381K84n204N401
1156B511o319P537l043o164J0775o874J220Q16k876P763r553L192N378p644M969
1171A688l826L322J829q897R275k424l105L602m216O839n392k263Q323o726K079
1186A08n80k97M800q558N095K375n475L848l493M354q85n855Q005l544r02J613
1202F09k566N664n822K95N235n284K641j942J243K736o579N045p0k628K623l362
1218b162M308j873l065N388l491J014k1j511M116m546J380K141l092K619k439
1233a234J503J248l764L586j400m68J535k613L097j654r91K625k575J796p08r09
$$ y = [-2978, 7572, -5627, -741, 3923, -2949, 3020, -4574, 2445, 3752, -7161, 4340, -151, -911, 1410, -4349, 6158, -2423, -3555, 5352, -3099, 1829, -1912, -661, 5347, -6351, 2030, 2314, -2890, 2511, -3808, 3729, 686, -5478, 5297, -1577, -357, 459, -2417, 5346, -4207, -1015, 4363, -3281, 1688, -2138, 1184, 3013, -5884, 3391, 967, -2138, 1464, -2752, 4087, -1305, -3568, 4755, -1971, 108, -472, -769, 4031, -4527, 568, 2943, -2532, 1316, -2177, 2177, 1292, -4563, 3442, -102, -1004, 609, -1957, 3707, -2115, -1820, 3415, -1869, 772, -1170, 73, 2809, -3770, 1275, 1205, -1423, 1200, -2162, 2146, 273, -2792, 2596, -895, 119, 98, -1413, 2703, -1843, -463, 1678, -1414, 1205, -1234, 269, 1517, -2247, 1339, -61, -529, 1006, -1607, 1490, -164, -1155, 1470, -1105, 691, -17, -926]
1249i26K381k572J458M6j323K123k106J119L78j570K002j716P38P30j832J827
1265G57j039J54P30j585J739q21m10J050j100J056p76j54J271j451O50M4k78P14
1283E51j258R09K35r41P56m16L44j01n62R57n20j87L40j76L53n98K02M95o21K21
1303a7J5L3R2l95M25pl53K14O0Mj47j1J98j09o1O7K8m9m0J26m4j20R1R8j34l2
1329f8J42r2J5l2O3O7k81J99J63l05N0Q1J06j39j83L78r8k21R6J75L9m53K35L98
1353C35m02j27J75K58j78m52N22J93n28k5L94J30n54k9O35j40n32O8O38j68p01
1374d88M05N34m07n18M65N25o27l81N88M26o89m52R70R6q37N2N85K58r73JJ136
1395F69n18o23K28P66j66j185Q61O37q06k57K25R35q10q70J479k05o20r5L93Q15
$$ y = [-926, 1455, -1117, 341, 387, -936, 1187, -919, 200, 578, -992, 1010, -706, 32, 762, -1070, 757, -282, -128, 602, -983, 756, -65, -475, 575, -525, 531, -245, -399, 872, -579, 71, 115, -163, 551, -707, 202, 437, -504, 252, -164, 180, 79, -483, 474, -46, -233, 107, -69, 284, -314, -112, 383, -238, -17, -2, 31, 123, -272, 153, 146, -207, 7, 67, 71, -76, -87, 111, 2, -59, 8, 36, -13, -53, 73, 29, -91, 0, 98, -36, -68, 74, -18, -3, -35, 28, 95, -186, 13, 176, -129, -79, 2, 108, -31, -214, 164, 66, -155, -59, 116, 155, -298, -63, 335, -67, -194, -19, 239, 61, -391, 131, 324, -204, -229, 165, 295, -259, -288, 347, 207, -325, -257, 381, 213, -488, -83, 451, 44, -474, -9, 516, -111, -492, 96, 522, -167, -619, 351, 447, -390, -338, 247, 505, -468, -467, 669, 151, -472, -244, 522, 356, -829, 32, 669, -137, -394, -169, 766, -44, -914, 565, 360, -260, -355, 38, 853]
1415H53j501J99J186p76j04l42R58O5j590J358J02n83R9m52J457j121o41J656
1433H23r98K25l33J41J101j917J036M99j051Q42j012J213k76j386K102j289Q6
1450a94N27r48J650j827N18J395k128J401n55J67O50k079K493q72j231J824j375
1467e84J416j331m35K818k980Q34Q05q79J324k674K331P06l180K477p36O58n45
1484B5j938M208k593j071K312j378J766k924J078L141m554J812N17j78P08l623
1500b692M405n09l455L136j269J699k042j319N274m314r1K008j137K063m357K775
1516A75K565n207K861m48P38K9l796N720k160k604L279j868K546l234k04N109
1532C501n409J496J029r83K167m822M199Q37m798L994j747J494p90k945O111m177
$$ y = [853, -648, -449, 737, -39, -143, -485, 473, 538, -1052, 306, 408, -175, -76, -528, 929, -192, -833, 823, -175, 50, -283, -142, 959, -958, 78, 577, -474, 368, -644, 569, 293, -1093, 1009, -280, -194, 333, -615, 1035, -792, -274, 1121, -1007, 394, -161, 6, 656, -1423, 1070, 198, -1033, 791, -584, 832, -499, -934, 1884, -1096, -262, 543, -336, 988, -1686, 645, 1351, -1829, 648, -88, 570, 25, -1913, 2295, -298, -1369, 943, -435, 1331, -1593, -515, 2626, -1928, -116, 401, 223, 931, -2692, 1713, 1204, -2251, 885, -384, 1315, -727, -2046, 3228, -1086, -1177, 831, -306, 1757, -2600, 175, 2740, -2467, 394, -54, 684, 713, -3083, 2637, 477, -2127, 1152, -716, 1830, -1404, -1608, 3501, -1908, -412, 617, -366, 1801, -3021, 1178, 2015, -2783, 1211, -536, 958, 168, -2777, 3334, -843]
1548h43o64L017k617L029l970J627L572o131L702l18p28J659m413N552j818l414
1564b758M860l053K051j753j125N504o079J714K361k877K772m172L597J292n953
1579c619N282j506k77O15l110O053m227j638M937l546K114k621R75M156o967L624
1595B45J284k466K052l873N083j131m870N997k508M43o57j541N863n964N02L967
1611B426l531K291l400K842K273o729N016l16j406J210l351N750l119k909N450
1626B497l236J440j713r3M693o368K369K215k888K270l529L761L29n173N257j743
1642H8k66M80k354N112m172o61M076l464K054k107R93K862n597L709K83k054K060
1659A042l053L878j433l024M821k918P93j26j238L907m577J438K282l191K421
$$ y = [-843, -1507, 1510, -1107, 1922, -2048, -421, 3151, -2980, 722, 404, -324, 1335, -3078, 2474, 656, -2758, 2102, -951, 1100, -653, -1778, 3726, -2353, -639, 1722, -1155, 1617, -2555, 1042, 2334, -3619, 1663, 157, -120, 495, -2615, 3438, -789, -2427, 2510, -1036, 1078, -1543, -568, 3588, -3379, 245, 1529, -937, 1115, -2758, 2325, 1194, -3676, 2321, -187, 256, -401, -1942, 3921, -2043, -1541, 2426, -1105, 1186, -2214, 628, 2901, -3828, 1188, 872, -534, 676, -2675, 3075, -44, -2953, 2497, -739, 701, -1012, -1105, 3588, -2780, -411, 1804, -1084, 1186, -2343, 1418, 1747, -3426, 1831, 88, -178, 302, -2052, 3060, -1112, -1773, 2303, -1161, 893, -1214, -221, 2641, -2956, 753, 1036, -1018, 1042, -2011, 1867, 434, -2590, 2231, -687, 106, -20, -1258, 2649, -1928, -490, 1792, -1399, 1022]
1674A022k313J847R39m215M309j390r73J538k280L518k625r39L698l240J464o42
1690b82j88K406m080K608O85k416K152k006K114m77k578L859k137j16R01j410
1706i65K650k839N40K261k847J690r48N20J086l036K864n34j361J647j663K000
1722A065j224j082K814k304P01K06o99J779k484J336Q56j961J619j141Q42J87
1738E10j811K383j220l52J039j220J508j294o2J599j873J001j82k75R49j640J385
1755D45r0j071J270r61P15k33p90J576j244K24N16p75R44r77L86O36j195R22l43
1774d5k5L79q94J039m66l33P55p31N87l25k22P86q86M36J07m23N55n71L68Q3n10
1795c36O09m22J14J67l66M90m13Q7L11n07L69j18o1K20l61L63r9k41L36j63O6
$$ y = [1022, -1291, 556, 1495, -2720, 1589, 199, -774, 764, -1516, 2002, -623, -1562, 2136, -1104, 360, -282, -470, 1936, -2144, 464, 1149, -1267, 885, -1121, 993, 516, -2062, 1797, -340, -456, 445, -965, 1685, -1154, -614, 1647, -1200, 490, -458, 62, 1148, -1888, 976, 442, -919, 728, -935, 1065, -159, -1241, 1573, -731, -30, 176, -523, 1256, -1228, 108, 964, -997, 622, -519, 323, 510, -1301, 1082, -138, -490, 549, -671, 837, -457, -519, 1080, -793, 208, 26, -249, 700, -940, 445, 355, -716, 554, -407, 308, 75, -715, 861, -383, -159, 357, -418, 526, -451, -65, 571, -624, 298, -45, -70, 309, -585, 454, -12, -345, 410, -321, 266, -59, -281, 505, -381, 55, 162, -261, 294, -277, 91, 174, -336, 273, -149, -35, 132, -234, 256, -157, -70, 241, -266, 103, -15, -76, 144, -217, 146, 47, -194, 142, -21, 45]
1816D5j00l0L12l56L9J99j12K7j75K27Q0l62K12J36j51p5MK45j36k42K59R2j78
1839d0j07J78J40k84m4K81l7j89k0K34K9l29J23K53j68j48R0J93j01k39K15J38
1861A68k26o7J57J15k14r8K74l7j40j6J35O4k49O8J77j23p1M4J19n6j43J39M1
1884F1p5o4P8P6j45M7N9l8No0J13l6q8J26o8L2m0J0O2j48J45j0j19J15r0J37j22
1911c7j03L00k18LP2n3J57l12J99J57l27J80p0J80j01l18N31k19j59J82j43L40
1933B41m30J7N24n05J20j8J00J96o85N85P6m33K80k53M90l33m12Q95n34k0J02
1954Cj28N79q79L12N56p30L79l13L82J10r27J040l00l27L78m54Q43p22k32J062
1974F32r27L39j16l3O73j223P80K76q02O59n91O75j73q94J369p70l6L42n57J034
$$ y = [45, -55, -85, 227, -129, -90, 109, -3, 24, -151, 76, 156, -206, 6, 142, -9, -84, -80, 165, 29, -213, 46, 138, -40, -147, 31, 171, -113, -157, 124, 87, -102, -122, 112, 141, -188, -65, 188, 20, -128, -38, 155, 54, -185, 30, 168, -58, -125, 32, 147, -67, -165, 109, 72, -68, -84, 51, 115, -134, -66, 111, -12, -83, -39, 80, 24, -119, 20, 61, -14, -78, 0, 76, -69, -22, 37, -1, 4, -56, 57, 21, -67, 59, -9, 23, -17, -7, 55, -93, 52, 42, -77, 38, -52, 85, -37, -140, 160, -58, -55, 17, -36, 121, -191, 8, 165, -162, 18, -52, 128, 27, -291, 240, 21, -138, 44, -99, 241, -189, -172, 352, -153, -33, -51, 49, 245, -440, 145, 221, -212, 68, -185, 305, -28, -440, 455, -79, -99, 3, -125, 454, -425, -113, 443, -287, 92, -221, 161, 271, -656, 384, 84, -243, 135, -319, 524, -198, -430, 632, -295, 44, -72, -105, 568, -655, 125, 401, -401, 258, -333, 342, 169, -725, 644, -126, -162, 180, -377, 657]
1994F57j127K38R41j260P74l75J58M93j365J365l13o99R09q33R46o61m63J543
2012I28j424M58K22m78R95j511R90M77j462J231o64M61J3j181J906j099l64R66
2030D64q75J079j241K23J444j946R48J1k20O84j677J735j66j405J467q25P45n72
2048a27p51K162j792J07Q58p86J049j668J014J007k174J408l13J26K17j541K291
2065A087r84j006J533r77J003j194n4K023k329P50M82n31Q87j922J767K66k009
2082a208J737p07N26l13j173K512j695l72J306j001J136j582O35J518k461J309
2098A67K8k73O27j803K160n00j511J804j010P68o87n91K252k165L96R17r78J097
2116F98j687J225P22k223J790n34K6K81j384K248j310p04J667j268R58j003J26
$$ y = [657, -470, -232, 709, -551, 223, -152, 6, 499, -866, 499, 186, -513, 396, -437, 509, -152, -615, 928, -496, -38, 184, -294, 701, -810, 180, 657, -805, 426, -238, 223, 236, -945, 961, -138, -502, 464, -411, 668, -573, -350, 1094, -852, 96, 107, -113, 571, -1106, 629, 463, -942, 525, -300, 445, -127, -878, 1284, -508, -401, 457, -329, 720, -948, 66, 1073, -1101, 307, -6, 120, 337, -1204, 1087, 103, -903, 630, -347, 656, -538, -592, 1431, -898, -148, 334, -197, 690, -1232, 535, 801, -1208, 529, -178, 348, 35, -1138, 1374, -321, -693, 613, -388, 748, -834, -199, 1319, -1142, 167, 195, -78, 549, -1254, 906, 406, -1105, 699, -311, 457, -230, -821, 1431, -734, -338, 579, -399, 698, -989, 236, 958, -1265, 525, -9, 17, 298, -1086, 1162, -148, -852, 815, -453, 505, -498, -372]
2133c72J632k336J148L50p74Q99j531J639j52j690J955r28K73q3q05K020j808
2150e63O9J290j263R28j084O79Q91k137J579r9n75O13j182J731q41j018J823j122
2168b81M39l44k27J516j962P05P89j055P85j050J073J91j682J700n41j80K61p88
2186f51J625j292l10J386j094N90o23K62R88j787J047K37o79O09r39J182l32j079
2204h60J478p50J43j7m53J269j288K01Q21r08O45o57M48M68j304J103k23l20M55
2223B51p53J014n47m73J060q20L80j65j91Q13j074N39K82o45O02o00N06N5p79
2242e45R71n27mK71n01P53o61L4O25p52M76k22LM04p80O66r1l78M86m67M47k03
2264El36P38n94J46J38k64M49n56K55K93n38L86k07J24J04m84N80k21j87K91k75
$$ y = [-372, 1260, -1076, 72, 422, -352, 547, -984, 655, 503, -1187, 768, -160, 113, 30, -775, 1245, -563, -494, 796, -467, 461, -623, 56, 947, -1190, 389, 290, -285, 328, -854, 877, 36, -982, 841, -281, 158, -186, -413, 1103, -859, -154, 635, -420, 365, -685, 388, 579, -1103, 597, 56, -124, 137, -651, 974, -318, -628, 758, -336, 254, -369, -107, 881, -906, 141, 378, -301, 308, -631, 551, 219, -860, 618, -132, 11, -6, -459, 810, -478, -277, 544, -364, 281, -376, 72, 540, -764, 339, 116, -204, 251, -502, 512, -35, -508, 552, -268, 112, -53, -244, 569, -505, 34, 316, -329, 273, -327, 179, 234, -545, 426, -101, -105, 166, -335, 418, -243, -209, 416, -336, 140, -82, -79, 325, -455, 211, 120, -258, 228, -239, 208, 5, -331, 407, -187, -41, 97, -167, 282, -274, -19, 274, -264, 122, -85, 39, 143, -341, 239, 18, -169, 122, -153]
2285a53L43k75j10M83m40J41L3r0K52m21K74J02l10K53j85J90k3k89L98j85l9
2306e1J02j57K70k49pK49k45J29p1oJ65k63J69K1j10R6j37J49j7j57J83r8K4K7
2330A6j05J69j13k8J14j00P8o3oJ04j19M4Pk3N9r1P7J3q6Q2n4K4K2o8P6k3l5M3
2358A4m7O1k3l0N2n0J1J3l5N5n6K7Qm4P0o8J8L6n0M1k3kM9o6L7J6k0Mk8N3k1l8
2390c6N3k2K6m5oR3q3j4M3j5L3q5O6K7o9K8rN7n8m6J13o4lRj9P6j14M4P3r3M4
2421Dm9O8Qj27J40m2j8J3n3J51j32qJ22j26J01j04L0J32k14J27pm1Q6j74J85m1
2447C1j29J67j33J22p5r5K45k30P4O7j42K15k35J07J15k45K31j53O9O4k47L25
2469A48j88k7J74k42K77k10k7K95l78K44m8j01K54l74L06l7k54L66l18K20m6k38
$$ y = [-153, 190, -85, -195, 288, -152, -11, 22, -68, 184, -237, 37, 139, -171, 82, -103, 87, 64, -225, 173, -12, -51, 51, -106, 164, -85, -92, 157, -88, 41, -30, -36, 129, -134, 35, 56, -54, 42, -95, 54, 37, -120, 63, -35, -11, 16, -89, 80, -33, -61, 53, -47, 31, -32, -38, 66, -53, -9, -2, -25, 34, -57, 20, 33, -53, 29, -25, -1, 21, -47, 29, 6, -29, 14, -33, 28, 5, -25, 27, -23, -12, 1, -34, 21, -35, -8, 0, -44, 26, -42, -24, 12, -38, 3, -20, -22, 27, -39, -2, 14, -6, -2, -30, 23, 2, -36, 17, -5, 21, -24, -30, 63, -20, -34, 9, -6, 27, -58, 8, 35, -34, -6, -15, 42, -16, -62, 51, -13, -16, -7, -26, 50, -64, -20, 53, -40, 4, -45, 23, 31, -96, 44, 2, -16, -3, -56, 95, -37, -45, 77, -49, 52, -52, -22, 110, -104, 23, 16, -25, 61, -113, 72, 31, -98, 69, -64, 58, -17, -112, 133, -97, -23, 44, -98, 117, -118, -11, 104, -141, 90, -63, 6, 70, -177, 148, -40, -67, 107, -135, 142, -68, -95, 200, -178, 66, 18, -83, 171, -203, 103, 66, -188, 178, -140, 80, 34, -204]
2491b04M66m13J10J59k94L78l93J65K53n04M20j84KK05m65N40k50j97M18l89L59
2512A82k64j02N46o35L07O3k33L92n90M69Q1n61N65l40J95nm16P61n43l5L68l94
2534a89M85n75J89N01q16N23j25m1K82p05P68j92m71O30m49M09k92k68Q71q07
2554b72J99K35l30N25p76M92L09q39O77l07J45J06o66R75n17k47N74n28N53n35
2574b27J4P62r86M98J2k13M60q35P87m4p10Q02n13L46j44m39J007q38J09M09n05
2595b48O13p40L82M60j018P79k34j1K54p64J000m51m22P86o31M77l74j31Q77j056
2615d52M41K15m21N30q00O97J01r01R20m16J17N5n41J034p84q0O63o29N14n59
2635b96K46N83j104P24l7k48L65p35R22l07o18R07n70L14k23k41R33r93K68M01
$$ y = [-204, 262, -151, -41, 118, -176, 202, -191, -26, 227, -277, 143, -41, -39, 166, -299, 241, -9, -206, 212, -177, 182, -82, -184, 362, -273, 34, 97, -136, 256, -334, 135, 216, -345, 220, -120, 75, 70, -346, 415, -128, -163, 205, -189, 296, -279, -90, 411, -405, 118, -7, -48, 234, -471, 297, 105, -366, 264, -185, 224, -68, -336, 535, -272, -73, 162, -168, 357, -419, 73, 382, -457, 220, -87, 58, 164, -502, 473, -44, -291, 283, -245, 308, -227, -213, 549, -437, 61, 73, -140, 320, -515, 272, 228, -482, 320, -193, 153, 9, -430, 577, -261, -152, 257, -248, 365, -375, 7, 467, -551, 228, -6, -17, 237, -527, 473, 22, -400, 386, -245, 232, -142, -273, 604, -452, -11, 204, -217, 313, -487, 210, 311, -590, 330, -86, 31, 86, -455, 579, -205, -285, 378, -251, 263, -296, -50, 533, -571, 153, 116, -132, 233, -502, 420, 113, -505, 402, -168, 146, -77, -318, 615, -378, -110, 291]
2655B91n19N07o90N29K61r51Q54k88l4J71n82R50n97k72P49o06M12l44KO75r85
2676d67N36J24l83M52o55O52p9o60Q36m70J46L0l86P96p18Q2M81n67M67m35K10
2697hL52p96O71j83j77L39n47O63l38k95O87n79K84j00j60N61p17L62J91m51M40
2718A99m04L21M6n44O94l69k4K25l73N38m57NM59n35L19j46mL02n79M72l7l07
2740a99L53l31L29j33l05N82m09P8R7k07L95m51J64K46m12K92j71J10J11m11M50
2761A78j65j23K22k49L12k26r3L71l63J65j0q0K29l52K29O5k48K34j87J45pk13
2783a66L15k09RJ18j88K34k02K6J92k67J92o6l9J50k12J71m5r3J80j76J23k2r9
2806g4J84j83R5L5j34J46j19O5L7j58J76r0j7P1r1J19j10JJ28j55P9k7J2N5j56
$$ y = [291, -228, 279, -411, 118, 379, -572, 282, -6, -40, 131, -451, 499, -98, -370, 379, -227, 185, -159, -157, 518, -467, 69, 193, -190, 262, -393, 259, 180, -480, 356, -114, 32, 62, -324, 472, -246, -164, 317, -250, 217, -218, -8, 344, -452, 219, 36, -141, 198, -349, 314, -24, -319, 368, -211, 73, -27, -187, 374, -343, 19, 210, -241, 199, -205, 116, 162, -382, 312, -57, -81, 144, -229, 309, -148, -143, 316, -219, 100, -46, -50, 252, -327, 145, 108, -199, 154, -177, 152, 19, -286, 296, -113, -35, 62, -145, 250, -201, -37, 209, -203, 89, -82, 28, 139, -272, 178, 13, -110, 112, -137, 175, -51, -144, 227, -136, 29, 19, -61, 168, -184, 45, 110, -138, 96, -91, 54, 47, -166, 149, -60, -51, 67, -121, 113, -89, -63, 129, -138, 54, -12, -51, 99, -113, 58, 13, -80, 100, -76, 47, 25, -74, 110, -73, 22, 57, -77, 69, -50, 15, 52, -106, 70, -20, -37, 34, -57, 62, -48, -47, 81, -74, 5, -22, -10, 45, -111]
2831a11J41K3j31J00n7P4l8p2J44q5k4M4j9O9j03L6P5r3L1j2K0K2j03R4Op5N6
2858A2k9M1l6l3J01p0j0J6oL7p2K8N5p3L6j1RK1n8N7lm6M2j5K1j2k1M6m5J4J8
2889A4k2K9m2L2J1o2Q3l5j9K3l0M1m4nO4o0M%J9J4p5P9pm4L1k1M9m5l4Q9o1OJ3
2922eLL6p5L0N9o7J6j7N0j3r6J16l3k2K9l7Q5q8nR3p7J7k3K2M4j12Q7Qm4K0m2
2953d1Q6o3n3J24p4J2qmQ7j32N8N9r1P1o1O5jj27J56o5j3L4p7J37j27PJ12j24
2981e3Q6n5K1O9j77J58k1q2Q3r7J25p2p9K00j75O3J8p7J54k00J02R1j83J51r2
3006d2P6jj71K57j25m9J20j20J72j95J1K25k63J18j9j9J27k60K18Rk03K09j31
3029e6J34r2j42L11k21J3R4j15K12k95J32J84l08J99q8N5O7k91L53j11j46J84
$$ y = [-111, 30, 53, -78, 22, -35, 39, 1, -71, 73, -12, -36, 8, -11, 58, -45, -9, 66, -27, 4, -8, 12, 34, -69, 25, 31, -44, 12, -17, 24, -12, -45, 56, -14, -24, -8, -14, 23, -49, -21, 34, -39, -3, -14, -5, 16, -42, 15, 12, -34, 8, -7, 14, 2, -19, 27, -18, -4, 14, -8, 21, -21, 11, 22, -40, 43, 8, -11, 12, -18, 23, -21, -26, 38, -22, -18, -18, 1, 15, -60, 19, 12, -32, -1, -22, 27, -18, -52, 37, -24, -18, -5, -2, 34, -41, -11, 48, -19, -3, -20, 30, 17, -79, 37, 4, -18, 11, -26, 59, -29, -34, 59, -18, -1, -24, -2, 42, -70, 17, 25, -19, 1, -41, 45, -18, -71, 53, -21, -9, -17, -21, 66, -66, -8, 51, -40, 31, -30, 35, 34, -93, 63, -2, -15, 19, -58, 79, -48, -41, 71, -53, 33, -22, -1, 68, -109, 49, 28, -54, 29, -68, 57, -15, -94, 106, -69, -6, 12, -65, 89, -111, -9, 82, -101, 50, -42, 34, 33, -138, 119, -6, -55, 65, -55, 117, -78, -67, 158, -105, 13, -6, -25, 102, -158, 60, 69, -134, 75, -56, 78, -14, -156, 155, -66, -53, 41, -74, 138, -157, -25, 159, -149, 50, -38, 17, 84, -207, 146, 35, -111, 73]
3051G3j56K16k08m0L24l21J18K0n4J75l51K69O8l11K64j62J58n8k37M29k74l8
3073i6J70j61K46l14R6K73l96K23l6k4J36l46L72p3k40K86j91J91j51j31M25l79
3095a20Q4J14j36K21l68K51J44m08L13j45O9M4l00M71k52j35K77k16K30k62K9
3116i5L38m52K11L7q3J75l69L71k8l35L71j99J39q7j78M55l81J5K29k22K26k96
3138a58J71K12m61L20p1k3J01l27M40j81k20L46k43J89j65m6L89m56J64J05j57
3159g1J91l37L15L1l80L84j65N3J2k29M35l14n4K82k47K05k40J01K51m49L00j9
3181E5j06J57l02L61j14k54L63k30J14o0j24L71l86R7J81k34K21k50J75J03l58
3202b20L28j15j4P7k34L57k12j07K93k38J45j05k0K53l69K03N7j49J69k37K40
$$ y = [73, -83, 133, -75, -115, 209, -112, 6, 26, -28, 147, -204, 65, 133, -178, 86, -76, 82, 24, -213, 216, -58, -96, 74, -87, 159, -155, -59, 214, -182, 41, 5, -19, 117, -229, 143, 70, -170, 116, -75, 116, -35, -166, 259, -120, -36, 78, -58, 163, -205, 46, 190, -218, 95, -50, 19, 63, -237, 234, -18, -153, 124, -92, 138, -124, -95, 243, -209, 2, 39, -44, 131, -238, 133, 105, -230, 141, -58, 81, -6, -184, 271, -110, -95, 134, -88, 138, -158, 13, 225, -236, 84, 13, -10, 91, -236, 204, 23, -197, 149, -94, 95, -70, -116, 273, -183, -19, 86, -71, 120, -217, 98, 129, -251, 133, -32, 21, 33, -196, 239, -75, -129, 153, -94, 111, -129, -28, 223, -226, 74, 55, -51, 106, -196, 165, 51, -203, 160, -70, 44, -16, -140, 231, -155, -58, 123, -111, 110, -140, 35, 138, -220, 108, -7, -21, 56, -178, 179, -33, -140, 153, -85, 60, -45, -65, 188, -181, 22, 79, -70, 99, -138, 102]
3223A02l6k53L32j73L0K0j32K87k74K5J96k15J55j40O8J31l07K57m6r3J35j93
3245a24K34j19j27K68j92P2j3n7K03k60J16J05j79J42j43J08L3k04K50j19k4P1
3267D1j26K03j63j5J75j85R6n4J1J14k07J47rj02J22j21J19l8j10K03j52L9L6
3290B4q4J54j70N2R5j45J05n1K8N1j43J46m5n2Q0r5J03n8m4J36j39N9Jm6Q9j17
3316f6Q5J2q7R2o6K4K3p9J16p7qN3o0P8n9mP0r5N9j9nM4p4N4%m6O9n0L9k2l2Q2
3348E1p1J3K6m5M7m9K2L0o4N5k6kJ9n7N9j1k8L8l7L3k7KM8o1L5J0l2M8m9K7J4
3379A8l6L5k4JK0k8K9k5nL4l0K2k6J0J5m4M3pk0K7l2K7nk6L6k5JOj1J9k3J4J0
3412@l1M4l6J9K1m5L5lj1K1l5N2k8j8M0m5L9j2j8L1m3M1j1l2M0l7L3rk5M0m1J8
$$ y = [102, 66, -187, 145, -28, 2, 22, -110, 177, -97, -72, 124, -91, 64, -76, -8, 123, -184, 73, 27, -66, 69, -124, 110, -9, -136, 132, -60, 12, -1, -58, 145, -115, 1, 106, -73, 69, -74, 34, 67, -137, 113, -6, -30, 41, -85, 118, -45, -60, 115, -70, 26, -28, -17, 97, -110, 37, 28, -74, 48, -73, 46, 8, -102, 101, -51, -12, 24, -60, 94, -76, -24, 71, -74, 31, -20, 8, 59, -84, 62, 17, -35, 45, -50, 53, -5, -49, 87, -52, 7, 8, -38, 51, -66, 19, 31, -56, 36, -30, -6, 17, -62, 54, -23, -31, 22, -38, 40, -19, -23, 47, -48, 11, -8, -13, 31, -43, 11, 11, -35, 34, -16, 23, 1, -31, 51, -20, -7, 19, -26, 21, -28, -6, 24, -40, 15, -11, -13, 6, -51, 8, -3, -31, 7, -30, 3, -24, -22, 26, -35, 0, 10, -22, 26, -23, 4, 18, -18, 17, -7, -6, 14, -14, 15, -10, -15, 19, -11, 11, -15, -5, 10, -34, 9, 2, -18, 9, -23, 4, -1, -27, 9, -16, -15, -9, -20, -1, -24, -10, 0, -31, 13, -23, -4, 17, -28, 7, 4, -7, 14, -21, 31, 3, -15, 25, -20, 19, 7, -11, 20, -23, 18, 7, -25, 15, -22, 11, 2, -23, 17, -24, -6]
3444fJ2l3K6j4J0J7m3L3k7NK7l4N3m5jM4o3M5oj7L8n3M8pk0L0l9M3k0l0O8o8J6
3477a1J3k8N0o4L3K9o7N1k6PL7p5P3m1j5M5n0O7o4QP0r3N1j5nP0j06P2Mm8O1p0
3509c7N9j3n2J00p5K0J7n8R7q8K2N3j05Q3n1K5L8j14J07k5n1O8o0Q3o5k7J09j09
3537d9N1j0j1Q2j41R9K4j05J04p2O5oj08J47r7PN6p2J05j24L1J02j44J00o1J8
3563iN8j40J40l3q3J00q9J05p2n0J72j50M5J8m4J09j75J14N0j40J25q9N6K7j38
3588i3J79q9m0R3r7J19j15KJ38j76R1j5j6Q4j82J60jj28J37r7Q0l8r9K17j60J3
3614c3O2p8J24j69Q5J03j94J23m0K9M0j67K01p5r0J36r8J13j02l2J92k00O7K5
3638B2m5J03j87J42L0j75J56p4N7j7j14K07j42l4J16j06J18j22L0J37j98J14j9
$$ y = [-6, 6, -27, -1, -15, -5, 12, -31, 2, -25, -20, 7, -27, 26, -19, -20, 24, -39, 6, 0, -17, 21, -32, 16, 9, -11, 19, -20, 23, 3, -27, 41, -27, -11, 2, -26, 24, -40, -7, 22, -45, 6, -20, -13, 24, -51, 22, -19, -34, 11, -39, 28, -36, -28, 42, -51, 0, -15, -20, 50, -56, 16, 20, -28, 33, -37, 22, 9, -43, 57, -18, 2, 19, -39, 58, -30, -8, 45, -60, 23, -28, -3, 35, -79, 28, 3, -48, 20, -40, 43, -22, -49, 60, -49, 2, -8, -19, 63, -78, 21, 45, -60, 44, -28, 37, 31, -77, 70, -27, -20, 36, -36, 69, -55, -24, 78, -66, 34, -27, -9, 49, -91, 49, 16, -67, 33, -56, 49, -23, -73, 99, -51, -6, 12, -32, 77, -98, 16, 66, -74, 51, -38, 18, 45, -93, 86, -3, -43, 50, -47, 72, -43, -41, 97, -79, 12, -3, -19, 65, -117, 43, 42, -86, 51, -46, 34, -4, -103, 114, -46, -33, 29, -49, 75, -94, -9, 94, -100, 23, -17, 12, 52, -115, 86, 11, -79, 57, -41, 72, -30, -62, 130, -70, -3, 22, -23, 80, -107, 35, 65, -110, 46, -28, 29, 12, -102, 105, -37, -71, 45, -61, 57, -65, -35, 102, -96, 18, -1]
3661aqO1j60J89n4j21J59j18R1n1n7J95j87L8P2q3R5j51J12N0j69J46p0K5K2j26
3687a01J95j13n1J39j15Q6p9KJ33j84Q9J5o1P9j20J38j9j29J53p4L2rp6J76j48
3712d2NR8j02Q0r6N9P8j74J35l2m1O2j16J58p6p1J42j06M6j8k7J18j51O3M5p8
3738d1P2r9Q9J4j20J34n0j2L0p8J39j07j4J02r2N2m7K4P5j41R1J1n1N4p8Q2k2
3765A7p9J11q0K3Ql2R1j09J8O4p1O0n0L3L0j00R5k5k7M4n5O8m2l1R7p8M0k7j7
3794b4O7q5M8J2n2O1n2M6Jo3Q3n5jK2k0N0o3OM6p3M8j7oL4p4O6lm3N1l9M3k7k9
3827d2O8m6K0Kk6N3m8J8K9n5M7k9OJ7l8M2j8j8L3l8M1j9j6L9n1K7jj2K6m2L0O
3859El2L3j7NKk7M4k4qJ5j8K8j6mL4l4K1Nj9K5m0L4kl0K4k8K6%k4L1k5J4Ok2J8
$$ y = [-1, -9, 52, -108, 81, 27, -94, 65, -53, 38, -13, -70, 125, -62, -24, 48, -35, 60, -91, 21, 71, -98, 48, -22, 3, 25, -101, 94, -19, -70, 69, -46, 40, -39, -37, 96, -88, 1, 16, -45, 34, -86, 52, 33, -96, 57, -17, 15, 6, -70, 106, -42, -37, 61, -41, 39, -57, 2, 80, -94, 41, 9, -32, 30, -86, 72, -4, -75, 67, -39, 7, -11, -38, 80, -71, -8, 37, -41, 31, -68, 21, 35, -85, 49, -1, -13, 17, -61, 78, -29, -43, 59, -33, 19, -28, -4, 71, -70, 21, 32, -19, 35, -43, 39, 17, -62, 49, -31, -8, 0, -32, 59, -50, -32, 32, -39, 21, -29, 4, 34, -66, 29, 4, -23, 21, -34, 34, -8, -39, 58, -20, 20, -7, -24, 43, -42, 6, 18, -34, 27, -25, 21, 22, -41, 42, -13, -14, 8, -12, 38, -25, -19, 27, -46, 2, -15, -21, 13, -61, 5, 2, -41, 10, -29, 14, -13, -42, 26, -20, 0, 2, -24, 29, -19, -1, 28, -27, 20, -9, -3, 14, -24, 18, 0, -18, 15, -23, 18, -1, -17, 22, -29, -2, -3, -15, 11, -31, -1, 5, -27, 6, -11, -6, -4, -31, 13, -11, -19, -4, -22, 6, -10, -14, 20, -14, 7, 12, -7, 18, -22, 12, 10, -20, 4, -24, 2, 2, -22, 9, -16, -2, 4, -18, 0]
3894@j8KOk1K4j5LJ7k1K5j0j1K5k5RKj8K4k2J7Oj6K2pMJ0l4L5j6lK3k9K5j0j2
3929iJ8k5K0j4JJ9k2K2k1k3L6k5J8nj7K9l0K1Nj4J4k6K1J0j3J9j2oJ2k9L7j7J
3962eJ1k2L2k4OJ3k8J6lj2L1l5K7k0jJ9k8J6mj0K4l6K3J4l7L5j9MJ4l1M0k1OL
3996bj3L3l4%M3m2K6j5OK1m5L6nk0K2k7K7ol8M9k6MKj1L1n0K6K6n4L8k1J7J1n5
4030d6O2k2j4K2k5M8m3mO0o7M6k8J1K8n7M7%l0L7k9K1rl3O8n9RJ2l3N3o8L4L3
4062B4o2M4l9K5K1o9Q1k5l0N2n0O0m1j9P4q3M3Nj5M8q8N0L0o3O4n5L3Qo1R2o2
4093h%K8l9N1n9J7M9q6N7k3LL7q1P7j2n7N6l9N5l9l1R4q9K5K0l3O6q4M9M0q6O2
4125B0l0L2Oq0J12o0k9N5n2O4o4J0P4j03N1joK7r2R4j3n6O6n8N1k1m0J01r3PK9
$$ y = [0, -18, -16, -10, -31, -7, -22, -19, -2, -23, 2, -8, -19, 6, -19, -10, -8, -26, -2, -24, -7, -1, -17, 5, -2, 2, 12, -22, 13, -3, -6, 17, -12, 13, 3, -9, 9, -16, 4, -10, -9, 10, -12, 10, -11, -34, 2, -23, -5, -10, -27, 2, -28, -7, -2, -16, -2, -28, -7, 3, -10, 9, -3, -9, 3, -26, 11, -6, -5, 6, -16, 16, -8, -2, 11, -17, -1, -4, -16, 15, -20, 7, -13, -14, 5, -23, -7, -11, -21, 3, -33, -10, 4, -33, 2, -17, -13, 1, -30, 10, -11, -5, -2, -15, 18, -16, -16, 27, -15, 11, -4, 2, 23, -22, 14, 9, -11, 11, -16, 11, 5, -33, 16, -10, -6, -4, -15, 16, -34, -8, 18, -36, 2, -19, -2, 9, -46, 16, -6, -20, 2, -23, 25, -18, -22, 38, -29, 17, -11, 0, 28, -29, 18, 18, -12, 25, -4, 17, 8, -25, 43, -16, -7, 5, -28, 25, -43, -9, 24, -38, 6, -33, -8, 13, -56, 25, 0, -30, 22, -28, 32, -9, -28, 46, -37, 6, 11, -4, 44, -44, 6, 36, -27, 37, -18, 15, 23, -38, 54, -8, -8, 20, -19, 32, -27, -10, 39, -47, 10, -13, -10, 27, -54, 23, 11, -46, 10, -29, 26, -13, -44, 50, -39, -14, 6, -27, 39, -45, 4, 44, -42, 20, -10, 22, 28, -52, 60, 0, -29, 26, -26, 38, -26, -16, 58, -45, 6, 5, -1, 26, -66, 28, 15, -41, 25, -33, 18, -3, -43, 58, -35, -28, 1]
4156Al6O2p2L7O2j16R1l4OK3q5J12m4l1O4o6O0n0k1R3r2M2J8n1O3j00P8J3q7Q5
4186B5m2J1Kn7J17p7j2N9n9N7o4K1O2r9O4lj1K6o9R8m3n5R1o6L9rl6R0r1K5K8
4217B2l9M1p8O2K0q7Q2l6J0No1R1m9k3O6n7M5m8J4P3r1M4Ok9M4p5P2j4n8Q4m1
4248eJ7nl1P1p7J9M4n0K9l7J1L4p4O3j2j0K5n7O5k2k4N4n1K8k0j0N2o8L1K0l9
4279b9M4n2M3%n6Q5n3LK7m2O5n9J0N7o3M9l3NL1m9L2mk2L2m4M2j6k9M6m0J6Kp
4312iL8n1J5J6k5K6k6JK0l4M0j9nJ6j8M0l5k0N8l2J0jqK4m0L2Ol5L0j8J9j0l2
4345b7M3l2jJ6j9K4j6%K1l6L0j2NQk1L4j8j2K2k3J6%j7K9j8JkkJ9k1J6ok1K9p
4380BlMj5K4j6jJ5k4RMj3J9k4K3j1k%j4OJ2k4L3k6J9ooJ6j2PQj1J5j5jJ8k1NO
$$ y = [1, -35, 27, -45, -8, 54, -62, 29, -5, 1, 24, -61, 51, 7, -24, 40, -26, 34, -16, -37, 56, -36, 6, 24, -27, 36, -64, 14, 27, -60, 25, -17, -6, -4, -61, 56, -21, -33, 26, -33, 24, -40, -19, 43, -56, 8, 5, -6, 20, -49, 49, 6, -49, 42, -24, 15, 6, -30, 60, -31, -6, 22, -17, 24, -54, 8, 28, -59, 23, -13, -3, 2, -59, 32, -17, -40, 26, -31, 14, -34, -20, 53, -38, 6, 12, -17, 27, -48, 24, 10, -48, 36, -5, 12, 7, -24, 47, -30, -11, 33, -17, 12, -25, -14, 20, -54, 9, -3, -13, 12, -45, 20, -2, -26, 28, -23, 5, -15, -25, 27, -41, -10, 10, -29, 15, -37, 6, 6, -50, 35, -18, -15, 12, -30, 35, -24, -14, 43, -20, 29, -4, 1, 32, -17, 15, 11, -11, 21, -23, 19, 3, -26, 20, -20, -4, -2, -9, 29, -22, -7, 9, -16, 10, -16, -15, 5, -29, 11, -8, -13, 3, -15, 25, -10, -30, 28, -4, 6, 5, -3, 21, -19, 13, 19, -16, 14, -4, 15, 5, -27, 16, -16, -17, -1, -20, 4, -12, -12, 9, -27, 3, -9, -4, 4, -17, 17, -1, -13, 9, -14, 2, 2, -15, 14, -4, -3, -5, -7, 12, -9, 7, 1, -20, 9, 2, -1, 3, -12, 12, -4, -5, 10, -14, -5, -1, -14, 5, -19, 4, -7, -9, -9, -23, -17, -5, -29, 4, -22, -3, -9, -15, 1, -11, -4, 4, -7, 8, -7, -8, 10, -11, -6, 0]
4418@rJ0j5K2qoK3j7Kjj3K1j0KOj5J1k2LQj0J2o%J4j7J1j6PNJJ3j1OJ2j6OMmJ3
4458A6k1J6Mj9K1k0KJ8k5K3k2QKj8K3j2j4J2j7K5j1LJ9k5OjjK0l1K1LpRk1J4m
4494dqK9k6RKkJ4j5J5jk1J5j2MRk6J9j6MJ3nJ6l8KL1l2J5LoJ8k3J7J1j3Rk0J2
4531aPk7L3j8LjmK2j7JJ5k9K5j8NJ6l0K9j7j0K0j6K4j5j6L3l4J8mj4L1m4K3J6
4565Fl1J7j5J8Jk3L6j8LJ2k7M5l3PK7m0K6j5J5Mm9N3j0l5M4k6K6j9l3M7l3PK0
4598Gk4L3n2L1J7k9K4k4RJ5m4N3k6rK0j8L5l2rM9l8J3MpK8n7M4J2n0M5l3K3j0
4631@l4O6n1LK0k2L4m5J7K3m6L3j2J1Kl9N5k2k0L4j9K2k4j4N9n3K5joK6m1K9J7
4664B7n6L7j3J7Mm0N1l0j8L2l9L7j7j2N1o1K5j0mK2n0N8j4l7M4k4K0j2k1O2n1
$$ y = [0, -9, 1, -14, 8, 0, -6, 17, 0, 2, 1, -12, 9, -1, 1, 7, -8, 3, -19, -16, -8, -18, -6, -12, -12, 2, -15, -4, -20, -13, -8, -7, 6, -5, 1, 13, -3, 3, 7, 3, 16, -5, 11, 15, -4, 17, -3, -1, 17, -8, 15, -7, 1, 3, -15, 8, -4, -18, -6, -23, 2, -9, -6, 13, -12, -6, -7, -8, 12, -19, 2, 5, -2, 7, -14, 0, -4, -12, 17, -9, 0, 2, 0, 14, -1, 14, 13, -8, 7, -5, -1, 8, -18, 1, -15, -11, 2, -3, 13, -25, -23, 8, -24, -9, -6, -12, 6, -17, 0, 11, -2, 7, -13, -1, 6, -21, 12, -6, -3, -4, -8, 14, -3, -2, 13, -16, 9, -9, -4, 12, -18, 11, -6, -16, 4, -12, 12, -3, -19, 14, -20, -2, -6, -20, 11, -33, -10, 6, -25, -8, -23, -5, -4, -27, 9, -9, -6, 6, -21, 24, -9, -2, 25, -15, 11, -4, 11, 15, -34, 19, 9, -26, 18, -8, 18, -1, -34, 13, -20, -13, 7, -17, 16, -36, -5, 12, -17, 7, -17, -8, 7, -37, 16, -10, -19, 1, -17, 18, -14, -23, 26, -12, 1, 5, -2, 26, -31, 13, 25, -25, 20, -13, 10, 0, -34, 32, -19, -16, 4, -18, 16, -29, -12, 11, -35, -2, -14, -3, -1, -40, 15, -7, -27, 7, -12, 10, -14, -28, 31, -22, 3, 2, -4, 22, -19, 10, 27, -29, 8, -5, 12, 16, -24, 27, -3, -21, 11, -28, 9, -8, -20, 31, -30, -5, -15, -19, 3, -47, 11, -3, -40, 4, -20, 0, -12, -33, 29, -22]
4695b2RK2k8L2l0J7K5n1M3k0JK0m8N7l0mJ3k5K9k0pM4n0K3Qk4K3l4L5Rn0M7k7
4728a3J0qj6M9l8oL6l4L0k2J0J9o1N3rj7L6m5M8j4k3L9l7K0ml1N8m7RK3k5K4l4
4761b0J3J1l2L1j9LRk8N1l0qL0j6RokJ9l9K4Qk0K7m1L1Nl3M7l4K2nqK9l7OK3l0
4797a0K1k3RK0l9L1j9jNj4K3j0k4M7k8%KkK7l6K4kj2K5j8Pol2M2pmJ8k6L4k3n
4833fK2j0J6k2jJ5k4K4j3qJ4j6J7rj1K2l0LJ1j6K6j9JJ6j1NKJ3jj8J3lrJ6j7J9
4869A1k0kK8k1J3pL%k0J0Jj0J9j3OMj4J5j6NJ3j2OqnK4l5K0j2J3Pj1J5j0j2K1
4905Fj0Qmj5K3j8LRrJ3nkRk0K3j6jK0l6J5Lj2J6j1KMkJ9j8J1pj9K2j2LJ3j6Om
4944iOMnMpM%lPOJLk0J1qJ2lnPKqQj8J5pj1K3j7Oj0mK1rnK2j4Mj0pK4j4J5j8L
$$ y = [-22, -13, 9, -19, 13, -17, 0, 25, -26, 17, -3, -2, 18, -30, 27, -3, -7, 6, -19, 10, -10, -17, 27, -23, 0, 8, -16, 7, -27, 8, 17, -33, 14, -13, -3, -11, -27, 22, -16, -22, 14, -20, 10, -12, -2, 17, -44, 9, 0, -17, 19, -26, 22, 8, -15, 24, -13, 7, 3, -28, 30, -17, -8, 15, -10, 14, -20, -7, 4, -28, 3, -16, -13, -4, -32, 19, -11, -19, 11, -5, 4, -2, -4, 15, -24, 0, 8, -12, 15, -26, 5, 10, -23, 24, -10, 12, 7, -1, 28, -9, -3, 20, -10, 11, -12, -3, 17, -22, 9, -10, -11, -6, -20, 3, -7, -31, 16, -12, -12, -10, -12, 15, -21, 3, 1, -11, 14, -4, 3, -3, -35, 7, 0, -4, 14, -12, 22, -1, -6, 16, 6, 22, 0, -1, 14, -10, 14, 1, -7, 7, -9, 8, -1, -12, 10, -20, -17, -6, -22, 4, -15, -14, 2, -9, -4, -2, 11, 10, -8, 5, 2, -7, 9, -8, 11, -9, -11, 17, -4, 9, 2, 5, 5, -15, -5, -4, -14, 5, -8, -2, 2, -12, 3, -13, -8, 5, -7, -1, -9, -14, 10, -25, -5, -17, -4, 3, -8, 7, -3, -15, 6, -4, 4, 0, -15, 8, -10, -7, 2, -7, 6, 1, -1, 8, -12, 11, -5, -6, 14, -22, -7, -4, -16, 0, -11, -9, -5, -7, 12, -6, 5, -2, -21, 1, -11, -8, 5, -11, -5, -9, -3, 1, -4, 0, -7, -3, -3, -6, 1, 7, 8, 11, -9, 2, -6, 6, 3, -2, 5, 7, -1, 7, -11, 4, -3, -14, 9, -8, -2, -12, -16, 5, -4, -9, 13, -1, 3, -7, -14, 10, -4, 11, -7, -4]
4988dJ7j3LLrK2k9J1Pk4K5r%Oj8J5qKQj8J3pMlnJ3j5J3Kj4J6j8J1Oj4QrpK4j6
5028a1J1Lj2J9o%mnK2j2L%j5K3k6J2J0j3Rj0%nj8L4j4j4J7k4K2j0j3L5k2J1j0
5063a3MJ8j6P%qJ3k1J8Rk0J7pKjoJ9k3J1J0j5J4k1J2lk2K4jrJ5k4J7j1k2L4j0
5099iKqLK6k9J3Pl5L1j4J8kj9L2j9lRlJ8l0J0Qj5OPj3K2l9K9Lk0K7l0J6j0qL6
5136A7l4J0opK7l5K2Rk9K8j6QMk1L4j2qJ7k7L3l0KL5l7KK3j1K3k7QPk0J8k1J8
$$ y = [-4, 13, 0, 3, 6, -3, 19, -10, 1, 8, -16, 9, 0, 0, 6, -12, 3, -5, -3, 5, -13, 0, -7, -3, -6, -11, 2, -13, 0, 2, -12, 4, -14, -3, 3, -11, -3, -12, -19, 5, -11, 0, 3, -9, 10, 4, 4, 0, -5, 17, 5, 8, 8, -7, 16, -10, 2, 12, -1, 8, -2, -2, -7, -25, 9, -5, -19, -2, -26, -4, -14, -27, 8, -14, -3, -13, -9, 9, -7, 0, 0, -8, 5, -16, 2, 11, -9, 8, 1, 3, 2, -4, 15, -8, 3, 13, -2, 12, -9, 3, 0, -22, 2, 1, -8, 7, -17, 0, -11, -33, 1, -9, -7, -15, -12, 14, -15, -2, 5, -30, 1, -13, 5, 3, -16, 16, -3, -6, 3, 0, 18, -12, -2, 6, -9, -3, 4, -9, 13, -26, 3, 6, -14, 13, -17, -1, -11, -19, 17, -17, -7, -13, -20, 7, -28, -6, 3, -26, 2, -14, -6, -2, -23, 11, -1, -9, 8, -19, 14, -16, -14, 21, -16, -14, 9, -2, 21, -6, 2, 9, -11, 7, -14, 4]
$$ [...]
8191a2
##END NTUPLES=NMR FID
##END=
