##TITLE=1H_ES-AN-EtCel-C2
 
 8 sc, 
 21.1.2022
##JCAMPDX= 6.0         $$ Bruker NMR JCAMP-DX V2.0
##DATA TYPE= NMR FID
##DATA CLASS= NTUPLES
##ORIGIN= UXNMR, Bruker Analytische Messtechnik GmbH
##OWNER= root
$$ XWIN-NMR		Version 3.5
$$ Fri Jan 21 12:14:36 2022 Russian Standard Time (UT+4h)  she@DPX200
##.OBSERVE FREQUENCY= 200.131346
##.OBSERVE NUCLEUS= ^1H
##.DELAY= (6, 6)
##.ACQUISITION MODE= SIMULTANEOUS
##.ACQUISITION SCHEME= undefined
##.AVERAGES= 8
##.DIGITISER RES= 18
##SPECTROMETER/DATA SYSTEM= spect
##.PULSE SEQUENCE= zg30
##.SOLVENT NAME= DMSO
##.SHIFT REFERENCE= (INTERNAL, DMSO, 0, 15.7039)
##AUDIT TRAIL= $$ (NUMBER, WHEN, WHO, WHERE, WHAT)
$$ ##TITLE= Audit trail, XWIN-NMR		Version 3.5
$$ ##JCAMPDX= 5.01
$$ ##ORIGIN= Bruker BioSpin GmbH
$$ ##OWNER= she
$$ F:/spectra/data/she/nmr/H-F/1/audita.txt
$$ ##AUDIT TRAIL=  $$ (NUMBER, WHEN, WHO, WHERE, WHAT)
(   1,<2022-01-21 12:13:15.45 +0400>,<she>,<DPX200>,
      <created by zg, POWCHK disabled, PULCHK disabled
       configuration hash MD5:
       00 E9 B6 7A A2 85 ED C7 34 08 36 98 17 FE 4E 26
       data hash MD5: 16K
       80 48 08 2E 4A 77 AF 98 1E E4 6A 19 21 80 FF F4>)
$$ ##END=
$$ 
$$ hash MD5
$$ 57 DE DE 18 3B 8E 4B 4C 45 C1 52 87 7E 80 EA 8B
##$RELAX= 
##$RELAX= 
##$RELAX= 
##$RELAX= 
##$RELAX= 
##$RELAX= 
$$ Bruker specific parameters
$$ --------------------------
##$DU= <F:/spectra>
##$EXPNO= 1
##$NAME= <H-F>
##$PROCNO= 1
##$TYPE= <nmr>
##$USER= <she>
##$AMP= (0..31)
100 100 100 100 100 100 100 100 100 100 100 100 100 100 100 100 100 100 
100 100 100 100 100 100 100 100 100 100 100 100 100 100 
##$AQSEQ= 0
##$AQ_mod= 1
##$AUNM= <au_zg>
##$AUTOPOS= <>
##$BF1= 200.13
##$BF2= 200.13
##$BF3= 200.13
##$BF4= 200.13
##$BF5= 200.13
##$BF6= 200.13
##$BF7= 200.13
##$BF8= 200.13
##$BYTORDA= 1
##$CFDGTYP= 0
##$CFRGTYP= 5
##$CHEMSTR= <none>
##$CNST= (0..31)
1 1 145 1 1 1 1 1 1 1 1 1 1 1 1 1 1 1 1 1 1 1 1 1 1 1 1 1 1 1 1 1 
##$CPDPRG= <>
##$CPDPRG1= <>
##$CPDPRG2= <>
##$CPDPRG3= <>
##$CPDPRG4= <mlev>
##$CPDPRG5= <mlev>
##$CPDPRG6= <mlev>
##$CPDPRG7= <mlev>
##$CPDPRG8= <mlev>
##$CPDPRGB= <>
##$CPDPRGT= <>
##$D= (0..31)
0 1.2 0 0 0 0 0 0 0 0.06 0 0.03 0 0 0 0 0.0002 0 0 0 0 0 0 0 0 0 0 0 0 
0 0 0 
##$DATE= 1642752794
##$DBL= (0..7)
120 120 120 120 120 120 120 120 
##$DBP= (0..7)
150 150 150 150 150 150 150 150 
##$DBP07= 0
##$DBPNAM0= <>
##$DBPNAM1= <>
##$DBPNAM2= <>
##$DBPNAM3= <>
##$DBPNAM4= <>
##$DBPNAM5= <>
##$DBPNAM6= <>
##$DBPNAM7= <>
##$DBPOAL= (0..7)
0.5 0.5 0.5 0.5 0.5 0.5 0.5 0.5 
##$DBPOFFS= (0..7)
0 0 0 0 0 0 0 0 
##$DE= 6
##$DECBNUC= <off>
##$DECIM= 32
##$DECNUC= <off>
##$DECSTAT= 4
##$DIGMOD= 1
##$DIGTYP= 9
##$DL= (0..7)
0 120 120 120 120 120 120 120 
##$DP= (0..7)
150 150 150 150 150 150 150 150 
##$DP07= 0
##$DPNAME0= <>
##$DPNAME1= <>
##$DPNAME2= <>
##$DPNAME3= <>
##$DPNAME4= <>
##$DPNAME5= <>
##$DPNAME6= <>
##$DPNAME7= <>
##$DPOAL= (0..7)
0.5 0.5 0.5 0.5 0.5 0.5 0.5 0.5 
##$DPOFFS= (0..7)
0 0 0 0 0 0 0 0 
##$DQDMODE= 0
##$DR= 18
##$DS= 0
##$DSLIST= <SSSSSSSSSSSSSSS>
$$ [...]
##$SUBNAM2= <"">
##$SUBNAM3= <"">
##$SUBNAM4= <"">
##$SUBNAM5= <"">
##$SUBNAM6= <"">
##$SUBNAM7= <"">
##$SUBNAM8= <"">
##$SUBNAM9= <"">
##$SW= 18.0517287032376
##$SWIBOX= (0..15)
0 0 2 0 0 0 0 0 0 0 0 0 0 0 0 0 
##$SW_h= 3612.71676300578
##$TD= 16384
##$TD0= 1
##$TE= 0
##$TE2= 300
##$TE3= 300
##$TEG= 300
##$TL= (0..7)
0 120 120 120 120 120 120 120 
##$TP= (0..7)
150 150 150 150 150 150 150 150 
##$TP07= 0
##$TPNAME0= <>
##$TPNAME1= <>
##$TPNAME2= <>
##$TPNAME3= <>
##$TPNAME4= <>
##$TPNAME5= <>
##$TPNAME6= <>
##$TPNAME7= <>
##$TPOAL= (0..7)
0.5 0.5 0.5 0.5 0.5 0.5 0.5 0.5 
##$TPOFFS= (0..7)
0 0 0 0 0 0 0 0 
##$TUNHIN= 0
##$TUNHOUT= 0
##$TUNXOUT= 0
##$USERA1= <user>
##$USERA2= <user>
##$USERA3= <user>
##$USERA4= <user>
##$USERA5= <user>
##$V9= 5
##$VALIST= <valist>
##$VCLIST= <CCCCCCCCCCCCCCC>
##$VD= 0
##$VDLIST= <DDDDDDDDDDDDDDD>
##$VPLIST= <PPPPPPPPPPPPPPP>
##$VTLIST= <TTTTTTTTTTTTTTT>
##$WBST= 1024
##$WBSW= 4
##$XGAIN= (0..3)
0 0 0 0 
##$XL= 0
##$YL= 0
##$YMAX_a= 187744
##$YMIN_a= -237392
##$ZGOPTNS= <>
##$ZL1= 120
##$ZL2= 120
##$ZL3= 120
##$ZL4= 120
##$ABSF1= 10
##$ABSF2= 0
##$ABSG= 5
##$ABSL= 3
##$ALPHA= 0
##$AQORDER= 0
##$ASSFAC= 0
##$ASSFACI= 0
##$ASSFACX= 0
##$ASSWID= 0
##$AUNMP= <proc_1d>
##$AZFE= 0.1
##$AZFW= 0.1
##$BCFW= 1
##$BC_mod= 2
##$BYTORDP= 1
##$COROFFS= 0
##$CY= 11.3945322036743
##$DATMOD= 1
##$DC= 2
##$DFILT= <>
##$DTYPP= 0
##$F1P= 2.36226072786647
##$F2P= -0.459571619588291
##$FCOR= 0.5
##$FTSIZE= 0
##$FT_mod= 4
##$GAMMA= 1
##$GB= 0.15
##$INTBC= 1
##$INTSCL= 1
##$ISEN= 128
##$LB= 0.24
##$LEV0= 0
##$LPBIN= 0
##$MAXI= 10000
##$MC2= 0
##$MEAN= 0
##$ME_mod= 0
##$MI= 1.114404
##$NCOEF= 0
##$NC_proc= 0
##$NLEV= 6
##$NOISF1= 3.799351
##$NOISF2= 2.8
##$NSP= 1
##$NTH_PI= 0
##$NZP= 0
##$OFFSET= 15.70392
##$PC= 1
##$PHC0= -15937.84
##$PHC1= -2.599223
##$PH_mod= 1
##$PKNL= yes
##$PPARMOD= 0
##$PSCAL= 0
##$PSIGN= 0
##$REVERSE= no
##$SF= 200.130013532006
##$SI= 16384
##$SIGF1= 3
##$SIGF2= 2
##$SINO= 400
##$SIOLD= 16384
##$SREGLST= <1H.CDCl3>
##$SSB= 0
##$STSI= 0
##$STSR= 0
##$SW_p= 3612.71676300578
##$SYMM= 0
##$S_DEV= 0
##$TDeff= 0
##$TDoff= 0
##$TI= <>
##$TILT= no
##$TM1= 0
##$TM2= 0
##$TOPLEV= 0
##$USERP1= <user>
##$USERP2= <user>
##$USERP3= <user>
##$USERP4= <user>
##$USERP5= <user>
##$WDW= 1
##$XDIM= 8192
##$YMAX_p= 0
##$YMIN_p= 0
$$ End of Bruker specific parameters
$$ ---------------------------------
##NTUPLES= NMR FID
##VAR_NAME=  TIME,          FID/REAL,        FID/IMAG
##SYMBOL=    X,             R,               I
##VAR_TYPE=  INDEPENDENT,   DEPENDENT,       DEPENDENT
##VAR_FORM=  AFFN,          ASDF,            ASDF
##VAR_DIM=   8192,          8192,            8192
##UNITS=     SECONDS,       ARBITRARY UNITS, ARBITRARY UNITS
##FACTOR=    0.0002768,     1,               1
##FIRST=     0,             0,               0
##LAST=      2.2672688,     0,               0
##MIN=       0,             -237392,         0
##MAX=       2.2672688,     187744,          0
$$ Real data points
##PAGE= N=1
##DATA TABLE= (X++(R..R)), XYDATA
0@%%%%%%%%%%%%%%Qj6J6j6J6j6J8k6L2l2M0m8N2o0P0p8Q8j02J14j28J44j60J76
37I2j97K21k44K70k99L30l64L99m37M80n28N82o41P05p76Q56r47J052j170J305
57F89j467J659j892K182k548L030l687M624o052Q433j3019K4517r7323j56538
71b37392L25293q70n9226j25440J39203J46176l69360J12578J94748q7240q1815
82d3345r9205K84909q1269k36402K28531Q339l5987j17421M2267K28640k55635
93g6578o892J53102m8673o151j28900J77654K9281k17564J43121R332j528m9493
105b3289n1951J91988j44894l5643J16918o5606M5304r3447P0721O4380j62150
116h7669J15108r999l0658K7528o5598J21351r1885k9271J19777r8918L5724k2494
$$ y = [0, 0, 0, 0, 0, 0, 0, 0, 0, 0, 0, 0, 0, 0, 0, 8, -8, 8, -8, 8, -8, 10, -16, 16, -16, 24, -24, 28, -32, 38, -40, 48, -54, 60, -68, 76, -84, 92, -105, 116, -128, 142, -157, 173, -191, 208, -229, 251, -277, 305, -336, 369, -407, 449, -498, 554, -616, 689, -778, 881, -1011, 1171, -1377, 1653, -2034, 2590, -3462, 4971, -8048, 16469, -80854, -237392, 87901, 87031, 27805, -97635, 41568, 187744, -181616, -69038, 125710, 38470, -43345, -142550, 142359, 61090, -175312, 53219, 61558, 25571, -91850, -49583, 179057, -76578, -83470, 69632, 20959, 14808, -114092, 63562, 92843, -124721, 18400, 27732, 26204, -23289, -75240, 116748, -28146, -63789, 53129, -12477, 32827, -60620, 10101, 74481, -87669, 27439, 17440, -13218, 14310, -51288, 70063, -21822, -51093, 68684, -30234, 5490, -17004]
128a7004K2352M7694j37084J14442J0513q3709N0698k9508P8804p8748m2995J44766
140H0221r0520j6853J7998K4354L8979j38785R0641O2902j05916K0493Q90P6134
152F0538o3749q2016J49678l9211n9731J0912L4101N8959j36452L4743J05832
163G3604q1772j8277l442Q2010k3029j16055J13837J7604o0722j4036J7316Q5146
175G2184j01563k6010J05630l6712k6100k5832O1347K7559j11551N4952M2542
186C6446l3684j9370j5117Q2162m5199n5219P1311o981r342l2745K1635N3154
198D7051p4890J0683L5568j2362l521l3060N1135j623m8872L6384k645N338j6881
211g695r470M5073l6266k487J9453j1836J3836k5692J7336J1646k9316K2605r297
$$ y = [-17004, 5348, 53042, -84042, 30400, 40913, -42796, 7902, -21606, 57198, -21550, -64545, 80221, -10299, -27152, -9154, 15200, 54179, -84606, 6035, 68937, -36979, -16486, -15596, 60538, -3211, -85227, 64451, 25240, -34491, -23579, 10522, 69481, -66971, -32228, 73604, -8168, -26445, -29887, 52123, 29094, -86961, 26876, 44480, -16242, -30278, -12962, 72184, -29379, -55389, 50241, 13529, -12571, -38403, 22944, 50503, -61048, -6096, 36446, 2762, -16608, -31725, 50437, 5238, -49981, 21330, 14349, 5007, -27738, -6103, 47051, -27839, -17156, 18412, 6050, 2529, -30531, 20604, 18981, -29891, 6493, 3848, 9186, -7695, -17165, 27908, -8358, -10845, 8608, -3228, 10608, -15084, 2252, 13898, -15418, 7187, -2110]
224b110K105N130j6265K2795j7076J500J4436k0735J5086o138J240N247j7995
237a2780K3392q319j2003J4105n275Q127j5349K516K0975k1500O94O737M156j582
251C894j9051K1641M191j9847N444N837Q283j6409n692K5055r593j2567M843J1227
265G256Q59k1599J0889J5821j4400p485O592J3858j1157j4647J8803M994j3714
278c930m664J1149Q549j7333k841J6879j890j1991o24J3883r34j5422N791J1341
292G963n358r950M413J1460p489r325Q870O279p591n982P938N448r051l554Q855
307B926K199q353j288P998L60p523M79P058j482o171K007N449k255n279L207M285
323C617l707k828K901K766k862k808L748J393l341m42K362O77k502k67K507m36
$$ y = [-2110, -5, 5125, -11140, 11655, -5421, -3921, 10515, -10220, 4866, -1272, -32, 5215, -12780, 10612, 2293, -9710, 4395, -880, 7247, -8102, -5586, 15389, -6111, -5417, 1320, 5476, 3894, -15157, 6484, 10675, -9172, -3728, 2109, 10392, -6017, -11709, 13346, 3753, -8814, -3971, 7256, 8115, -13484, -2595, 13226, -1174, -8659, -2067, 11791, 634, -14013, 4790, 9784, -3930, -8594, 2555, 11104, -6229, -9070, 7809, 5919, -6072, -6696, 7187, 6253, -9169, -3378, 7963, 2605, -7345, -2932, 8528, 1039, -8286, 584, 6863, -728, -6710, 1228, 6676, -2375, -5929, 2926, 5125, -3228, -4516, 3482, 3842, -3681, -3202, 3856, 2374, -3797, -1790, 3659, 1404, -3875, -668, 3617, -90, -2918, -17, 2749, -113, -2921, 827, 2220, -1121, -1563, 799, 1476, -1026, -1293, 1214, 778]
339G78j851M07J655m73j565Q25J054q08o63P47L37m63l57L95O84j167J92R44r97
358c26N23l32J16O63j451J359l45p37J193j198J227r09m40K047k351J312k15p27
376e91K103l163K252L23k393K792k454J932k23k714M397l180P34Q38k171M143
392B625m712J818K455m527M123l325K028J508n909O866l278r25K904m363O267
407C555n369j43N958p093M712k769P78M054r194Q486j796m048N448o051P573n047
423i46l493J0526r204L539n86j334P013j2215Q441K101q303P163o333P774l394
438G49q204J4931r315M52K156l548J0331j4586O032Q073j2406P585n826P062K02
453C688j4131J7833o698l798M659n964J3745j5122R73J4613j5061O887m869M878
$$ y = [778, -1073, -666, 989, 516, -1049, -224, 830, 22, -641, 106, 443, -20, -377, 18, 702, -465, -273, 671, -326, 197, -135, -19, 644, -807, 552, 207, -530, 663, -535, 692, -217, -657, 1390, -961, 351, 136, -591, 1512, -1651, 601, 924, -1469, 1323, -1131, 801, 578, -2136, 2261, -919, -185, 653, -1518, 2625, -2087, -269, 2186, -2341, 1782, -1543, 485, 1993, -3916, 2950, -328, -1253, 1651, -2712, 3555, -1814, -1957, 4001, -3092, 1620, -1149, -371, 3683, -5511, 2975, 1179, -2869, 2579, -3472, 4101, -946, -4439, 6087, -3117, 422, -164, -1498, 5515, -6700, 1741, 3842, -4461, 2702, -3631, 4143, 749, -7455, 7476, -1839, -1387, 769, -2779, 7552, -7034, -1002, 7071, -5335, 2250, -3576, 3486, 3688, -10443, 7390, 692, -3106, 1553, -4411, 9334, -5788, -4815, 9798, -5263, 1624, -3245, 1633]
467A633N760j9799J8028j798q549P265q490J5545j2394n936J9922j5485M917k674
481b055Q49J1577k2750J4973M138j2945R847j0162J4256o602j2772K2808j3925
494b763J678J323m276J5612k2160R866R964j6806J1735r805J0373o5j8170K4066
508A0572j1341k938O662q872J7191j9389M096J5804k0372J2004o785N041N641
521G314k1839K3941p365q964J2063j1576J6324j5117k218K1412k2360R503j437
534c19p84J0123k3320K1159j170j5299J5491j1370J3130r552q563K5259k1267
547f482M458M575n710J2914k2469J5905O129k0387J6255q798Q545l610j3908K6731
561A4148j7621j764R947q977J3884k0029R745J3054k3837J5027m873L552J882
$$ y = [1633, 7393, -12406, 5622, 3824, -4725, 2540, -5950, 9595, -2799, -8735, 11187, -4298, 619, -2055, -1206, 10371, -12379, 2594, 6732, -6213, 3634, -6528, 7728, 1126, -11646, 11162, -2763, -1085, 238, -4038, 11574, -10586, -720, 9244, -7562, 4173, -5632, 4741, 4676, -13494, 10572, -769, -3707, 2955, -5917, 11274, -8115, -4019, 11785, -8587, 3417, -3368, 1673, 7314, -14525, 9416, 2051, -6913, 5150, -6426, 9898, -5219, -7437, 13975, -8385, 1118, -319, -1103, 9020, -14300, 6859, 5689, -9610, 5881, -5489, 7641, -1911, -10474, 14785, -6482, -2024, 2551, -3159, 9755, -12714, 3191, 9320, -11067, 5188, -3610, 4935, 1325, -12583, 14148, -3473, -5237, 4710, -4267, 9617, -10412, -667, 12387, -11450, 3577, -1296, 2256, 4138]
574D138j7875K6072j2166q307J4159j0547J3144j6029K962J8685k4638J1676k59
587A015j269O583j9853K2636n136j4042J6306j0189J0576j0325l908K1837k2021
600g790O356M411n218R612j9068J6692K110j7709J6025q156O809m209r392K2176
614A2649j7202P07Q313q012J0772j6038R899P847j8969J4244n487K683J340j2673
628i927K0060j1830l763J1058r993J0452j1370L283J1365j8103J1730k531j763
641a332N851j3191J5728o590o823J2664j0640Q086n617j874J2318j5824Q701J119
655B576o040Q025j0825J0596k344q965J3255r103L828o73m288J1443j3213N254
669d74N041q666P394p398O640O95j0622J2673n856m95K205m843J0262j0505J437
$$ y = [4138, -13737, 12335, 169, -8138, 6021, -4526, 8618, -7411, -4449, 14236, -10402, 1274, 1015, -254, 6329, -13524, 9112, 3976, -10066, 6240, -3949, 6627, -3698, -7606, 14231, -7790, -1434, 2977, -2241, 7371, -11697, 4995, 7105, -10604, 5421, -2735, 4074, -135, -9527, 12649, -4553, -3846, 4467, -3545, 7227, -8811, 1088, 8935, -10034, 4210, -1277, 1406, 2746, -9927, 10133, -1697, -5460, 5598, -4395, 6057, -5313, -2030, 9335, -8768, 2962, 431, -1332, 4519, -8672, 7056, 466, -6357, 6307, -4333, 3753, -1864, -3738, 8580, -7244, 1457, 2576, -3464, 4561, -6264, 4332, 1988, -6977, 6278, -2825, 1003, 330, -3958, 7485, -5728, -474, 4567, -4099, 3295, -4103, 2537, 3232, -7390, 5283, -573, -1068, 1137, -3706, 6556, -3949, -2512]
684b512Q020q902N327m735L918L251j1405J0455k143l130L253n063R029p018k323
699c978R009p161L218k867J364N290j0327O750P91l918L476n070O894l001m648
714d178P884m919J801j089j201N893p439L153K116l811L659m299L800J00m724
729c254N808l505R27Q89k978M749m196J213K105l932L909k557O42J333l230M264
745B187l035j93K811l097K379k101R82K090m505L241o4j157Q07j976L731k161
761f1j975L533j492L09j501R87K615m329J304J865j068l19j634L434o06l319K657
778D00M96m09j682L93L160k961q77K205J38p31j899K455J004l121Q50J309J27
795H57j494o39K810j053j804J288Q38k59j740R47J670j783m25R65N88p56j085
$$ y = [-2512, 5508, -3394, 1933, -2802, 1116, 4367, -7038, 3417, 1274, -1856, 1397, -3666, 5363, -1655, -3978, 5031, -2130, 1088, -1779, -415, 4875, -5452, 1298, 2089, -1829, 1647, -3423, 3471, 470, -4178, 3706, -1213, 588, -501, -1702, 4191, -3248, -95, 2021, -1790, 1869, -2430, 1370, 1470, -3254, 2554, -951, -24, 865, -2113, 2636, -1560, -347, 1758, -2174, 1735, -822, -180, 1153, -2077, 2187, -848, -1041, 1770, -1327, 1052, -1049, -67, 2023, -2482, 759, 695, -462, 345, -1631, 2100, -61, -2036, 1497, 5, 314, -1187, -200, 2415, -1914, -610, 1255, 187, -132, -1766, 1668, 1062, -2257, 400, 896, 487, -1195, -802, 2358, -603, -1480, 725, 863, 132, -1767, 688, 1692, -1429, -579, 730, 857, -637, -1276, 1534, 481, -1323, -35, 803, 544, -1196, -249, 1421, -362, -787, 178, 766, 10, -1075]
812a075J605K19j373L13N95K39q87j51J147n04n53M10K63p8n28L82L16n39J56
831d3R9j4l1j07K59k54j2L90l93r9L09J24l02l03O35P1o93J17N87k5q26K40R32
854F61n97o53M96P10n06r38R81N74j015l35Q29N81j247k77J393k16r26j19J207
873F03P2j668P82J017o89p10J72J445r61j110J406J70n30p53Q11J039j821K50
891d75R68k15l01q82J619j52j548J218n8J64o62k79J737j517m4P46m16O77j422
910h42J011N74j580J313p43M16K33j330J890j247nR60j447J593j176J27J050j810
928a013J884j108k56J410j840J712j138j42J773k558J819l72o74J434k299K368
944A000p12j538K378j848J384q96p68K867l125J255N94j277J876k804K321L19
$$ y = [-1075, 530, 749, -624, -311, 284, 523, -364, -515, 632, 128, -425, -15, 248, 170, -358, 24, 340, -199, -43, 56, 42, 11, -96, 163, -91, -103, 287, -106, -205, 104, 228, -74, -377, 258, 329, -364, -247, 340, 315, -511, -271, 661, 64, -589, -93, 617, 111, -827, 154, 728, -287, -622, 207, 788, -459, -736, 657, 441, -485, -604, 603, 675, -993, -211, 806, 117, -593, -421, 1024, 63, -1047, 359, 529, -1, -754, 57, 1096, -725, -475, 493, 278, -23, -905, 714, 562, -986, 232, 174, 338, -324, -603, 1134, -383, -427, 319, -97, 580, -842, 169, 743, -837, 476, -267, 149, 382, -948, 942, -305, -310, 650, -797, 796, -380, -253, 797, -1013, 871, -237, -493, 917, -923, 789, -349, -491, 1282, -1276, 543, 171, -503, 931, -1368, 1000, 288, -1250, 1128, -720, 664, -232, -1000, 1867, -1258, -3, 591, -686, 1190, -1614, 707, 1026]
960A026k815K938j693R97k41j844L781l075L19J608j955K344k924J684J547l814
976b117L205j381L39P27k873M263k623p62K713k683K533k429N99K749m545L141
992H56o21p61J754l473M177j812k001L800l103K148j476o07L809m936K546O73
1008I73k014K446l525L580n93l377M552k855J234l90j654M587m908J464K181l070
1024a369K775l290K759Q14m717M909k106O5O78k561N051m393P4L560l737K750
1040A262k745J638K280n680M693j001j206J752l246M922l221j571M695l919K192
1055H45j706K74L464n966L854M17k481K541l379M199j718l126N421l556J128l99
1071a88r68M166n632K573J961l511K761k937L187l02m341N708k786j46P97j849
$$ y = [1026, -1789, 1149, -544, 453, 212, -1632, 2149, -926, -607, 1001, -954, 1390, -1534, 150, 1697, -2117, 1088, -293, 46, 773, -2100, 2163, -460, -1222, 1491, -1192, 1341, -1088, -489, 2260, -2285, 856, 235, -526, 1228, -2245, 1932, 120, -1881, 1919, -1184, 964, -512, -1119, 2690, -2246, 300, 973, -1041, 1405, -2120, 1460, 867, -2510, 2042, -813, 421, 31, -1623, 2964, -1944, -480, 1701, -1369, 1406, -1884, 875, 1689, -3028, 1881, -225, -160, 518, -2043, 3008, -1385, -1311, 2249, -1488, 1262, -1483, 155, 2435, -3245, 1448, 447, -759, 993, -2253, 2669, -552, -2123, 2572, -1347, 845, -861, -587, 2877, -3089, 765, 1182, -1299, 1242, -2137, 2062, 344, -2782, 2639, -917, 211, -188, -1156, 3010, -2622, -49, 1912, -1599, 1162, -1775, 1412, 1110, -3231, 2477, -309, -455, 342, -1507]
1087a507M505n010J058L451m142K556k235K053J075n210N370j556j362J650k411
1102a715M457l929o05M554m163J941j362Q16K346n501M291Mk405K129k544L857
1118B171k390k135M959l532J053m02l86L194n086K819J363l060K349k326K797
1133A388p99l157M781k663J52N41j314L408m169J430K273l352K348j865J614N23
1149A139l633M258j785o91J391j888L111l009K34K855l379K003j078M89J358l601
1165b226L496q27j532J971j940K427j856p49L192l058J234r4l76J681l185K556
1181G14J66k161K083j554J627q84j456L243k442L39O93q60J737k654J574J021
1197A186k404J778j012R48j33j873K935j638l49J037j058J695k034N87J624k270
$$ y = [-1507, 2998, -2012, -954, 2497, -1645, 911, -1324, 729, 1804, -3406, 1964, 408, -954, 696, -1715, 2742, -1187, -1792, 2762, -1401, 540, -822, -6, 2340, -3161, 1130, 1134, -1271, 858, -1686, 2171, -219, -2354, 2605, -927, 126, -276, -662, 2532, -2554, 265, 1628, -1432, 917, -1409, 1388, 589, -2568, 2213, -450, -298, 243, -1071, 2337, -1832, -402, 1871, -1481, 867, -998, 616, 1139, -2494, 1764, -21, -712, 679, -1209, 1902, -1107, -873, 1982, -1397, 606, -472, 17, 1375, -2226, 1270, 443, -1089, 882, -1058, 1369, -487, -1236, 1956, -1102, 132, 38, -338, 1343, -1842, 714, 880, -1281, 802, -752, 875, -9, -1465, 1778, -664, -325, 368, -492, 1245, -1409, 165, 1186, -1218, 560, -452, 496, 363, -1510, 1425, -213, -562, 475, -583, 1112, -922, -335, 1289, -981]
1213i81J301n52L86M94k002K270p49q05J128j075J441j277j99J783j863Q46j65
1230a9j42R20j793J473m4j026J094r34R63n09o66J548j285M19J55m98J018j312
1248f38P67L35j060J024p16M43O4q06J208q55J03M35o73Q25q16L24M83r68Q54
1267C33m35N3L26p54R05n07j81O05o25N25m00K0N41q09N57j08j60L42n87O39k30
1288E0l70O04m27K56j50j66N53n81K18J42k42K88m16L62K9m17M18k16J26l2k54
1309b25N02l63j7K21k19K60l08J23K13l49K18q3N2P0k82L29j27r8J67j93K56k00
1331e3n0K85k64Q9j9k6J90k87J57N6j13R5j62K08o2j79K36j28N0k1q2K46k35J6
1355e3J54j34J05j55J08Q0k16J60m7K4nj28K47j74m1J54j32J50j86O0J86k79J50
$$ y = [-981, 320, -232, 154, 648, -1354, 916, 167, -638, 490, -585, 856, -421, -620, 1163, -700, 146, -19, -161, 759, -1034, 439, 395, -631, 463, -471, 492, -17, -683, 865, -420, -1, 154, -344, 674, -638, 129, 464, -596, 428, -288, 155, 219, -587, 621, -234, -131, 304, -369, 456, -360, -36, 447, -521, 333, -102, -49, 277, -477, 428, -79, -260, 345, -280, 245, -155, -135, 406, -403, 154, 46, -114, 228, -359, 280, 50, -320, 284, -143, 113, -37, -203, 350, -231, -13, 129, -113, 175, -241, 121, 150, -267, 151, -65, 61, 29, -225, 277, -86, -103, 118, -101, 159, -149, -26, 187, -162, 56, -27, 25, 95, -187, 142, 15, -83, 84, -109, 147, -53, -103, 182, -82, 7, -12, -38, 152, -135, 22, 78, -35, 60, -102, 106, 44, -135, 101, -27, 23, 2, -80, 166, -69, -53, 101, -33, 72, -83, 25, 105, -111, 49, 2, 26, 21, -107, 140, -34, -75, 79, -53, 97, -89, -29, 157, -122, 28]
1378B8k9MP0k16K61j08r7J61j45J87j89kK52l04J62m2k3J67l25K97m6j87K12j73
1402h5K06j42r2L23l42J55kr2K52m01L15J0k89L36k63K06o4k33M57l82J04J09
1424H6k03L39m55K91J32m48M40l01J89M1m25O40m38kK88l52M40m78J80L56o45
1445c25M84k22O8J82o04P76l76k25M99m84N07m66KO56q35M54n3j12L59p81P94
1466B98j40n20O53n16N02l57k96R69r27L04J65l04N81r38O80K04q44P64m74M26
1486B30j52o20J187q54M2L92m83P60r99M71N86j112Q13m01K47J49r47J304o61
1505d8k80O38o25Q32q75J22R43j253P27k09k5M91j189J243l12o69Q71p20P63o04
1525a79k61J232j276N19Q6l13P20j244J032P2j008J045p24N81k45o55J457j207
$$ y = [28, -1, 3, 73, -143, 118, 10, -87, 74, -71, 116, -73, -75, 177, -127, 35, -7, -30, 137, -188, 109, 63, -124, 88, -85, 121, -21, -113, 210, -132, 23, 21, -71, 181, -220, 95, 105, -184, 152, -111, 95, 31, -202, 255, -127, -23, 86, -117, 222, -233, 58, 190, -258, 182, -119, 70, 111, -314, 326, -112, -114, 174, -178, 262, -216, -36, 320, -325, 159, -63, 5, 187, -417, 359, -17, -242, 257, -227, 280, -186, -184, 472, -363, 91, 38, -74, 285, -496, 298, 158, -362, 291, -225, 277, -80, -376, 593, -334, -30, 135, -169, 412, -526, 154, 358, -486, 278, -196, 230, 78, -542, 645, -209, -167, 225, -258, 502, -497, -26, 560, -552, 261, -140, 107, 256, -691, 613, -48, -328, 310, -315, 517, -358, -236, 707, -546, 181, -28, -53, 438, -751, 492, 180, -489, 382, -338, 425, -179, -440, 792, -484, 35, 121, -192, 528, -716, 316, 388, -620, 425, -299, 282, 37, -618, 839, -368]
1543c68K09M58o02Q56j172P57M35j297J119n71L24N5r34J538j022j45P85p87Q94
1562E32j022L86Q49j483J005k79nL57j135J498o87n59J040q41P81p45k9J228j557
1581f66P56Q3l34N91j214J288k33r59J174p50N90m46m00J434j446M21M20n70P55
1600D94j197R81K27j275J201o02L46r8p32J518j187M6O93p30Q14j048N91O13j420
1619g65J092l72M5K58r73J438q15l62R38q15P36p47J58R15j413Q77q5k67N27j030
1639f60J169l79p17J079p61N11l65k19J081j276N45K61n28O40r32Q73l9r25J108
1658D66o35K81n7n05J138j072K34N27o76O52p68N43K97j049R85m16L0J88o36J049
1678E76p68r8P19p21N64n29J98N68j063P75j27k29L57o43Q44m32l68P90o40L94
$$ y = [-368, -159, 299, -303, 553, -619, 138, 573, -724, 395, -176, 148, 203, -731, 807, -215, -360, 425, -362, 532, -490, -104, 745, -738, 267, -12, -17, 340, -795, 703, 16, -543, 497, -344, 437, -308, -337, 891, -666, 90, 173, -161, 430, -784, 504, 271, -688, 486, -264, 326, -120, -520, 914, -532, -111, 309, -261, 494, -703, 278, 505, -770, 431, -171, 175, 77, -655, 863, -324, -278, 415, -315, 499, -549, 42, 655, -765, 327, -45, 0, 258, -715, 723, -92, -454, 484, -331, 405, -342, -184, 731, -682, 195, 110, -157, 370, -660, 509, 130, -587, 492, -269, 242, -123, -342, 739, -537, 8, 269, -259, 381, -551, 322, 283, -642, 466, -169, 112, 55, -450, 688, -384, -150, 377, -299, 353, -415, 128, 425, -624, 361, -55, -25, 163, -473, 576, -192, -290, 429, -292, 272, -257, -59, 509, -554, 221, 94, -135, 222, -421, 423, -9, -377, 413, -227, 167]
1698A67k59q9O76r29N20J04l98M76o21N99j05n41P48m92K09m1k63O62p27K74K63
1719B33m65M71m91L57J04o03O88l72N0J40l79O03n05N6L82m92L94l03J31K49n90
1740c42N44j94j03K63l96M52k74j22M32m34K67j27m8L14m84L53k9k13K93l34L21
1761A39j12k26M31l62J61Nj55L21l78K06R0k60K70k46J71K5k66L61k44N1J04k18
1783a32L00k70P4J58k64K36j52L0J24k51K71j45l3J56k14K10j37k2J79k28J77
1804F7o3n8J61k28J84l6j17J76j65J22l8q0J85j94R8K2q7J29j49J07Qj42J74j27
1828e1N1L2r8J56j40M0P2j29J16q8L9M7j25J47q7PO1j12J15q0j3J12j24Q9m2k2
1854b7Q4j28J10l1l8Q1r4R2m3n2J10j10O5nn1R0j05P3Rq8J06p5M6rn1J01j04M4
$$ y = [167, -92, -181, 495, -434, 86, 190, -208, 268, -353, 246, 141, -400, 348, -144, 65, 24, -239, 423, -304, -30, 233, -232, 239, -252, 105, 209, -394, 294, -78, -28, 112, -267, 336, -169, -113, 269, -223, 171, -132, -1, 248, -342, 202, 8, -95, 168, -228, 224, -50, -172, 260, -174, 93, -34, -82, 232, -252, 101, 72, -141, 152, -182, 139, 27, -199, 232, -130, 31, 36, -119, 202, -176, 30, 120, -140, 130, -116, 55, 80, -186, 175, -69, -18, 86, -132, 168, -102, -28, 130, -134, 102, -50, -20, 104, -147, 124, -21, -54, 102, -112, 98, -39, -61, 118, -110, 67, 4, -54, 107, -121, 63, 27, -90, 86, -79, 43, 5, -75, 110, -84, 14, 36, -51, 78, -71, 36, 44, -98, 76, -51, 0, 32, -66, 90, -50, -10, 62, -67, 49, -39, 0, 47, -78, 69, -18, -11, 50, -62, 53, -27, -40, 72, -52, 37, -5, -27, 57, -71, 39, 8, -30, 51, -43, 49, 6, -46, 64, -46, 19, 14, -37, 53, -52, 21, 30, -58, 48, -27, 19, 10, -41, 60, -44, 0]
1882@L4q2R9j02O1L2j13J31q7K0L6r1J37j07LQ3r4R5r9M1P9j38J04m5%M4j17J50
1910G4q8m3J18j07Q6o2j5J23j66J18l1l2R5j58J54m6q3J38j34J00m0o3J72j85
1934g5Q6K7r5J33j61J21kj31J85j32O5mr4J95j94N8Q3j43J60j58R2N8j99K08j07
1959b4J9M6j36K19j97K6J41j83J61j36M2J34k57K35r2n2J24j89K42j56n5K15k18
1982i1J55q8j4J97l08K08mj20J57k16K26p9j66K94k28J09k8r4K65l18J56P9j89
2005i7K00k25K01Pk77L42k02N7L2j65L17l06P5J79k43K07j93J17J06l38L35j44
2027a5k4J07k19L31k48k7K65k98K14j47K1K13l77K92m6j30J81k57L16j69j41L54
2049A96l16J63n2p1K72l90K39P1k39K44k46K40p2k25L80k76P8M2j46L20l85J66
$$ y = [0, 34, -48, 51, -51, 10, 42, -71, 60, -27, -7, 29, -62, 75, -32, -29, 54, -40, 55, -44, -3, 76, -62, 42, -3, -3, 41, -76, 74, -14, -57, 61, -46, 40, -22, -37, 86, -80, 38, 7, -25, 70, -88, 66, 20, -63, 75, -59, 41, 1, -62, 110, -75, 11, 38, -57, 76, -85, 36, 34, -97, 88, -44, 21, 17, -77, 118, -76, -18, 65, -78, 82, -76, 16, 74, -125, 83, -24, -5, 41, -95, 124, -73, -47, 94, -89, 72, -64, -22, 112, -145, 90, -2, -54, 70, -119, 123, -33, -88, 127, -91, 64, -24, -38, 159, -149, 59, 55, -65, 92, -124, 102, 23, -143, 151, -77, 32, 4, -90, 175, -143, 13, 92, -97, 103, -122, 79, 86, -191, 151, -51, 6, 38, -127, 190, -116, -41, 138, -105, 102, -91, 26, 132, -206, 129, -15, -39, 68, -151, 180, -68, -95, 170, -128, 86, -61, -40, 173, -204, 88, 42, -88, 93, -164, 152, -17, -158, 196, -120, 43, -9, -80, 192, -198, 41, 112, -127, 117, -129, 111, 39, -186, 194, -82, -4, 38, -108, 212, -173, -7]
2071gJ67l14K71k30J72M5l28M04k02l8J30j99L28l17L8K80l45K27j50O7J48l84
2093b37L82j14j36K10k34L00k23q1L40l32J63m9l4K24m03L19Mk38K56k28K34j15
2115Hj86M01l09P7L6j09K68l69K03J15k75K47k01J59qk61L96k47J6J15j77K82
2137A81l20J06K01l15K29j42P8Q6l07L63j65q8J82j93K50k27j6K92l33J83m9k8
2159c2J61l16K96n2j81K40k08J84j13j16L37l07J16K5j02K11l03K09L9k20K30
2180I8j70J19k0j68L13k47M4R9j47K03k37J20J22k60K07j15N6N0k12K92j68m2
2202f3J52j57J78j78K5J82k54J58m1k7J09k20K30p0j21J94j66J28p3o9K14k23
2224i2R9J4p3J36j92J62Kj58J75j22P7k0r0K09j87M5O5j13J42j42O7P3j75J57
$$ y = [-7, 160, -154, 117, -113, 59, 104, -224, 180, -22, -60, 70, -129, 199, -118, -80, 200, -145, 82, -68, -1, 147, -237, 145, 31, -105, 105, -129, 171, -52, -133, 207, -125, 38, -11, -45, 179, -224, 95, 99, -139, 117, -111, 123, 8, -178, 223, -86, -9, 27, -82, 186, -183, 20, 135, -140, 107, -94, 65, 57, -204, 192, -55, -39, 76, -101, 181, -139, -33, 168, -147, 82, -60, 18, 104, -203, 160, -5, -93, 89, -104, 146, -81, -97, 195, -138, 45, -4, -32, 129, -187, 109, 57, -124, 116, -92, 92, -21, -137, 200, -107, 9, 34, -68, 143, -160, 49, 88, -132, 98, -72, 47, 27, -141, 172, -75, -31, 68, -79, 124, -113, 7, 129, -131, 76, -39, 17, 67, -145, 147, -21, -63, 89, -68, 110, -68, -43, 139, -115, 43, 2, -25, 84, -136, 94, 24, -97, 97, -69, 59, -14, -83, 131, -92, 7, 21, -52, 84, -108, 54, 56, -102, 73, -49, 28, 8, -82, 127, -60, -15, 50, -63, 79, -63, 4, 77, -98, 59]
2248E9r3L0M6j34J80j20lR9j25J16q1JJ02j67J39m8k8Q0j24J29o0n2J12j04P7
2273C1m0j6J01j34P9pm5Q3r7Q1k5p3J32j07M1J3n7J03j18N9K4o7P3p7N4K8j06
2300f7J08o0PL5o2R2q8J8M9p4P5m6PM7q4P5m8JM4o2O9n0j0O4p6N5j7k9N9p8N7
2331A1Kl0N9o9M0pl6O8q0N2%l1M8n5J9K8n1O3m1OK8n0N8o1K2K5l6M5m0J1K2o0
2363d0O5l0oL6m6N3m7OL6n2M8k7JK8n7N7k5j9L8m8N3k0k9M4l5K7ol4N9o3M6ll3
2396b3L9l0K5Jm5O4n1J5K9m5N1n3K7J2m2M6k9J5J1m0N8m0J0J5n1N7m4J4L6o1O1
2427C2l7oL3n6N9k5j5L9m8N2m3ML7o3O2k2j7M7o6N3j0l5N5o2M8j1k5O0p1L8Ol3
2459b0M3n6M8ln5P0m5L5j9l5Q0p1K5K7n2O3n4J8K5p3Q2m6J6Rn4Q9n6rL9n5N7n8
$$ y = [59, -34, -4, 42, -92, 88, -32, -35, 64, -61, 55, -26, -25, 77, -90, 49, 1, -27, 53, -71, 58, -2, -54, 58, -46, 31, -9, -25, 76, -58, 21, 14, -31, 52, -45, 36, 11, -62, 70, -37, 4, 17, -40, 63, -55, 4, 28, -39, 34, -43, 11, 39, -67, 41, -19, -12, 23, -39, 53, -35, -17, 32, -42, 33, -13, -6, 41, -43, 32, -16, -15, 29, -33, 36, -14, -24, 40, -36, 19, 2, -27, 32, -46, 11, 13, -17, 42, -27, 13, 6, -30, 38, -42, 10, 10, -21, 27, -28, -9, 19, -32, 31, -10, -4, 24, -26, 32, -29, -7, 18, -18, 27, -13, -2, 20, -40, 25, -5, -11, 25, -21, 32, -15, -9, 27, -25, 23, -4, -3, 25, -32, 25, 0, -19, 19, -29, 24, 4, -25, 19, -16, 11, 5, -29, 30, -33, 13, 10, -23, 16, -14, 11, 12, -33, 31, -20, -5, 24, -21, 30, -23, 4, 16, -26, 20, -9, 6, 17, -23, 35, -5, 5, 20, -31, 26, -18, -4, 32, -29, 32, -5, -11, 22, -34, 25, 0, -15, 24, -24, 28, -15, -11, 26, -37, 25, 3, -14, 33, -33, 20, 10, -25, 30, -32, 16, 5, -20, 40, -31, 7, 13, -20, 23, -33, 15, 12, -43, 27, -18, 17, -2, -37, 43, -28, -3, 24, -28, 35, -19, -1, 24, -49, 33, -13, 3, 12, -42, 47, -9, -18, 21, -34, 23, -35]
2491c5K7M7q1O7k7nK6p8J08m9l6P2o6P1n9oP2r1O1k1j2N9q2P6k8n0Q2p0M3k1k8
2522c4R2r4L1J8m3O8q7P6Mq7R7n8K8jn0J05r6J1M8n4O4p3L3N0j10R7m5LL5q1J20
2553F7p7j4P1p7P3p6K3O3j17R2k1j5L4q4J04m7m3R8q4O4m3k9J08j23N9J4m3O7
2581D4j02R3j6q2J02p0M7l0m1J13j16M6M0o8P6q5O4J9r9J04m9PNn2J13r3PN8o9
2610c4O8p3K9N3j10J06l5k6N0o9R2p1k2P7p8O9m3KP4j24Q3jl9N0q0R7m5n3J09
2639E6q6L7j5k4R2j11N7K0n2N9q4Q5j5p4R3n2PK0m9R6j06L8N1p7N6n8L4K9r6J02
2669C3m2nK8o8J05p8mQ1r2O1k8lN7j01P9k1j6M4o8Q5n7k4Q3q8N3k6LO2r6N4J6
2700B7n4N3o8P1j7n3Q0o9K9Pl5P4q9M3L1o5O4o1M2Qn7P0m6QJ6l4P0o7QN0o0L8
$$ y = [-35, -8, 39, -42, 25, -2, -7, 19, -59, 49, 0, -36, 36, -30, 41, -18, -24, 48, -43, 18, -3, -15, 44, -38, 38, 10, -40, 42, -28, 15, -6, -34, 58, -36, -5, 13, -30, 38, -49, 27, 31, -56, 41, -17, 11, 10, -40, 65, -31, -20, 28, -26, 38, -35, -2, 48, -62, 35, -10, -7, 28, -53, 67, -10, -24, 47, -30, 43, -33, -10, 53, -64, 28, 7, -8, 26, -58, 46, -1, -44, 54, -30, 34, -9, -38, 70, -53, 6, 20, -23, 44, -58, 35, 19, -63, 39, -31, 16, -14, -55, 58, -58, -12, 28, -40, 36, -49, 15, 34, -65, 39, -10, -3, 2, -50, 63, -30, -23, 35, -34, 34, -39, -10, 43, -67, 39, 4, -22, 28, -41, 51, -20, -42, 35, -43, 26, -17, -15, 59, -65, 18, 17, -22, 28, -52, 45, 0, -53, 56, -30, 7, -8, -32, 60, -51, 6, 26, -26, 33, -51, 34, 19, -55, 38, -14, -7, 13, -36, 60, -46, -8, 43, -34, 22, -36, -2, 27, -69, 33, -9, -14, 14, -54, 51, -27, -31, 50, -42, 19, -9, -12, 45, -56, 23, 2, -14, 30, -38, 47, -10, -34, 49, -39, 14, -12, -9, 53, -43, 11, 27, -27, 26, -42, 29, 12, -41, 39, -30, -1, 6, -29, 45, -44, -1, 30, -35, 29, -32, 10, 18, -39, 31, -15, -7, 9, -25, 45, -22, -14, 36, -24, 14]
2732A4k2J3L2q5O3j1k2L8m1M8l6j0M6n3M4k6lM5p0N2nl3L4l4L9j2l1O5n6K2Rm0
2764b6M4m8L6J1l5M1l6J9Rm2N5m0J4Qj5L4n4L4Om1M8k8J1J4m9M7k4mK8l0K9k0
2796dj0L8m2K2%nK2n0L3jj5L3l6K2Mk5M5m2K8qk1L4l6J9Kk0L0k9J4J0j7K5l1J2
2830AQj7K2j9kJ4k8K8j5LJ4k6L3j8qJ8j7J5j1j2K5k5K7j0nJ2k0L1j5rRj3J4Mj1
2865cRk0J5oj0J9j2K0nk1J6j6J2Jj2J7k3J9Mj7K3j8J1Kj8K3qmQj6K6k8K0%k0K1
2901Ij3JJ2j6J6j3KJ4k5J5Nj7K3k2PokK1k1J5j3kJ9j5J7j5jK4k9OMqJ9j3JJ2l0
2938a9L3j9Rlj1L1l7K3kk6K6j6J1Jj7J2j0J3LjOj1jQj0Nj4LK6k6K2k0MJ4k1K3
2974Ij0mK4m2K9j0KK0j9Qnj1K3k7K9j6nK4k0Plj5K8k1NPk2K8l1K2moJ6j8NJ1j9
$$ y = [14, -8, 5, 37, -48, 15, 4, -18, 20, -21, 27, -9, -19, 27, -26, 18, -8, -11, 34, -36, 16, 11, -22, 12, -22, 17, 5, -26, 39, -17, 5, 14, -26, 18, -30, 6, 17, -18, 23, -13, 6, 15, -27, 28, -12, 2, 10, -5, 29, -25, 9, 15, -26, 22, -6, 5, 19, -30, 17, -7, -11, 17, -13, 16, -4, -14, 24, -18, 4, 4, -1, 21, -29, 4, 3, -12, 21, -15, 7, 11, -14, 31, -11, 17, 9, -12, 22, -14, 5, 7, -13, 17, -12, 2, 12, -5, 20, -11, 1, 9, -8, 14, -5, -7, 7, -21, 7, -8, -5, 9, -17, 16, -2, -10, 8, -9, 6, -5, -17, 8, -17, 10, 0, -5, 7, -13, 18, 3, -6, 3, -10, 4, 8, -3, 6, -14, 1, -5, -15, 4, -8, 12, 7, -14, 2, -14, -2, -1, -13, 4, -19, 0, 4, -13, 10, -8, 3, 5, -13, 10, 2, -2, 6, -10, 16, -12, 8, 8, -12, 9, -4, -3, 9, -7, 9, -4, -2, 12, -13, 2, 7, -10, 13, -9, -2, -8, -10, 11, -10, 5, -8, -10, 9, -6, 11, -4, -5, 19, -10, -4, 0, -8, 11, -2, -1, 11, -19, 14, -5, 4, 1, -10, 21, -16, 7, 5, -21, 5, -11, 0, 1, -16, -4, -14, -1, 2, 1, 7, -4, -5, 3, -7, -2, -16, -13, 13, -13, 9, -11, -7, 7, -14, 9, -1, -5, 19, -23, 6, -4, -2, 18, -1, 7, 2, -9, 14, -13, 16, 0, -5, 19, -1, 6, 3, -12, 16, -5, 0, 7, -15, 13, -18, 4, 0, -6, 10, -8, -3, 8, -11]
3011a1K1k8J8Rj9K1nqJ6j8J4qnJ2k4L1k4KJ5j3K2k0QLk5L2j1j5J9j4J7j7j2L4
3045A7l4K3qkK5m1L2j3pK1m0M2j1j4L3l8J5KpK5k7J4J2l6K5j2J8ml5M4k2lJ5j6
3079gL0l6PK0l6K3lLRl5L8j9qK4k4L3k6qL4l2K2j8PK0l4K8j1j7J9j9K5lk1L6l4
3114a3J8pqJ8k4K4oj6L1k8J9j0j2K8k4J3Jj9K1rMJ6m1M0l1K0jk5M0k8J0Oj7K4
3148A4k2MK2m2L4j0KJ5m4L3nk1K9k6K5k5J5K1l3J3Qj3J3k1J5jj3K7k3PJj2K9l5
3182a9K0mj6L0l2J7J1l0L5j9LJj8L2l7K2Kj0K1k7J9J2l1K7k3NRj3K4k4OJ3j0J6
3216A2j9PJ9l2K2lj4J2j2K3j5j1K3j0J9k3%K0l3J6J4k8J5k0K1lj0K6k6J8pj0K8
3249A9k9MJ3j2K1k1J3jj8J9qPqKJ2j6PPj7K0k0PJ8l6K5nJJ2l2K4qj1K2j9%LlK7
$$ y = [-11, 10, -18, 0, 9, -10, 11, 6, -2, 14, -4, 10, 2, -3, 9, -15, 16, -8, -6, 9, -4, 18, -2, 6, 9, -16, 16, 5, -10, 9, -5, 12, -5, -17, 17, -17, 6, -2, -4, 21, -20, 12, -1, -8, 13, -27, 15, 4, -10, 23, -15, 0, 2, -5, 20, -7, 7, 19, -17, 8, -4, 14, 10, -25, 19, -3, -6, 9, -7, 23, -13, -6, 14, -22, 1, -2, 1, 10, -25, 13, -6, -14, 10, -14, 19, -7, -15, 19, -13, 9, -9, -2, 18, -16, 12, 1, -16, 3, -16, 9, 6, -15, 21, -13, 5, -2, -10, 8, -16, 8, 2, -14, 17, -11, 8, -2, -14, 14, -10, 3, 4, -15, 6, -3, 1, 17, -24, 16, -15, 5, 4, -21, 19, -9, 1, 7, -10, 14, -8, -4, 18, -24, 10, 0, 2, 17, -27, 6, 1, -20, 9, -17, 8, -17, -2, 19, -14, -1, 7, -6, 7, -14, 1, 0, -13, 14, -9, -2, -1, -13, 16, -19, 1, -3, -19, 11, -21, -4, 7, -23, 12, -7, -4, -3, -21, 11, -26, -4, -2, -12, 9, -18, 1, 13, -18, 9, -14, -9, 0, -13, 11, -13, -7, 6, -4, 12, -7, 0, 19, -13, 9, 6, -8, 4, -8, 15, 0, -11, 12, 2, 21, -2, -2, 18, -15, 1, 15, -13, 2, -18, 3, 0, -10, 16, -10, 8, 1, -9, 19, -10, -6, 7, -5, 16, -5, 8, 7, -11, 8, 0, 7, -1, 1, 13, -3, 4, 11, -6, 14, -6, 1, 19, -17, 8, 3, 4, 16, -16, 8, 0, -11, 11, -8, -8, -5, -8, 19]
3287A9l2J3J0k7K1rkLmJ9k1ROqJ4j3NpNMj0RRj2Kj%Rk1K8k8KK1j4Oj8RMKQj5P
3329B%j5J3pnK6j9lkPllJ0%qJ8k2J2Rk4J8j6J5nrJ5nkJj2K6lj3KqJ5nJmjmlPJ2
3373Hj2nL%LJPj4NOoLjjJ0j5J3nLlqJ8j8J2Lj4QjlNj2J5Kj3J5j4JNj0J4k0J3J
3416aKKqJ0rJ2jplOj1RmNJLKj2RmpJ8j0QjqKKNlkQj5kLj1J1qJNj1J4lKmj3K2j8
3464a4PJ7j5kJ0j2Oj%Jj3J2KnJ2mNj0N%o%kOlnJ1j5J7onNkOPk4J6oOLj9LJ1j0
3508a1OrK0rlOj0J6Jkjj0K0j1qJ1qOrLJLLnNlj2J3nnKrJPLKoJJ0pOj8ON%PJ%R
3557A3ojj8J3Oj0J4mKj4nJ5mMlj7J7j7J1Oj5J0k4J7J5j7ROj0J3k0J4JrQkJNj0
3596fJ2jj2NPj2J2JpQMj4J0oj4J9j8K1j2nK4k2MQj4J3k1J9Kk2K7j5kMkJ4j0nJ4
$$ y = [19, -13, 0, 10, -17, 4, -5, -7, -4, -8, 11, -10, -1, 5, -3, 11, -2, 3, -4, 1, 5, -5, 4, 13, 1, 3, 2, 2, 11, -10, 18, -10, -8, 13, -1, 5, -13, -4, 0, 2, 10, -5, 2, 2, -13, 0, -7, -12, 14, -5, -8, -10, -3, -6, -9, 1, 1, -7, 11, -11, 1, 10, -14, 4, -12, 3, -2, -11, 4, -1, -3, -2, -14, 12, 9, -4, -2, -10, 5, 0, 1, -3, -4, -8, -11, -4, 8, -4, -9, -6, -6, -3, -2, 5, -9, -4, 2, -4, -1, -2, -3, 7, -8, 5, 0, 3, 0, -8, 10, -8, 4, 7, -7, 1, 0, -3, 2, -10, 5, 7, -6, 9, -5, -4, 1, -9, 5, -15, -2, -1, 1, 3, -5, 5, -4, 8, 7, 0, -3, 3, -8, 1, -3, 2, 3, 6, 8, -4, 5, 1, -6, 12, 2, 10, 9, 1, 3, 5, 10, 7, 5, 13, -2, -4, -1, -12, -1, -9, -8, -3, -14, 0, -3, -1, -5, -18, 4, -14, -7, 10, -5, -7, 3, -9, -3, -4, -4, -3, -16, -4, -2, -7, 5, 1, 6, -4, 1, 1, -5, -5, -7, -1, -4, -9, 2, -13, 4, -2, -7, -2, -4, 2, 9, -15, 1, -5, 1, 4, -15, -12, -1, -11, -5, -14, 6, -3, -6, 0, -10, 6, 7, 5, 4, -6, 14, 3, -5, 6, -2, 4, -5, -2, -1, 2, 5, 0, 5, 2, -10, 3, -2, -7, -5, -14, -13, -6, -3, -1, -7, -6, 4, -3, 3, -15, -9, -4, -4, 3, 4, 4, 13, 7, 6, -12, 1, 7, -3, 11, 7, 9, -5, -10, 5, 1, 5, 2, -15, 2, -15, -4, 2, -13, -3, -27, -10, 5, -12, -3, 3, -7, 6, -14, 0, 1, -8, 0, -2, -1, 4, -6, 6, 5, -7, -2, 5, -7, 5, 6, -1, 7, 11, -3, 7, 1, -13, 6, -12, 9, -3, -8, 16, -6, -2, 6, -8, 5, -16, 3, 5, -17, 10, -5, -7, -3, -5, 9, -1, -6, 8]
3635Hk9L2j1jNKKj%Lj5J7qoNNllj6K2j6J6j0j4K4j6J4lpN%NmpK1k3QOj1J6j4m
3677fJ6j7RnRlj0O%MQj3J4j6%MrJ9j4JJ3j8JOnK2k2J4qqMNnJ1j4KRJrLJ3j4oJ2
3721DqJ9oq%kJ8l1K4pj1K5j6%Qj4ROj2OrJ1k0J1Mj0J5qnLN%j1J6Mj0jl%J7j3J1
3763A1Lj4RoMo%J1oQj0j8J6Nj7J6oOj3J4nJKj5J2jj1J0rJ5lnkoJ1klJ3qMKj1M
3806@LqNqJ3Pj2Rj8Oj%K0k7K4k6J4Jj1LJ1j1%pJ1JjjjOJlkkJ5np%jQkpPJJj0Q
3853DLk4J4KqJ5lnokLJMJnLrjJ2pJ3qJJ0orOKKj6J3mnQlLNLNk5KJ2oRnJjk0J8
3902cLJjnJ1j1RjrJ3j7MQj7J3qKJ2qRplKnJ1JpL%MMPj0%PpOqj3J5oPmqPnJJjM
3952AjrPoJ2Kj1Op%OkQj9J6mMlMMj3QLJkKj2J0nkLmPj2JJ3J1j8lKLj4QKpJ4j1
$$ y = [8, -21, 11, 0, -1, 4, 6, 8, 7, 7, 10, -5, 12, 4, -2, 3, 8, 5, 2, -14, 8, -8, 8, -2, -16, 8, -8, 6, 3, -4, 1, 1, 6, 2, -5, 16, -7, 1, 7, -4, 12, -2, -6, 10, -7, 2, -3, 6, 3, -7, -1, -1, 3, 11, -2, 12, -4, -4, 0, -9, 10, -4, -3, 10, -8, -7, -1, -6, 16, -6, 8, 0, -8, -4, 1, -4, 7, -7, -5, 4, 5, -4, -1, 12, -2, -8, 4, -4, 15, 9, 1, 1, -1, 17, -14, 10, 3, -8, 17, 1, 1, 9, -5, 4, 10, -2, 4, -5, 6, -14, -3, 1, -9, 6, -2, -7, -4, 1, 1, -10, 6, 10, 0, -1, -4, -4, 13, 0, 11, 14, 0, 9, 3, 7, 1, 1, 12, 6, 14, 4, -14, 2, 7, -10, 6, 0, 6, -7, 7, 2, 3, 5, -10, 2, 1, -10, 0, -9, 6, 3, -2, -4, -10, 1, -1, -4, 9, 1, 5, 7, -4, 0, 3, -5, 0, -8, 5, 12, 0, 9, -9, -3, -4, -4, 16, -11, 13, -13, 1, 2, -9, -6, 5, -6, -6, -13, -2, -1, -2, -3, -4, 2, 3, 0, -2, -4, 11, 6, -1, -1, -2, 6, 4, -3, 4, 5, 6, -4, 4, 7, -17, -3, -1, -9, 6, 3, -2, -8, -10, -7, -6, -2, -1, -6, -3, -12, -13, -1, -8, 5, -3, -2, 8, 2, -7, -1, 1, 3, -13, 0, -4, -9, -1, -4, -1, 4, 7, 12, -13, -11, 1, -5, 4, -1, 0, -1, -21, -3, 0, 1, 0, -5, 6, -5, 4, 3, -6, 7, -10, -6, 2, -15, -2, -10, -8, 4, -4, 5, -2, -5, -3, -8, 3, 4, -3, 0, 0, 4, 8, 15, 5, 5, 12, 5, 11, 3, -10, 5, -1, 6, 2, -6, 1, -4, -3, -2, -3, 1, 0, -9, -2, -8, 4, 6, -5, 1, -6, -6, 0, -2, 6, -13, 3, -1, 3, 0, 4, 8, -5, 3, 6, 7, 5, 7, -5, 5, 0, -2, 1, -3, 4, -8, -7, 6, 17, -1, -4, -2, 1, -13, -5, -3, -10, 4, -7]
3999gJ0loNkM%qPLjlkJOKllQj7J7j2jNj0J3Ok2RlJ0%qOqNJkLkmoJ5mPnNokmRM
4051Gj0J0j2OLJJrNpNOoJ2qklJkOj1LQrjpJ6omJ5LoPj7J9j6Ro%Mj6PJJ2mmpJ8
4099A2kkpPjpNllLj5K0j1%%mRqpJ5oOj6MJ7j0LRqLpJ6j8J2JJlrlJOkONjj3nPm
4148gKMlkKPo%J4rKj3OJ2rNJpQlkopJ3mJ1jj4J4kQj3jLMJ1j6%LKkj2lJ4j4J3M
4195GkkqNmmJ8j5mRRqMolNq%QNLPk4Q%nJ6j6pJ5kjkJ3mLj1J0%nj0N%KmoJJ3pM
4245Bj2QMj3J5mmJ0qOkJLoJ3j5J5pj0LnjJ2knLRpqLJ6j9LqJ9j1j3J4jPpmRj6M
4290iNmJ1qJmOOj0OKj1RpRNrKpQj3RKPpkKjpoJ4oJ1jkj0jM%J0pK%kLkJ1oPoKp
4342aJKnOOjq%MKLqLLj4jRnJ2nj3MQ%rlJ3%%oKPqJ1rJ1nrMQj3JnK0j4ljLJ8j3
$$ y = [-7, 3, 0, -6, -1, -3, 1, 1, -7, 0, 3, 2, -1, -3, -2, 4, 6, 3, 0, 8, -9, 8, -4, -5, 0, -10, 3, 9, -13, -4, -7, 3, 3, -5, 1, -7, -2, -1, -3, 0, -2, -6, -12, 3, -1, 6, 1, 6, 0, -2, -6, 3, 7, -3, 7, -5, 1, 4, 5, 6, -3, 2, -5, 0, 6, 0, 12, 4, 2, -1, 0, -2, 4, -7, -4, 4, -5, -6, -13, 3, -3, -7, 8, 11, 5, 12, -5, 14, -2, 7, 1, 1, 5, -11, -4, -3, 9, 5, 1, -6, 12, 10, 8, 1, 8, 7, 0, 5, 2, -1, 2, -13, 7, -4, -4, -4, -8, 1, -7, -14, 1, -5, 1, -15, -11, 6, -4, -1, 8, 0, 3, -4, 12, -6, 6, 7, 8, 5, -4, -7, -6, 0, -2, 4, 9, 8, -5, -10, -3, -7, -5, -1, -4, -6, -4, 3, -3, -3, 11, 2, 4, -9, -3, 9, 0, 5, 6, -1, 7, 4, 2, -4, -11, 2, -2, 9, 8, -6, 8, 6, 14, 1, 0, 3, 7, 18, 2, 2, 5, 7, 5, -7, -10, 4, -10, 3, 7, 5, 3, -5, 0, -4, -8, 10, -5, -9, 0, 9, 1, 5, -1, -4, 1, -7, -7, 1, 6, 9, 16, -8, 0, 0, -5, 11, -5, -12, 3, 1, 0, -2, 11, 7, 10, -1, 9, 9, 4, -6, -1, -1, 1, -3, -9, -8, 5, -2, 2, -10, -2, 2, -11, 4, 0, -4, 6, -2, 4, 2, 3, 6, 0, 13, -2, 13, 6, -4, -1, -6, -7, 5, 3, -2, 1, 10, 3, -5, -2, 14, -5, -2, -10, 9, -2, -15, -1, -2, 5, -2, -6, 3, -13, -9, -4, -8, 3, -5, -4, -8, -2, 4, -6, 0, 2, -9, 0, -7, 2, 7, -2, 0, -7, 1, -12, -3, -1, 6, -1, -3, -1, -2, -9, -15, -1, -7, 4, 3, 1, -9, -10, -6, -6, 4, -3, -1, -1, -3, 0, -2, 9, 3, 10, 4, 6, -1, 0, 2, -3, 3, 9, 8, 0, 0, 4, 6, 9, 1, 4, 7, -7, -8, 1, -4, 8, 3, -10, -6, 2, 2, -7, -10, 3, 3, 3, -3, -1, 6, -2, 9, 0, 11, 6, -3, 1, 9, -4, -3, -8, 12, -2, -5, -6, -3, 15, 2]
4392B%J0qj6PKPpJkJMmOj3J1jnJ3j2mLOKkpJnPLmJ0nmOn%JJ3j1JJJkLj1J0nK%
4442Aj3RJ5k1J1lJLj0Jj0J1J4lkmN%qjjlOKLjlOnjKlOlQj5N%MJj3QNrJjMMj0O
4492aMkmLmKLlnjJ1mjjKMmNkjLLqJ2lllj2J6ok%mOKNj6J3j2KJ0krRMj0J1Lj5J4
4542IkKoJ1npJ0oMj3J3mL%JmlOrJ2qjLpoJ7rLj0MNrNnMJ2pL%lO%j5J1n%NOj3J5
4592A3rjRnLKj1RJk%l%j4J2klMMj0oQoMl%J2qJKMjnO%MljLj1NJMK%nJlklNlnL
4646cPjJPj3KnkO%jmKJnPnJ0qJ5rMkj1J1JoJJ3%pojlLJLMj0J5j3MmJmoOJ4k0J6
4696FolmONNplRpKLJ0jk1Pj%MqJ0JPj4PjmJ1j3J5qJ%qJPrnJ5j0J3j5J0rkNmJJ0
4745HqrnJ4%K%KLj2J7qpNKMRj2MqLRj6MKkLoJ3nj3J5oMnmQpKkMJ1j3JMkkkLLN
$$ y = [2, 2, 12, 4, -12, -5, -3, 4, -3, -2, -4, -3, 1, -3, 3, -10, 1, 0, -5, 8, -4, -8, -5, 1, 3, 1, -6, -5, -10, -3, 0, -4, 6, 1, -3, 3, -2, -2, -1, 12, 1, 2, 3, 4, 2, 5, -6, 4, -1, 1, 1, -12, -3, 12, -9, 2, -1, 0, 3, -7, -6, -16, -5, 9, 6, 4, 0, 5, 5, -3, -4, -5, -8, -2, 0, 3, 2, -1, 5, 0, -1, 1, -2, 4, 1, 9, -6, -1, -1, 3, 4, -9, -1, 4, -5, -4, -5, -1, 3, -7, -1, 3, 1, -3, 0, -4, -2, 1, -2, -7, -8, 3, -1, -2, -3, -1, 3, -1, 4, 2, 1, 4, 7, -1, 11, 8, 5, 2, -10, 6, 0, -2, -2, -6, 0, 2, 7, -9, 4, -8, -6, 4, 2, -7, 2, 6, -4, 7, 10, -5, 9, 7, 9, 3, 14, 9, 2, 12, 6, 10, -3, 10, 6, 9, 9, 10, 6, 3, 9, 0, 12, 4, 3, 6, -1, -7, 10, 1, 4, -6, -2, 3, -6, -1, -6, -2, 10, 3, 6, 6, 3, 9, 9, -6, 5, 0, 0, 5, 11, -2, 13, 4, 3, 12, 7, 10, 12, 1, 10, 11, 9, 9, 6, 6, -8, 4, 2, -1, 3, 7, -3, -9, -1, -7, -3, -6, -6, 6, -2, -1, 1, 5, 4, -1, 5, 5, 9, 6, 5, 8, -3, 2, 3, 7, 9, 9, 4, 5, 2, 0, -3, 2, -1, -6, -3, 4, 3, 4, 11, -2, 0, -5, -7, -1, -1, -2, -6, -4, -3, -8, -1, -6, 4, -4, 11, 2, 6, 4, -7, 4, 5, -1, 0, 13, 13, 6, 0, -1, -4, -1, 0, 3, 7, -3, 12, -1, 3, -1, 0, -4, -10, -4, 10, -10, 6, 0, -3, -7, -1, 4, 9, 2, -1, 8, 1, 3, 6, 16, 15, -6, 1, 0, 0, 4, -4, 6, 7, 14, 0, 7, 6, 2, 13, 0, 15, 7, 8, 8, 0, 1, 8, -1, -6, 9, -1, 12, -3, 7, -2, -4, 1, -3, -2, 8, 0, -9, -14, 0, 0, 2, 2, 4, 7, -5, 12, 4, -3, 2, 4, 8, 17, 5, 9, 1, 4, 13, -3, 1, 3, 1, 4, -2, 11, 6, -7, 8, 2, 6, 1, -3, 5, -2, 0, -2, 2, 13, 0, 1, 5, 3, 1, -1, 2, 5, 10]
4796A0Loj1J4poJ1K%krJ7j5J1j3klLoOlQJLj0NkP%j8J7j1J2knMLkjOrJ2kqnQ%
4843ELMooPJrkJ2lj0PPj3%MkLJK%j1jJ1lKlOjlkmLJ2jnJ0kNqj3J8mjMj0J0nOo
4893Ij5PMoKKj0PpJ5ln%qJKnOJ2olJ4nrK1j2MMrNnRj0JLmKj0kJ2rRlj3%LJ5j9
4941iJ0LoOop%J5rOJmqJ0MrJ%kQ%oJ4oj2K4k1J0kNmqoJ0JmJjmJ3plo%J%J4oKp
4991dj2J1lMJ2j0J3j3%KmOj4NMoK7rj0QKqJ2j8NKL%lJPj2mL%PnoMpO%MJkmqNP
5040a%PnNjj8K1kJ1j3J%rjJ1mkoKMkJpJ6j4oJ1Jj3Kj1J8OnRj5J9pkkkKkLKJ2m
5087A0j7KRnKJ2pMqoJ6j4Pj6J0LokjMJJnjM%pNJ1j4pJ4kkMlQ%nKjM%LoJ2ooKp
5137dLJ2j5PmOlKJmoqJ1lJMqkJKK%%jJ7rpoJ4rRpKQlkjOj0NQj2J5qoNlkMoQj0
$$ y = [10, 13, 7, -4, 10, 3, -3, 8, 10, 10, 8, -1, 16, 1, 12, -1, -3, -6, -3, -9, -3, -6, 2, 3, 6, -4, 1, -1, 6, 6, -12, 5, -6, 6, 4, -1, 3, 6, 4, 3, 9, 0, 12, 10, 2, -3, 5, 5, 8, 12, 6, 0, 7, 8, -1, -3, 9, 6, -4, 3, 10, -3, -3, 1, -1, 2, 3, 5, 5, -6, -7, 4, 1, 3, 0, 6, 5, 2, 0, -4, -1, 11, 10, 5, 15, 13, 18, 10, -3, 15, 11, 10, 14, 4, 14, 9, 15, 9, -6, 1, 5, -1, 1, 3, -7, 0, -7, 8, 5, 0, 0, -8, -7, -5, -10, -4, 8, 2, -1, 13, 8, -1, 20, 8, 12, 16, 7, 12, 7, 16, 6, 7, 10, 6, 8, -2, -4, 8, -1, 8, 5, -8, -8, -5, 10, -9, 1, 4, -2, 4, -2, -9, -9, 6, -3, 3, 4, 0, -8, 2, 6, -3, -2, -2, -4, 4, 4, -2, 12, 6, -6, 18, -3, 7, 5, 10, 6, -2, -8, 2, 3, -1, 0, -1, -5, 8, 1, -2, -8, -8, -7, -7, 7, 1, 3, -4, -16, -5, -8, -4, 8, -2, 11, -2, -2, 0, -4, 2, -12, -7, -3, -9, 18, 9, -1, 7, 9, 1, 13, -5, 0, 2, 5, 5, 2, 3, 10, -2, -6, -3, -3, 4, -1, -7, -3, -10, -4, -4, 0, 1, -1, -5, -13, -8, -1, -1, 6, 1, 6, 5, -13, 8, 6, 17, 4, 5, 5, -4, -5, 6, 2, 0, -6, -4, 0, -2, -1, -8, 8, -6, -12, -1, 0, -13, -11, -22, -4, 2, -3, 6, -9, 10, 3, 1, -1, -3, -1, -3, 0, 2, 14, 10, -7, -5, 4, -1, 1, 13, 6, 10, 2, -4, 12, -2, 5, -11, -1, 2, -4, -6, -7, -3, -2, -1, -6, -7, -3, -3, -10, -5, 6, -8, -15, -1, -3, -5, -1, -4, 4, 4, -1, 1, 0, 4, 4, 7, 1, 13, 7, 1, 3, -4, -1, 11, -4, 3, -1, 5, 2, 4, 5, 1, -5, -13, -2, -5, -4, 0, -8, -10, -9, -7, -5, -5, -5, -6, 11, 2, -5, -11, 3, -6, 3, -4, -2, 6, 3, 1, 0, 6, -4, 1, 9, -3, 12, 4, -2, 3, 0, -2, 2, -4, 4, -6]
5189fLkjLKKjjpJ1nlKpJ2Nj1J5pppJ8nKlJ1qlKLj1RqMPrkJ1j9J2nMqPn%L%j0J1
5239blLmKMrJ7mmKPjLrLk%J3kpmlOjpOqkJ7j1lMlrROj4LOJ2j6jmPJ0pqJ0rJ0r
5290f%QOmjjlMjLkmMjLnKpjQKkj0NKoJ1j2mJ0okMlLmOnMRpJKj0PJ3pMkkKlJMj
5345FooLjjOOj1LpoK5j5jKOj0LmOKnQl%kj%JKL%lJRj3MJJ1JqLjj1kLjJ0qJ2qj
5397B%pQoNj5OMJ2rMp%mJQpRlLQj5JmRLOo%JkNoKJj4J4j2JOLJj6JMLJmjrJ6lQ
5450Fj3nPMlJJpJ5lJk1K1MnJnOj1OmLklOj1J0k%%nLlJoLNlOkQrOqJLoJ2ojkLJ0
5503GkpKJrJ0KJMmqm%%J1krLlNnJNj1Qj0L%LOKjjKmKnJ1Lj3RQj5LNj0KJRNmlp
5556cNj0NJ1Kj2OpnKoQLrPJqJ0oKkRnjnJ1joOkOpJKk%kK%LmMr%KlLJ1j0j1MjN
$$ y = [-6, -3, -5, -6, -3, -1, 1, 0, -1, -8, 3, -2, -5, -3, -10, 2, 7, -4, 11, 4, -3, -10, 8, 3, 5, 2, 13, 5, 2, 4, 7, -4, 5, -3, 1, 8, -1, -3, 8, -11, 1, -4, 0, -8, -1, -6, -6, -3, -3, -13, -2, -5, -2, -6, -4, 0, -9, 8, 4, 0, 2, 9, 8, 11, 2, 5, 3, 3, 16, 14, 7, 3, 0, 6, 5, -2, 4, -4, -6, 11, 0, -3, 1, -2, -11, -2, 4, -10, -7, -1, 11, -5, -6, -10, -3, 7, 0, -8, 2, -7, 3, -6, -6, 2, 8, 4, 3, 2, -1, 3, 2, 5, 3, -1, 3, 2, 5, 0, 2, -5, -6, 2, 4, 2, -8, -3, -1, -7, 4, -8, -12, -2, -8, -10, -6, -9, -6, -10, -4, -9, -5, 4, -3, -2, 0, -10, -3, 10, 3, 7, 5, 3, 5, 2, 3, 7, 6, 0, -6, -3, -4, -5, 1, 7, -4, -1, -8, -14, 11, -4, -5, -3, 3, -7, -4, -8, -2, 0, -5, 3, 0, 0, -2, -3, -3, -2, 0, 3, 3, 0, 1, 10, -3, 1, 2, 13, 14, 6, 9, 8, -3, -5, -2, -3, 7, -1, 11, 3, 2, 2, -5, 3, -3, 2, -13, -7, -3, 9, 0, 4, -3, -3, -7, -6, 2, -5, 4, 1, 4, 12, -3, -2, -6, 3, 6, 12, 6, 6, 7, 5, 10, 4, 6, 7, -7, 7, -5, -4, 2, 5, 6, -10, -9, -5, -2, -1, -5, -6, -15, 1, -2, 6, -7, -12, -5, -1, -4, -3, -2, -9, 6, 3, 4, -17, 4, 8, 3, 4, -1, 5, -6, 0, -4, -1, -3, -6, 0, -11, -1, -3, -3, -3, -8, -5, -8, -7, -13, -10, -5, -8, -2, -4, 4, -5, 1, -7, -6, -3, -9, 3, -3, -4, -6, -3, 7, 5, -2, 0, 1, -8, 2, 4, 5, 9, 5, -3, -7, -7, -7, 4, 2, -7, -4, -7, -2, -7, -6, -1, -12, -4, -14, -11, -11, -8, -2, 0, -1, -2, 0, -4, -2, -7, 4, 7, -6, 3, 11, -4, -1, 4, -6, -4, -3, 6, 11, 7, 4, -3, 2, -8, -3, 8, 10, -2, 4, -3, -8, -6, -12, -4, -1, -10, -3, -2, -10, 0, -6, -4, -6, 3, -2, -3, -8, 3, 2, -4, 2, 0, 6, -1, 0, 2, 0, 0, -2, 0, 0, 3, -1, 3, -6, -6, -4, -7, -4, 7, -3, -14, -10, -11, -6]
5609fqKPj0J4okNJkNkKJ1j5kJ1KkJkrPKPj8ROpr%POljkJj0J5pmJ%LK%lMj0J6p
5660@KnJ%%OjKoJORmj4JNljJ6ronNJnJ5j4lmQMlJJkjMklJmK0nj5J6nnLmMLNNr
5714GkJjNj0J0MpKonjQj2J0knQkj1MjLJ1j0kL%LpQmQlQqjlJ5lj3J1j4J4Lnlj0
5762ePmOnJp%Q%k2K0jj3JJ5Jj3lJOJjNNj0lJ4jmQj0Pjp%lQOmnJ4jqNoJ0j2kjK
5812arNNmRj1kQjqLnJ8jrOmP%JJj5ROJPj6LOnMjKqMoJJ1j6J%JMJkmnRjpQj4Ol
5866a1JkJ1kLqJJ0NkJnKjlNj1RoMkNoMMkj4J7j4kRJj0J0oKJ0j8J3%mj3J4%Lmj
5913cQnPMpK%OKOj4kNJLj3MkMoNJoj0LJ4j1OOj4KlKJN%MJj3LMLr%K0j0k%jJ3q
5964FJ4rj2Oj5QNkk%kjlJ4k0J0kJ3j1j7J2kPjLlL%nJoPJPklQJJnl%JKJmjJRjj5
$$ y = [-6, -14, -12, -5, -15, -1, -7, -9, -4, -3, -5, 0, -2, 0, 11, -4, -6, 5, 7, 5, 6, 4, -5, 2, 4, 11, -7, 2, 8, 1, -8, -8, -1, 5, 2, 1, -1, 0, -10, 5, -2, -6, -5, -5, -2, 0, 0, -3, 1, -9, 7, 0, 2, -3, -2, -2, -2, 4, 3, 5, -1, 0, 6, 15, 11, -3, -2, 3, 0, -1, 15, 6, 0, -5, 0, 1, -4, 11, -3, -6, -10, -2, 2, -1, 0, 1, -1, -2, 2, 0, -3, -2, -6, 14, 9, -6, 10, 5, 0, 3, -1, 3, 6, 11, 16, 7, 5, 6, 5, 10, 0, 10, 14, 7, 9, 3, -2, -3, 5, -7, 3, 1, -4, 4, 2, -9, -5, -6, -3, 8, -2, -4, -1, -1, 2, -5, 3, -1, 7, 4, 12, 4, 3, 0, 15, 12, -1, 10, -4, 10, 13, 8, 5, -5, 2, -2, 4, -1, 0, -7, -7, 1, 1, -21, -1, -2, -15, -14, 1, 2, -11, -14, -13, -7, -6, -7, -2, 3, -7, -10, 4, 3, -1, 7, -3, 4, 3, -4, -4, -7, 1, 7, 3, -2, 12, 11, 3, 8, 2, 12, 0, -2, -3, -1, -10, -5, 0, -4, 5, -6, -8, 0, -1, -9, -6, -11, 7, 6, -3, 3, -1, 6, 6, 7, 8, -7, 2, 8, 9, 16, 0, 3, 9, 4, 8, 7, 9, 1, 5, -1, 0, 11, -5, -4, -4, -3, 1, 2, 0, -4, -9, 0, -1, -8, 0, -14, -8, -11, -10, -12, -1, -3, 0, -8, -7, 3, 8, 6, 7, 2, 4, 3, 0, 5, -6, 3, -3, 1, -1, 4, -2, 2, 6, 4, -10, 7, -7, -9, 0, 1, -9, 1, -5, -3, 7, -11, 2, 2, -2, -15, -1, -1, 2, -2, -3, 5, 0, 7, 11, 4, 6, 6, 12, 14, 20, 6, 4, 9, 10, 13, 0, 4, 2, 6, 0, 5, 6, 0, -10, -7, 7, -4, 2, 8, -6, -4, -7, -5, -4, 1, 1, 5, 6, -7, -4, 0, 3, -6, -6, 14, 4, 2, 2, 1, 14, 6, 20, 11, -1, 5, -10, -2, 3, 1, -1, -1, -3, -4, -7, 7, -13, -3, -5, 8, -3, -20, -8, -10, -3, -4, -1, -4, -1, -1, -6, -5, -11, -4, -3, 4, 2, -1, 7, 8, 9, 4, 1, 1, 2, 4, 5, 1, 0, 1, 10, 9, -6]
6015fO%lKk%Kpj0J5LoM%LkLlPj0oJ2Lj0%OmlNlOK%Lj2J0Pj3kLQk2J5jLj0J0j5
6063a2NRpKJQk%NqJ0ppJ0oRkjNpRj0NloQlK%Kj0MqLKJ1j3JmpJ2jnOmOmOjoMNJ1
6116A7k3JNjQpJ0j2J6orNMkRj5Mk%oJ4mOpoJoJ0oRmj9J2LJ3rKj0LJQkkLoQj2J
6164cKJ0pQoMlRj0KKrJ4l%oo%MpPj7PnJ6%j1J0lKnlNmJ0oLNn%qJ3Jj1PlJ3j2%
6213APpRlNj5KJ3j4J4qooRkpRqQ%lPplM%rNOMLJNlMMj5QpNJmqJ0joKj%ljMojJ1
6268GokrJ0ljjl%OLjpmJ4Nn%qJ3jKkQlj2J5qknRkj0J0LMj6Qj1QQj4JkOoKJ4ql
6318AkJRrMNnmJKNQLpmkR%jrjjNmkKnlRPolrRrK1j7jJ4j1oJ1omJ0okJ0kpoJ3j3
6371hJ2KJkOoJNLomLj0JRLknkLJoMLkKolJ0pkrKJ4lkMljJ1j2MMOj0Jj0J1JmJ%
$$ y = [-6, 0, 0, -3, -1, -3, -3, -1, -8, -18, -3, 0, -6, -2, -2, 1, -1, 2, -1, 6, -4, -10, 2, 5, -5, -5, 1, -3, -6, -1, -4, 2, 4, 4, 7, -5, 5, 12, -1, -3, 0, 8, -14, 1, 0, 3, -7, 3, -12, -7, 2, -5, -3, -2, 6, 4, 4, 9, 1, 11, 4, -3, 7, 1, 10, 8, 7, 12, 5, 14, 4, 9, 6, 0, 8, 5, 7, 7, 9, -1, 3, -5, -2, 0, 11, -2, -1, -5, -12, 0, -1, -6, 0, -4, 2, -2, 4, 3, -3, 1, 6, 17, -6, -5, 0, -1, 7, 0, 10, -2, 14, 8, -1, 4, 8, 6, 15, 0, 4, 2, 2, -4, 10, 6, 12, 5, -1, 0, -6, 4, -2, 7, 3, -16, -4, -1, 12, 3, 5, -5, -2, -1, 7, 5, 3, 6, 0, 8, -4, -3, -1, 9, 2, 10, 4, 8, 5, 14, 4, 6, 8, -1, 13, 10, 10, 4, -2, -2, 2, -5, 2, -15, -8, -13, 3, 3, -8, 2, -1, 1, -4, -7, -2, -6, 4, -2, 1, 6, 1, 1, -7, 6, 7, -4, 3, 0, 13, 1, 1, 8, 1, 10, 7, 12, -3, -1, 12, -2, 12, 4, -2, -8, 1, -1, -8, 1, -7, 1, 1, -2, 5, -2, -5, -1, -1, -10, -5, 1, 5, 8, 9, 14, 11, 15, 19, 4, 12, 5, 10, 11, 7, -1, 9, 8, 2, 4, 3, 3, 0, -1, 3, -3, -4, 7, 1, -1, -10, 0, -3, -4, -5, -8, -8, -2, 1, 0, -7, -11, 3, 8, 3, 3, -5, 8, 7, 9, 7, 15, 12, 0, 15, 7, 5, 0, 9, 7, -3, 7, 10, 14, -2, 6, -5, 3, 11, -3, -2, -4, 2, -4, -2, 12, 4, 1, -1, 0, 9, 0, 4, 9, 4, 0, 1, 3, 8, 16, 19, 12, 8, 6, 15, 15, 14, 5, 4, 3, 8, 4, 2, 4, -1, -4, 5, 12, 6, 3, -6, 3, -6, 15, -2, -3, 11, 0, -6, 5, -1, -5, 5, -1, -3, 7, 5, -2, -8, 5, -8, 4, 6, 7, 5, 11, 5, 6, 11, 14, 8, 4, 7, -3, -2, 7, 10, 8, 3, 1, 4, 5, -1, 3, 6, 4, 6, 0, -3, 7, 0, -2, -11, -9, 5, 2, 0, 4, 1, 0, 11, -1, 3, 7, 13, 3, 4, -6, 5, 6, 2, 3, 3]
6423CNj0K%l%lNrkJ7prOjOpONmkjJ0jmJrPPNrNoLoRnQoLmMlkoJ%nLjNlRj7NNm
6480dqQPnjPqKJqKRLqLJKOnNj0OKJJ0j6KjJnOjmJ0k1J0JKnj0J4j0LLlMkPKq%k
6532eOLNnkKmJ2onOkPJj0J2oooNkMnOpJooOQoOj2J8nolOlJ0Jn%Oj1MMjJ2pkMK
6585A3%oNrNk%kjjrPnJ0pPon%J5j4%PrRjNj0Qn%OjoLMkJJKJ0j4OkJmjOjk0J4k
6637@oLmOMolJ1j0RJj7J4nm%OoOlnQJ1mPkokKpR%nJ5pqKj7J2mPlrKOKm%%J1rL
6689AjLkpkLnNoJ6qkN%nJOkRopNjMmj0NLLj%rJ4qnONj4RmpmO%%KJ4omJMqLNMn
6745aRj1NLKmMjmJ2mj0KLJk2J3JnPljjKqJ5plllJ3oMoLkJ1LmmjO%Lj6J4mJjNl
6796DjKPj4Rj4LJPomlLpJ4j1KJRrlNJmKN%PqJ7roJmLQqlOJMOj8Qjn%JMj1OLl%
$$ y = [3, 8, -2, 0, 0, -3, -3, -6, -1, -10, -12, 5, -2, -11, -5, -6, 0, -7, -1, 4, 0, -2, -3, 7, 6, 2, 3, -6, 1, 8, 13, 4, 9, 3, 6, 0, 9, 4, 12, 6, 9, 5, 9, 6, 4, -2, -1, -1, -6, -3, -4, 1, -2, 7, -10, -5, 0, -4, -12, -4, 3, -2, -3, 4, -4, -2, -1, -9, -7, 2, 5, -3, 0, 1, 3, 9, 4, 9, -1, 5, 7, 8, 18, 2, 4, 3, 4, -1, 5, 4, 0, 10, -11, -1, 0, 2, -3, -13, 1, -9, -6, -3, -6, -2, -4, 3, 5, -3, -3, -5, 1, 4, 9, 4, 2, 4, 0, 12, 6, 1, 7, 5, 12, 13, 3, 15, 9, 3, -3, 2, 0, 4, -1, 5, -2, -1, -7, -13, -7, 1, -5, 1, -11, 7, 2, -4, -7, -1, -4, 6, 7, 2, 2, 8, -3, 1, 5, 4, 16, 9, 7, 11, 13, 13, 7, 12, 3, 8, 6, 6, 4, 3, 2, -7, 0, -5, 5, -2, 5, -1, -6, -6, 9, -5, -5, 2, -7, 2, 1, 6, -4, 4, -1, -1, 5, 4, -2, 1, 5, 3, 4, 5, 7, 17, 3, 9, 7, 8, 4, 3, 9, 8, -12, 2, 0, -6, -3, -7, -1, 3, -3, -6, 5, -5, 4, 5, -12, 2, -3, -7, -7, -1, -7, -1, -4, -9, -1, 10, 6, 13, 11, 5, 3, 5, -2, 7, 7, 2, 17, 10, 2, 4, -13, -1, -5, 2, -1, -10, -8, -2, 0, -4, -4, -4, 7, -2, 1, 0, 3, 1, -6, -8, -5, -10, -5, -11, 5, -3, -5, 0, 0, -5, -4, 2, 0, 9, 3, -4, 1, 0, 4, 0, -10, -5, -2, 1, 0, 0, -9, 5, -3, -8, -2, 3, -11, -2, -6, -13, -17, -11, -11, -11, -9, 5, -1, -5, -4, 0, -8, -5, 0, 4, -1, 8, -3, 2, 5, 7, 3, 7, 6, 2, 14, 10, 0, 2, 5, 6, -16, -3, -2, -7, 0, -3, -4, -5, -3, -11, 4, -3, -6, -9, -12, 1, -5, -1, -7, -4, -6, 5, 8, 4, 0, -1, 5, 5, 8, -8, 6, 2, 3, 2, 7, 4, 3, 5, 12, -2, 7, -7, -4, -3, 4, -2, -6, -9, -6, -13, 1, -10, -8, -7, 2, -7, -10, -5, -4, -8, -6, -1, -1, 6, -2, 15, 6, 0, 1, -3, 0, 8, 0, -3, 3, 4, 8, 14, -4, 4, 3, -2, -2, -1, 3, -8, -2, 1, -2, -2]
6850bj7J6j3RNpO%kLKLjpJ4LqQmqLKpJ3Nj0Rmj1J1j0mJ3pJ2j9J2j1M%j5K3j4N
6894@Qj8%NjkOLrJ1oQjj2J5njMNj0QLkoLJ3k5J8j0LJmmQKokqLJ2rRmnqMOoLo%
6945iJ4nnLKMQLkjj2QKJomjJ0j4J0JmJ1j4%QlJ%ojpKoqJ3MRrQj2NPRk4J4lRo%
6995D%jj3MJ1%LjOnkJmLj0Qj5OM%Nj1OlJLj0LOqKJ2lj0PlKjOmLKlJ2Jj2JJ0rm
7045@QMpJk%LokNp%Oj3J2nLmnLnRpMKoJ0lpJ4j0QmJ0j2Rj0Oj0J7onmKKmQoJ2j8
7095a0J0lljrRkqPj2J3mKNqKJ1j0J0j6J3LlKjOnJ0qQlopRpKMkPpOqMkMj0OrLM
7145dmmrK1j4M%QkjKkQ%kKJk%%MPj2J%o%oNRlj5JJ0rJ1mk0K5j8J3qOPj1J6j2L
7193dmNNpJ0j9J0NkJJ1qj0RKMoKjjpPlJ0j4Qj1QMlkPmoOj1OJoMj%MJ0JmolkJ2
$$ y = [-2, -19, -3, -16, -7, -2, -9, -3, -3, -5, -2, 0, 3, 2, -5, 9, 12, 4, 12, 8, 0, 3, 5, -2, 11, 16, 6, 15, 11, 0, 11, 1, -3, 10, 3, 15, -4, 8, -3, 1, 1, -14, 9, -5, 0, 8, -10, -10, -5, -6, -8, -2, 1, -8, 3, -3, 5, 4, -8, 7, 2, 1, 5, 10, 0, 8, 11, 9, 3, 6, 19, -6, 12, 2, 5, 6, 2, -2, 6, 8, 2, 0, -8, -5, 7, -2, 7, 3, -2, -10, -6, 0, -6, -3, -9, -9, 5, 0, -5, -2, 0, 4, 12, 15, 13, 12, 0, 8, 10, 11, 5, 1, 0, 10, -4, 6, 7, 3, 14, 0, 0, 8, 5, 6, 6, 0, -1, -8, -6, -12, -20, -7, -3, 6, -3, 5, -7, -2, 5, 14, -10, 4, 1, 10, 4, 4, 4, 3, -10, -6, 5, 5, 8, 7, 13, 8, 6, 7, 3, 6, -4, 4, -11, -5, -1, -1, 4, -7, -1, -4, -3, 0, -10, -7, -1, -9, -7, 5, 2, -8, -1, -4, -2, -3, 3, -1, 2, 4, 1, 13, 14, 2, 3, 13, 4, 0, 8, 12, 5, 6, 4, 4, 7, 1, -1, 4, -3, -3, 3, -10, 2, -3, 0, -4, -9, -6, -11, -2, -9, -5, -3, -9, 1, -2, -9, 5, -5, 3, -1, 9, -3, 6, -4, 2, -8, 9, 3, -2, -6, -4, -2, -6, 2, -4, 8, -10, 0, -3, -6, -7, -16, -7, -9, -17, -10, -22, -9, -13, -11, -6, -14, -12, -1, -11, -1, -17, -4, -1, -4, -2, -3, 3, -2, 8, 0, 8, 5, -1, -8, 1, -6, -4, 0, -2, 5, -2, 4, -4, 0, -2, 2, -8, -2, -11, -8, -4, -8, -12, -21, 0, -14, -10, -10, -2, -4, -5, -3, -5, 3, 3, 1, 3, 4, 2, 2, 2, 6, 13, 1, 2, 2, -4, -4, -10, -5, 4, 1, -14, -13, -3, -12, -1, -5, -25, 0, -18, -5, -13, -7, 0, -11, 5, -7, -4, -8, -3, 2, -5, 5, -14, -4, 1, -1, 0, 11, 3, -7, 2, 4, 8, 2, 4, 3, 2, -5, 2, -1, 9, -5, 3, -8, 0, 4, 1, -1, 6, 2, -4, 2, -9, -3, -2, -8, -4, -5, -5, -1, 9, 10, 6, 0, -3, -5, 7]
7243GKjnOL%oNj7J2Pj0%jJoJnMMj2Pj3J2mLPj1Lj1J3j0jJ8jj%mjQp%J1rQnRnK
7292GoJ0Kj1KLpq%O%KokoQ%%%oJ5j5J3mlQplKNkOLJLnNqPj6LjN%J0j6MqP%lj0
7344a6J7j4MPoj4J0lLpJ0LNj1MJ2j1j2J7Kj1RJNpKoJ0JLLrLj1KkJRMrnlljRj5
7390b0NJ3pjqJ0JMJnOj3K0pLJj4J3rJ2mljQ%kNjqOj5K3mk0J4jkqJjjmJJOqJ8j2
7438gkOmkMNjnOJ2k4J6Mj3J2j1OJpLOJ3j2rlRl%NqpLnJ4j3Lj%kNLjkqJ0Kkl%N
7488bjj0P%J6%j2RlLlJjj%j1RnJmk%jOmJ1j0jJ0j0LLoRrJ0%jNp%JjKQqNJlJkM
7540GOj6OJpRprJ1KpPJpoNMokNmJ1j0jLPmj1RjJ0MoKj0J9rmMJlNMrlOmn%M%oR
7593EqOjoj5J1NLkJlRj0J1k1J7pJ9j2%nOLQj8NmQkMM%pmJ2j0oj0NLOJnJnRnmJ
$$ y = [7, 9, 8, 3, 9, 12, 12, 6, 11, -6, 6, 13, 3, 3, 2, 3, -3, -2, -7, -3, 1, -11, -4, -17, -5, -9, -6, 1, -10, -7, -18, -5, -15, -16, 2, 1, 0, 0, -4, -5, 3, -4, -4, 7, -2, 6, 1, 10, 5, 7, 1, 11, 13, 2, 4, 7, 0, -8, -8, -2, -2, 0, -6, -8, -14, -6, -6, -6, -6, -12, 3, -12, 1, -3, -6, 2, -5, -8, -6, -1, -3, 3, 6, 7, 10, 5, 10, 2, 9, -7, -4, -5, 0, 0, 10, -6, -2, -10, -3, -3, -6, -16, 1, -13, -9, -2, -8, -22, -12, -15, -12, -19, -9, -6, -1, -12, -8, 4, -7, -19, -2, 0, -11, -2, -1, 4, -3, -1, -7, 3, 4, 7, 10, 1, 4, -7, -5, -7, -6, 3, 7, -2, -7, -10, -13, -14, -5, -20, -15, -2, -9, -10, -18, -8, -7, -3, -2, -7, -1, -14, 6, -1, 2, 3, -11, 2, -7, 5, 1, -2, -3, 5, 5, 3, 8, 7, -1, 5, -10, 13, 9, -11, 3, 2, 0, -8, -7, -8, -9, -13, -12, -11, -5, -13, 5, -7, -9, -3, -7, -9, -5, 0, -1, -6, 0, 12, -12, 4, 8, -5, 7, -4, 2, 3, -4, -1, 5, 18, 6, -3, -6, 3, 0, 0, 5, -3, -10, -7, -12, 2, -11, -8, -9, -9, -11, -6, -3, -4, -6, -14, -4, -2, -4, -7, -7, -2, -3, -13, -6, -6, 10, 10, -2, 7, 4, 7, 4, 5, 4, 3, 3, -8, 1, -4, -3, -7, -9, -9, -10, -4, -8, 3, -7, -8, 2, -8, -5, -2, -8, 1, -8, 2, 2, 1, 6, -1, -1, 0, -1, 1, 9, 1, 6, 7, 4, 5, 3, 7, 13, -3, 3, 4, -3, 6, -1, -10, 1, 3, -4, 3, 4, -3, -9, -4, 0, -6, -8, -3, -7, 4, -6, -7, -4, 3, -1, -12, -3, -4, 6, 10, 4, 6, -4, 15, 6, 2, 6, 7, 4, 9, 13, 4, 1, 7, 3, -2, -2, 2, 2, -4, 5, -3, 3, 2, -4, -19, -8, -3, 0, -2, -1, -4, 5, -5, 6, -15, 2, -5, 14, 2, 2, -3, 3, 6, 14, -4, 1, -3, 5, 3, 7, 11, 11, 4, 0, 12, 2, -4, -14, -9, -6, 0, 1, -4, -3, -8, 1, -4, -8, -7]
7642gQp%%oK%OOqJ0p%lJ3j0LNl%jRljkqPNj1Mj0J6poMj0PkrJ7lmoJ4j5J1jjJ5
7691A1k6QLJ0rmJ7jj1M%qJ3mj4NPlOmNj6J0Oj1mMmMJKJjnLJ3qkj0OPj2PLpJ0K
7738D%kjOlojjOJ1qmn%K3j3koPnrKKlNnMj2RLqKJ1qQj0jK1j1LMkRj2l%J6j0%m
7788AjQnlJ0pknQ%j3L%LpLPjNmqmJ2KKqJJkoPLmMQq%MlpJ9nmJJjpjkqOPJ%noJ1
7845Ar%JP%k1LKJ2LnkQ%pJ2j7J3Qj0%mMj0K5j7LKpj0L%POoNKj0jJLmjNlMlj5J8
7894dMqj%Rj3LOjOoQmoJ5pQpMnLoQonJ0qjQmnQj2MNj0QpJ4j1Rlol%Q%JkKNKkj3
7948hNQqkPpJQKljPj5OmkLpQLj0JkJ1orlJ3nQj1LPqkLMrJ2JkKLlqRlJjJ2pmN%
8002Cj3J0lnJ2Jj8PLj1RmOlLkoNK%%NOj2KNKlMlQpKKjj5OjJ2o%kKqPjmJ6k2Pl
$$ y = [-7, 1, -6, -6, -6, -12, -10, -10, -4, 2, -6, 4, -3, -3, -6, 7, -3, 0, 5, 2, 2, 1, 10, 7, 6, 4, -4, 3, 8, -3, 1, -9, 7, 0, -6, -2, -12, -5, -7, -16, 1, -2, -6, -12, 2, -13, -2, -3, -4, 11, -15, -7, -4, 6, -3, -7, 10, 9, -2, 2, 2, -6, 7, 3, -11, -6, 1, -2, 4, 0, 5, -11, -1, 5, -6, -10, -6, -10, -6, -5, -3, -2, -3, -8, -5, 8, 0, -2, -12, -6, 1, -11, -4, -1, -8, 2, 4, 4, 2, 1, 7, 4, -2, -3, -4, 2, 13, 5, 1, -4, -4, 19, 6, 4, -2, 5, 0, -9, -7, -5, -8, -3, -8, -4, -16, -7, -4, -12, -10, 1, -7, 1, -9, -10, 11, 0, 3, 7, 5, 14, 2, -1, -1, 15, 5, 5, 1, 0, 8, 3, 0, 10, 3, 1, -4, 4, 4, -9, -6, -6, -3, -10, -7, 0, -1, 4, 0, -8, -12, 0, 2, 4, -4, -3, -2, -4, -10, -3, 0, -4, 0, 8, 0, 0, 4, 1, -6, 13, 8, 4, 5, 6, 5, -2, -3, -5, -13, -7, 0, 1, 1, -4, -10, 1, -8, -8, -7, 0, 0, -21, -18, -16, -4, -1, -6, -8, 0, 0, -7, 5, -12, 1, 9, -1, -1, -5, -1, -11, 14, -3, 0, 2, -5, -15, -12, -12, -5, 1, -5, 0, 2, -8, -9, -8, -5, -9, -10, -5, -8, -4, -7, -22, -4, 0, -8, -9, -9, 0, -13, -10, -4, -5, 1, -5, 3, -1, -7, 8, 1, 9, 2, 6, 1, 4, -2, 6, 0, -5, 5, -3, -4, 4, 0, -5, 3, -9, -5, 0, -10, -2, -9, 5, -6, 3, 0, -6, -9, -9, -1, -1, 0, -2, 0, 5, 7, 5, -8, -3, 5, -3, -5, 2, -5, -4, 4, 6, 3, 2, 9, -6, 0, -4, -6, -3, -10, -2, 1, -9, -8, -10, 1, -5, -14, -17, -4, -9, -1, -12, -9, -2, -10, -12, -9, -5, -14, -2, -1, -3, -1, 2, -1, -9, 0, -3, -2, -3, 9, 2, -2, 3, 3, -10, 0, -3, -8, 4, 5, -13, -6, -3, -14, -5, -9, -3, -6, -3, -5, -11, -6, -4, -4, -4, 1, 7, -5, -3, 2, 4, 1, 5, 2, 10, 3, 5, 7, 6, -9, -3, -4, 8, 2, 2, 0, 2, -6, 1, 0, -4, 12, -10, -3, -6]
8053fkKlMj2RPj0%LKpJ3lLqOlLKLj3J9j6J5rKJRj%qj0J0oJ0Mj5%JOJqoJ1jlK%
8102bpNNJpjJMLmJJ%jLJ1kj2mJ7j7J0Pk1NOpQloj1QNLrMkOLlNj1n%KJ0k%JmOj2
8154a2J3jKMoJllJ3j1PLj5KkLnjMMKj1Nj2K3j9J2Nmj1KOqJ2oJK
$$ y = [-6, -8, -6, -9, -5, -17, -8, -1, -11, -11, -8, -6, -13, 0, -3, 0, -8, -2, -5, -2, 0, 3, -10, 9, -7, 8, -1, 1, 2, 11, 10, 10, 2, -8, 2, -4, 6, 10, -5, -5, -4, 2, 3, -5, -11, 0, -1, -4, -2, -2, -9, -4, 1, 2, -5, -6, -5, -1, 2, -2, -1, 0, 0, -1, 2, 13, 11, -1, -5, 12, -5, 5, 12, -9, -4, 2, -5, 3, 0, -6, -17, -9, -4, -1, -10, -6, -8, -2, 1, -2, 3, -8, -13, -13, -11, -1, -3, -3, -2, -6, 0, -12, 1, 0, 2, 6, 0, 1, -2, -5, 8, -3, 4, 7, -8, -6, -8, -5, -10, -11, -7, -3, -1, -12, -7, -19, 4, -15, -3, 2, -2, -13, -11, -5, -13, -1, -7, -6, -4]
8191d
$$ Imaginary data points
##PAGE= N=2
##DATA TABLE= (X++(I..I)), XYDATA
0@%%%%%%%%%%Qj6J6j6K4l2L6m4N6p2Q8j04J20j36J60j92K24k56K96l42L90m45
32b37N07n74O48p30Q20r21J031j151J285j431J588j760J948k153K378k624K891
49A515l186L510l864M257m693N179n726O344p046P854q799R917j1266J2932j5046
64h118J7835k1706K7488l7196N7650j73379J43052J39515k15001J3722K5159K13543
76A82564l00913m994L09209j50181j00337k8174J65574N6373l21982K08678R7780
87A13597j43346k2693r756K12886j60042j40880K51956p4605m1686m8944O9594
98F081J22697k44766Q7034J13335j01265J6626p0075J47049m3984j44072J75900
109F4560n5388j6552n133k0134J22771j53641M0561Q8922j07505O0296m9383N6922
$$ y = [0, 0, 0, 0, 0, 0, 0, 0, 0, 0, 0, 8, -8, 8, -8, 16, -16, 20, -24, 32, -40, 48, -56, 64, -72, 88, -104, 120, -136, 160, -182, 208, -237, 270, -304, 344, -386, 434, -487, 544, -607, 678, -753, 835, -925, 1023, -1130, 1248, -1376, 1515, -1671, 1839, -2025, 2232, -2461, 2718, -3008, 3336, -3710, 4144, -4655, 5262, -6004, 6928, -8118, 9717, -11989, 15499, -21697, 35953, -137426, 5626, 145141, -69860, -56138, -30979, 182564, -118349, -123343, 185866, 35685, -64652, -92826, 72748, 129121, -192861, 15817, 113597, -29749, -52442, -62198, 150688, -9354, -150234, 101722, 27117, -14569, -63513, 6081, 128778, -115988, -28954, 84381, -16884, -258, -70333, 76716, 32732, -111340, 64560, 9172, -7380, -12513, -32647, 90124, -63517, -22956, 65966, -41539, 18757, -30626, 26296]
121B6296K643j10601J45878o2877l6992N7281m1520P1867j03664L4651R5495j34020
133e5563N3540Q247J1416j855r4484J42224l8488q7210P8251j0859L7047r2737
145e0471J7082J25598j28332J655M6396J6772p863j07009J26562J7764j18218
156f0064M9419K1730M0236q6268k6761J45158q1416m9196M1164L4613J2973j19952
168g8364P8890P1068j04000O039K0852N7142n3580p2492J24458k1308o1118J3202
180a9211K7082M5585j00091J6591Q5945o0885j3753j781N1658n596q4567P3971
192A4948J5137m1409k685O36N6524n5211k3622O5724k5447p976j5171K3834K5902
205C1184o2709K8997J9893k0092K976j8817L9223j5287k8933L7719j4991L709
$$ y = [26296, 28939, -81662, 64216, 1339, -35653, 21628, -19892, 51975, -51689, -17038, 78457, -55563, -2023, 6224, 17640, 15785, -78699, 63525, 25037, -62173, 16078, 5219, 42266, -50471, -33389, 92209, -36123, -34468, 11928, 28700, 20837, -86172, 40390, 58154, -60064, -10645, 11085, 51321, -34947, -61708, 83450, 2034, -47162, -5998, 28615, 41588, -78364, 526, 71594, -32406, -26367, -5515, 51627, -1953, -74445, 50013, 28705, -32413, -19211, 7871, 53456, -46635, -30044, 55901, -4984, -18737, -20518, 31140, 25544, -59023, 14948, 30085, -11324, -14009, -13373, 43151, -12060, -35682, 30042, 4595, -3381, -18552, 5282, 31184, -31525, -2528, 17365, -2727, 249, -18568, 20655, 5368, -23565, 14154, -837, 2872]
217B872p307l824K7834l2367J0712J0623j6169J5760j6885J2761Q58j6524K3751
230A2095j7829L088R352j2719J2869j5249J0898P436k3393J7523j025k077k284
243a315q026K3629j5485r925J7006k946M40j4327J1402J4546k5039M407J1003
256E370P28q346j0665K3760l124j9835R773Q898K75j7143L963K1005j5160r962
270a0463J0184R619o920j6317J6273R805j7408l124J0909P410j4070o716J8479
283G661o38j3977R12J2150Q17j5453L691J3648o234r916M365J0870n715j0903
297h722Q711P512q258n897P492N943q607m547R095K755q577j735Q194Q11p752
312c582M4P302r65o672J834N733k082n356K650M947l641l472L380K606k659k939
$$ y = [2872, -4435, -8259, 19575, -12792, -2080, 8543, -7626, 8134, -8751, 4010, 4868, -11656, 12095, -5734, -2646, 6706, -6013, 6856, -8393, 2505, 9941, -13452, 4071, 3046, 969, -1315, -9341, 14288, -1197, -11122, 5884, 2938, 3378, -10949, 453, 14999, -10040, -5633, 5370, 6098, -2248, -12913, 10847, 7723, -12112, -2339, 6559, 6834, -10309, -6346, 14659, -501, -10463, -279, 9340, 2420, -13897, 2376, 12181, -5227, -8351, 2558, 9968, -4102, -10818, 7661, 7023, -6954, -6042, 6108, 6925, -8528, -4837, 8811, 2577, -7339, -2974, 7896, 2181, -8722, -11, 7501, -757, -6654, 838, 6781, -1826, -6373, 2722, 5477, -3100, -4835, 3359, 4170, -3582, -3538, 3764, 2799, -3873, -2039, 3694, 1612, -3744, -1094, 3853, 212, -3260, 120, 2726, 67, -2872]
328b872L343K200l744p07K758N20k320o15K641j68k180M94J669l56j661O57J333
345I92q47q59P98M89o32k62L28N66p24m18J309q20j57N06n83R22j056L19Q79j573
365h23J295n40m5N88j540K160j320n28J751j975J983j570k59K671l487K143k90
382B14r99K328l684L252l56k631L446k979K651j267k232N344m922J828Q33k476
398a650M525n874L560J864n699N459l678K418L55n367Q279n486q5L369m489O289
414C790p016K516N325r206O688k940J018K575q856J0978m561l985O836o014P007
429D155o939j87J0161j2259N720j82j068M895j2131J2322j342r179R646o298P037
444D351n865m640J5684j3628K415L487l284P727j5102J1216M455j4456J0784n588
$$ y = [-2872, 471, 2671, -1073, -1780, 978, 1498, -822, -1437, 1204, 1036, -1144, -650, 1019, 663, -998, -341, 992, 145, -714, 84, 573, -59, -321, 7, 573, -151, -569, 740, -80, -237, 269, -314, 608, -448, -129, 750, -823, 472, -68, -113, 475, -1065, 1095, -225, -753, 998, -977, 1006, -564, -823, 1848, -1639, 504, 214, -785, 1543, -2141, 1111, 755, -1876, 1570, -1409, 1242, -25, -2257, 3087, -1835, -7, 826, -1650, 2875, -2999, 561, 2425, -3274, 2185, -1493, 925, 1280, -4087, 4192, -1294, -1379, 1990, -2499, 3790, -3226, -710, 4615, -4591, 2097, -843, 175, 2750, -6106, 4872, 311, -3674, 3162, -2852, 4155, -2784, -2971, 7190, -5069, 651, 469, -599, 4296, -7835, 4487, 3145, -6034, 3612, -2686, 4351, -1514, -6154, 9530, -4098, -1683, 1804, -1480, 6247, -8855, 2361, 6816, -7640, 3144, -2444]
458b444O586l263j0624K0313j2431k332P107n774J0932j6561P161J1671j8576
471h235J0274l857M551J333j6453K1979q294p749J0338q076J2837j4834P49J8042
485A2605k0321Q340j002N52O882k0039J9966k366j3003J3258r523J1992j0084
498b743n998K2232k0006N266L176m534J1399k0853J5961L847j8107J5882r348
511c826Q570m113j1759K4790j8424P53Q763r285J3535j9334J1150J0030k2879
524a2029J7120o664L315J730j6105K5653j4930n608J4725j2252J2893j5525N130
537b547J5997k5640J5148j496k432O383j8354K3868r078j2537J8965j2539J0043
550E781j0300j340K0761k5563J0369M743p432R341j8455J9937k146j8547K0879
$$ y = [-2444, 4142, 879, -9745, 10568, -1863, -4195, 2912, -2862, 8070, -8491, -1330, 10341, -8235, 2039, -1818, 2733, 4066, -12387, 9592, 1298, -6451, 3887, -4189, 8648, -6186, -5437, 12605, -7716, 624, -378, 174, 7056, -12983, 6983, 4617, -8386, 4872, -4651, 7341, -2743, -8741, 13491, -6515, -1249, 1927, -2607, 8792, -12061, 3900, 7747, -10360, 5522, -3826, 4744, 631, -11128, 13662, -4762, -4009, 4754, -4531, 9004, -10330, 820, 10850, -12029, 5091, -1573, 1742, 3472, -12633, 13020, -1910, -7518, 7207, -5045, 7848, -7677, -2547, 13450, -12190, 2958, 1462, -970, 5413, -12941, 10927, 1849, -10688, 8277, -4262, 5781, -4519, -5859, 14902, -10661, -292, 4451, -2981, 6360, -12095, 7842, 5696, -12851, 8028]
563H028j0587O010n006o971K3858k3478M295J0868j1214J0717j6992J4756M955
576I239k3177K0539o892J341M4j1400K4651j9075k455J5734j3099J0415j3869
589h004Q331J1477k5165J7393j881l391M513j4042K2345j2206q973J8273j2541
602c871Q289r302J650J5983k3849J2096L244p204P583j4467J7740m758j3900J8588
616G822j0435N093m168m015J7823k0197O452P299r853R317j3036J1998J585j6381
630a0696J7334q016J650J039q253J7091j5150J534J0053j1625R677r601N696N980
644F713j6269J4838n210k168N566r936J3804r724k223J1819j2206P806m532L89
658a333P776j4468J1708j625o087P900q508R486n518m842J2902j1166M108J07
$$ y = [8028, -2559, 3451, -1555, -8526, 15332, -8146, -3851, 7017, -4197, 6520, -10472, 4284, 9239, -13938, 6601, -291, 1050, 1094, -10306, 14345, -4730, -7185, 8549, -4550, 5865, -8004, 327, 11804, -13361, 4032, 2151, -1240, 3273, -10769, 11576, -630, -9603, 8670, -3871, 4418, -4884, -3234, 12749, -11100, 996, 4240, -2964, 4619, -9848, 7892, 3134, -10766, 7822, -2613, 2480, -1688, -5703, 12120, -8077, -1625, 5674, -4179, 5138, -7898, 4100, 5685, -10696, 6638, -1378, 272, 1311, -6942, 10149, -5001, -3467, 6586, -5039, 4638, -4963, 733, 6713, -9556, 5282, 72, -2096, 3470, -6466, 7338, -2386, -4609, 7210, -4996, 2810, -1722, -1333, 6443, -8025, 3683, 2058, -4029, 3871, -4637, 4849, -669, -5511, 7391, -3775, 333, 440]
672D40k442P833j2572Q476K336q912P723n755O066k522o938J2914q435K45K785
687A242l365P511j0618M792N677r570O028l517L672K82q437J1136m622k497L638
702A352l656O947p708Q48P195q012L931k044J516K747q302P735j249l515L700
717A485l835N468l944k013O586n692K460p68p24L972o275M298L23l396L938l757
733a874L088o76k786M826m193J803Q34k719L517l344K158L59l331M397k678K89
749c30Q77j792L448l781Q91K726l269J604j234J621M57l866L888m01j593N57n77
766g74K968l169p23L690k025l51o33J714J097m127K236J695j743n78k05K895j804
783A63k266L066j0j120j072J335J905l234J57K257o43j014p26K317j39k579J507
$$ y = [440, -2002, 5831, -6741, 1735, 4071, -4841, 2882, -2873, 3193, 671, -6267, 6647, -1788, -1543, 1242, -2123, 5388, -5230, -438, 5239, -4331, 1697, -1820, 1852, 2134, -6303, 4833, 211, -2286, 1352, -2304, 4643, -3065, -2217, 4978, -3034, 897, -1147, 369, 3116, -5186, 2549, 1300, -2215, 1485, -2350, 3118, -826, -2839, 3747, -1945, 515, -253, -977, 2995, -3280, 1018, 1341, -2055, 1883, -1874, 1214, 538, -2248, 2578, -1615, 188, 1022, -1697, 1820, -1524, 634, 993, -2338, 2059, -619, -330, 547, -1245, 2203, -1578, -687, 2039, -1230, 374, -860, 761, 1218, -2648, 1240, 839, -754, -197, -774, 2194, -975, -1698, 1992, -33, -384, -1017, 697, 1794, -2333, -97, 1598, -145, -723, -928, 1967, 163, -2103, 963, 953, -167, -1239, 96, 2001, -1233, -1076, 1181, 538, -476, -1202, 1115, 976, -1603, -96]
800i6J055o77j183L65J966j570r84J489K90o38r81J178P86j690K17R17q2o13l35
819e86J140k15r21N73L06j83l92J70N05n42l4L22j42J8j16J80o6k03M05k35k68
840b84M01N6k45k37M51K26p20P1O22p7o71P0R55m56q01N99O05m26q77P49Q17j077
862b49l83Q73M77r88n34J431n0j155J16R43K36j536L61J446r07o96L28J049m10
881C52j492J386N33j018k95M22J145j447m40J627n54l88m23Q56O44j943R89O51
899F05o90N1o29J511o75j127J555o33K50n19j12J506j816O74M53q38J078j428
917g84J125J28j418J766j300N72L18j285J815j554O13O40j722K029j369K96P24
934E94j684K294j774P5J577k087J761j313M17J398k883K417o03o59J191k067K735
$$ y = [-96, 959, 282, -901, -536, 1430, -140, -1124, 365, 655, 17, -964, 214, 1000, -690, -473, 444, 362, -251, -586, 554, 339, -582, -9, 297, 114, -278, -108, 397, -145, -179, 143, 1, 19, -97, 83, 17, -186, 219, -16, -284, 117, 173, -72, -309, 142, 368, -352, -281, 341, 264, -407, -337, 618, 162, -639, -40, 565, 139, -738, 11, 828, -249, -632, 241, 718, -270, -804, 627, 577, -578, -462, 481, 717, -819, -458, 988, 81, -615, -287, 762, 352, -1140, 246, 779, -239, -534, -112, 1033, -414, -854, 773, 219, -169, -592, 264, 908, -1035, -46, 605, -85, -34, -663, 848, 173, -954, 601, -32, 218, -301, -413, 1093, -723, -49, 404, -434, 644, -784, 341, 469, -949, 817, -483, 89, 407, -878, 937, -617, -4, 636, -1086, 943, -426, -130, 594, -1090, 1204, -570, -495, 1082, -1005, 756, -557, -140, 1258, -1625, 792, 189, -470, 721, -1346, 1389]
951A389j545j085K693k325J483j034j95K524l684K115L81j505J768k569K773o62
967E22k409L500k314J070m26j132L478l927J438J436k387K375k763K280M87l607
983b379M067k075K80O37k160M011l619M28K627l245K611k338J324J649m499M220
999A539j419q69J776k851M016k901q74L927l815K217j345J74K704n063L846j77
1015H85k247K594l033L677j916k298N013l859J369k27r14L604n303K998J382l497
1031a772L029k841L001o84l703N686l394K53R13j904M244n073J734K927m420L104
1047A100k299J908P65m783N656k333j109K031k573M247m137J54M282m857K634
1062F86j280N97K054n376N072q86k575K924k746L643k822j389N248m728J640o
$$ y = [1389, -156, -1241, 1452, -873, 610, -424, -619, 1905, -1779, 336, 717, -788, 980, -1589, 1184, 522, -1887, 1613, -701, 369, -57, -1189, 2289, -1638, -200, 1236, -1151, 1224, -1539, 741, 1228, -2379, 1688, -387, -107, 530, -1630, 2381, -1238, -810, 1817, -1428, 1183, -1155, 169, 1818, -2681, 1539, 120, -749, 1027, -1824, 2192, -709, -1583, 2344, -1471, 746, -599, -425, 2279, -2784, 1062, 885, -1362, 1232, -1801, 1876, -40, -2338, 2675, -1184, 185, -42, -956, 2648, -2655, 343, 1725, -1772, 1257, -1584, 1417, 733, -2970, 2716, -678, -425, 488, -1416, 2828, -2245, -511, 2416, -2004, 1100, -1199, 709, 1474, -3309, 2347, 14, -1095, 936, -1637, 2610, -1527, -1373, 2909, -1948, 686, -594, 3, 2057, -3319, 1753, 867, -1708, 1216, -1530, 2113, -709, -2098, 3150, -1578, 62, 56]
1078E6n65K854n439M131O71l879L387k454K820j525k799N890m145L57J180j423
1094h83L310n089K814K227m659L255j872J904k13l909N889k984j020K127j999
1109a102L426m226J099L611m822K549r65Q13J050m495N072j426k167K639k204
1124a148L073k923n59M386m406J639k4k91J983m393L823J0k975K866k068K343
1140A336j540j744M529l694Q00Q11j212K482l838K512J108l402K867j700J360
1155F75k73k410M199k825p2J579j776K415k967J319J920l569K523r61L14O53k631
1172a887L558j768j031K152j814J845j918K92K409l365J830q1m71J094k498K848
1188A195p76j787K360j512J192j046n13K662k860R55O31q71J235k220K021J43
$$ y = [56, -509, 2345, -3094, 1037, 1708, -2171, 1216, -1238, 1582, 57, -2742, 3148, -997, -640, 540, -883, 2427, -2662, 152, 2379, -2280, 975, -897, 1007, 794, -3115, 2774, -210, -1230, 897, -1102, 2324, -1902, -803, 2808, -2014, 535, -430, 383, 1433, -3062, 2010, 584, -1583, 1056, -1148, 1925, -998, -1557, 2829, -1577, 62, 38, -253, 1730, -2663, 1160, 1170, -1805, 1061, -1007, 1336, -204, -1948, 2581, -1113, -313, 498, -714, 1768, -2070, 442, 1550, -1852, 1015, -685, 675, 402, -2008, 2191, -634, -706, 873, -903, 1512, -1455, -136, 1784, -1785, 738, -223, 91, 744, -1887, 1671, -97, -1128, 1024, -790, 1055, -863, -571, 1838, -1527, 303, 222, -249, 845, -1653, 1195, 419, -1368, 992, -520, 672, -374, -887, 1775, -1085, -130, 501, -370, 865, -1355, 666, 809]
1204H09k163K131j090P21l85j111K593k096J35J046j045J251j767J097Q64k127
1220a137J627o42K78J83j393K162j241m23J183j055J103j156K45J253j803J080
1236B64k18j59O09j334J469n09o91J117r53Q06n34k95J219j361O63J07n04P67
1254D63j017Q32m3p88J015p46M11n7m89J001r60L53L14o49P32o96M05K14q04Q75
1274C66m47L6K23m96P40o08L7M98o12M63l53J54L18p27O15j37j97K87m22N31k89
1295b0k17N13m07K03j33j8L48n33L07P0k22K29l33L66n7l35M20k28Q2j2j60L83
1317B46l48N1J62j62J79k57J74J18l14K41j23O6L5k37L35j66r0J66j45J78j73
1338f4k2K30k17P9m2L9R2k43J94Oj20J17j43J96r1j39K45j43L4j0l7J75k17P3
$$ y = [809, -1354, 777, -313, 408, 23, -1088, 1505, -591, -456, 590, -455, 796, -971, 126, 990, -1137, 490, -152, 126, 309, -1084, 1078, -163, -586, 597, -458, 645, -511, -266, 987, -816, 264, 46, -113, 496, -838, 631, 122, -569, 548, -405, 401, -133, -428, 791, -570, 93, 200, -304, 463, -554, 278, 235, -553, 462, -284, 127, 70, -419, 582, -378, -25, 289, -360, 372, -324, 81, 295, -509, 366, -81, -45, 178, -318, 422, -186, -149, 349, -263, 200, -153, 1, 319, -408, 207, 70, -127, 160, -262, 269, -20, -237, 276, -131, 72, -61, -79, 269, -264, 43, 113, -109, 120, -213, 153, 96, -239, 181, -47, 35, 23, -137, 246, -102, -51, 111, -51, 128, -129, 45, 163, -151, 90, -33, 33, 68, -169, 166, 0, -90, 76, -69, 109, -64, -86, 144, -73, 6, -36, 3, 95, -148, 46, 52, -68, 49, -94, 102, 11, -128, 117, -26, 8, -2, -39, 136, -81, -8]
1362hQ3j07J01j50J64j6j94K30j10L5j5j12K48k11QJ41j31J19j72J15Q4k53K15
1385F4q3K3J2j70L30k26n5K05j87K02k04P3J95l50K42n7j0R5k48L17j65r8K49
1408A54k56K36j96k0L18m36K72k4j15K24l71L67j01k39L73l10K26j37j18M58n32
1429b27K56P4k46L63n02M28Om63N71l68J71k0k87O38o03J46K81m02M48n42L80
1450A02J89p14O89l04L8J30n08Q31n94r0N52n48M74n05K07N03r47O78j35j25K94
1471B17p07R39m38m18P99o23M72l98o3Q36j090N26J19l25M74q46Q96j38p76R66
1491D22o18L98k48l79J177j167L09M15n58O62r49P29K43j100J038m97K10K1o87
1510e79J321j012j7P00p42P49q57M01O84j352R80k67o2L45r51J313o93m22R91
$$ y = [-8, 75, -32, 69, -81, 83, 67, -127, 103, -7, 28, 13, -99, 149, -62, -54, 87, -44, 75, -97, 18, 102, -151, 64, -19, 4, 16, -154, 176, -50, -105, 100, -87, 115, -89, -16, 179, -171, 71, 14, 4, 99, -149, 168, 3, -95, 154, -102, 134, -62, -82, 236, -200, 72, 48, -67, 157, -214, 153, 52, -187, 186, -124, 102, -35, -153, 305, -227, 29, 103, -143, 220, -282, 146, 152, -311, 260, -108, 63, 43, -244, 394, -209, -63, 218, -184, 264, -278, 102, 291, -423, 266, -38, 0, 130, -378, 453, -141, -231, 321, -227, 247, -258, -51, 452, -495, 183, 48, -77, 217, -490, 449, 11, -407, 392, -231, 241, -157, -220, 616, -474, 52, 171, -154, 320, -526, 370, 232, -544, 422, -196, 202, -46, -425, 752, -415, -106, 309, -249, 413, -536, 193, 436, -664, 374, -123, 87, 108, -579, 742, -270, -287, 413, -329, 420, -437, -36, 648, -704, 276, 9, -53, 292, -659, 654, -39, -461, 530]
1529E30q53O92o37N4R98j473Q67Ll83O08j074J182l53q08J219q52N08l33l01J242
1549H36j457O23L39o70P67j068R82J3j164J373p36K41mo12J409j328K28P52q83
1568c59P74r17O70M10j442J338m66q0K79q29J446j063k30J105r94O99p01K93Q17
1587G50j604J116p1l95M98r54J336o79o78J338r67N36m14r2J127j580Q05K90o73
1606c11O84r81J095k41j006J387q22L09j21m29J304j412M31O09q74P73q87P30
1624B38K15j248J314n71rK12o66J268j110M3Q76r65P10o36L37N73j350J144k53
1643A22l24M73p78J105p06l56J077r31N11l23j0P78j292Q76M3n68O34p71Q59l48
1663G1o45J158q20K90l5k85Q82j144N44L46p15O35o30N84k3q18J088n99L5K11
$$ y = [530, -323, 369, -268, -214, 784, -689, 178, 181, -202, 406, -668, 514, 161, -647, 572, -280, 228, -105, -406, 836, -621, 2, 341, -329, 438, -630, 352, 365, -799, 574, -162, 79, 75, -537, 872, -456, -228, 524, -359, 415, -502, 168, 578, -864, 474, 8, -72, 207, -622, 824, -239, -469, 636, -358, 341, -360, -67, 750, -854, 262, 191, -204, 294, -660, 676, -3, -681, 657, -310, 226, -188, -280, 847, -733, 72, 362, -311, 373, -608, 487, 246, -760, 627, -195, 114, -7, -436, 868, -544, -113, 496, -378, 395, -492, 238, 453, -795, 519, -52, -61, 151, -515, 753, -357, -314, 562, -403, 307, -329, 8, 581, -769, 375, 122, -202, 271, -507, 598, -108, -464, 613, -318, 193, -130, -140, 638, -654, 222, 265, -303, 331, -440, 419, 71, -574, 584, -236, 54, 19, -266, 616, -528, 16, 362, -353, 282, -348, 236, 213, -605, 483, -116, -81, 130]
1683A30m56Q67q69J88N85p76N64m35K69K81q91R03l26j89L62n26P43n62j18P19
1703D63p42M24k17NM58q42O55q2l55M49m88N40k69l25P19o05K57k9j78N17p12
1724c57M29J33m57M72m08L36m9m17O52m57J11J25k86M77n19K06K60m91M29k91
1744a02J45J30m71N49k83p1K43l13L76l24L0L23m36L19j54j9K31m13M03j23j83
1765a43L00l04K72j37j23L48l66K11j9j18K49l36K79l7k06K71k40J71j3j98L30
1786A91k85R7Q3j90K32k31J18P8k32K37j55M9O4j82K42j70J5J34k03K00j43K0
1808c1J44k37K02q0k9J18j67J73q9n2J55j76J27m7m8J37j78J26lr8J33j36R6j3
1832B7r0J51j32N2K4p7J13j38P6L8j05J24j08N3L6j13J44j00J2O8r3J09r8K9O4
$$ y = [130, -326, 541, -328, -140, 445, -331, 233, -202, 67, 348, -543, 360, 34, -155, 207, -319, 424, -138, -256, 463, -279, 145, -72, -67, 391, -451, 204, 122, -233, 216, -272, 268, -1, -326, 393, -212, 45, 16, -162, 355, -357, 72, 205, -252, 220, -188, 148, 99, -318, 334, -123, -12, 113, -173, 304, -215, -9, 251, -240, 189, -102, 43, 173, -298, 251, -32, -103, 140, -173, 203, -121, -91, 232, -204, 115, -39, -58, 173, -240, 163, 40, -143, 157, -147, 125, -12, -135, 213, -153, 58, 39, -79, 170, -166, 113, 76, -130, 141, -99, 72, 59, -139, 191, -94, 3, 86, -104, 128, -103, 15, 93, -139, 98, -57, -8, 56, -126, 116, -54, -39, 95, -108, 92, -51, -31, 113, -124, 78, -2, -31, 87, -80, 93, 4, -48, 107, -69, 58, 11, -37, 100, -78, 48, 45, -53, 80, -56, 40, 27, -63, 88, -44, 8, 32, -45, 68, -70, 6, 44, -61, 63, -45, 8, 44, -69, 75, -25, -13, 55, -38, 71, -27, 2, 66]
1857F6j15J14o6oO2j13J25o1k0R3j13Q4l8k9R2j27Q2rn1P2r2Q0j8o4J14j06O1
1884A7j4m0J06j31Q5J8p6P9r0R0Jj08J34q0K8J4o4J25j34M9M2q8J02j05O3L7j42
1911h2J43o9KM4r5J43j13kR3j32J22q8K7P8j67J44n9k3R1j35J55q1n6J48j39J01
1937E0o4rJ25j89J41k3p6J27j53J45n8q4J78j67Q7qp5J67k24J38M7j66J66j47
1961g2J18j2j56K47j86M6N9j27K08k19P5J28k14J69j20P6O1k32K73j25l2J12j70
1984i3K33j94PK05k73J88r5J6J38l01K76o5j23J73j88K20j57q8K97k90J49m4n4
2007f3K19l40K48Rj96K31k19J99o3j95L54k61P2M2j21K70l32J67J26k80K48j94
2029g9J38K6k74L74k13k1J38j98K90l02P1K35l39K37j39M9J25l39L74j47j02K04
$$ y = [66, -49, 65, -1, -7, 55, -58, 67, 6, -14, 79, -34, 50, 12, -17, 75, -52, 30, 21, -30, 42, -50, 30, 12, -52, 62, -44, 17, 3, -37, 69, -62, 23, 41, -35, 44, -46, 44, 45, -63, 71, -9, 19, 33, -31, 94, -40, 9, 51, -37, 65, -40, 23, 60, -82, 61, -8, -6, 38, -57, 86, -27, -29, 64, -68, 54, -34, -7, 71, -96, 48, -11, -34, 57, -78, 77, -4, -60, 88, -51, 50, -14, -23, 102, -87, 54, 31, -45, 82, -71, 74, 16, -68, 110, -57, 30, 22, -53, 114, -110, 28, 75, -91, 75, -72, 46, 34, -122, 125, -61, -15, 44, -83, 125, -94, -19, 109, -105, 64, -56, 20, 81, -151, 122, -3, -35, 77, -93, 140, -54, -47, 158, -115, 73, -22, -6, 132, -169, 107, 42, -81, 92, -96, 124, -33, -121, 176, -114, 35, -9, -63, 156, -184, 64, 73, -123, 108, -111, 88, 25, -170, 184, -77, -5, 37, -84, 186, -146, 21, 147, -133, 115, -79, 59, 85, -189, 185, -28, -49, 89, -109, 181, -121, -50, 185, -154, 83, -56, -7, 118, -221, 153, 6, -96, 108]
2051A08k38K73k12m3L32l62J98n3m0J99l73L29m1k19K74k29K31j34j54M07l63
2072a10J25M6j26K52l66K48P0l02K92k07J61l9k40M21l10L5J28j75K70l33J51
2093iJ91l81K90j34P0P3l22M12k07r2K31k15K50k48M6K85m10K43o7j3J45l47L71
2116A62j05j89K76k34K04j63o3L42l73J60K6r7J87l29K89lk58L00k15J55o8j62
2138a58L81l25P5J12j65K27k92J80J09l11K80j36O0K7k25L66k46l1K04k22K16
2159A26k17P1K02l40K27o5k5J13k54L11j49j16K37k08J81j38l4K52l26J80K0j06
2181e8J53k36K31l0k04K69j88J21m8j01K77k85J01Q5j54J75k11J72L4k43K49j31
2203b2M1K5j56K57k04OJ44j79J74j71R8J00k48K03o6k8Q6j81K28j16n4J71j64
$$ y = [108, -130, 143, -69, -112, 220, -142, 56, 3, -37, 162, -211, 118, 77, -142, 132, -97, 134, 0, -154, 253, -110, 15, 61, -65, 187, -179, 69, 139, -163, 129, -78, 83, 44, -196, 225, -85, -50, 78, -97, 173, -160, -9, 182, -199, 91, -43, 27, 100, -222, 190, -17, -109, 122, -93, 157, -91, -45, 240, -170, 73, 6, -7, 138, -209, 162, 57, -132, 144, -90, 114, -49, -112, 230, -143, 17, 43, -54, 133, -196, 93, 90, -168, 132, -83, 72, 4, -158, 223, -102, -27, 85, -80, 147, -145, 35, 144, -167, 113, -23, 37, 64, -161, 205, -41, -72, 132, -90, 126, -91, -20, 182, -158, 69, 4, -21, 92, -162, 149, 0, -116, 121, -87, 94, -44, -78, 174, -152, 28, 48, -58, 95, -141, 90, 60, -144, 125, -63, 58, 10, -91, 186, -99, 2, 87, -67, 108, -103, 69, 103, -140, 109, -22, 19, 44, -112, 145, -59, -53, 91, -88, 86, -85, 13, 113, -135, 68, 2, -26, 60, -121, 107, -9, -63, 108, -56]
2226e6J18q2nJ47k12J33%p3J08j57J69n5j19J94j45P2k2o2J53j77Q1M0j05J26
2250G1j32J00J1j35J74j32L4L5r5J56j36L0Q8j21J00q3L8N8j34J34o5lN1r8J16
2275F2p6j7J16j16P5l3k0Q5j30R6j2n2P3q7P2l5m5R7r8M8jl5Q0r9O5Po8Q9o2M7
2305B6kp1J04o7J6K7o1Q1p3L6K3o3O3m1J7K1o8Q7n7KL9n9N7m5oM8q3P6k3k7N2
2336B9o7O3k7k1N4o4N4j1l0N1o0L9Kk8M7n5N2j4k2N7o0K8Pk8N6n9J5K9o0O3n4
2367a4J8J5l9M2k5LK4n3M1k3JK0n3N7k3MJ7m0M2k0j5M9n0L9j7j2M8n5M0oj6L1
2399C0m5N3k2k8M7n3M3j4k1N4n9K7Kl5M5o1M8ml6M9l6J8Qm1N9n3J2L6n3M8l3K1
2431FJ2m3N4l3J3J3m5N6l6LL1n2O4n0J4M2p4N6k3mL1n5N2k6k1N7o4L7k3qN1p3
$$ y = [-56, 62, -20, -25, 122, -90, 43, 43, -30, 78, -79, 90, 35, -84, 110, -35, 37, 15, -47, 106, -71, 10, 50, -55, 71, -61, 39, 50, -85, 89, -43, -9, 26, -69, 87, -49, -19, 69, -52, 48, -35, 3, 61, -73, 61, -4, -7, 44, -54, 62, -14, -31, 85, -31, 44, 11, -9, 76, -54, 42, 30, -22, 51, -36, 36, 1, -44, 53, -45, 3, 2, -33, 47, -52, 13, 20, -48, 41, -21, 26, 24, -47, 57, -10, 6, 33, -28, 53, -20, 16, 39, -24, 39, -2, 15, 36, -32, 55, -2, 0, 39, -20, 37, -8, -14, 34, -49, 27, 4, -23, 29, -38, 25, -2, -23, 31, -33, 21, 10, -20, 31, -29, 10, 12, -16, 31, -24, 28, 14, -8, 49, -11, 17, 24, -4, 52, -7, 8, 37, -23, 40, -14, 4, 19, -20, 22, -3, 0, 24, -29, 12, -11, -10, 10, -43, 14, -9, -5, 12, -28, 14, -6, -21, 28, -22, 17, 0, -12, 36, -19, 21, 15, -1, 30, -15, 38, 16, -12, 35, -18, 25, 11, -10, 44, -15, 12, 14, -21, 24, -37, 11, 7, -29, 20, -16, 2, 10, -31, 28, -25, -13, 23, -30, 18, -15, 6, 18, -25, 29, -4, 9, 22, -23, 33, -3, 0, 31, -21, 43, -7, 7, 49, -25, 31, 8, 4, 35, -20, 32, 6, -15, 42, -22, 15, -8, -16, 35, -38]
2463c8M4lk8M7o4P7k7m4P0n5K6Jk4P8q4L2K4m2O1p4N4%o3Q4m5NQn5R9q8K6L1o4
2496c1N6n9L2L3r3R3m3pL4p6J01n6j6O6o3N3n0J7O1r9P5j6k1M4o7P9m3k9P8p8
2526b5N4l2qP2j10P0J0n0N7p6P5k5n9R9q2K7Kl1R4j21M7M3p8P8p5N3K4r5J13o7
2556a6QK8n7J10j00J8N4p7P3o9M5L7j14J20m5j4M0q2R7o3k1P8q8P2m3kP3j27R1
2585B6j1l9N4q7R7m9n4J16q3L5j7j4R6j28O8K1o2O6o8P2k5n8J05p3L0%m1R3j11
2614d1M5M9q7O7o6M5J1q5J12o3nL2o7J03q2JP1r5Q0n5K1N5j22J15k3m5O1p2R6
2643E6n6l0Q7p7M9k3j5P5j14P5Nn6O9p1O7m2m8J09q0K1J0l7P4j02N7K2q0Q0n9
2672c4N0Kq1J22p9LL7n3P8p3K6M4q0P2m5K9K0r2J00m2j5M9n7O4n4kP1r5N2j7q
$$ y = [-38, 6, 3, -25, 22, -42, 35, 8, -36, 34, -21, 5, 6, -18, 60, -24, 8, 32, -10, 51, -23, 31, 31, -32, 52, 7, 12, 20, -35, 64, -24, 2, 33, -31, 25, -34, -2, 31, -62, 31, -12, -19, 15, -61, 40, -16, -32, 34, -29, 24, -26, -9, 52, -47, 28, 12, -9, 35, -32, 47, 4, -25, 53, -25, 29, -3, -11, 61, -49, 21, 31, -19, 38, -38, 37, 12, -47, 52, -30, -3, -1, -32, 62, -59, -12, 31, -47, 31, -44, 9, 33, -62, 51, -16, -8, 20, -37, 73, -27, -9, 45, -32, 41, -28, 17, 54, -60, 60, 15, 1, 41, -41, 56, -7, -28, 50, -38, 34, -9, -11, 62, -65, 26, 15, -24, 30, -57, 40, -9, -63, 53, -30, 5, -12, -26, 70, -58, 10, 31, -31, 35, -33, 39, 14, -44, 61, -12, 18, 18, -23, 70, -41, 4, 53, -34, 33, -33, 12, 23, -62, 50, -13, -18, 14, -53, 50, -32, -31, 40, -55, 25, -30, -9, 46, -76, 39, 16, -29, 32, -40, 56, 0, -30, 57, -20, 29, 6, -9, 66, -48, 27, 32, -24, 45, -26, 41, -1, -49, 60, -20, 1, 11, -26, 48, -54, 3, 25, -55, 25, -34, 16, 18, -63, 59, -20, -17, 20, -33, 45, -28, -2, 42, -38, 34, -11, 18, 38, -54, 46, 4, -11, 38, -19, 45, -9, -11, 60, -35, 17, 0, -8]
2703hM7q1O3k0k4M8o3O4l5l1P3o6L7qj8N7p0L7J0m1N5n7N6j3m6Q2o0J3K5l3N2
2734D5o4L3K8p0N8m2K4J4o3O7l6QJ9l9M4l3nM1o6M5j3oK5n1O5k5k3M2m4M3j7l1
2766b7O3m5K4kk3M7o1M9Ll5M0m4K8kj9N0m6j4L5m0K7j7NJ2l7L9k9J7J1l9M9k4
2798eJJ3k4L2k4lK8m3M4j9mJ7k4K7j1pL0k6J8j4nJ9k8K1j2jK3l1RJ1k8K2j4J0
2832BLk4K8k3LJ5k7K5j7J0J0k3K6j3LJ6l7L5k2J4J9l1K2j5KJ6k0K4k2J1Qk7K7
2865A8j7j1J9l6L3qLOk2J6j0nK0j7MJ0k4K3j4QmOJ2k5J8J1l3M2k6J3Qj9K2k2L
2900BJ6k7L1j6kQj9MKNQj6J2lrJ3k4K5k4qK3j6J2jj0K5l0K3onK2k7K5j2pK3k0
2937cJ7Kj8L3l5J6jj9K1j2MMk0K6k4KMj3K5k8J1Pj7K0j4LQoJ5j7J1%k1L1j5QO
$$ y = [-8, 39, -42, 21, 1, -23, 25, -38, 26, -9, -40, 33, -33, 4, -4, -22, 35, -35, 2, 12, -29, 26, -31, 25, 12, -34, 48, -12, 1, 26, -7, 45, -19, 14, 42, -28, 30, -12, 12, 26, -37, 30, -6, 2, 21, -18, 26, -7, -12, 29, -37, 8, -5, -11, 14, -37, 28, 3, -20, 22, -22, 21, 4, -27, 36, -9, 15, 13, -10, 37, -24, 25, 28, -7, 33, -11, 17, 15, -4, 46, 0, -14, 21, -19, 8, -9, -4, 8, -29, 10, -19, -2, 9, -30, 19, -5, -4, 9, -15, 17, -7, -10, 18, -25, 19, 0, -4, 13, -11, 16, 5, -2, 28, 2, 20, 6, 1, 20, -8, 13, 1, 0, 23, -8, 1, 12, -16, 6, -8, 2, 5, -19, 9, -14, -11, 4, -23, 2, -15, -5, 5, -18, 8, -5, -2, 14, -23, 12, -10, 4, 23, -8, 14, -1, 1, 17, -3, 21, -1, 10, 18, -9, 18, 1, -10, 9, -27, 6, -2, 1, 7, -15, 1, -9, -14, 6, -11, -7, 3, -21, 2, -12, -4, -8, -2, 10, -15, 3, 14, -19, 23, -3, 10, 18, -1, 21, -1, 2, 18, -9, 22, 6, 4, 12, -7, -3, -1, 4, 12, -4, 8, 5, -4, 9, -15, 10, -14, -22, 1, -15, -3, -4, -14, 11, -19, 4, -2, -7, 15, -12, 13, 1, -6, 17, -3, 14, 16, -2, 31, -4, 12, 11, -8, 13, 1, 5, 9, -11, 15, -9, -7, -3, -16, 9, -19, -8, -1, -18, 2, -12, -9, -1, -7, 8, -9, 2, 2, -19, 12, -3, 5, 11]
2974A1j5J5J3k1K7k6J7k4OK7l4K3j3kJ6k8K0j4oK5l6K7j8oL3k7J5j0rK6l3K1k
3007bj9K8k3J9KpK3k8J4KkJ9l7K9jk4K6k2J7Pl2L6l1OJ8j3Qj9J1J0l0J7%qJ6l7
3043b7M1k1pK5l0J3LlK0k8K3rrK6l3L3oj0K0k6K9j6j0L3l3J6MpJ2k3K0nj9K2j9
3078aJ9rk0K6k9QJ7k3K5l8L0Jk6L0j1jJ4j8K4k2J1Rj5K1j6jK9m6L4j0rK0l3L6
3112B6k5mL1k1J6k3nK3k5PNj8K3k9M2j6k3L6l5K9k0jK9l4K0jk4K2k2L0Ok6L4j9
3146HRmj7L7k7%J0k2K1j9K0Qm4L2j0%Nl0M3l2MJ3pQk1J6Jk6L5pj2K0k4L2j9j0
3182iL5l0K0j1KK5l8L2pj5K2j8JJ0k7K8j4Nj1qL2l8J3J0k3K2j7RPk5L4k0mJ1p
3217dK8l9J6Rj2J3k3K7noJ5j6mJ5j5K2j1j4K4k8K2j5lJ6k7K7j2j1J3k4K5pj9L7
$$ y = [11, -4, 11, 24, 3, 30, 4, 21, -3, 3, 30, -4, 19, 6, 4, 20, -8, 12, -2, -8, 17, -19, 8, -10, -16, 17, -10, 5, -5, -14, 12, -21, 0, -2, -21, 7, -16, 3, 5, -2, 21, -7, 7, 9, 7, 26, -11, 18, 17, -7, 19, -3, 14, 21, -11, 25, -6, 0, 18, 5, 13, -6, 5, 15, -15, 2, 2, -6, 10, -27, 14, -7, -14, 11, -19, -6, -3, -6, 14, -14, 9, 0, -9, 17, -16, 17, 11, 1, 21, -5, 24, 8, -2, 31, -2, 14, 18, 11, 23, 0, 20, 15, -4, 18, -1, 18, 9, -11, 15, -14, -6, 11, -12, 13, -25, 5, 6, -20, 10, -1, -2, 12, -6, 18, -4, 7, 16, 1, 22, 6, 5, 34, -12, 22, 12, 3, 23, -10, 26, 1, -3, 28, 7, 23, 0, -5, 18, -7, 0, 5, -13, 10, -19, 23, 7, -16, 20, -15, 14, -6, -7, 22, -12, 8, 7, -17, 5, -17, 13, 19, -7, 27, 8, 17, 13, -4, 33, 6, 6, 16, -6, 15, -4, 16, 24, -20, 12, 2, 2, 7, -23, 20, -12, -8, 5, -2, 6, -15, 1, 2, -24, 11, 4, -8, 12, -12, 20, 1, -9, 26, -4, 16, 5, 7, 32, -6, 26, 19, 4, 26, 8, 9, 19, -8, 20, 6, 11, 0, -8, 24, -14, -1, 9, -14, 8, -9, 0, 7, -18, 16, -4, -8, 3, -4, 24, -15, 1, 10, -2, 11, -12, 15, 10, 4, 19, 3, -1, 14, -1, 21, 10, -4, 20, -8, 14, -1, -4, 12, -15, 12, 0, -11, 2, -22, 3, -4, -23, 14]
3251A4k8J2mpK7k8J6Jj0K2j3PKj6K1j7J5J0j5J5k7J1J1j6QrOJj5K3j5jLk0K7k2
3287a1J0J3k4J5j0MJ3k5J5rLJ7l0K0oNjpJ5lJJ2j5J3Lj8J3j2J8rj2K2j4jJ0j7
3323bJ9k5J4kj6J5j3QKj0J1rOLqJ1j1NKj0J5llOj1J8pjMmJ7j1qK0k1K2j6kJ0j5
3363@J9j4oJ6j8Nj1JJ2j6NLnPnOMj6J3oNLj6K5j4J1J2k0PKLJrRJj1LJJ0j2KMq
3406CPonlKOj1nJ8j4J3j2pQrJ1Oj2OJKLj1K4j1j%nPkJ7j2JOrmJ1rJJ1rJ1k2J5
3450A1j1KkjknMJ3j5J2lj2J7j6J4pOKj6J6mkO%J2j5OJ2j5jj%Mj1RJj3J2oR%nJ1
3493A6j6M%j0J4plNj4J2j3J2Rj7J8olNkoKQJ0j1J3j0Qjj9J5jNj1pJ4lnMj0J9p
3534A1j0jmJ4j0mJ0j6J4ok0K9j3J0n%J1mJJ1j1MlPPj6J2j1J8j6oJ7omMj0Ln%J
$$ y = [14, -14, -2, -6, -13, 14, -14, 2, 3, -7, 15, 2, 9, 11, -5, 16, -1, 14, 24, 9, 24, -3, 8, 19, 3, 11, 2, 8, 9, -6, 17, 2, 1, 4, -16, 11, -11, -1, 12, -12, 3, -7, -3, 10, -15, 0, -9, -6, 11, -19, 1, -5, 0, -1, -8, 7, 4, 5, 17, 2, 15, 18, 0, 13, 1, 19, 10, -2, 20, 6, 5, 15, -2, 17, -8, 6, 4, -12, 3, -10, -2, 0, -10, 1, -8, -2, 1, -7, 4, -7, -2, 0, -10, 5, 2, -1, 5, -6, 12, 5, 4, 8, 4, 21, 10, 2, 22, 1, 23, 7, 5, 15, 0, 19, 5, -1, 15, -3, 2, -9, -8, 4, -12, -7, -4, -9, -2, -7, -1, 3, -13, 0, -6, -1, 2, -14, 11, -3, 8, 20, 0, 7, 9, 12, 13, 4, 13, 14, 3, 6, 7, 17, 5, 7, 11, 3, 10, 4, -1, -4, -2, 4, -7, -12, 6, -8, 5, -7, -14, -6, -15, -4, 2, -10, -4, -3, -1, 2, -9, 15, 4, 3, 3, -2, 5, 3, 20, 8, 9, 15, 6, 2, 13, 4, 5, 16, 7, 18, -4, 11, 0, 2, 0, -1, -3, -8, -4, 9, -6, 6, 3, -9, 8, -8, 6, -1, 5, 7, -9, 7, 3, 1, 7, 7, 19, 4, 10, 22, 7, 6, 5, 5, 9, -2, 7, 8, -5, 7, 1, 10, 10, 5, 16, 0, 4, 4, -6, 8, 1, -2, 3, -11, 1, -12, 0, 9, -8, 10, 4, 1, 6, 4, -2, 0, 8, 18, 7, 20, 10, 18, 17, -2, 13, 12, 17, 6, -1, 13, 10, 5, 9, -1, 18, 11, 1, 0, -4, 10, 0, -4, 6, -10, 4, -2, -22, 7, -6, 4, -1, -1, 10, 6, 7, 18, 7, 11, 8, 15, 22, 6, 18, 7, 25, 9, 3, 20, 14, 10, 14, 4, 7, 2, 2, 3]
3574CnKmNnpJ8j4LkkOrPJ1qlNPOj2NmKPj4J9oqK1k6J5pkJ7j7J0j0J0kj3J4qj2
3618gPj2J1%j4K0r%Jj0J8j9jJ7j5L1j8%RqJ4j7OJ1rJ2j0MJ5j4Lj3ONj0NlqK3k8
3658gRkNj4oJ7%j6K2j9J0onJ0pJJ6j9J6j4K1j3KOj2NJ3j5K1j6MlnJ9qOnj3RrM
3699BOk4K4j5oJ8j4J0o%Oj9J6LJnPJqJK0jmkjMj5J8Mj6J6j9K2nj4J1j3OKmLj9
3741iK2pj2J3k6J7mj6K4j7JQjOlKJlJ1j1RRj4J2Kmmj0J9nNJ1k0J0rkJ2j2KlNK
3783A1j4NJnRj3OjqJ5pRorJ2rPllJ3lJLj2K0j5NKj0J7lNj4nNkQOj0%oNnj3J1j1
3829a1LLkMJj2J2p%KkJ0pPNoQqO%KLpJ0llJ8k3J3j0mJ0j1kOLjj2Qjj2J0j1N%K
3875dLpQKj2J3%KRj7J5qjJ0pJ0mjQnj0lJ0PpLj0J0Lj1nrJ2MmknqJ3j6J4Pk0J4
$$ y = [3, -2, 0, -4, 1, -4, -11, 7, -7, -4, -6, -8, -2, -11, -4, 7, -1, -4, 1, 8, 14, 2, 7, 3, 5, 12, -2, 17, 11, 3, 24, -2, 13, 6, 4, 21, 4, 14, 4, 14, 12, -1, 13, 5, -7, 0, -12, -1, -1, -15, 5, -4, -4, -3, -13, 5, -14, -15, 2, -13, 18, 0, 0, 9, 1, 15, -2, 4, 15, 6, 18, 8, 12, 27, 13, 16, 3, 9, 14, 4, 9, 6, -2, 21, -7, 2, 0, 5, -9, -15, 2, 2, -14, 8, -11, -1, -7, -12, -2, -9, -8, 8, -11, 5, -9, 12, -1, 1, 7, -5, 0, 13, -2, 19, 3, 7, 4, -1, 18, 10, 16, 11, -2, 7, -2, 2, 8, -16, 8, -7, -13, 5, -9, 1, -5, -5, 1, -18, -2, 1, 2, -3, 4, 5, -3, -2, 18, 17, 13, 11, 10, 14, -1, 17, 21, 5, 21, 2, 24, 19, 5, 16, 3, 9, 11, 7, 10, -9, 13, 6, -6, 7, -19, -2, -6, -22, 2, -15, -14, -6, -7, -1, -4, -2, -1, -4, 7, -4, 5, 14, 0, 12, 14, 10, 6, -4, 15, 10, 15, 26, 6, 16, 7, 5, 17, 5, 7, 4, 9, 11, -3, 2, 3, -2, 7, -6, 0, -1, -9, 6, -1, 8, 2, -7, 5, -4, 3, 0, -3, 10, 7, 8, 11, -1, 19, 4, 9, 11, 1, 18, 15, 20, 6, 1, 6, 4, 12, 18, 8, 8, 2, 7, 2, -11, 0, -11, -8, -5, -7, -3, -2, -14, -2, -9, -9, -7, -9, 1, -6, 1, 6, 0, 8, 0, 6, 6, 8, 11, 4, 14, 11, 8, 26, 3, 16, 6, 2, 12, 1, -1, 5, 8, 7, -5, 3, 2, -10, 0, -11, -6, -6, -4, -1, -8, 0, 2, -10, 3, 3, 5, 14, -3, 12, 4, 3, 13, 6, 16, 12, 11, 19, 14, 4, 1, 11, 18, 11, 14, 4, 14, 17, 6, 1, -8, 4, 8, 4, 2, -3, -11, 2, -14, 0, 7, -13, 1]
3919AoJjNqJ0J2qlmMJ0qMKoMjJ0poJMj0Q%jRk1J2Rj5%nK5k7nM%MMllLKNlJ5k2
3968eLQj1OJ9np%J1%mp%NlQrj2J9rJqJJ0k0J2Kj2J0omJ0j5J0okJ4j0l%NNJ2j2
4012APmRj3RLlJ1pOpj2PmJ9nj6MmljLNj2J3j2R%okLJrJ7j3J4k%ljJ2L%j0LOqQ
4060A6j4RJ1j7NkLnlJ0oKKoppJ1Mj3MJKkj1KK2j3J%JrJ4l%JJ8k0J0pQljQj3QO
4106A7oMj0Mkj0J1jj0LqJ1ljmJJ0omkLJmOKrJ1mLOnO%oJ0j7J1oLJ1j2Mo%k%LP
4154A0rjLj3J7rOj1jPqJ5j3O%%MnPNj1J1kJkkPjlKoPPrNj9J4nJRj7J0Mk0J1Qr
4201AKm%qPNj8K1j4J2j1jRoJ7oj4J6rPJ0rJ4j2RJj3QNoJ3k1J2olJnpJ3rLoNj6
4245a3J2KlklLQm%lJ0Nj1lLPknQQrJ2m%j5MQJMook%jLMj1O%oj0KJ1pN%J0j1NP
$$ y = [1, -5, -4, -5, 0, -8, 2, 14, 6, 3, -1, 3, 13, 5, 9, 11, 5, 9, 8, 18, 11, 5, 6, 10, 0, 8, 8, 7, 16, -5, 7, 16, 1, 1, -4, 21, -6, -11, -7, -7, -3, 1, -2, -5, -2, 0, 5, 2, 17, -5, -2, 6, -5, 1, 20, 15, 8, 8, 19, 19, 15, 8, 8, 13, 10, 18, 9, -3, 16, 7, 8, 0, 1, 11, -9, 3, 5, -7, 3, -3, -7, 3, -12, -2, -8, -10, 4, -6, -9, -9, -4, 1, 13, 1, 8, 4, 13, 0, 9, 12, 9, 20, 13, 19, 12, 0, 7, 3, 22, 17, 1, 5, 1, -2, -3, 0, 5, -7, 6, -6, 3, 3, -3, -5, -2, -1, -10, 7, -6, 8, 6, 6, 3, 2, 14, 17, 17, 7, 10, 16, 8, 16, 2, 11, 22, 5, 10, 8, 11, 6, 3, 13, 7, 9, 11, 5, -2, -9, 2, 6, -7, -3, -2, 0, -2, -13, -11, 11, -2, -1, -1, 0, -9, 5, 2, 2, 3, 21, 1, 11, 4, 12, 9, 8, 16, 3, 11, 17, 11, 15, 5, 9, 7, -3, 8, 7, -3, 0, -8, 3, 0, -1, -5, -4, 6, 0, -4, -6, -3, -2, -6, 0, 2, -7, 4, 0, 3, 9, 4, 10, 10, 4, 14, -3, 8, 2, 5, 16, 4, 8, 2, 2, 0, 0, 3, 10, 1, 0, 3, -10, 7, -2, 4, -7, -8, -1, -9, 6, -7, -1, -1, -1, 3, -2, 5, 10, -1, 10, 8, 9, 7, 5, 12, 11, 8, 10, 4, 11, 18, 9, 14, -5, 9, 4, 5, 14, -3, 7, 11, -9, 2, 10, 1, 3, -1, -1, -9, -2, 3, -15, 6, -8, 4, -7, -8, 1, -5, 12, 6, -8, 8, -1, 6, 16, 7, 21, 9, 18, 19, 6, 14, 19, 13, 26, 5, 17, 11, 8, 9, 4, -3, 10, 1, 4, -2, 3, -13, -1, 1, -2, -4, -7, -4, 4, 0, 0, -3, 7, 12, 1, -2, 1, 8, 6, 1, 9, 17, 8, 20, 16, 16, 1, 5, 13, 14, 18, 12, 6, 4, 4, 3, 6, 10, -1, 5, 5, -1, -11, -9, 2, -5, 0, 0, 10, -1, 4, 11]
4295A1k0J0LmPoNNKj2RpRj1LkJ0qLnjOpkl%oPmJMjPnPolLLnJOKpRj5J0JkQmKk
4348F%JLkn%J0Kq%nRnMj2%QqlmQjjJplRnOPj1QkJMoKmMPjLRj9JJkPOJj0QnNj8
4403fJ3j8J4q%nJQn%jjJ2lmm%Nj0J6kj3K3j3PrJ3mkJ1omJ4j2PmmNj2J0omlQmO
4449Fj5PqnKRoNrQlPLJLj1ORj0NLlJ8j8OqK0nNj6lJ0qnRjooOLomPjlKkjnJ2jk
4501AJlJjMlQ%j3RKNlKj%lLojokJ2rJ1lpKnjJ2j6KLj%jKomQpJ7pj1J2NK%jNj1
4553cRLj1J5kJoPj1%jKKkMnQqKqKjjQj2kJ2nJjJ%rNLkJ0nRj1KMoQQrkMjJ7j1Q
4605B0kqoNqKlmkLLj4QJ0Kj1KOknNj4J2qJ9lnRoO%mQj0NnJJ2j2kKKlnlJ5j1Pj7
4654iJ0MlKj2PqjPlJlNKLnKlOJ0j0jNOqPlJ1k0KJ3mmj0J3JKoPrQj2%nKJ1j5nP
$$ y = [11, -9, 1, 4, 0, 7, 1, 6, 11, 13, 1, 10, 3, 12, 1, 4, 2, 12, 4, 7, 2, 1, 7, 0, -2, -5, -5, -11, -4, -8, -7, -3, -4, 3, -2, 5, -1, -4, -1, 2, -3, -2, 4, 6, -1, 8, -7, 3, 4, 2, 10, 6, 8, 6, 6, 7, 10, 8, 3, 3, 13, 15, 7, 7, 2, 11, 6, 10, -2, -2, 6, -2, -5, -9, -1, -2, -3, -2, -9, -12, -3, -8, -2, 5, -6, 2, 0, 1, 5, -1, 1, -3, 1, 8, 7, 10, 19, 0, 1, 2, 0, 7, 13, 14, 4, 12, 7, 12, -6, 7, -11, 3, -5, -5, -10, -9, -1, -6, -6, -7, -8, 4, 1, -3, -7, -7, -2, -12, 4, 2, -11, 12, -1, 6, -3, 10, 6, 4, 15, 9, 5, 19, 7, 14, 10, 6, 11, -1, 9, 3, -1, -4, 4, 0, 6, -9, -2, -10, -15, -13, -4, -10, -5, -14, -6, -9, -2, 1, 2, 5, -6, 0, 9, -1, 4, 7, 4, 22, 4, 10, 2, 22, 17, 22, 6, 3, 13, 5, 0, 9, 8, 2, -4, 2, 5, -1, -5, 2, 1, -2, 0, -2, -3, -8, 4, 3, 1, 2, -1, 0, -1, 3, 0, 8, 8, -5, 4, 6, 11, 8, 10, 9, 9, 6, 9, 3, 2, -4, -6, 6, -3, 8, 5, -2, 0, -5, -6, 6, -10, -8, -5, -6, -6, -7, -5, -11, -15, -7, -14, 3, -4, -15, -3, 2, 4, 4, 3, 8, -3, 6, 9, -2, 13, 11, 12, 6, 13, 2, 2, 1, 3, 5, 3, 7, 2, 10, 2, 4, -4, -2, -3, -4, 4, -8, -10, 2, -3, -2, -3, -2, -2, -11, -6, -3, -5, 5, 0, 9, -2, 0, 4, -2, 6, 14, 5, 3, 7, 6, 23, 12, 20, 18, 10, 4, 9, 1, 3, 0, -4, -6, -3, 0, -14, -6, 4, 6, -5, -3, 3, 1, -4, 1, -13, -1, -9, 10, 7, 2, 11, 5, 11, 11, 7, 15, 5, 10, 5, 6, 18, 6, 4, 6, 8, 5, 0, -3, 12, 1, 8, -9, 1, 5, 2, 4, -8, -1, -9, -10, -3, -6, -5, -8, -3, -1, 2, -3, -1, -4, 2, 12, 2, 1, 6, 12, 4, 11, 8, 19, -1, 1, 14, 10, 6, -4, 9, 10, 12, 6, 13, 4, 12, 0, 0, -5, -3, 8, -7, -12, -5]
4703elJ0jqJ5j6oJ4j3K0j1MJ0oLpJ3lQoLpNmKPrnNj3PkP%Jk2J0%NJKp%%nJ0lL
4751CoMRj0mJ1%OqMJjQmNr%Llj%j0N%LlkLpjjMNpJ%j3J3mM%LKmJ1j1QjnJOMnP
4805A4KOj4J2jnppJ6omJnRj0jnOKoJ0rmRj2J1j2LPpNjRoOqQLJnM%LlLjMl4K9l
4855GkmJ1rLJ1k0MqJ4j4KlJ1j3NNKj7J4JjPrlRLJjNJnM%lj1J3JlQj0J0pploJP
4903A%qJ1j3LQLnm%pNLK%nMQj0OQMjoJnNrjMNKpM%nQLoo%Oj0n%OJMqPrlOLqNP
4960BnNKoJJQj0J1LoOnNj3J4j5QNkq%LQj6LpLJ2j1lrJ0mLmLOJMJjNj0J0qO%%L
5010IpJ0knJRoKmjJ3j4nLMlMj7J5lj9RQlokLmRjKJO%%pKrJ0rJ2lKMQlNqmMLrr
5063ejJ9j0K%pMmjjNPk0OJ1oL%j2JRoMNnK0j0j9K0rJ1j1Qn%KjLjkNPj1KmqJ2j1
$$ y = [-5, -8, 2, 1, -7, 8, -8, -14, 0, -13, 7, -4, 0, 10, 4, 7, 0, 13, 10, 18, 12, 15, 8, 13, 9, 11, 18, 9, 4, 9, -4, 3, 1, 8, 8, 9, -13, -3, -3, 2, 3, 5, -2, -2, -2, -7, 3, 0, 3, -3, 1, 10, 0, -4, 7, 7, 13, 5, 9, 10, 9, 17, 13, 18, 9, 9, 12, 9, 8, 8, -2, 3, 3, 6, 3, 1, 4, -3, -4, -5, -1, 4, -3, -2, -2, -15, -2, -6, -2, -2, 1, 3, -1, 10, -1, 7, 6, 1, 2, 8, 12, 7, 14, 16, 22, 8, 20, 19, 14, 7, 0, 16, 10, 6, 7, 2, 11, 1, 0, -5, 1, 3, -3, 7, -2, -6, 3, -9, 2, -10, -7, 0, -7, -2, -3, 6, 0, 6, -2, 6, 9, 10, 5, 9, 9, 12, 9, 12, 11, 15, -19, 10, 7, 5, 1, 12, 3, 6, 17, -3, 1, -7, 7, -7, -5, -8, 3, -10, -5, 0, 2, -15, -1, 0, -1, 6, -3, -6, 3, 6, 7, 6, 11, 12, 7, 11, 11, 8, -3, 10, 11, 8, 16, 6, 16, 9, 2, -1, -7, -6, 1, 1, -7, 4, -9, -6, 2, 5, 0, -4, -4, -11, -6, -3, -1, -1, -6, -2, 6, -4, 2, 10, 14, 13, 7, 8, 3, 8, -1, -2, 2, 7, 9, 2, 6, 6, 1, 9, 12, 6, 0, 0, 6, -4, -9, -9, -3, -2, 2, -6, 1, -8, -11, -5, -2, -10, -5, 2, -3, 2, 4, -2, -1, 0, 8, -2, 9, 12, 6, 12, 7, 12, -1, 13, -2, 6, 11, 9, 1, 1, 4, 12, -4, -1, -8, -5, 7, -4, -7, -16, -6, -10, -7, -11, -8, -2, -1, 3, 4, 3, 8, -2, 8, 0, 6, 6, 6, 9, 2, 12, 10, 5, 6, 15, 9, 11, 7, 6, 19, 5, 0, 3, 7, 4, 8, -9, 6, 3, -16, -7, 1, -2, -8, -10, -7, -11, -2, -3, -1, 0, 6, 6, 6, -1, 1, -8, 2, -7, 5, 2, 4, 8, 16, 13, 18, 10, 6, 10, 13, 4, -5, -6, 13, 3, 5, 5, -2, 2, -2, -3, -4, 1, 8, -12, -6, 5, -1, 2, 2, -10, -9, 0, -6, -2, 3, -2, 18, 8, -11, 9, 0, 11, 0, 8, 3, 3, 5, 4, 7, 6, 4, 9, 16, 5, 7, 3, -5, 7, -4]
5111dNKKllrjRkk%JpKJ6loJlOOQmMj0%kJ0lKJj2NmNjnOokPp%kJj2QRmoMqKJRj2
5167a1MkJ2j1QPnPk0J4QoLlmkORlnm%PlmlllNnj%MNkjNqJpOQNrLmJJ5pMkmQj6
5221cOrQlOj0QJ8j7J0j0Lj0pJ2kpMJjl%MJorKJ2%JqMPQnJ%kjMOmKkNn%j0J1%J
5272A1j1kLRj6JojJ0pnJ6MnMj0jJ0mmJ2kj3KJ5qKOJj1J3j1Mj2J5lnLjKrRmj1N
5317eMj%mj0J8qjNj1MPj1J3jLoKl%R%Loj%J6qj5J7%llJ1rNonkRqjkJQolpJ5j0
5367fNj3JJRKorJ4LoJ7onK%LKkL%lMpNNj3NKJRj5nJKjJ0j8QJlNkj4J7pjJ0MJj6
5418fJ0llQj5J8j0J7nJj1NLlmLQJj1MKk3J6Nm%l%Mljm%lmOKqKOqJ4%%JOj0KJ1
5467A3j0%MJ3j0nRj0KNrlJ5j5Nkj1OmOpJKKJpRpJ0j1J1mNj2J%OONlkM%JqJ1kj0
$$ y = [-4, 1, 3, 5, 2, -1, -10, -11, -2, -4, -6, -6, -5, -12, -10, 6, 3, -3, -2, -5, 1, 7, 15, 11, 15, 5, 5, 3, 13, 10, 12, 13, 1, 6, 2, 7, 6, 1, 7, 1, -1, 6, -1, -1, -3, -2, -14, -6, 3, -1, -7, -3, -11, -9, -8, 1, -11, -7, -9, 3, -8, 0, 7, 2, 9, -11, 3, 11, 5, 8, 5, 1, -1, 5, 14, 11, 6, 2, 2, 9, 6, 2, -1, -4, -7, -2, -7, -8, -8, -4, 1, -1, -2, 3, -5, -4, -11, -5, 3, 8, -1, 2, -2, -1, 14, 7, 11, 9, 5, 13, -3, 3, -6, 2, -1, 5, -5, 3, 21, 4, 14, 4, 7, -3, -10, 2, 0, -7, -3, -2, -3, -6, -6, -2, -1, -7, -16, -14, -2, -2, -1, -9, -5, 2, 10, 5, 6, 6, 4, 3, 7, 13, 9, 11, 9, 14, 9, 9, -1, 10, 10, 11, 0, -2, 1, 10, -6, -5, -11, -12, -2, -9, -14, 2, 6, 1, 5, -5, -6, 4, 0, -4, 8, 6, -7, -5, 10, 2, 4, 10, 11, 0, 13, 2, 6, -6, 9, 6, 1, 4, 3, 5, -4, 5, 1, -10, -5, -1, -2, -2, -6, -16, 2, -6, -7, -2, -13, -9, -2, -13, 0, -1, 2, -4, -2, -5, -5, 4, 4, 7, 1, 0, 0, 16, 8, -7, 10, 10, 7, 4, 15, 6, 11, 5, 0, -2, 7, -1, -2, -4, -3, 5, -1, -4, -11, 4, -6, -1, -14, -13, -12, -3, -1, -7, -16, -2, 1, -5, 12, 6, 1, 3, 3, 6, 8, 6, 9, 9, 6, 10, 3, 8, 13, 0, 5, 7, 8, 17, 2, -3, -2, 0, -1, 9, -9, -1, 0, -3, 2, 0, -14, 3, -4, -5, 5, 9, 10, -6, 4, 1, -2, 6, -9, 9, -1, 16, 11, 12, 1, 6, 9, 6, 2, 5, 13, 14, 3, 7, 9, -14, 2, 7, 3, 3, 0, 0, 4, 1, 0, -4, -4, -7, -11, -5, -3, -11, -9, -3, -11, 3, 3, 3, 4, 10, 0, 2, 13, 3, 3, 7, 20, 10, 5, 14, 4, 6, 11, 2, -1, 14, -1, 4, 2, -9, -3, -7, -1, -8, -7, -5, -3, -2, -9, 0, -7, 3, -8, 3, -1, 4, -8, -7, -7, -1, 5, 10, 7, 5, 9, 9, 10, 2, 13, 11, 1]
5515AJ5j5nMRroJM%OqjJjj4J4pJ3qPkLpJLmJ1poOOkKLJLqJ1jn%Pj0klRpMrPnO
5568FpKmqLQj1RqOj0J1%pJ4opMOOMj4J1OpPmqOJJjMj0Pn%KOpo%j0J6j1Mj0RPj3
5618hJ2%j2J%QjPlmjQ%lJ4j2jkJ7k2J7JOj0j5R%Kj1KnJ3j5OrJL%LLmoMKJpK2o
5666EkqkJ1kMj0J3nQojnRj1OkmJlJ0Mj2J0mrJ2lr%Rj4J0oQppLJ1LrO%OKmJ2j6
5714BJ1pJLjpJ0j2Mk%MJ4rj5MoJ3pk%MqMOpnLlLNmmPMlK%oR%mJ2lLo%mJnMjjo
5768eQJ0k0RNj0kkQoJJ0j4KJ5roQkj1J7kpJ0koQp%KMqJ8oqJ3kj2Rj1QmNK%qJl
5816@OJnnJJrK0j7oMKmJQJjNpM%OkRj4J1m%J5j4Pj6J3looMN%mKJn%Oj3KmKJ2m
5867@Oj1QNqNlLljmJMKKQmLlkKJpkjLlomQKqJ0j1nNJMqkLjJ1Jr%NJ3jj9RNNj4
$$ y = [1, 16, 1, -4, 0, 9, 0, -6, -5, -1, -1, 5, -3, -4, -3, -4, -18, -4, -11, 2, -6, 1, -1, 2, -5, -4, -1, -5, 6, -1, -7, -1, 5, 3, 5, 8, 9, 12, 4, 15, 14, 9, 9, 16, 6, 4, 1, 10, 3, 7, -2, 5, 0, 6, -1, 1, -3, -11, -8, 0, -11, -2, -10, -4, -14, -3, -3, -10, 4, -2, -9, -5, 1, 7, 11, -3, 8, 14, 7, 14, 10, 2, 8, 9, 10, 9, 13, 3, 10, 5, 5, 7, 13, 6, 0, 0, -10, 6, -5, -1, -11, -2, 5, -8, 4, 4, -8, -7, -7, 1, 0, 7, 4, 0, -1, 7, 7, 4, 18, 6, 5, 3, 20, -2, 15, 16, 22, 12, -3, 6, 6, 8, -3, -1, -6, 7, -8, -2, -11, -10, -7, -7, -4, -1, -5, -11, -7, -5, -4, -11, 11, 5, 3, -5, -7, 4, 2, 6, -4, 9, 4, 12, 6, 5, 0, 9, -2, 4, 2, -2, -1, -4, 6, 10, -2, 8, 4, -5, 7, 4, -5, -5, 4, -10, 0, -6, 2, -5, -12, -9, 2, 5, -4, 2, 2, 8, 10, 6, 18, 2, 13, 6, 7, 10, 9, 2, 12, 0, 4, 2, 2, 6, 20, 11, -4, 0, -6, 7, 0, -2, -2, 2, -6, -2, 4, -3, -8, -5, -8, -5, 0, -4, -8, -1, 3, 0, 2, 2, -4, 5, 5, 1, 13, 10, 13, 7, 7, 3, 4, -1, 3, 2, 1, -5, 3, 13, -7, 2, 7, -3, -5, -7, 1, -5, -4, 6, -8, -6, 9, 0, -6, 2, 0, -11, 6, 4, -3, 7, 5, -1, 7, 0, 0, 2, 6, -2, 16, 10, 2, 15, 13, 1, 10, -1, 7, 3, 8, 10, 10, 2, 3, 0, 6, 7, 2, -3, -2, -1, -10, 10, -7, -13, -9, -7, -11, -10, -2, -1, -2, 3, -4, 0, 0, 6, 4, 13, -1, 10, 6, 6, 21, 7, 14, -2, 11, 8, 2, -4, 0, 5, 5, 1, 3, 4, -1, -1, 5, -8, -6, -10, -8, 4, 0, 6, -5, 3, 8, 0, 5, 2, 5, 2, 1, -3, -2, 2, 4, 6, 14, 10, 13, 10, 8, 10, 11, 4, 2, 1, 4, 1, -5, -9, -1, 1, -7, 3, -8, -13, -8, -7, -3, -11, -13, -10, -11, 0, 1, -8, -8, -3, 10, 9, -10, -1, 4, 9, -5]
5921eJ7j5J5qJ1j2oJ0mj1QJ1mJj2J1j3PpLoNOmplK3j5kJ2rojNQpKOjpPKmK%ll
5968c%JLOkj3K1k3J7omKMjmPqjKOrnLnK1j4jQoJkOrLJ2pJlNQrlJ1oLkMpNMmj0
6020c%Qj3LOrJ0nqPknLOnLLqKOonK0qM%mKkQnlO%QqpLQqOrNjknJ3lj3lKRpqMJ
6076iQok%pMJ6j2PnJ4pjNJ1j8J0jLOj3MQpoJ5j7kQkrQkkrKLLpLKpJ3nPQroJJ2
6126A0klRj3LRMj0NpKLOrmMlJJLrJkLj0%%NKj2J2lNoOoQOj1MmOlLQnpR%MlNpn
6180CoJ4rjQJqmkoJ4Mlj1OmjmPrJ3j6JK0j7LJ2plK2j1KpJ0o%KqJ0qnJ0%Jj2Nl
6227cnMlPj4J5j4J4j1J3j3KqQJKooM%J2kMMMj4QPj3QLlkM%PJlMj4klJKlKMpnN
6277dJ2k0J3%nLJOj8J7moJ5j4J0qjkQKLnMj0NkmQ%k%NMkj5M%mLmJ7j0j1KLKLN
$$ y = [-5, 12, -3, 12, 4, 15, 3, -3, 7, 3, -8, 0, 11, 7, 8, -4, 7, -6, 1, -6, -3, -9, -4, 2, -2, -9, -12, 11, -4, -6, 6, -3, -9, -10, -5, 3, -4, -2, 4, 3, -4, 3, 5, 1, 3, 3, 0, -3, -3, -2, 1, 7, 5, -8, 13, -10, 7, 1, -3, -1, 3, 2, -2, 5, -3, -4, -2, 4, -5, -10, -7, -12, 9, -5, -6, 2, -4, -3, -5, 1, -8, -5, 7, 0, 1, -2, 3, 11, 2, -1, 10, 4, 7, 5, 9, 2, 7, 11, 7, -3, -3, 5, -8, -5, 1, -8, 2, -3, -11, -4, -6, -11, -8, -2, -7, -4, -1, -9, -7, -1, -7, -12, 8, 0, 4, 4, 0, 2, 0, 8, 3, 0, 6, 6, 14, 6, -1, 2, 10, 2, 8, -1, 4, 3, 1, -4, 9, 6, -7, -10, -8, 1, -6, -14, -10, -9, -1, -7, -9, -9, -16, -12, 4, -8, -1, -6, 8, 1, 0, 5, 16, -2, 8, 7, 10, 16, 3, 7, 15, 8, 2, 17, 0, -2, 6, 4, -5, 3, 1, -1, -10, -8, -5, -2, -9, -6, -4, -11, 2, -3, 4, 12, 3, -3, -2, 10, 8, 5, 14, 1, 4, 13, 17, 7, 12, 5, 7, 10, 16, 7, 3, 7, 4, 5, 6, 9, 0, 1, -1, 2, -8, -8, -8, -3, -1, -13, -1, -4, 1, -5, 1, -5, 3, 9, -2, 2, -2, 4, 1, 4, 12, 7, 0, 9, 9, 13, 10, 15, 8, 3, -3, 11, 2, 1, 9, 10, 2, -2, -4, -10, 4, 8, 5, -6, 0, -4, -5, -9, -2, -11, 2, -14, -13, 7, -10, -7, 5, -2, -5, 17, 6, 8, 1, 11, 5, 5, 7, -1, 9, 1, -4, 6, 6, 7, -5, 0, -3, -8, -4, -7, 0, -14, 1, -13, 1, -10, 3, -10, -8, -16, -8, -7, -5, -11, -17, -13, -13, -1, -3, 1, 5, 9, -5, 3, 10, -3, 5, 8, 5, 3, 7, 7, 14, 15, 12, 16, 2, 0, -3, -2, 0, -3, -1, 3, -4, -9, -4, 8, -12, 1, 1, -4, -1, 0, 6, -12, 5, 1, -5, 10, -4, 6, -2, -3, -5, 3, 5, 8, 3, 7, -3, 2, 0, -4, 4, 4, 2, 2, 7, 11, 9, -6, -2, -2, -6, -3, -7, 10, 0, -11, -9, -6, -4, -1, 4]
6325Dj1QlJKKl%nRkMMKJqjljOQj0OpLlkLoKknPmJ1j0j4J1Jj3J3lJ1ojJjoKMOK
6377DjjkNnJ0kkmOQlpOqnJJ0j0%jMlqLmJ2qkJ3j0NnkPpJ7j6Rj0lKJ0lQnPrOLk
6428HnLj3mOK1j8L%kMmrRmNqjPj8J6jrJ0KLnKoJ8j3LlLKMLjn%Pj2RmjRj2Qmn%
6479bokRmP%njk%JOLljnOQoj1PMj0R%jjJkJ5opjMK%kj2J6mqkJ6%rmnJJ2j6MOj4
6532a5NNllRLj1J0jPm%J%OOlj1%OlOj4kK0qnlNmj1%J2j0kRllMOj2QlmJ0JlJj2
6581a3ONKKmN%JjJLQJj6lMONj9K5j3rM%Rqj1J0lkpQ%Oj1lOQ%kkrJ4KnKjnRNnl
6633BNJjLMqqQkj1J6j3j0MOJmnNoKRlKlj2J2nJlPJJ0%%pjlOPo%K%KQjj7MJLjJ
6686C%kLj0KmJ3qj4J1nLNpmOjNOj0MMKPMnqPmjMJjJKj7Oj0J1NqmLkJQqn%kQnJ
$$ y = [4, -7, 1, -2, -1, 1, 3, 0, 0, -5, 4, 2, 6, 10, 12, 13, 5, 4, 1, 0, 6, 14, 4, 10, 3, 6, 3, 1, 4, -2, 0, -2, -7, 0, -4, 7, -3, -17, -6, -5, -18, -5, -8, 3, -3, -4, -3, -4, -10, -8, -4, 2, 4, 3, 2, 0, 5, 0, 10, 8, 6, 2, 8, 16, 13, 6, 12, 4, -1, 0, 10, 0, 0, -1, 3, 0, -8, -5, -9, 3, -5, -7, 6, -4, 1, -4, -6, 1, -6, 11, -5, 4, -6, -9, -7, 3, 0, 8, 3, 10, 1, 7, 10, 8, 3, 6, -7, -11, -5, 16, -2, 1, 1, -1, 3, -1, -10, -1, -5, 0, -8, -9, -2, -20, -4, -5, -14, -4, -2, 1, -4, -2, -8, 10, -3, 0, -3, 0, 2, 6, 9, 8, 3, 3, 10, -2, 7, 3, 2, 11, -1, 7, 3, -2, -2, -8, -10, -1, -5, 2, 2, -3, -4, -6, -6, -5, 1, 4, 1, 0, -5, 1, 9, 3, -8, -1, 3, -7, 2, 2, 1, 0, 1, -1, 14, 8, 1, 0, 4, 6, 6, 4, -8, 8, 4, -4, -6, 10, 10, 1, -3, -8, -7, 5, -11, -7, -1, -15, -10, -5, -8, -11, -2, 1, -10, 0, -1, 6, 2, 2, 3, 3, 9, 15, 12, 1, 1, 7, 4, 10, -4, -6, 14, 6, 1, -2, 3, -1, -12, -12, 0, -10, -12, -3, -6, -9, -5, 1, -11, -3, -6, -10, 0, 1, -2, -1, -13, -7, -2, 0, 2, -2, 3, 3, 4, 3, 4, 7, 15, 16, 0, -3, 1, 7, 12, -7, 18, 5, -4, 0, 0, 9, 1, -10, 0, -3, -5, -12, -4, -4, 2, -9, -12, -6, 2, 2, 0, -2, -11, 3, 5, 0, 2, 1, -4, 5, 10, 5, 2, 7, 8, 7, 10, 14, 6, -2, 6, 4, -7, 9, -4, -14, -10, -4, -3, -7, -12, -7, -13, -11, -2, -5, -3, -6, -18, -6, -11, -10, -13, -6, -5, 5, 5, 5, -2, -3, -6, 0, 7, 1, 1, 3, 3, 5, 13, 12, -5, -1, 0, 3, 2, 3, 3, 1, 4, -6, -4, -8, 5, -3, -17, -6, -11, -8, -3, -10, -14, -8, -9, -4, 2, -8, -4, 0, 2, 9, 13, 8, 0, 7, 3, 2, 6, 7, 6, 7, 9, -8, -2, -12, -1, 4, -4, -8, -5, -7, -6, 2, -6, -11, -11, -13, -5, -10, -9]
6739iJ1kmJlJoMPjqJ0K%KJJoklN%pPpJ4j1QlkrKOjolJJJ2j2KnOnLQMj4%LRnLK
6793BoJ6j2JpJ0Pj1J0lj0MlLjpnJ5Jj0RoJJj2RJj1OklLLqRQlpNPnqJ6oNj1QpJ0
6842FqJkP%pjMm%%%lNJ0j7M%kNoJjpJ0j0PJJ0pNolNQj0QoPjj4J0NKp%pJ3rKOj0
6894fpJ5j6NmRpKJJNnjJ2qjmjOKlLkRmJ3pOj2Nn%Pj3RkLkoKKoLnJnJ0j2NQpkM
6947eQj1J1oj4J1%KpQKqJ2Qlj3J0KloJ6j6jP%KoOojkPjn%lkMklOqNLqNOMj4J3
6997DMrMNoJLkMrRj0RkQrLNj1lLNpk%jnNPpQj1Oj4J2%JjPnLJn%kJ3j1KJ0lnkR
7050IroJ0%Qj0Oj8J1oQJj6J3j3J1j3mOLrJ7lmjKmOJ0pljPkQmkOkKoN%mRrR%pJ0
7100A4j3J0k5J9olk%Lj4K7j5lnNRjRnj0KJ2okOoPmj%%nOkNnNqMNrjjjKN%rPjq
$$ y = [-9, 2, 0, -4, -3, -6, -5, -11, -7, 0, -1, -9, 1, 3, 3, 5, 6, 7, 1, -1, -4, 1, 1, -6, 1, -6, 8, -3, 5, 2, 0, -9, -7, -1, -2, -8, -11, -10, -9, 3, -9, -7, -12, -6, -11, -8, 0, 4, -10, -10, -7, 2, -3, 0, 2, -4, 12, 0, 1, -6, 4, 11, 0, 10, 7, -3, 1, -2, 1, 0, -7, -12, 3, 4, -6, 3, -3, -2, -1, -13, -4, -3, -14, -8, -10, -13, -10, -7, -15, -6, 2, -1, -8, -3, 4, -1, -9, 7, 1, 6, -5, 3, -4, 6, -2, -1, -3, 4, 4, -3, -4, 0, -4, -4, -4, -4, -7, -2, 8, -9, -5, -5, -7, -2, -8, -7, -8, -15, -5, -15, -8, -7, 3, -4, 1, -5, -8, -3, 5, -5, 3, -3, 4, 3, -11, -1, 4, 6, -1, -1, -8, 5, -4, -2, 4, -6, -13, 2, -14, -9, -13, -4, -11, -9, -8, -7, -2, -7, -8, 4, -4, -5, -9, -10, -4, -2, -5, -2, -4, 5, 1, 14, 7, 13, 1, 6, 1, 1, 8, -5, 4, 2, 5, 3, -3, -1, 1, -5, -2, -7, -6, -11, -1, -13, -8, 0, -7, -9, -5, 3, -8, 3, -3, -17, -6, -6, -4, -11, -3, -1, -9, 3, 11, 8, -5, 5, 7, 4, -2, 14, -2, -3, 4, 4, 6, 0, 6, 0, -1, -3, 4, 3, -2, -2, -5, -7, -3, -5, -8, -2, -10, -5, -2, -10, -5, 1, 5, -9, 4, 8, -1, 3, 8, 2, 3, 6, 4, 8, -1, 8, -2, 7, 5, 13, 4, 7, 12, 1, -2, 1, 6, -1, -3, -3, -4, -9, -4, 3, -4, 4, -7, -1, -15, -3, -3, -2, -3, 4, -1, 2, 3, -2, -2, -4, 9, -2, 0, 10, 7, 2, 0, 9, 0, -6, 4, 4, 12, 2, 8, -10, 1, -5, 3, 4, -12, 1, -12, -1, -14, -18, -12, -9, -18, -1, -4, -8, -9, -7, -11, -5, 5, -2, -5, -6, 1, -1, 7, 3, 1, 7, 5, 7, 1, 6, 6, 2, 11, 2, 11, 11, 4, 14, 1, 11, -14, 5, -1, -4, -6, -6, -3, -17, 10, -5, -8, -13, -8, 1, 0, 9, 4, -6, -4, 8, 2, 0, 6, 0, 7, 3, 2, 2, 2, -3, 3, 1, 6, 1, 6, -2, 2, 7, -2, -3, -4, -5, -3, 2, 2, -7, 0, -1, -9]
7151iNqMlJNKJn%PpLKmJJ6ljLj2KJOpOoKJ%mLqRnjjRqkPJj0%mMOokN%JO%mkOm
7209amJ3j1NlRjMlLj8%J1Rj5jK%oMNj2QpNlOmkOj1J1rJ3Mjl%NnK%rJ2j3JJ5kl
7258FojKlQKpjnjKj5J7rOnNqOmN%pJ2KpqJ3k%KLMJqNnJ4j6QrNJ0pkQMj8MlJ1j1
7310cLkLJj4LJ0mrQMJloL%KJ0qJ5lj0OjjJrRJ4j4Pnmj1LLllLLPjj0J1j0kOnJr
7360a3J4Jqk%OLj3J6LmpMOkNJnjkOpKPrNr%J0rMoJ1rJk%LlpO%kmPOlqkQpJ0lQ
7414Fj0LQoLj7J3J0Kj1J4j3QpJlKKj0PLj2QLj4PQj2Pj1JKNRj8J2%NmjOrMmJ2l
7460F%kKkj4K4j1MmkMj0J9j2jj1J2j0K%pJ2j4MMNj2jPOkOpJ2j4%OqJ4qOomQnK
7506bkkMLmK0j6nnP%oPn%Lj4PL%J0kj1JMMlLJ2pmMNkKo%JJ2j6MmkLRonqJ1j5J8
$$ y = [-9, -4, -12, -8, -11, -10, -5, -3, -2, -7, -7, 0, -7, -4, -2, -6, -5, 11, 8, 7, 10, -2, 0, 1, 7, 0, 6, 0, 2, 3, 3, -1, 2, -6, 3, -2, -3, -4, 5, -3, -5, 2, 3, -7, -7, -11, -7, -1, -7, -9, -4, -4, -3, 3, 3, -1, -3, 3, -1, -5, 8, -3, 2, -1, 8, 7, 11, 8, 11, -7, -7, 4, 13, -2, -3, -1, -1, -7, -3, 2, -10, -2, -9, -4, -7, -1, -5, -7, -1, -12, -1, -10, 3, 7, 6, 3, 3, 8, 3, 5, 5, -4, 8, -5, -4, 11, 9, 6, 0, -1, 1, -2, 6, 8, 1, 0, -5, -6, -4, -19, -2, -11, -5, -10, -5, -13, -7, -11, -6, -6, -13, -1, 1, -6, -14, -1, -3, -3, -1, 2, 6, 7, -1, 4, -1, 13, -3, 5, -4, 1, 11, 4, 2, 10, 14, -4, 0, -3, 8, -3, 0, -2, 1, 2, -12, -9, 1, -3, -12, -4, 0, 1, -2, -8, -5, -5, -3, 7, -1, 14, 11, 1, 7, 6, 5, 6, -3, 6, 20, 6, 13, 8, 4, -7, -4, -1, -4, -7, -4, -1, 6, 5, -5, 6, -4, -6, 0, -5, -4, -13, 1, 2, -6, -8, -8, -2, 1, -12, 4, 7, 3, -4, 0, 6, 4, 9, 10, 5, 4, 2, 8, 1, 3, 10, 1, 6, -3, -3, 7, -2, 2, -4, 7, -2, -1, -3, -3, 0, -3, -10, -4, -4, -6, -10, -3, 3, 0, -8, -10, -2, -9, 1, -2, 6, -4, -1, 7, 1, 4, -13, 0, 10, 12, 1, 15, 2, 10, 3, 4, 1, 3, 5, -5, 2, 5, -7, 1, 4, -10, -3, 5, -7, 0, -11, -10, -8, -3, 6, -12, 0, 0, 5, 1, 0, 6, -3, 1, -3, 9, 6, 6, 4, 6, 4, -10, 14, 3, 7, 3, 1, 5, -5, 14, 2, 1, -10, 2, -8, -6, -6, -13, -1, -15, -11, -7, -2, -14, -15, -8, -2, -4, 2, -5, 7, -7, -7, -1, -9, 5, -3, 3, -3, -7, 1, -4, -2, -4, -6, -2, 1, -3, 17, 1, -4, -9, -2, -2, -8, -1, -6, -6, -3, -17, -10, -7, -7, 3, 1, -10, -9, -5, -1, -4, -1, 11, 4, 0, 4, 9, 7, 9, 3, 3, 4, 16, 0, 4, 0, -2, 1, 10, 4, -1, -9, 2, -13, 5]
7557EpoRlLj1PMQlj0Nj5J1pKNRpLpLRqNoR%j1J0LnQnrQJmMj3NnJJ1kkkrNOlj%
7610brJ0plPlMMrkNjJ1qQkjPmoLjrJ6pJ1pm%L%kj4MkKlLjNMjl%nNNoMmlJPoLo
7666iJ9jnpP%NjlmjLj3J1Ooj1%NJoqRRm%qJ0j2jJ1Mj1jJ1qMnLNNj8J5Pj1OpjJ0
7715DjlJ0oqkNmrOMrKQjMrQlj3J0j%OlLmLrLJ0%nRrMNLKnoMo%JJm%KnQkLkOKj1
7772dmJ0l%rNLj0kJ2Mkl%%OOkpRpNjOrjKJmNJj0OkrPlJJjj1LjkJQloRNJ%JlKm
7828cLJ%lOkkKJQklklJLkJOj3qJ7kmnj6J8lPJqK%MOj5PJ2j5nPnkJ0mRnRj2OMj1
7880dJ3j3OOqpJ1njMOj3QkNj5JJJ0qMqLJ2j6JOJjqOJ8j1%QnqpK3qjpjlJ8rmJN
7929Dj1MJ7k0QmnJ0k1J1QpJ%%NPj3%nMlPNrJ5pOmJ0j9J4pmKQmmPrJ0%j0oJ5rP
$$ y = [5, -2, -8, 1, -2, 1, -10, -3, 1, 9, 6, -4, 1, -14, -3, -10, -8, -3, 6, -1, 2, -5, -2, 7, -1, 4, -2, 7, 7, -4, 6, 9, 4, 12, 7, -2, 6, 7, 3, 7, -6, -1, -6, -5, 6, 4, 2, 0, -9, -4, 2, -1, -2, -2, -11, -1, -8, -11, -4, -7, -3, 1, -8, -10, -5, -6, 5, -3, 5, 3, 2, 9, 5, -1, 2, 1, -8, 8, 1, 12, 5, 1, 1, 4, 4, 2, -12, -8, -10, -8, -11, -8, -9, -4, 0, -1, -4, -4, -9, -4, 1, -5, -1, -5, -8, -7, 0, -6, -3, -9, 10, 9, 4, -3, 4, 4, 9, 8, 5, 1, 0, 3, -10, 1, 7, 1, -10, -10, -5, -4, -10, -18, -9, 0, -4, -4, -12, -2, -14, -15, -4, 0, -11, -12, -1, -9, -5, -10, -7, -2, 3, -15, 0, 7, -4, 2, -5, -6, 4, 3, 0, 10, 4, -4, -6, -1, -5, -14, -8, -4, -13, -11, -3, -4, 0, -9, -1, -4, -17, -7, -8, -8, -2, -5, -2, -6, -3, -12, -9, 1, 1, -4, 5, -4, 0, 5, 8, 10, 5, -1, 3, -3, -3, -2, -1, -5, -5, -3, -8, 0, -2, 1, -1, 5, 7, -4, -8, 2, -1, -1, -10, -5, -2, -12, -14, -2, 2, 0, -3, -3, -3, 3, 9, 7, 0, 9, 2, 7, 6, 12, 3, 2, 4, 5, 1, 6, 7, -3, 3, 1, -8, -1, -4, -3, -2, -3, -14, -11, -12, -14, -13, -5, -8, -14, -5, 0, 1, 1, 2, -1, 1, -3, 0, 1, 1, -2, 4, 2, 0, 2, 3, 11, 9, 6, 4, 1, 2, 5, 3, 4, 10, -3, -11, 6, 4, 0, -5, -21, -3, -6, 1, 2, -6, -4, -4, 0, 6, -9, -2, 10, -5, -10, -3, -8, -10, 0, -4, 5, 0, 9, -3, 3, 7, -4, 9, -4, 2, 8, 0, -7, 4, -1, -2, 2, 8, -5, 3, 1, 6, -9, -8, -7, 3, -5, -1, -9, -6, 6, -10, -9, -3, -2, -3, -11, -5, 13, 2, 2, 10, 5, -3, -10, 13, 5, 4, -3, -4, -7, 11, 2, -2, -1, 4, -7, -3, 14, -6, 2, -2, -7, 3, -18, -7, 1, -6, -5, -5, -5, 0, 7, -6, -6, -11, -7, -10, -3, 2, -7, 8, 1, 7, 3, 13, -6, 8, 1, -3, -1, 7, 3, -1, 6, -3, 7, 7, -3, -9, 6, -3, 4]
7976Dj3%KkpJ0mLj1J3OroRKj1J7noO%M%KM%jj1K%nNJMlOPj1ooJRpnlJ3lKj2J3
8026bq%jkJ5lolNkMJ1Kj2kRlmJ8j8RJplkJ1j0LjqKjQqQJjKJrJ0j2%LKJ%kJ0Jj0
8077cKJ2oJ3j7J2lmMolmOMj0J4nOj6NLml%lPppJ1Nlj1J5j2oJ0%J0lQj3J2oLjP
8123A3j1LqJ0JKj0J7j4KkOoloRj2PklKLKlJOlojpJ8%j8J4qJ0qJ7npJ0j5PLnlJ
8170bNMKnK%o%lJ2j2JJJnKnMQnk
$$ y = [4, -9, -9, -7, -9, -16, -6, -10, -7, -18, -5, 1, -8, -14, -5, -3, -14, 3, -2, -8, -2, -2, 2, 2, 4, 8, 8, 7, -4, -2, -2, -7, -2, -1, 3, 0, 6, 13, 2, -4, -10, -9, 0, -7, -12, -15, -2, -5, -3, -15, -2, -10, -10, -11, -13, 2, -1, -7, -10, -5, -7, -3, 8, 10, -2, -4, 5, 2, -2, 16, -2, 7, 8, 1, -2, -4, 7, -3, 0, -1, -9, -7, -8, 0, -8, 0, 1, 0, 2, 3, -6, 4, -8, -8, -5, -3, -2, -2, -4, 6, 7, -3, -1, 11, 5, 18, 1, 13, 10, 6, 10, 4, 1, -3, 3, 7, -3, 11, 6, 12, -4, 1, 4, 0, -3, -3, -6, 1, -6, -13, -2, 3, 0, -11, 4, -8, -14, -4, -4, 6, 3, 11, -2, 10, 4, 7, 6, 13, 2, 5, -3, 7, 8, 10, 0, 17, 3, 5, 3, 9, 3, 0, -6, 3, -9, -2, -4, -7, -5, -2, 0, -3, -2, 4, 1, -5, -6, -13, 5, 5, -13, 1, -7, 3, -5, 12, 7, 0, 10, -5, 2, 5, 0, -3, -2, 3, 7, 9, 4, 6, 6, 0, 0, -3, 9, -3, -2, -1, 0, -5, -3, -8, -4, 4, -1, -3]
8191c
##END NTUPLES=NMR FID
##END=
