##TITLE=1H_ES-AN-EtG-st
 
 8 sc, 
 21.1.2022
##JCAMPDX= 6.0         $$ Bruker NMR JCAMP-DX V2.0
##DATA TYPE= NMR FID
##DATA CLASS= NTUPLES
##ORIGIN= UXNMR, Bruker Analytische Messtechnik GmbH
##OWNER= root
$$ XWIN-NMR		Version 3.5
$$ Fri Jan 21 12:31:34 2022 Russian Standard Time (UT+4h)  she@DPX200
##.OBSERVE FREQUENCY= 200.131346
##.OBSERVE NUCLEUS= ^1H
##.DELAY= (6, 6)
##.ACQUISITION MODE= SIMULTANEOUS
##.ACQUISITION SCHEME= undefined
##.AVERAGES= 8
##.DIGITISER RES= 18
##SPECTROMETER/DATA SYSTEM= spect
##.PULSE SEQUENCE= zg30
##.SOLVENT NAME= DMSO
##.SHIFT REFERENCE= (INTERNAL, DMSO, 0, 15.7039)
##AUDIT TRAIL= $$ (NUMBER, WHEN, WHO, WHERE, WHAT)
$$ ##TITLE= Audit trail, XWIN-NMR		Version 3.5
$$ ##JCAMPDX= 5.01
$$ ##ORIGIN= Bruker BioSpin GmbH
$$ ##OWNER= she
$$ F:/spectra/data/she/nmr/H-F/1/audita.txt
$$ ##AUDIT TRAIL=  $$ (NUMBER, WHEN, WHO, WHERE, WHAT)
(   1,<2022-01-21 12:30:01.59 +0400>,<she>,<DPX200>,
      <created by zg, POWCHK disabled, PULCHK disabled
       configuration hash MD5:
       00 E9 B6 7A A2 85 ED C7 34 08 36 98 17 FE 4E 26
       data hash MD5: 16K
       D1 95 DD 82 88 B2 A5 93 0A DF 0E 72 03 C1 CF 0B>)
$$ ##END=
$$ 
$$ hash MD5
$$ A9 B9 8A 49 72 ED AF 58 43 BE 0F 74 40 FD 98 0A
##$RELAX= 
##$RELAX= 
##$RELAX= 
##$RELAX= 
##$RELAX= 
##$RELAX= 
$$ Bruker specific parameters
$$ --------------------------
##$DU= <F:/spectra>
##$EXPNO= 1
##$NAME= <H-F>
##$PROCNO= 1
##$TYPE= <nmr>
##$USER= <she>
##$AMP= (0..31)
100 100 100 100 100 100 100 100 100 100 100 100 100 100 100 100 100 100 
100 100 100 100 100 100 100 100 100 100 100 100 100 100 
##$AQSEQ= 0
##$AQ_mod= 1
##$AUNM= <au_zg>
##$AUTOPOS= <>
##$BF1= 200.13
##$BF2= 200.13
##$BF3= 200.13
##$BF4= 200.13
##$BF5= 200.13
##$BF6= 200.13
##$BF7= 200.13
##$BF8= 200.13
##$BYTORDA= 1
##$CFDGTYP= 0
##$CFRGTYP= 5
##$CHEMSTR= <none>
##$CNST= (0..31)
1 1 145 1 1 1 1 1 1 1 1 1 1 1 1 1 1 1 1 1 1 1 1 1 1 1 1 1 1 1 1 1 
##$CPDPRG= <>
##$CPDPRG1= <>
##$CPDPRG2= <>
##$CPDPRG3= <>
##$CPDPRG4= <mlev>
##$CPDPRG5= <mlev>
##$CPDPRG6= <mlev>
##$CPDPRG7= <mlev>
##$CPDPRG8= <mlev>
##$CPDPRGB= <>
##$CPDPRGT= <>
##$D= (0..31)
0 1.2 0 0 0 0 0 0 0 0.06 0 0.03 0 0 0 0 0.0002 0 0 0 0 0 0 0 0 0 0 0 0 
0 0 0 
##$DATE= 1642753801
##$DBL= (0..7)
120 120 120 120 120 120 120 120 
##$DBP= (0..7)
150 150 150 150 150 150 150 150 
##$DBP07= 0
##$DBPNAM0= <>
##$DBPNAM1= <>
##$DBPNAM2= <>
##$DBPNAM3= <>
##$DBPNAM4= <>
##$DBPNAM5= <>
##$DBPNAM6= <>
##$DBPNAM7= <>
##$DBPOAL= (0..7)
0.5 0.5 0.5 0.5 0.5 0.5 0.5 0.5 
##$DBPOFFS= (0..7)
0 0 0 0 0 0 0 0 
##$DE= 6
##$DECBNUC= <off>
##$DECIM= 32
##$DECNUC= <off>
##$DECSTAT= 4
##$DIGMOD= 1
##$DIGTYP= 9
##$DL= (0..7)
0 120 120 120 120 120 120 120 
##$DP= (0..7)
150 150 150 150 150 150 150 150 
##$DP07= 0
##$DPNAME0= <>
##$DPNAME1= <>
##$DPNAME2= <>
##$DPNAME3= <>
##$DPNAME4= <>
##$DPNAME5= <>
##$DPNAME6= <>
##$DPNAME7= <>
##$DPOAL= (0..7)
0.5 0.5 0.5 0.5 0.5 0.5 0.5 0.5 
##$DPOFFS= (0..7)
0 0 0 0 0 0 0 0 
##$DQDMODE= 0
##$DR= 18
##$DS= 0
##$DSLIST= <SSSSSSSSSSSSSSS>
$$ [...]
##$SUBNAM2= <"">
##$SUBNAM3= <"">
##$SUBNAM4= <"">
##$SUBNAM5= <"">
##$SUBNAM6= <"">
##$SUBNAM7= <"">
##$SUBNAM8= <"">
##$SUBNAM9= <"">
##$SW= 18.0517287032376
##$SWIBOX= (0..15)
0 0 2 0 0 0 0 0 0 0 0 0 0 0 0 0 
##$SW_h= 3612.71676300578
##$TD= 16384
##$TD0= 1
##$TE= 0
##$TE2= 300
##$TE3= 300
##$TEG= 300
##$TL= (0..7)
0 120 120 120 120 120 120 120 
##$TP= (0..7)
150 150 150 150 150 150 150 150 
##$TP07= 0
##$TPNAME0= <>
##$TPNAME1= <>
##$TPNAME2= <>
##$TPNAME3= <>
##$TPNAME4= <>
##$TPNAME5= <>
##$TPNAME6= <>
##$TPNAME7= <>
##$TPOAL= (0..7)
0.5 0.5 0.5 0.5 0.5 0.5 0.5 0.5 
##$TPOFFS= (0..7)
0 0 0 0 0 0 0 0 
##$TUNHIN= 0
##$TUNHOUT= 0
##$TUNXOUT= 0
##$USERA1= <user>
##$USERA2= <user>
##$USERA3= <user>
##$USERA4= <user>
##$USERA5= <user>
##$V9= 5
##$VALIST= <valist>
##$VCLIST= <CCCCCCCCCCCCCCC>
##$VD= 0
##$VDLIST= <DDDDDDDDDDDDDDD>
##$VPLIST= <PPPPPPPPPPPPPPP>
##$VTLIST= <TTTTTTTTTTTTTTT>
##$WBST= 1024
##$WBSW= 4
##$XGAIN= (0..3)
0 0 0 0 
##$XL= 0
##$YL= 0
##$YMAX_a= 293421
##$YMIN_a= -334572
##$ZGOPTNS= <>
##$ZL1= 120
##$ZL2= 120
##$ZL3= 120
##$ZL4= 120
##$ABSF1= 10
##$ABSF2= 0
##$ABSG= 5
##$ABSL= 3
##$ALPHA= 0
##$AQORDER= 0
##$ASSFAC= 0
##$ASSFACI= 0
##$ASSFACX= 0
##$ASSWID= 0
##$AUNMP= <proc_1d>
##$AZFE= 0.1
##$AZFW= 0.1
##$BCFW= 1
##$BC_mod= 2
##$BYTORDP= 1
##$COROFFS= 0
##$CY= 11.3945322036743
##$DATMOD= 1
##$DC= 2
##$DFILT= <>
##$DTYPP= 0
##$F1P= 2.36226072786647
##$F2P= -0.459571619588291
##$FCOR= 0.5
##$FTSIZE= 0
##$FT_mod= 4
##$GAMMA= 1
##$GB= 0.15
##$INTBC= 1
##$INTSCL= 1
##$ISEN= 128
##$LB= 0.24
##$LEV0= 0
##$LPBIN= 0
##$MAXI= 10000
##$MC2= 0
##$MEAN= 0
##$ME_mod= 0
##$MI= 1.114404
##$NCOEF= 0
##$NC_proc= 0
##$NLEV= 6
##$NOISF1= 3.799351
##$NOISF2= 2.8
##$NSP= 1
##$NTH_PI= 0
##$NZP= 0
##$OFFSET= 15.70392
##$PC= 1
##$PHC0= -15937.53
##$PHC1= -6.599225
##$PH_mod= 1
##$PKNL= yes
##$PPARMOD= 0
##$PSCAL= 0
##$PSIGN= 0
##$REVERSE= no
##$SF= 200.130013532006
##$SI= 16384
##$SIGF1= 3
##$SIGF2= 2
##$SINO= 400
##$SIOLD= 16384
##$SREGLST= <1H.CDCl3>
##$SSB= 0
##$STSI= 0
##$STSR= 0
##$SW_p= 3612.71676300578
##$SYMM= 0
##$S_DEV= 0
##$TDeff= 0
##$TDoff= 0
##$TI= <>
##$TILT= no
##$TM1= 0
##$TM2= 0
##$TOPLEV= 0
##$USERP1= <user>
##$USERP2= <user>
##$USERP3= <user>
##$USERP4= <user>
##$USERP5= <user>
##$WDW= 1
##$XDIM= 8192
##$YMAX_p= 0
##$YMIN_p= 0
$$ End of Bruker specific parameters
$$ ---------------------------------
##NTUPLES= NMR FID
##VAR_NAME=  TIME,          FID/REAL,        FID/IMAG
##SYMBOL=    X,             R,               I
##VAR_TYPE=  INDEPENDENT,   DEPENDENT,       DEPENDENT
##VAR_FORM=  AFFN,          ASDF,            ASDF
##VAR_DIM=   8192,          8192,            8192
##UNITS=     SECONDS,       ARBITRARY UNITS, ARBITRARY UNITS
##FACTOR=    0.0002768,     1,               1
##FIRST=     0,             0,               0
##LAST=      2.2672688,     0,               0
##MIN=       0,             -334572,         0
##MAX=       2.2672688,     293421,          0
$$ Real data points
##PAGE= N=1
##DATA TABLE= (X++(R..R)), XYDATA
$$ plain form
0 0 0 0 0 0 0 0 0 0 0 0 0 0 0 0 0 -8 0 -8 8 -8 8 -8 12 -16 16 -16 24 -24 32 -32 38 -44 48 -55 60 -68 76 -84 94
39 94 -108 118 -131 144 -160 176 -194 213 -235 260 -286 314 -347 381 -423 469 -521 582 -655 740
59 740 -840 969 -1132 1347 -1641 2071 -2754 3962 -6515 14048 -80247 -334572 -17388 221405
73 221405 -2958 -73202 156334 54917 -260732 -102340 270234 128513 -204458 -85424
83 -85424 128127 -39429 -132733 134694 182482 -154018 -200699 127408 159787 -104457 -67273
94 -67273 134349 -6626 -191428 27745 217093 -23751 -194425 31964 138059 -77265
104 -77265 -92888 138961 80813 -174666 -79201 173500 60513 -150745 -13296 135031 -45387
115 -45387 -138661 85766 143764 -100752 -130101 103576 93028 -112414 -46459 132765 10648
$$ packed form
0@%%%%%%%%%%%%%%%qQqJ6j6J6j6K0k8L2l2M0m8N6o4P0q2R2j03J15j28J44j60J78
39I4k02K26k49K75l04L36l70M07m48M95n46O00o61P28q04Q92r90J103j237J395
59G40j580J809k101K479k988L712m825O716j0477K0563r4295k54325L17184K38793
73B21405k24363p0244K29536j01417l15649J58392L72574j41721l32971J19034
83h5424K13551j67556r3304K67427M7788l36500m6681L28107L2379k64244L7184
94f7273K01622j40975j84802K19173J89348k40844j70674K26389J06095k15324
104g7265j5623K31849n8148k55479R5465K52701j12987k11258J37449J48327j80418
115d5387r3274K24427N7998k44516k9349K33677j0548k05442O5955J79224j22117
$$ plain form
126 10648 -150497 10136 150703 -26498 -131861 49786 104715 -81358 -82458 109953 67075
137 67075 -124652 -50311 125057 24872 -118920 8319 114321 -40485 -111432 63773
147 63773 103611 -78070 -86003 88670 60224 -100070 -32849 111039 9307 -116118 10409
158 10409 111731 -29858 -99379 51195 83547 -72434 -67713 88941 51515 -97957 -32557
169 -32557 100318 9864 -98874 14328 95377 -36287 -89100 53774 78099 -67095 -61934
180 -61934 77736 42476 -86295 -22543 91568 3769 -91785 13828 86481 -30939 -76985
191 -76985 47355 65007 -61673 -51621 72124 36707 -78116 -19994 80135 1935 -79088
202 -79088 15996 75290 -32245 -68396 45998 58081 -57225 -44729 66093 29547 -72305
$$ packed form
126A0648j61145J60633J40567j77201j05363J81647N4929j86073j100J92411m2878
137F7075j91727P4341J75368j00185j43792J27239J06002j54806p0947J75205
147F3773L9838j81681p933J74673k8446j60294O7221J43888j01732j25425J26527
158A0409J01322j41589o9521J50574L2352j55981M721J56654l7426j49472O5400
169c2557J32875r0454j08738J13202Q1049j31664n2813J42874K4325j45194N161
180f1934J39670l5260j28771O3752J14111q7799r5554J05613P2653j17420m6046
191g6985J24340J7652j26680J0052J23745l5417j14823N8122J00129p8200q1023
202g9088R5084N9294j07535l6151J14394J2083j15306J2496J10822l6546j01852
$$ plain form
213 -72305 -13761 75164 -1858 -74166 17035 69407 -31445 -61568 44419 51464 -55102 -39584
225 -39584 62701 26210 -66955 -11739 68126 -3077 -66416 17340 61979 -30158 -54819 41080
237 41080 45217 -49885 -33688 56396 20979 -60344 -7848 61441 -5210 -59615 17788 55049
249 55049 -29414 -48146 39573 39372 -47709 -29061 53444 17561 -56596 -5404 57193 -6826
261 -6826 -55286 18482 50967 -29007 -44362 37948 35817 -45046 -25795 50005 14829 -52588
273 -52588 -3506 52696 -7683 -50352 18313 45734 -27894 -39178 35957 31045 -42185 -21726
285 -21726 46312 11598 -48238 -1186 47964 -9042 -45607 18610 41221 -27102 -35093 34189
297 34189 27496 -39638 -18861 43193 9570 -44769 -76 44286 -9220 -41829 17936 37534
$$ packed form
213g2305N8544Q8925p7022p2308R1201N2372j00852l0123J05987P045j06566J5518
225c9584J02285l6491r3165N5216P9865p1203o3339Q3756M4639r2137k4661R5899
237D1080M137r5102J6197R0084l5417q1323N2496O9289o6651n4405P7403L7261
249E5049q4463j8732Q7719k01q7081J8648Q2505l5883p4157N1192O2597o4019
261f826m8460P3768L2485p9974j5355Q2310k131q0863J9251P5800l5176o7417
273e2588M9082N6202o0379m2669O8665K7421p3628j1284P5135m912p3230K0459
285b1726O8038l4714n9836M7052M9150n7006l6565O4217K2611o8323p991O9282
297C4189o693o7134K0777O2054l3623n4339M4693M4362n3506l2609N9765J9598
$$ plain form
309 37534 -25678 -31655 32104 24480 -36942 -16352 39989 7613 -41161 1284 40446 -9935
321 -9935 -37911 17945 33696 -24979 -28020 30711 21159 -34939 -13521 37475 5410 -38274 2735
334 2735 37285 -10599 -34644 17790 30496 -24040 -25090 29027 18654 -32626 -11539 34657
346 34657 4060 -35086 3441 33912 -10623 -31240 17137 27207 -22747 -22025 27197 15943
358 15943 -30334 -9273 32014 2313 -32202 4596 30919 -11165 -28249 17101 24347 -22132
370 -22132 -19426 26062 13714 -28748 -7490 30035 1065 -29947 5287 28526 -11254 -25813
382 -25813 16579 22012 -21041 -17294 24467 11886 -26695 -6069 27668 97 -27355 5745
394 5745 25818 -11224 -23137 16060 19457 -20062 -14964 23071 9881 -24978 -4439 25688 -1073
$$ packed form
309C7534o3212n977O3759p624o1422K0590N6341l2376m8774M2445L9162n0381
321i935k7976N5856J5751n8675l041N8731r552n6098K1418N0996l2065m3684M1009
334B735L4550m7884k4045N2434J2706n4536j050N4117j0373n1280K1087M6196
346C4657l0597l9146L8527L0471m4535k0617M8377J0070m9954P22M9222j1254
358A5943m6277K1061M1287k9701l4515L6798K6323m2084j7084M5350P246m6479
370b2132K706M5488j2348m2462K1258L7525k8970l1012L5234K3239l9780j4559
382b5813M2392N433m3053L747M1761j2581l8581K0626L3737k7571k7452L3100
394E745K0073l7042j1913L9197L397l9519N098L8035j3190l4859K0539L0127k6761
$$ plain form
407 -1073 -25241 6438 23634 -11399 -21007 15748 17469 -19312 -13215 21916 8440 -23482 -3394
420 -3394 23947 -1712 -23326 6638 21653 -11173 -19035 15111 15614 -18271 -11554 20547 7035
433 7035 -21845 -2294 22119 -2455 -21388 7009 19690 -11171 -17145 14728 13863 -17570 -9996
446 -9996 19553 5755 -20612 -1333 20718 -3060 -19902 7250 18171 -11018 -15677 14223
458 14223 12515 -16713 -8841 18409 4861 -19259 -715 19205 -3365 -18275 7217 16537 -10669
471 -10669 -14099 13579 11055 -15826 -7576 17288 3806 -17960 59 17793 -3854 -16831 7395
484 7395 15116 -10559 -12754 13181 9855 -15172 -6561 16435 3017 -16924 583 16647 -4102
497 -4102 -15611 7354 13905 -10238 -11598 12585 8797 -14322 -5670 15378 2339 -15716 1042
$$ packed form
407a073k4168L1679J7196l5033r608L6755J721l6781O097L5131j3476l1922K0088
420c394K7341k5659k1614K9964J5015l2826p862L4146N03l3885O717L2101j3512
433G035k8880J9551K4413k4574j8933K8397J2681l0861n974L1873q65l1433P574
446i996K9549j3798k6367J9279K2051k3778j6842K7152J0921k9189m659K9900
458A4223j708k9228P872K7250j3548k4120J8544J9920k2570j4910K5492R320k7206
471a0669l430K7678k524k6881Q250K4864j3482k1766J8019J7734k1647j2977K4226
484G395P721k5675k195K5935l326k5027Q611K2996j3418j9941J7507J6064k0749
497d102j1509K2965O551k4143j360K4183l788k3119Q652K1048j3039j8055J6758
$$ plain form
510 1042 15343 -4299 -14290 7309 12589 -9931 -10366 12038 7697 -13587 -4750 14473 1635
523 1635 -14702 1515 14251 -4506 -13181 7266 11520 -9652 -9378 11540 6848 -12881 -4062
536 -4062 13621 1128 -13715 1788 13207 -4569 -12105 7108 10451 -9258 -8385 10953 5948
549 5948 -12122 -3313 12723 548 -12740 2185 12147 -4765 -11018 7080 9425 -9039 -7410
562 -7410 10543 5101 -11545 -2611 12000 15 -11904 2520 11262 -4888 -10122 6984 8536
575 8536 -8746 -6599 10057 4388 -10896 -2030 11209 -391 -11037 2725 10327 -4910 -9173
588 -9173 6823 7620 -8403 -5769 9539 3672 -10241 -1455 10453 -798 -10201 2961 9481 -4954
602 -4954 -8347 6685 6855 -8102 -5096 9106 3097 -9685 -1009 9821 -1086 -9507 3091 8746
$$ packed form
510A042J4301j9642r991K1599N280k2520m35K2404m341k1284Q837J9223j2838
523A635j6337J6217J2736j8757q675K0447M254k1172K74K0918m692j9729Q819
536d062J7683j2493j4843J5503J1419j7776p536J9213L343j9709Q73J9338n005
549E948j8070Q809J6036j2175j3288J4925R962j6912o253J8098K345j8464J629
562g410J7953n442j6646Q934J4611j1985j1919J4424Q742j6150n234J7106J552
575H536j7282K147J6656n669j5284Q866J3239j1600j0646J3762P602j5237m263
588i173J5996P97j6023K634J5308n867j3913Q786J1908j1251r403J3162O520j4435
602d954l393J5032J70j4957L006J4202o009j2782Q676J0830j0907q421J2598N655
$$ plain form
616 8746 -4951 -7620 6524 6160 -7787 -4440 8653 2530 -9126 -573 9158 -1408 -8781 3256
630 3256 7998 -4957 -6866 6370 5440 -7481 -3804 8221 2009 -8573 -181 8517 -1653 -8105
644 -8105 3347 7305 -4880 -6221 6141 4844 -7116 -3295 7740 1614 -8017 99 7912 -1790
658 -1790 -7465 3354 6672 -4760 -5601 5916 4289 -6790 -2808 7328 1206 -7537 414 7388
672 7388 -2010 -6920 3454 6117 -4744 -5057 5780 3785 -6539 -2362 6986 859 -7117 657
686 657 6883 -2120 -6374 3440 5574 -4594 -4550 5493 3312 -6150 -1985 6486 582 -6561 813
701 813 6312 -2169 -5786 3368 4996 -4411 -4013 5234 2859 -5804 -1602 6090 269 -6121 1040 5857
717 5857 -2295 -5324 3404 4550 -4366 -3594 5094 2469 -5599 -1265 5809 7 -5753 1222 5440
$$ packed form
616H746j3697k669J4144l64j3947L347J3093o123j1656Q553R731j0566p373J2037
630C256M742j2955j909J3236r30j2921L677J2025o212j0582Q392Q698j0170o452
644h105J1452L958j2185j341J2362j297j1960L821J1035o126r631Q116P813r702
658a790n675J0819L318j1432q41J1517j627j1079L982J0136o122q743P951O974
672G388r398m910J0374K663j0861l13J0837j995j0324M177R348o127p976P774
686F57O226r003m254R814K134j0168M4J0043k181r462M165Q471n904p143P374
701H13N499q481l617R154J628r407L98R247k375q663M202P692n821o390P161M817
717E857q152l029Q728J146q916P72Q688k625q068M334P074n802n760O975M218
$$ plain form
732 5440 -2365 -4890 3374 4117 -4222 -3183 4837 2100 -5243 -970 5390 -182 -5288 1308 4946
747 4946 -2353 -4402 3270 3651 -4008 -2776 4568 1771 -4893 -696 5005 -372 -4892 1419 4532
762 4532 -2380 -3992 3218 3276 -3906 -2420 4380 1441 -4674 -439 4726 -592 -4570 1564 4186 -2457
778 -2457 -3633 3221 2904 -3810 -2069 4213 1136 -4428 -181 4410 -772 -4211 1661 3801 -2455
793 -2455 -3248 3121 2556 -3638 -1754 3978 894 -4122 -16 4100 -862 -3872 1678 3472 -2405 -2936
809 -2936 3003 2249 -3486 -1505 3758 675 -3894 153 3812 -998 -3583 1756 3174 -2435 -2637 2969
825 2969 1967 -3392 -1234 3621 439 -3697 364 3588 -1137 -3316 1830 2895 -2429 -2354 2912 1702
841 1702 -3238 -994 3417 258 -3436 465 3289 -1170 -3018 1784 2589 -2333 -2080 2738 1450 -3039
$$ packed form
732E440p805k525Q264P43q339J039Q020k737p343M273O360n572n106O596L638
747D946p299k049P672L81p659J232P344k797o664M197N701n377m520O311L113
762D532o912j612P210N8p182J486O800k939o115M235N165n318l978O134K622o643
778b457j176O854l17o714J741O282l077n564M247M591n182l439N872K140o256
793b455p93O369n65o194J884N732l084n016M106M116m962l010N550J794n877n31
809b936N939p54n735J981N263l083m569M047L659m810k585N339J418n609k02N606
825B969j002n359K158M855l182m136M061L224m725k179N146J065n324P5N266j210
841A702m940K244M411l159l694L901K824m459j848M802Q05m922K53M818j288m489
$$ plain form
857 -3039 -796 3181 99 -3176 579 3016 -1230 -2745 1812 2340 -2305 -1834 2683 1233 -2948 -598
873 -598 3027 -66 -3007 706 2823 -1319 -2536 1845 2107 -2284 -1612 2600 1037 -2803 -444 2882
889 2882 -191 -2817 771 2603 -1328 -2304 1790 1884 -2188 -1410 2456 880 -2630 -317 2646 -262
905 -262 -2585 803 2387 -1319 -2083 1754 1684 -2106 -1232 2349 717 -2494 -182 2511 -361 -2420
921 -2420 874 2200 -1347 -1913 1749 1522 -2056 -1063 2258 576 -2370 -60 2360 -451 -2259 920
937 920 2025 -1367 -1729 1712 1335 -1993 -905 2153 429 -2240 40 2204 -527 -2077 942 1852
953 1852 -1348 -1556 1658 1189 -1890 -775 2050 321 -2093 125 2052 -568 -1921 969 1691 -1338
969 -1338 -1404 1626 1050 -1834 -643 1946 208 -1989 210 1932 -620 -1774 998 1545 -1325 -1252 1581
$$ packed form
857c039K243L977l082l275L755K437m246j515M557N28m645M71M517j450m181K350
873e98L625l093k941L713K117m142j217M381K62m391O72M212j563l840K359L326
889B882l073k626L588J832l931r76M094R4m072P78L866j576l510K313K963k908
905b62k323L388J584l706p64L837p0l790Q74L581j632l211K312K693k872k059
921b420L294J326l547n66L662k27l578R93L321j682k946K310K420k811j808L179
937I20J105l392l62L441l77l328J088L058j724k669K280K164k731j550L019R10
953A852l200k08L214m69l079J115K825j729k414K218J927k620j353K890P22l029
969a338o6L030n76k884J191K589j738k197K199J722k552j154K772N47k870P3K833
$$ plain form
986 1581 905 -1775 -525 1855 123 -1887 272 1788 -669 -1656 1005 1408 -1313 -1123 1529 778
1002 778 -1704 -422 1775 35 -1762 333 1678 -697 -1506 1013 1283 -1289 -1007 1493 664 -1622
1018 -1622 -316 1688 -47 -1670 384 1573 -737 -1402 1031 1163 -1276 -900 1441 571 -1569 -244
1034 -244 1588 -112 -1563 432 1460 -746 -1289 1011 1066 -1237 -783 1389 489 -1503 -166 1514
1050 1514 -166 -1461 464 1360 -777 -1182 1012 953 -1216 -699 1356 390 -1435 -99 1437 -219
1066 -219 -1379 524 1258 -780 -1083 995 864 -1186 -613 1301 316 -1361 -25 1342 -269 -1283
1082 -1283 530 1160 -772 -980 983 757 -1141 -516 1223 242 -1289 26 1256 -301 -1187 553
1098 553 1059 -771 -877 966 669 -1107 -439 1185 181 -1223 86 1198 -338 -1114 581 991 -787
$$ packed form
986A581o76k680J250K380j732k010K159J516k457r87K661M03k721J90K652p51
1002G78k482J282K197j740j797K095J345k375q09K519K70k572K82K500q29k286
1018a622J306K004j735j623K054J189k310o65K433J32k439L76K341q70k140J325
1034b44J832j700j451J995J028k206n43K300N5k303M54K172r00j992J337J680
1050A514j680j295J925Q96k137m05K194n9k169N17K055r66j825J336J536j656
1066b19j160J903P34k038l03K078j31k050N73J914r85j677J336J367j611j014
1082a283J813O30j932k08J963k26j898O25J739r81j531J315J230j557q86J740
1098E53N06j830j06J843k97j776O68J624j004j404J309J112j536p76J695M10j778
$$ plain form
1115 -787 -809 946 599 -1065 -363 1143 129 -1152 134 1115 -368 -1023 581 898 -756 -718 922
1132 922 529 -1010 -299 1076 77 -1074 162 1034 -373 -945 587 811 -745 -647 885 447 -979
1149 -979 -243 1025 19 -1020 199 979 -412 -881 596 740 -756 -566 869 390 -944 -177 971
1166 971 -34 -963 240 905 -430 -811 598 666 -737 -502 843 319 -896 -126 923 -59 -895 260
1184 260 831 -431 -741 579 607 -706 -457 790 270 -855 -95 862 -92 -837 271 771 -446 -674
1202 -674 576 548 -709 -400 775 228 -821 -51 824 -128 -792 298 734 -453 -610 589 504 -690
1220 -690 -338 763 179 -781 -6 782 -150 -727 312 666 -438 -559 570 456 -653 -302 726 150
1238 150 -739 0 736 -171 -683 310 622 -456 -514 552 403 -637 -256 695 114 -706 40 700 -194
$$ packed form
1115g87k2J755l47j664P02J506j014j281J286R81j483o55J604L17j654L8J640
1132I22l93j539P11J375r99j151J236Q72j407n72J532K24j556R8J532m38j426
1149i79P36J268j006j039J219P80j391m69J477J44j496J90J435m79j334P67J148
1166I71j005r29J203O65j335l81J409O8j403K35J345n24j215P70J049r82q36J155
1184B60N71j262l10J320K8j313K49J247n20j125P60R57r54p45J108N00j217k28
1202f74J250k8j257L09J175n47j049P70Q75r52o64J090M36j187j57J199q5j194
1220f90L52J101n84r60P75P88r32n77J039L54j104j21J129j14j109L51J028n76
1238A50q89P39P36r07n12R93L12j078n8J066j49j040L81R51n81q20P46O60q94
$$ plain form
1257 -194 -646 343 572 -451 -468 552 355 -626 -216 659 64 -680 77 665 -220 -610 348 521 -449 -433
1277 -433 544 308 -609 -189 633 46 -644 95 606 -223 -556 342 480 -439 -391 518 281 -569 -151 607
1297 607 28 -596 119 572 -241 -522 342 435 -435 -342 513 244 -556 -110 577 -11 -579 138 545 -256 -492
1318 -492 345 410 -427 -305 493 187 -538 -79 556 -24 -533 155 504 -251 -431 346 380 -422 -274 473 171
1339 171 -508 -51 515 -54 -497 152 461 -247 -403 349 332 -409 -227 468 145 -482 -30 488 -72 -467
1359 -467 181 436 -269 -371 351 300 -404 -201 452 114 -467 -7 473 -87 -435 182 392 -260 -334 349 264
1380 264 -381 -174 418 90 -436 7 439 -96 -409 179 364 -260 -304 327 226 -380 -156 397 59 -402
1400 -402 25 410 -104 -365 200 333 -262 -264 323 206 -361 -120 390 46 -383 46 382 -127 -361 198 301
$$ packed form
1257a94m52R89K29j023j7J020j97r81M10Q75n95p44P57N88q85l90R58J73r70J6
1277d33R77k36r17M20Q22n87o90P39N11q29l33Q98J38r19M8R09k37q50M18P58
1297F07n79o24P15M53q13k81Q64R3q70R3Q55k69q00M46O87n88n68P17M07q01k36
1318d92Q37O5q37J22P98l06p25M59O35n80n09O88L49p55j80P77L4q02J48P47l02
1339A71o79M57N66n69m43O49L09p08j56P52j7p41J82O95l23o27M52N18n60l95
1359d67O48K55p05j02P22n1p04K03O53l38n81M60M80n60l48O17K10o52p4O83q5
1380B64o45K07N92l28n26M43M32n35l13N88J85o24m4O31j01o06K24N53l38m61
1400d02M27L85n14k61N65J33n95kN87j17n67K41N10l44m29M29L36n09k34N59J03
$$ plain form
1421 301 -266 -243 311 180 -340 -96 373 23 -371 70 349 -131 -321 207 282 -262 -203 301 156 -337 -82
1442 -82 351 11 -347 79 337 -152 -287 198 247 -255 -180 307 121 -312 -58 341 -3 -312 91 306 -144
1463 -144 -258 204 223 -253 -165 288 100 -303 -22 318 -27 -301 101 287 -145 -243 205 199 -250 -145 281 99
1485 99 -282 -24 290 -32 -283 98 253 -152 -214 198 173 -238 -134 259 68 -273 -11 281 -35 -258 107
1506 107 231 -157 -193 191 171 -224 -98 247 55 -250 6 256 -51 -242 106 223 -142 -178 187 137 -207
1527 -207 -88 241 37 -234 31 237 -74 -227 120 203 -156 -166 197 111 -211 -73 236 31 -222 41 231
1548 231 -81 -200 114 166 -163 -143 191 103 -202 -56 210 17 -222 38 199 -78 -175 128 159 -154 -119 188
1570 188 86 -196 -32 205 -2 -199 59 197 -79 -163 122 147 -155 -104 179 74 -183 -29 194 -12 -182
$$ packed form
1421C01n67K3N54j31n20K44M69l50l94M41K79m80j90N28P5n44N9N04j45m93K55
1442h2M33l40l58M26K58m89j35M85M9n02P5M87j86m33K54L99l44l09M03K15m50
1463a44j14M62J9m76Q8M53j88m03K81L40l45k74M02J86m32r8M48om49J05M26j82
1485I9l81K58L14l22k51L81J55m05o2M12k5m11J04L93j91l41K62K92l16k23L65
1506A07J24l88l6L84k0l95J26L45j92l05K56K50l07j91L48J17l65l6L65n0l44
1527b07J19L29k04k71K65K06l11j53L47Q3l59j0L63q6l22J38L09k05k53K63J90
1548B31l12j19L14N2l29K0L34q8l05J46K66j93k39K60J61k77r7L03L1l13L5L07
1570A88j02k82J64K37k07j97K58J38k76q4K85K5l02N1K83j05k57J54K23k06j70
$$ plain form
1591 -182 53 173 -98 -148 130 120 -151 -89 174 59 -174 0 196 -29 -176 74 173 -96 -136 130 111 -144
1613 -144 -78 170 40 -172 1 178 -29 -159 81 155 -99 -129 125 103 -141 -59 170 37 -162 11 171 -28
1635 -28 -146 92 157 -99 -99 129 90 -131 -41 167 23 -145 23 161 -49 -139 89 125 -102 -94 130 76 -138 -26
1659 -26 155 17 -142 31 154 -51 -132 98 117 -103 -78 137 61 -131 -19 135 9 -134 40 140 -53 -116
1681 -116 97 103 -103 -68 122 46 -135 -19 147 -12 -130 40 135 -60 -109 94 84 -113 -60 118 34 -123 -10
1704 -10 140 -19 -125 52 122 -57 -89 89 75 -98 -52 125 42 -120 1 137 -27 -117 60 111 -66 -89 103
1727 103 77 -90 -41 110 23 -114 13 122 -22 -101 56 102 -75 -73 94 73 -96 -35 111 14 -115 16 116
1750 116 -32 -97 66 96 -68 -67 101 58 -107 -32 125 11 -107 25 113 -34 -85 73 89 -77 -64 96 54 -93
$$ packed form
1591a82K35J20k71n0K78j0k71O2K63j15k33J74J96k25j47K50R9k69m0K66j9k55
1613a44O6K48j30k12J73J77k07j30K40P4k54l0K54k2k44Q2K29j33j99J73J60j99
1635b8j18K38O5k56%K28l9k21R0K08j44j68J68J38k10r0K28L6k27QK24n4k14J12
1659b6J81j38j59J73J23k05q1K30J9k20K5K15p6j92J12J54j26j43J74J00j93o3
1681a16K13Ok06L5J90p6j81J16J66j59j18J70R5j95m9K03j0j97N3J78q4j57J13
1704a0J50j59j06J77P0j79l2J78j4j73M6J77q3j62J21J36j64r0J77N1j77k3J92
1727A03k6j67M9J51q7j37J27J09j44p9J57M6j77KJ67k1j69O1J46r7j29J31J00
1750A16j48o5J63L0j64JJ68m3j65P5J57j14j18J32Q8j47n1J58J6j66J3J60m2j47
$$ plain form
1774 -93 -11 106 -1 -97 42 97 -47 -81 71 78 -84 -56 91 43 -92 -26 109 -4 -101 36 93 -44 -86 72
1798 72 69 -72 -54 92 22 -99 -12 103 -4 -92 30 78 -42 -76 68 67 -75 -45 93 18 -101 -2 101 -22 -94
1823 -94 35 88 -48 -61 70 54 -87 -43 85 17 -96 8 91 -15 -83 55 87 -41 -68 67 53 -75 -25 100
1847 100 22 -103 8 85 -22 -90 29 88 -56 -65 72 44 -82 -27 97 13 -75 18 89 -27 -78 55 63 -58 -49 69
1873 69 50 -87 -27 90 1 -78 12 98 -36 -80 46 56 -56 -50 70 37 -71 -20 86 14 -76 24 82 -36 -70 51
1899 51 60 -66 -50 72 23 -78 -8 83 10 -73 9 72 -32 -66 48 62 -67 -36 75 27 -71 -12 73 -8 -77 27 66
1926 66 -48 -61 50 56 -64 -35 60 15 -63 -4 70 -4 -74 15 58 -45 -57 60 50 -67 -45 62 24 -75 2 73 -11
1953 -11 -65 21 58 -39 -63 55 43 -64 -36 71 32 -73 0 70 -17 -70 18 61 -47 -48 48 36 -54 -30 67 16 -68 7
$$ packed form
1774i3Q2J17j07r6J39N5j44l4J52Pj62K8J47m8j35O6J35j13r7J37N7j37m2J58
1798G2lj41J8J46p0j21Q7J15j07q8J22M8j20l4J44jj42L0J38p5j19R9J03j23p2
1823i4J29N3j36j3J31j6j41M4J28o8j13J04Q3j06o8J38L2j28k7J35j4j28N0J25
1847A00p8j25J11P7j07o8J19N9j44rJ37k8j26N5J24q4q8R3P1j16n1J33Qj21RJ18
1873F9j9j37O0J17q9p9R0Q6j34m4J26J0j12OJ20l3j08N1J06p2r0J00N8j18l4J21
1899E1Rj26J6J22m9j01P0R1p3q3Q2O3j04l4J14J4j29L1J11m8r8N9Q5q1o9J04L9
1926F6j14j3J11Oj20K9R5m5p8N9P4p4p0Q9M3j03j2J17j0j17K2J07l8r9P7P1q4
1953a1n4Q6L7r7k4J18j2j07K8J07l9j05P3P0q7n3Q8M3j08jR6j2r0K4R7n1q4P5
$$ plain form
1981 7 78 -15 -57 25 62 -39 -59 58 31 -68 -13 57 8 -63 11 66 -23 -58 28 50 -39 -48 53 43 -65 -22 63 7 -68
2010 -68 11 64 -21 -58 28 43 -47 -33 46 23 -65 -12 66 -2 -74 3 58 -17 -60 36 47 -50 -40 52 21 -58 -13 60 -4 -67
2040 -67 21 52 -18 -47 33 27 -53 -40 52 23 -57 -19 52 3 -53 18 55 -20 -47 48 37 -43 -34 55 22 -51 -5 54 -1 -55 23
2071 23 47 -20 -35 39 34 -41 -27 48 13 -61 6 55 -6 -55 19 44 -20 -35 44 32 -48 -22 51 24 -45 -6 47 -11 -52 32 51
2102 51 -29 -33 47 32 -47 -18 48 15 -47 -2 48 -4 -48 26 38 -35 -37 31 28 -34 -24 44 8 -55 6 59 -14 -43 17 39 -33 -27
2134 -27 38 31 -42 -21 39 4 -41 3 50 -11 -50 25 34 -38 -30 40 27 -56 -17 48 -3 -50 16 41 -13 -48 23 38 -28 -18 40 20
2166 20 -36 -8 51 -6 -49 3 43 -10 -35 37 39 -25 -19 45 25 -33 -12 40 6 -40 20 37 -25 -41 21 31 -39 -25 46 22 -44
2197 -44 -6 38 2 -39 23 47 -15 -39 23 22 -28 -25 44 12 -42 -3 40 -1 -34 16 35 -18 -31 37 29 -38 -16 38 17 -34 -3 44
$$ packed form
1981GP1r3m2Q2L7j01k0J17k7r9N5P0m9p1P4N5q9l5Q6K2q9rJ01j0j08M3Q5n6p5
2010f8P9N3q5l7Q6J5r0J4P9k3q8N3P8o8p2P7N5p5m3R6J1r7J0R2l1p9M5P3o4o3
2040f7Q8L1p0k9Q0oq0J3R2k9q0L8P1m9n6P1L7p5k7R5j1q0RQ9l3p3M6N9n5n4P8
2071B3K4o7j5P4np5J4P5l5p4O7M9o1m9P4K5o4j5P9j2q0K6P3k7o9L9N3n8m1Q4J9
2102E1q0mQ0j5p9K9O6l3o2M5N0n2m4P4J2p3kO8lo2J0O8l6o3O1N3p3k9O0K2p2O
2134b7O5pp3K1O0l5m5M4M7o1l9P5Rp2QP0j3q3L9O5n1m7O6K5n4l5P1J5o6J0N8k0
2166B0n6K8N9n7m3N2M0n3k5P2Ko4OO4k0n8K1N2l4m6O0J7o2j6O2J0p0J4P1k4o6
2197d4L8M4l6m1O2K4o2k4O2jn0LO9l2n4L9M3m1l3N0J9n3j3O8qo7K2N4k1n1L1M7
$$ plain form
2229 44 0 -35 11 26 -19 -39 27 22 -29 -22 29 7 -47 -6 42 -9 -35 9 31 -24 -36 28 25 -20 -20 33 6 -33 -4 28 -12 -38
2261 -38 2 23 -20 -34 25 12 -35 -19 34 7 -42 3 42 -10 -44 16 32 -26 -32 22 23 -38 -14 33 1 -38 -12 30 -16 -30 22
2292 22 24 -27 -30 21 13 -31 -16 29 -3 -36 -2 28 -11 -29 11 24 -30 -18 20 21 -37 -15 35 -5 -28 2 41 -17 -29 8 28 -24
2324 -24 -22 28 8 -25 -24 26 -9 -30 7 21 -23 -30 8 28 -21 -23 23 13 -19 -4 31 -7 -33 4 17 -19 -25 15 11 -22 -16 22 13 -20
2358 -20 -7 32 4 -28 3 23 -24 -30 19 13 -25 -16 33 13 -33 -6 18 -5 -28 0 22 -21 -28 20 22 -23 -14 16 3 -30 -2 25 5
2391 5 -29 8 28 -25 -21 21 17 -14 -16 16 14 -23 -2 23 -10 -29 5 14 -28 -14 21 5 -20 -21 24 17 -18 -11 18 7 -27 1 19 -18 -28
2426 -28 19 19 -13 -11 29 4 -29 2 20 -13 -15 6 11 -11 -10 18 17 -11 -3 19 4 -27 3 23 -6 -30 4 4 -18 -20 18 19 -20 -19 28 -1
2462 -1 -9 5 12 -15 -17 11 7 -19 -18 17 10 -23 -5 23 2 -23 -4 23 -16 -25 3 9 -17 -18 12 14 -16 -11 24 -13 -12 0 10 -17 -18 10 14 -12
$$ packed form
2229D4m4l5M6J5m5k0O6nn1PN1k2n4M1M8n1k6M4K2n5j2O4lm5%N3k7l9K9L2m0k6
2261c8M0K1m3j4N9j3m7J6N3k7m9M5L9n2l4O0J6n8oN4Jo1K4M7l2l9K6M2m6j4N2
2292B2Kn1lN1qm4J5M5l2l3L4L0l9j8M0J3n4J2L8Jn8K2N0m0k3L0L9n8j2L7K0n2
2324b4KN0k0l3JN0l5k1L7J4m4pL8K0m9kM6j0l2J5L5l8k6L7J3l6oM0ml3OL8rl3
2358b0J3L9k8l2L1K0m7oM9ol8RM9k0m6K7K4k3k3K8K2m3pM8Km5RL0j3l3K8K7k0
2391El4L7K0n3MM2ml1kL2kl7K1K5l3j9L4Rm2J4L5j6k5jM5pl5PK9j1l4K8J8l7j0
2426b8M7%l2KM0k5l3L1J8l3kK1Nk2JK8jk8QK2j5l1L0K0k9k4L4%k2kL8Jl9JM7k9
2462aqJ4Pk7kK8mk6JL5pl3J8K8k1k5J9K7l9rK8Ok6jL0Kl0NL5l7JJ2J0k7jK8Mk6
$$ plain form
2500 -12 -13 17 10 -15 -12 22 0 -20 -2 19 -4 -14 9 9 -12 -7 22 13 -23 -14 15 -1 -23 -5 11 -17 -11 3 6 -17 -15 7 -6 -31 -9
2535 -9 21 0 -20 -1 12 -6 -8 2 0 -11 -10 11 0 -18 -5 15 1 -29 9 20 -7 -10 3 17 -18 -12 18 3 -32 -3 12 -4 -13 -3
2569 -3 16 -12 -15 8 14 -13 -10 9 4 -15 -12 23 1 -6 5 18 -5 -9 27 12 -8 -1 20 8 -12 -7 10 1 -16 0 20 3 -10 18 14 -2
2605 -2 -12 14 3 -22 1 14 -16 -23 0 15 -3 -13 6 7 -9 -1 23 9 -22 -2 18 5 -7 0 17 -9 -13 8 18 -9 -8 13 -7 -3
2639 -3 2 8 -6 -11 11 7 -15 -7 13 4 -7 0 9 1 -22 1 18 -6 -8 7 3 -2 -10 16 -2 -13 -6 24 -7 -12 -1 9 13 -7 17 18 -4 -7 9 10
2679 10 -6 -7 21 4 -13 13 14 0 -14 12 6 -13 -10 12 5 -16 -9 19 -5 -13 13 21 3 -19 10 14 1 2 18 7 -9 -4 19 2 -18 7
2715 7 7 -3 -6 8 12 -7 -6 6 9 -18 -2 17 6 -3 -8 19 4 -11 11 8 -6 -2 -2 5 -3 5 9 -2 -9 3 6 0 -11 10 9 -10 -3 13 8 -3 -10
2756 -10 12 -5 -14 17 -1 2 5 0 -3 -5 1 8 -3 -13 -6 7 3 -15 1 16 -4 2 6 7 -19 -1 10 10 -10 -1 1 -7 -12 11 15 2 -4 7 5 -8 -14
$$ packed form
2500a2jL0pk5LL4k2k0J8K1k3j0K3%k1NK9rl6RK9j6k2J8J6k8OJ4Lk3KK2j3k5K2
2535iL0k1k0J9J3j8kJ0kj1JK1j1j8J3K0j4l0L8J1k7lJ3J4l5OL0j5l5K9J5j6rJ0
2569cJ9k8lK3Ok7LJ9nj9LL5k2pJ1J3k3mL6j5k0PK1j2k0NJ7rj7J6K0j7j3K8mj6
2605bj0K6j1k5K3J3l0pK3J5j8j0J9Jj6QK4j4l1K0K0j3j2PJ7k6mK1J0k7JK1k0M
2639cNOj4nK2mk2QK0rj1PRqk3K3J7k4kJ5mnqK6j8j1PL0l1nJ1J0Mk0K4Jk2lJ6J
2679A0j6jK8j7j7K6Jj4j4K6oj9LK2pk1PK8k4qK6Qj8k2K9Mj3JJ6j1j6NK3j7k0K5
2715G%j0lJ4Mj9JJ2Lk7J6J9j1rnK7j5j5K2lj4M%PqQMj1pJ2Loj1K1jj9PJ6nj1p
2756a0K2j7rL1j8LLnlkOPj1j0PJ3mj8J6J5k0OMJk6J8J1%k0RKqnK3Mj3oJ1kj3o
$$ plain form
2797 -14 19 13 -17 -3 15 3 -16 3 12 -3 -1 2 0 -2 6 7 5 -17 -2 9 -6 -9 0 7 -20 -3 12 -1 -14 -4 6 -6 -4 -1 2 -8 -3 11
2835 11 0 -10 -7 9 4 -11 3 5 0 -9 4 6 -10 -10 9 1 -10 -3 12 5 -7 1 8 1 -3 -6 15 6 -9 14 -3 -22 -13 5 -5 -13 -7 5 -3 -15
2875 -15 9 11 -2 -8 11 8 -10 -6 3 10 -15 -2 -2 -1 -15 8 2 -2 -6 -1 6 -4 -4 4 -9 -12 -6 -3 -10 -12 3 5 -16 -15 1 3 -8 -14 6 3 -12 -3 0 3
2919 3 -10 -1 5 -8 -7 12 6 -10 6 3 7 -1 1 8 -11 -7 0 0 -4 -1 7 3 -8 -1 5 -13 -5 -1 9 -8 -6 16 -1 -6 -11 12 9 1 -5 2 -9 -9 -2 9 -5
2964 -5 -2 7 13 2 -15 5 -3 3 -1 7 3 -1 -4 5 -11 -4 -4 -1 -5 -12 1 -5 -19 -4 6 -9 -3 -4 -3 -8 -3 -3 0 -9 -7 7 0 -7 0 -3 -11 -7 6 8 -14 -9 6 4
3012 4 3 0 3 8 0 2 0 3 6 5 8 -3 -4 2 -5 -1 -17 5 -4 -10 2 -8 -9 -4 4 3 -14 -9 2 2 2 8 -1 5 1 11 8 2 -4 11 0 -2 -1 4 -1 -1 -7 5 3 -4
3062 -4 6 0 -6 -8 -5 13 -1 0 -3 -4 -5 -14 2 13 3 -4 21 5 7 -5 0 5 -1 9 1 -6 -1 4 -2 1 2 14 2 1 13 7 -9 0 -2 3 -3 6 7 7 -5 -1
3108 -1 2 -10 -3 10 0 -6 -3 -8 6 0 2 -2 -1 -10 2 0 -8 -8 -1 1 -1 -2 11 0 7 0 17 1 -7 -1 1 -9 -7 3 -4 0 -3 -8 4 -15 -7 0 -6 -13 1 9 1
$$ packed form
2797a4L3ol0J4J8j2j9J9Rj5KLkkQJkk2J5J1j5lRPk7J7J5j3j3J0J0j2KLLj0NJ4
2835A1j1j0LJ6nj5J4KnrJ3Kj6%J9qj1PJ5pj2QPpmlK1rj5K3j7j9RJ8j0qOJ2qj2
2875a5K4Kj3oJ9lj8MRPk5J3%Jj4K3ommNPj0%Qj3lOLpkJ5Kk1JJ6Kj1oK0lj5RLL
2919Cj3ROj3JJ9oj6J6lMqKPj9MP%mLQmj1POj8QMJ0j7KK2j7nnK3lqoPj1%PJ1j4
2964eLROj1j7K0qOmQmmlRj6P%LmpJ3oj4J5J0j5OjJnN%LrKJ4ppPlqMJ3Kk2NJ5k
3012DjlLNqKkLLjLj1jOpMj6K2roJ2j0jNQjj7NJ1%%OrOmJ0looJ5j1kJNn%oJ2kp
3062dJ0ookLJ8j4JljjrJ6J1j0pK5j6Kj2NNoJ0qpNNoLJJ2j2jJ2oj6RkNoRJ%j2M
3108aLj2PJ3j0oLnJ4oKmJrJ2kq%PKkjJ3j1PpJ7j6qOKj0KJ0pMlnJ2j9QPopJ4Qq
$$ plain form
3155 1 -10 -6 -1 -19 -3 -3 -13 -6 -8 5 -7 -1 13 -2 -7 -14 10 4 -2 -3 3 -2 -2 12 12 0 -7 -1 4 -8 0 2 0 -2 2 14 4 2 3 2 -2 -8 -3 0 10 2
3201 2 4 10 -4 1 8 -5 -7 -2 8 4 -6 5 3 2 0 8 8 5 -4 11 -1 3 1 -2 10 -3 2 3 3 -4 -7 1 -5 -3 4 -1 -4 2 18 -9 -4 5 3 -4 -3 0 -9 5 -7
3250 -7 13 1 1 -1 6 -6 -3 10 -1 9 -5 14 -1 -3 -2 2 -3 -4 -3 -4 -1 11 5 -12 1 -10 -2 3 -8 1 -6 2 5 2 4 7 2 -9 9 -7 -12 3 6
3293 6 11 16 -6 -2 6 2 -1 -3 -3 -4 -3 -2 7 -5 -7 0 -2 11 -7 -17 8 -3 6 -3 1 4 -6 -3 -7 0 -3 6 6 9 -2 5 0 3 2 -4 1 1 -8 6 11 6 0 -1 9 3
3343 3 6 3 5 -11 2 5 1 12 11 0 -1 1 2 4 -2 -9 -5 -11 -7 3 5 -4 -7 -2 -5 4 -8 0 1 12 -1 -7 -4 6 -3 10 -5 0 6 -6 8 7 -8 2 -3 12
3389 12 4 -2 0 -1 -4 -10 -3 5 -3 -5 -6 -9 -5 -6 -2 2 3 3 -4 -7 -3 1 0 3 -5 2 -2 -11 -4 -5 7 -1 11 -4 0 -2 2 1 -1 -2 -7 -2 -15 -7 2 -7 5 1 10 6 -4 5 3 4
3443 4 7 5 -2 5 0 -3 1 -6 5 -4 11 6 3 1 3 10 -2 1 -2 -4 9 8 -9 -10 10 1 -13 -3 7 1 -4 5 0 -3 -2 7 2 -7 -1 1 -6 2 1 2 -3 -7 -2 -6 -14 7 6
3494 6 6 -9 3 -11 4 0 4 -7 -3 2 5 7 5 -2 0 2 -1 -10 0 0 -5 8 -4 -7 -5 -5 2 -5 -7 -6 -4 -13 -1 0 -9 2 -3 0 3 -3 -6 -9 -8 -5 5 -1 3 -4 -6 -2
$$ packed form
3155Aj1MNj8J6%j0PkJ3j2OJ4j5npK4oojOn%J4%j2pONj2QKkkMJ2j0kJjmoNLJ0q
3201BKOj4NPj3kNJ0mj0J1kjkQ%lrJ5j2MklJ2j3NJ%plQoKPnlOJ6k7NRkpJLrJ4j2
3250gK0j2%kPj2LJ3j1J0j4J9j5kJMnjJjLJ2oj7J3j1QNj1RpQLlKLnj1J8j6nJ5L
3293FNNk2MQmlk%jJJRj2kPkJ3j8j0K5j1RrMLj0LmPlR%Lj1PnLjoN%rJ4NnojJ0o
3343CLlKj6J3LmJ1jj1jKJKopMoMJ0KrlNlRj2QJJ1j3oLJ0rJ3j5NOj2J4jj5J0nJ5
3389A2qoKjloPQqkjlMjMMJ%plMMjLqPmrPjJ2qJ2j5MkMjkjnNj3QRrJ2mRmj0RkJ
3443DLkpPnlMpJ1rJ5nlkKPj2LlkJ3jj7jK0rj4J0J0onRnlJRnrOKpQjJnmNmqK1j
3494F%j5J2j4J5mMj1MNLKkpKKlrJ0%nJ3j2lK%PpkJKrJ2JrJ1nLLollJLJ0oMpkM
$$ plain form
3544 -2 8 -2 0 7 4 9 0 3 4 1 0 5 -4 1 3 4 -3 8 -7 -5 1 -8 1 1 -6 -3 -1 6 12 7 -11 -5 -3 -11 -7 -3 2 -11 8 4 1 -5 -8 2 2 -5 0 -6 -4 -15 -5
3595 -5 5 -14 -8 5 5 -19 -3 -5 -6 -8 -4 -14 -6 -10 -6 -10 -2 5 -16 -2 -10 6 -5 0 -3 2 3 -12 0 -5 -6 -1 -2 1 -1 -4 4 -2 6 6 0 -1 -9 -2 4 -2 -11 -7 -5
3644 -5 -5 -10 -4 -7 -4 -8 -8 7 -8 -11 -1 -3 -4 -10 -6 -7 5 3 -3 -4 -9 -1 0 -6 -2 1 0 13 1 0 -14 -6 7 2 -6 -1 2 -11 -5 -13 8 -11 3 -5 -4 0 -1 4 -5
3693 -5 -8 -5 -10 -15 -4 -13 -8 -4 -2 -5 7 1 -5 0 -7 -2 2 -6 2 -2 -2 -5 7 1 10 5 6 -4 -10 -8 5 0 4 -1 -2 7 -11 -5 -2 -2 -8 -4 -6 5 -5 -2 -7 -6 4 -7 -3
3744 -3 4 5 -7 5 1 -4 -3 7 6 6 -3 -3 -12 -3 -4 5 -5 8 9 2 7 -2 2 -7 1 -14 -5 0 -3 -13 -12 4 -3 -5 2 3 2 -9 4 3 2 2 2 -3 5 -4 3 -3 -1 -4 -5
3795 -5 6 -3 -4 2 -1 4 -9 8 -2 0 1 -5 -3 -10 -6 -5 -7 -2 0 -1 -7 -2 6 -1 -7 -3 -7 -8 -9 -1 -15 -2 2 -10 2 -4 -1 -2 -5 -7 12 -11 -1 -7 -5 -2 4 2 -3 0
3845 0 -11 8 5 6 0 -8 -7 -6 -5 -12 -3 2 -5 -6 -3 -10 -9 9 -1 -5 -2 -6 0 -6 -7 -5 -3 8 6 8 -1 4 3 11 -1 1 -1 -2 -9 -2 -6 0 -6 -2 10 -3 0 -10 -8 -5 0 -5
3897 -5 4 4 -11 -7 -1 1 4 4 5 -7 -6 0 3 1 -1 0 6 -1 0 0 5 -8 4 6 0 4 -1 5 -5 0 4 -7 8 -7 -6 -2 6 -3 -4 -9 -2 -11 -8 -4 -5 -4 -6 1 3 -7 -1 -2
$$ packed form
3544bJ0j0KPlNrLJljNrNKJpJ1j5KOrR%pLKPOnj8OKqMMNj3J9mlolJ0%pNoKj1J0
3595eJ0j9OJ3%k4J6kjkMj0QmMmQPk1J4qJ6j1NlNJj5J2njNjLklQoQ%ojqPOorMK
3644e%nOlLm%J5j5lJ0kjoMjJ2kojnQJoMLjJ3j2jj4QJ3nqNLj3OqK1j9J4qJMjNr
3693elLnnJ1rNMKlJ2ooNpNMqQm%lJ2oRnJj0oKJ3nMnjRj8OL%oMkJ1j0LnJJ0j1M
3744cPJj2J2mnJJ0j%r%rRjRj0J3JpNrMrQj5RNlj0JJ6pkPJjj1J3jj%%nQrPoKlj
3795eJ1rjOlNj3J7j0KJoKpMJkNKjoNQpoMmjjQj4J3Mj2J2oLjlkJ9k3J0oKLOknL
3845@j1J9lJoqJJJpRNpjLpJJ8j0mLmOojKKJ1kKrNjQj2KkjpPmOoMJ2j3Lj0KLNn
3897eR%j5MOKL%Jj2JOLkkJOpJ%Nj3J2KoMnOj0NMj1J5j5JMQrjnPrLMjJkPKj0Oj
$$ plain form
3949 -2 -7 3 -6 3 -3 13 -13 -2 -1 -10 -4 3 9 6 -9 -5 -13 3 -5 -2 7 -6 -4 -15 -2 1 0 -4 -5 2 5 -7 -3 -1 -3 2 -6 -2 -7 0 7 -1 -6 0 0 -1 6 -11 2
3998 2 6 4 2 -2 2 -1 4 10 -4 5 -10 -5 -3 -3 -7 1 -1 0 -6 -4 -9 -9 -13 -8 -3 -6 -4 -3 -12 5 -16 0 -5 -2 14 -3 5 -4 -2 -6 -8 -6 -2 1 -2 1 6 -1 -7 -7 1 -12 -13
4051 -13 -11 1 -3 -3 -3 -6 5 -4 -8 -6 -9 7 -6 -6 -13 -4 -1 -8 -9 -2 -7 -3 -5 -4 7 -5 -5 9 1 -10 1 7 -7 2 6 7 0 6 -1 -2 -6 2 8 -4 -7 -1 0 -2 -2
4100 -2 -7 -11 5 -6 -1 -7 -10 0 -6 -12 -11 4 -3 -14 -12 -14 -1 -11 5 -1 -4 -4 -11 2 -2 -3 -5 -6 -1 -8 0 0 11 6 -5 -5 -5 -5 0 -11 0 -5 1 7 -11 1
4146 1 -10 -7 -13 -4 -7 2 1 -8 -12 -7 4 -5 -6 -1 0 2 -3 4 -3 7 -1 3 15 -2 8 1 21 10 3 8 4 11 5 -11 -13 4 -7 4 -4 6 5 -5 -11 -3 3 -3 10
4193 10 6 -7 -1 2 3 0 -3 -6 -1 -4 -4 -4 0 4 -6 7 9 11 0 8 2 4 -5 5 1 7 -4 -5 0 -3 -1 -3 2 -5 5 4 3 7 11 -2 0 -1 1 6 -1 2 6 -8 -1 6 -4
4244 -4 2 -3 10 -6 -3 12 2 16 6 3 5 5 -9 7 -1 -4 0 3 15 15 18 5 -3 -3 -4 -3 -1 0 -6 -4 -6 -1 -6 9 6 8 3 1 -4 -7 0 -8 -11 6 3 2 10 0
4292 0 -3 2 -4 4 13 6 6 -3 -11 0 0 0 -1 3 -9 -2 -3 -7 2 0 -3 -9 -10 -1 3 9 -4 6 2 4 4 11 8 5 -3 7 3 -5 -4 7 3 3 4 2 0 0 6 -3 6 7 6 9 4 0 3
$$ packed form
3949bnJ0rRoJ6k6J1JrOPOlj5MqJ6qLRj3Kj1J3LjmjPLj2MKkNqMnPPqnO%jPj7J3
3998BMkkmMlNOj4Rj5NK%mQkJoKn%mNNlKJrJ7k1J6nLJ6j7QrKmkKMLlLNpo%Qj3j
4051a3KJ2m%%lJ1rmKlJ6j3%pRLpjPnMkJJ1j2%J4qj1J1Oj4RMJpOpjmQOj2lOJk%
4100bnmJ6j1NolJ0ooJJ5pj1KkJ3j0J6ol%pJ3mjkjNpQ%J1nj1%%%Nj1J1nOOj8J2
4146Aj1LoRlRjrmNJ1rjNJKnPpJ0qMJ2j7J0pK0j1pNmPoj6kJ7j1J1qJ0jj0oQOoJ3
4193A0mj3OLJlllNl%%MMj0J3KKj1QoKrJ0mOj1jNlKkNpJ0jjMMj3KjKNpLMj4PPj0
4244dOnJ3j6LJ5j0J4j0lK%j4J6qlMLJ2%Lj3q%jJKJoKkNnJ5lKnknlPqlJ7ljQj0
4292@lNoQRp%rqJ1%%jMj2PjmRklojRMOj3J0mK%PllqJ0mqJJ1m%Jkk%OrRJjLnmL
$$ plain form
4347 3 15 -4 -1 -4 -10 4 3 -2 -7 -2 -5 -7 -4 5 6 5 15 6 -1 -9 5 0 1 -3 5 3 -3 -10 -4 9 1 2 1 10 6 1 -5 6 14 -2 3 0 7 5 3 6 3 2 3 -10 -4 -6
4399 -6 -2 5 -1 -10 -7 -2 3 1 -5 3 0 -1 1 -3 -1 7 9 12 7 -4 -3 6 5 1 9 6 -3 -3 -5 3 -10 -6 -2 -2 1 -3 -8 -6 -9 -9 -10 -5 -3 -7 -10 -9 2 3 2 -4 -2 7 -2 1 0 9 3 -8
4457 -8 5 4 -4 0 -7 -5 3 11 3 5 11 0 -7 -3 -4 -10 -5 -8 -11 -5 -1 -4 0 8 -7 -5 1 -3 -4 4 -2 -2 0 12 7 -3 0 2 -2 2 0 6 -1 -3 1 -11 -3 -4 -5 -13 1 -3 1 -5
4511 -5 -2 -9 -8 -5 -6 0 -17 -11 -15 -6 -8 -8 -8 -4 -8 -14 2 -6 -3 -5 -1 5 1 3 8 5 2 7 -2 -1 -5 -6 -9 -4 8 -3 0 -3 5 -4 -11 7 -9 -4 -4 2 -7 -1 -5 -5 -3 -4 -5 1 -3
4566 -3 -6 3 -2 -6 -4 -2 -3 -6 -8 -2 8 -1 -8 5 -1 12 -5 2 13 10 3 3 -5 3 1 9 8 -6 0 6 -6 1 -2 -2 -8 0 -1 -8 -7 -5 -7 -5 4 -4 -3 7 -4 2 0 -2 11
4617 11 6 -1 9 1 4 0 5 4 3 5 5 1 14 4 1 5 0 19 1 -7 -2 -1 -2 -11 0 4 0 2 -1 -10 -7 1 -6 -7 -2 1 -7 -5 -7 3 -1 9 -6 -1 -1 -1 2 -3 3 -5 -8
4668 -8 4 9 3 -1 -8 4 -7 7 -1 6 -6 -11 4 3 8 8 -4 -6 -10 -14 0 -6 0 -2 -11 1 -3 -2 3 -3 -10 0 6 -1 0 -3 10 1 5 -2 -4 7 6 -9 -9 -2 8
4715 8 -2 4 6 -6 -3 -6 -4 -7 -9 1 0 -1 4 -2 -4 1 -5 3 -3 -5 -5 1 -2 0 0 -1 0 11 5 5 -3 2 -2 3 -4 -7 1 -5 10 -4 7 -5 -8 -2 -2 1 -14 -7 -9 -7 -3 -4
$$ packed form
4347CJ2j9LloJ4jnnNlkLRJjJ0rpqJ4nJmQkopOJ3qJjRmnoJ1Qj6NlPkkLljJj3Ok
4399fMPorLNNkoQljKmKQKLnj1JRjmQlr%kQj3MM%LmnKl%jNKmlJJ1JjoKRrLjRoj1
4457hJ3jqMpKQQqKOj1pMjoNllOMlMQj5KOmjQo%KJ2nj0LKmMkOpkMj2QjjqJ4mMo
4511eLpJLjOj7OmRk%%MmoJ6qLkMOmKNllNrJmjlNJ2j1LlQrpJ8j6N%OrOm%KjjOm
4566clRnmKKjlkOJ0rpJ3oJ3j7PJ1lp%qQkQjj4OOj2Pl%oQjpJKkKRqJJ0j1OkkJ3
4617A1npJ0qLmNjjK%mJ3j0lMnJ9j8qNJjrJ1MmKlrLQpjNLqKkJ0mJ0j5N%%LnOql
4668hJ2NompJ2j1J4qPj2nJ5jN%j2kmmJ4oOkrJ2mJNopJ0OpJlJ3rMpkJ1jj5%PJ0
4715Hj0OKj2LlKlkJ0jjNokNoQok%OlK%jJJ1o%qNmNplQoJ5j4J1j2lO%Lj5PkKMj
$$ plain form
4767 -4 -6 -8 -9 -17 -4 -12 -4 -3 -2 -5 -6 -6 -3 1 -9 5 6 -9 3 2 1 5 7 -2 0 -11 -5 -1 -14 -8 5 1 2 -1 1 5 -1 -8 8 -2 -4 0 -8 -11 -10 -9 4 -7 -8
4816 -8 -2 -11 -6 -16 -3 1 -3 -7 -2 -2 4 2 4 -2 -2 -6 3 4 -1 -3 8 -2 -6 -11 1 -3 -6 -5 -16 -6 -13 -4 0 -10 -12 -4 -5 -11 -12 -3 2 8 -5 2 -6 -5 -4 -8 -8 -14 -6 -1
4868 -1 -1 -2 -9 -6 -1 -3 0 -3 -8 -8 -8 -2 -11 -10 -8 -7 -6 -19 -5 -4 -2 -7 -13 -18 -15 -5 -6 4 -9 -5 -5 -7 -2 2 -10 -5 -11 -3 -5 -8 -1 -8 -3 -10 0 -3 -8 0 -2 -7 8 -10
4920 -10 5 -3 -4 -7 -10 -8 -6 -9 -14 -7 -1 -2 -8 -14 -20 -18 -12 -7 -11 -9 -12 -7 1 -9 5 -2 -1 6 -6 -6 -3 -2 -1 -3 -10 6 11 -7 1 -3 -6 -5 -9 -7 -5 -5 -9 -7 -4 0 -3 1 -3 -1
4974 -1 -1 -5 -3 -1 -7 -8 3 -1 -8 -4 5 2 -6 -13 -3 -5 2 -8 -2 11 -1 -1 6 -3 0 -3 5 6 -1 -2 -9 -4 -2 -3 -4 -2 -3 9 0 -2 -4 -5 3 -14 -1 -8 -5 -6 -2 1 -6 -3 -11
5027 -11 -1 -10 -9 -3 -1 8 -4 0 1 4 16 8 5 2 3 3 3 10 5 6 -2 -1 -2 -3 0 -3 -5 -5 -2 16 -2 -1 -10 4 3 0 2 -2 6 -8 0 -3 2 5 3 2 -5 11 8 -1 9
5078 9 -4 7 -3 1 4 3 10 6 1 2 6 5 11 2 0 0 -10 -5 -1 -6 3 -10 3 -4 -2 0 -3 0 -6 -10 -7 1 3 -2 -5 -7 6 9 5 15 -1 5 4 -9 -1 7 9 4 0 -2 -1
5129 -1 10 1 1 -3 1 -3 1 2 -2 2 3 -3 -8 0 5 1 -7 -1 0 1 4 6 2 -9 3 3 7 0 11 4 0 4 2 6 5 -3 10 2 15 -10 -3 6 -3 -3 4 1 -5 -3 -6 -8 -8 1 -2 3
$$ packed form
4767dkkjqJ3qQJJlj%LMj0J4Jj5J2jjMKrKj1OMj3OJ3mJlKMopJ6j0kMqlJJJ3j1j
4816hOrNj0J3MmmN%OkKo%mRJnkJ1j0mnJ2mlJj1J0pRMj0kQjojRNOj3PqJJm%oQN
4868a%jpLNkLln%%OrJKJJj3J4JKnonLJ0jJ0j3M%kNMj2NoQklPpNpJ0lnQknJ5j8
4920a0J5qjllKKlnPOjoooKONmKlNQj0J4pJPj2%LJJkpJ6Nj8QmlJmKK%mKLMlMmK
4974a%mKKojJ1mpMRlqpJ0kPj0OJ3j2%PrLlQJpjpNKjjKjJ2rkkjQj7J3pLjMLpLq
5027a1J0rJOKRj2MJLJ2qllJ%%PnJqJjjLlk%LJ8j8JrJ4jlKmQj4QlNLkjpJ6lrJ0
5078Ij3J1j0MLjPmnJMjOrk%j0NMnRj3J3pKKlLomLQKnlkJ3LmJ0j6Ojj3QQKnmkJ
5129aJ1r%mMmMJmMJonQNmqOJJLKmj1J2%MpJ1pmMkMjqJ3qJ3k5PRr%PloKlk%RlN
$$ plain form
5183 3 -12 6 -5 -2 -1 4 1 3 -3 -6 3 -4 0 -6 -2 5 13 3 4 -1 4 -3 5 5 0 2 4 1 2 -2 -3 -2 -4 3 10 -6 1 -1 -6 2 4 -1 -9 -7 -10 -1 -6 1 0 -1 1 -5 14 -1
5237 -1 6 9 -2 0 12 4 4 12 12 -5 6 -1 5 6 4 5 7 4 8 -4 -6 4 0 1 1 -6 -4 4 -7 -2 -1 0 4 -8 -1 -3 -15 1 -2 0 3 -2 6 -3 7 -1 4 3 3 7
5287 7 3 1 7 5 -1 -5 6 -1 -7 -2 -4 -8 -3 0 7 -5 -10 -4 1 -5 -12 -7 -12 0 -8 3 2 -11 -4 -12 -1 -4 -6 -4 6 -2 -2 -5 -2 -1 4 9 5 10 5 7 4 16 14 17 1 13
5339 13 6 0 -8 -12 -3 4 12 -2 -3 -2 7 -1 -11 -8 2 1 -6 2 -9 0 -3 -8 4 7 5 -2 6 6 10 -1 4 -6 -2 -2 11 4 0 0 2 12 1 1 0 1 -10 5 0 4
5387 4 0 1 -10 6 3 3 0 -8 1 -3 -8 -8 -3 6 4 -1 6 4 2 3 5 10 5 11 5 1 -3 5 -4 5 -4 1 -2 5 15 -4 4 8 -4 -3 -3 6 -7 1 4 -6 0 4 3 -2 12 -2
5439 -2 -3 -7 0 -4 2 3 4 -3 5 7 7 0 -7 6 2 7 0 5 -2 12 -2 3 4 8 -4 4 7 -4 -13 -9 0 -3 3 4 2 -9 1 -4 0 -10 -4 2 -3 0 -8 2 1 -10 2 2
5489 2 9 4 3 6 16 11 6 2 9 2 3 0 2 6 -5 -6 1 -3 1 -1 3 3 -3 -1 -7 -5 -2 -2 -1 -9 -7 -6 -8 -1 12 6 5 0 -10 0 3 1 1 4 -5 -4 3 1 7 1 -5 -5 7 3 8
5544 8 9 -4 4 0 -5 -3 -1 3 0 4 -3 -2 -6 -5 -7 -5 -5 -6 -10 -2 3 3 4 -5 -3 0 5 1 -6 1 -5 -2 7 -1 -1 -1 1 -3 2 -1 -12 0 -13 -8 -1 -5 -9 -11 -7 -10 1 -5 -3 -6 -10 4
$$ packed form
5183Cj5J8j1LJNlKolRpMoMPQj0JnNpQ%nKKlJmjJkPPj6PknQKnqKlRnPjjKoJ9j5
5237aPLj1KJ2q%Q%j7J1pOJkJKlMj2kJ0mJ%pKQj1NJJMj2Pkj2J6lKLnQrJ0qNj%M
5287GmkOkomJ1poNkmNLPj2nONopNnJ2qJ1jj3PqJ1lkKJ0q%lLJNNmNnKlJ2kLj6J2
5339A3poqmRPQj4jJRqj0LJ0jpQj1RlnJ2LkpQ%Mj1Nj0M%J3pm%KJ0j1%jJj1J5nM
5387DmJj1J6l%lqRmn%NRknPkkJKNnOommQrRrNlPJ0j9QMj2J%Rj3QLj0OMjnJ4j4
5439bjmPmOJJpQK%ppJ3mNpNpJ4j4NJMj2QLj1rMRlOJkj1J0nMj0OOnLqJ0jj1J2%
5489BPnjLJ0nnmPpJlKMj1jPmMkM%oKoKL%JqKJkPJ3ojnj0J0Lk%LrJPkOoo%J2mN
5544HJj3QmnKKMlMpJmJkK%jmQN%JrKLNmpPoLRq%%KmNlj1J2j3NPmmkMlJ1oKlmJ4
$$ plain form
5600 4 -10 -10 -3 -2 0 -4 6 -5 7 -4 1 -3 3 2 -6 -12 -2 -1 1 5 -7 2 0 7 2 2 -1 -7 0 -7 -5 -11 -8 -6 4 -9 -1 -12 -4 -10 5 -1 -10 -2 -6 -2 -7 -2 -3 6
5650 6 -1 -8 5 13 -5 11 1 -2 -8 -2 -7 -6 -8 -3 0 -5 6 1 13 8 1 -3 -3 -4 2 -8 -3 -5 -11 0 1 -5 -3 1 0 3 -4 -8 -5 -8 -2 -3 -7 -3 -2 3 -2 0 -4 8 5 -8
5702 -8 8 3 6 -6 -12 -1 -5 1 -9 -8 5 7 2 -4 -6 -8 2 4 -4 -11 -12 -2 -11 -4 -4 -3 -3 -1 5 -4 -3 4 13 2 7 3 3 6 4 -3 3 5 -10 6 -7 -6 2 0 -6 -11
5752 -11 -7 5 -2 -6 -2 -11 -11 2 9 -3 -8 -5 -6 -7 -8 8 2 -4 -9 -10 -5 -4 -6 -5 1 -12 -4 9 0 -8 -6 -4 -4 -1 7 6 4 8 -1 -11 6 -7 1 0 -5 2 -7 -1 -5 -7 -4
5803 -4 -6 -16 -8 -7 -4 2 -8 -6 -7 0 -3 -10 -2 -1 -2 -3 0 -5 14 -6 2 -8 -4 -3 1 1 9 -4 -4 6 -3 -1 -8 -2 -3 -5 -6 0 -9 -10 -6 -7 -3 -3 -15 -11 -1 -13 -11 -11 -2
5854 -2 -11 0 0 2 -10 7 3 6 -9 1 5 0 9 0 0 -2 11 -1 -6 -2 2 -3 -11 -2 1 -9 -8 -14 -8 0 -11 -6 -9 -17 -10 2 -6 -10 -3 -8 -1 -5 -5 -5 4 -6 1 2 4 5
5904 5 -3 -7 4 10 -4 6 5 7 7 3 4 2 8 8 0 1 -3 0 1 -12 -6 -13 -3 -3 0 -6 -12 0 -9 -8 4 -5 -1 -14 -1 6 -1 5 -3 -2 13 9 2 -10 -3 -5 3 9 5 -9
5954 -9 -9 -6 2 -4 -5 -4 -4 -7 -1 2 1 -16 -12 -14 -1 -7 -2 -15 -12 -5 -3 -11 -17 -4 -18 -7 -11 -7 -3 -3 7 5 2 0 -8 -1 -3 2 1 -5 9 -1 5 2 -5 -4 -9 4 -1 -6 -2
$$ packed form
5600Dj4%PJKmJ0j1J2j1NmOjqoJ0JKMj2RkPn%loPpKoLKJ0j3Qj1QoJ5orQmMnNjR
5650FppJ3Qj8J6j0loOnJkNLnJ1nJ2npm%jOj0NkoJ1JoKMjLpmLlOjmMJNnKmJ2lj3
5702hJ6nLj2oJ1mOj0JJ3KnokkJ0KqpjJ0rP%J%KOrJPRj1Nm%LkpOKj5J6j3JQkon
5752a1MJ2pmMr%J3Pj2nLjjjJ6oonjNJkJOj3QJ3rqKK%LQjkMrj0J7j3QjnPrOmkL
5803dkj0QJLOj0KjPlpQJjjLnJ9k0Qj0MJM%Qj3%J0rKpOjkjOrjMjM%j2MJ0j2K%R
5854brJ1%Kj2J7mLj5J0MnRr%kJ3j2nMMnqRLj0JoOQj1NlqPJ2qmPnPm%%Rj0PJKJ
5904EqmJ1Oj4J0jK%mJkO%qJmLJj3OpJ0%LooJ2rJJ2rMj3J3PpOqJJ5mpj2PkQOmj4
5954i%LQojJ%lOLjj7MkJ3oNj3LPKqoJ3j4J1mMM%J0klkqPkNjoJ4j0OlpJnJ3nnM
$$ plain form
6005 -2 -9 -14 -4 -8 -2 -7 -3 -1 1 7 1 -8 -14 -12 -13 -3 -4 -9 -6 2 7 8 0 -1 -2 4 -6 -1 2 2 -1 -9 1 0 -2 -4 -14 0 -4 -3 -4 -4 -13 0 -2 -7 -6 -5 -2 -6 -6 0 -12
6058 -12 -14 -8 -7 -10 -14 -4 -18 -1 -5 -6 -3 -7 -6 -3 0 -1 -4 6 7 -1 -3 -1 4 3 6 6 6 -2 -6 -5 2 1 -15 -6 -6 -9 -4 -13 -2 -7 -1 3 -12 -1 -4 1 -4 4 -6 -8 3
6109 3 -5 7 -9 3 0 7 -4 3 0 1 7 -4 0 -7 -9 -5 -1 4 -10 6 11 -1 -9 0 -5 -2 0 -10 -7 0 -8 -12 -5 -10 -5 0 -4 -6 -6 2 -2 -10 -11 1 -1 -11 6 3 5
6158 5 -2 -6 5 2 1 -2 -5 -12 -6 -10 -1 0 -6 -2 5 -8 -7 -5 -18 -5 -6 -17 0 3 -7 -1 -5 1 -8 -1 -7 -4 -8 -3 -11 -4 0 -4 -8 1 2 -1 -1 3 -6 -6 -4 -2 3 -8 -4 -7 -5
6211 -5 -9 -10 -9 0 -5 -4 -7 -10 0 1 -4 -5 -9 -4 -1 -2 -2 -8 -2 -2 -2 0 16 4 -4 -1 8 -4 6 1 -5 9 -9 0 -1 -4 4 3 -16 -14 -3 7 2 -8 -3 -8 -4 2 2 -7
6261 -7 -13 -7 -9 -3 -6 -8 -9 7 1 -5 1 0 4 19 2 10 0 -3 -6 -4 -2 -2 3 11 3 1 3 2 0 -3 -7 -1 -6 -11 4 -8 -6 -9 8 -3 -7 2 -1 -3 -5 0 -16 -6 -12 -2
6311 -2 9 2 -5 -2 -1 6 17 9 11 7 3 4 -1 1 7 -3 1 4 1 8 18 5 1 5 -8 2 9 -1 -1 10 -7 -6 -9 -7 -1 10 -6 -6 -2 -6 2 2 -2 1 -2 -1 8 8 13
6360 13 3 0 5 -4 7 6 4 -3 0 6 6 2 -1 1 2 5 2 -9 -2 -14 -12 -4 -2 -2 -13 -10 -16 -12 4 0 -3 8 -1 -5 -4 5 4 -2 -3 3 6 12 14 8 9 5 2 6 0 8 5 3 3
$$ packed form
6005bpnJ0mOnMKKOoroKjJ0jnLQNJqjjOj0NL%lqJ0jkkj0J4mJj%rJ3knJJLm%Oj2
6058a2kOJlmJ0j4J7mjLmJLLjlJ0JqkKNjL%%qmJPjj6R%lNrJ1nOMj5J1lNnQj0kJ1
6109CqJ2j6J2lPj1PlJOj1MpkMMNj4J6Nj2qRnLKj0LPqmPnNNmk%QmqjJ2kj0J7lK
6158EpmJ1ljllpOmRJoMPj3JKj3J3jj1J7Lj0OmOrPoLmNqPMmmRJl%Mr%KKNj1MlK
6211emjJRnJllJ0JnjmNLj%oO%%KJ6j2qLRj2J0noJ4j8RjlQjj9KJ1J0nj0NnMO%r
6261goOkOlkjJ6ooOjMJ5j7Qj0llKK%NQqkKjklmOnnJ5j2KlJ7j1mRlkkNj6J0oJ0
6311bJ1ppLJPJ1qKmmJnKOj0MLlPJ0j3mMj3J0Pj0%J1j7JlKOJ1j6%MmQ%mLlJR%N
6360A3j0lNrJ1jkpLO%mlKJLlj1Pj2KQK%j1LoMJ6mlJ1rmJRjojOLOKoJmlMoQlk%
$$ plain form
6413 3 10 0 11 7 10 -3 0 2 -2 1 -5 -4 -7 -18 -15 -11 -7 -6 0 -4 8 4 -10 0 2 3 1 4 5 2 7 13 2 7 9 4 0 12 2 4 -2 5 10 8 4 2 -5 -3 7 3
6463 3 4 -12 -11 2 -3 6 -6 -4 -1 -4 -5 -6 -16 -4 7 -1 -2 -9 2 7 -4 -2 -2 -3 7 3 8 0 6 -5 -7 -10 8 4 -11 -14 -7 -1 -6 -9 0 6 -3 -7 -7 -10 -8 -5 -9
6512 -9 1 -8 3 -3 -7 3 -9 -3 3 -6 11 11 5 1 3 6 -1 4 2 -8 -8 -5 1 -2 1 -5 -5 -10 -10 -6 -2 1 -7 -5 -1 -11 3 -7 -2 -3 -8 -8 -7 -9 -5 1 -10 -3 3 -3 -4
6563 -4 -4 1 -6 2 13 2 1 -2 0 -3 -5 5 4 2 2 1 3 1 -10 -3 -15 -1 5 -4 -10 -3 -19 -2 0 -10 -9 -5 -7 -8 -16 -11 -3 -2 4 2 -1 -4 -8 2 3 5 2 14 10 -4
6613 -4 7 0 -2 -1 3 -1 6 -5 -10 -10 -2 -5 -15 1 -13 -1 -15 -14 -16 -1 5 -3 1 -3 -7 -1 -4 -4 -2 -1 -7 -4 -3 3 8 -4 -6 -5 3 -1 -5 -6 3 4 -8 -3 2 -2 4 1 -2
6664 -2 -5 3 -8 -1 1 -12 -10 1 -9 -7 0 -3 -19 -13 -11 -15 -14 -13 -14 -6 -7 -9 -7 -9 -2 -10 -4 9 0 0 2 7 7 4 0 2 4 -5 4 1 -3 -10 -6 8 1 4 -8 -1 -2 -6 -7 -15 -10
6717 -10 -19 -5 -5 -5 -1 -2 -3 -7 -8 1 -10 0 -1 -5 -5 7 -1 2 10 7 -5 -3 2 5 6 7 6 -5 -1 3 -5 -5 -10 -1 -6 -6 -12 -2 -15 -1 -10 -11 -10 -12 1 3 -5 -3 8
6766 8 -3 1 -2 -1 -2 10 7 -6 2 7 5 4 14 6 0 4 -12 0 3 -3 -5 -11 -7 -1 6 1 -16 -4 -1 1 -10 -9 -7 -12 -7 -9 -8 -3 -7 0 0 5 -2 -6 -1 -1 -6 -6 -3 -1 -3 7
$$ packed form
6413CPj0J1mLj3LKmLoJlj1LMMJOmJ2mj4J0KJkLJlNOj1NKnmJ2j0KoPNkmkpKJ0m
6463CJj6JJ3nRj2KLljjj0J2J1qjpJ1Nj1K%jJ0mNqOj1klJ8mj5lPOnlROrm%lKLm
6512iJ0rJ1omJ0j2OOrJ7%omKLpNkj0%LOlLo%n%MMLqKMj0J4j0Njn%JkMOj1POoj
6563d%NpQJ1j1jlKlkJ0jk%jKkj1Pj2J4OroPj6J7Kj0JMkjqNQJOkllmJ0JKlJ2mj4
6613dJ1pkJMmPj1n%Qlj0J6j4J2j4JkJ5OqMmmOl%KJoLJONj2kJQmmjRJj2NNmOll
6664blQj1PKj3KJ1j0KPlj6OKmJJjQjkKkPqOJ3r%KN%lmKKrRlmpMJ4pLj2PjmjqN
6717a0rJ4%%MjjmjRj1J0jm%J2qLQlj2KNLJJjj1MMq%nRn%oJ0j3J4rjJkJ3KqKJ1
6766Hj1MlJjJ2lj3QNkjJ0qoMj6J2LokoMOPnj7J2LKj1JKnNkJNmP%NpmN%n%LKkJ0
$$ plain form
6818 7 -7 0 -4 7 9 -5 -4 1 4 -2 -14 -4 9 -13 -16 -12 -8 -10 -1 -13 -5 -4 -10 -3 -8 -10 -14 -26 -1 -5 -12 -6 -9 -2 -3 -5 -7 -1 -1 7 1 -1 5 -3 -1 8 2 0 -2 -5 2
6869 2 -11 -2 1 -13 -15 1 -10 -16 -8 -12 -11 -10 -10 -3 -16 -11 -6 -14 -7 -4 -3 0 -3 -9 -9 -7 4 3 3 2 8 -3 -6 3 -10 4 -6 -1 -11 -2 6 2 -9 -24 -3 -3 -11
6916 -11 1 -5 -8 -7 -16 -12 -4 -7 -15 -9 -2 -9 -5 -3 -2 -5 3 -5 -14 -2 2 -4 -2 -4 6 14 0 9 0 11 -6 -9 9 -7 -1 -5 -8 7 -7 1 -11 -7 -9 -22 -8 -5 -8
6963 -8 -5 -10 -8 -13 -8 -7 -4 -6 1 -4 -1 -5 -2 2 -5 -10 2 1 0 9 0 9 3 7 11 9 1 1 2 -6 -3 -2 13 -5 -2 0 -5 2 -17 -4 0 -9 -2 -9 -3 -9 -8 1 -10 -6 1 -7 -9 0 -3
7018 -3 -6 4 -10 -3 -4 2 1 -3 7 4 9 1 3 -7 -3 -5 12 -4 -17 -11 -7 -5 -6 -11 0 -11 -9 0 -11 -11 -4 -11 -8 1 0 -3 -12 -4 -6 3 -15 -4 -12 -6 6 -1 10
7065 10 11 0 9 8 -2 4 2 2 3 -2 2 -1 -5 -5 -8 -4 7 -7 -4 -2 -8 -5 -3 -5 -20 -16 -12 -6 -2 -4 6 -4 8 5 1 5 -1 -5 7 -2 6 4 0 0 -9 -6 2 -3 -7 1 -6
7116 -6 -3 -5 2 -2 -8 -2 -7 2 -11 -7 -5 -10 1 -17 -8 -16 -10 -5 -12 -2 0 -4 0 -2 5 -4 -7 -8 -12 -1 -1 2 -1 -12 -9 -5 7 -2 10 -1 -1 -2 -6 -1 -10 -6 -2 -11 -9 -1 -6 -9
7168 -9 -6 -11 -1 -1 1 -9 -9 -7 -9 -13 -7 -12 -4 -1 4 -2 3 12 -3 8 0 -9 2 10 8 -2 -4 -1 -1 -1 8 2 2 4 -8 -10 -7 -3 -1 0 -8 -6 1 -8 -5 7 -16 -5 -21 -17
$$ packed form
6818Gj4PmJ1Kj4JNLoj2J0J3k2lMMkRj2QJoPnkmj2K5mpOlPjkkO%QokOqKRokklP
6869Bj3RLj4kJ6j1oQmJJ%Pj3NNqPLJLlo%KJ1j%jOj1lRj3J4j0Nj0RQmj1j5K1%q
6916a1J2olJrMQlqOPpMKJlQqrJ2MoKkJ0Qj4RrJ1j7lJ8j6OmlJ5j4Qj2Mkj3J4Ll
6963hLnKnNJLkPnLmLMpnJ2jjRrRoMMkq%JqLJJ5j8LKnPj9J3MrPpOoJRj1MPqkRl
7018clJ0j4PjOjmJ0lNqKj0MkJ7j6j3OMKjnJ1j1KRj1%PpLRjlrQkRj8J1qOJ2pJ1
7065A0Jj1Rjj0Ok%JnMlm%lMJ1j4LKoLKkj5MMOMkJ0j0J2lmMomJ2rQkm%rLQnmQp
7116fLkPmoOnRj3MKnJ1j8RqONpJ0KmMkPrljmJ1%Llj1LMJ2rJ2j1%jmNrMMrKQnl
7168iLnJ0%Kj0%KkmOnQLNoNRj5J1qrJ1Qkj0kL%%Ro%Kj2kLMKJqKPrLJ2k3J1j6M
$$ plain form
7218 -17 -7 -16 -8 -1 -1 7 -3 6 -7 8 9 -1 3 -3 7 -4 2 -4 8 -7 -6 7 -8 15 5 -11 -12 -11 -7 -9 -16 -10 -1 -16 -10 -11 -21 -14 1 -15 -4
7259 -4 0 -10 -8 -9 0 -9 -14 -11 -5 -5 -5 6 6 10 -3 -6 5 -3 -2 2 -6 -2 1 -4 -4 -6 -14 -4 -9 -9 -3 -8 -5 -15 -15 -25 -11 -9 0 -11 -10 -11 -2 -3 -7 4 3 10 2 -2 -4
7310 -4 2 3 6 -3 4 -1 -6 6 -6 -1 -1 -3 -6 -1 0 -1 -8 -5 -16 -8 -19 -10 -6 -11 -11 -12 -15 2 -1 -9 -11 -6 -5 -3 -6 -1 -4 -4 0 -7 -4 4 -8 0 0 -12 -3 2 11 1 -2 4 6
7363 6 -6 -2 -15 -7 -5 -10 -6 5 -9 -20 -11 -7 -3 -19 -3 -4 -7 -11 -17 -6 -3 -14 -2 -6 -3 1 -3 2 -7 -10 -3 14 3 -3 -2 -1 -5 -5 0 3 1 2 -11 2 -9 -16
7409 -16 -16 -18 -8 -12 -9 -9 -14 -10 -7 -5 -12 -14 -11 -11 -3 -10 -17 -11 -5 -12 -3 -5 -5 -10 -7 0 -10 -1 8 -7 -15 -4 -3 -12 3 -4 -5 -16 -5 -11 -1 -8 -3 -9 -18 -1 -20 -1 -18
7458 -18 -12 -9 -15 -16 -9 -16 -20 -13 -3 -13 2 -3 -1 -9 -10 -4 -5 0 -5 0 4 2 -2 1 -6 9 15 7 2 -8 -11 -14 -9 0 -2 0 -18 -6 -8 -18 -18 -14 -8 -9 -16 -13 -15 -19 -16 -13 -15 -4
7510 -4 -7 -12 -11 -11 4 -8 -14 0 -9 0 6 0 -4 -19 -9 -6 2 -9 0 3 3 -11 5 2 -16 -9 -8 -6 -7 -8 -12 -13 -14 -12 -11 -10 -13 0 -5 -5 -8 -16 -13 -6 -7 -2 -5 -18 -5
7559 -5 3 7 -6 -5 -5 -3 3 4 2 1 -1 3 8 0 3 -1 1 -8 -14 -2 -17 -14 -14 -18 -15 -6 -7 -10 0 -21 -10 -3 -12 -9 -6 -1 2 -6 -3 -6 4 1 0 -8 -1 7 8 2 -2 -9 3 5 -1
$$ packed form
7218a7J0rQP%Qj0Rj3J5Jj0MoJ0j1OoJ2j5JJ3j5K3j0j6jJMkpORj5Ojj0PJ5j6J1
7259dMj0KjRrnLO%%J1%Mj3lJ1qJMqMLn%kqJ0n%OnLj0%j0J4KRj1JjRjmJ1jPqmk
7310dOJLrPnnJ2j2N%klNJjpLj1Qj1RMn%jlJ7lqkNJKlNl%MpLQj2Q%j2RNRj0lOK
7363Fj2Mj3QKnMJ1j4j1RMMj6J6jlmoJ1Lj1J2mLMmNrlPJ7j1oJJm%NLkJj3J3j1p
7409a6%kJ0mL%nMLKpkL%QppOOpRk%nLPj0RRj5qJ1JrJ5pjj1J1oJ0pNorJ7j9J9j7
7458a8OLojPpmPJ0j0J5nKqjOjNnNMkmLpJ5Oqnj0llNRkKj8J2kj0%MOjpLkmLLkJ1
7510dlnJ%J5j2oJ4rROomj5J0LQj1RL%j4J6lj8PJKjjmjjKJJlJ3n%lqLPjNlj3J3
7559eQMj3J%KOJkjkMNqLmKroJ2j5L%mLRjlJ0k1J1PrLLNLqLlJ0ljqPQJompJ2Ko
$$ plain form
7612 -1 -6 2 -7 1 -4 -5 -3 -9 -7 -4 -15 -12 -11 -7 -14 -1 -10 -14 -10 -22 -11 -9 -16 3 -8 -7 -10 -5 -4 1 -4 1 -4 1 -1 11 5 6 5 2 -2 -5 -3 -3 -13 -10 -5 -5 -8 -7 -10 -11 -3
7665 -3 -11 -2 0 -11 -12 -16 -8 -14 -8 -19 -10 -10 -6 -5 -12 3 -7 -5 -8 -12 3 3 1 -1 -7 9 4 -3 -8 2 -12 -3 -11 3 -1 -5 -5 -3 -3 -3 -5 -4 -10 -13 -1 -9 -9 -1 -8 -12 -14
7716 -14 -2 -10 -6 -2 5 -6 -4 -7 -7 -5 5 -7 -5 3 7 -2 -6 -2 4 6 6 -10 1 11 -17 1 0 -5 -1 -6 -4 -12 -13 -13 -8 -17 -12 -16 -11 -9 -6 -8 -6 -1 -11 5 11 -3
7764 -3 3 4 3 -2 11 2 -3 0 -1 5 2 -6 4 -9 -8 -8 -5 -12 1 0 -11 -5 -8 -5 1 -6 -13 -18 -9 -16 -13 -12 -8 2 -10 -12 -9 -7 -1 -6 -6 3 1 10 13 -4 4 13 12 -3 5 0
7816 0 -1 6 3 4 -3 4 -1 0 2 8 -6 0 -12 -4 -12 -2 -14 -2 -3 -2 7 -6 6 -6 -4 -16 -2 4 -9 -5 0 -3 -1 -1 12 12 13 9 1 5 0 1 0 -2 8 -9 0
7863 0 5 -4 -6 -7 2 3 -2 -7 -13 -1 4 0 4 4 5 -10 -6 0 9 -2 7 6 8 2 8 -2 3 8 12 -1 6 10 -4 5 -1 7 -8 0 2 1 7 0 7 7 -1 -4 -1 -1 0 -2 -13 -10 -3
7916 -3 -9 -6 4 -9 -5 1 -4 -4 -12 8 0 -3 10 -6 4 5 5 6 23 8 5 11 1 11 -3 8 -2 -1 1 10 3 5 1 -8 9 -4 8 -6 0 -7 -9 -8 5
7959 5 6 -8 -4 -5 -2 -4 -2 -7 1 1 -4 2 -3 -2 2 6 1 11 -6 11 8 -7 0 12 0 -1 4 -8 -3 5 -9 -6 3 -1 -5 0 -3 -14 -12 -16 4 -8 -8 -13 -6 -18 -2
$$ packed form
7612anQrQnjKoKLj1LJMpJ3rmMj2J1KpJ9j1JlNJNnNnNkJ2oJjlmlK%j0LN%lJljQ
7665cqRKj1jmQoOj1R%MJpJ5j0KlmJ5%kkoJ6npnJ0j4RqJ4mm%K%%kJolJ2q%Qpmk
7716a4J2qMMPj1Kl%KJ0j2KQMrmMOK%j6J1J0k8J8jnMnKqj%NrNmNKLkKNj0J6Oj4
7764cOJjnJ3rnLjOlqJ0j3J%LpJ3jj1OlLOppnRpLJMJ0j2kLKOn%RkRLj7QRjj5Qn
7816@jPlJpPnJKOj4Oj2QqJ0j2J2jJRj3J2j2Kj2J4Oj3MNlK%J3%JmqMnJjkJ0j7R
7863@NrkjRJnnoJ2NmM%Jj5MORj1RjKoOj0NNMj3PMj4RoQj5QKjOpP%qlL%Jkj1LP
7916coLJ0j3MOn%qK0qlJ3j6J0J%JJ7j5lOj0J0j4J1j0JKRpKmrJ7j3J2j4OpkJJ3
7959EJj4MjLkKnQ%nOnJMMnJ0j7J7lj5PJ2j2jNj2NQj4LRmmNlj1KmK0j2%nPj2J6
$$ plain form
8006 -2 6 -2 8 -4 -2 6 -2 8 3 1 2 -2 12 1 8 8 5 7 -1 0 4 7 3 -4 -2 -3 -3 -10 0 -2 -5 2 -10 -4 -7 -3 2 -13 -9 -8 -6 -12 0 -3 2 3 7 3 3 -4 -3 7
8058 7 2 10 6 14 6 -7 9 8 9 9 3 5 -6 0 7 -1 2 -4 5 3 -6 -10 -6 -15 0 0 -9 -9 1 0 -6 5 4 -4 -6 11 4 0 1 2 12 4 13 6 7 6 -3 14 12 10 4 -4
8110 -4 5 2 -13 0 6 -9 -8 -4 -13 1 -9 -3 -9 3 -4 0 3 -6 -12 -5 -3 -2 5 -6 7 -8 12 2 -1 10 3 13 1 11 4 -1 10 12 6 2 6 4 17 2
8154 2 3 -5 -11 -4 -2 -12 -15 -6 -2 -6 -5 -4 -5 -1 -9 -5 -3 -5 -3 8 -2 -7 0 7 5 13 7 -4 3 12 6 2 0 -3 -3 8 12
$$ packed form
8006bQqJ0j2KQqJ0nkJmJ4j1P%lKqJMLmpKj%pJ0klPj2OlMNj5MJKoJ2lNJMm%pJJ0
8058GnQmQqj3J6jJ%oKj1OPqLoRkrmMrJ5%r%J0joJ1jqkJ7pmJJJ0qRpJjrJ7kkoq
8110dRlj5J3Oj5JMrJ4j0OoJ2pMLroPKJPj1J3j5K0j0lJ1pJ0j2J0pnJ1KomMkJ3j5
8154BJqoPKj0lRMmJJjMqMKkKJ1j0nPPkQoj1PRomkl%J1M
8191A2
$$ Imaginary data points
##PAGE= N=2
##DATA TABLE= (X++(I..I)), XYDATA
$$ plain form
0 0 0 0 0 0 0 0 0 0 0 0 6 -8 8 -8 8 -16 16 -24 24 -32 40 -48 56 -64 80 -94 104 -122 144 -164 185 -214 240
33 240 -274 311 -350 392 -440 492 -548 610 -678 751 -832 920 -1017 1124 -1239 1363 -1504
50 -1504 1656 -1826 2012 -2220 2452 -2714 3011 -3355 3753 -4222 4786 -5476 6344 -7473 9012
65 9012 -11243 14778 -21248 36933 -155301 -53403 293421 -2320 -130397 68263 65444
76 65444 -214293 -57552 284568 135023 -242666 -114523 154950 24938 -128626 91651
86 91651 149301 -155802 -202593 144544 188417 -107579 -113905 117128 26434 -160234 23677
97 23677 211361 -27637 -212532 21716 166363 -52287 -112559 107860 83516 -161552 -79724
108 -79724 179048 74526 -162221 -39220 140801 -16473 -135320 68635 141945 -96455
$$ packed form
0@%%%%%%%%%%Oj4J6j6J6k4L2m0M8n6P2q8J04j20J44j74J98k26K66l08L49l99M54
33B40n14N85o61P42q32R32j040J158j288J429j583J752j937K141k363K602k867
50a504L160l482L838m232M672n166N725o366P108p975R008j0262J1820j3817J6485
65I012k0255K6021l6026N8181j92234J01898L46824k95741j28077J98660k819
76F5444k79737J56741L42120j49545l77689J28143K69473j30012j53564K20277
86I1651N7650l05103m6791L47137M3873k95996o326K31033r0694j86668J83911
97B3677J87684k38998j84895K34248J44647k18650o0272K20419k4344k45068Q1828
108g9724K58772j04522k36747J23001J80021j57274j18847K03955P3310k38400
$$ plain form
118 -96455 -140606 102086 113749 -106441 -69420 121974 26748 -142787 1432 153473 -17887
129 -17887 -143171 36787 118244 -65227 -92689 96755 74208 -119405 -59478 126318 38923
140 38923 -122090 -8726 116283 -25100 -112971 53460 108550 -71819 -96141 83393 73714
151 73714 -94227 -46326 105919 20488 -114627 841 115147 -19932 -106282 40320 91609
162 91609 -62113 -75590 81518 59784 -94422 -42511 99800 21609 -99901 2285 97383
173 97383 -25776 -92704 45630 84274 -60861 -70598 72664 52425 -82321 -32435 89457
184 89457 12961 -92387 5121 89772 -22428 -82145 39309 71190 -54911 -58491 67449
195 67449 44366 -75670 -28573 79547 11056 -79966 7164 77551 -24419 -72275 39442
$$ packed form
118i6455m4151K42692J1663k20190L7021J91394r5226j69535J44219J52041j71360
129a7887j25284J79958Q1457j83471k7462J89444k2547j93613N9927J85796q7395
140C8923j61013J13364J25009j41383q7871J66431N5090j80369k4322J79534r679
151G3714j67941M7901J52245q5431j35115J15468J14306j35079q6350J46602N1289
162I1609j53722j3477J57108k1734j54206N1911J42311p8191j21510J02186R5098
173I7383j23159o6928J38334L8644j45135r737J43262k0239j34746M9886J21892
184H9457p6496j05348R7508Q4651j12200n9717J21454L1881j26101l580J25940
195F7449k3083j20036M7097J08120o8491r1022Q7130P0387j01970m7856J11717
$$ plain form
206 39442 63661 -51920 -51715 61972 37290 -69559 -21657 74187 5905 -75149 9516 72219
218 72219 -24347 -65804 38161 56770 -50098 -45739 59308 33066 -65239 -19069 67914 4311
230 4311 -67628 10344 64528 -23972 -58724 35865 50286 -45758 -39654 53443 27427 -58709
242 -58709 -14433 61255 1281 -60886 11569 57649 -23750 -51860 34727 43979 -43924 -34388
254 -34388 50902 23433 -55342 -11533 57213 -751 -56552 12765 53427 -23917 -47930 33698
266 33698 40311 -41741 -30955 47805 20395 -51625 -9185 52949 -2139 -51817 13099 48292
278 48292 -23275 -42688 32133 35292 -39326 -26512 44522 16732 -47551 -6404 48373 -3978
290 -3978 -47035 13942 43650 -23015 -38354 30848 31457 -37132 -23290 41662 14291 -44239 -4819
$$ packed form
206C9442K4219j15581K05J13687k4682j06849M7902R5844o8282q1054Q4665O2703
218G2219r6566m1457J03965J8609j06868M359J05047k6242r8305M6170Q6983o3603
230D311p1939P7972N4184q8500l4752R4589J4421r6044O104R3097k6016q6136
242e8709M4276P5688n9974o2167P2455M6080q1399k8110Q6587R252q7903R536
254c4388Q5290k7469p8775M3809O8746n7964n5801O9317M0662p7344k4013Q1628
266C3698O613q2052J0786P8760k7410p2020M2440O2134n5088m9678O4916L5193
278D8292p1567j9413P4821L159p4618J2814P1034k7790o4283M1147N4777n2351
290c978m3057O0977K9708o6665j5339O9202O09o8589J3842O4952k7371n8530L9420
$$ plain form
303 -4819 44775 -4628 -43293 13676 39891 -21955 -34783 29082 28205 -34735 -20521 38690 12034
316 12034 -40822 -3167 41035 -5673 -39409 14041 35993 -21613 -31026 28016 24701 -33032
328 -33032 -17424 36420 9489 -38088 -1321 37991 -6729 -36167 14298 32753 -21046 -27933
340 -27933 26708 21991 -31020 -15172 33841 7820 -35065 -283 34691 -7093 -32758 13970
352 13970 29380 -20072 -24739 25134 19070 -28939 -12670 31360 5814 -32305 1159 31748
364 31748 -7948 -29757 14233 26430 -19740 -22000 24253 16647 -27568 -10651 29555 4297
376 4297 -30169 2135 29412 -8314 -27322 14007 24052 -18919 -19753 22899 14672 -25734 -9012
389 -9012 27347 3091 -27678 2857 26743 -8549 -24617 13731 21406 -18173 -17300 21683 12477
$$ packed form
303d819M9594m9403l8665N6969K6215o1846j2828O3865q77o2940J4214N9211k6656
316A2034n2856L7655M4202m6708l3736N3450K1952n7606r413N9042l315n7733
328c3032J5608N3844k6931m7577L6767L9312m4720k9438N0465J8455n3799o887
340b7933N4641m717n3011J5848M9013k6021m2885L4782L4974m1784k5665M6728
352A3970J5410m9452m667M9873o064m8009J6269M4030k5546l8119L3464L0589
364C1748l9696k1809M3990J2197m6170k260M6253p606m4215J6917M0206k5258
376D297l4466L2304K7277l7726j9008M1329J0045m2971q34M2652q227m0406J6722
389i012L6359k4256l0769L0535K3886l5292j6068L8348P675l9579Q73L8983r206
$$ plain form
402 12477 -24169 -7189 25475 1685 -25623 3784 24577 -8984 -22450 13677 19343 -17645
414 -17645 -15423 20731 10886 -22834 -5928 23856 826 -23769 4226 22621 -8965 -20460
426 -20460 13220 17420 -16801 -13656 19516 9343 -21316 -4688 22106 -79 -21877 4776
438 4776 20651 -9159 -18514 13030 15579 -16254 -11991 18655 7900 -20218 -3571 20788 -874
451 -874 -20428 5177 19139 -9193 -17011 12688 14168 -15560 -10731 17675 6878 -18936 -2794
464 -2794 19338 -1343 -18834 5347 17518 -9013 -15405 12208 12646 -14791 -9365 16648 5711
477 5711 -17726 -1887 17972 -1968 -17408 5664 16048 -9037 -14018 11949 11348 -14262 -8235
490 -8235 15883 4810 -16770 -1224 16872 -2366 -16215 5780 14849 -8857 -12821 11482 10247
$$ packed form
402A2477l6646J6980L2664k3790k7308K9407K0793l3561j3466L6127N666l6988
414a7645K222L6154r845l3720J6906K9784k3030k4595K7995J8395l1586j1495
426b0460L3680M200l4221L145L3172j0173l0659J6628K6794k2185k1798K6653
438D776J5875k9810r355L1544K549l1833M263L0646j0755k8118J6647K4359k1662
451h74j9554K5605J3962k8332p818K9699J480k9728M829K8406j0797k5814J6142
464b794K2132k0681j7491K4181J2171k6531o392K7613M38k7437N426K6013j0937
477E711k3437J5839J9859j9940j5440K3072J0384k5085m981K5967o01k5610O027
490h235K4118j1073k1580J5546J8096j9238j3849K1995R069k3706l964K4303j235
$$ plain form
503 10247 -13535 -7264 14952 4033 -15633 -651 15636 -2694 -14896 5841 13518 -8660
515 -8660 -11533 11057 9074 -12882 -6250 14106 3186 -14672 -60 14543 -3040 -13794 5924
528 5924 12416 -8514 -10515 10644 8152 -12292 -5487 13325 2608 -13749 342 13540 -3207
541 -3207 -12723 5871 11342 -8235 -9463 10190 7206 -11613 -4645 12500 1940 -12802 842
554 842 12503 -3495 -11649 5952 10283 -8112 -8464 9846 6293 -11102 -3863 11843 1308 -12019
568 -12019 1255 11644 -3732 -10752 5980 9377 -7925 -7614 9453 5515 -10548 -3213 11121
581 11121 821 -11184 1575 10738 -3846 -9797 5905 8450 -7643 -6722 9025 4736 -9942
594 -9942 -2561 10417 323 -10397 1893 9895 -3988 -8962 5855 7635 -7444 -6002 8651
$$ packed form
503A0247k3782O271K2216j0919j9666J4982J6287j8330j2202K0737P677k2178
515h660k873K2590j983k1956O632K0356j0920j7858J4612J4603j7583j0754J9718
528E924O492k0930k001K1159k492k0444O805J8812j0717j6357J4091J3198j6747
541c207r516J8594N471j9577j228J9653k984j8819O968J7145j0560j4742J3644
554H42J1661j5998q154J7601M331j8395l52J8310l553j7395P239J5706j0535j3327
568a2019J3274J0389j5376p020J6732L397j7302L11J7067l938j6063P335J4334
581A1121j0300j2005J2759R163j4584n951J5702K545j6093R21J5747m289j4678
594i942P381J2978j0094j0720J2290Q002j3883m974J4817J780j5079J442J4653
$$ plain form
607 8651 4096 -9463 -2068 9812 -55 -9719 2108 9179 -4061 -8242 5766 6925 -7203 -5327
621 -5327 8268 3499 -8952 -1557 9190 -426 -9027 2357 8436 -4144 -7474 5695 6188 -6965
635 -6965 -4642 7891 2913 -8458 -1095 8599 -757 -8367 2507 7756 -4135 -6804 5542 5549 -6659
650 -6659 -4100 7466 2461 -7925 -765 8004 -967 -7737 2589 7106 -4092 -6181 5380 4975
664 4975 -6404 -3569 7100 2019 -7478 -388 7500 -1221 -7186 2752 6556 -4126 -5629 5295
678 5295 4441 -6199 -3093 6803 1615 -7075 -102 7033 -1398 -6686 2799 5998 -4046 -5097 5063
693 5063 3954 -5872 -2678 6346 1278 -6571 118 6467 -1497 -6072 2777 5421 -3915 -4539 4860
708 4860 3463 -5555 -2244 5988 941 -6140 394 6026 -1683 -5623 2878 4960 -3916 -4102 4763
$$ packed form
607H651m555j3559P395J1880r867r664J1827P071j3240m181J4008J159j4128J876
621e327J3595m769j2451P395J0747r616q601J1384O079j2580l330J3169M93j3153
635f965K323J2533m978j1371P363R694r356p610J0874N249j1891k669J2346Pj2208
650f659K559J1566n005j0386P160Q769q971o770J0326M517j1198k089J1561m05
664D975j1379K835J0669n081r497P090P888q721n965R938L804j0682j503J0924
678E295q54j0640L106R896n188q690O973P135q431n288R485L199j0044j051J0160
693E063j109r826L194R024n068p849O689O349p964m575Q849K644r336o24R399
708D860j397r018L311Q232n047p081O534N632p709l940Q501K082q876j86Q865
$$ plain form
723 4763 3041 -5386 -1877 5733 627 -5818 600 5623 -1820 -5198 2876 4516 -3828 -3675 4550
738 4550 2643 -5078 -1543 5346 373 -5379 754 5139 -1848 -4699 2823 4043 -3659 -3220 4311
753 4311 2270 -4758 -1232 4979 157 -4964 912 4742 -1919 -4286 2814 3657 -3580 -2867 4169 1939
769 1939 -4561 -954 4715 -76 -4681 1077 4397 -2034 -3946 2848 3292 -3544 -2506 4038 1601
784 1601 -4357 -670 4445 -297 -4337 1226 4032 -2067 -3557 2805 2921 -3392 -2160 3822 1317
799 1317 -4066 -449 4131 -433 -4019 1278 3690 -2059 -3227 2717 2599 -3276 -1891 3637 1089
814 1089 -3853 -269 3873 -583 -3725 1371 3390 -2123 -2933 2725 2311 -3207 -1605 3524 833 -3687
830 -3687 -41 3666 -747 -3475 1488 3129 -2139 -2626 2685 2038 -3089 -1350 3348 637 -3446 103
$$ packed form
723D763j722q427L509P610n106o445O418N023p443l378Q074J640q344J53Q225
738D550j907p721L535O889m973n752O133M385o987k851P522J220p702M39P531
753D311k041p028L526O211m822n121N876L830o661k367P100Q43p237P13P036k230
769A939o500L607N669m791m605N758L320o431j912O794M44o836J038O544k437
784A601n958L687N115m742m040N563K806o099j490O362J16o313J232N982k505
799A317n383L617M580m564l586N297K412n749j168N944j18n875J385N528k548
814A089m942L584M142m456l142N096K019n513q10N658m14n518J602N129k691m520
830c687L646L707m413k728M963J641n268m87N311o47n127J739M698k711m083L549
$$ plain form
846 103 3386 -827 -3186 1486 2815 -2084 -2335 2552 1767 -2920 -1137 3123 451 -3208 226 3117
862 3117 -921 -2903 1525 2547 -2060 -2102 2512 1538 -2825 -922 3005 269 -3040 394 2944 -1014
878 -1014 -2697 1602 2339 -2073 -1866 2471 1336 -2726 -743 2850 117 -2846 481 2722 -1069 -2475
894 -2475 1565 2106 -2009 -1663 2327 1143 -2569 -603 2659 12 -2649 543 2489 -1070 -2252 1539
910 1539 1901 -1954 -1463 2237 975 -2435 -438 2530 -89 -2465 632 2334 -1112 -2063 1559 1719
926 1719 -1913 -1297 2179 821 -2330 -311 2377 -215 -2324 692 2146 -1160 -1890 1537 1524 -1864
942 -1864 -1133 2070 664 -2218 -193 2230 -296 -2150 738 1965 -1156 -1715 1510 1373 -1781 -985
958 -985 1992 550 -2092 -103 2089 -346 -1995 778 1814 -1154 -1556 1476 1228 -1739 -846 1899
$$ packed form
846A03L283m213k359M672J329m899k51M887p85m687J783M260k672l659L434K891
862C117m038j982M428J022m607m2M614r74m363J903L927k736l309L434K550l958
878a014j683M299P37m412K07M337j135m062J983L593k733k963L327K241l791j406
894b475M040N41m115L46L990j184l712J966L262k647k661L192J946l559j182L791
910A539L62l855M91L700j262l410J997K968k619k376L097J702l446r51L622J60
926A719l632O16L476j358l151K019K688k592k109L016J454l306p30L427j3l388
942a864P31L203j406k882K025K423k526j854K888J227l121n59L225j37l154P96
958i85K977j442k642J989K192k435j649K773J036k968m02L032k48k967Q93K745
$$ plain form
974 1899 430 -1989 -10 1960 -422 -1866 813 1672 -1179 -1423 1457 1074 -1698 -720 1827 315
990 315 -1884 74 1844 -483 -1730 841 1544 -1173 -1273 1432 971 -1631 -593 1751 236 -1768
1006 -1768 149 1731 -526 -1599 867 1416 -1167 -1150 1395 847 -1562 -484 1664 146 -1678 220
1022 220 1625 -569 -1492 871 1292 -1149 -1036 1377 731 -1503 -405 1591 69 -1583 275 1524
1038 1524 -589 -1384 895 1190 -1124 -923 1326 649 -1439 -326 1527 1 -1493 325 1428 -621
1054 -621 -1278 901 1082 -1117 -820 1287 555 -1404 -243 1441 -67 -1422 364 1317 -655 -1184 894
1071 894 972 -1104 -740 1247 475 -1335 -175 1358 -117 -1310 409 1232 -648 -1066 896 883 -1053
1088 -1053 -637 1197 393 -1254 -104 1272 -165 -1236 432 1141 -667 -986 875 785 -1050 -556 1152
$$ packed form
974A899j469k419J979J970k382j444K679Q59k851k44K880l83k772R78K547j512
990C15k199J958J770k327j247K571P03k717j00K705m61k602J038K344j515k004
1006a768J917J582k257j073K466N49k583J7K545n48k409J078K148j518j824J898
1022B20J405k194r23K363M21k441J13K413o46k234J098J996j522j652J858J249
1038A524k113p95K279K95k314K01K249o77k088J113J853j526j494J818J103k049
1054f21o57K179J81k199K97K107p32j959J161J684j508j355J786R53j972n29K078
1071H94P8k076L64J987p72j810J160J533j475j193J719Q23j880m18J962j3j936
1088a053M16J834q04j647J150J376j437j071J668P09j808l19J861r0j835M94J708
$$ plain form
1105 1152 301 -1219 -50 1215 -211 -1160 453 1051 -692 -906 869 709 -1016 -485 1100 242 -1150
1122 -1150 11 1138 -248 -1077 476 968 -674 -810 827 624 -955 -411 1039 192 -1084 42
1138 42 1054 -269 -995 485 876 -674 -732 815 546 -937 -354 1007 118 -1029 85 992 -310
1155 -310 -931 510 816 -672 -659 819 480 -914 -280 969 76 -983 144 949 -341 -858 514
1172 514 750 -661 -591 789 418 -871 -231 917 29 -913 163 864 -349 -788 506 670 -654 -526
1190 -526 756 362 -829 -192 860 -12 -862 182 809 -370 -730 520 613 -647 -478 752 323 -796
1208 -796 -125 830 -42 -808 222 774 -375 -677 532 560 -641 -417 729 270 -774 -96 779 -87
1226 -87 -758 234 705 -382 -633 507 505 -622 -375 685 225 -732 -60 744 -86 -716 248 658 -377
$$ packed form
1105A152q51j520J169J265j426r49J613N98j743k14J775j60j725N31J585q58j392
1122a150J161J127j386q29J553M92j642j36J637k03j579N44J450q47j276J126
1138D2J012j323p26J480L91j550n8J547k69j483N83J361q89j147J114R07j302
1155c10o21J441L06j488J3J478l39j394O34J249q93j059J127Q05j290n17J372
1172E14K36j411P0J380l71j289O40J148q88r42J076P01j213m39J294J64j324J28
1190e26J282l94j191O37J052q72q50J044O27j179l60J250R3j260J69J230m29j119
1208g96O71R55q72p66J030N52j149l02J209K8j201K24J146m59j044O78Q75q66
1226h7o71R92M71j087k51J140kj127K47J060m60r57O72Q04q30o30R64M10j035
$$ plain form
1245 -377 -569 491 470 -600 -323 663 190 -691 -32 718 -125 -669 267 619 -389 -538 525 406 -597
1264 -597 -288 654 141 -688 -2 657 -155 -645 275 564 -399 -479 498 366 -577 -242 624 108 -642 22
1284 22 637 -157 -592 282 516 -384 -426 479 335 -547 -213 597 86 -604 53 592 -181 -553 288 490 -400
1305 -400 -405 482 283 -544 -176 572 48 -592 69 565 -197 -518 302 441 -402 -364 469 252 -519 -145 560
1326 560 26 -552 87 522 -200 -477 311 409 -379 -310 467 219 -489 -122 510 -3 -510 103 487 -212 -439
1347 -439 297 371 -380 -287 431 193 -482 -87 496 -34 -486 129 440 -228 -400 307 335 -368 -251 431 162
1368 162 -457 -60 461 -43 -447 147 417 -228 -365 322 305 -369 -214 417 122 -434 -35 435 -70 -432
1388 -432 146 382 -224 -345 302 264 -367 -189 398 103 -415 -28 402 -68 -394 153 351 -226 -308 291 236
$$ packed form
1245c77j92J060k1j070K77R86m73q81O59P50q43n44R36L52j008j49J063j19j003
1264e97L09R42n13q29O86O59q12m90R20K89r63q0R77j32r43L35Q66n16p50O64
1284B2O15p94m35Q74K34r00m2R05j44q82L34Q10n11o90O57N39p73l72Q41K02q90
1305d00nQ87j99q27L68P48n24o40O61M96p62l21Q20J39q43L8Q33k17p71L74P05
1326E60n34n78O39M35p22k77P88R8p88O9P77k48p08L67O32n13n07O13L84o99k27
1347d39P36P4p51R3P18k38o75L95N83n30m52O15L11o68j72P07K8p03J17O82k69
1368A62o19L97N21n04m04N94K70o45j37O87j7o74J55O31k95n56L99M70n05l62
1388d32N78K36o06j21O47l8o31J78N87k95n18L87M30m70l26N47J98n77q2N99n5
$$ plain form
1409 236 -348 -156 381 82 -394 1 386 -70 -374 167 332 -232 -277 292 207 -327 -137 376 58 -368 23
1430 23 354 -102 -348 162 291 -239 -251 282 176 -329 -124 336 32 -350 26 328 -111 -306 176 268 -231
1451 -231 -214 285 159 -301 -93 331 22 -329 48 317 -107 -286 177 242 -233 -196 273 140 -285 -70 310
1472 310 2 -311 56 283 -127 -269 183 220 -230 -190 246 106 -282 -63 284 1 -292 70 269 -133 -245
1493 -245 183 203 -204 -162 250 113 -267 -37 270 -21 -258 73 242 -122 -227 178 179 -214 -133 241 79 -258
1515 -258 -35 255 -39 -253 81 221 -135 -199 174 161 -209 -113 231 56 -249 -15 236 -56 -228 99 218
1536 218 -129 -176 176 137 -199 -80 229 44 -232 9 232 -47 -201 106 183 -142 -161 166 106 -203 -83 216
1558 216 31 -225 3 204 -66 -207 100 170 -151 -150 173 94 -185 -60 196 19 -204 22 191 -67 -178
$$ packed form
1409B36n84J92N37k99m76L95L85m56l04N41J65n64m5N69q5n34J90N13l18m26L91
1430B3L31m56k46N10J29n30j2N33j06n05K05M60l04l82L76L02m39j95M82R2m99
1451b31J7M99j26m60K08M24l09l51L77K69m24j79M63O5m75L7M69j33m25K15L80
1472C10l08l13L67K27m10j42M52L7m50M0M36j40l88K19L47k83k93L62J99m02j12
1493b45M28K0m07M2M12j37l80K30L07k91k37L31J69l64j05M05Jl93Q1L74j62l37
1515b58K23K90k94k14L34J40l56o4L73j3l70R6L44j75l05K34K51k92j72L27J19
1536B18l47m7L52l9l36J19L09j85k76K41K23k79j54L07P7l25j9L27o0l09J20K99
1558B16j85k56K28K01k70j41L07P0l21JL23p9k79J25K56j77k23K26J69k58j11
$$ plain form
1579 -178 110 169 -132 -117 169 87 -175 -39 205 22 -189 29 178 -79 -171 108 136 -143 -109 159 62 -177
1601 -177 -41 183 -18 -187 46 170 -81 -148 121 113 -149 -90 165 63 -163 -21 172 -15 -167 55 164
1622 164 -83 -133 123 126 -138 -83 158 52 -159 -7 166 -26 -156 55 139 -97 -124 119 92 -140 -69 144 31
1645 31 -154 7 150 -35 -142 64 131 -90 -110 117 83 -143 -59 151 35 -138 19 156 -37 -133 72 124
1667 124 -96 -102 130 81 -128 -40 140 20 -148 17 129 -46 -127 66 106 -109 -91 115 61 -134 -34 137 1
1690 1 -140 32 133 -53 -113 84 105 -91 -79 117 60 -119 -15 129 -9 -113 35 120 -61 -100 83 99 -91
1713 -91 -70 120 49 -109 -14 134 -13 -120 33 111 -62 -101 84 77 -103 -60 109 35 -126 2 116 -14 -115
1736 -115 40 108 -61 -86 88 74 -96 -48 116 21 -111 2 113 -13 -98 57 104 -70 -82 98 70 -96 -33
$$ packed form
1579a78K88N9l01J5K86q2k62J36K44j83k11K18J49k57r2K79K8k79L4K68r7k39
1601a77J36K24k01j69K33J24k51o7K69qk62N9K55j02k26J42J93j87j52K22J09
1622A64k47n0K56Lk64N5K41j06k11J52J73j92j30K11Q4k36k7K43k7k32P1K13j13
1645C1j85J61J43j85j07K06O7k21k0K27l4k26Q4K10j16j73J57J37j93r6K05N2
1667A24k20oK32m9k09Q8J80j20j68J65J12j75q1J93M0k15J8K06n4j95J00J71j36
1690Aj41J72J01j86o0J97K1j96J2J96n7j79J04J44j38j04J48Q5j81l9J83J6j90
1713i1K1J90p1j58R5J48j47j07J53P8j73l9J85pj80M3J69p4j61J28J14j30j01
1736a15J55O8j69k5J74j4j70M8J64r5j32J13J11j26q5J55M7j74j2J80k8j66O3
$$ plain form
1759 -33 115 16 -111 2 105 -32 -110 49 88 -80 -83 78 58 -97 -38 102 -3 -100 11 101 -43 -103 53 78
1783 78 -68 -66 95 43 -100 -29 107 9 -100 31 101 -33 -86 67 82 -79 -62 87 39 -99 -38 98 2 -103
1807 -103 6 98 -42 -86 55 79 -80 -64 88 26 -97 -16 93 -12 -97 36 97 -34 -79 64 72 -72 -44 95
1831 95 35 -93 -8 93 -5 -88 33 97 -46 -67 61 63 -67 -37 83 23 -91 -15 95 -15 -97 28 78 -53 -73
1856 -73 64 60 -78 -38 79 7 -97 -7 90 -18 -83 37 87 -43 -62 74 60 -82 -30 90 21 -77 5 94 -20
1881 -20 -79 41 74 -58 -64 66 41 -86 -20 84 7 -90 9 81 -29 -80 39 62 -62 -62 66 40 -72 -18 78 5
1907 5 -79 20 87 -16 -67 48 64 -55 -44 70 37 -71 -16 85 1 -71 13 81 -25 -68 58 59 -53 -39 62 33
1933 33 -68 -10 63 2 -81 22 73 -30 -71 50 47 -62 -35 62 14 -66 -9 79 1 -65 30 63 -26 -55 44 48 -51 -34 61
$$ packed form
1759c3J48r9j27J13J03j37p8J59L9j68lJ61k0j55N9J40j05r7J11R0j44o0J56K5
1783G8j46KJ61n2j43P1J36r8j09J31P0j34n3J53J5j61J7J49m8j38O1J36r6j05
1807a03J09R2j40m4J41K4j59J6J52o2j23Q1J09j05q5J33O1j31m5J43Qj44K8J39
1831I5o0j28Q5J01r8q3J21O4j43k1J28Kj30L0J20o0j14P6J10j10q2J25N0j31k0
1856g3J37mj38M0J17p2j04R0R7j08o5J20N0j30j9J36j4j42N2J20o9r8Q2Q9j14
1881b0n9J20L3j32oJ30k5j27O6J04p7r7R9P2j10n1J19K3j24%J28k6j12N4R6p3
1907Eq4R9O7j03n1J15J6j19J1J14l3j08N5J01q4p2Q4O8j06m3J26Jj12J4J01k9
1933C3j01N8P3o1q3J03N1j03m1J21lj09K7R7m8q0N7Q8p8o6R5L3q9k9R9Mr9J7R5
$$ plain form
1962 61 28 -73 -7 70 -8 -72 22 59 -43 -64 36 42 -58 -35 55 19 -71 -5 59 -8 -66 21 58 -36 -45 39 32 -53 -26 65
1992 65 26 -56 1 66 -11 -62 35 65 -38 -44 50 36 -53 -30 59 14 -58 1 57 -15 -64 10 50 -47 -52 40 23 -72 -23 56 3
2023 3 -75 0 66 -20 -54 21 42 -33 -46 49 36 -51 -12 62 7 -62 7 64 -20 -48 28 49 -32 -39 51 31 -54 -23 56 -10 -59
2054 -59 3 52 -21 -59 28 41 -44 -40 41 18 -60 -12 49 -5 -60 11 50 -32 -55 34 50 -39 -42 42 14 -43 -19 54 4 -59 5
2085 5 46 -24 -37 36 43 -46 -27 40 13 -60 -9 50 -19 -66 8 45 -17 -46 22 31 -39 -22 41 1 -56 -16 51 5 -48 22 47 -30
2117 -30 -35 37 36 -38 -15 55 16 -53 -3 52 -2 -42 27 44 -39 -40 34 31 -46 -24 36 9 -65 0 43 -11 -48 29 38 -32 -29 33 26 -37
2151 -37 -28 45 20 -49 -1 45 -6 -35 33 33 -21 -28 43 27 -36 -7 49 8 -54 5 43 -12 -41 24 46 -30 -29 28 9 -44 -28 46
2183 46 -2 -51 -5 33 -19 -35 17 30 -33 -28 41 23 -33 -16 52 7 -43 8 42 -10 -28 28 37 -23 -25 46 21 -32 -13 41 3 -33
$$ packed form
1962F1l3j01O6P7p8o4R4L7j02k1J00Oj00K3R0l6r0O6O4o7n8Q7L7r4rQ4pq5K7R1
1992F5l9q2N7O5p7n1R7L0j03oR4j4q9K3Q9m5p2N9N6p2m9P4M0r7nR2j7r5M9P9n3
2023Cp8P5O6q6l4P5K1p5j3R5j3q7L9P4n5o9O9N7q4k8P6K1q1pR0k0q5L1P9o6m9
2054e9O2M9p3l8Q7J3q5MQ1k3p8M8O1n4n5P1L9q2k3Q9J6q9lQ4k8n7K4P3n0o3O4
2085EM1p0j3P3Pq9J9O7k7p3N1N9o9m7P4L7o2k9O8Rp0J7O3m0n7M0O7m6n3P0K5p7
2117c0nP2jp4K3P0l9o9N0N5n4m0O9J7q3jP4lp7K2O0k7p4O5M3n4l7P7Rp0LO2po3
2151c7RP3k5o9M8M6n1k9O8%n4pP1j6o3K9N6m1o2N9L8n5k9O5K2p6JN7j9n3J6P4
2183D6m8m9M6L8n2j6N2J3o3NO9j8n6J7O8m5n0N1L4n2j8N6Ro0kP1k5n3J9N4l8l6
$$ plain form
2215 -33 4 45 -19 -34 21 18 -40 -23 24 14 -42 -27 23 -6 -41 6 36 -16 -33 11 32 -35 -21 40 16 -32 1 43 -6 -35 15
2246 15 42 -22 -24 21 28 -29 -20 26 12 -47 -2 33 -6 -42 6 30 -19 -34 22 16 -43 -19 27 5 -49 -13 36 -4 -41 10 29 -17
2278 -17 -33 38 23 -29 -19 35 2 -34 -8 36 -11 -41 17 36 -20 -35 29 21 -27 -21 18 1 -42 -14 26 -1 -30 0 15 -27 -29 7
2310 7 13 -33 -14 19 0 -33 0 22 -9 -30 11 35 -23 -25 24 27 -31 -9 41 24 -25 5 26 -22 -24 13 24 -12 -23 18 20 -25 -15
2343 -15 21 3 -34 2 28 -7 -41 2 15 -30 -23 19 2 -33 -9 24 -6 -32 6 31 -6 -21 27 25 -7 -11 25 13 -23 -9 26 6
2375 6 -27 7 19 -9 -30 15 17 -23 -19 13 -4 -40 -11 22 -2 -28 3 27 -12 -30 13 22 -17 -23 27 3 -18 -5 28 -5 -32 13 27
2408 27 -16 -15 10 20 -28 -18 23 13 -17 -4 23 2 -22 10 16 -17 -23 7 9 -36 -20 -2 -1 -26 -11 22 -12 -32 8 24 -9 -21 18
2441 18 18 -17 -19 18 8 -8 8 21 4 -16 14 15 -11 -9 19 16 -18 -11 23 8 -28 3 15 -10 -20 2 19 -18 -20 20 0 -28 -13 19
$$ packed form
2215c3L7M1o4j5N5ln8J7M7j0n6J5N0k9l5M7L0n2j7M4K1o7J4O1k4m8L3M2m9k9N0
2246A5K7o4kM5Pn7RM6j4n9M5L5l9l6M8K4m9j5N6on9K4M6k2n4L6M9m0l7N1J9m6
2278a7j6P1j5n2J0N4l3l6K6M4m7l0N8J9n6j5O4qm8OL9j7m3K8M0k7k9L0J5m2kL6
2310GOm6J9L3j9l3L3K2l1k1M1K4n8kM9Ln8K2N0j7m9L0K1m8kL7J1l6j1M1Km5J0
2343a5L6j8l7L6K6l5l4M3J3m5PM2j7l5K4L3l0k6L8K5l7j5M8kl2mL6j2l6J4L5k0
2375Fl3L4J2k8k1M5Km0ML2j7l6K9L3k4k6L1K4l9j8M3Rl9oN0k4k1J3L3l3k7M5J4
2408B7m3JK5J0m8J0M1j0l0J3K7k1k4L2Ol3oL0Km5J6J8Jk5J5L3l4k0M0J6l3j2L9
2441A8%l5kL7j0j6J6J3j7k0L0Jk6KK8ll4PL4j5l6L1J2k5j0K2J7l7kM0k0k8J5L2
$$ plain form
2475 19 8 -28 -7 16 -20 -13 13 9 -7 -22 10 10 -11 -10 23 1 -13 10 26 0 -16 18 22 -1 -10 22 9 -3 -6 22 1 -22 2 25
2509 25 -5 -20 0 8 -24 -19 -1 9 -20 -4 17 -7 -16 1 14 -14 -17 15 27 -10 -8 16 11 -25 -8 28 7 -20 4 17 -7 -15 14 22
2543 22 -4 -14 10 14 -18 -4 14 -1 -20 1 15 -14 -22 9 11 -10 -17 10 8 -19 4 25 0 -17 0 24 -2 -8 13 21 -5 0 12 27
2577 27 -14 1 18 6 -20 3 16 -5 -17 8 12 -8 -7 9 5 -20 1 2 4 -26 -1 -4 -2 -21 0 3 -10 -13 13 2 -22 3 18 -1 -21
2612 -21 4 15 -3 -11 12 18 -7 -7 13 19 -7 2 20 -1 -7 -2 14 2 -5 15 10 -11 -9 8 -2 -19 1 13 -9 -11 7 -3 -16 -3 7 17
2648 17 -20 -7 22 5 -5 5 24 -3 -12 15 18 -12 -5 14 10 -2 2 25 -6 -19 4 19 -1 -12 16 9 -12 -9 -1 4 -18 -11 17 -8 -7 8
2684 8 18 -4 -11 0 -6 -13 -7 18 10 2 5 18 13 -2 14 18 6 -12 9 17 -6 -2 17 7 -7 -1 11 1 -7 1 5 -3 -14 3 6 -10 -11 4 0 -6 -4
2725 -4 -4 -4 -6 -3 13 -5 -3 1 2 -8 1 11 0 -12 13 9 5 -7 13 17 -4 -10 6 10 -7 2 19 5 -9 -4 15 -4 -12 2 6 -13 -6 16 0 -17
$$ packed form
2475A9j1l6K1K3l6PK6mj6j5L2%k1JL3k2j4K3J6k6j6L4Mk3rL2j3j2lK8k1k3K4K3
2509B5l0j5K0Ql2NJ8J0k9J6K1k4rJ7J3k8lL2J2l7KK4nl6J7L6k1k7K4J3k4qK9Q
2543B2k6j0K4Ml2J4J8j5j9K1J4k9qL1Kk1pK7kk7K3K1k5j7J7K4k6oK1Qk6NJ2J5
2577B7m1J5J7j2k6K3J3k1j2K5Mk0JJ6mk5K1JKl0K5lKj9K1Lj3lK6j1k4K5J5j9k0
2612b1K5J1j8qK3Ok5%K0Ok6RJ8k1oNJ6j2pK0nk1KJ7j0j7K0J2k2kJ8j0j3J3J0J0
2648A7l7J3K9j7j0J0J9k7rK7Ll0PJ9mj2MK3l1j3K3J5k0j1K8pk1LQNk2PK8k5JJ5
2684HJ0k2pJ1opOK5qqLJ3nj5J6Mj2j8K1Qk3MJ9j0j4OJ2j0qQMqj1J7Lj6jJ5moK
2725d%%kLJ6j8KMJj0RJ0j1j2K5mmj2K0Mk1oJ6Mj7RJ7j4j4NJ9j9qJ4Mj9PK2j6j7
$$ plain form
2765 -17 -9 13 5 -10 9 10 -7 -13 6 16 1 -1 10 14 -5 13 15 11 5 9 23 4 -15 3 17 -7 -11 6 8 -2 8 16 -4 -2 -2 12 6 -5
2803 -5 5 22 -11 2 3 1 -13 -3 8 -5 -4 3 13 6 5 2 10 -2 3 12 12 1 2 11 5 -17 3 8 1 -11 5 10 4 2 -2 8 -5 -9 3 -1 -17 -6
2845 -6 13 -12 -23 4 8 -8 8 0 -3 -10 -2 6 -4 -20 12 13 4 5 11 11 9 -1 8 9 -7 -13 13 -7 0 12 12 -4 -4 9 6 -14 -2 3 -6 -3 -13 7
2887 7 -1 -14 11 6 -9 -6 -5 13 5 -5 11 3 -4 7 19 -1 -19 4 23 3 -8 7 16 -3 7 6 6 -8 0 13 -4 -11 5 11 -7 -9 8 9
2925 9 -6 -6 -2 0 -16 2 7 4 -10 -6 11 -7 -17 10 14 -3 -2 6 -1 -7 3 9 7 6 5 11 -3 1 14 7 9 10 3 1 -5 2 13 5 -9 11 0 -6 -5 11
2969 11 0 -6 -11 0 -5 -6 -7 -2 2 -10 4 5 -4 -8 4 11 3 2 16 5 -6 -7 4 -3 0 2 12 6 1 3 3 -5 -9 6 -1 -29 -15 -6 -3 0 8 2 -18 -3 0
3014 0 3 -9 -2 -4 2 -9 5 6 -2 2 1 5 8 2 7 7 -3 8 3 6 1 -5 4 -10 2 1 6 8 1 15 2 -4 -5 1 -11 0 3 9 -10 -9 5 -6 -3 -8 1 3 -8
3061 -8 14 15 14 -9 4 4 10 -2 11 13 -12 1 19 10 -7 3 5 20 1 1 3 0 1 11 4 -9 -4 -4 -5 2 -8 0 -2 -3 -6 13 3 -1 14 9 -4 -4
$$ packed form
2765a7QK2qj5J9Jj7oJ9J0j5kJ1Mj9J8KmoMJ4j9j9J8J4k4mJ7Kj0J0Qk0K%J4oj1
2803eJ0J7l3J3Jkj4J0J1j3JPJ0pjlQj2NR%j1JRok2K0Npj2J6NokmJ0j3mJ2mj6J1
2845fJ9k5j1K7Mj6J6qlpQQj0j6L2JrJO%kj0RJj6oK6k0PJ2%j6%J3lk0J2NrLj0K0
2887Gqj3K5nj5LJJ8qj0J6qpJ1J2k0j8K3J9k0j1J5Rj9J0j%j4QJ3j7pJ6Oj8kJ7J
2925Ij5%MKj6J8Nlj4MJ7j8j0K7Mj7JQpoJ0OkjjOj4MJ3pKJpkoPJ1qj4K0j1oJJ6
2969A1j1onJ1njjNMj2J4JrmJ2PqjJ4j1j1jJ1pLKJ0onK%qmJ5pk8J4RLLQok0J5L
3014@Lj2PkOj1J4JqMjMLoN%j0J1nLnoRj4J2jNKpJ4j3ojOj2J1LOj9JJ4j1LnRKj1
3061hK2Jjk3J3%Oj2J3Kk5J3J8rj7J0KJ5j9%KlJJ0pj3N%jPj0QkjlJ9j0mJ5nj3%
$$ plain form
3103 -4 3 -9 -4 2 6 -2 2 0 9 1 -5 1 2 7 -1 8 2 4 1 10 2 -1 3 7 -9 -3 -8 6 -18 -7 2 -10 -15 -4 1 -1 -8 6 9 -11 -6 2 8 -17 -4 8 5 -1 13
3152 13 15 5 -5 18 8 8 12 8 -3 -7 -1 2 4 5 3 -6 -2 1 14 4 -5 -4 3 5 -9 -9 0 -4 -3 -3 3 6 0 4 -2 -1 -11 -2 1 -4 -6 10 -4 0 9 13 8 -2
3200 -2 0 2 0 3 -1 1 1 4 7 -9 0 0 12 -2 -6 -3 7 -4 4 3 -2 -1 -2 -4 7 -9 -3 -5 -1 -3 12 3 0 7 5 12 6 5 -3 14 5 6 8 3 1 7 4 0 -8 8 8
3251 8 -13 3 3 -3 -6 -6 2 -4 -10 3 -6 0 -2 -8 0 -6 3 -2 4 -1 2 2 6 6 13 24 6 5 6 8 0 4 10 10 6 13 13 9 -5 3 4 -5 -3 -7 7 -1 2 -11 -3 -9 -6 6
3303 6 -9 -16 6 -4 -14 1 11 -6 1 -1 -2 -5 5 3 9 1 2 5 8 2 0 6 5 8 -4 9 -2 9 1 6 0 1 10 -6 -5 -8 -8 -2 -2 -8 -1 -9 -7 2 2 -4 -2 -3
3351 -3 -6 -8 -11 7 -3 -2 1 -3 -2 0 -9 3 2 1 7 -7 -8 2 3 -3 4 -1 -2 -6 4 -9 -9 -16 -6 -1 -3 -18 -6 10 -6 -16 -10 -8 -3 -10 -7 -7 -11 2 0 4 -8
3398 -8 -1 1 2 -2 -6 1 1 3 0 0 2 7 0 -10 -1 -4 4 0 -3 4 5 -8 -7 5 -9 -7 -13 -5 1 7 -4 7 -14 -17 5 -3 -4 -8 2 -7 2 8 11 -4 -3 4 8 3 8 -5
3448 -5 4 4 0 2 5 -2 9 9 1 -3 -5 4 -9 -7 2 -6 5 -9 -1 0 -8 -8 -1 -9 -4 -10 -1 -9 -4 -5 -7 -3 4 0 -11 -12 3 8 2 -3 -1 1 -4 -4 -8 -2 1 -2 -2 -4 -1 4 -1 -2 -5
$$ packed form
3103dPj2NOMqMkRqoOJNqRoKlRqlMMj6OnJ4k4J1Rj2nJ1NkpJ4Lk0NQOk5J3J2loJ4
3152A3Kj0j0K3j0%Mmj1mOLKJkrMLJ3j0rJPKj4%RmJ%OLoMoJj0RLnkJ6j4MRMnj0
3200bKKkLmK%LLj6R%J2j4mLJ0j1QjnJjkJ1j6OkMkJ5rlPkPojqJ7rJKnkOlmqJ6%
3251Hk1J6%ol%QooJ3rOkoQoRnOnL%M%PJ1j8jJKqMO%mP%mj4QJrKmJ4qLj3QoLJ2
3303Fj5pK2j0j0J5J0j7PkjlJ0kOqJLLokOjLj2J3j1J1qNoJRj6Jl%O%oPqKR%oKj
3351clklJ8j0JLmJKrJ2jjOj4jJ0JoPnjmJ0j3%pJ0Nkj5J2J6j6j0OKNpL%mJ3kMj2
3398hPKJmmP%Kl%KNpj0RlQmlPJj3JJ2j4KoQOOj1J1k1lK2qjmJ0rROLj5JPMnNj3
3448eR%mKLpJ1%qmkRj3KRqJ1j4QJq%PqNoRqNjkMPmj1jJ5NonKKn%mOLl%kLNnjl
$$ plain form
3503 -5 -9 -5 -4 -15 -6 -10 -12 -5 -2 -7 -20 -8 -2 -9 -12 -1 2 -3 -1 -5 10 18 -6 14 6 5 3 18 15 1 6 -2 2 -3 -1 5 -6 4 -1 -6 -4 -7 -1 4 -9 12 -5
3550 -5 -3 -20 7 -7 -10 0 -2 4 -5 3 3 0 -3 2 -1 10 -2 -1 0 11 5 4 8 1 11 -1 -1 -4 -13 0 4 -9 -4 1 3 -5 -12 9 -6 4 -9 -6 -6 -5 -2 5
3596 5 4 -3 2 -12 -3 2 -5 -6 3 1 -6 8 -3 4 4 0 -1 8 4 -2 15 4 -5 5 3 -6 -1 2 0 -2 2 2 14 -5 -3 -1 -10 -5 -7 -2 -2 3 -1 4 4 1 1 -8 0 5 5 7 -4
3649 -4 -3 6 5 3 11 6 14 8 7 12 -4 6 5 2 5 4 2 1 -7 2 3 -1 -1 -9 -5 -2 16 -1 4 -5 -3 4 -1 7 -3 9 2 8 5 2 6 5 3 4 8 -1 12 1 16 -2 5
3700 5 5 3 0 -4 -1 12 2 0 9 1 2 -4 -1 -1 0 -7 -6 2 1 -3 -1 3 0 -5 -2 12 2 0 -5 -1 5 4 8 5 7 14 8 8 8 3 13 11 -4 9 0 -4 1 4 -5 -6 9 -5
3752 -5 -1 -1 -7 5 1 6 -7 6 -3 -1 -13 1 0 -3 8 -2 0 2 -6 -2 1 2 4 -5 -1 1 -1 -2 -3 5 -5 3 -2 2 -7 -4 5 -11 1 -8 -9 -16 -6 1 -3 -6 -5 -10 -13 -8
3802 -8 -7 -9 5 -16 -4 2 8 -9 -1 -9 1 1 -1 -6 -1 0 -7 4 3 9 12 1 -5 9 -5 8 -7 -10 -1 -10 -9 -6 -1 -3 -7 -1 3 7 -4 -11 -2 -13 -2 -4 -6 1 0
3849 0 -3 -3 0 1 7 9 4 5 6 -10 7 14 -7 2 -1 9 -5 -7 11 -7 0 -3 3 -8 -5 1 2 -5 -5 1 2 -6 4 -8 -3 -1 8 -4 0 -1 0 0 -1 13 8 0 -7 1 5
$$ packed form
3503emMJj1RmkPLnj3J2OplJ1LnKmJ5Qk4K0qjkJ5lj4NqMnKOj1J0nnKlONj3K1j7
3550eKj7K7j4lJ0kOrQ%llNlJ1j2JJJ1ojMpJ0j2%lrJ3Mj3NNKqpK1j5J0j3L%JLP
3596EjpNj4RNpjRkpJ4j1P%mjRmoJ7j1rJ0krNLkkM%J2j9KKrNkN%NmN%l%rQN%Kj1
3649dJRjkQnQojNj6J0jlLjkjqRJm%qMLJ8j7NrKPnQj0J2pOllMjkJMrJ3j1J5j8P
3700E%klmLJ3j0kRqJoL%JpJQjmKMlnLJ4j0knMOjMlKPo%%nJ0kj5J3rmNLrjJ5j4
3752eM%oJ2mNj3J3rKj2J4jlJ1j0KKqMLJKrMKkjjQj0QnMrLRj6J2rjpJ0PmlJnlN
3802hJkJ4k1J2OOj7QqJ0%knNJpJ1jOLj1oJ4j4J3j5lRrJLNkmOMMj1pRj1J1kkPj
3849@l%LJOKnJJj6J7Pk1RlJ0j4kJ8j8PlOj1LOJp%OJqJ0j2NKRj2MjJ%jJ4nqpQM
$$ plain form
3898 5 4 10 7 12 4 -3 12 -1 6 8 1 -2 -2 -9 1 0 -9 -1 -11 -6 -7 -12 -10 -14 -5 0 -1 0 -16 -6 -10 -9 -5 -7 -6 1 3 0 -3 -7 3 1 -4 3 3 0 3 7 6 -1 2 -2 -2 6
3952 6 4 2 4 -10 -5 -1 -6 -2 -4 -11 -15 3 -2 -6 -2 -2 -10 -1 -9 -11 2 2 0 2 -5 6 1 -2 6 -2 7 6 3 4 10 10 -12 -2 2 -5 -3 -1 -4 4 3 -8 -3 5 -1 -6 -1 -6 -5 -3
4006 -3 -7 6 -2 -4 -4 -12 6 -2 -2 -5 -3 11 -1 8 3 -1 4 7 -2 1 5 -1 -3 -5 6 -5 -3 -12 -11 -2 1 -1 3 8 -13 1 -13 -3 -6 1 5 -8 0 -15 -12 -8 -5 0 -2
4055 -2 -6 -8 -6 4 4 -11 -4 10 0 -4 5 0 -11 -1 -2 16 5 -6 -7 -7 -7 3 -6 -4 -1 6 3 1 -2 -9 -4 -12 -9 -6 -11 -14 -2 0 2 -4 5 -7 7 -2 3 1 2 12
4103 12 11 -2 6 1 1 -3 -1 16 10 0 0 3 4 -1 -6 -2 -6 -7 4 -8 -7 -6 -5 -10 -5 -3 -6 -14 -8 -6 -8 -6 -2 0 -6 -2 -7 2 -9 -5 -6 -3 1 -9 8 10 -1 5 10 10 10
4154 10 1 -1 7 4 8 -5 -5 -2 3 -2 3 -13 -8 3 -11 -1 -2 5 -12 -13 1 -2 -10 -6 -4 -3 -10 -2 -2 0 -2 5 0 -6 10 15 3 10 4 8 -3 5 11 6 1 6 2 4 7 -15
4204 -15 -3 -7 -7 -9 1 -7 -3 -4 -5 -15 -2 -12 -3 1 -1 5 -1 -3 -3 9 -2 0 11 2 1 14 13 11 7 -3 4 -6 8 10 3 5 3 6 2 -5 0 -7 0 6 9 1 -2 -3
4252 -3 -12 4 -9 -4 7 -1 1 -5 6 11 6 -2 6 7 18 4 4 6 7 7 -4 6 -6 -7 5 9 -1 -7 -4 5 5 -3 -10 -8 -3 6 1 -1 -11 2 -1 -11 -4 -3 -5 -1 -7
$$ packed form
3898EjOlNqpJ5j3PKpl%pJ0jrQj0NjnKmRNjJj6J0mJMkJPKllmJ0knP%lLMjpLm%Q
3952FkkKj4NMnMkpmJ8nmM%qRqkJ3%kKpJ1nlQqRjlJO%k2J0MpKKlQjj1NQonNnJK
4006cmJ3qk%qJ8q%lKJ4j2RnmNLrLMokkJ1j1KrJRLkMNk1J4j4J0lPMj3Qj5LMLNk
4055bmkKJ0%j5PJ4j0mRnj1J0jJ8j1j1j%%J0rKLPlklpNqLLnlJ2KKoRj2J4rNkJJ0
4103A2jj3Qn%mKJ7oj0%LJnnMmjJ1j2JJJnNKlqOKkKMKoMnRj1MjLMj0J7Kj1ON%%
4154A0rkQlMj3%LNnNj6NJ1j4J0jPj7jJ4lqMKJpQ%KkPnoJ6Nj2PoMj1QOnnNmKLk2
4204a5J2m%kJ0qMjjj0J3j0RMkOok%J2j1KJ1rjJ3jkmj0Pj0J4KpKkLmpNpPOLqlj
4252crJ6j3NJ1qKoJ1NnqQJJ1j4%KJ%j1J0j2jJ2Mj0oLR%qpKNRnkj0J3lj0PJkMo
$$ plain form
4299 -7 -2 0 -7 -8 -4 -15 6 -3 -1 11 1 4 7 9 7 2 2 4 0 -7 16 1 3 3 12 -4 10 0 2 5 -14 6 -4 1 -4 -6 -3 -4 1 1 -1 -9 -9 -7 -8 -6 9 -2
4347 -2 9 -6 3 4 3 -2 -3 3 1 -4 7 12 7 0 12 -1 -5 2 3 -5 1 -6 -6 -5 10 -10 -13 -6 1 -10 -3 1 -8 -10 -18 6 2 6 -11 7 -4 -6 1 -1 -3 12 -1
4394 -1 4 0 -3 -7 1 6 -3 1 -2 -1 -6 0 2 3 6 7 -16 -1 -3 -2 -8 4 -4 -8 0 -15 -11 2 -7 -1 -9 1 2 -13 -3 -9 -5 7 -1 -2 3 1 -3 -1 -7 2 6 -2 0 9 -6
4445 -6 8 -3 -1 -1 -1 -6 2 4 2 -3 2 1 -6 -3 -2 -2 -7 -7 -11 -9 -4 0 -13 -12 1 6 2 9 6 10 -5 5 2 8 4 1 -6 -5 13 2 -1 4 0 8 -1 7 -3 -2 -1 -7 -13 -2
4497 -2 -6 -6 -2 -10 -13 -9 -8 -4 -14 -3 -1 3 -3 -6 -5 -8 -10 -3 -7 3 3 -3 -1 7 2 13 4 8 -11 -2 -6 4 7 -6 -8 -1 -9 -8 -11 -5 -6 -7 -7 -3 -6 -8 1 -10 -6 -5 -9 -6 -5
4550 -5 -5 -1 -7 -6 -2 -6 -1 10 2 -5 7 9 0 3 -5 3 -5 9 9 -2 -1 8 4 8 0 3 2 -9 -7 1 -1 -6 -3 -5 4 -6 -7 -4 0 3 -6 -9 -6 -5 -3 5 1 0 -5 -12 -3 6 1 -7 -2
4605 -2 7 1 6 12 7 3 -3 -3 -7 5 -4 2 -6 -8 -5 -11 -2 -6 -14 -3 -7 -4 1 -8 -4 -3 -2 -10 -12 -1 -2 -2 -3 5 1 7 0 6 5 1 11 -3 14 14 5 -8 -5 2 7 -4 3 -7
4657 -7 -2 6 -11 -6 -7 7 -11 5 -10 -7 -12 6 -1 -4 2 -2 -16 -4 -1 1 2 -6 5 6 9 -4 -3 -5 -1 -5 4 -2 2 7 7 -2 2 6 -2 8 0 -3 -2 1 2 -3 0 -7 -3 -9
$$ packed form
4299gNKpjMj1K1rKJ2j0LLKkn%KmpK3j5K%Rj6J4j0KLj9K0j0NnkLjN%kq%KjKJ5j1
4347bJ1j5RJjnjOknJ1NnpJ2j3mPJqOp%JJ5k0lPPj1PMrkqK4mMj7J8j1kPkkJ5j3
4394aNmlmQNrMlJnOKJLJk3J5kJoJ2qmQj5MJ3rOqJ0Jj5J0oMJ2qjNkmKoRMqKRj5
4445fJ4j1K%%nQKknNjpLJ%n%mKNMj3JJ3NmPlMj5J0lOmlpJJ8j1lNmQrQj0JJooJ1
4497bm%MqlMJMj0J1KMolJlkPmJ0%oKQnJ1rMj9RmJ0Lj3kPqJlOjj%MlkRj1MJmLJ
4550e%MoJMmNJ1qpJ2KrLqQqJ4%j1JRmMqLjj1KQknLkRj0jLMLrlLJKQmjnpRRnqN
4605bRoNOnmo%mJ2rOqkLoRmqJ1mLNrMJJqkJ1j%jQmOpOjmJ0j4J7%rj3LPNj1Pj0
4657gNQj7NjJ4j8J6j5LnJ8plOmj4J2LKJqJ1JLj3JkMmRoMN%rMMqJ0qlJLJnLpMo
$$ plain form
4707 -9 -11 -10 -6 -5 -10 -9 -13 -6 -2 -9 -5 -3 0 3 -5 -1 -4 -1 -6 -7 9 7 3 6 10 -3 11 15 -2 -5 2 -4 -6 -1 0 -6 1 2 -5 0 -5 -8 2 -13 -5 0 0 0 -4 -3 -5 -3 4 6 2
4762 2 4 6 13 10 -2 1 3 -2 -1 7 0 -6 10 -3 2 -1 0 -10 6 -8 -7 -9 -8 -3 -7 5 -7 -7 -9 -13 -18 -3 -10 -11 -9 -9 -5 -5 -12 -2 2 -6 -2 1 -1 -1 7 -1 -4 -3 -2
4813 -2 -3 0 3 3 -15 -2 2 -4 7 -8 7 9 -7 3 -5 2 -11 -9 -6 1 -7 0 -3 2 -8 -7 6 -2 -2 4 -3 6 -3 -9 -1 -3 -6 8 12 8 -2 -10 -3 3 6 3 3 0 3
4862 3 2 -1 1 -4 -1 3 -6 -4 -13 -12 -13 -6 -7 -11 -4 -4 -7 -1 -8 -6 -6 -6 1 -7 -9 -4 -2 7 8 2 -4 -3 4 3 -5 10 -4 2 -10 -5 6 10 3 2 2 -2 1 2 1 -9 -3 2 -10 -9 -11
4917 -11 -8 4 -9 -12 -12 -3 -7 -6 -7 -8 2 0 -3 -1 -4 3 8 5 -5 1 5 -4 -2 4 1 -1 1 3 -1 -2 -9 1 -4 -9 4 -8 -10 -11 -1 -10 5 -7 -17 -6 -5 -6 -7 7
4965 7 6 -7 2 3 -9 2 3 3 1 3 3 0 1 -1 6 5 0 0 0 12 2 1 0 8 -7 -6 0 0 -3 -7 -5 -8 -5 -6 -7 -3 -7 3 4 2 2 2 5 0 4 2 11 -2 0 -4 6 1
5017 1 2 -1 2 2 -2 -2 -1 7 4 10 3 -11 -7 -11 2 -2 -7 -2 -8 -8 -6 -10 -16 -9 -14 -1 2 -18 -1 -15 5 -4 -5 7 -2 -9 -4 -2 -1 -1 7 -3 6 2 5 0 3 1 -4 -4 -1 0
5069 0 2 -7 -4 -4 -5 -5 -2 -4 1 -9 -4 -7 -3 -5 0 -5 -15 -5 -12 7 -6 -11 -10 -5 -10 -5 -2 10 2 -9 3 6 9 5 4 4 5 1 10 7 1 2 -6 -2 -1 -5 -6 -13 -4 -4 3 -18
$$ packed form
4707ikJMJnJmPMpMKLLqMlLnjJ6kmLMj3J4Mj7lPokNJoPJpNnlJ0j5QN%%mJkKPKm
4762BKKPlj2LKnJQpoJ6j3NlJj0J6j4JkJNmJ2j2%kmnJ5pjK%M%pJ0MqMLk%QqlJJ
4813bjLL%j8J3MoJ1j5J5Kj6J0qPj3KLPqPlNj0JJ3q%OpRroQklJ4Mmj0qPOLl%lL
4862CjlKnLMrKrJjPjmP%lOpK%%PqkNKRJooJPjqJ5j4Oj2NJ1Mpj%mLJjj0ONj2Jk
4917a1LJ2j3l%RmJjjJ0klKlPNlj0OMrKOlkKKmjpJ0nnJ3j2kjJ0rJ5j2j0J1JjjJ4
4965Gjj3RJj2J1J%kK%lJkPjn%%J2j0jjQj5JO%lmKlLjjMmJ0Jk%%LnMkRj3KmJ0n
5017AJlL%m%JQlOpj4MmJ3mnNo%KmoPnJ3Lk0J7j4K0rjJ2rpNKJ%Qj0RmLnLkn%LJ
5069@KrL%j%LkNj0NlMkNnj0J0pJ9j3nJNnNLJ2qj1J2LLmj%JmRloJqMJmjpR%Pk1
$$ plain form
5121 -18 7 0 -4 -7 -1 -7 5 -3 1 -9 -1 -5 5 -5 -3 2 -7 4 1 7 5 8 -8 -3 4 6 4 5 -4 1 -6 4 9 -5 -4 -6 -10 -10 -4 -5 -8 -4 -10 3 -2 -1 -3 -6 4
5170 4 -1 -18 -2 -1 5 -6 8 7 13 6 8 4 8 2 12 1 1 4 5 11 1 10 -11 -4 4 -7 -4 -1 2 4 -3 -2 6 -6 -2 -5 -5 -3 -8 -5 5 2 1 7 7 -1 1 1 12
5219 12 5 4 6 4 10 12 -6 5 8 1 18 8 1 4 2 11 11 5 2 0 2 6 -5 -2 4 2 -3 -12 -4 2 -2 1 -1 7 2 2 -8 -12 -4 2 -3 -5 2 0 2 0 13 0 -9 7 -2
5270 -2 7 8 15 -1 3 -1 0 -11 -4 -12 -2 -5 3 -4 -5 -4 0 -5 -1 -3 -5 -9 -2 -10 -11 -6 -4 -6 0 -9 2 -2 6 5 -1 11 -1 7 2 6 8 7 5 10 2 -1 -8 3 -1 0 0 1 2 2
5324 2 7 -5 1 -1 -5 2 -4 1 8 -4 -4 -3 -2 -2 1 4 6 -7 -9 -3 8 3 5 -1 4 8 10 8 6 4 7 6 2 10 4 -6 -3 -6 -13 2 -1 -9 -1 -10 1 -15 -3 3 -4 -2 -5 -14
5376 -14 -5 -3 3 -1 -8 2 9 1 -1 8 2 -6 -2 4 10 -1 3 6 2 14 7 1 -3 4 7 0 2 6 6 -2 -2 -10 -5 -1 -7 -7 -10 4 -8 1 -7 1 -4 -3 -3 -6 0 2 10 7 10 2 7 6 16
5431 16 6 3 16 -3 17 5 6 5 4 2 6 1 0 7 0 -7 -5 -7 11 0 -1 -4 -6 -1 -3 4 1 -5 -3 1 -3 -6 1 0 9 3 9 11 1 4 -5 -7 17 -4 6 7 8 5 8
5480 8 7 -2 8 10 1 -1 1 -1 -8 -3 3 -6 6 10 -3 -11 -10 1 -4 7 1 -3 7 4 1 -3 9 7 4 -1 9 9 8 11 5 8 1 11 1 -2 0 7 4 1 9 1 10 -2 3 -5
$$ packed form
5121a8K5pmlOoJ2qMj0QmJ0j0KNrJ1lOkLj6NPKkJrNpJ0Nj4Jkm%OjlMoJ3nJklJ0
5170Dnj7J6JOj1J4jOpKmMoJ0j1%LJOj0Rk1PQj1LLLKpJQj2Ml%KnLJ0ljO%qK%J1
5219A2pjKkOKj8J1LpJ7j0pLkR%olkKMj1LOknrQOmLkQn%j0mQOnkPkKkJ3j3rJ6r
5270bRJPj6MmJj1PqJ0lQpjJMnMkkmPqjNKkOrJ1mQjoJ2j2QnMKjkNqlpJ1mJ%JJ%
5324BNj2OkmPoNPj2%JJ%LLKj3kOJ1nKoNMKkkkLjmQoj0LlpJ5lqQrJ1j6J2OpKlr
5376a4RKOmpJ0PqkRoqMOOj1MLmJ2pomPLpKM%q%qNMo%lJ4j2RqQnJ%lOKQlLqNjJ0
5431A6j0lJ3j9K0j2JjjkMnjPppKkJ8j1jlkNkPloKMmlPjRoOKj0LrkK4k1J0JJlL
5480HjrJ0KrkKkpNOrJ2Mj3qJJ1nJ1omJ0llmJ2klnJ0%jLoLpJ0j0lKPllQqRj2Nq
$$ plain form
5530 -5 6 2 -5 -5 -6 4 -3 -4 -6 6 -8 -4 0 -1 10 -1 1 9 -1 6 6 -2 -9 1 6 -5 4 0 0 0 6 -4 16 13 5 7 0 10 7 11 11 -5 -11 2 -6 -12 -2
5577 -2 -8 5 -1 -6 -2 1 6 -9 -6 -3 -2 -6 0 -5 -6 3 5 9 -2 3 2 4 -2 4 5 7 -4 7 8 3 12 7 -1 2 -2 3 1 -1 -8 5 -8 -1 -1 -3 7 -3 -9 1 -2 5 5
5628 5 0 -8 5 -3 -5 -3 7 5 -8 3 1 6 11 6 4 -4 -7 3 14 1 0 5 0 4 -6 7 -3 -5 -5 -17 -3 -9 -7 -4 -10 7 -7 -8 -8 -10 -3 -8 -9 -8 -12 -8 -4
5675 -4 4 5 0 8 -3 7 3 7 8 -9 12 6 8 3 1 3 8 8 3 1 -6 -8 -9 -12 -7 -5 -8 -2 -4 -16 2 -3 -20 -11 -7 -2 -1 -2 4 1 1 1 7 7 -2 -2 2 0 3 8 5 3 3 -7
5729 -7 -5 -2 -1 4 5 -1 -6 1 5 5 -5 16 -2 -2 -17 -12 -3 3 -11 -10 7 -3 -6 -5 3 -10 2 -5 1 2 -2 8 7 4 9 8 9 6 3 2 7 1 7 7 -5 3 -1 2 -1 -2
5779 -2 -3 -3 -7 -7 -10 -6 -19 -14 -8 -27 -13 -8 -5 -4 -7 -2 -2 -4 -8 -2 -5 4 3 0 5 0 9 6 12 7 0 11 7 4 0 1 5 10 -6 1 -1 2 -4 -10 -4 2 -8 -11 -3 -13 -1 -8 -6
5832 -6 -6 -11 -7 3 5 -4 4 12 4 -2 2 14 14 7 3 -2 5 1 -5 4 3 4 2 2 -2 1 -4 -4 -5 -2 -2 -6 -5 -7 -2 -6 -3 -9 -11 -8 -4 3 1 3 4 10 6 -7 -6 -7 1 9 -10 1 4 1
5888 1 3 5 -3 1 4 -6 1 -5 -4 4 -2 -6 -1 3 -2 -6 -8 -6 5 -1 -8 0 -6 -14 -10 -14 2 0 -3 -4 -6 1 -12 -3 7 -6 13 3 -4 3 6 -13 5 -2 14 1 -4 4 -4
$$ packed form
5530eJ1mp%jJ0pjkJ2j4MMjJ1j1KQj0P%qpJ0Nj1Rm%%Oj0K0lqKpJ0lM%j6oJ3qoJ0
5577boJ3onMLNj5LLJmOnjRKMj1NjKoOJKj1J1JnRnqLmNkkpJ3j3P%kJ0j0oJ0lP%
5628EnqJ3qkKJ0kj3J1kNNnkqlJ0J1j3jNnMj0J3j0k%j2J4oKLoJ7j4j%kPnjJmMM
5675dQJnQj1J0mMJj7K1oKnkKN%nkpkjlNKlOkj2J8nj7RMNJjOl%%O%r%MkLNlk%j0
5729gKLJNJonPM%j0K1j8%j5NROj4JJ7j0lJQj3J2pOJmJ0jlNjJlljNoO%j2QmLlj
5779bj%m%lMj3NOj9J4NLJlN%kmOlRjlNnRlOnpJ1mlmJMNj6PkLooOOj0lQj0J2pK
5832f%nMJ0KrQQqoMJ2%pmnPmoRjJk%mLn%jL%mJkNmLokLMPkKJOmj3JjQQj9J1Ll
5888AKKqMLj0PoJQomNMnmkKJ1opQoqMmJ6kljkPj3RJ0j3J9j0pPLj9J8pJ6j3nQq
$$ plain form
5937 -4 -7 -4 0 -4 5 -1 7 -9 -4 3 -3 -10 -5 -12 -12 -10 -3 -1 -7 1 1 5 -2 0 9 2 8 -1 6 8 5 8 5 -6 3 7 9 5 10 9 2 3 7 1 -1 2 -7 0 -9 -4 0 0 -3 -12 -5 -5 -2 -7 -4
5996 -4 -7 -9 -15 -1 -2 -6 3 0 9 -2 1 7 10 0 1 -6 -2 2 -5 3 0 1 1 -2 0 -4 5 -3 -5 -4 -10 8 2 -6 -7 5 -4 -8 2 -1 -2 -7 0 -3 3 -5 10 -4 -8 -1 1 13
6048 13 15 -3 1 13 5 8 9 5 0 -11 0 13 -8 7 5 -5 3 5 -8 10 -2 -6 -5 -7 -2 -7 8 1 -1 -3 6 7 -3 4 -2 3 -1 2 -4 11 -4 5 3 1 1
6093 1 7 1 4 1 -2 5 -2 17 -3 4 0 9 3 9 -4 5 -7 -8 -2 -10 1 -6 -1 2 1 -5 4 2 -3 -9 -9 2 -4 3 3 -1 -4 4 8 7 7 5 5 -6 -6 10 -2 -7 2 1 2 11
6145 11 11 -1 13 -8 7 -5 -5 11 -7 3 -10 -8 -7 2 1 -2 -4 0 -2 -1 -1 -7 11 7 5 7 1 7 10 4 9 -2 -8 12 -1 3 9 0 8 4 14 -1 -2 2 -8
6190 -8 12 -10 -4 -3 -11 2 -4 -7 1 -7 -3 -3 -12 -4 -6 0 5 2 5 1 0 4 2 -1 12 1 -2 4 0 -2 7 9 -2 -4 -1 5 -8 -7 -1 -6 2 1 -9 -5 -2 -2 -3 -6 -2 -4 0 -19
6242 -19 -11 -17 -4 -9 0 -6 -7 -11 -6 -4 -1 3 0 -10 -5 1 7 -4 5 6 7 7 -4 -2 2 -10 2 12 5 10 1 3 -1 -6 4 6 -2 -7 -8 -2 -4 -9 -7 -3 2 -1 -7 -3 7 -2 10
6293 10 -1 3 -1 11 -10 -9 -6 3 10 9 6 6 3 2 11 4 8 0 2 -1 -8 -1 -3 -12 -3 -8 -5 -3 -11 -4 -7 -6 -14 -3 -8 -8 0 5 -4 -8 3 6 11 2 1 -11 -2 4 6 8 1 1 4 6
$$ packed form
5937dlLMmRoQj6NPopNp%KPKoQ%MpKRpOrPKlLlj1RMKmNjpJMokLrPrNM%lrP%LnL
5996dlkoJ4jmRlRj1LOLj0JpMMpQlJ%lKmRqkJoJ8oqjJ2rmJ0ljnPlOqJ5j4mPKJ2
6048A3Kj8MJ2qLJmnj1J1J3k1J5kj0QKj3J8j2mJkNnJ5pkkRJj0PoNmLoJ5j5Rkk%
6093AOoLllPpJ9k0PmRoOj3Rj2jOqJ1pNLjoRkno%J1oP%mlQMj%k%j1%J6j2nRjJR
6145A1%j2J4k1J5j2%J6j8J0j3KJRjlkMkJ%oJ8mkKoOLoNj1oK0j3MOrQmJ0j5jMj0
6190hK0k2OJqJ3olQqM%rQkONlLmjMklJ3j1lOmkRKj1kLOj3JOnQjj0ML%jlMkMj9
6242a9QoJ3nRojmNKLMlj0NOOj1RJJ%j1KMj2J2J0pNrKmnJ0KqnjOknKMNloMJ0rJ2
6293A0j1MmJ2k1JLRPjl%ljRpMqKlpPkrRnLKqPlJqJ1n%QNrmJ1LNrjj2ROKKp%LK
$$ plain form
6347 6 3 -6 10 5 3 -3 -6 -3 -11 -7 -2 0 -1 -7 -10 -5 -8 -1 -9 -1 -5 -8 -2 -12 -9 -5 1 -3 0 -2 -4 -4 -8 4 2 1 -4 -3 -2 1 -7 4 0 7 5 0 0 -2 -6 7 4 2 -3 0 -1 -1
6403 -1 -7 -8 -8 -6 -1 -1 -1 -12 -7 -3 -4 -9 3 -1 5 -1 7 5 5 -1 3 2 -1 -4 6 2 -1 2 -4 -18 -4 -3 -3 -2 -6 -4 5 -3 1 -7 -14 1 -8 -2 4 -8 -3 -3 -7 -4 -7 -6 -12 -3
6457 -3 -6 -2 -2 -6 -4 -10 10 4 4 3 2 6 15 1 10 -1 0 -1 1 -1 -1 0 -7 0 0 -7 -8 1 -5 0 -7 0 -9 -17 -6 -4 3 -12 -4 10 -8 -4 1 -12 -6 3 0 9 1 5 4 0 1
6510 1 4 0 10 -8 1 -4 1 1 6 -2 -2 0 -14 1 -13 -4 -13 -9 -5 0 -6 -3 -8 -11 6 -14 1 0 -11 5 -3 -1 -6 -2 3 -2 2 -9 -3 9 2 1 14 16 -10 2
6556 2 7 -3 -1 -5 -8 -11 -5 -6 4 0 -1 -6 -9 -8 -13 -7 -3 -5 -12 -14 -11 -7 1 3 -2 -3 -5 -5 13 -1 -6 -1 -4 0 6 2 2 10 0 -7 10 6 -4 6 0 -4 0 -10 2 -11
6606 -11 -4 -5 -8 -5 -3 -7 -6 -3 -9 -16 -4 5 -9 -1 4 -4 4 -3 -7 -5 2 -4 -4 3 8 2 1 1 12 14 -2 13 -6 6 6 -4 -5 -5 -7 -2 -5 6 -9 1 -4 -13 -11 -13 4
6655 4 4 -6 0 -8 -5 -4 -2 -5 -3 9 -6 -4 -5 -2 4 8 6 2 4 8 2 -2 -11 3 -7 -3 0 -1 3 -1 7 9 1 -7 -4 -4 0 -3 -17 -10 -8 -11 6 -4 -8 3 1 -3 -6 -4 -3 0
6707 0 -12 -13 -4 -1 2 6 -4 -4 2 0 -2 -2 -2 1 4 5 11 6 -8 1 -3 2 -6 -1 2 -5 -12 -2 1 -15 -2 -5 -10 -8 -3 -4 -1 -5 -6 -2 -6 -4 -8 3 13 2 4 5 1 7 -4
$$ packed form
6347FlrJ6nkolLqMNKjolNlPqQmlOj0LMOmLkk%mJ2kjnJJLqJ1mPkn%kmJ3lknLj%
6403aoj%KN%%j1NMjnJ2mOoQk%oMjllJ0mlLoj4J4J%JmKRqMqpJ5rOOj2N%mLlJoR
6457clM%mKoK0o%jjMRj4Rj1JjKk%JpP%pjRoNpPrqJ1KPj5QJ4j8MNj3ORlRqMjmJ
6510ALmJ0j8RnN%Nq%Kj4J5j4RrMMNoLnlJ7k0J5jj1J6qKnMNnMj1OJ2pjJ3Kk6J2
6556BNj0KmllOjJ0mjnlJnOMkpkLMQKnjk%J8j4nNlMOm%Qj0pJ7mj0J0omMj0J2j3
6606a1PjlLKmJLopJ2Rj4QNqQpmKPo%PNoj%J1Kj6J5j9J2%j0j%kNlJ1j5J0nrKkJ7
6655D%j0OqLJKlKJ2j5KjLOMkmKMomrJ4j0MLjMmQKqqL%Mlj4PKlJ7j0mJ1kmlKJL
6707@j2jRLLMj0%Okk%%LLJOnj4RmNqNLppJ0Lj6J3lnKNjLmjMmKmJ1J0j1KJmOj1
$$ plain form
6758 -4 6 -2 -1 5 8 4 1 1 -5 -3 0 3 5 3 -4 -6 -7 1 -9 -1 -4 -5 3 -6 -7 1 -6 -7 -8 -6 2 -3 -4 2 3 3 5 3 3 6 -4 7 4 2 -4 6 2 11 3 -1 12 2 -4 3
6812 3 -3 -3 2 1 0 -4 -7 -8 -6 -10 4 -3 2 3 5 2 6 1 -10 8 -8 3 0 -4 0 2 14 9 2 12 7 1 11 2 5 3 4 2 7 9 9 -1 8 1 -2 7 -5 -9 -3 -4 -13
6863 -13 -11 3 -2 -10 4 0 0 0 -1 -4 5 15 13 -3 -2 -4 4 15 2 10 2 10 4 9 19 10 10 -3 -2 2 5 -4 11 4 -9 1 -9 -6 -11 2 -3 -6 -7 0 0 -12
6909 -12 -11 0 7 4 -2 -1 5 -6 6 -7 -2 10 12 -1 6 -2 4 12 10 13 12 24 2 7 2 9 4 -9 3 -5 -3 -6 -1 -12 -3 -6 9 0 1 -4 -9 -10 -10 0 4 4 6
6956 6 -5 6 2 1 9 -4 7 -7 -1 0 6 9 7 11 1 14 10 -1 12 2 7 7 0 -6 2 -4 0 -4 -6 -6 -10 -3 1 6 -7 8 -11 -10 3 3 -11 -3 2 3 8 2
7002 2 13 3 4 -3 4 1 11 4 3 6 5 6 9 0 1 6 -6 -4 -2 -3 -3 3 13 -8 0 3 -2 -4 6 -9 -7 6 0 -3 4 3 7 5 0 15 11 4 11 10 10 15 17 6 11 11
7052 11 3 15 5 9 5 8 6 14 7 8 0 -14 1 -1 1 0 -4 6 -5 11 1 10 -2 4 0 18 -2 9 3 3 3 5 3 6 14 13 2 2 9 15 12 4 -9 8 -2
7097 -2 -2 10 7 -1 4 -3 0 -1 -3 0 -5 -3 1 5 -3 5 7 -6 -10 2 9 11 4 11 6 1 5 5 0 2 12 7 8 1 11 11 5 10 2 12 2 9 16 -7 -6 -5 1 -2 4 1 1 3 -2
$$ packed form
6758dJ0qJOLml%oKLLKkpkjQj0QljQrjQpjjKQnjOJ%Kk%Lj0J1lkoJ0mRqmJ3j0oP
6812Co%NjjmljKmJ4pNJKlMnj1J8j6J1lmMKJ2npJ0noJ0rLkJkNK%j0RplRj2mOjr
6863a3KJ4nqJ4m%%jlRJ0kj6JkQJ1j3QqQoNJ0r%j3JMLrJ5pj3J0j0LnJ3nljP%j2
6909a2JJ1PloJOj1J2j3NJ2Kj3PqOQkLjJ2k2NnPnj3J2qKlNj1RlJ5rJnnj%J0M%K
6956Fj1J1mjQj3J1j4OJOLkMj0J3mj1J3j0N%poQoMmk%mPMNj3J5j9JJ3%j4QNJNo
7002BJ1j0JpPlJ0pjLjJLrJNj2KKj%OJ0k1QLnkJ0j5KJ3olPjMknJ5mpPj%NKj1N%
7052A1qJ2j0MmLkQpJqj4J5kKjmJ0j1J6j0Rj2OmJ8k0J1o%%KkLQjj1%POlqj3J7j0
7097b%J2lqNpLjkLnKMMqQKj3mJ2PKpPnnM%nKJ0nJpJ0%oNqJ0j0PPk3JJOlOl%Kn
$$ plain form
7150 -2 -8 0 -8 7 9 7 -4 2 -3 9 3 4 7 7 7 8 9 6 8 1 18 0 3 1 13 5 18 6 4 5 0 8 9 8 3 7 7 3 -6 0 -2 5 4 -2 2 5 -4 -4 -1 5 -5 4
7202 4 4 12 0 12 5 1 6 12 6 15 5 5 7 -2 7 8 2 7 7 7 3 -6 11 10 12 -3 -4 3 1 -5 -5 -7 -3 -3 2 -11 -3 -2 -1 -4 4 5 -1 13 5 10 5 1 14 6 2 11 5
7255 5 4 9 5 7 5 3 13 14 -1 9 13 4 9 6 -4 8 -4 4 4 -1 2 3 1 2 -4 -1 2 1 6 10 0 -2 1 9 12 4 4 11 7 18 11 18 8 9 5 12 7 8 10 0 7
7306 7 5 4 11 1 -7 -4 1 -1 -4 -5 -7 -5 0 -7 0 0 -7 6 -4 -2 5 -6 12 -1 13 5 6 6 19 4 -3 14 7 9 13 8 2 -1 5 5 9 3 0 9 -8 -4 -4 1 -8 -2
7356 -2 -7 -4 -9 -10 0 -3 -6 -2 5 -4 1 3 -2 7 10 3 12 8 16 0 3 6 9 10 8 5 9 2 8 4 -3 -2 1 6 -1 16 2 0 4 4 1 0 -1 4 0 -1 -7 0 -7 0 8 -3 6 -9 -10
7411 -10 0 2 0 1 0 -1 2 5 12 12 1 1 1 -2 10 2 4 5 3 2 1 -2 -3 -5 2 3 10 -6 -2 2 0 -1 -10 -2 -6 -8 -6 -4 -11 -6 -6 7 -3 3 0 2 -3 13 11 -3 7
7462 7 3 7 0 0 10 6 8 -7 -4 -10 2 4 4 4 -9 2 1 7 -16 4 0 -9 1 -2 -2 -22 -10 0 -4 7 3 -9 -6 -2 1 11 4 8 5 -10 4 2 7 6 6
7507 6 8 3 0 4 6 2 5 -3 3 -11 2 2 0 -17 -2 -14 -7 -17 -7 -8 -9 -12 -10 -8 -4 -7 -6 2 -9 0 4 -1 -1 -2 10 10 5 6 4 7 -2 10 10 8 9 -5 11 6 -10
$$ packed form
7150boQqJ5Kkj1OnJ2oJL%%JJlKpJ7j8LkJ2qJ3j2kJnQJjnM%mrOkPjoMLr%LOj0R
7202D%Qj2J2pmNOoRj0%KrRJoN%%mrJ7jKj5jPko%kM%Nj3QJJlQJoJ4qNnmJ3qmRo
7255EjNmKkkJ0Jj5J0MrNlj0J2j2Q%nLJkJoLLjNMj0kLQLq%PmJ1pPj0JmPnJKj0P
7306GkjPj0qLNkljkKNpP%pJ3j0KPj1J8j3J4qJ%J3j5pJ7pKMnolO%MolRj7M%NrO
7356bnLnjJ0llMPrNKnRLpRmQj6LLLJklMpOmpJLNpJ7j4kM%ljjNmjoPpPQj1Rj5j
7411a0J0KkJjjLLP%j1%%lJ2qKJkjjljkPJPj6MMkjrQmkKKpN%J3j0OlKnJ6kj4J0
7462GmMp%J0mKj5LoJ2K%%j3J1jOk3K0mrJ0l%k0J2J0mJ1mj2LMLJ0pMlj5J4kNj%
7507FKnlMKmLqOj4J3%kj7J5j2Pj0J0jjlKKMlJQj1RMn%jJ2%nJkLrJ2%kJj4J6nj6
$$ plain form
7556 -10 0 -1 -5 -9 9 -9 -5 0 3 -8 -9 -8 0 5 -2 -2 5 -1 1 5 1 7 9 6 7 -3 -1 -1 5 10 14 5 -6 2 2 3 5 5 -11 -4 6 5 -7 -7 4 -5 -4 -7 3
7605 3 -4 -2 -7 -5 -2 -4 4 -9 4 -3 12 -11 -6 -4 -6 10 2 -3 2 8 -1 6 -3 5 1 -3 -1 8 0 6 3 -1 0 9 -2 -7 3 4 13 1 -8 -13 -8 3 6 8 1 -7 -16 -6 -11
7656 -11 -3 -4 0 0 8 2 0 6 6 12 5 6 14 -3 2 -11 6 -6 5 6 4 7 -6 -10 4 5 -6 -7 -1 -9 -8 -3 -7 1 -9 -9 -9 -12 -12 -3 1 -1 -2 3 6 -2 11 3 -1 -1
7706 -1 4 -5 1 13 9 1 3 10 10 8 0 13 9 2 6 -2 -1 7 3 -2 -6 -2 -2 6 -2 -6 -3 -9 -6 -4 -7 -3 -2 7 -4 -1 1 5 0 8 7 0 8 0 7 4 2 6 4 -3 9 8 2 -2 -2 -5 3
7763 3 -6 7 0 3 -3 -5 -5 -11 -4 -4 1 -4 -7 -7 -3 -9 -9 -7 -4 0 5 -2 10 6 8 5 5 9 0 5 6 0 15 1 3 0 10 4 6 9 6 9 2 -3 6 5 5 4 -3 -6 6 -5 5
7816 5 7 -2 -2 1 4 1 6 2 1 -1 -3 5 5 5 14 -1 10 8 8 -1 2 7 7 1 -1 -2 -1 6 5 10 0 7 5 6 -1 0 7 -3 -6 -3 -11 8 0 3 12 7 -8 -9 -11 2 2 -2 14
7869 14 -5 8 -5 2 7 4 -2 5 2 13 1 3 -1 9 3 2 15 8 2 -8 1 -2 -10 5 0 0 -8 4 2 -1 6 -2 -5 -4 -5 -11 2 4 7 5 0 -1 -7 -7 3 9 -3
7916 -3 7 3 8 4 -2 -1 9 4 0 -3 -2 6 -3 3 -12 0 1 -3 -2 -3 -13 -2 1 -5 -4 9 -4 -9 -5 -13 5 -5 -6 -4 2 2 4 0 6 1 11 13 6 10 3 8 12 11 1
$$ packed form
7556a0J0jmmJ8j8MNLj1jJQNp%PoKMmOKlJj0K%ONMrj1Q%JK%j6PJ0jj2%J1rJlJ0
7605CpKnKLkQj3J3pJ5k3NKkJ6qnNOrPrQmmKRqOlmJRj1nJ0JRj2rnNJ1LKpqrJ0n
7656a1QjM%QokO%OpJQj7Nj3J7j2J1JkLj3mJ4Jj1jOqJNmQj0%%l%RMkjNLqJ3qm%
7706aNrOJ2mqKP%kqJ3mpMqJQmnmM%QqmLoLKlMJRj1LKMnQjpQqPlkMkpJ2jom%lQ
7763CrJ3pLok%oP%Nnl%Mo%KLMNpJ2mKl%MrNJoJ5j4KlJ0oKLlLpnRj%jplJ2j1J0
7816EKr%LLlNmjkkQ%%Rj5J1k%rLN%okjJPjNj0PkJpJPj0lLqJ9qLRnj5jkJ3%mJ6
7869A4j9J3j3PNloPlJ1j2KmJ0ojJ3poj0RlqJ5n%qJ2klPqlJjoJ3KLknjo%J0Oj2
7916cJ0mNmoJJ0nmlJQrOj5J2JmJjj0J1LoJJ3j3nMqJ8j0jKO%KmOnJ0KpMpNMjj0
$$ plain form
7965 1 -8 6 0 -6 -2 -6 2 -5 -2 -2 -9 -6 -5 0 -8 -6 1 0 -1 -10 -8 -7 -5 8 -11 -1 -4 4 -2 11 -5 1 10 9 2 1 7 3 5 6 4 10 -4 2 -2 0 5 0 2 5 4 1 -3 -3
8019 -3 7 -4 -6 1 -10 6 7 -5 2 -2 12 10 -2 3 -8 -6 9 4 9 6 5 4 11 5 -2 9 17 9 -2 7 -8 -4 0 8 2 10 -7 3 0 -3 1 -5 -11 0 -8 -1
8065 -1 -4 6 7 -12 -6 4 3 0 -7 -1 7 7 1 -1 3 14 12 16 21 7 4 6 2 -1 4 8 11 8 6 10 -5 2 4 7 4 4 -2 5 4 -2 2 7 3 -5 -1 2 -4 -2 4 7 9 3 13 -2
8119 -2 8 4 -2 11 11 -3 3 3 4 6 2 2 2 12 1 1 4 -2 6 -11 1 2 9 2 -3 -8 0 3 -4 -2 -11 4 -3 -6 -11 0 1 5 5 12 -1 1 3 1 4 12 12 5 7 11 3
8170 3 -1 10 -6 -5 2 15 3 14 -2 2 7 9 5 -1 -12 -2 -1 1 -4 -4 -2
$$ packed form
7965ArJ4ooMmQpL%pLJNqKPjjrKJKJ3j9J0lQoJ3j6ORjpjOmKJkOj4OmKNnKLjlm%
8019cJ0j1kPj1J6Jj2PmJ4kj2Nj1KJ5nNljjPopJ1Qqj1Rj5MMQoQj7J0llMooJ1qP
8065alJ0Jj9OJ0jlpOQ%okMJ1kMNj4lKmlNMLlkMj5PKLl%oPjoMNmqMLoKOLKoJ0j5
8119bJ0moJ3%j4O%JKm%%J0j1%LoQj7J2JPpnnQLpKrJ5plnJ1JM%Pj3KKkLQ%pKMq
8170CmJ1j6JPJ3j2J1j6MNKmoj1J0JKn%K
8191b
##END NTUPLES=NMR FID
##END=
