##TITLE=1H_ES-AN-EG-C2
 
 8 sc, 
 21.1.2022
##JCAMPDX= 6.0         $$ Bruker NMR JCAMP-DX V2.0
##DATA TYPE= NMR FID
##DATA CLASS= NTUPLES
##ORIGIN= UXNMR, Bruker Analytische Messtechnik GmbH
##OWNER= root
$$ XWIN-NMR		Version 3.5
$$ Fri Jan 21 12:41:11 2022 Russian Standard Time (UT+4h)  she@DPX200
##.OBSERVE FREQUENCY= 200.131346
##.OBSERVE NUCLEUS= ^1H
##.DELAY= (6, 6)
##.ACQUISITION MODE= SIMULTANEOUS
##.ACQUISITION SCHEME= undefined
##.AVERAGES= 8
##.DIGITISER RES= 18
##SPECTROMETER/DATA SYSTEM= spect
##.PULSE SEQUENCE= zg30
##.SOLVENT NAME= DMSO
##.SHIFT REFERENCE= (INTERNAL, DMSO, 0, 15.7039)
##AUDIT TRAIL= $$ (NUMBER, WHEN, WHO, WHERE, WHAT)
$$ ##TITLE= Audit trail, XWIN-NMR		Version 3.5
$$ ##JCAMPDX= 5.01
$$ ##ORIGIN= Bruker BioSpin GmbH
$$ ##OWNER= she
$$ F:/spectra/data/she/nmr/H-F/1/audita.txt
$$ ##AUDIT TRAIL=  $$ (NUMBER, WHEN, WHO, WHERE, WHAT)
(   1,<2022-01-21 12:39:55.14 +0400>,<she>,<DPX200>,
      <created by zg, POWCHK disabled, PULCHK disabled
       configuration hash MD5:
       00 E9 B6 7A A2 85 ED C7 34 08 36 98 17 FE 4E 26
       data hash MD5: 16K
       73 86 1E 11 AF E9 C0 B4 94 3E AC 2D C6 B4 C5 29>)
$$ ##END=
$$ 
$$ hash MD5
$$ 2E 70 66 63 26 27 BD 3E 57 77 2F F2 ED 5F 29 CB
##$RELAX= 
##$RELAX= 
##$RELAX= 
##$RELAX= 
##$RELAX= 
##$RELAX= 
$$ Bruker specific parameters
$$ --------------------------
##$DU= <F:/spectra>
##$EXPNO= 1
##$NAME= <H-F>
##$PROCNO= 1
##$TYPE= <nmr>
##$USER= <she>
##$AMP= (0..31)
100 100 100 100 100 100 100 100 100 100 100 100 100 100 100 100 100 100 
100 100 100 100 100 100 100 100 100 100 100 100 100 100 
##$AQSEQ= 0
##$AQ_mod= 1
##$AUNM= <au_zg>
##$AUTOPOS= <>
##$BF1= 200.13
##$BF2= 200.13
##$BF3= 200.13
##$BF4= 200.13
##$BF5= 200.13
##$BF6= 200.13
##$BF7= 200.13
##$BF8= 200.13
##$BYTORDA= 1
##$CFDGTYP= 0
##$CFRGTYP= 5
##$CHEMSTR= <none>
##$CNST= (0..31)
1 1 145 1 1 1 1 1 1 1 1 1 1 1 1 1 1 1 1 1 1 1 1 1 1 1 1 1 1 1 1 1 
##$CPDPRG= <>
##$CPDPRG1= <>
##$CPDPRG2= <>
##$CPDPRG3= <>
##$CPDPRG4= <mlev>
##$CPDPRG5= <mlev>
##$CPDPRG6= <mlev>
##$CPDPRG7= <mlev>
##$CPDPRG8= <mlev>
##$CPDPRGB= <>
##$CPDPRGT= <>
##$D= (0..31)
0 1.2 0 0 0 0 0 0 0 0.06 0 0.03 0 0 0 0 0.0002 0 0 0 0 0 0 0 0 0 0 0 0 
0 0 0 
##$DATE= 1642754394
##$DBL= (0..7)
120 120 120 120 120 120 120 120 
##$DBP= (0..7)
150 150 150 150 150 150 150 150 
##$DBP07= 0
##$DBPNAM0= <>
##$DBPNAM1= <>
##$DBPNAM2= <>
##$DBPNAM3= <>
##$DBPNAM4= <>
##$DBPNAM5= <>
##$DBPNAM6= <>
##$DBPNAM7= <>
##$DBPOAL= (0..7)
0.5 0.5 0.5 0.5 0.5 0.5 0.5 0.5 
##$DBPOFFS= (0..7)
0 0 0 0 0 0 0 0 
##$DE= 6
##$DECBNUC= <off>
##$DECIM= 32
##$DECNUC= <off>
##$DECSTAT= 4
##$DIGMOD= 1
##$DIGTYP= 9
##$DL= (0..7)
0 120 120 120 120 120 120 120 
##$DP= (0..7)
150 150 150 150 150 150 150 150 
##$DP07= 0
##$DPNAME0= <>
##$DPNAME1= <>
##$DPNAME2= <>
##$DPNAME3= <>
##$DPNAME4= <>
##$DPNAME5= <>
##$DPNAME6= <>
##$DPNAME7= <>
##$DPOAL= (0..7)
0.5 0.5 0.5 0.5 0.5 0.5 0.5 0.5 
##$DPOFFS= (0..7)
0 0 0 0 0 0 0 0 
##$DQDMODE= 0
##$DR= 18
##$DS= 0
##$DSLIST= <SSSSSSSSSSSSSSS>
$$ [...]
##$SUBNAM2= <"">
##$SUBNAM3= <"">
##$SUBNAM4= <"">
##$SUBNAM5= <"">
##$SUBNAM6= <"">
##$SUBNAM7= <"">
##$SUBNAM8= <"">
##$SUBNAM9= <"">
##$SW= 18.0517287032376
##$SWIBOX= (0..15)
0 0 2 0 0 0 0 0 0 0 0 0 0 0 0 0 
##$SW_h= 3612.71676300578
##$TD= 16384
##$TD0= 1
##$TE= 0
##$TE2= 300
##$TE3= 300
##$TEG= 300
##$TL= (0..7)
0 120 120 120 120 120 120 120 
##$TP= (0..7)
150 150 150 150 150 150 150 150 
##$TP07= 0
##$TPNAME0= <>
##$TPNAME1= <>
##$TPNAME2= <>
##$TPNAME3= <>
##$TPNAME4= <>
##$TPNAME5= <>
##$TPNAME6= <>
##$TPNAME7= <>
##$TPOAL= (0..7)
0.5 0.5 0.5 0.5 0.5 0.5 0.5 0.5 
##$TPOFFS= (0..7)
0 0 0 0 0 0 0 0 
##$TUNHIN= 0
##$TUNHOUT= 0
##$TUNXOUT= 0
##$USERA1= <user>
##$USERA2= <user>
##$USERA3= <user>
##$USERA4= <user>
##$USERA5= <user>
##$V9= 5
##$VALIST= <valist>
##$VCLIST= <CCCCCCCCCCCCCCC>
##$VD= 0
##$VDLIST= <DDDDDDDDDDDDDDD>
##$VPLIST= <PPPPPPPPPPPPPPP>
##$VTLIST= <TTTTTTTTTTTTTTT>
##$WBST= 1024
##$WBSW= 4
##$XGAIN= (0..3)
0 0 0 0 
##$XL= 0
##$YL= 0
##$YMAX_a= 229372
##$YMIN_a= -280237
##$ZGOPTNS= <>
##$ZL1= 120
##$ZL2= 120
##$ZL3= 120
##$ZL4= 120
##$ABSF1= 10
##$ABSF2= 0
##$ABSG= 5
##$ABSL= 3
##$ALPHA= 0
##$AQORDER= 0
##$ASSFAC= 0
##$ASSFACI= 0
##$ASSFACX= 0
##$ASSWID= 0
##$AUNMP= <proc_1d>
##$AZFE= 0.1
##$AZFW= 0.1
##$BCFW= 1
##$BC_mod= 2
##$BYTORDP= 1
##$COROFFS= 0
##$CY= 11.3945322036743
##$DATMOD= 1
##$DC= 2
##$DFILT= <>
##$DTYPP= 0
##$F1P= 2.36226072786647
##$F2P= -0.459571619588291
##$FCOR= 0.5
##$FTSIZE= 0
##$FT_mod= 4
##$GAMMA= 1
##$GB= 0.15
##$INTBC= 1
##$INTSCL= 1
##$ISEN= 128
##$LB= 0.24
##$LEV0= 0
##$LPBIN= 0
##$MAXI= 10000
##$MC2= 0
##$MEAN= 0
##$ME_mod= 0
##$MI= 1.114404
##$NCOEF= 0
##$NC_proc= 0
##$NLEV= 6
##$NOISF1= 3.799351
##$NOISF2= 2.8
##$NSP= 1
##$NTH_PI= 0
##$NZP= 0
##$OFFSET= 15.70392
##$PC= 1
##$PHC0= -15939.65
##$PHC1= -3.999225
##$PH_mod= 1
##$PKNL= yes
##$PPARMOD= 0
##$PSCAL= 0
##$PSIGN= 0
##$REVERSE= no
##$SF= 200.130013532006
##$SI= 16384
##$SIGF1= 3
##$SIGF2= 2
##$SINO= 400
##$SIOLD= 16384
##$SREGLST= <1H.CDCl3>
##$SSB= 0
##$STSI= 0
##$STSR= 0
##$SW_p= 3612.71676300578
##$SYMM= 0
##$S_DEV= 0
##$TDeff= 0
##$TDoff= 0
##$TI= <>
##$TILT= no
##$TM1= 0
##$TM2= 0
##$TOPLEV= 0
##$USERP1= <user>
##$USERP2= <user>
##$USERP3= <user>
##$USERP4= <user>
##$USERP5= <user>
##$WDW= 1
##$XDIM= 8192
##$YMAX_p= 0
##$YMIN_p= 0
$$ End of Bruker specific parameters
$$ ---------------------------------
##NTUPLES= NMR FID
##VAR_NAME=  TIME,          FID/REAL,        FID/IMAG
##SYMBOL=    X,             R,               I
##VAR_TYPE=  INDEPENDENT,   DEPENDENT,       DEPENDENT
##VAR_FORM=  AFFN,          ASDF,            ASDF
##VAR_DIM=   8192,          8192,            8192
##UNITS=     SECONDS,       ARBITRARY UNITS, ARBITRARY UNITS
##FACTOR=    0.0002768,     1,               1
##FIRST=     0,             0,               0
##LAST=      2.2672688,     0,               0
##MIN=       0,             -280237,         0
##MAX=       2.2672688,     229372,          0
$$ Real data points
##PAGE= N=1
##DATA TABLE= (X++(R..R)), XYDATA
0@%%%%%%%%%%%%%%%%%oJ4j6J6j6J6k4L2l2L5m3M8n4O2p0Q1r1J00j12J28j44J60
39H4j76J95k18K41k65K93l24L58l93M31m75N23n78O37p04P82q66R63j078J216
59F46j380J577j826K154k595L218m173N791q999J7562q0126k12086K63772K02347
73A85882j79643o0750J88018p6229k58357J15894K94513j12306k64048J02988
83f4038J78853j42131r3827K10290N6498k54355m0743K52127J7947k17387L4274
94f2492J80306j01620j63236J54054J52008j78098j28485J83093Q3429j85247
104f6288k7011J93943k3410k00330N9874J93188q7503j68529J14420J32897j43510
115b2259r6277J68560O3037j82220l0610J82205m697j72102M2860J57160p9230
$$ y = [0, 0, 0, 0, 0, 0, 0, 0, 0, 0, 0, 0, 0, 0, 0, 0, 0, 0, -6, 8, -8, 8, -8, 8, -16, 16, -16, 19, -24, 24, -30, 32, -38, 43, -48, 52, -60, 68, -76, 84, -92, 103, -115, 126, -139, 154, -170, 188, -205, 226, -249, 274, -304, 333, -371, 411, -455, 508, -570, 646, -734, 843, -983, 1171, -1424, 1794, -2379, 3412, -5587, 11975, -68151, -280237, -16465, 185882, 6239, -54511, 133507, 57278, -201079, -85185, 209328, 97022, -167026, -64038, 114815, -27316, -121143, 89147, 145645, -108710, -149453, 102674, 120621, -96766, -62492, 117814, 16194, -147042, 7012, 159020, -19078, -147563, 35530, 118959, -66288, -93299, 100644, 77234, -123096, -63222, 129966, 42463, -126066, -11646, 121251, -22259, -118536, 50024, 113061, -69159, -99769, 82436, 77739, -94363, -51503, 105657, 26427]
126B6427j39333J08594J17156j29088q8984J42212N5604j50044k0412J52923j2993
137F2062j49504M3018J38609o9711j20796R3375R8134j13270p2847J27847M6096
148H3013j35822j8281J37041j0071j32332L7793J22536o3166j08175Q4686Q9548
159H6770j01582o7220J13640M2210j20661j6062J22432r783j18785L4292J09780
170G5031n6599r6007P5896P8423r1332n8115J02295L5940j08217j2912J09116
181E3519r984j05281L1775R7073n1436q4955O8089O9623q1263n1747R0540L2197
193E8150r5715j1901R6652q257r3421K7456Q6226m4921p5519O0001O1859p2117
205a1507m5896Q0790K8327q5689r943Q6708q434q3923K6043P7508m2063o7822
$$ y = [26427, -112906, -4312, 112844, -16244, -105228, 36984, 92588, -57456, -77868, 75055, 62062, -87442, -44424, 94185, 24474, -96322, -2947, 95187, -18083, -90930, 36917, 83013, -52809, -71090, 65951, 55880, -76452, -38659, 83877, 20711, -87464, -2778, 86770, -14812, -82032, 31608, 73818, -46843, -62905, 59527, 49744, -69041, -34749, 75031, 18432, -77575, -1679, 76744, -14588, -72703, 29592, 65532, -42685, -55597, 53519, 43535, -61746, -29971, 67102, 15666, -69289, -1200, 68423, -12840, -64587, 25953, 58150, -37565, -49466, 47186, 38929, -54492, -27036, 59190, 14269, -61250, -1249, 60610, -11507, -57403, 23387, 51714, -33975, -43918, 42790, 34356, -49567, -23524, 53984, 11921, -55901]
217e5901N5817N5392o6777m0812P4541K4785p8801q107P9505q499p6662K4225
229b1294P0559l8426o1577N0554N0166o0110l6917O6748K2496p0311p542P0725
241C5071p329o8041K1421O2489l4205n4385M5155M4150n3873l2238O0034J9212
253C7461o3435n616O3972p920o1704K0809N6801l2542m9482M2604M0172n0617
265i497k9258N6214J7323n9256m833N9604p578n7337J9361N2601k9996m5688L9057
278G17L6916m6158k6786N1039J5757n3583m315N3673o969n1447J7670M7027k7302
291F239m0684L5512L2707m1946k3513M6425J3516m8771l142M8935p120m6986J6848
304a1980M3043k5638l7309L3146L0059l9039k1666M3124J2516m5240l016M5341
$$ y = [-55901, -84, 55308, -11469, -52281, 22260, 47045, -31756, -39863, 39642, 31143, -45519, -21294, 49265, 10839, -50738, -184, 49982, -10128, -47045, 19703, 42199, -28112, -35654, 35071, 27742, -40299, -18878, 43611, 9406, -44979, 176, 44326, -9547, -41785, 18249, 37461, -25974, -31590, 32382, 24462, -37242, -16433, 40368, 7826, -41656, 948, 41120, -9497, -38755, 17459, 34782, -24474, -29307, 30297, 22719, -34618, -15257, 37344, 7348, -38340, 717, 37633, -8525, -35311, 15728, 31485, -22098, -26413, 27260, 20291, -31156, -13486, 33541, 6239, -34445, 1067, 33774, -8172, -31685, 14740, 28256, -20515, -23657, 25278, 18158, -28828, -11980, 31063, 5425, -31884, 1262, 31321, -7718, -29384, 13740, 26256, -18984, -22000, 23341]
316B3341o422m3460J5344L9721k3396l4357L0254K7566l5589j9772L9245J1302
328B3777m1089k535M1072o102l9273J4271L5793k1587l0871K7816K4690l2656
340f694j7585L5972R894l7648j947L7664n910l6017J3311L2858j9961k8373K5616
353A180K2721l0007j6240L3013R196l4513j915L4462n270l2932J2051L0007j8168
366C585k5830K3339K0621k7376j4623L0122Q117l1481j409L1421n198k9975J1422
379g265K7259j6997k3420K1730J8628k5377j3151K7851P221k9043j102K8951m918
392A0367k7604J0589K5068j5645k1524J9913J7121k3234j2072K5444O630k6503
404a1450j016K6377m514k5101R691K2783j4376j9484J8300J5420k1331j0769K3356
$$ y = [23341, 16919, -26541, -11197, 28524, 5128, -29229, 1025, 28591, -6998, -26770, 12475, 23777, -17312, -19847, 21225, 15123, -24150, -9879, 25914, 4327, -26544, 1272, 25962, -6694, -24279, 11693, 21587, -16061, -18008, 19656, 13746, -22271, -8960, 23898, 3937, -24436, 1180, 23901, -6106, -22346, 10667, 19863, -14650, -16565, 17897, 12627, -20305, -8254, 21753, 3585, -22245, 1094, 21715, -5661, -20284, 9838, 17955, -13526, -14935, 16486, 11288, -18687, -7265, 19994, 2997, -20423, 1307, 19935, -5442, -18593, 9258, 16479, -12564, -13666, 15285, 10367, -17237, -6648, 18420, 2775, -18749, 1164, 18285, -4949, -17021, 8423, 15053, -11450, -12466, 13911, 9397, -15704, -6013, 16770, 2394, -17090, 1210, 16630, -4701, -15470, 7886]
417G886N751k4343n75K4211m483k3038R279K0861j3532j7846J7125J4115j9882
430d471r832K1716N214k2568m71K2419m189k1296Q566J9258j2468j6433J5739
443A184J2950j8256q988J9922M715k0688l21K0512l982j9456Q026J7551j1614
456A555j4941J4634J1717j6944q044J8477M107j9159o5J8980l889j7981P607J6208
470A2262j0895j3786J3660J0803j5752p417J7131L774j7738l0J7534l632j6590
483a0676P063J4911j0086j2645J2633R851j4567o685J5823L285j6355J75J6150
496H877l572j5238O752J3671r560j1533J1886Q936j3646n996J4775K860j5229
509g017L49J5002l458j4125O368J2653q933j0661J1061Q242j2673n498J3659K595
$$ y = [7886, 13637, -10706, -11281, 12930, 8447, -14591, -5312, 15549, 2017, -15829, 1296, 15411, -4471, -14303, 7413, 12627, -9941, -10412, 12007, 7818, -13478, -4912, 14346, 1878, -14555, 1184, 14134, -4122, -13110, 6812, 11527, -9161, -9482, 11030, 7048, -12408, -4382, 13169, 1555, -13386, 1248, 12965, -3979, -12023, 6454, 10561, -8598, -8663, 10317, 6428, -11553, -3946, 12262, 1367, -12419, 1241, 12044, -3708, -11125, 6006, 9780, -7958, -7988, 9546, 5914, -10676, -3613, 11298, 1212, -11433, 1200, 11051, -3516, -10201, 5622, 8907, -7448, -7273, 8877, 5305, -9933, -3181, 10490, 930, -10603, 1283, 10219, -3427, -9423, 5352, 8212, -7017, -6668, 8334, 4876, -9249, -2881, 9772, 839, -9822, 1239, 9481, -3192, -8690, 4969, 7564]
523G564j4040L64J3805l259j2968N928J1594q304r716J0258P449j1716m926J2632
537D665K224j2971N18J2751l197j1952N668J0652p842q915R626O834j0957m469
551g365J1789J961j2068N57J1823l019j1057N288R853p282q235Q924O264j0121
565b688m084J0861J763j1111N82J0859k853j0147M957Q991o781p491Q290N669
579F817r393l647J0077J494j0278O57J0041k748r367M693Q299o383o881P750N205
594F336q750l324R352J335r537O69R295k606q642M375P638n920o318P187M730
609E820q108k985Q645J139q793P14Q560k508p948M151O998n579n770O734M301
624E371p565k673Q046R75q169P47P950k413p362L912O476n214n322O286L936p029
$$ y = [7564, -6476, -6112, 7693, 4434, -8534, -2606, 8988, 684, -9032, 1226, 8675, -3041, -7967, 4665, 6889, -6082, -5564, 7187, 3990, -7962, -2294, 8358, 516, -8399, 1227, 8061, -2896, -7365, 4424, 6385, -5683, -5126, 6697, 3678, -7379, -2091, 7762, 480, -7755, 1169, 7433, -2688, -6772, 4089, 5852, -5259, -4677, 6182, 3329, -6818, -1861, 7130, 349, -7142, 1148, 6817, -2576, -6223, 3854, 5348, -4930, -4273, 5768, 3020, -6347, -1654, 6645, 262, -6619, 1131, 6336, -2414, -5738, 3614, 4949, -4588, -3919, 5376, 2770, -5872, -1497, 6141, 221, -6097, 1090, 5820, -2288, -5273, 3372, 4511, -4282, -3568, 4992, 2484, -5464, -1313, 5685, 106, -5664, 1070, 5371, -2194, -4867, 3179, 4154, -4015, -3268, 4682, 2269, -5093, -1181, 5295, 81, -5241, 1045, 4981, -2048]
640b048k437P458Q69p561P21P328k256o774L641N940m855m850N815L569o504k176
656d120O901O97o971P65O759k180o242L465N454m582m450N487L259o108j951O461
672B644N84o524P96O296k097n794L285N062m310m115N127K997n698j771O000N03
688B985o050P55N838j980n361L082M653m017l757M748K733n286j604N571M13n597
704b874P71N388j902m924K898M287l774l460M470K497m934j448N209L18n218P73
720a923N005j803m577K740L963l546l172M176K267m609j281M819K58m826P66M602
736B859j729m182K564L611l291k889L850K066m253j156M460J99m441P25M244j597
752A040l870K400L330l063k657L579J894l951j032M122J62m107O94L925j508l577
$$ y = [-2048, -4485, 2973, 3842, -3719, -2998, 4330, 2074, -4700, -1059, 4881, 26, -4824, 991, 4560, -1944, -4120, 2781, 3478, -3493, -2728, 4031, 1851, -4391, -926, 4528, -54, -4504, 983, 4242, -1866, -3817, 2644, 3228, -3296, -2500, 3796, 1699, -4095, -810, 4252, -58, -4173, 954, 3951, -1747, -3518, 2482, 2985, -3065, -2310, 3528, 1548, -3813, -731, 3922, -95, -3852, 896, 3629, -1657, -3261, 2310, 2723, -2874, -2103, 3285, 1383, -3541, -643, 3644, -130, -3590, 880, 3377, -1557, -3005, 2204, 2522, -2696, -1923, 3082, 1279, -3298, -558, 3405, -141, -3313, 863, 3130, -1479, -2760, 2059, 2317, -2509, -1743, 2859, 1130, -3052, -488, 3123, -168, -3057, 793, 2859, -1394, -2550, 1910, 2109, -2332, -1607, 2637, 1040, -2830, -430, 2900, -163, -2820, 759, 2653, -1298, -2330, 1792, 1954, -2153, -1459, 2466, 958, -2619]
768b619K250L072k880k426L342J710l683r19L837J00l820O95L642j460l286K115
784c30K811k683k221L120J537l402q02L528P1l505O55L332j355l007J959K585
800B293k479k036K868J417l128p30L238O1l233O22L064j260k768J835K343k297
816a90j844K650J276k909o42L012Pk991O07K839j205k553J729K170k157j699K492
833E92J156k709n66K787lk764N90K608j129k344J597J989j984j543K280J053k475
850h65n30K553pk534N61K375j045k148J491J798j843j416K129R49k312m43K377
867A090n8k346N49K222j025j962J410J660j737j299K006Q62k164l87K214q5k164
884a214N34K043r54j819J315J535j628j168J858P57k000l23K035r4k009N15J861
$$ y = [-2619, -369, 2703, -177, -2603, 739, 2449, -1234, -2153, 1684, 1784, -2036, -1341, 2301, 841, -2445, -330, 2481, -202, -2423, 697, 2234, -1168, -1970, 1558, 1629, -1876, -1221, 2111, 756, -2251, -292, 2293, -186, -2222, 646, 2063, -1065, -1795, 1443, 1504, -1729, -1107, 1957, 697, -2071, -236, 2107, -190, -2034, 616, 1892, -1017, -1659, 1353, 1360, -1631, -1024, 1815, 610, -1943, -214, 1956, -201, -1900, 592, 1748, -961, -1527, 1260, 1257, -1507, -917, 1691, 562, -1782, -185, 1804, -180, -1723, 557, 1610, -865, -1395, 1158, 1151, -1383, -822, 1553, 508, -1640, -149, 1649, -194, -1610, 519, 1468, -844, -1287, 1090, 1032, -1314, -765, 1457, 432, -1530, -120, 1540, -197, -1496, 510, 1372, -792, -1179, 1035, 950, -1214, -680, 1363, 409, -1410, -95, 1440, -188, -1356, 502, 1259, -741, -1064, 971, 877, -1132, -617, 1244]
901A244q89j669J238J391j513j069J722O87j865k67J878r8j853N05J719q56j530
918a225J185J258j424r53J613O08j716k47J756j20j721M88J596q07j418J108J160
935A141j344q60J501N46j604k10J620j29j582M57J476p76j299J044J061j240q06
952a004J398M81j468j80J510j37j462M45J359p26j185R71R72j162p23J301M38
969H28j374j48J409j58j353M40J243o91j086R06Q90j096o44J212L76j281j08J281
987F46j51j244L98J162o52j005Q51Q10j014n91J140L44j190j04J196j41j152L90
1005c07J063o18r17Q07P41r46n31J051L15j103r3J124j57j074L86R68n84q28P35
1024C2O75q75m89R80K70j018p1J022j49r79L46R03n48p72P07O17q27m42R20K33
$$ y = [1244, 355, -1314, -76, 1315, -198, -1267, 455, 1142, -723, -990, 888, 790, -1063, -558, 1161, 305, -1225, -40, 1218, -206, -1159, 454, 1062, -654, -901, 855, 735, -986, -498, 1098, 291, -1127, -19, 1141, -203, -1063, 438, 984, -620, -830, 790, 661, -921, -464, 1012, 236, -1063, -19, 1042, -198, -1004, 394, 875, -593, -773, 737, 600, -862, -417, 942, 216, -969, 2, 974, -188, -911, 390, 828, -546, -694, 715, 557, -796, -356, 887, 196, -890, 16, 906, -190, -834, 378, 754, -527, -635, 646, 495, -749, -351, 811, 159, -846, 5, 815, -199, -790, 350, 694, -496, -600, 596, 455, -697, -307, 756, 138, -779, 28, 769, -177, -708, 343, 658, -445, -538, 586, 429, -645, -259, 709, 125, -703, 32, 707, -168, -657, 323, 593, -425, -496, 526, 377, -602, -256, 647, 99, -673, 34, 651, -176, -618, 302, 535]
1044E35r44m2R53j54r14L60Q19n18p10O59N62p63m00Q57K07q90k2Q91j66q35L25
1065a90P73n03o54O28N04p25l59P96J83q25qQ04j57p68L18O97m67n84N81M69o75
1086a62l22P49J65p66lP56j62p09L18O31m43n36N52M17o34k74O80J36p19L0O95
1107C99j64o73L05N95m37m87N14L89o00k55O43J19o60K0O56j69o10K95N38m02
1127A6m42M97L37n48k28O07Q5o01K7O05j63n64K88M95l80m08M54L03n26j79N50
1148B25P4n78N2N55j81n06K75M46l65l72M48K71m92j71N18O8n47O7N19j59m86
1169c39K70M24l60l39M25K46m60j56N04L6m87N9M75j65m31K54L75l30l06L86K17
1190B98m31j35M61K1m49O7M41j66m07K47L37l17k60L71K00m13j15M30J3m30P1
$$ y = [535, -409, -451, 502, 348, -566, -206, 613, 95, -615, 44, 606, -157, -557, 300, 507, -383, -405, 486, 320, -515, -190, 583, 80, -574, 54, 558, -167, -526, 270, 453, -372, -380, 424, 267, -501, -183, 514, 47, -537, 44, 513, -162, -484, 265, 430, -336, -339, 417, 255, -454, -136, 495, 52, -484, 68, 485, -149, -423, 257, 393, -326, -296, 399, 235, -438, -133, 462, 25, -462, 52, 441, -159, -414, 229, 348, -312, -292, 364, 195, -415, -120, 418, 16, -426, 71, 408, -140, -368, 239, 324, -277, -250, 355, 192, -372, -84, 411, 31, -377, 77, 380, -146, -325, 225, 299, -279, -227, 328, 147, -359, -84, 362, -3, -375, 73, 344, -148, -319, 199, 267, -280, -213, 306, 147, -339, -69, 355, -5, -344, 81, 327, -133, -289, 215, 251, -236, -177, 298, 133, -298, -44, 331, 1, -305, 81, 298, -133, -268, 193, 214, -235, -168, 273, 107, -300, -53, 284, -33, -293, 78, 278, -135, -250, 180, 193, -237, -166]
1211a66M23j50l76K33L20k96k57L61J77l82j07M02J9l99P0L73j50l39K24K76k72
1232a6k37L33J56l67o4L55J0l65O5L37j43l08K15K53k45k26L08J52l38o2L46q
1254A51l35Q5L10j41k85K09K42k64j83K99J23l08n3L24j9l19P2K96j35k81K07
1275eK17k38j61K51J20k95n7L07k2k91P6K77j28k38J77J94k17j53K62Q8k58m5
1297a39K65j0k56O9K56j29k25J75J84k10j33K31Q9k52l7K68k8k54P1K31j28k03
1319a65J71J64k07j25K26P5k41j9K38k5k32P2K17j20j79J58J47j84j09K18O0k19
1341g9k7K22k1k16P7J88j01j80J42J60j78j15K06N5k14j6J98j7k02O8J82j01j67
1364a36J37J25j63r9J93N4j95j3J92k2j92P3J63j03j38J32J33j72p4J69M4j75
$$ y = [-166, 257, 107, -269, -36, 284, -12, -269, 92, 269, -113, -220, 182, 201, -198, -128, 245, 95, -244, -20, 256, -16, -253, 80, 236, -131, -195, 160, 170, -195, -130, 207, 64, -244, -29, 224, -21, -247, 61, 213, -125, -187, 159, 151, -184, -99, 211, 70, -215, -6, 236, -28, -211, 88, 211, -97, -150, 174, 155, -164, -92, 204, 69, -212, -5, 212, -26, -187, 64, 184, -111, -168, 139, 117, -174, -98, 179, 51, -187, -10, 184, -33, -186, 76, 164, -94, -139, 126, 116, -140, -71, 185, 56, -169, 6, 190, -20, -153, 78, 167, -85, -122, 146, 118, -136, -65, 166, 38, -165, 6, 170, -37, -162, 64, 139, -102, -121, 117, 92, -140, -68, 149, 29, -150, 8, 155, -29, -138, 80, 140, -79, -106, 116, 95, -121, -44, 144, 43, -137, 5, 165, -13, -128, 78, 133, -81, -97, 101, 84, -118, -50, 132, 31, -136, 1, 126, -37, -136, 57, 111, -84, -97, 95, 73, -119, -46, 117, 14, -124, 8, 141, -31, -105, 64, 108, -67]
1386f7qJ76l0j66O5J47r1j46J36J00j45p1J68L8j85QJ61l5j67P3J52j03j34J21
1410cJ08j41o7J56K6j58lJ65k8j50O1J34q8j08J19Q7j33o5J42K9j35qJ55k9j40
1435g4L7J42q1j18J07P7j21n6J19M7j50J4J38m7j31O4J24q7j00J03Q1j14n5J25
1459D4J9j26J6J15k1j20N5J05o3r2Q9P3j07m3J20Nj08%J24k8j24M9J02p3p7P5
1485IN9j03l9R9L5j26JJ13k0r3L7J01p3p7P5P8j05m3J07K5j08LJ17k9r9M8R5p6
1513A1p1P7N4r1k5R3Pr8QR5k9r3N1Q2o3o4O7M5r2k3Q9K6r9J0Q3k4r4M2Q6o2o2
1544f4Q7L5p1l3Q2J6q0J0Q0k5p8N2N7o1n4O4M3p3k3Q1Lr0J5P4l5o3K9P5o1n1O5
1575FL4o3k4P7Kp4RP9k7n9M4N7n1n2O1L3o2j6P2Qp1OO3k7n9M1N5n3m5N9K5o7j6
$$ y = [-67, -75, 101, 71, -95, -30, 117, 26, -120, 16, 116, -29, -100, 68, 106, -79, -71, 90, 55, -112, -39, 113, 10, -124, -3, 105, -36, -103, 53, 79, -79, -82, 83, 55, -95, -34, 100, 12, -96, 23, 110, -23, -88, 54, 83, -52, -60, 95, 66, -74, -37, 105, 24, -94, 13, 90, -31, -87, 32, 79, -71, -57, 81, 34, -97, -33, 91, 4, -96, 7, 88, -26, -81, 44, 63, -63, -47, 68, 47, -73, -18, 87, 24, -68, 21, 94, -13, -56, 64, 69, -39, -39, 85, 57, -67, -18, 84, 11, -66, 9, 68, -35, -74, 25, 60, -66, -65, 48, 28, -65, -28, 73, 0, -77, -2, 76, -29, -72, 35, 60, -48, -45, 72, 43, -56, -8, 87, 11, -60, 17, 71, -20, -45, 48, 55, -43, -35, 60, 31, -62, -11, 71, 8, -56, 11, 56, -36, -59, 30, 56, -43, -33, 50, 26, -68, -26, 60, -2, -64, 23, 58, -13, -46, 36, 52, -28, -18, 62, 37, -41, 11, 68, 7, -47, 17, 60, -13, -36, 45, 48, -42, -27, 47, 12, -51, -22, 53, -8, -59, 6, 40, -23, -47, 30, 32, -42, -33, 46, 19, -40, 4, 61, 10, -42, 19, 52, -10, -26, 46, 54, -17, -11, 52, 25, -34, 7, 62, 9, -36, 23, 48, -19, -35]
1608c5O9jo5J0N6k7n7L6N3l6m7M6L3n6j7O1Qo9J4O6k9m5L9L4l4l8N4L2o0k6P2
1639D1pn4J5M5j7m7L0L7m4m0M9J6l7k3N2Mm7ON2l8k8K4N0n1k7M6K3m9kL5Ll5M
1672a4N3j7l7K0L9l7k2L0K4m8j0M9Mm8RL2j8l3K6L2l0l6L6Qk8rM6j2m5J4L8qm4
1705c6L4K5l1j4L0J5l4LL3Ll1KL3k0j5J9J4k9j8K6J9m2KL1Jl6J1K4j5l0K3K8l7
1738a2j2M0ok7%K7lk0KL2k5j8J2L0k3j4L3Nk5nL1nj8OL2j7l4K6J5j4k4K6Nk8r
1773a7L7Km2PL8k5l3L5Mk8nK8Mj7lK3Kl7K0K6j1k5K4Oj2qK6ok1J2K3j3k0J2J5
1808B1j1j2J3Rk9mK8Kl3nM0j6m0K5J9j9oJ0K0k9KJ4Pk4MK5Mk6J3K7k7rJ4J7k5
1843aPJ6Lk7mK5mk4J8J2k4mJ1Oj2pK1pj9QJ6j2j9PK1j3j2J2LrjJ3%j2pK8Jj4J6
$$ y = [-35, 34, 33, -32, -22, 34, 7, -50, -14, 39, 3, -44, 2, 35, -21, -38, 23, 31, -38, -24, 42, 13, -32, 7, 41, 7, -31, 23, 55, -5, -31, 41, 34, -20, -5, 40, 23, -24, 6, 43, -1, -41, 8, 24, -13, -36, 16, 20, -27, -21, 31, -7, -35, -11, 39, -12, -39, 7, 30, -19, -21, 14, 17, -18, -14, 39, 22, -15, 5, 44, 7, -15, 15, 39, -9, -19, 30, 34, -14, -5, 27, 9, -24, 2, 34, 4, -32, 4, 12, -16, -25, 21, 9, -36, -22, 16, 8, -36, -2, 23, -8, -22, 8, 23, -11, -8, 25, 28, -3, -1, 32, 12, -3, 16, 30, 1, -17, 9, 28, -14, -12, 19, 20, -16, -5, 19, 4, -26, -3, 25, -12, -24, 16, 10, -17, -17, 10, 7, -13, -11, 21, -4, -22, -10, 20, -3, -17, 16, 21, -4, -9, 22, 17, -1, 5, 37, 20, -14, 12, 27, 13, -11, 15, 20, -8, -17, 20, 22, -20, -13, 25, 0, -33, 2, 6, -22, -27, 1, 5, -12, -15, 8, 10, -27, -7, 19, 8, -17, 7, 13, 1, -7, 19, 13, -8, 4, 27, 14, -6, 6, 21, 10, -2, 11, 20, -9, -13, 15, 17, -16, -21, 19, 3, -37, -12, 7, -12, -18, -8, 12, -17, -15, -1, 6, -18, -14, 11, 15, -11, 2, 29, 2, -7, 7, 24, -1, 6, 22, 25, -2, -6, 19, 15, -9, 9, 21, -3, -7, 4, 10, -2, -9, 12, 5, -14, -6, 10, -2, -21, -14, 7, -6, -18, -6, -3, -12, -13, 0, 0, -12, -19, 9, 10, -4, 12]
1882A2kKj0J8mj9KJ5J0j8j%lj3J1K0j6j7QJ4j4j2J0%oR%rpJ7LkoPLmqK7mj7J0
1923FJ2j6jPPJqMJj4oJ7Kj4%J1lj1qJ7j0k4L7pk0PJ4j1moJ4j1jJ1J1qLJ0J0j8
1963Aj2K1mj1K1Kj2KL%j0j1J9kqlJ1Mk3J3J2j8j4J6%j2JPOk1J2J2pj7J7J4j5N
2001aJ7nrrMJ1Kj3PMnKKJknQqpJ5kj6KL%kqRk0RlNKkP%n%J6j2qK7j4NQmK%oMn
2052AMJ1j4JJ3qMkj4PQj0rQOj6mN%pPLmJJMpmJ5noJ2Mk%%Nj7RJ1kpQNLk2QRkj0
2102AMQj1%jjj0nOJnjPMj7PLqkJ0Po%OJ0j6LMJ2plJ5j3OJ2j4jlJ6kj5NPmj0Mo
2149cJ3j7J7j6ooJ7pjJMNj5OJ5j0j0J8noJ3J3k0J3nMJpJ2l%j6K%J3j2O%jj1Nk
2191aj5J1roJ0Nll%J1ojkJ7k0J5nRpjJ4qjoQLkRj1kpJ4j0LnMPj9NJ1rrQ%nJnR
$$ y = [12, 10, 12, 2, 20, 16, -3, -1, 14, 24, 6, 5, 5, 2, -11, 0, 20, 4, -13, -5, 9, -5, -17, -7, -7, -13, -4, -4, -13, -20, -3, 0, -2, -8, -1, 2, -2, -10, 17, 13, -4, 6, 18, 2, 1, 8, 15, 16, 8, 12, 13, -1, -7, 10, 12, -2, -2, 9, 6, -5, -13, 4, -6, -30, 7, 0, -20, -13, 1, -10, -14, -20, -6, -17, -18, -7, 4, -4, -1, 9, 19, 1, -11, 10, 6, -5, 16, 18, 6, 8, 11, 11, 1, -10, 9, 7, -1, -4, 7, 11, -12, 1, 13, -5, -19, -3, -3, -15, -14, -7, -1, -22, -10, 2, -5, -22, -5, 9, -6, -1, 16, 11, 2, -7, -3, 8, 10, -3, 4, 8, 3, 5, 7, 8, 6, 1, 9, 1, -6, 9, 7, -9, -7, -4, -4, -6, -14, -5, -25, -16, -19, -14, -12, -14, -7, -7, -12, -12, 4, -8, -16, 11, -3, 2, 10, 6, 8, 8, 2, 6, 1, 5, 16, 2, 3, 16, 8, 12, 10, -4, 3, 11, 1, -8, 0, 6, -10, -14, -9, -9, -16, -9, -6, -10, -9, -8, -4, -11, -15, 0, -5, -11, 1, 5, 3, 3, 3, 8, -9, 0, 11, 9, 2, 10, 15, 18, -4, 4, 13, 11, 1, 5, 13, 2, 2, 1, 0, -10, -15, -9, -8, -13, -14, -7, -3, -20, -13, -10, -18, -20, -10, -3, -9, -9, -3, 7, -9, -6, -2, 10, 3, 0, 15, 2, 8, 20, 6, 5, 2, 18, 16, 1, 6, 13, 9, -1, 3, -3, 10, -7, 10, -6, -12, -18, -1, -8, -9, -8, -4, 1, -14, -8, 7, -3, -13, 5, 0, -6, 7, 20, 0, 13, 8, 12, 13, 6, 18, 15, 15, -1, 1, 1, 14, 2, 8, 8, 7, -4, 1, -1, -16, -5, -14, -20, -10, -5, -8, -11, -11, 0, -6, -7, -9, 8, -12, 3, -2, 7, 0, -1, 13, 5, 4, -2, 6, 9, 7, 16, 5, 3, -4, 10, 0, 3, -2, 2, 9, -10, -5, 6, -3, -12, -4, -4, -9, -8, -13, -4]
2239dOprJ4j4LJ1qKO%K%RrrNK0j6LJ1rMj0J0oqlJ2%nKQKj8jKmpNOmoJ0J%MrmL
2289iJ1kLkOJpJ3j0MJ1j6LPlM%jJk1LOjRrLj2QJoNomJ1%j2L%jMj0PQj3J0KJ1r
2337ANMJoJlJMPor%KJ0onpJ7j8jJ7j8oKJ0qjKLqM%%L%NJOj2J3koKJ1j5KQRnmp
2388bLpPM%Kj1MjnkNpJ4lj7NknK4j6J1Kj0lNJ2JmKojQOKj0LMPrjNqoJ2nJ0nnl
2438DqKNmlpJ2j5J1JJLj5J3qpJ5pPmpK2j2RrQj3J1J6qkoK%lRlpjKQj4%KPj1%L
2486alpM%KKj0J7pNqNoN%LMmJ2p%NkPrMQpj8K1j5RPnj0QJk7QKlJ5j0jojjJ4Mj4
2536a0J0klMOOqnMOjLqROrQmj5J0M%mJPj0oJ0jrkk%nnJ0mNrJ1oNnK1j0qQRj0O
2586HlPJmLKpLMMj0J3j1kMqNj4QjkLpNr%Rpo%J0oPKnLLQrQj3J4KLkMoJK%LmJq
$$ y = [-4, 2, -5, -14, 0, -14, -11, 0, -8, -6, 0, 0, 2, 2, 11, 2, -7, -2, 18, 2, 5, 16, 7, 11, 1, 11, 5, -3, -6, 6, 6, 1, 3, 11, 13, -5, -6, -4, -8, -15, -10, -4, -8, -14, -4, -3, -3, 1, -8, -12, -9, 2, 0, 3, 1, 7, 8, 1, 14, 4, 8, 19, 3, 6, 13, 10, 14, 14, 13, 14, -7, -4, 2, 1, 10, 1, 4, -8, 0, 1, -5, 0, -6, -10, 1, 1, -11, -8, -8, -9, -5, -15, -8, 0, -13, -3, -1, 10, 1, 6, 10, 11, 5, 6, 3, 4, 8, 15, 9, 0, 0, 2, 12, 6, 1, -6, 11, -7, -8, 9, -9, -15, -13, -3, -11, -12, -10, -7, -15, -11, -11, -11, -8, -8, -3, -2, 4, -8, 5, 3, -3, -1, 10, -5, -3, 5, 14, 9, 5, -2, 1, -6, 1, 5, 5, 7, -4, 0, -1, -6, -8, -3, -10, 4, 1, -16, -11, -13, -18, 6, -10, 1, 3, -7, -10, -5, 7, 8, 4, 6, 0, -1, 7, 13, 15, 5, 8, 12, 19, 10, 9, 14, 6, 0, 12, 7, 17, 12, 7, 4, -4, -2, 3, -1, -4, -11, 1, -14, -3, -2, -1, 2, -13, 0, -8, -15, 0, -7, 0, -4, -11, 11, -1, 8, -1, 7, -6, 5, 21, 13, 11, 5, 7, 7, 4, 13, 10, 3, 2, 4, 12, -2, -2, 0, 7, -4, -4, -1, -4, -11, -7, -7, -5, -3, -13, 4, -3, 2, -6, -1, -7, -2, -2, 1, 5, 1, 13, 6, 6, 11, 9, 16, 7, 11, 19, 12, -6, 15, 0, 9, 16, 11, 1, 9, 10, -17, -9, -7, -10, 5, -5, -6, -12, -13, -14, 0, 4, -10, 0, -2, -5, -1, 5, 11, 3, -2, 2, 8, 7, 10, 2, 11, 17, 8, 16, 12, -3, 7, 11, 11, 7, 8, 15, 5, -1, 9, 8, -1, -3, -5, -5, -10, -15, -5, -9, -4, -13, -2, -8, -3, -8, 13, 3, -5, 3, 12, 2, 8, 5, 12, 13, 9, 12, 14, 7, 10, 14, 18, 8, 21, 10, 8, 12, 4, 9, -5, 3, 2, 0, 3, -4, 1, -8, -8, 1, -6, -12, -12, -2, -8, -1, 1, -4, -1, 2, 10, 1, 9, -4, 10, 12, 15, 13, 17, 11, 12, 14, 14, 17, 13, 14, 6]
2640Fl%J0j1Kj0K1j4%koMkqkNJ3qlLmJ1mjOnqJ9j2J2nN%JQplqQkKqJ2Kr%jnlM
2690@oKj%pL%kQolJ1qmJ2JPj0lRLkMqRoQmQoNlj0QJJojJLj1koOjj0KJ3Mj7KRL
2743@mOj0POJrkJ3JjmO%PpkJ0rjLpJ5rokkk%P%j8NKoLJKnOoJ3j1PkONpjjLRNq
2797GjM%jpJOKmpMqMkk%jLknJ0k2J1onJ7j2%J4j0lONQmjJlO%QrPlOoJMj1PoJM
2850Fj9J6kmoLPj0kj0PJ4lnnLPqJ2mML%oKRj8K5p%RomlLNMpJj3QrJ0Nj1J1j1L
2898Dqjj5K0jnmjLJJ0ojNlKKPnl%J1rJ3rRj0JJ3JJj2r%Oj1JQJmj3J0n%Nj3RLp
2947ilKjP%oR%KKPlKkOnJ2rlNjLm%LoK%rKnk%kJkNnqRm%KOOj2J1rJMpRLmLJ2q
3004GRmnKmJNNj4%Rj6RpLj1MOlnKkj2J8lmjnRpmPlJ1L%KJkoJ8qNj3PNnNnKKqN
$$ y = [6, 3, 3, 13, 2, 4, -6, 15, 1, 1, -1, -7, -3, -5, -13, -15, -10, 3, -5, -8, -5, -9, 2, -2, -3, 3, -2, -10, 9, -3, 9, 4, 9, 9, 10, 18, 11, 8, 0, 8, 6, 8, 0, 12, 14, 5, 5, 4, -1, -4, 0, -6, -4, -5, -5, -12, -9, -9, -11, -3, -9, -12, -1, -9, -13, -1, 0, 7, -3, -6, 3, 6, 4, 8, 0, 9, 3, 11, 7, 15, 9, 14, 11, 1, 9, 10, 11, 5, 4, 5, 8, -3, -5, -11, -5, -6, -16, -14, -1, 3, -14, -12, -3, 0, -4, 2, -8, -1, 5, 6, -3, -5, 8, 9, 8, 4, 10, 10, 17, 10, 8, 18, 9, 8, 11, 4, 19, 10, 4, 2, 0, -2, -2, 5, 5, -13, -8, -6, -12, -9, -8, -6, -11, -5, -11, 2, -9, -2, -4, 2, 7, 0, -1, -2, 1, 10, 15, 7, 6, 10, 10, 9, 2, 3, 9, 11, 7, 0, 4, -4, 0, -2, -4, -4, -5, -2, -4, -9, 1, -21, -10, -16, -21, -4, -16, -16, -2, -12, -15, -9, -4, 4, 0, -1, 0, -3, 3, 3, 11, 2, 9, 6, 12, 6, 7, 11, 0, 7, 1, 2, 6, -13, 3, 1, -3, -9, -6, 1, -9, -11, -21, -14, 0, -3, -8, -13, -10, -3, -11, 1, -3, 1, 4, 4, -2, 0, 9, -9, 16, 9, 9, 18, 12, 8, 5, 8, 13, 17, 10, 11, -2, 6, -3, 7, 12, 1, 12, 1, 4, -4, -5, -20, 0, -1, -6, -10, -11, -8, -7, 3, -3, -4, 1, -2, 0, 2, 9, 4, 1, 1, 12, 3, 16, 7, 16, 6, 7, 20, 21, 22, 10, 1, 1, 7, -4, -3, 5, 6, 2, -11, -1, -6, -6, -1, -14, -5, -2, -9, -12, -10, -11, -4, -4, -10, -1, -1, 1, 3, 10, 7, 9, 7, 13, 8, 20, 11, 8, 13, 12, 15, 11, 11, 14, 8, 10, 10, 1, 3, -2, -4, -4, -6, -5, -7, -2, -7, -15, -6, -10, -10, -8, -2, 4, -8, 3, -6, -5, -1, -8, 1, 4, 0, 3, 15, 7, 16, 12, 7, 9, 5, 6, 11, 16, 2, 2, 11, -5, 4, -3, 0, -11, -7, -1, -4, -9, -7, -9, -21, -3, -6, -10, -11, -16, -7, -14, -18, -11, -14, -3, 0, 0, 2, 3, 1, -5, 13, 5, 10, -3, 4, 9, 4, 9, 4, 6, 8, 0, 5]
3057ELj5QpkNKqJLj3QMpNoJ3onORLnLrPNrPQp%kONlkrJ7j2Lo%oJ2j0%onRoJKj0
3111a6J1j6RLnNPRj4RJjo%RjJjnN%OmPj4MJ6lqqJ1lqJrpLLpOLpKqQQkoJ2Qj4P
3163AKmKKoJ7lNjj3kJ3lMJj2J3qnpNJ%%%qK%j0LPojPmmMkNrK1rJ4j0lRJ1j4JN
3213A1JljLoPmnJ0j3MNrNkj6NM%oNqJ3j2rJ6k%kNlK%KJJ1jmMolJ5%MrnOMpoJ5
3264A6j1nOKQj5nJ0j3MNqkJJNOlmKmRj9J6OpJO%jMoMlJ7pj5J2Nj4MpRoj8J2L%
3312Aj5J0j0NNnMpQoJ1j1KKOMlKnQj1J2jRnPKmmllKRj0QkMmmJj2kOlnl%KmNnN
3364gpQJ3lkj5QKMJ%LJ0lNpLmOlj5Q%%koKKoOLj4jNQnjj0J0oPoQJ2j4oPj0J3o
3414eMP%M%NnJpRjj2J4qMKoPmpjkJ0rmOlplKJM%rNK%nOLJ8j8P%LLQj3OlMPrLk
$$ y = [5, 8, -7, 1, -6, -8, -3, -1, -9, -8, -5, -18, -10, -6, -13, -8, -14, -1, -7, -12, -6, 3, 6, 1, 4, -5, 2, 7, -2, 5, 13, 6, 6, 4, 10, 15, 12, 10, 1, 18, 6, 9, 3, 3, -3, 9, -1, -1, -7, -12, -3, -9, -8, -6, -16, -5, -21, -12, -9, -14, -9, -2, 7, -7, 2, 3, 2, -4, -4, 5, 4, 5, 4, -1, 4, 4, 10, 6, 13, -1, 3, 19, 16, 8, 0, 11, 8, 0, 1, -8, -15, -12, -9, -16, -10, -7, -14, -12, -20, -12, -4, -6, -12, 0, 8, -6, 1, 3, -1, 1, 3, -3, 14, 11, 16, 15, 2, 0, 13, 10, 14, 15, 3, 16, 8, 3, -4, 1, 2, 2, 2, 2, -6, -4, -4, -14, -11, -4, -10, -11, -4, -8, -12, -8, -10, -5, -14, 7, -2, 12, 2, -1, 8, 19, 5, 6, 11, 12, 9, 8, 11, 5, 12, 8, 3, 13, 0, 4, 9, 0, 5, 3, -13, -8, -4, -4, -10, -5, -13, 0, -12, -21, -5, -7, -7, -9, -4, -7, -5, -5, -3, -2, 9, 8, 4, 8, 2, -1, 14, 14, 18, 9, 4, 10, 14, 7, 1, 16, 5, 0, 6, 8, 16, 1, -4, 6, -7, -3, 2, -6, -8, -7, -6, -1, 5, 2, -2, 0, -4, 5, -14, 2, 8, 1, 2, 8, 8, 7, 11, 5, 9, 6, 23, 16, 1, 13, 18, 4, 8, 1, 10, 4, -14, -2, 1, 1, -14, -4, -14, -9, -4, -9, -5, -12, -4, -10, 1, -10, -8, -6, 0, 4, 1, 3, -2, 6, -5, 7, 6, 15, 10, 17, 19, 15, 11, 8, 5, 7, 16, 6, 14, 12, 16, 12, 8, 9, -3, -5, 1, -2, -7, -10, -10, -8, -12, -7, -12, -7, -14, -6, 7, 4, 2, -13, -5, -3, 1, 2, 2, 5, 15, 12, 17, 10, 13, 9, 15, 12, -3, 5, 5, 5, 3, -3, -1, 1, -5, 1, 4, -10, -11, -6, 2, -3, -4, -14, -4, -10, -3, -9, -1, 11, -3, -9, -2, -12, 1, -5, -1, 6, 6, 10, 10, 15, 10, 11, 4, 13, 12, 0, 14, 6, 10, 12, 6, 13, 9, 2, 1, -1, 9, 0, -4, 2, -1, -8, -11, -9, -8, -4, -4, -13, -8, -6, -6, -11, -5, -2, 16, -2, 5, 5, 8, 11, 19, 6, 12, 9, 13, 20, 11, 14, 12]
3469A2kmKplQlLkKOj1j9MOMkJnJ1lllJ0oQjJ0jkNj7J2MJoLRomlNoLmJj0%LpJ0
3520Cq%omjRqkJ2j1NlJ1pN%MPpjJ3llQLJnMpLLqkmMJ4j5mJjJ0mjj2J0nJjjj5m
3571b2K3oLKn%RplRMrPPMknJ0k1K2j0Kj0OLl%nnOM%nklMpjj0NPmPpKmJ6ljnMJ
3623BMPrKQjj0J5krPll%Nj4O%%%njOj7lJ4Kj1JJJK%O%l%lOpJ5JrJ2jmnONkkJQ
3676A9j5P%m%KpmKj0J3ojnJkoONmMKj0PJ5j3J0ljRKnJmMJ3k1J5%lkrJ0oJO%pN
3725A1j4Rj0POqr%JnNOj2R%LmOKqPOLmlRJmLJ1oj%rJMQqj0MrLRj4J2j3joLOqO
3777ejj1J2NqnNLNLJ0pnMJ2o%%PqJ0oknlJ8j3koJ1j3Qrj0LJ4qj%nkOJklJ1rLK
3826bj2RJ1j4J3No%PJPpM%jojpOPqkKmKRj4MrKllMPpPrkP%J1jrKJ0qKnJ6j%Nj3
$$ y = [12, 10, 6, 8, 1, -2, 6, 3, 6, 4, 6, 12, 1, -18, -14, -8, -4, -6, -5, -10, 1, -2, -5, -8, 2, -4, 4, 3, 13, 12, 10, 15, -2, 10, 14, 15, 9, 12, 21, 15, 11, 8, 13, 7, 10, 6, 7, -3, -3, 0, -7, 3, -5, -5, -11, -15, -16, -7, -15, -17, -5, -16, -11, -14, -3, -10, -5, -5, -1, 6, -1, -2, 11, 8, 5, 13, 16, 17, 12, 16, 9, 12, 15, 7, 5, 1, 5, 19, 4, 0, 1, 0, 10, 6, 5, -7, 3, -2, -1, -2, -3, -18, -22, 1, -5, -2, 0, -5, -5, 4, -3, -6, 3, 7, -2, 5, 12, 16, 14, 9, 19, -2, 20, 10, 12, 2, 8, 11, 8, 8, 3, -2, 4, 8, 8, 3, 1, -2, 2, -5, -6, -16, -11, -4, -8, -1, -8, -6, -10, 6, 3, 2, -3, 1, 2, 6, 13, 4, 6, 14, 13, 3, 18, 16, 7, 14, 11, 8, 8, 13, -1, 5, 5, 5, 5, 0, -1, 5, -12, -15, -1, 1, -10, -9, -8, -7, -5, -5, 1, 1, -2, -2, -5, 1, -6, 9, 10, 1, 13, 12, 8, 3, 9, 14, 12, 10, 11, 19, 4, 11, 11, 7, 7, 9, 2, -2, 0, -10, 3, -3, -4, -9, -8, -10, -16, -10, -5, -9, -5, -3, -13, -6, 9, -4, 6, 3, 2, 11, 13, 8, 9, 5, 9, 22, 1, 16, 16, 13, 11, 2, 12, 6, 7, 13, 13, 6, 11, -3, 6, -4, 3, 9, 1, -8, -8, -7, -12, -7, -1, -13, -4, -4, -1, -5, 1, 3, -5, 2, 8, 11, 7, 4, 13, 14, 10, 13, 24, 18, 17, 17, 8, 9, 13, 21, 13, 3, 7, -2, 1, 10, -4, 8, -5, -6, -12, -9, -3, -11, -5, -6, -17, -5, 0, -8, -13, -8, -5, 0, 3, 13, 6, 1, 5, 17, 11, 11, 11, 18, 10, 20, 14, 12, 7, 4, 22, 9, 7, 1, 12, -1, 7, -2, -12, -9, 5, -3, -4, -4, -9, -11, -5, -4, -6, -9, 2, -7, -4, -2, -14, -5, 6, -8, 5, 10, 4, 4, 11, 12, 19, 12, 16, 16, 15, 9, 8, 1, 7, 14, 6, 4, 6, 2, 4, 13, -1, 3, -6, -4, -7, -10, -6, 1, -6, 1, -8, -10, -3, -3, 8, 7, -2, 0, 10, 2, 4, -1, 15, 14, 14, 19, 6]
3879FML%Mj4J2Jj1PjpJlNojj0KMmnqJ4pJJJ1kPlkkM%O%KjQ%qK%J5mj2P%qoLLJ
3932IlkNj0oJJ0j4MKj0J7kkmOpQnRL%Jj5K3lLj8J1%Mj1J7j1OjrKNj1LOor%JJp
3980iJMLkKlkpLJkJ0qNRMn%KKNj1NNj0OPoKLj4NKjoJOj2KoJ0pLj0PNop%kJ0JQ
4033CKLljQn%Mj0MJoJ3Qpj0J3jrmlRmqRlj5J6pjjQrj7J5oKQlJ1j3QJ1qJ2oqPr
4082bJ6k0K0%pQQoj4QlqJ6j0OqKklOk0PmLJ0rlLqJ4j2J2kpLJ2jQj1OLqOrLJJ4
4129A8mNj8J5j0J%oNpQolj2L0k2jj5J4OqPj5QLJPj1J4mjPj0J3pJ6j4lJ4rPQj7
4172DRLmj6J4qJ3j8Okj2J4j3QpnKkOqJ6rPJpNjKKkMJ7j6jLMJkP%Mo%lOKqjLjj1
4223@KKmmRj3KmMjJOpkm%J4lJLKM%nNKNlk%qP%J0qmOj2J2qmKj3J5j2PmnlKMj1
$$ y = [6, 10, 13, 13, 17, 3, 15, 16, 5, 12, 11, 4, 5, 2, 7, 1, 0, -10, -8, -4, -8, -13, -21, -7, -14, -13, -12, -1, -3, 4, 1, -1, -3, 1, 1, 7, 7, 9, 8, 16, 16, 8, 10, 10, 25, 21, 9, 16, 16, 8, 2, 5, 8, 9, 6, 4, 9, -1, -7, -6, 4, -10, -6, -4, -14, 3, 1, -1, -5, 1, -6, 2, -3, 6, 9, 9, 10, -5, 18, 15, 18, 0, 11, 11, 15, 4, 21, 10, 16, 15, 6, 8, 13, 2, 5, 11, 5, -4, -4, -3, -2, -9, -8, -4, -1, -3, -1, -4, -6, -13, -10, -9, -11, -1, -9, -4, 5, 9, 4, 4, 6, 8, 13, 2, 7, 12, 2, 8, 15, 9, 11, 14, 0, 5, 7, 6, 0, 1, 7, -5, -3, -9, 1, -6, -3, -13, -6, -1, -7, -14, -14, -16, -6, -5, 3, 5, 8, 5, 4, 12, 7, 7, 11, 1, 5, 6, 0, 13, 21, 14, 4, 17, 16, 7, 3, 0, 9, 5, -3, 6, 3, -12, 4, -3, -4, -5, 3, -6, -23, -8, -14, -12, -4, -7, 4, -9, -1, 10, 2, 14, 8, 0, 7, -2, 14, -6, 14, 14, 7, 15, 23, 17, 3, 11, 8, 0, 16, 6, 12, 4, 6, 4, 1, 7, -13, -6, -10, -7, 3, -6, -9, -6, -14, 0, -12, 0, -2, -9, -6, 6, 5, 13, 2, 8, 11, 3, 9, 0, 3, 4, 18, 14, 19, 1, 16, 6, 7, 7, 1, 6, -1, 7, 1, -2, -14, 16, -6, -7, -22, -8, -2, -10, -3, -18, -10, -7, -6, 1, -10, 4, 0, -1, 6, -4, 9, 2, 18, 4, 1, 15, 6, 13, 21, 4, 13, 16, 12, -4, 10, 2, 15, -3, 3, 1, -11, 3, -10, -2, -9, -14, -12, -14, -8, -16, 0, -9, -2, -1, -8, -3, -4, -2, 0, -2, 2, 19, 3, 2, 5, 9, 10, 8, 15, 15, 19, 13, 13, 10, 16, 18, 10, 9, 12, 11, 0, 2, 4, 0, -4, 5, -8, -6, -10, -6, -7, -6, 0, -7, -9, -13, -13, 1, -2, -1, 2, 4, 8, 8, 3, 8, 10, 15, 12, 10, 10, 2, 9, 9, 19, 11, 7, 13, 1, 13, 5, 1, 3, -10, 5, -7, 0, -4, -9, -12, -10, -6, -17]
4275a7%NlLj0J4JNoJ2kJ6k1J0kj1J8j2J3j2J5mmjm%q%MmJRj0LrmOQoRj3NoOn%
4321a1QJj3RRjnLKjLJ3lkooJ3ljJkqNOrKkqKpLNrRJoQj1nQOj8J3jKJ0j0J3j2Q
4371CJ2qKoJ0JpklkMlNkJ2j2MoLlqRpJomLMrnJ1jJ%JJ2pjQJLnNMj0KJ1KkkJLn
4424A2jM%%mmJj2RoPnql%P%qjQnlOPj3J1J%LLj2RJ4qjoRjjmoJ4j5jQJnkJ5qj2
4475fLkJqPOj3kMLjoQJQmjJJL%LlRM%mJknjRmojNJj0j7J0J6rm%LmlmPmkKpK%R
4531fMMLj2KNNJ1pq%KJ1kqK%KJQoj2MpLOk%plN%o%ojJ3qkROrQj0kQMNJ%QpKJ0
4585B1j1Pj0k%J2j7J5or%Npj4NJPnpJ2Lj1QKqQlqOnQJ0JlpQmKL%lKkQMLj0kln
4635aK1k4LNmKqoJ1kllkOj9J6KjMMpmNjJ0PLj5J5oJ2omJOj2PmKMnJ0j5N%noKj
$$ y = [-17, -17, -12, -15, -12, -22, -8, -7, -2, -8, 4, 2, 18, -3, 7, 5, -6, 12, 0, 13, 1, 16, 12, 8, 7, 3, 3, -5, -5, -1, -5, -4, 5, -5, -2, -11, -15, -9, -1, -7, 2, -11, -6, -12, -6, -11, -11, -3, -2, -15, -6, 3, 2, -3, 0, 2, 1, 4, 17, 14, 12, 6, 0, 13, 10, 9, 10, 8, 0, 5, 11, 2, 4, 2, -6, -4, -11, -8, -3, -12, -3, -2, -8, 0, -11, -16, -8, -2, -20, -7, -8, -6, 4, -6, 7, -5, 3, 15, 7, 9, 3, 13, 14, 7, 5, 2, 0, 4, 1, 6, 4, 16, 4, 8, 2, 5, 2, -6, 3, -4, -3, -9, -13, -10, -6, -15, -20, -9, -10, -9, -9, -8, 4, -3, -4, 4, 5, 8, 3, 8, 12, 2, 4, 15, 17, 15, 13, 14, 17, 12, 11, 15, 15, 15, 11, 7, 8, -4, 5, -1, 6, 1, -7, -10, -10, -3, -3, -11, -12, -4, -9, -12, -6, 1, -12, -1, 0, 0, 3, 6, -6, 3, 17, 9, 8, 2, 11, 10, 9, 5, -1, 13, -2, -3, 5, 6, 1, -1, 14, 6, -6, -3, -5, -4, -12, -5, 1, -12, -14, -10, -7, -8, -14, -6, -5, 3, -1, -2, -1, 0, 3, 3, 6, 3, 12, 16, 16, 12, 13, 11, 6, 5, 14, 10, 4, 3, 8, 9, -1, -18, -8, 8, -1, -5, -5, -2, -6, -9, -13, -6, -10, -12, -10, -17, -15, -15, -6, -2, 2, 5, -7, -5, 0, 5, 16, 9, 1, 1, 3, 14, 12, 4, 6, 6, 8, 9, 17, 11, -1, 3, -4, -1, 5, 3, 3, -4, -7, -2, -2, -8, -8, -14, -15, -2, -10, -12, -3, 3, -6, 2, -8, -10, -2, 2, 7, 8, 8, 16, 9, 11, 21, 10, 17, 7, 5, 5, 17, 0, 15, 9, 0, 0, 5, -2, -16, -11, -10, -3, -8, -15, -3, 0, -11, -3, -1, -9, -1, -4, -12, -6, -11, -3, 7, 8, 5, -2, 6, 2, 4, 7, 7, 4, 6, 4, 12, 16, 19, 9, 7, 4, -1, 20, -4, -1, 4, 0, 2, -6, -12, -1, -3, -6, -9, -11, -5, -24, -8, -6, -7, -3, 1, -6, -10, -5, -6, 4, 11, 14, -1, 14, 8, 20, 14, 10, 11, 17, 5, 12, 8, 10, 14, 9, 19, 4, 9, 9, 4, -2, 0, -1]
4684ajlMj1RmrRlMoJ3Jj1LJLMjJ2rNPkpQ%kmKk%jj2RkPpnNMj3kPj2NLpN%Lj1J0
4737eJkNj6J2PJklJ0j0QQlMKkqmRolkLLj1%JJ0j2pPooNkMjJ2rLjPj0jK0qkJlR
4788GoQoPJjkJ8j2j1QMnlJpqJ6j4LnlPlnKpKkQOj0OLLjKKqnJ6knQKrMLJjOn%j3
4842eNMpJ2j0Oj0Pjj1%MlMj3J3rPqJ1J2k3J3nKlJ9qJPk%pMOjN%poJ5j5j1J2Pj2
4888a%pjOLj9J3Kj2QrJJ2qJJOmNQoOmO%knjOJ1rNLmnrMLLpKoKLllojl%JOJj0J1
4943fjLq%LNM%NmMMpNJOOj3jkMNokplnJ8llj6R%Lmj1NlOnPmj%LMPl%J2j5N%Pm
4998DLKj3J3%nPJj1KRj4JLmj8J5pmJ3j3J1j0Lj%oJ5npJ8lNj6J1lJ0%MJrnJ5kn
5043EJLjoJ2mNr%kMqkpRMrK%onKLkMoJ5j3OLmMJ3j5J0MjKo%KqJ6%j3%Rplj0RJ1
$$ y = [-1, -2, -5, -1, -12, -3, -7, -16, -7, -10, -6, -12, 1, 2, -9, -6, -5, -2, 2, 1, 13, 4, 9, 16, 14, 7, 15, 15, 13, 9, 11, 9, 9, 8, -4, 5, 3, 10, 3, -2, 3, 7, -6, -8, -1, -13, -8, -5, -12, -7, -7, -4, -15, -5, -4, -6, -1, -17, -5, 2, 3, 1, -2, 8, -2, 6, 14, 11, 15, 17, 15, 7, 3, 12, 6, 3, 1, 4, 7, -4, -4, -3, 7, -5, -12, -5, -11, -17, -12, -14, -10, -11, 1, -8, -5, -6, 1, -9, -10, 10, 2, 0, 1, -2, 7, 1, 9, 3, 10, 11, 10, 8, 26, 14, 3, 11, 15, 10, 7, 8, 1, -7, 9, -5, -2, -7, -10, -3, -6, -11, -9, -16, -14, -16, -8, -2, -12, -6, -3, 0, -1, 1, 3, -5, -10, 6, 4, -1, 7, 9, 0, 4, 7, 8, 7, 13, 8, 8, -5, 0, 4, -3, 9, -1, 5, -5, 2, 1, -10, -10, -6, -9, -5, -18, -5, -14, -7, -15, -4, 8, -15, -2, -7, -5, -8, 11, 3, 4, 11, 9, 9, 2, 6, 12, 11, 16, 16, 9, 3, 18, 3, -8, 4, 11, -1, -1, -8, -9, -3, 0, -19, -6, -4, -16, -8, -17, -16, -4, -12, -11, -10, -4, -8, -3, 5, -1, 5, 1, 7, 7, 5, 0, -1, 5, 16, 7, 12, 15, 11, 6, -3, 1, 4, 7, 0, 2, -4, -2, 1, -2, -5, -11, -12, -15, -15, -14, -8, -7, -17, -6, -7, -4, -12, -12, -9, -4, 0, 0, 5, 1, 5, 9, 2, 7, 8, 14, 20, 7, 6, 4, 8, 13, 7, 5, -2, -5, -10, 8, 5, 2, -14, -5, -5, -2, -6, -17, -12, -15, -9, -14, -7, -11, -12, -12, -9, -5, 2, -1, -1, 11, -4, 1, 1, 8, 4, 7, 9, -4, 9, 9, 4, 11, 12, 1, 3, 12, -2, -1, 2, -2, -20, -5, -12, -16, -3, -16, -5, -15, -12, -13, -13, -19, -4, -9, -16, 2, -1, 4, -12, -1, -4, 6, 6, 10, 11, 2, -3, 12, 10, 5, 6, 9, 8, 2, 14, 10, 15, 6, 6, 4, 8, 0, -2, -9, 0, 4, -5, -3, -3, -9, -14, -12, -9, -11, -7, -13, 2, -11, -5, -2, -6, -2, 11, -4, 6, 10, 9, 11, 5, 5, 7, -1, 15, 15, 2, 2, 11, 4, 1, -9, 0, 11]
5095A1loqj%qMN%omJ1j0M%MMOKMj4qOK2nPqnJ0oJ0nmmOkJj2RjmorJ0JkJ0j9kk
5145a7J5jlPj4RJonJ2Qq%OLnNjmJ1KJ%Nj0jj1OmLKoPnpKQj4lMjjJLokMOLkmNJ3
5198A1lj5NJ5krPlJLj1J2jkjMjLj2mOkOj3NlNrjJ1j1Mj1KKOmNljNpJ3jNMj0lJ4
5247A1kl%jKOkjnKr%J3k0Q%j5J3okOlkjOmKoMLMoLLmQKJ5j1Lo%ONlrJ3joMnQq
5300ILqJ0j1Llq%jP%nLPrkKj0J2Oj1OpJ2KnMJJ0j2RJNp%qkJ1j1J1k%pnjLj5RM
5349@kkj%pNpQoPn%OmRqJ2Oj3PjqJ6j0N%J0qjLmnNmj6J4mJ0mkkljOnj1%pJ4Jk
5400iLMmjJ2j1MJJ1mJN%lJm%lJ2nlQKplmj0LLOm%j1KJnMMml%lQJ0j0J2mJQrnM
5452AJ1%JNkpJmOoNOj4nQNmj0kQnKJmpPoJnK1j5NLpQPNrKoMkQqOlMjOpJ4j1oj
$$ y = [11, 8, 2, -6, -7, -7, -15, -11, -6, -6, -12, -16, -5, -15, -11, -11, -7, -3, 3, 5, 9, -5, -13, -7, 15, 10, 17, 9, 4, 14, 8, 18, 13, 9, 5, 11, 9, 10, -2, 7, 6, 2, -4, -13, -3, -2, -4, 6, -13, -15, -17, -2, -3, -6, 1, -13, -4, -3, -9, -14, -2, 6, -2, -2, 4, 7, 2, 7, 6, 2, 13, 15, 16, 16, 21, 11, 10, -1, 5, 1, 4, 6, 0, 7, 2, -5, -3, 5, -9, -12, -8, -9, -10, -9, -6, -12, -14, -10, -4, -1, -3, -7, -2, 11, 8, -7, -2, 13, 11, 2, 9, 6, 7, 10, -1, 11, 10, 8, 7, 11, 10, 13, 1, -3, 3, 1, 7, -6, -1, -4, 1, -8, -9, 2, -9, -5, -16, -14, -12, -6, -10, -5, -8, -9, -4, -11, 2, 1, 6, 10, 0, -3, 11, 9, 6, 6, 5, 7, 13, 11, 10, 5, 7, -2, -2, 11, -9, -1, -1, -16, -3, -9, -11, -5, -8, -10, -11, -5, -9, -7, -13, -9, -6, -2, -8, -5, -2, -6, 2, 4, 19, 8, 11, 5, 5, 11, 16, 13, 4, 17, 16, 10, 14, 9, 17, 9, 12, 4, 14, 3, 6, 3, -5, -5, -6, 1, 1, -4, -1, 6, -3, -5, -3, -13, -1, 5, -6, 0, -7, 5, 7, 2, 6, 7, 17, 5, 14, 15, 20, 13, 13, 5, 3, 14, 3, 14, 12, 12, 5, 0, -1, 2, -13, -4, 0, -2, -4, -5, -5, -12, -7, -14, -6, -12, -5, -10, -10, -4, -8, 1, -7, 5, 11, -2, 5, 4, -4, 12, 2, 7, 7, 17, 9, 8, 11, 7, 2, 7, 3, -13, 1, -3, 7, 3, 1, -1, -4, -5, 1, -4, -15, -15, -22, -8, -7, -9, -6, -2, -6, -7, 5, -6, -2, -1, 10, 6, 7, 12, 12, 9, 10, 6, 6, 3, 15, 10, 7, 15, 17, 10, 7, 3, -7, -4, -1, 5, 1, 1, -10, -8, -7, -12, -8, -4, -8, -11, -11, -14, -6, 4, -6, 6, 2, 3, 11, 2, -3, 1, 12, 12, 13, 18, 16, 9, 10, 6, 12, 6, 11, 17, 3, -2, 6, 11, 7, -3, -5, 3, -2, 0, 1, -3, -10, -3, -9, -8, -13, 8, -7, -2, 1, -6, 2, 9, 14, 5, 7, 1, 5, 3, 11, 3, 9, 6, 10, 9, 15, 8, 22, 11, 5, 4]
5506DlkQj3J9j3Mmjj4MPrOnJ1JJmoJ1%jOj0QkmMJMmJ0npQnOj0NkRj4kmK%J3rp
5556hQrJmOMrlKNMjJ2j2NLMlJ2%j0OnLkKMoQpjNlrJ2j2LmmMjKj6K4k2J1nkoOk
5607a0RpmNoJ5JL%LLlRopJ1mL%%mNjOqMqjoKPpjMj3PlkkJ2j3MQj1QmoJJ0MlJ2
5659A6loJMPp%NkqMJjlPrjQk2K%RorMpKJ0mKLKlkOklJ2jjK%MoJ0qOoMJMJj0J0
5713A7j3KJjQlqJj0j%jpQknmJ9pJ0j0mRn%PlJ4j1J8j4P%%J2j3OmrMlmOj1oJ8p
5760AjpKLmNrPjjKmJJqLQ%NKnJQKrLKQMmoKqOjJ%omm%OOnOj7lO%jkn%MjOj%Pk
5820aLj0J1kPkJ8oj0J4mlmKj3ROQj2noLpnQnLJlmjKoQokPMMjlMkJQklLoMLj%M
5874A0LoJj1J0lj1NRj0lJ2j4OoMJnk%NqPQj7RJk%RmJ1oO%OmPj1MOmJj0J0%qJk
$$ y = [4, 1, -1, 7, -6, 13, 0, 4, 0, -1, -15, -11, -4, -13, -7, -12, -1, 0, 1, -3, -9, 2, 2, 1, 7, -3, 5, 3, -1, 3, 4, 8, 4, 14, 9, 2, 10, 5, 11, 1, 6, 4, 13, -1, -3, -7, -5, -5, 8, -1, -8, 0, -9, -8, -12, -6, -2, -11, -14, -12, -7, -3, -4, 8, -4, 1, 4, 8, 5, 17, 17, 7, 13, 8, 11, 9, 11, 15, 9, 17, 10, 9, 14, 11, 2, 14, 2, 5, 1, -3, 1, 0, 2, -14, 10, -12, -1, -6, -8, -14, -8, -10, -1, -8, -12, -7, -13, 2, 3, 6, 6, 9, 12, 9, 18, 12, 5, 16, 12, 15, 15, 15, 11, 16, 15, 21, 13, 17, 9, 8, 2, 4, 11, 4, 3, 7, -6, 1, -2, -4, -6, 6, -7, -3, 5, -6, 2, -2, -8, -7, 3, 7, 4, 16, 13, 7, 8, 12, 19, 12, 12, 17, 15, 7, 11, 12, 11, 8, 15, 6, 5, 13, -9, -7, -7, 2, -4, -13, -9, -16, -14, -4, -8, -6, -3, -1, -4, -6, 0, -2, -5, 7, 6, 5, 7, 7, 11, 5, 15, 7, 13, 7, 11, 12, 16, 17, 7, 17, 4, 6, 7, 6, 14, 11, 3, 4, -6, -7, -7, -8, -15, -7, -9, -14, -18, 1, -6, 4, -6, -10, -1, -6, -6, 1, -2, 12, 1, 19, 5, 12, 12, 12, 24, 11, 17, 13, 4, 8, 5, 1, 7, -4, -10, 8, 1, 0, -7, -5, -2, -6, -1, -10, -3, -4, -5, -3, -7, -6, -5, -13, -10, -2, -2, 3, 5, 0, 1, 9, 11, 2, 5, 7, 15, 19, 15, 9, 11, 3, 9, 8, 9, 9, 3, -1, -5, -5, 1, 7, 2, 8, -9, -12, -6, -6, -7, -9, -14, -14, -10, -11, -5, -6, -6, 1, -1, 2, -8, 3, 1, 8, 6, 24, 18, 8, 22, 18, 15, 11, 13, 0, 9, 15, 23, 11, 6, 0, 3, -4, -9, -1, -6, -3, -2, -5, -9, -10, -8, -14, -6, -12, -14, -7, -3, 1, 0, -3, 1, -1, 0, 8, 6, 3, 6, 0, 4, 7, 6, 6, 10, 13, 7, 8, -3, 7, 4, -7, -2, 7, -3, -6, 6, -8, -2, -8, -4, -3, -8, -10, -10, -5, -13, -6, 2, -15, -6, -5, -7, -7, 2, -2, 9, 3, 9, 9, 15, 11, 18, 7, 11, 17, 13, 14, 4, 14, 14, 6, 7, 5]
5923EjJnmMnpPoRj1PQnjqORpMj%mJ0KJmP%Qj4MJjNj7J9rllOKj0LjmpKoRlj1PJ
5977a1Kjl%MMOqMkoJ8JlJMlQrpJ0pLlL%rPkkJ5qokj0N%MloJ2nJLo%lJ1qJ3oO%
6030FmmNJ2JjmLjNLjkqoKJpjPq%J%rRkJkkrJ0kPqN%%KLmM%jPMj5J0KOjNmlNnp
6087EoQ%Kj0o%JkMJrPokKMOj0OQNj4MmJ6mKnLMMnJ1r%Qj1PljJoKj2LLj1lP%kJ2
6140EokqLOrJ6j1K%kJ7onOoQNqLOLj0%jJJ2j4J8j0qNLj5oJMmoNJ1j7L%MrJ0qJ4
6189@qmRkJ0qLnK1j1nKNKJ1oj1jNRlnKj3JpJ3Kjj0MkPk5J3PPk2J0lO%mkRMNj0
6237aJJ0lJ0j0JJ2nljjjN%mQj4plPNmmMj2Pj2J4j1JQrQLn%MJoJ1lOJqONoQj3J5
6287A5%nQj6QnNojpJ1%rkmMqOKj2J1nlmN%MJ0Lj2JlJ0J3j0J0%%nJ1oj7J0J1pm
$$ y = [5, 4, 5, 0, -4, 0, -5, -12, -5, -11, -2, -13, -6, 2, -3, -4, -12, -6, 3, -4, 0, -1, -1, -5, 5, 7, 8, 4, 11, 11, 19, 5, 9, 10, 9, 14, -3, 16, 7, 4, 1, 7, 9, -1, 2, 1, -3, -10, -8, -14, -5, -8, -19, -12, -11, -9, -10, -13, -13, -9, -5, 1, -7, -3, -5, -11, 7, 8, 5, 6, 10, 7, 15, 6, -1, 9, 2, 5, 2, 5, 5, -4, 3, 1, -1, 14, 6, 0, -2, -12, -7, -7, -3, -6, -12, 0, -5, -4, -1, -7, -7, -10, 1, -7, 6, 0, 6, 6, 2, -2, 3, 15, 16, 15, 11, 14, 13, 18, 21, 20, 18, 10, 4, 6, 7, 0, -1, 6, -2, -2, -1, -1, -10, -1, -3, -2, -4, -6, -15, -5, -7, 0, -8, -3, -3, -3, -1, 2, -2, 2, 2, 1, 8, 12, -3, 7, 9, 15, 14, 19, 15, 12, 17, 12, 5, -1, 7, 7, 9, -1, -7, -7, -6, -8, -4, -3, -12, -5, -11, -13, -11, -7, -1, -11, -5, 3, 8, -6, -2, -6, 10, 6, 8, 3, 6, 10, 14, 9, 20, 11, 11, 19, 8, 15, 12, 11, 12, 6, 8, -4, -1, 2, -9, -12, -5, -5, -7, 5, -1, -3, -11, -8, -2, -11, 5, -6, -4, -4, -6, 11, 5, 0, 6, 0, 8, 13, 5, 8, 14, 17, 7, 7, 6, 7, 19, 5, 23, 13, 5, 10, 13, -2, -8, -7, -3, -7, -13, -8, 3, -14, -11, -11, -7, -16, -6, -14, 0, -8, -12, -3, -5, 5, -3, 0, -5, 16, 5, 0, 2, 7, 9, 20, 14, 3, 2, 7, 16, 13, 8, 10, -3, -2, -9, 4, 6, 5, -5, -1, -3, 4, -21, -8, -1, 6, -16, -6, -9, -3, -3, -7, -9, 0, 4, 9, -1, 0, 10, 7, 17, 7, 8, 20, 15, 12, 11, 10, 9, 14, 14, 10, 18, 4, -3, -6, 1, 6, 2, -2, 2, -10, -3, -15, -1, -12, -11, -3, -12, -4, -1, -6, -6, -2, -1, -7, 4, 1, 7, 8, 0, 6, 11, 5, 13, 0, 15, 15, 10, 18, 2, 10, 5, 10, 4, 3, -4, 7, 7, -2, -4, -8, -4, -12, -6, -4, -16, -5, -10, -13, -17, -12, -12, -8, 2, 5, -7, -6, -9, 1, 14, 4, 14, 14, 14, 9, 20, 14, -3, 7, 18, 11, 7]
6333GoRqPj1Oj%rMqkL%oMKLjj3RN%QJKoLMkoJ0%jkOm%Pj0O%p%KJ0j3mOpOlj1N
6387fqLLjkjpOJ1jmNQpoRPjpPMjJ6k7KRN%KpnLOj3Oj0PpLkj1NKRj9NN%mQkmJ0
6440CokOlJ5j1LjJ3pnJ3j4LRnjmPMpnJ2k3J2nnPrKpOmNrNjqoMJ0MjMOLjkLkjj
6492CQoJ0pJRoj2NjkJlJ2rpn%NKpJ2qljkJ3%pMj1mK2j3J5oOLlJqRnkJ1rlJ9j7
6541DOmoPrRj2JNkkmJrJ0Poo%mMNj2KQ%P%J2kj0kJ0J2j0j0QlkL%lKqkJ7j3JJq
6591gqRj3J2nrOLj3J1LNmMmMnJJ0KnJ3JoRkJoKknQ%pJ0rLpPLoj5J7qjlj%NpkJ
6643a0KJlkRKoQMjJ3pqJ1jpQMmj0JJ3j4rNJ0q%oLLnJj3J1Lj4k%NrK1pmJ0oj%M
6692eJRrKLkJJ4j2RNkLkmkl%j1OJ%Nj3%NlmMlLlpjL%KLKjQpNlQ%kJ3LokLrmJ0
$$ y = [7, 1, 10, 2, 9, -2, 4, 3, 3, -6, -2, -10, -12, -9, -9, -15, -11, -9, -6, -7, -20, -11, -6, -6, 2, 3, 5, -1, 2, 6, 4, -2, 8, 8, 7, 5, 11, 7, 7, 14, 4, 10, 10, 3, 3, 5, 15, 2, -2, 4, -3, 3, 0, -11, -6, -14, -11, -8, -9, -11, -12, -19, -13, -2, -3, -7, -2, 6, -1, -7, 2, 9, 8, 1, 8, 12, 11, 27, 0, 2, 11, 16, 16, 18, 11, 6, 9, 15, 2, 8, -2, 5, -2, 1, -1, -12, -7, -5, 4, -15, -10, -5, -5, -9, -1, -3, -7, 3, -3, -5, 1, -2, 13, 2, 5, 4, 17, 10, 5, 18, 4, 7, 16, 11, 10, 6, 13, 17, 10, 5, 17, -6, 6, 1, -4, 3, -6, -4, -11, -5, -9, -4, -13, -8, -9, -17, -23, -19, -9, -5, -6, -2, 4, 7, 6, 4, 7, 5, 4, 3, 11, 5, 15, 8, 9, 18, 12, 0, 5, 4, 2, 3, 0, 12, 3, -4, -9, -9, -4, -2, -9, 3, -5, -8, -9, -11, 2, 2, -5, -1, -12, -16, 6, -7, 8, 2, 8, 11, 8, 9, 1, 10, 5, 3, 14, 5, 2, 21, 4, 10, 6, 0, 7, -2, 7, -5, -4, 1, -1, -3, -7, -6, -15, -5, 2, -4, -10, -10, -14, -10, -5, -17, -15, -7, -7, 0, 0, 12, 10, 0, -2, 8, 20, 10, 0, 8, 5, 3, 6, 6, 3, 5, -3, -5, 12, -1, 0, 1, -7, -15, -6, -19, -7, -12, -21, -15, -12, -25, -14, -11, -6, -10, -6, -10, -6, -11, -10, 0, 2, -3, 10, 11, 5, 14, 12, 13, 7, 9, 7, 2, 10, 10, 3, 13, 4, 7, 0, 7, 10, 4, -11, 6, -2, -3, -6, -7, -7, -2, -9, -11, -10, -8, -7, -10, -12, -3, -1, -7, 1, 5, 4, 17, 10, 2, 13, 12, 5, 13, 17, 13, 3, 4, 17, 3, -6, -1, 9, 1, 1, -5, -2, 1, -4, -3, -16, -5, -2, -16, -18, -18, -13, -22, -1, -8, -12, -2, -8, -9, -9, -5, -4, 5, -4, -2, 1, -1, 0, 14, 2, 11, 16, 14, 17, 15, 11, 9, 6, 6, -5, 1, 2, 2, 7, -6, -6, -1, -4, -8, -4, -7, -4, -7, -14, -15, -12, -12, -10, -7, -5, -6, 2, -5, 0, -3, 5, 5, 3, 16, 19, 13, 11, 14, 5, 1, 11]
6747A1l%jj0KJ0j2jLKJj6KK%%mKmjQj0QojLJ2kRj1KPlKLjMmNJOpNlqjjMkNpj2
6799a2Qj3MJ5j7RlkqQkkQLOnJkKJ0jj9J5%J5nmj4J8rkQMnoRjnmkj6J6j8PPmmk
6847a4NlPOpJpRlJmJ5Lo%NnkPjlmJ8plj1MK%J3j7qNN%mjmkjOrPjlNj0MQjlJ1m
6900aPJJmRQqKkNOj1JkL%Kj2LlpJkkoJ6j2NKq%nK%kNlMqJ1lLRJ0pkqJ7oPplNK
6954A3lOpMj2MMj4MKMj0%LlrRrNJPlo%PmLJ3rjQLNlJqMNLjj1jJ3lqmLOrOrRqm
7008dKmj0OmmKM%OkQJ1j3LoPKOo%LLKmoRlQkRk0OjjlKmkmkRj2JklRJkjKmQjKj6
7064a5J8PoJ0pJ4mlnj%QrKkMmKlrJ0j2Rj2OJKj4JMpPkLj0J0kJ0moJ3j1J2qJ0j
7110FnN%mJJ3k1NPkmJ1lollJ4j7LJQrJ2k1LLj1POkkLLrjJ9pmOJoMMrLJ5kllJ2
$$ y = [11, 8, 8, 7, -3, -1, 9, -3, -4, -1, 1, 2, -14, -12, -10, -10, -10, -14, -12, -16, -17, -9, -19, -11, -17, -18, -15, -3, -5, 4, -7, -5, 2, -1, 1, 4, 3, 7, 3, 8, 9, 15, 8, 13, 10, 2, 1, 0, 4, 2, 7, 0, -12, -4, -17, -13, 2, -15, -6, -9, -11, -19, -11, -13, -15, -7, -4, 2, -3, -2, -4, -2, 8, 7, -12, 3, 3, 18, 13, 9, -5, 13, 4, 2, 10, 14, 9, 3, 12, 11, 6, 2, 0, -16, 0, -18, -11, -4, -8, -12, -14, -9, -12, -5, 1, -6, -5, -12, -3, -6, -5, -9, 6, 9, 3, 3, 8, 3, 1, 8, 7, 4, 0, 18, 11, 8, -3, 1, 3, 3, 16, -1, -9, -4, 1, 1, -3, -4, -8, -10, -11, -5, -14, -7, -8, -11, -6, -16, -12, -4, -5, -8, 3, -1, 6, 7, 8, 4, 13, 21, 13, 15, 13, 18, 24, 13, 14, 12, 15, 15, 17, 5, 8, 5, -2, -1, -3, -5, -11, 5, -7, -2, 0, -8, -8, -13, -11, -11, -13, -8, -11, -7, -15, -4, -7, -4, 5, 15, 8, 6, -2, 15, 9, 16, 9, 6, 11, 13, 10, 16, 9, 13, 1, 5, 9, -5, -1, 1, 5, -5, -5, -2, -5, -14, -5, -14, -9, -8, -1, -4, -10, -10, -3, -7, -4, 9, 0, -1, 7, 10, 15, 12, 13, 5, 9, 14, 17, 16, 5, 4, 17, 14, 6, 2, 5, 11, 2, 8, -1, 8, 0, -4, -2, -6, -16, -10, -14, -18, -16, -12, -12, -6, -8, 0, 11, -2, 1, -5, 2, 4, 10, 4, 4, 7, 10, 12, 8, 2, 11, 8, 16, 14, 23, 3, 9, 8, 7, 4, 6, 2, 0, -4, -6, 3, -9, -8, -10, -13, -4, -3, -5, -6, -4, -8, 0, -1, 1, -15, 3, 10, 4, 14, 7, 21, 17, 14, 9, 8, 8, 16, 7, 9, 7, 11, 7, 9, 6, -3, 7, -5, 4, -8, -2, -1, 1, -13, -12, -8, -15, -8, -10, -7, -17, -7, -9, 1, -3, -9, 4, -7, 5, -3, 7, 6, 1, 6, 6, 2, 3, 16, -5, 0, 7, 5, 1, 12, 9, 3, 0, -3, 11, -6, -3, -2, 6, -3, 9, -12, -9, -6, -17, -10, -4, -6, -8, -5, -2, -11, -12, 7, 0, -4, 2, 3, -3, 1, 5, -4, -1, 14, 12, 9, 6, 18]
7160A8rmJ2pljNj1jJnPj0kLPjnmLnjlLKLOjMJlJ4nOnlJM%Oj6J1oKRrMmj4J0Rk3
7212a0J6j2qONkjrJ3qjMnMNnpJ2kO%%JNkOnLQrnJ1j%lQpjj0Rk2J8rKMj4J0rJ%
7262a0PmoOLKjqJ0jlQoMPpNKJJ1Ln%j0LQj4Qj0nRj4jKJ2j3QrMolOrQJOJqR%JM
7314Fj2MK0lnOkJmnPj%JoKLonmNjJJqk%J4nmnjjPKJj5NJ%jJ1mOJQrlQJJ2j6Oo
7368FkPnNmkMLj2mOlkJrjJ5j4j1J1J5j8Rj%jmPOLj0J7qKnJ2MrlMKJqKnJ2j2J0
7416A1jj8K1j0Jj2OkKj1J1rJlNKj0LQpJ2kKlKJ1jNlrJ1%LpNmQj3Njlmln%Kj1%
7464a5J0Jnk%rJ7j6OrK3rNnKJ3j0PLoOjO%qJ2rOj0PkOqlNmljoMNj6NRolnOj0k
7514a9J2qNOrJ1JlLlNJ1j0QnPKmjJj2ONnlMmOlnKoJqlKLPj5PM%JmJ1j2J3KrPP
$$ y = [18, 9, 5, 17, 10, 7, 6, 11, 0, -1, 0, -5, 2, -8, -10, -7, 0, -1, -6, -10, -7, -12, -13, -16, -13, -11, -8, -2, -3, 1, 2, -1, 13, 8, 14, 9, 6, 7, 11, 11, 17, 1, 12, 6, 8, 17, 8, 12, 8, -6, 4, 13, -10, 6, -6, -14, -8, -3, -5, -6, -15, -2, -10, -11, -7, -12, -8, -3, -8, -15, -3, -5, 1, 1, 1, 2, 7, 5, 11, 6, 9, 17, 8, 3, 14, 13, 13, 10, 18, 11, 10, 0, 9, -13, 5, -4, -2, 2, -12, -2, -11, -10, -10, -3, -7, -13, -7, -4, -2, -3, -11, -1, -2, -5, 3, -3, 1, 8, 1, 6, 8, 9, 20, 23, 18, 18, 8, 11, 19, 5, 13, 3, -2, 7, -7, -8, -6, 6, -7, 1, -8, -4, -10, -13, -7, -16, -8, -7, -1, 0, -8, 1, 1, 2, 6, -6, -2, 18, 15, 10, 16, 14, 15, 11, 6, 13, 12, 12, 13, 7, 9, 12, 6, 1, -3, 2, 1, 2, 3, -5, -7, -7, 7, 2, -2, -7, -8, -9, -2, 0, 1, -14, -9, -8, -8, -9, 2, -2, 4, 5, 13, 4, 1, 9, 10, 22, 6, 12, 6, 4, 11, 6, 11, 7, 5, 9, 12, 0, -4, 2, -1, -3, -2, -11, -12, 3, -11, -22, -11, 4, -14, -5, -6, -6, -7, -11, -4, 2, 5, -5, 12, 4, 6, 1, 13, 17, 8, 5, 9, 11, 12, 4, 6, 1, 13, 1, 11, 10, -8, 13, 3, 4, -8, -2, -4, -2, -13, -2, -11, -10, -13, -8, -6, -16, -13, -5, -12, 0, -2, 0, -3, -1, 10, 9, 14, 11, 2, 13, 13, 16, 9, 14, 10, 18, 5, 10, 9, 6, 2, -1, -6, -6, -4, -15, -15, -5, -4, -9, -11, -11, -20, -3, -19, -13, -22, 1, -8, -3, -8, -6, 7, -3, 4, 7, 1, 7, 6, 12, 12, 4, 16, 7, 13, 3, 10, 8, 14, 6, 3, 8, 4, 1, 0, -6, -2, 3, -13, -8, 1, -5, -8, -13, -7, -17, -19, -7, -15, -10, -4, -13, -2, -1, -4, -1, -4, 1, 12, 2, 10, 5, 12, 14, 10, 9, 10, -2, 4, 9, 4, 1, 5, 1, 7, 4, -1, 1, -5, -4, -12, -15, -13, -10, -3, -18, -11, -7, -7, -6, -10, 1, -11, 2, 4, -5, 2, 9]
7565IqkRJ1j1KJLkJKkoMKmKLj1Pj3J%%%j1J3kJlkjQj7J4%mmJ5okJ2oPmj1K1%j1
7614ERKpJKmmLOrJNj3QJlojLrjLJ2j3OLj2Pl%NKJ3j5OKJKnJ6qLMoMpjKoOj0Qj3
7667eNMnMJrojJQLmpJKpLKKKNqJ2KnJ2mNlKqJJ5pkj2%jK7k2nJ5j6J0j5O%nkkM
7718gjNkjoKmMLMQmMjjJ3o%j%nJ3mkNlJqmJnQjllqJ3j8Mj4PK%MJPkjKN%MLj1M
7773APqJ3rJ3j5Q%nNJmpJ7loLj3J3j5NkmoJ3j2j0J6%%j0NkK%kR%j2PJ4j1Rkj%
7819BlJ0J0j2J2qKknnKmNqj1K2j6K%KjroJ1KoLMNnomJ3kJLKMqQjPKj1QjJJmkP
7870A1jqJm%jPqlmLj4J3JpPj1J0PplJ3ojQmjkLJ7j3OOrLjJkMLklpJ1rojjKnmO
7922ej3QqNMonJ2qMqJ5LlJrJ0MJ4j6MK3j9lKMqKJ6j1pQqNnpJJKmM%Kj4LjPNj0
$$ y = [9, 1, -1, 8, 19, 8, 10, 11, 14, 12, 13, 15, 13, 7, 11, 13, 9, 11, 14, 3, 10, -3, -2, -2, -2, -2, -13, 0, -2, -1, -4, -6, -7, 1, -16, -2, -2, -6, -10, 5, -1, -3, 9, 3, 10, 6, -5, 16, 16, 5, 14, 16, 9, 10, 12, 8, 4, 7, 13, 4, 5, 10, -3, 5, 6, 3, -3, -4, -1, -10, -11, -8, 4, -9, -3, 0, -12, -5, -8, -8, -3, -1, 12, -3, 3, 5, 6, 8, 3, 19, 11, 14, 18, 12, 16, 9, 8, 10, 4, 10, 0, 8, -5, 0, 4, -1, 3, 4, -5, -11, -12, -11, -3, 0, -4, -11, -10, -8, -15, -12, -10, -8, -6, -1, -9, 3, 5, 0, 12, 8, 13, 10, 12, 4, 5, 20, 13, 11, -1, -1, -2, 25, 3, -2, 13, -3, 7, -8, -2, -2, -7, -9, -11, -7, -8, -3, -5, -6, -12, -10, -14, -10, -7, -3, 5, 1, 5, 4, 3, 16, 10, 10, 9, 9, 4, 17, 13, 11, 16, 13, 14, 6, 2, 3, -2, 6, 5, 2, -1, -9, 4, -14, -10, -24, -17, -15, -15, -11, -10, -3, -5, -6, -4, 1, 1, 5, 8, -3, 1, 8, 0, 13, 4, 17, 2, 10, 10, 5, 10, 11, 7, 0, 17, 14, 8, 11, -2, 11, -4, 1, -1, -5, -11, 2, -10, -20, -4, -4, -4, -14, -9, -11, -9, -9, -11, -2, -2, -14, -7, 7, -4, 5, 3, 2, 2, -1, 9, 19, 7, 19, 11, 13, 11, 6, 1, 3, -1, 4, -4, -15, 7, -9, -7, -7, -5, -6, -15, -21, -10, -8, -14, -11, -7, -2, -7, -13, -17, -4, -6, -5, -2, 0, 4, -4, 4, 3, 10, 12, 1, 9, 8, 9, 10, 6, 4, 11, 10, 2, 3, -1, -1, -2, 5, -3, -6, -10, -7, -21, -8, -7, -14, -7, -18, -8, -1, -8, -11, 2, -4, -5, 3, -1, -2, -4, -1, 16, 3, 9, 15, 6, 9, 8, 9, 7, 11, 14, 12, 9, 2, 13, 4, -2, -3, -4, -2, -7, -11, -5, -18, -10, -18, -13, -9, -15, -20, -8, -16, -12, -20, -5, -2, -5, -4, -13, -3, 1, 15, -1, 3, 26, 7, 4, 6, 10, 2, 4, 20, 9, 2, 10, 2, 7, 2, -5, -4, -3, -1, -5, -1, -1, 1, -13, -10, -11, -4, 1, -9]
7971iKK%nJ0%OljlJ8j7LlQ%jQlmMKrPoKnPmjoqOj1KMKKrKMmjkRnKMj1RRLNj5J4
8026A0j0J5nOjjlKkj1J2Lj3%LJkmKrJJlOjj6MNMJnOqJ1ljJ0Jk%KPj3K0plJ1j8
8074CjPoMpJJ0%%k2OkJ4j4RmjqmlJ0jMmQmpJ5pQPoJjLjnJ0nJ0qQnKqJ1omMlj0
8125bOlj4MmJ8j3mj0J5nJ3j6KPj0PJRRpJPpLJMjqKJMkJlKjoJ0qj0Oj3J0j3J2p
8172a2QrpJ3nqJ3LnOOj2LJ5j9J3mLK
$$ y = [-9, -7, -5, -5, -10, 0, 0, 6, 3, 2, -1, 17, 0, 3, 0, 8, 8, 7, 15, 12, 8, 12, 14, 5, 12, 6, 8, 3, 10, 6, 5, -1, -9, -3, -14, -12, -8, -6, -4, -13, -11, -7, -11, -12, -14, -5, -10, -8, -4, -15, -6, 3, 6, 11, -4, 10, 0, 15, 10, 16, 15, 14, 11, 13, 11, 0, 12, 15, 2, 2, 5, 6, 4, 0, 2, -7, -6, -5, -8, -2, -3, -19, -15, -10, -6, -5, -10, -4, -12, -1, -4, -5, 5, 6, 4, 4, 6, 13, 0, 20, 13, 10, 21, 3, 2, 9, 3, 7, 0, 1, 11, 11, 11, -11, -5, -7, 7, -7, 2, -2, -3, -11, -15, -18, -8, -9, -5, -9, -1, -5, -12, 3, -4, 4, 11, 5, 6, 5, 8, 7, 2, 12, 7, 17, 9, 17, 12, 14, 6, 17, 11, 7, 11, 8, -2, 4, 1, -13, -9, -13, 5, -8, -12, -22, -7, -12, 1, -15, -13, -6, -16, -9, -8, 1, 10, 3, 4, 11, 4, 7, 8, 12, 11, 3, 5, 6, 10, 8, 9, 6, 8, 7, 1, 11, 3, -7, -1, -14, -4, -17, -5, -12, -4, -13, -20, -7, -12, -20, -7, -4, -9, -3, 3, -9, -6, 9, -10, 3, -1, 2, 4]
8191D
$$ Imaginary data points
##PAGE= N=2
##DATA TABLE= (X++(I..I)), XYDATA
0@%%%%%%%%%%%qJ6j6J6k4L2l2M0n6O4p2Q8j04J28j52J76k07K39k72L10l51M00
33B15m55N12n76O48p30Q18r12J016j131J256j392J540j703J881k075K287k519
50a320K776l057L368l717M104m539N032n595O245p008P916r016J0387j2145J4494
65G925j7816K2904l1755N1436j71824P0551K97951k36956j01850J64221O289k29169
77a68093J18262K73886j12638k99431J05780K15852j14086j38373J79346O6328
87A26833k33441m9477K63176L1179k33657L296J99234o9676j68301J29327J58863
98A57356j71076j42212J80750J09029j84307n4780J88622Q86j98477M3822J98749
109A28362p3865j83084J00881J51167j28829j14448J57120P9124j77051m7071
$$ y = [0, 0, 0, 0, 0, 0, 0, 0, 0, 0, 0, 0, -8, 8, -8, 8, -16, 16, -16, 24, -32, 32, -40, 48, -56, 72, -80, 96, -111, 128, -144, 166, -185, 215, -240, 272, -304, 344, -386, 432, -480, 536, -595, 661, -731, 809, -894, 987, -1088, 1199, -1320, 1456, -1601, 1767, -1950, 2154, -2385, 2647, -2948, 3297, -3711, 4205, -4811, 5576, -6569, 7925, -9891, 13013, -18742, 32694, -139130, -68579, 229372, -7584, -109434, 54787, 61076, -168093, -49831, 224055, 111417, -188014, -82234, 133618, 19532, -118841, 60505, 126833, -106608, -156085, 107091, 138270, -95387, -92091, 107143, 37467, -130834, -1507, 157356, -13720, -155932, 24818, 133847, -50460, -105240, 83382, 84268, -114209, -70387, 128362, 54497, -128587, -27706, 123461, -5368, -119816, 37304, 116428, -60623, -107694]
119a07694J83845J3405j77989K3625J65079o1652j48619R4968J28951j19914j03845
130a09840J36406P2758j46716l8000J52180L327j52099K8437J45005n6733j30449
141i5724Q1939J09907j03864q5726J21318N9620j32712l2285J37254M101j35370
152g1542K4112J28028n0872j15913P4478R9368r3735p8794J08211N4975j17783
163c9467k9198J22227L015j21287K2256J14942m5776j03439O6669Q7632q4140
174f566o8566R7427M7190j05883k4493J09304J387j07793K1097J01689m1927r1458
186f8592O0173P7660p5147o0944Q6410M2127r3665k2073R6708J751r5550J8015
198c3127R0302l6445q1276N2781O9030o6458n4119P6900L7259q3716j9193Q6691
$$ y = [-107694, 76151, 89556, -88433, -64808, 100271, 38619, -110000, -15032, 113919, -5995, -109840, 26566, 99324, -47392, -85392, 66788, 70115, -81984, -53547, 91458, 34725, -95724, -13785, 96122, -7742, -93468, 27850, 87470, -45242, -77527, 59727, 63828, -71542, -47430, 80598, 29726, -86187, -11709, 87659, -6076, -84870, 23341, 78316, -39467, -68665, 53562, 56577, -64710, -42454, 72488, 26712, -76727, -10058, 77574, -6566, -75132, 22295, 69485, -36398, -60891, 48413, 49800, -57993, -36896, 64793, 22866, -68592, -8419, 69241, -5906, -66850, 19560, 61687, -31978, -54051, 42657, 44408, -51142, -33127, 57175, 20730, -60546, -7765, 61265, -5193, -59312, 17588, 54847, -28869, -48062, 38629]
210C8629P03q5792J7397Q1145l4304p3030M9260O1919o1696m8318P1079L2930
222D9922p7120j6468P9598k55p8522J6505P4016l1552o6409M4797N6115n5674
234e047m3732O3823K9818o8933j5035P0897N3o9746J4495O5613k8016n8741L9943
247d608M9509m9813l8362N7278K5821o2077j2451O4061j187o3192J4487N9569
259C9035k6852n3440L7820M5046m6880l4876N3716K3395n8076j1101N9771j415
271B6143n8790J3568N5265k4844m9391L4737M1527m2880l1991M8890K1343n2615
283a9038j0061N3952j386n2853J2434M9499k2653m4074L1615L6853l8957k8241
295c2910M4454J8567m7854q345M9133k030m8225J2076M5247k1388m0372K9576
$$ y = [38629, 39332, -46460, -29063, 52082, 17778, -55252, -5992, 55927, -5769, -54087, 16992, 49922, -27198, -43666, 35932, 35677, -42845, -26340, 47676, 16124, -50285, -5488, 50627, -5047, -48779, 15044, 44862, -24071, -39106, 31791, 31844, -37902, -23407, 42206, 14190, -44551, -4608, 44901, -4912, -43274, 14004, 39825, -22252, -34703, 29358, 28171, -35021, -20534, 39035, 12183, -41257, -3437, 41609, -5271, -40147, 13569, 36964, -21112, -32213, 27558, 26143, -32647, -19079, 36186, 11342, -38049, -3312, 38215, -4665, -36656, 12234, 33577, -19038, -29099, 24853, 23467, -29386, -16952, 32547, 9894, -34180, -2565, 34288, -4669, -32910, 11544, 30111, -17743, -26088, 23045, 21015, -27210, -15134, 30113, 8725, -31647, -2071]
307b071L3844l6307k5990M1319J7161m4420p792M5557j753m4633J0980M1801j9513
320H183l7217K6993L1114l3121k3786L7642J5599m0400o936M1323j830m0387J0268
333a2555L7743j8066l3501K4852K7918l0421k1231L4516J3791l7010n930L7861
345A7967k021l7022R676L4626j6756l0768K2931K5665k7963j9582L1690J2768
357B1211l3936n583L4687j709l3885Q733L1631j5213k8051K0876K3344k5519j7685
370b1099K8911J1402l0964m775L1629j934l0868Q382K8759j4300k5470J9485K1137
383B0295k3694j5980K6777J0226k8608m169K9155j916k8432P797K6476j3189k3431
396a8693J7890J9425k1704j4668K4470R399k6116l826K6579j774k5885P175K4066
$$ y = [-2071, 31773, -4534, -30524, 10795, 27956, -16464, -24256, 21301, 19548, -25085, -14105, 27696, 8183, -29034, -2041, 29073, -4048, -27834, 9808, 25407, -14993, -21929, 19394, 17564, -22823, -12555, 25188, 7122, -26379, -1527, 26391, -4030, -25261, 9255, 23046, -13964, -19894, 17967, 15946, -21076, -11400, 23226, 6470, -24298, -1367, 24298, -3665, -23247, 8443, 21211, -12725, -18308, 16379, 14670, -19215, -10482, 21149, 5936, -22115, -1239, 22105, -3414, -21099, 7812, 19214, -11750, -16525, 15104, 13170, -17698, -9316, 19443, 5143, -20327, -842, 20295, -3399, -19379, 7398, 17624, -10984, -15153, 14002, 12086, -16346, -8549, 17927, 4738, -18693, -803, 18622, -3082, -17750, 6720, 16119, -9997, -13823, 12756, 10982, -14903, -7728, 16338]
409A6338j2124k1237J6436J7540j9940j3156K2487Q294k3989l168K4416j980k3771
422a3854O939K2071j1486j9449J5424J6048j8607j2022K0924P542k2264k859K2620
435A1027j873k1963O423K0376j0578j7936J4196J4760j7105j1011J9188O881k0416
448h031k518K0708j862k0075O045J8598r886j6334J3216J3385j5880r925J7802
461E243O103j8906k090J9168j938j8579N794J7184r304j5078J2349J2348j4796
474b502r151J6548N614j7535j905J7739j809j7154N358J5855q628j3862J1435
487CJ1309j3681q319J5292N012j6175j555J6331j898j5782N208J4530q212j2667
501a0604J0792J0293j2854p503J4295M442j5079j264J5202j928j4639M953J3463
$$ y = [16338, 4214, -17023, -587, 16953, -2987, -16143, 6344, 14638, -9351, -12519, 11897, 9917, -13854, -6915, 15156, 3670, -15779, -355, 15693, -2914, -14936, 5988, 13530, -8734, -11593, 11027, 9154, -12809, -6386, 13990, 3412, -14524, -328, 14432, -2673, -13684, 5504, 12385, -8031, -10549, 10159, 8297, -11778, -5733, 12865, 2979, -13355, -139, 13246, -2634, -12559, 5243, 11346, -7560, -9650, 9518, 7580, -10999, -5205, 11979, 2675, -12403, -54, 12294, -2502, -11653, 4895, 10509, -7026, -8931, 8808, 6999, -10155, -4797, 11058, 2430, -11432, 3, 11312, -2369, -10688, 4604, 9616, -6559, -8114, 8217, 6319, -9463, -4255, 10275, 2063, -10604, 188, 10481, -2373, -9876, 4419, 8861, -6218, -7482, 7720, 5792, -8847, -3894, 9569]
514I569p699j1716J0048R496j1920o908J3237M068j3929j112J4007j833j3460
527h152M627J2348p175j0689R330Q624j1054o228J2256L580j2874q45J2933j886
541D795j2415M471J1362o806r830Q791P908j0367n668J1438L230j1993p02J2012
555F226j798j1516M182J0516o322r077Q148P272r587n183J0556K933j1043o00
569e293J1054j731j0574L938R624n904q292P587O604q887m682R781K593j0242
583d424m04J0221j730r764L751Q878n557p647P114O066q290m294R116K339r494
598d119l32R457j653r019L515Q197n186p028O610N553p700l875Q422K082q770
613c846k16Q718j612q298L352P499m880o417O194N048p179l516P862J822q150
$$ y = [9569, 1870, -9846, 202, 9698, -2222, -9130, 4107, 8175, -5754, -6866, 7141, 5308, -8152, -3525, 8823, 1648, -9041, 289, 8913, -2141, -8369, 3887, 7467, -5407, -6252, 6681, 4795, -7620, -3149, 8213, 1407, -8423, 368, 8276, -2091, -7759, 3679, 6909, -5084, -5786, 6226, 4428, -7088, -2906, 7610, 1288, -7789, 359, 7631, -1956, -7139, 3417, 6350, -4693, -5293, 5761, 4030, -6544, -2606, 7018, 1114, -7178, 409, 7013, -1874, -6556, 3225, 5818, -4424, -4828, 5393, 3663, -6101, -2350, 6528, 971, -6676, 438, 6504, -1786, -6080, 3036, 5375, -4119, -4451, 5006, 3353, -5666, -2151, 6046, 860, -6168, 442, 5995, -1705, -5580, 2842, 4924, -3846, -4062, 4656, 3044, -5254, -1902, 5597, 717, -5700, 494, 5542, -1637, -5153, 2709, 4531, -3619]
628c619j04Q096j591p685L169O952m585n937N788M653o685l211P292J647p557
643c377n9P494j517p076K971O383m285n418N372M234o190k903O743J451o980L0
659c127O920j491o549K864N872m054m980N068L874n834k617O314J279o542J26
674b877O435j443o080K695N462l810m627M750L570n449k379N883J139o067J39
689b659N976j380n623K546N020l559m233M415L271n047k185N461R94n603J86N521
705C101j346n184K402M640l365l887M134L002m738j962N098Q78n246K39N124j285
721A605m821K289M288l172l573L877K736m403j787M747P61m850K52M750j249m434
737b984K165L938k963l273L617K478m088j599M362O88m477K74M361j177m062J996
$$ y = [-3619, -3723, 4373, 2782, -4903, -1734, 5218, 633, -5304, 484, 5137, -1548, -4759, 2533, 4180, -3377, -3436, 4058, 2541, -4535, -1564, 4819, 534, -4884, 488, 4722, -1468, -4371, 2372, 3823, -3157, -3127, 3793, 2302, -4247, -1383, 4489, 435, -4545, 523, 4397, -1437, -4054, 2260, 3539, -3003, -2877, 3558, 2115, -3965, -1270, 4192, 382, -4245, 505, 4075, -1374, -3753, 2130, 3269, -2798, -2659, 3317, 1937, -3686, -1140, 3880, 321, -3912, 503, 3774, -1273, -3458, 2003, 2997, -2606, -2420, 3101, 1755, -3429, -1027, 3613, 248, -3639, 495, 3497, -1241, -3203, 1895, 2773, -2473, -2234, 2890, 1605, -3216, -927, 3361, 189, -3384, 493, 3229, -1174, -2961, 1786, 2547, -2303, -2051, 2699, 1450, -2984, -819, 3119, 156, -3117, 500, 2978, -1110, -2709, 1653, 2341, -2136, -1862, 2499, 1322, -2740, -744]
753g44L627k767k991L342K275l791j455M052N94m131K65M047j121l771J895L343
769B669k575k767L129K084l537j312L760N24l851L09L739j087l465J792L061k412
785F1k523K926J877l280j169L480M40l546L08L433j016l202J677K800k219k302
801b255K679J718l004j079L200M01l261K84L159r45k924J553K561k061k114K494
817D06J575k811r58K968L41l026L16K910r06k711J475K373j955j942K351J422
833A828k613q65K765K77k787K97K700q64k491J370K181j811j768K151J309k411
849g32p90K543K53k551K89K466q05k279J268J997j682j612K008J168k226o97K355
866I73J87k368L01K288p76k115J221J840j599j479J889J080k102o27K213J45k215
$$ y = [-744, 2883, 116, -2875, 467, 2742, -1049, -2504, 1548, 2142, -1989, -1724, 2323, 1202, -2569, -674, 2669, 94, -2673, 456, 2540, -997, -2309, 1451, 1975, -1876, -1567, 2172, 1085, -2380, -588, 2473, 61, -2462, 464, 2341, -939, -2108, 1372, 1812, -1734, -1426, 2007, 991, -2211, -534, 2266, 47, -2255, 424, 2142, -862, -1941, 1259, 1660, -1601, -1317, 1842, 897, -2027, -474, 2087, 26, -2088, 406, 1981, -830, -1788, 1180, 1521, -1505, -1189, 1721, 815, -1896, -421, 1952, -3, -1945, 406, 1828, -785, -1650, 1115, 1392, -1395, -1098, 1602, 738, -1753, -383, 1798, -13, -1781, 370, 1679, -732, -1522, 1021, 1274, -1277, -988, 1478, 673, -1606, -338, 1659, -23, -1635, 373, 1541, -685, -1382, 973, 1160, -1208, -907, 1381, 605, -1510, -289, 1551, -48, -1527, 362, 1442, -660, -1287, 926, 1071, -1144]
883a144L18K123p41j950J136J686j494j348J755R70j936n53K039J17k038L03J963
900A206p16j781J071J537j392j219J631Q72j799m81J872R0j885L10J804o82j645
917a207J030J403j306j122J523P87j673m29J750N7j740L01J668o52j513R68J281
934A126j219j017J423P15j563l79J631K7j618L15J536o33j381R12J182j145r37
951a025J335O43j458l37J511K2j509L06J423o04j271Q54J089j086q40J237N89
968H79j359k96J407j4j373K85J311n62j170P99R92j004p73J166N22j259k55J292
986E88j8j287K97J211n38j087P62R19r54p01J077M84j179k14J193l0j180K71J117
1005G31n06r86P01Q33q87o27R96M24j085j93J128n2j094K69J033m94r03O64P67
$$ y = [-1144, -826, 1297, 556, -1394, -258, 1428, -66, -1414, 341, 1311, -625, -1178, 861, 978, -1060, -757, 1206, 490, -1291, -220, 1317, -75, -1294, 337, 1209, -590, -1071, 801, 891, -994, -684, 1120, 438, -1207, -177, 1226, -80, -1202, 321, 1108, -565, -994, 756, 813, -927, -626, 1042, 390, -1123, -155, 1126, -93, -1110, 313, 1028, -535, -914, 717, 744, -874, -559, 977, 344, -1037, -125, 1057, -88, -1025, 310, 953, -505, -842, 669, 691, -818, -512, 911, 307, -964, -110, 979, -107, -947, 290, 879, -480, -776, 631, 617, -756, -471, 840, 278, -892, -93, 899, -105, -878, 288, 810, -449, -704, 588, 570, -717, -420, 791, 253, -834, -72, 847, -107, -808, 269, 753, -426, -640, 553, 523, -657, -386, 731, 225, -761, -60, 773, -114, -741, 255, 679, -406, -599, 529, 477, -617, -348, 685, 191, -712, -48, 719]
1024G19q29n91R55L72j002j71J038n8j012K77R43m65q51O35P00p67n31Q72L48
1043E82r37j43R49o3r24K61Q67m51p60N95O40p19m85Q20L10q78j31Q96p0q52K40
1064b53Q07m23p02N59N86o89m36P66K73q15r7Q30p3q09K44P53m04o40N23N31o35
1085a04l96P00K45p57p6P63p6p51K41O82l73n91M85M90o00l44O58K15p01n9P04
1106C55q9o78K28O28l65n30M70M43n75l17O28J87o67l8O69j09o32K23N91l52m97
1127d27M44L99n24k88N90J54o02l6O14j07n81K22N36l34m57M21L57n02k42N49
1147A86J23n54k2N67j05n34K09N00l28m15M06L34m82k24N14J22n38LN21j10n05
1168c32K23M51l08l80L80L10m55j92M63J10n11J2M82j07m55K07M14k90l50L59
$$ y = [719, -110, -701, 254, 626, -376, -547, 491, 433, -579, -302, 641, 176, -675, -40, 660, -107, -638, 234, 582, -355, -498, 451, 388, -536, -275, 592, 141, -619, -24, 616, -103, -588, 232, 542, -336, -467, 429, 359, -493, -253, 554, 131, -571, -12, 574, -115, -551, 215, 488, -327, -424, 406, 333, -476, -232, 521, 117, -523, 0, 531, -104, -500, 200, 445, -312, -388, 375, 299, -452, -211, 471, 98, -493, -8, 482, -118, -462, 196, 411, -290, -349, 355, 266, -412, -184, 444, 79, -451, 19, 462, -113, -430, 198, 385, -282, -320, 349, 240, -392, -169, 422, 70, -427, 17, 416, -108, -396, 194, 348, -254, -290, 324, 217, -364, -142, 394, 60, -397, 24, 381, -121, -363, 186, 309, -245, -267, 300, 195, -339, -130, 370, 42, -373, 33, 367, -115, -339, 175, 297, -241, -238, 283, 173, -332, -109, 342, 34, -346, 34, 344, -111, -303, 160, 270, -241, -229, 253, 146, -309, -102, 312, 22, -328, 31]
1188C1K70m12j79M54Q1m68J4M63j17m31K05L85k84l19L48K43m03j50M30N9m17
1209a97J1M29j21l96K04L37k67k89L35K18l79j32L83O1m02M3L84j05l59J77L21
1230B56k51k52K89J95l34j27L70M6l77L1L63j06l26J70K91k29k41K78J79l19j13
1251b07L42K6l28L9L32j21l01J69K74k27k18K64J59k99r6L15K0l03L3L11j09k79
1273b04J67K51k17j96K45J48k84q2K93K3k98M5K80j02k57J45K33j95j82K30J29
1294A72k61o4K69K1k93M4K83j16k31J47K00j90j66K29J12k46n6K55J1k67N4K53
1316A60j12k20J45J90j69j66K23J06k47l9K50rk45O4K13r1k03J36J72j61j46J93
1338D4Q9k11m8K24jk19L2K21r4j86J35J51j53j22J76R7k17l0K02Jk13N3J97q8
$$ y = [31, 301, -111, -290, 164, 245, -223, -209, 254, 137, -294, -89, 296, 12, -307, 41, 284, -119, -269, 161, 220, -197, -186, 243, 122, -274, -70, 267, 0, -289, 46, 264, -115, -247, 136, 197, -205, -162, 222, 117, -242, -65, 256, 5, -247, 42, 237, -97, -224, 146, 192, -185, -154, 209, 103, -223, -53, 238, 9, -232, 46, 225, -94, -207, 135, 161, -167, -128, 204, 83, -218, -49, 225, -2, -220, 44, 203, -96, -192, 123, 143, -160, -127, 184, 75, -204, -37, 214, -3, -199, 46, 194, -90, -172, 121, 144, -154, -109, 171, 69, -188, -43, 190, -5, -187, 43, 172, -89, -153, 116, 137, -156, -112, 171, 55, -176, -29, 171, -19, -185, 44, 156, -90, -146, 109, 120, -147, -93, 160, 48, -172, -27, 163, -6, -172, 51, 157, -90, -129, 121, 112, -133, -69, 144, 53, -150, -14, 158, -3, -149, 44, 133, -78, -126, 98, 97, -122, -90, 131, 37, -149, -14, 137, -16, -138, 38, 135, -82, -112, 90, 91, -122, -69, 128, 40]
1362D0j79J26J48j49j23J84P6j95l6K05j0j99N1J80q6j60J16J39j52r5J62O5j81
1385g3k5J79j2j68L8J71p5j62J14J26j32r6J59O2j69k4J75j1j77N4J45p7j29J01
1409fJ06j19q1J49N1j67rJ67k7j55M6J44q4j22J07J01j23o9J35M4j40l2J67l0
1433E3j47N2J39q1j02Q4R5j19n4J28L6j38j5J36rj43N0J34q3r4R2P9j14n6J21
1458D4L7j46NJ20lj31M2J04o2r5Q7Q1r3p3J16L5j32lJ31j7j25M1J11n2r5Q0P6
1485H3j03n1J05K9j10j7J27j6j06L2J11o3r9R2N6q1n7R5M1j13%J03j9r9L4J00
1511G4o9p3P6N0q1m3R5L5r5k0J09j4r8L8Q4o5p9Q2N9p6m0P8K9r0nQ8j5q9L8P9
1541F2n7p3P3N3q1l6Q2J5p8j1Q6pp8M3N6m3n7N8M4o5k6O4J5o9oR0k2p6M2M8m0
$$ y = [40, -139, -13, 135, -14, -137, 47, 123, -72, -108, 97, 87, -112, -61, 119, 33, -127, -11, 128, -24, -119, 43, 108, -73, -98, 81, 69, -99, -61, 110, 35, -127, -13, 113, -19, -115, 44, 106, -63, -87, 88, 77, -100, -46, 99, 22, -107, -6, 100, -19, -100, 49, 100, -67, -76, 91, 64, -91, -45, 99, 15, -107, 0, 101, -22, -91, 44, 88, -52, -84, 83, 53, -94, -42, 97, 16, -86, -2, 93, -26, -80, 48, 84, -54, -69, 67, 58, -85, -35, 99, 16, -78, 14, 93, -21, -77, 44, 81, -65, -60, 60, 57, -74, -32, 72, 10, -85, 2, 83, -10, -83, 33, 68, -64, -67, 64, 47, -78, -37, 74, 22, -73, 7, 83, -20, -71, 34, 63, -47, -64, 63, 47, -59, -27, 84, 21, -78, 14, 70, -11, -68, 27, 68, -45, -45, 58, 39, -60, -26, 74, 5, -68, 8, 58, -23, -66, 29, 64, -31, -51, 58, 44, -54, -16, 68, 3, -76, 6, 65, -11, -51, 27, 56, -34, -39, 49, 34, -55, -17, 62, 5, -68, 5, 58, -23, -59, 23, 38, -40, -51, 35, 28, -50, -7, 49, 6, -51, 7, 51, -14, -40, 24, 39, -30, -36, 54, 32, -44, -2, 46, 6]
1572Fo1P1L6o4k3O3Mo4KP1j1q0L8P0n0o8P0L6n5l7O6K2p3kP3j8o6L2N7m0m3L6
1604bM4n7l0O2K0n7kN3rn9J8N9k7n0M6K9n3k3O5Km4pN0j2n7K9N1m5k6K8L8n2j6
1637c4N0kl5j1P1j9o5K9N3l1l8M5K3n0j6N3Mn2J6M4k1m7J8O0n8k0L7K0l9k0M9
1668A4Nm5J1L9k2l6J8M1k8l6L7J9l8mL9%l7lM6j3m9M0K4k5k5L0J8k9j3N3j0m6
1700b5J3L7j7l8L0K7l0j8K7J9l7j1L5ol1OL3lm0K8J8l0j5K7K5m3pM2jl4J8J6j4
1733Al0K7K4k3k3K1K0k3j4M8j6l7J2K6pk7J5J5ml3K5J7l7j1M0J4l9J0K5j9k2K1
1765dJ6k2j1L1Kk8ML2kl4RL1k6j1J6K3k2l3L8Mk3lK3mj5QJ9j5k0J5K6k8k0K9J7
1800B2m3kK8oj2%J8pj8K6J3k6kJ5Qk3NJ9ok7J8J6j4j8J7J6j2k7L4J0m0RK1qk5
$$ y = [6, -55, 16, 52, -12, -35, 28, 32, -32, -30, 41, 30, -50, -12, 58, 8, -60, 10, 46, -9, -46, 20, 42, -31, -33, 40, 22, -44, -12, 45, 5, -38, -2, 42, -15, -45, 17, 37, -20, -22, 31, 22, -37, -19, 40, 13, -37, 9, 38, -15, -38, 27, 29, -15, -22, 28, 16, -41, -12, 39, -6, -32, -4, 34, -18, -34, 16, 14, -21, -32, 39, 20, -45, -16, 37, 6, -32, 13, 36, -14, -30, 23, 27, -25, -9, 35, 14, -33, -15, 45, -13, -33, 4, 24, -15, -35, 14, 19, -26, -15, 24, 2, -34, -16, 25, -3, -39, -2, 17, -21, -25, 14, 14, -23, -26, 20, 7, -42, -2, 22, -3, -28, 2, 20, -9, -22, 31, 21, -25, -12, 25, 8, -30, 0, 27, -3, -21, 6, 25, -12, -23, 12, 6, -25, -19, 14, 11, -29, -1, 17, -13, -28, -1, 24, -19, -26, 16, 15, -19, -1, 15, 1, -29, -2, 22, -1, -24, -3, 17, -6, -20, 28, 12, -25, -13, 13, 6, -21, -6, 9, 5, -28, -3, 14, -23, -34, 6, 20, -19, -9, 16, -3, -25, -4, 12, -10, -21, 10, 12, -16, -12, 20, 18, -16, -7, 24, -2, -13, 3, 26, 4, -29, 9, 13, -10, -13, 10, 6, -9, -1, 18, 3, -17, -2, 24, -4, -24, 5, 22, -21, -23, 5, -1, -13, -13, 5, -2, -20, 6, 19, -7, -9, 6, 14, -9, -4, 15, 9, -18, 0, 16, 2, -16, 1, 17, 5, -22, 12, 22, -18, -9, 12, 4, -21]
1835b1J7K2k1j9K6Pj0j6J6%j6mL2ol1K3N%k0J2J2j0qK8lk4lK1Kj5J5Rj3k6K6O
1871A3k0kQOj9KK8j4j7MK2lk1KJ4noK0oj4nJ8j2nRJ0mj5K5pj1pJ7Qj9JJ3%j5n
1911a2K2qk0K3pjj3J6J0k8NK0j1nJ0J5j9j6K2jj0RMoj8J4J8qj0Pl%JL%rj5K7M
1950A0j7QRj9jJ6mlkLNlqPPj2mJ9prLJ1j0%NQk0J0K0j9nLQj0%kLkPjMnKPnj5J0
1997BJ4qj3QJ1j3%KLj0PJmqJ8no%J5Pk0kRj1oNJ0Nj0PJ3j8KKl%kQmnmPRj1Qjj3
2044dnJ4orQJ9j3l%J0Kj8J0lOkL%qJPrNj0J0J4k1J1Qj3kQKj2j%J5j4lJ1j3jJ1
2087EpklLRj5JJ0klj0K5j3oQOJj3P%mpJ5okRoOj4J0Lj2J5LQj6kkMmpJ5%ppMMo
2135ejJ0jj6K1onlLJ3kmpOKlJ0j8MM%lkN%OrQj1OJ7j0lrKMj2J3klKRrpNRkk%k
$$ y = [-21, -4, 18, -3, -22, 4, 11, 1, -15, 1, 1, -15, -19, 13, 7, -24, -1, 4, 4, -16, -4, 8, -2, -10, 18, 15, -9, -12, 9, 11, -4, 11, 20, 7, -19, 7, 13, -7, -9, -1, 5, -14, -12, 16, 2, -15, -11, 11, 8, -13, -11, 3, -2, -8, 12, 6, -8, -13, 5, -7, -12, -3, 7, 3, -12, 13, 6, -5, -12, 5, 13, -6, -5, 8, 8, -7, -12, 10, 2, -18, 5, -2, -3, -16, 0, 10, -18, -13, 7, -4, -9, 1, 16, -3, -19, 3, 2, -8, 1, 5, -1, -19, -5, 13, 5, -5, 2, -1, -1, 0, 3, 3, -6, -21, 6, 10, -7, 1, 10, -9, -10, 6, 2, -1, -3, 0, 5, 2, -6, 1, 8, -4, -8, 11, 4, -5, -2, 9, -1, -1, 4, 12, -8, 2, 22, 3, -2, 1, 9, -1, -1, -3, 0, -2, 5, 4, 8, 3, 5, 12, 7, -8, 2, 16, 8, -5, 3, 14, 1, 1, 3, 6, -4, 3, 4, 0, -8, 10, 5, -1, -1, 14, 21, 1, -1, 8, -3, -9, -4, 6, 11, 1, 8, 21, 3, 5, 7, 4, 4, 2, 10, 6, 1, -3, 4, 13, 2, 10, 9, -4, -9, 5, -1, -10, -2, 17, 4, 1, 1, 11, 13, -5, 5, 2, 8, 6, 9, 9, 1, 2, 9, 0, 5, -5, 5, 19, -2, 9, 17, 4, 2, 10, 12, 0, -1, -1, 14, 0, -3, 8, -5, -6, 5, -2, -4, -7, -4, 5, -10, -9, 1, -1, -4, -14, 11, -2, -8, 0, 6, 7, -6, 1, 1, -3, -10, 5, -1, -3, 6, 0, 6, -8, 2, 5, -7, 8, 11, 19, 3, 1, -1, 3, -1, -8, 7, 7, 0, -7, -3, 1, -5, -6, 4, 3, -13, 8, 2, -3, -6, -3, 10, 8, 4, -3, 3, 5, 2, 12, -6, -2, 2, 2, -1, -3, 2, 2, 8, -1, 7, -4, 2, 19, 9, 6, -3, -1, 3, -9, 4, 2, -1, 1, 10, 1, -6, -1, 8, 6, 4, 4, 2]
2185BJ6j7lJ3j1PnOrLmMjoJ2Mj3J4lj2nKRJnPjj8PJ0mnQrMpNMoPL%okJ3nj4RJ
2234@MjJJ4k0PMj8%KJ2Lj0MQqj0MOj1MP%jkNMj3OkJrJ9jJj3J4olQQj2KKomOOm
2283HokJ2nj4MJNlmlJ6lllmNMj0KMkQmLpQqLJk%kONmmM%J2j4nRqKJPj1OOomjo
2337fNLljK%OnkNj0MQkrmK4j8OLmlJ5Jj8k%J4rpNJ0j2jOJ6j5kjOKnkKkpNj%ML
2388Dnj4J3k%MmNmJ5qnkNM%pNomJ1nMnKKlMnL%nJ7j4jKmLLloL%JjrJ1%OqPjJ1
2441A4mj5ORrlK%%QrnLRknKjLj4K0jj3PqqJ1lJ0j2J9j4MjoLRmJnPrOlJLoJ6lj6
2491fJPj8J2Roj0jKRJpLKoR%kKj0OjkJRj1J0JNj1nP%mJ0mJk%jOnNl%Jllq%QlN
2544@LLkj0J1j1QOj0ONj4NKpJ0jQj1RonQmJjL%oJ2oj2QJ2j2kkMrLMNKrjKlJ%k
$$ y = [2, 18, 1, -2, 11, 0, 7, 2, 8, -1, 2, -2, 2, 1, -5, 7, 11, -2, 12, 9, -3, -8, -6, 3, 4, -1, 6, 5, -13, -6, 4, 0, -5, 3, -6, -2, -9, -4, 0, -6, 1, 4, 4, -2, -4, 9, 4, -10, -1, 0, 4, 3, 4, 18, -2, 5, 9, -9, -9, -7, 5, 8, -2, 2, 10, 2, -8, -4, 2, -9, -5, 2, 2, 1, -1, 4, 8, -5, 1, -1, 0, -9, 10, 9, 10, -3, 11, 5, 2, 10, 18, 6, 8, 10, 4, 0, 6, 12, 8, 2, 0, 12, 7, -7, -3, -2, 3, 0, -4, -7, 9, 6, 3, 0, -4, 1, 5, -5, -3, 1, -1, 7, 3, 6, -1, 7, -1, 2, 3, 1, 1, -1, 5, 10, 6, 2, 6, 6, 18, 4, -1, 8, 0, 2, 3, 10, -1, 5, 11, 5, 1, 0, -6, -1, 2, -1, -2, 0, 0, 6, 1, -1, 4, -6, -2, 6, 4, -5, -9, 15, -3, 3, 6, 2, -1, 14, 15, -3, -5, -5, 9, 0, -7, -2, 8, -4, -5, 1, 17, 2, 0, -1, 5, 7, 2, 0, 2, 0, -7, -2, -3, -3, 1, 4, -1, -15, -2, -4, -4, 0, -4, 1, -3, 12, 4, -1, -3, 2, 6, 6, -1, 4, -2, -6, 5, 0, 4, -1, 1, 3, 0, 4, -1, 2, 2, -3, 14, 0, -1, 1, -3, 0, 3, 0, -6, -3, -3, -2, -3, -12, -1, -1, 5, -3, 4, 3, 14, 10, -5, 1, 10, 1, -2, 0, 0, 0, 8, -1, -6, -3, 6, 4, -1, 1, 0, 3, -11, 9, 8, -5, 2, -6, -14, -3, -6, 4, -8, 11, -3, 1, 0, -6, -3, 6, 2, 3, -2, 5, -4, 2, -1, 0, 3, -3, 13, 10, -6, -5, 2, -16, -4, 5, -1, -11, -12, -10, -1, 0, -7, -4, -2, -8, 1, 1, -1, 1, -9, -3, -4, -6, -5, 4, -7, 3, 4, 9, -2, -7, 0, 0, -4, 6, 2, 3, 1, 1, 0, 6, 1, 6, 3, 3, 4, 1, -2, -10, -10, -2, -5, 0, 3, 6, 4, -6, 5, -6, 2, 8, -2, 4, 9, -5, 0, 2, -5, 5, 4, 12, 1, 10, 4, -1, 7, 3, 4, 3, 6, 6, 0, 12, 6, -6, 2, 14, 2, 0, -2, 2, -7, -4, 0, 5, 7, -2, -3, -1, -4, -3, -3, -5]
2594eL%NJ0mJq%jOjn%L%qOOj1OMrQj1kJ0K%l%qJ2nJ0j0Kj2KOjOoKK%jJLkjLLj2
2647dJJ2orKJ1rNpRn%J2olkrP%oJJPpKNoJ9j2JqQj3J1Kj1Qj0OK%nPOKj6RplJ0
2697BMoJj1J3%%lj3K0olOj8K2njkQKnqLMLk%MkoJ0k%j6N%JRpKkPLnoJ2j0OoJp
2748dPjJpJ0rJkMj0OjlRoQjnLrJ1j5QJ0OolOjJojOjPNk0J0rJ1njp%K0j8kLkKN
2799Ej1MMkQoj4J1qQJ1j4k%MMoMkPj%KnLLj4J3rmOJnKJmJjJKjk%J2j2MNmMplL
2851dJ1krNmmMmOKkj3J1OklOpNpOKnj0PlJ2%noLOKj2QKJkLQ%j9Oj0J1LPj1J2o
2901EJqoJ2oMoNm%Pj2J4jj1LpJ4q%pQKMj2mOJjMJLoJ0j4LJ0mLoPkqMRj0NqjMJ
2952bjmPnJJLoJ5j4JNnJ3pj5J4LmnKOopPlJ3j2J0mnkPjJ3k0PkOJJLlrpQkMnKM
$$ y = [-5, -2, -2, 3, 13, 9, 10, 2, 2, 1, 7, 6, 1, 1, 4, 4, -4, 2, 8, -3, 3, 7, -2, 6, -5, -7, 3, 5, 5, 2, 2, -6, 6, 1, 11, 1, 3, -9, -7, -1, -2, 4, -2, 0, 2, 2, 1, 2, 5, 3, 2, 5, 8, -4, -3, 9, 3, -6, -4, 7, -2, 3, -4, 5, 0, 0, 12, 6, 3, 1, -8, -1, -1, -7, -6, -5, 2, -5, -3, 2, -4, 15, 3, 4, -4, 4, -9, 2, 4, -7, 1, -9, -3, -1, -1, -6, 1, 7, 9, -7, 2, -5, -8, 2, 6, 0, 1, -10, 3, 3, 3, 0, -13, 7, 1, -2, 4, -14, 8, 3, 2, 0, 8, 10, 5, -3, 0, 4, 7, 5, 5, 9, 7, 1, 11, 9, 9, -7, -2, -2, -1, 8, 1, 3, 1, 8, 11, 6, 0, 12, 2, 8, 2, 3, -4, 3, 2, 3, -4, 6, -3, -2, -4, 0, -10, -4, -5, -8, 1, -5, 3, 2, -3, 0, -9, 2, -13, -5, 5, 11, 5, 2, 8, 7, 8, 2, 1, 7, 6, 13, 18, -2, 8, -1, 10, 5, 4, -3, -3, 17, -1, -3, 0, -2, 0, 5, -6, -2, 2, 0, 8, 2, -12, -1, -9, -1, 10, -4, -6, -6, -2, 2, -4, 0, -2, 5, 4, 4, 6, 1, 4, 7, -7, 6, -3, -7, -1, 0, -5, -3, -2, -6, -5, -6, -5, -3, -4, -6, -6, 6, -6, -2, 3, -1, 3, -4, -7, -4, 7, 5, -4, 1, -3, -7, -3, -7, -1, 1, -1, -14, -3, 3, 1, -2, 4, -3, 2, -5, 1, 3, -2, -12, -5, -8, 4, 4, -1, -7, -4, 2, 4, -8, 0, 2, 3, 1, 4, 12, 12, -7, -1, -11, 0, 3, 10, -1, 11, 5, 6, -2, -8, 4, -2, 2, -4, 1, -3, -3, 4, -8, 6, 5, -6, -3, -10, 4, -4, -4, -11, -3, -1, 3, -9, -13, -7, -6, -7, -3, -2, 1, -5, 5, -9, -6, 4, 0, 3, -3, 4, 2, -6, -2, 7, -3, 2, -6, -7, -3, -2, -3, -7, 0, -5, -4, -3, 0, -6, 9, -5, -4, 1, -4, 9, 2, -13, 1, 4, 0, -5, -3, 3, -3, -10, -3, -6, 7, -5, 5, 1, -4, -6, 1, 0, 13, -7, 0, -2, 4, 5, 6, 9, 6, -3, -10, -2, -4, 0, -5, -3, 1]
3003Aj3NkLnJ2k%n%JJ2rQrNKj1Q%mJlJ4lj3MKNrkJ1Qrj1J1j1J1kNrLj0JPJ0rj
3051bPj0j%NJ0j9nJ7lPJ5j7mjjJ6k9J8OpjJKkmQjKJ0nk2NLKQj1ONrLjq%LJ0j1
3098eMoPlMkKQj3MnJ5lkLnLjklOj4RRj7J1lOokpQloOMPJj0OqJoPJQkMrKjJ3j6
3151aKPOnkq%Oj2J0j3PNqJ8kkqKqMmJ2j6QnJLJJ3j2JjJ2j7J1Jj2LNJo%OpKM%k
3200@jpJ9j0Lj1JNKNj4RlNj0RNJj5J4mjkmQnJ0j4NPLknJRnKJj3NJnJJmJ1pQnJ
3250ErNJmJnJ1NlnmnnJ4Jk%lNlJ4j6J3rrJ0lOOj4JnJ5j0K%qJ1mknRpJ7k0ROnJ
3299CjkjjnJ2lmJ0mKj4RMlLmPpKKj6J1o%J1%j1PLj2LNj5J2lOJnjnQjmJ0jKrLL
3349AJ4j6lm%J4onK%J5ppjJ2jj3%lPj3J1MnJJNlOkkPj1kOoJOoNj5J7lQnKj3N%
$$ y = [1, -12, -7, -9, -6, -11, 1, -1, -1, -6, -6, -5, 7, -2, 6, -3, 2, 4, -7, 1, 1, -3, -2, -5, 9, 6, -7, -3, -1, 4, -5, -7, 4, 12, 3, -8, 3, -8, 3, 1, 6, -3, 0, -10, -9, -2, 8, -1, -2, 5, -5, -6, -6, -1, 9, -10, -15, 2, -1, 6, 21, 4, 0, -1, -2, 14, -15, 3, 9, 2, 1, 2, 4, 2, -2, 6, 5, 7, 17, 12, -10, -5, -2, 0, 8, -3, 3, 8, -1, 2, 1, -7, -7, -4, 6, -5, -1, -7, 0, -3, 1, -1, 1, 9, -4, 0, -5, 10, 7, 5, 8, 3, 6, 5, 3, 0, 6, -8, 1, 10, -7, 4, 1, 7, 1, -1, -8, 0, -3, -9, -3, 1, 8, 9, -1, 5, -3, -2, -8, -1, 0, 8, 6, 10, 1, 3, 2, 15, -1, 1, 8, 14, 9, 7, -1, -1, 5, -7, 3, -10, -3, 2, -6, 12, 10, 8, 0, 2, -6, -2, -6, 6, -10, -2, -7, -6, -3, -2, 11, -1, 0, -1, 11, -6, 5, 6, -6, -3, 2, 3, -3, -3, 3, -4, -2, 2, 2, 0, -1, -8, 11, 1, 4, -7, -6, -1, 1, 6, -8, 1, -2, 3, -7, 2, 7, 8, -7, 7, 3, 2, 0, -4, 4, -1, 9, -5, 0, 7, 10, 8, 3, 4, 13, 8, 10, 11, -2, 3, 4, -1, 0, 1, -3, 8, 1, 9, 4, 5, -4, 1, 2, -2, -1, -6, 5, 10, 7, 2, -2, -7, -12, 2, 3, 1, 1, -2, 3, 0, 14, -2, 11, 2, -7, 3, 0, 6, 12, -2, -1, -6, 9, -1, 1, 1, -7, 4, 0, -2, -7, 2, -5, 12, -8, 1, 7, 2, 3, 2, 0, -1, -2, -7, 5, 2, -2, 8, 4, 6, -8, 1, 5, 2, 5, 1, 8, 1, 3, 5, -11, 0, -6, -6, 5, 5, -6, 1, 4, -8, -5, 0, -15, -3, -6, 0, 1, -4, -5, -10, -2, -3, -7, 3, 2, 4, -5, -2, 1, 15, -1, -4, -8, -8, 6, 0, -5, -3, -3, 12, 5, -2, -3, 9, 8, -5, -5, -8, -1, -14, -3, 1, -4, -3, -2, 3, 0, 6, 4, 2, 9, -2, -4, 2, -4, -3, 3, -3, 2, -13, 4, 1, 9, 4, 6, -7, -2, -2]
3398bkJ1oPpJ2oPj3kljJoJ3j2QRnj3K0j1lnQjOnMj0Nj%PjNj1JLj1J1LmpJRpKl
3447eJ0lJKpMoj%Jj7K0j1J0oMlkK1j8LjMlPj5RKj2J4j0kQLjLPj0Jj4J2KLMlMj3
3494dlNjMjqLPmQlrMJ%KknJ1pR%pmJ0%n%jkpKJLJJ2p%%qMrJNJrJ5jj%pNlJRrj
3551dnJNmKOmp%J2jJNj1lOJjRmLjmMpLkqNNJojJOmOj1mRLomJ3pkNlqNJ2qL%Nn
3607BNKrkkNQj2L%QookoOLPq%J9j4rPjOmj0PmQj2ROmNjJMlojlL%%nJJMJLn%Qj5
3663hJ5jojJ%n%lkQN%Koj4J7Npj3K2qKjj1NPJnk%j3J0MnL%rQj2QMrlJ4jKj2QJ
3713eKJJqLOj0J2qJ4j9RpPjmMO%Kj5PLllMJnQnj0JQqJ2pQq%OnJ1lqJ0j4KJ1j0
3762gJ1j1N%JkjQJkLq%lJ1jLmpRj1RJmnjJ0oJm%%JrOqQKOj0NmLNqLmNoJ4j3O%
$$ y = [-2, -4, 7, 1, 8, 1, 13, 7, 14, 1, -1, -4, -5, -4, -10, 3, -9, -1, 8, 3, -10, 10, -1, -4, -9, -1, -2, 4, -1, 3, -7, -2, -3, -3, 4, 3, 8, -3, -2, 1, -10, 1, 4, 0, -7, -6, 3, -4, -2, -5, 5, 2, 3, 5, -2, 2, -4, -5, -5, -4, -21, -1, -12, -2, -8, -4, -7, -9, 12, -6, -3, -4, 0, -3, 4, -11, -2, 0, -12, 2, -8, -10, -2, 1, 0, 3, 10, 0, 1, -13, -1, 1, 4, 8, 5, 9, -4, -7, -2, -3, 1, 0, -8, -5, 2, -2, 6, 3, -6, -2, -1, -1, 1, -1, -6, 5, -2, 7, 7, 0, -4, 6, 6, 1, 1, 0, -2, -9, -7, -6, -3, -2, 10, 3, 3, 3, -5, -1, -10, -9, -4, -3, -12, 3, 2, 1, 1, -6, -1, -4, -3, 6, -3, -4, -9, -8, -3, -7, -5, 1, -3, -10, -10, 2, 1, 2, 7, -4, -7, -1, 0, -1, 8, 4, 7, 6, 2, 6, -1, 2, 0, -8, -3, 2, 3, -3, -4, -3, 3, -1, 5, -6, -10, -1, 2, -4, -8, 5, -2, -4, 1, -2, -10, -5, 7, -1, 2, 2, 7, 2, 7, 9, 0, -2, -4, 1, 9, -3, 0, 0, 8, 2, -4, -6, -12, -6, -3, 4, -4, -4, 15, 1, -8, -1, -2, 4, 0, -10, -3, -7, 1, -11, -2, 4, 0, 5, 4, 5, 9, 6, 0, -1, -4, -1, -1, -1, -6, -5, -4, 0, 1, 4, -1, -1, 7, -8, 7, 6, 0, -1, 0, 0, -5, -5, -8, -10, -2, 3, 3, 5, -1, -15, 2, 7, 0, -13, 9, 1, 3, 2, -9, -4, 3, 4, -1, -3, -3, -16, -6, -2, -7, -4, -4, -13, -5, -17, -9, -5, -14, -17, -3, -4, -2, -14, -6, -5, -3, -2, -1, -9, -6, 0, -10, 2, -6, 8, -11, -2, -9, -2, -3, -7, -3, 3, 3, 5, -10, -3, 0, -3, -6, -2, -1, -6, 2, -3, -13, -12, -4, -12, 0, -7, 1, -7, -7, -1, -6, 5, 2, -6, 4, -10, -8, 3, -7, 4, -7, -2, -2, -1, -3, -4, 4, 5, 3, 6, -2, -2, -5, 6, 5, 8, 4, -3, 6, -5, 4, 5, 1, -4, -5, 5, -1, 0, -4, -4, -4, -3, -12, -6, -14, -6, -4, 2, -8, -3, -7, -4, 1, -7, -4, -8, -3, -9, 5, -8, -2, -2]
3815bQMrm%PJj6MQJ%ooJ2j1JOkNqNnLpQnPj0J0Nmj0J0lPlkQj2PQj6kJ1nnOPpm
3866eLRj3K%%KjpPRj4PrPMplmNljJMRj1J1ljKj0jJ1qkQJ0j7QoLOj2J3j0kOmRj0
3916hKKlJJpPKNpqQm%LmJ2mJ0oqJ7j2L%KrLkrQkRqlMkMjJrNJLOqjkjQoLqO%J1
3972Eq%%Oj4QJ4j6RoRjmmRrlKkRoJk%jk%lRKKj2oJ1KkjmQnJjPrNKN%jojJ0jj1
4026e%OojkRpoJ6rjPnoO%kJ%pJ2rLlKQ%j0OLpQpLNMoJ0pLLLjj7PmJ1loJ%jj4J2
4080ckJ0p%MpJlMQOrpQlQlJ%Jj3nJ6kko%jJ7j6LKoP%pkJQllMkJK%kkJJKnJ4j0
4134a%J0jrqNNNmjj0J3MrL%M%Jqmjj0J4kLRj3PrJLOoOj3PNj0J5j3nJ9jmKKlmM
4184DmPonJ4j0LjmnJQL%j%n%jLkjMJ0j5nmQLLJpnJ2MmL%LnPmrl%J%J2qJKOnNq
$$ y = [-2, 6, 10, 1, -3, -3, 4, 5, -11, -7, 1, 2, 2, -4, -10, 2, -9, -8, -2, -4, 1, -7, -2, -7, -4, -11, -3, -8, -1, -11, -1, 4, 0, -10, 0, -3, 4, 1, -1, 7, -5, 2, 10, -6, -8, 3, -2, -7, -1, 6, -1, -5, -2, 7, -6, -4, -4, -4, -2, -3, -10, -3, 6, -8, -1, -10, -3, 1, -6, -9, -13, -8, -11, -12, -11, -7, 2, -9, 2, -1, -2, 0, -10, -11, 0, -8, -10, -2, 8, -9, -1, -7, -4, 2, -10, 3, -7, -9, -3, -7, 2, -8, -6, -4, -7, -6, -5, -12, -5, -3, 2, -5, -13, -5, -9, -9, -6, -10, 2, -2, 8, 2, -6, 11, -1, 2, 2, 4, -5, -2, -4, -13, -5, -7, 2, -6, -9, -5, -7, -3, -4, -3, -12, -7, -6, -3, 3, -5, -6, -8, -9, -1, -7, -4, -12, -6, -6, 5, -3, -3, -3, 3, -11, -3, 11, -5, 4, -2, 7, 6, 2, -2, 7, -2, -5, -3, -5, 4, -2, -1, -3, -3, -4, -6, -6, -9, 0, 2, 4, -8, -14, -3, -1, -3, -4, -8, 0, -5, -4, -5, 2, -7, -2, 0, 5, 5, 4, -2, -3, 7, 6, -5, -5, 1, -5, -6, -8, 1, -6, -12, 4, -5, -6, 1, -4, -10, -4, -4, -6, -5, -5, -12, 0, -9, -6, -9, -7, 1, 1, -9, -3, 0, -7, 1, -6, -3, 2, 6, 0, 10, 3, 6, 9, 12, 11, -6, 1, -3, 8, 5, -1, 0, 0, -1, -15, -3, -5, 5, -2, -2, 2, -5, -4, -7, -3, 5, 11, 2, -5, 3, 0, 8, 5, 6, 6, 7, -6, -11, 5, 3, 1, -5, -5, -6, 11, -5, -2, 0, -6, 1, 1, -6, -8, -7, 1, -2, -5, -1, -3, -2, 0, 0, -2, -4, -3, -2, 0, -5, 9, -1, -1, 9, 8, -1, -9, -4, 1, 6, 2, 1, -9, 4, 8, -1, 2, 2, 6, 6, 7, -1, -5, -6, -16, -2, -4, -1, 8, -5, 2, -7, -6, -3, 3, -3, 3, -10, -3, 2, -8, 7, -6, -11, 8, 7, 3, 5, 7, 4, 0, 4, 0, 7, 1, -4, 10, 0, 3, 2, -2, -7, -6, 2, 5, 5, 4, 4, -1, -1, -2, 1, -1, -2, 2, 12, -3, -8, -12, -4, -1, 2, 3, -4, -9, 3, 7, 3, 6, 6, 9, 4, 11, 7, -2, -5, -5, -4, -4, 8, 0, 1, 3, 9, 4, 9, 1]
4239AmPljmRlpJJ0qlkmJ1nOqNjlnJ8r%pRkjOqjRj1KJ2nmJKnRoMj1J0Jj7MJ1Mm
4291@NrOLoKQj3J4j3KOlmLJmkPkllJ0o%OmmqJJJK2ooKkJNj2QnpLjKQj4J2lmQK
4344EoqJ5j2J2j1LjOJ1qrj2K4nrOnkJ0%pJnJ3rpJ3PoLj4J8j0nJ2qKLljLkJnLJ
4391BQKqm%kOlMJJ0j2j4J3oOpJ2pJ0j5O%OmkK%NqOJljRj4MpPLmMlkNj1JqJ9Lj2
4442bJ2j0Olj3J0j2J5%Jjm%KkMkRj7RJ3j2o%J7j6KoPKLkpOKLnlmPMoPrKjmNLo
4492bLpkJ2oJ%jlRlJ0j3J0kj0MjljjNPj1QJ2%l1RJ1k%nNkOqJ0kmPj0%J0mpLOj1
4541dJ3j1MoqK3j1Nj1J1kOpmQkNpQj1JJ1nmnJ0j6J0mLOLoj0lJ4nqRJLlK%l%lR
4589FlrJ4lj0J0J0k0lJ3mJmNPrKolQp%LLKNj8LMnPKMk%nKKkKnJ1j0J2j5RnLOj1
$$ y = [1, -3, 4, 1, 0, -4, 5, 2, -5, -4, 6, -2, -5, -7, -11, 0, -5, 1, -7, -2, -3, -6, -11, 7, -2, -2, -9, 0, -2, -3, 3, -5, -6, 3, -8, -6, 6, 1, -3, -2, 0, -5, 4, -2, 2, -9, 1, 2, -15, -11, 0, 4, 0, 5, -4, 2, 5, -1, 1, 9, -4, 10, -3, -1, 5, 2, -2, 1, 2, -2, -4, 3, 1, -2, -5, 5, -1, -1, 5, 1, -3, -11, -10, -9, -8, 14, 8, 2, 4, 2, 3, 8, -4, 4, -1, -8, -5, -6, -4, 4, -10, 2, -1, -5, 3, 5, -1, -9, 6, -6, 6, -5, -2, -3, 3, 14, 6, -3, -15, 9, 4, -5, 1, -4, -6, 4, 4, -3, -2, -7, 6, -3, -10, 3, 10, 4, 7, -7, 11, 1, -4, 8, 0, 2, 5, 2, 1, 4, 2, 3, -2, 1, 2, 10, 12, 4, 0, 0, -2, 4, 1, 5, 6, 16, 4, -10, 3, -3, 3, -4, 8, 1, 11, -4, 2, 2, 8, 4, 2, 4, 4, 9, 1, 7, 8, 5, 4, 13, -1, 3, -4, 3, 6, 2, 6, 3, 1, 6, -5, -4, -12, 7, 10, -2, 10, 0, 6, 3, -10, 0, -12, 3, 3, 4, 3, -1, -1, 1, -1, 3, 1, 10, -7, 2, 15, 3, -3, -3, 14, -2, 0, -6, 1, 3, 6, 4, -3, 3, 5, 8, 3, 0, -4, 3, 7, 1, 8, -1, 1, 0, -4, 1, 4, -2, 1, -6, -8, 4, -2, -1, -1, -2, -5, 4, 1, 11, -2, 8, 6, -4, 0, -1, -4, -5, -6, -1, 6, -5, 3, 15, 15, -16, -7, 4, 2, 2, -3, 2, 0, 6, -2, 8, 6, 2, 9, -1, -1, 9, 5, -2, 1, 7, -4, 9, -2, 2, -4, -12, 11, 0, 5, -6, 5, 3, 9, 2, -2, 6, 4, 9, 2, 10, -1, 0, 11, 6, 2, -3, 7, -9, 1, -3, 0, 6, 9, 3, -7, -10, 4, -1, -9, 0, 1, 4, 1, 3, 3, 0, 0, -3, 6, 3, -6, 8, 5, -5, 5, 15, -5, -8, 5, 1, 2, -2, 3, 10, 1, 3, -3, -6, 2, -5, -5, -2, 1, 3, 8, -10, -7, -3, -8, -1, 1, 5, 3, 3, -2, 0, 2, 0, 2, -3, 8, -2, 10, -5, 4, -1, 2, 8, -3]
4639cJ0kj2J8plLq%pJ4rJjNNKj2LKPnjOpJ2j0njJ4mj0JNNjnOoq%MLRmrJ2%rMJ
4690CLo%kPPj4J0pkJ0j2MLrQklKlOqOKm%Rlmj2PlNlJ6j2PrN%OJojPkpQlM%mnO
4744FomLRqKLj6LPPj8KQ%MLqLJ0j2JjjMKj0QkJKoJ3%rnPLmMlnJ0qNLrNOnjqJ0
4797ElKkLoRJqKmQPj9J4jnjKjlJ2KlrK%jmLj3OJ1Jmj1J3LqMKpLpONmKjKjmNLq
4851@%PNqJOnmPlrPLnrQLKj7K3k0J2%JMoj2kJ4pKjJ0mNrJ0nrPlMMj2N%OomMJ0
4902A0mjn%P%jKqljKKMlLk0KJ3lN%JoJQnLQpLlkj1QKmPRj1lLRnmlNKoJ3mKk3J3
4956ALLkkmPj2J2pLmnJ7rJ5k3QpJkQ%%lJ0j2QkPJj5RqLjJ2rK0j0nj0lJ3j0mNP
5003DJrJ0rJJjnjJ6JmrKJMj%Nj0J2pj0LRmlkM%%oLJMmPnKmOr%Mj1J4mnOMj0J2
$$ y = [-3, 7, 5, -7, 11, 4, 1, 4, -4, -4, -11, 3, -6, -5, -6, -1, 4, 6, -6, -3, -1, 6, 1, 0, 6, -1, 11, 1, -4, -5, 9, 5, -5, -4, 1, 6, 5, 0, 6, 0, -8, -8, -4, -1, 8, 4, -5, 7, 7, -2, 2, 3, 6, 0, 0, -2, 5, 12, -2, 8, 1, -1, 9, -3, 1, 4, -5, 3, 1, -2, 0, -3, 3, -5, 1, 3, -1, -1, 8, 5, 1, -11, -4, -7, -2, -5, 11, -1, 6, -3, 2, 2, 8, 9, 3, 2, 9, 7, 0, 8, 5, 9, 9, 5, 0, 6, 0, -4, -1, 8, 0, 2, 5, -11, -8, -1, 6, -12, -10, -2, -2, 2, 5, -3, 0, 10, -2, -1, -2, -3, 1, 3, -7, 1, -1, 0, 2, -4, 9, 9, 0, -5, 2, 5, 1, 5, 2, -3, 7, -1, 4, 7, -2, 3, 9, 4, 3, -5, 5, 2, 4, 2, 5, -1, 8, 9, 1, 3, -1, 7, 14, -5, 9, 8, 3, 2, 4, 3, 0, 12, 14, 11, 2, 4, 4, 3, -1, 2, -11, -5, 6, 7, 3, -8, 5, 8, 0, 4, 6, -1, 2, -5, 1, 6, 2, 4, 3, 5, 4, 0, 5, 8, 0, 0, 7, 12, 4, 5, 11, 6, 2, 9, 6, -3, 4, 7, 2, -7, 1, 4, 6, -11, 12, -8, 4, 4, 5, 9, 3, -9, -11, 3, -4, -2, -3, 7, 3, 8, -1, 9, 4, -5, 2, -1, 3, 7, -5, 0, 0, 6, 0, -4, 0, 10, 6, 5, 0, 0, 7, 7, 6, 8, 0, -3, -4, -2, 0, 4, 1, 4, -16, -14, -1, -4, 1, 1, 2, -4, -3, 5, 0, 3, 11, 4, 7, 4, 2, -9, -1, 1, -3, 4, 13, 2, -1, 2, 11, 6, 2, -1, 4, 6, 0, 13, 9, 11, -12, 1, 4, 7, 5, 3, -1, 6, -6, 6, -1, 2, -2, -7, 10, 1, 16, -7, 1, -6, -5, -7, 1, 1, 1, -2, 8, -4, 4, 2, 9, 10, -5, 4, -4, -1, -2, 10, 1, 21, 11, 6, -4, -7, 6, -4, -8, -3, 4, 5, -4, 6, -3, -2, -1, -2, -7, -8, 8, 9, 5, -4, -2, -1, 3, 2, 2, 7, -3, 9, 2, -8, -5, 4, 0, -3, -5, -1, -1, -1, -7, -4, -3, 1, -3, 4, -1, 1, -3, 3, -6, -6, -2, -13, 1, -3, -8, -2, 2, -8, 4]
5055Dj6J5j0J2nlRj4MRpJ4k1J4pJ4rj5J0PpjJ1rNrJ0j2J3nJ%JJMj6J2lnNJmML
5099EqkLkJ6j5QlpRNlpLnJ4mqjJ1pMjJkmJ1rJrJ0rJ3lolO%J1Lj3Nj0LNqOmkLK
5150CJ3j5%LNjqJLk%l%jOJNj4PlM%%j6PJ1j0RljnJ1j1RqJ5j8RpMNLLpj9K3j0m
5198fNMKnOJPj1Lj0MOplNLloQj0J1j2J3pJ2ojJkkOqqJ2nPlpMMnQmJ3j7RrPln%
5249dlKnJ1MnK%mKOj5PR%j3J0mlNLkJNj2NlrJ6lqJ6j0%O%j2%J0lOoMJoJ0j2lR
5298ErRnJ9j6jnQJPrJ0qklOj0RlMnjoJ0lkMlJnJ0m%j1J1j2J4j2kPMl%%nLLjj1
5347a2RJjKOJJMj1%Oj4MJ5j5jLQjlNpmRlJ2j3%lQMj2lK1rn%%lP%KmoJ2pQopJ2
5397A0rLmlJ1jrJNoLlkJ1lnJlMLnoQm%OkkQnPoj2KJ8r%pO%LokJ3joKKjqLJ2j5
$$ y = [4, -12, 3, -7, 5, 0, -3, 6, -8, -4, 5, -2, 12, -9, 5, -2, 12, 3, -12, -2, 5, -2, -3, 8, -1, 4, -5, 5, -7, 6, 1, 2, 2, 3, 4, 8, -8, 4, 1, -4, 1, 2, -2, 2, 5, -3, -5, -2, -4, 12, -3, 5, 2, -5, 4, 9, 6, -1, 2, -3, 11, 7, -1, -2, 9, 2, 6, 5, 6, 4, 0, 11, 2, 3, -6, 4, -5, 8, 5, -1, -4, 2, 2, 13, 16, 3, 8, -2, 1, 6, -2, 4, 0, -2, 1, 3, 16, 1, 1, 4, 9, 8, 0, 1, 4, 2, 2, -1, -1, -2, 4, 5, 10, -4, 3, 0, 4, 4, 4, -12, -5, 6, -4, 5, 2, 1, -4, 7, -4, 5, -3, 12, -6, 3, -4, 0, 5, 8, 11, 4, -15, 8, -2, -6, -1, 3, 5, 0, 6, 7, 14, 3, 6, -4, 0, 6, -1, -4, 1, 4, 1, -5, 3, -7, 4, -8, 5, -2, 10, 4, 3, 4, 2, 0, 6, -2, -10, 2, -3, 4, 1, -6, -2, 2, -3, 5, 1, 14, -3, 6, -3, 4, 1, -4, -4, -7, -5, -10, 1, 5, 0, 2, 2, -2, 0, 6, -9, -2, 7, 7, -6, 4, 0, -3, 2, 5, 3, 4, 9, -3, 2, -1, -10, 6, 3, -5, 11, 1, 1, 7, 7, -5, -5, 5, 2, 8, 2, 6, 7, 1, 11, -1, -4, 5, -4, 5, 0, 19, 3, 2, -3, 5, 6, 13, 4, 14, 6, 4, 1, 7, -3, 6, 3, 7, 2, 1, -5, 5, 2, 0, 4, 1, 2, -3, 7, 3, 3, -8, 3, -9, 5, -7, -9, -2, 2, -1, -1, -1, -6, -3, 0, -1, -12, -3, -2, -3, -1, 5, 6, 7, 11, 0, 0, 6, -8, -4, 11, -4, -5, -2, 6, 5, 2, 7, 0, -4, 5, 2, 14, 1, 1, -2, 6, 10, -2, -5, 16, 7, 2, 2, 2, -1, 6, 6, 8, 4, -2, 10, 3, 11, 5, -2, 10, 1, 4, 0, -3, 8, 7, -2, -1, 4, -2, 1, -2, -4, 7, 4, -1, 0, -3, 1, 4, -1, -7, 1, -3, -3, 3, 1, -1, 7, 2, 9, 3, -9, -7, 11, 2, 2, -5, 1, 1, 4, -2, -4, 9, 8, 2, 4, 6, 5, -3, 0, 12, -3]
5450cNmJ0r%nKOpQJJkJQj1j1J1LO%Jj4RlRpolPLmkLmJlLkOnJM%jjNj1jNqRMKn
5505BjMlmJ2j6J2mP%j0OoQpNmkNMoMJKoKj2MmKOOJknJkoJ1JlMnjj4J7Jo%OJLq
5558AL%qJ1j0J0oJLmQrJKpJ4j7QlNpPm%%KoLOrKQqKQKpNnjLjJL%kkjmkJ2j0RK
5612IrjNojM%oNNoKmNPlNj3LRlj4KLoRkLPJppK%lNpJ3oNpoN%J0j0KnRqPOj1MJ
5667BJMmlj0jJ0lkjOMk%NKj2PmNpPjj1JJ6j6PkLKlRj3kQkkJnPj2QLjJPmJ2j3K
5718DrmQJ1rlJ2j0n%J0m%j0J4kmPnnjOJnkoK0rLj1JNKqONoP%pKlmPKKNoKMj0J
5770aPjlmJmJ4pj0ONlLj4kJ3kOj0J0j5KJ4Oj4LoNLkkJlKOJ%k%jK%%l%pJ4j6J5
5819Gj0kQNlJjqMJKNj1P%mRj4MmnOpJ4mkJ8j8lMQpkJKJ2k4RJQj2kLlPpKKqJ0Q
$$ y = [-3, 2, -2, 8, -1, -1, -6, -4, 2, -5, 3, 4, 5, 3, 4, 12, 1, -10, 1, 4, 10, 10, 11, -3, 6, 3, 12, 5, -1, -4, 3, 6, 2, 0, 3, -1, 0, -3, 0, -2, 4, -1, 0, 4, 4, 3, 2, 7, -4, -5, 0, -8, 1, 5, 7, 2, 1, 5, 2, -2, 10, -6, 6, 2, 9, 9, -1, 5, -1, 7, 0, 5, 1, -1, 4, 8, 2, 6, 7, 9, 3, 5, -7, -3, -7, -5, 1, 7, 8, 6, 1, 2, 0, -6, 5, 6, 3, 7, 2, 1, -13, 4, 5, -1, -1, 5, 6, 9, 1, 4, 4, -4, 7, -3, 7, 1, 2, 5, 1, 9, 0, 1, 3, -4, 10, -7, 1, -2, 3, -4, 3, -1, -1, -1, 1, -5, -2, 4, -5, -3, 5, -3, -1, 7, 9, 2, 7, 2, 1, 4, 3, 4, 7, 7, 5, 3, 2, -2, -4, 8, -2, 7, 9, 0, -1, 4, -2, -3, 1, 1, -5, 0, 5, -1, 1, -3, 2, 9, 6, 11, -2, 1, 10, 7, -7, -5, -2, -8, 1, -1, 2, 9, 10, 3, -4, -2, -2, -5, 0, -7, 6, 0, 5, -2, -8, -3, -3, 7, -3, -1, -6, 3, -5, 2, 8, -3, 1, 2, 3, 7, 3, 0, -10, -11, -1, -4, -6, -7, -1, 3, 1, 1, 6, 8, -4, 3, -1, 4, -3, 4, 3, -8, -7, 9, -7, 0, -2, 1, 3, 0, 9, -4, -6, 2, 0, -2, -1, -6, 1, -11, -3, 0, -1, 0, 7, 3, 15, 2, 4, -5, -9, -1, 10, 1, -2, 10, 0, -5, -5, 5, 1, 1, -9, 5, 3, -1, 6, 1, -4, -5, 1, 2, -3, -5, -11, 9, 0, 3, -8, -7, -2, 0, -8, -2, 3, -3, 4, 4, -3, -1, -4, -8, -1, 1, 3, 8, 2, 4, 8, -2, -1, 6, 5, 2, -2, -1, -5, 9, 2, -8, -2, 3, 0, 3, -11, -13, 0, -2, 4, -6, 4, -11, -9, 5, 11, -3, 0, -6, -1, 2, 0, -2, -1, -4, -2, 4, 5, 5, 3, 3, 2, 4, 4, 4, 1, 1, -6, 8, -8, 7, -3, -5, 3, 8, 5, 6, 5, -3, 1, 2, 4, 9, -2, 5, 5, 1, 10, -4, 0, -4, -9, -3, -10, 4, 0, -2, 16, -2, -5, -1, 7, 0, -2, -1, 1, 13, -11, -2, -1, 7, -5, -7, -4, -7, 0, -7, -5, -3, -11, -1, 7]
5870G%qJ%KnMj2J7qnKJ0qjQk%pJ3rjJ1mpOjpRlj1%QkMnjLMqjKQj1POj3J1qOpJ0
5922DoOljqMPrNlJ0Jmj1pJ2KQNj3LMKkonJOJJJ1j1rkJ1%j3MKlMNOnmJ4j2k%%J2
5973A2qjPNr%Jj0J3j5MPj2mJ2j2PJ3kpJ3j7%lMN%mJOmKNnNnj0J3Kn%rJ2j3J2P
6019A3qOj4KJ2kpN%oO%%j6jMJ2mj2oJ1MMjjKj3J1NqMOKjj3PLkMPj2NOj1LkjKk
6068ClMkQj0MPknrJ2j2OlLN%j0J5lnlOjj4J4J0k9J7MolPJlRpkoQJj2J2nlJJ3j0
6116BlLnJPoJ1j1J0mj3Pj3RJ5oJ%JMoNpjkNjNqoPKoJ0Lmj1NJ1Nk1KJjMjOnM%n
6167@Olj1Pm%QrJ2mKnMmJ1j3PoJkNKk%%Oj3OLmJ0j%jn%Kj2J1PJmrMLkNp%kJjK
6220B%nJ3nLj5Rk%OmKo%nRqNQj1oJ4nK%Lj5K2j2J0j0KJojOL%jqjPLlnJ2jj8K1
$$ y = [7, 7, -1, 0, 0, 2, -3, 1, -11, 6, -2, -7, -5, 5, -3, -4, 4, 2, 2, -5, 8, -1, -2, 9, 5, -2, 4, 3, -4, 5, 2, -9, -9, -1, -3, 1, -4, -5, -2, 2, -6, -7, -5, 3, -8, -1, 5, -8, 3, -5, 1, -6, 4, -2, 4, 1, 0, -8, -4, 3, -6, -1, -4, 6, 7, 3, -8, -15, -3, -1, 7, 12, -1, 2, 6, 8, 6, 0, -5, -4, 2, 3, 4, 15, 4, -5, -7, 4, 4, -9, -5, -3, -6, -2, 3, 9, 4, 0, 14, 2, 0, 0, 0, 12, 4, 3, 10, 15, 6, 6, 7, -3, 10, -5, -1, 6, -6, -10, 2, -10, -3, 10, 8, 1, 14, -3, -3, -6, -2, 3, 3, -1, 0, 6, 2, 4, 9, 4, 9, 4, -6, 7, 9, 4, 4, -5, 7, -6, 6, 13, 5, 11, -3, -1, 11, 9, 2, 7, 7, 1, 7, 7, 7, -9, -10, -6, 6, 2, -10, -16, -5, -1, 3, 2, 1, 3, -10, 1, 6, -2, 2, 8, 10, 9, -4, 3, 6, 4, 8, 15, 3, 8, 14, 3, 6, 4, 3, 5, 3, 0, 4, 2, 10, 0, 4, 11, 9, 4, -5, 7, -5, 1, -2, 1, 6, 6, -4, 11, 8, 3, 0, 6, 5, -9, 5, 15, -14, 3, 7, 1, -2, 5, 6, 3, 12, 5, 3, -3, 5, 6, -6, 6, 1, -2, -1, 12, 2, -1, 2, -3, -2, 5, -1, 10, -1, 9, 5, -8, -1, -14, -5, 10, 4, 5, 5, 6, 10, 4, 9, 2, 1, -1, 4, 3, 8, 0, -6, 1, 3, -3, 7, 10, 6, -5, 0, 11, 16, -5, -3, -2, -3, 1, 0, 6, 1, 5, 5, 0, 6, 3, -8, -1, -5, -5, 3, -6, 6, 2, 4, -1, 3, -1, 10, -3, 4, -2, -1, -3, 2, 4, 2, 2, 2, 8, -5, 1, 4, 0, 10, 9, 9, 8, 3, 3, 5, -7, 4, 11, 12, 8, -1, 3, 6, 4, 9, 2, 2, 0, 1, 0, 2, 2, -3, 10, 5, 8, -7, 2, 0, 0, 6, 2, 4, -2, -2, -7, 2, -6, -1, 7, -4, -10, 4, -1, 1, 1, 4, -11, 11, -1, 9, -1, 1, 2, -4, -5, 1, 4, 4, 3, -5, -6, 1, 4, 1, -4, 8, 7, -11, 10]
6269A0j1Oj2NKJmKnPjKllPjpMJ3j5J1j5JOlNoNm%OqJ1j2J0nJ0nrJ3j2LJ0j4JN
6315AqRKj2lJ7j7J0KjKqLKLpmLLRnjJoOnRqJNnNjLjnJJOmKMmkPj0M%OloJj0MJ
6370cNKj4QrOPlPmKNj1%j%P%kK%m%J2qj3J9j0MppOJQlnNoJ0j2MjjMrKKQnMpLL
6423ARnpLJ1j1Qj5kJ2j1J4l%qMN%oKplJJ2j1J8nomJJljJ1qMljNmm%QmmQnJ2j4
6472eJ1j0PNj2Olj3RP%mlRj3J5pnLJlJMjMj3RRqmjPn%JqJ7njj1NkJJ9k0RolJ3
6521FjM%j7J0nKl%nRnMLnnjJ1qkMkKjkOlm%OlRrQrPlLkqJ2j2J1KoPpoMjP%Omr
6576eJ3j0PrLPqjnkJJ2Lj2pJ3nJmJQKMrOj2RKqJ4nKj0PloJOj4K1j0kJ4nrK%jJ
6625bKMKJj6J6Mj4PLoRqLrJLJ4rqOomJ9j8J1mlJ2pKrP%qJ0%qKRj2Pm%RqLKMkk
$$ y = [10, -1, 5, -7, -2, 0, 1, -3, -1, -6, 1, 0, 2, -1, -4, 3, 2, -5, -1, 12, -3, 8, -7, -6, 0, -3, 2, -4, 1, -3, -3, 3, -5, 6, -6, 4, -1, 9, 4, -5, 8, -4, -1, 9, -5, -4, 1, -7, 2, 4, -8, -11, 6, -11, -1, 1, 0, 2, -6, -3, -1, 2, -5, -9, -6, -3, 6, 1, 0, 1, -5, 1, -4, 5, -3, -2, 3, -2, 3, 2, 5, 4, -1, 0, 1, 7, 3, 5, 9, 5, 3, 10, 0, 4, 4, 10, 7, 1, 2, -8, -4, -3, 2, 4, -10, -2, -11, -5, 2, -1, 6, 2, 4, 9, -2, -2, -3, -3, 4, 4, 2, 4, 4, 0, 0, 12, 4, -9, 10, 0, 4, -3, -10, -4, -3, 5, 2, -3, 2, -4, 6, -6, -2, -3, -4, 0, -9, -7, -5, 3, -2, 2, -5, -2, 1, 10, 5, -2, 1, 12, 1, 9, -6, -8, 4, -7, 7, 4, 4, -4, 0, 5, 5, -1, 1, -6, -9, -8, 4, -7, 11, 6, 0, -4, -3, -2, -5, -6, 5, -3, 1, -2, -3, 2, -2, -6, -6, 2, -2, -6, 2, -3, 9, -5, 6, -4, 3, 8, -4, 2, -1, -14, -5, 2, 2, -2, -5, 4, -9, 6, -1, -6, -3, -2, -5, -4, 0, -1, 3, -10, -1, 8, 0, -4, -5, 2, -3, -3, -2, -10, 7, 2, 1, -10, -5, -7, -6, 13, -7, 2, -4, -7, 6, 5, 9, 9, -8, 2, -3, -1, -4, -4, -9, 0, -5, -1, 2, -3, -8, -9, 2, -6, -8, -4, -6, -4, -5, -7, -1, -4, -8, -8, -2, -5, 4, -5, 3, -6, 1, -2, 1, -1, -9, 3, -9, 2, 4, -2, 5, -2, -8, -4, -5, 2, 2, 8, 4, -5, 8, -2, 5, -4, -1, 6, -2, -3, -8, -10, -9, 3, 6, -6, -13, 0, -5, -4, -8, -7, 1, 3, 7, -2, 4, -8, 1, 3, -5, 9, 4, 6, -4, 3, 0, -6, -5, 1, -13, 8, -2, -4, 10, 5, -4, -2, -2, -3, -2, 0, 4, 6, 7, -9, 7, 11, -3, 4, 7, 1, 10, 2, 5, -4, -3, 0, 14, 5, -3, 3, -3, -7, 12, -6, 5, 1, -2, 10, 3, 5, -4, 3, 3, -5, 5, 5, -3, -1, 8, -4, 3, -1, -1, 8, 0, 3, 5, 9, 7, 5]
6676EM%j0%%Ljj0PjJ5j1kpQKj1J7kkpOJj4PlMPj1JNKqLmJ1j1MKkKJ1kqQj1jNN
6725FnQj4JKM%KOj2Pj2MjPoKJJ0j0mJlJJ3j1Qj0OJ5j5mlOjkPjlmjMJ0lqNj3J8
6773HlkMj2Rj1NkJjRlOj2QMnrNJpJ5ljjj8K1Kj7KMJ0qrLQ%%Kj3KNLrJ3KmRj2J
6823@mMqLOJK%mJ%j2QJ0q%J1mkj3J3PjnpJ0qJ2lnmQrRnnJ2j1NmJMkKOnj0O%Mj
6874EnMKqQLj0NnK2roLJJOqNk4NNoJ6mjMlKj1J1p%QpmlPPkj4K3j2Pj2J3pPpqJ9
6924A6mj3NLJpKkNOj%Nj1PMj3J5k0J2OqOpKjkk%LrjRMjlJJjPLlj5%rK0j0Nn%J4
6975A4qNj2QLqjRoNmOj4Rj4QrJ0jqJ0J1j6RnoPmO%Jj2MRlNj0jkJ4nljQmlMrRp
7025bPOoKjj1J2Oj7lQ%OkkmMJ0pOj4KP%qmJ4mlLpJ3j4mLRKpKRKrLJrPjokLPJq
$$ y = [5, 9, 9, -1, -1, -1, 2, 1, -9, -2, -3, 12, 1, -1, -8, 0, 2, -9, 8, 6, 4, -3, 3, 4, -10, -3, -6, -2, 5, -6, -5, 0, 2, -6, -3, -7, 4, -7, -3, -1, -3, -1, 10, 8, 0, 8, -3, -4, 1, 6, 1, 9, -5, -4, -2, 2, 2, 4, 10, -2, 5, -7, -3, -4, 3, -3, -1, 0, 10, 0, -4, -3, -6, -5, 8, -3, 5, -5, 1, 16, 1, -3, -6, 0, -1, -3, 4, 3, 0, -4, -5, -1, 9, 6, -2, 3, -10, 8, 5, 3, 7, -5, 4, -7, -2, -4, -3, -4, 5, 2, 8, -4, 4, 8, 3, -6, -1, 0, -7, 8, 5, 4, 3, -15, 6, 8, -9, -7, -3, 7, -1, -10, -7, 1, 1, 1, 3, -10, -8, -3, 0, -9, 4, 6, 2, 11, -1, 0, -4, 0, -8, -5, 1, 2, 4, 4, 0, 1, 1, -11, -3, 7, -1, -1, 10, 6, 4, -9, 4, 11, 10, 5, -2, 8, 0, 12, 9, 4, 0, 8, -1, 8, 3, -2, 10, -1, 4, 0, 1, 5, 3, 5, 11, 6, -4, 2, 2, 6, 5, 0, 4, 6, -2, 6, 9, -1, 4, -1, 21, 12, 6, 9, 10, 11, 17, 9, 14, -10, -5, 0, -6, 10, 6, 5, 9, 6, 8, -3, 8, 1, 1, 9, 2, -2, -5, 2, 9, 7, -7, 16, 4, 11, -1, 12, 5, 12, 5, -3, 16, 12, -1, 4, 7, 8, 1, 3, 1, 6, 12, 11, 11, 16, 5, 12, 16, 3, 18, -2, 10, 16, 8, 14, 7, 9, 8, 6, 4, 4, 7, -2, -3, 6, 10, 9, 6, 7, 8, 7, 14, 17, 14, -1, -1, -10, 10, 0, 5, 0, 0, 14, 6, 11, -1, 7, 10, 2, 1, 10, 4, 9, 5, 11, -3, 6, -8, 0, -9, 1, 0, -8, 2, 13, -3, 6, 1, -5, 2, -2, 4, 4, 5, -7, -3, 6, 3, 8, -2, -3, -5, 9, 4, 1, 0, 8, 4, 1, 5, -4, 5, -2, 5, 11, 5, 7, 6, -5, 7, 13, -4, -7, 1, 1, 7, 5, 3, -1, 3, 13, 6, 12, -2, 0, 7, 7, -1, -5, 9, 5, 2, 5, -2, 11, -3, -7, -4, 5, 7, 0, 2, 11, 13, 4, 7, 8, -1, 6, 5, -1, -3, 0, 7, 8, 0]
7078@nJ1lnMLkJ7k3NrJ1mMkNnNJjlNqnJ4krNlMJmJ4j6L%JkpOm%LJ1j2J0j0NJn
7128@QKnJoJ0Lj1J5j8OrJ2nkJ5nnoOKj7RQqNNnnjoJ3Jlj0J8ppOrPnJ5j6J0rOl
7176@Njj%J%Oj2J8orPMrkmOJjKpKlKKOrKOoPj0LJ0kOj2JKrRKJlqJ3Jj0Rj0MOJ
7229A1Mr%Qj4J3j1kJ3nkpjRj3J0Qjlj2MOj1MnQPj0JJ%%NoRqJlOKlkjO%oJ0j2L
7278BJ0qNmnnQM%mmLJ2k3Q%%PjlLm%PJrJ4j5MKpmJ8mj8OJ6moJ0j3J%J5nj4J2j2
7326dMJ7j7r%J4Nmj0J5mqkO%qNj3J4KlO%RnKj3OnJ1okoJ0qmJ2Mj2J1jqOj1J1%
7372Gj%jj2RPJj1kOoJ1kkoJ0%KqOnM%OoqQj5RlQjNqj2J3q%J4%oqJ6p%MmLkkj3
7423a0QNqlQ%JMj%oLJNj3J5j1L%kJ2j1OkpkJ7j5KOOoJ1pj0PkJ0pmJJK%nJKPqR
$$ y = [0, -5, 6, 3, -2, 2, 5, 3, 20, -3, 2, -7, 4, 0, 4, 2, 7, 2, 7, 8, 7, 4, 9, 1, -4, 10, 8, -1, 4, 1, 5, 6, 2, 16, 0, 3, 3, 4, 2, -5, 1, -3, -3, 0, 11, -1, 9, -1, 4, 5, 0, 8, 10, 5, 6, 0, 10, 13, 2, 17, -1, 5, -4, 8, 3, 1, 16, 11, 6, 0, 6, 8, -9, 0, 8, 0, 5, 10, 5, 0, -1, -7, 6, 7, 4, -6, 12, 5, -2, 4, -5, 2, -3, 12, -4, 6, -3, 3, 0, 5, 4, 3, 3, 4, 4, 10, -2, 16, 10, 1, 8, 12, 3, 1, -3, 3, 4, 3, 5, -2, 0, -3, -1, 1, 7, -2, 0, 6, 0, 7, -3, 0, 10, 8, 14, 2, 3, 5, -4, 5, 7, 8, 5, -3, 10, 11, 1, 10, 0, 4, 10, 11, 15, 6, 6, 14, 0, 13, 2, 0, 13, 8, 6, -1, -2, 7, -6, 4, 12, 11, 8, -4, 0, 6, -5, -1, -6, 2, 9, -1, 0, 1, 1, 1, 6, 0, 9, 1, 2, -1, 5, 7, 4, 2, 1, 7, 7, 1, 11, -1, 2, 12, 4, 9, 5, 0, -5, 3, 7, 7, 3, -1, 2, 14, -9, -1, -1, -1, 6, 5, 2, 5, 1, 1, 8, 9, 0, 14, -1, 3, 5, -2, -6, 12, 8, -10, -4, 12, 8, 2, 12, -1, 0, 0, 15, 10, -4, 8, -4, 0, 17, 0, -9, -9, 5, 10, 6, -4, 11, 7, -1, -3, 3, 3, -5, 0, -13, 1, 3, 0, 6, 6, 15, 10, 12, -1, 5, 0, 11, 5, 3, -3, 7, -1, -5, 7, 11, -1, 10, 9, 1, 7, -4, 7, 7, 6, 6, 5, -7, 2, 9, 10, -1, -3, 3, -3, 8, 6, 4, -2, 8, 8, 10, 2, 8, 3, 7, 7, 13, 7, -1, 7, -8, 1, -2, 6, 5, 10, 2, -10, 3, -5, -5, 9, 9, 3, -5, 11, 4, 4, 8, 4, 7, 5, 3, -10, -2, 3, -5, -8, 0, 0, 1, 5, 4, 4, -2, 1, 2, 7, -6, 9, -2, 1, 1, -1, 11, 0, 6, 4, -3, -5, 12, -3, -1, 5, 11, 5, 16, 9, -1, 6, 4, 14, 7, 3, 4, 5, 7, 7, 2, 3, 5, 12, 4, 13]
7473A3q%OqlkPoNMnpRJKkMnj0PkMqNNmj%MlmNmJPqlJ2qRnlPj3J1qPkJ0oknQ%%
7528Hj6J0oQnKKljJlK%LmlQmOlOj7J2oOOjkKnkJ3ljj1RmJnkQrJ3ljKqQojRmpM
7582CRpn%%PkPpk%JJ0j0PnlPJj2R%jjkLlmMj0RNj3J6lLj3KQnMrKj%PmoKNJljO
7636FkPj0%PoPoPj0MjoPRj9J3pJoRrnJ6nqQPlrkQjlJNKoPoKJ2j1plJ6oqJ4%pk
7688AQmnrJ6j0nPKoJ4o%Pj2Qlj4K2j2oJ8Nj7LJLmPj4PPlPj1j%Pj0J2j2K%kNmm
7735eLLJ2j4MJmjN%Nj9NmJJ3jlKljPrNjMj5K2k0MN%Nj3OMJoMmJjNJ0j0koJ6j6
7784eMLQk2NQj1J1OmKJnLlJ5rlrONpRQJj5Mn%Jm%oQKlJ2lj4PLnJOqPqPRkj4Mj
7837@nOmQj3J4LJrnNJ3k1J8mmLjOmpQrJPpKJ0j0Oj3J2pmNMj3QnMJ1qJlORqpJ5
$$ y = [13, 5, 5, 11, 3, 0, -2, 5, -1, 4, 8, 3, -4, 5, 6, 8, 6, 10, 5, -5, 2, 0, 4, -4, 1, 6, 2, 1, 1, 5, 2, -2, 3, -1, 0, 7, -1, -4, 8, 0, 9, 4, 1, 8, -5, 6, -2, 5, 3, 13, 7, 5, 0, 8, 8, 8, -8, 2, -4, 4, -1, 1, 3, 0, -1, 0, -3, -1, -1, 2, -2, -5, 3, -1, 5, 2, 8, -9, 3, -3, 3, 9, 8, 6, 8, 3, 1, 14, 11, 10, -1, 8, 4, 5, 0, -2, 6, -3, 10, 7, 6, 8, 0, 8, 2, 1, 10, 6, -1, 3, 12, 5, 0, 0, 0, 7, 5, 12, 5, 3, 3, 4, 14, 4, 11, 6, 3, 10, 11, -1, 8, 8, 7, 6, 4, 7, 4, 0, 4, -6, 3, 8, -5, 11, 8, 11, -2, 0, 8, 3, 7, -2, 0, -1, -1, 6, 2, -4, -2, 3, 4, 1, 0, 6, 4, 11, 1, 1, 8, 2, 9, 3, 10, 0, 4, 3, -3, 4, 13, -6, 7, 0, 1, -5, 4, -5, -10, 6, 1, -7, 1, 8, 5, -4, -6, 2, 1, -2, -1, 4, 6, 0, 7, 1, 3, 15, 4, -3, -6, 10, 4, -4, 10, 10, 3, 1, 9, 5, 0, -9, 7, -3, -8, -1, 1, -5, 9, 3, 3, 10, -2, 6, 3, -11, 11, -1, -7, 11, 16, -1, 2, 3, 6, 2, 9, -5, 2, 9, 6, 13, 2, 1, 1, 8, -2, 10, -2, 0, 0, -2, 3, -1, -5, -2, 1, 13, -1, 3, 4, 0, -1, 4, 4, 9, -10, -5, -9, -8, 5, 4, 1, 3, 0, -1, 6, -3, 2, 1, 5, -10, 12, -8, -4, 1, 1, 6, -7, -1, 3, 4, -2, 2, -2, -1, -2, 3, 13, 3, 1, -5, 11, -5, -1, 2, 10, -12, -7, 1, -10, 1, 7, 3, 5, 6, 1, 4, 1, 16, 7, 4, -5, 1, 6, -1, 8, 16, 17, 2, 6, 1, 1, 2, -2, -2, -8, 0, 2, -1, 11, 8, -6, 1, 4, -1, 0, 6, -2, 5, -3, 4, 13, 11, -3, 1, 0, -5, 1, -3, 5, -8, 6, 9, 10, 1, -4, 1, 14, -7, 11, 7, 3, 6, 5, 11, 7, 0, 8, -1, 0, 7, 0, 2, 12, 2, 8, -5, 7, 0, -4, 1, 5, -8, 0, -5, -1, 10, 2, 3, 0, 6, 15, 7, 0, 15]
7886A5j1kLKJJmLqPrLkQpj2RmJ7qrQMj0J3j2QjJ0rlMn%KPnMn%L%mK%JnJ6j1lO
7937HmpkQmQMrNj1QjPj1J2m%mOoNlnJ0jpnjQNJoQLmOj5OKjmMMnkMj2J0pkJ0n%
7990DKrQOrkPj2J8qJ1j1nJ3j4J2oJkMj0OLLOmJKlj0Nj1jJ8qNmlKJklKJp%J3j1
8038a%LKkMrOKmPj0RqjJ1rPkkPnJkKL%MrjlOj7J2Lj1J3j1Q%j1MQJLlm%JmJ5mk
8090GrPQrJ4j7LNRj6KlLNmJ0jpnrJ2lJ8k4RQknnPnPmNmpPOrJ1nkJ0j3klJ1krJ1
8140A1KolJj1J1ljNPl%j1JJrJ1%MKpj0NO%Mj%jJlQkJoLMkmMlNj1jJ5nojLJr
$$ y = [15, 4, 2, 5, 7, 8, 9, 5, 8, 0, 7, -2, 1, -1, 7, 0, -12, -3, -7, 10, 2, -7, 1, 5, -5, 8, -4, 4, 3, 13, 4, 1, 5, 0, 0, 2, 9, 4, 8, 3, 3, 6, 6, 2, 4, 4, 5, 0, 16, 5, 2, 8, 4, -3, -5, 3, -1, 7, 11, 2, 7, -4, 4, 3, 10, -1, 11, 7, 7, 3, 9, 3, 8, 5, 0, 10, 9, 2, -3, -4, 4, 9, 10, 4, 12, 15, 11, 17, 2, 8, 10, 9, 5, 9, 13, 8, 6, 10, -2, 8, 1, -1, 9, 4, 4, 6, -3, 5, 11, 2, 0, 7, -5, 13, 5, 16, 5, 0, 13, -1, 11, 5, 6, 4, 8, -2, 4, 7, 10, 16, 12, 13, 15, 12, 2, 7, -4, -5, 13, 5, 10, 6, 3, 5, 6, 4, 1, 3, 4, -3, -3, 10, -1, -1, 2, 4, 2, 6, -3, 3, 5, 1, 8, -2, 7, -1, -2, 9, 0, 7, 5, 3, 10, 5, 6, 4, 6, 9, 9, 13, 4, 3, 0, 6, -11, 1, 4, -7, 6, -5, 3, 3, -8, -4, 4, 5, 8, 5, 1, 1, 2, -2, 13, 9, 7, -2, 5, 13, 4, 18, 1, 4, 9, 18, 2, 4, 1, 4, 9, 5, 15, 14, 7, 2, -7, 5, 2, 20, -4, 5, 13, 11, 6, 1, 8, 3, 10, 6, 11, 7, 0, 7, 13, 4, 15, 10, 8, 18, 5, 3, 0, 11, 9, 0, 11, 13, 7, 4, 5, -6, 5, 2, 1, 6, 13, 10, 10, -1, 0, 1, -8, 3, 3, 7, 9, 2, -8, -3, 3, 3, 7, 6, 6, 5, 6, 3, 11, 9, 10, 4, 7, 11, 9, 5, 9, 6, 11, 0, -1, 14, 9, 3, 2, 5, 6, -3]
8191c
##END NTUPLES=NMR FID
##END=
