##TITLE=1H_ES-AN-DMSO
 
 8 sc, 
 13.04.2022
##JCAMPDX= 6.0         $$ Bruker NMR JCAMP-DX V2.0
##DATA TYPE= NMR FID
##DATA CLASS= NTUPLES
##ORIGIN= UXNMR, Bruker Analytische Messtechnik GmbH
##OWNER= root
$$ XWIN-NMR		Version 3.5
$$ Wed Apr 13 10:18:45 2022 Russian Standard Time (UT+4h)  she@DPX200
##.OBSERVE FREQUENCY= 200.13135
##.OBSERVE NUCLEUS= ^1H
##.DELAY= (6, 6)
##.ACQUISITION MODE= SIMULTANEOUS
##.ACQUISITION SCHEME= undefined
##.AVERAGES= 8
##.DIGITISER RES= 18
##SPECTROMETER/DATA SYSTEM= spect
##.PULSE SEQUENCE= zg30
##.SOLVENT NAME= CDCl3
##.SHIFT REFERENCE= (INTERNAL, CDCl3, 0, 15.7039)
##AUDIT TRAIL= $$ (NUMBER, WHEN, WHO, WHERE, WHAT)
$$ ##TITLE= Audit trail, XWIN-NMR		Version 3.5
$$ ##JCAMPDX= 5.01
$$ ##ORIGIN= Bruker BioSpin GmbH
$$ ##OWNER= she
$$ F:/spectra/data/she/nmr/H-F/1/audita.txt
$$ ##AUDIT TRAIL=  $$ (NUMBER, WHEN, WHO, WHERE, WHAT)
(   1,<2022-04-13 10:17:47.43 +0400>,<she>,<DPX200>,
      <created by zg, POWCHK disabled, PULCHK disabled
       configuration hash MD5:
       00 E9 B6 7A A2 85 ED C7 34 08 36 98 17 FE 4E 26
       data hash MD5: 16K
       7A 70 C6 63 0E 17 74 5D 6F 47 52 FF 9A A5 C4 F6>)
$$ ##END=
$$ 
$$ hash MD5
$$ F0 12 DE 5A E7 27 AA BD B5 DB 05 2A 5D 0F F0 14
##$RELAX= 
##$RELAX= 
##$RELAX= 
##$RELAX= 
##$RELAX= 
##$RELAX= 
$$ Bruker specific parameters
$$ --------------------------
##$DU= <F:/spectra>
##$EXPNO= 1
##$NAME= <H-F>
##$PROCNO= 1
##$TYPE= <nmr>
##$USER= <she>
##$AMP= (0..31)
100 100 100 100 100 100 100 100 100 100 100 100 100 100 100 100 100 100 
100 100 100 100 100 100 100 100 100 100 100 100 100 100 
##$AQSEQ= 0
##$AQ_mod= 1
##$AUNM= <au_zg>
##$AUTOPOS= <>
##$BF1= 200.13
##$BF2= 200.13
##$BF3= 200.13
##$BF4= 200.13
##$BF5= 200.13
##$BF6= 200.13
##$BF7= 200.13
##$BF8= 200.13
##$BYTORDA= 1
##$CFDGTYP= 0
##$CFRGTYP= 5
##$CHEMSTR= <none>
##$CNST= (0..31)
1 1 145 1 1 1 1 1 1 1 1 1 1 1 1 1 1 1 1 1 1 1 1 1 1 1 1 1 1 1 1 1 
##$CPDPRG= <>
##$CPDPRG1= <>
##$CPDPRG2= <>
##$CPDPRG3= <>
##$CPDPRG4= <mlev>
##$CPDPRG5= <mlev>
##$CPDPRG6= <mlev>
##$CPDPRG7= <mlev>
##$CPDPRG8= <mlev>
##$CPDPRGB= <>
##$CPDPRGT= <>
##$D= (0..31)
0 1.2 0 0 0 0 0 0 0 0.06 0 0.03 0 0 0 0 0.0002 0 0 0 0 0 0 0 0 0 0 0 0 
0 0 0 
##$DATE= 1649830667
##$DBL= (0..7)
120 120 120 120 120 120 120 120 
##$DBP= (0..7)
150 150 150 150 150 150 150 150 
##$DBP07= 0
##$DBPNAM0= <>
##$DBPNAM1= <>
##$DBPNAM2= <>
##$DBPNAM3= <>
##$DBPNAM4= <>
##$DBPNAM5= <>
##$DBPNAM6= <>
##$DBPNAM7= <>
##$DBPOAL= (0..7)
0.5 0.5 0.5 0.5 0.5 0.5 0.5 0.5 
##$DBPOFFS= (0..7)
0 0 0 0 0 0 0 0 
##$DE= 6
##$DECBNUC= <off>
##$DECIM= 32
##$DECNUC= <off>
##$DECSTAT= 4
##$DIGMOD= 1
##$DIGTYP= 9
##$DL= (0..7)
0 120 120 120 120 120 120 120 
##$DP= (0..7)
150 150 150 150 150 150 150 150 
##$DP07= 0
##$DPNAME0= <>
##$DPNAME1= <>
##$DPNAME2= <>
##$DPNAME3= <>
##$DPNAME4= <>
##$DPNAME5= <>
##$DPNAME6= <>
##$DPNAME7= <>
##$DPOAL= (0..7)
0.5 0.5 0.5 0.5 0.5 0.5 0.5 0.5 
##$DPOFFS= (0..7)
0 0 0 0 0 0 0 0 
##$DQDMODE= 0
##$DR= 18
##$DS= 0
##$DSLIST= <SSSSSSSSSSSSSSS>
$$ [...]
##$SUBNAM2= <"">
##$SUBNAM3= <"">
##$SUBNAM4= <"">
##$SUBNAM5= <"">
##$SUBNAM6= <"">
##$SUBNAM7= <"">
##$SUBNAM8= <"">
##$SUBNAM9= <"">
##$SW= 18.05172834244
##$SWIBOX= (0..15)
0 0 2 0 0 0 0 0 0 0 0 0 0 0 0 0 
##$SW_h= 3612.71676300578
##$TD= 16384
##$TD0= 1
##$TE= 0
##$TE2= 300
##$TE3= 300
##$TEG= 300
##$TL= (0..7)
0 120 120 120 120 120 120 120 
##$TP= (0..7)
150 150 150 150 150 150 150 150 
##$TP07= 0
##$TPNAME0= <>
##$TPNAME1= <>
##$TPNAME2= <>
##$TPNAME3= <>
##$TPNAME4= <>
##$TPNAME5= <>
##$TPNAME6= <>
##$TPNAME7= <>
##$TPOAL= (0..7)
0.5 0.5 0.5 0.5 0.5 0.5 0.5 0.5 
##$TPOFFS= (0..7)
0 0 0 0 0 0 0 0 
##$TUNHIN= 0
##$TUNHOUT= 0
##$TUNXOUT= 0
##$USERA1= <user>
##$USERA2= <user>
##$USERA3= <user>
##$USERA4= <user>
##$USERA5= <user>
##$V9= 5
##$VALIST= <valist>
##$VCLIST= <CCCCCCCCCCCCCCC>
##$VD= 0
##$VDLIST= <DDDDDDDDDDDDDDD>
##$VPLIST= <PPPPPPPPPPPPPPP>
##$VTLIST= <TTTTTTTTTTTTTTT>
##$WBST= 1024
##$WBSW= 4
##$XGAIN= (0..3)
0 0 0 0 
##$XL= 0
##$YL= 0
##$YMAX_a= 271365
##$YMIN_a= -263615
##$ZGOPTNS= <>
##$ZL1= 120
##$ZL2= 120
##$ZL3= 120
##$ZL4= 120
##$ABSF1= 10
##$ABSF2= 0
##$ABSG= 5
##$ABSL= 3
##$ALPHA= 0
##$AQORDER= 0
##$ASSFAC= 0
##$ASSFACI= 0
##$ASSFACX= 0
##$ASSWID= 0
##$AUNMP= <proc_1d>
##$AZFE= 0.1
##$AZFW= 0.1
##$BCFW= 1
##$BC_mod= 2
##$BYTORDP= 1
##$COROFFS= 0
##$CY= 11.3945322036743
##$DATMOD= 1
##$DC= 2
##$DFILT= <>
##$DTYPP= 0
##$F1P= 2.36226072786647
##$F2P= -0.459571619588291
##$FCOR= 0.5
##$FTSIZE= 0
##$FT_mod= 4
##$GAMMA= 1
##$GB= 0.15
##$INTBC= 1
##$INTSCL= 1
##$ISEN= 128
##$LB= 0.24
##$LEV0= 0
##$LPBIN= 0
##$MAXI= 10000
##$MC2= 0
##$MEAN= 0
##$ME_mod= 0
##$MI= 1.114404
##$NCOEF= 0
##$NC_proc= 0
##$NLEV= 6
##$NOISF1= 3.799351
##$NOISF2= 2.8
##$NSP= 1
##$NTH_PI= 0
##$NZP= 0
##$OFFSET= 15.70392
##$PC= 1
##$PHC0= -18487.15
##$PHC1= 32.60078
##$PH_mod= 1
##$PKNL= yes
##$PPARMOD= 0
##$PSCAL= 0
##$PSIGN= 0
##$REVERSE= no
##$SF= 200.130013532006
##$SI= 16384
##$SIGF1= 3
##$SIGF2= 2
##$SINO= 400
##$SIOLD= 16384
##$SREGLST= <1H.CDCl3>
##$SSB= 0
##$STSI= 0
##$STSR= 0
##$SW_p= 3612.71676300578
##$SYMM= 0
##$S_DEV= 0
##$TDeff= 0
##$TDoff= 0
##$TI= <>
##$TILT= no
##$TM1= 0
##$TM2= 0
##$TOPLEV= 0
##$USERP1= <user>
##$USERP2= <user>
##$USERP3= <user>
##$USERP4= <user>
##$USERP5= <user>
##$WDW= 1
##$XDIM= 8192
##$YMAX_p= 0
##$YMIN_p= 0
$$ End of Bruker specific parameters
$$ ---------------------------------
##NTUPLES= NMR FID
##VAR_NAME=  TIME,          FID/REAL,        FID/IMAG
##SYMBOL=    X,             R,               I
##VAR_TYPE=  INDEPENDENT,   DEPENDENT,       DEPENDENT
##VAR_FORM=  AFFN,          ASDF,            ASDF
##VAR_DIM=   8192,          8192,            8192
##UNITS=     SECONDS,       ARBITRARY UNITS, ARBITRARY UNITS
##FACTOR=    0.0002768,     1,               1
##FIRST=     0,             0,               0
##LAST=      2.2672688,     0,               0
##MIN=       0,             -263615,         0
##MAX=       2.2672688,     271365,          0
$$ Real data points
##PAGE= N=1
##DATA TABLE= (X++(R..R)), XYDATA
$$ [...]
1462C98L410m827k626N286J794n614r28N762N2n743Q38N557j687n268K497M873
$$ 398 3808 -1019 -3645 1641 3435 -2179 -3107 2655 2707 -3036 -2198 3359 1672 -3596 -1099 3774
1478C774l243m388L874L835m411l194M813K517n127j775N334J001n461j87N476
$$ 3774 531 -3857 17 3852 -559 -3753 1060 3577 -1550 -3325 2009 3010 -2451 -2638 2838
1493B838o04n380J363N184k104m827K761M383l397l808L949L167m410k479M770
$$ 2838 2234 -3146 -1783 3401 1297 -3530 -769 3614 217 -3591 358 3525 -885 -3364 1406
1508A406J750n006r92N110K51n110N04M994j270m787K014M483k696m133L347L662
$$ 1406 3156 -1850 -2842 2268 2519 -2591 -2087 2907 1637 -3150 -1136 3347 651 -3482 -135 3527
1524C527l908l111M368K489m769j760N052R81n230j47N269o65n176J454M948k173
$$ 3527 -381 -3492 876 3365 -1404 -3164 1888 2869 -2361 -2508 2761 2096 -3080 -1626 3322 1149
1540A149m580K826M092l405l518L900K856m257k192M521J536m678q92M738K34
$$ 1149 -3431 -605 3487 82 -3436 464 3320 -937 -3129 1392 2928 -1750 -2642 2096 2330
1555B330m701M18M593j081m412J717M179k346l852K894L485l434l005L911K415
$$ 2330 -2371 -1953 2640 1559 -2853 -1136 3043 697 -3155 -261 3224 -210 -3215 696 3111
1570C111m311j744M613J005m802k21M870n56m808J324M586k020m255K675L794
$$ 3111 -1200 -2944 1669 2674 -2128 -2349 2521 1965 -2843 -1519 3067 1047 -3208 -533 3261
1585C261l231l244L689K656m042k042M300J407m456p74M494J78m489M46M385j069
$$ 3261 30 -3214 475 3131 -911 -2953 1347 2754 -1702 -2476 2018 2196 -2293 -1847 2538 1469
1601A469m194J648L972k214l673K745L285l222k828L626K286l973j652M224R75
$$ 1469 -2725 -1077 2895 681 -2992 -247 3038 -184 -3012 614 2900 -1073 -2725 1499 2474
1616B474m363k88M404m05m348J086M171j710l875K291L495k825l037L294K511
$$ 2474 -1889 -2177 2227 1822 -2526 -1440 2731 1021 -2854 -563 2932 107 -2930 364 2875
1631B875l659j972L952J404m166q10M284J84m299M54M229j084m074J696L833k271
$$ 2875 -784 -2756 1196 2600 -1566 -2376 1908 2092 -2207 -1753 2476 1392 -2682 -986 2847 576
1647E76l503K791L066l216k570L553K022l824j422L994Q07m063k12M070l88l963
$$ 576 -2927 -136 2930 -286 -2856 697 2719 -1105 -2527 1467 2274 -1789 -2001 2069 1681 -2282
1663b282R46L767j441l547J948L239k406k861K827K454l212j982L511J494l777
$$ -2282 -1336 2431 990 -2557 -609 2630 224 -2637 190 2644 -568 -2550 961 2455 -1322
1678a322r27L935L34m021L14L992r53l870J574L643k172l310K680K891l124k366
$$ -1322 -2249 1686 2020 -2001 -1687 2305 1352 -2518 -944 2699 527 -2783 -103 2788 -336 -2702
1694b702L440J809l668j236L807O62l855j01L812m21l705R13L532j366l288J786
$$ -2702 738 2547 -1121 -2357 1450 2112 -1743 -1844 1968 1547 -2158 -1245 2287 921 -2367 -581
1710e81L014k181k705K555K372k923j948L204J504l445r87L596M53l699J46L683
$$ -581 2433 252 -2453 102 2474 -449 -2397 807 2311 -1134 -2121 1475 1928 -1771 -1625 2058
1726B058p36l582J321L386j894l065K368K671k771k223L097J719l348j197L510
$$ 2058 1322 -2260 -939 2447 553 -2512 -144 2527 -244 -2467 630 2349 -999 -2196 1314
1741A314O50l571j30L577l86l483Q58L347j300l153J725K912k126k602K503K242
$$ 1314 1964 -1607 -1737 1840 1454 -2029 -1171 2176 876 -2277 -552 2360 234 -2368 135 2377
1757B377k835j827L102J379l292q93L402L69l437J59L386o79l267J182L074j649
$$ 2377 -458 -2285 817 2196 -1096 -1989 1413 1782 -1655 -1496 1890 1211 -2056 -874 2200 551
1773E51k799K032K472k391k081K675J673k914j224L084P66l217k93L272j77l264
$$ 551 -2248 -216 2256 -135 -2216 459 2132 -782 -2006 1078 1844 -1373 -1666 1606 1429 -1835
1789a835O71L159j133k999J591K786k046k468K431K103k763j665L005J205l149
$$ -1835 -1164 1995 862 -2137 -546 2240 194 -2274 157 2260 -503 -2168 837 2042 -1107
1804a107p45L246K19l218K61L148p30k997J151K787j508k550J830K267k128j940
$$ -1107 -1852 1394 1613 -1605 -1344 1804 1074 -1923 -772 2015 507 -2043 -213 2054 -74 -2014
1820b014K363J610k581j244K755Q57k890m53K981J1l013M61K955r28k805J369
$$ -2014 349 1959 -622 -1866 889 1746 -1144 -1597 1384 1395 -1618 -1157 1798 870 -1935 -566
1836e66K612j817k321K209J963k525j549K772J089k924o28K999J41k960L06K885
$$ -566 2046 229 -2092 117 2080 -445 -1994 778 1867 -1057 -1685 1314 1455 -1505 -1199 1686
1852A686p32k759J128K552j449k335J744K081k007j789K214J491k422j156K584
$$ 1686 954 -1805 -677 1875 426 -1909 -165 1916 -91 -1880 334 1825 -597 -1753 831
1867H31Q02k710m35K798K6k794L80K737p95k606J200K424j605k142J928J827k200
$$ 831 1633 -1077 -1512 1286 1312 -1482 -1102 1635 840 -1766 -566 1858 253 -1889 39 1866 -334
1884c34j477K428J079k584o38K642K40k667J98K595n65k528R55K369j292k182
$$ -334 -1811 617 1696 -888 -1526 1116 1356 -1311 -1113 1482 917 -1611 -656 1713 421 -1761
1900a761J592J965j878j694K109J417k349j063K494P03k609l18K659o5k656M72
$$ -1761 -169 1796 -82 -1776 333 1750 -599 -1662 832 1535 -1074 -1392 1267 1202 -1454 -982
1916i82K558q37k416J196K201j508j943J768J682j996j364K167J027k282o92K361
$$ -982 1576 739 -1677 -481 1720 212 -1731 37 1719 -277 -1641 526 1553 -729 -1421 940
1932I40L48k395LK386l50k348P04K265j061k120J390J920j694j667J968J377k232
$$ 940 1288 -1107 -1104 1282 932 -1416 -712 1553 492 -1628 -238 1682 -12 -1679 289 1666 -566
1949e66j008K393O31k513k34K544j61k498N30K406r00k232J225K018j484j785
$$ -566 -1574 819 1450 -1063 -1297 1247 1086 -1412 -882 1524 624 -1608 -383 1635 151 -1634
1965a634J712J519j894j240K031R71k134o81K198M00k255q4K271k42k237N49K198
$$ -1634 78 1597 -297 -1537 494 1465 -669 -1350 848 1248 -1007 -1091 1180 938 -1299 -750 1448
1982A448r05k070J216J891j522j664J822J355k039j028K216O62k333k74K370j14
$$ 1448 543 -1527 -311 1580 58 -1606 216 1571 -468 -1496 720 1382 -951 -1225 1145 1031
1998A031k335M89K230q18k088J135J877j383j672J618J429j800j173J947R05k052
$$ 1031 -1304 -815 1415 597 -1491 -356 1521 138 -1534 84 1513 -287 -1460 487 1392 -660
2014f60o43K146L58k216k4K208k67k193N84K113q95j983J191J804j480j567J715
$$ -660 -1303 843 1201 -1015 -1039 1169 902 -1291 -707 1406 511 -1472 -281 1523 43 -1524 191
2031A91J294j917r69K037O52k123l23K153rk122L18K073o56j929R26J784j186
$$ 191 1485 -432 -1401 636 1288 -835 -1158 995 986 -1136 -818 1255 599 -1330 -404 1380 194
2048A94j621J431J421j633j201J833R38j984o34K087L23k147J5K148l38k114O56
$$ 194 -1427 4 1425 -208 -1409 424 1362 -622 -1256 831 1154 -993 -978 1170 832 -1282 -626
2065f26K019r73j848J244J643j471j430J679J163j833q69J907O01j982l14J993
$$ -626 1393 420 -1428 -184 1459 -12 -1442 237 1400 -433 -1302 605 1206 -776 -1090 903
2081I03L1j965K30J927n02j847P47J765j001j618J236J445j459j245J679R86j849
$$ 903 934 -1031 -801 1126 624 -1223 -476 1289 288 -1330 -94 1351 -108 -1353 326 1312 -537
2098e37o82J979L54k040k6K061l20k004O43J895r39j744J212J522j428j287J601
$$ -537 -1219 760 1114 -926 -952 1109 789 -1215 -572 1323 384 -1360 -148 1374 -54 -1341 260
2115B60J038j730p85J813N43j866k98J878N5j881J88J855m55j778O88J701r24
$$ 260 1298 -432 -1217 596 1139 -727 -1025 853 908 -973 -785 1070 615 -1163 -475 1226 302
2132C02j579J158J428j379j232J576R83j736o92J841M04j917q0J915k33j858N40
$$ 302 -1277 -119 1309 -70 -1302 274 1257 -479 -1171 670 1074 -843 -923 992 759 -1099 -559
2149e59J749q14j610J050J434j263j223J430J004j564p83J677N34j754k89J798
$$ -559 1190 376 -1234 -184 1250 -13 -1236 194 1198 -366 -1149 528 1062 -692 -981 817
2165H17L9j809K14J786m65j731P11J643r43j518J179J350j380j145J550Q92j655
$$ 817 856 -953 -739 1047 582 -1149 -438 1205 262 -1256 -77 1273 -107 -1252 298 1190 -465
2182d65o40J747L65j780q1J758j73j710M13J641o68j508Q75J380j083j215J250
$$ -465 -1105 642 1007 -773 -854 904 731 -979 -566 1075 407 -1101 -226 1154 71 -1144 106
2199A06J032j415q22J526O22j634l71J710J16j751J45J743m45j667O98J588r62
$$ 106 1138 -277 -1099 427 1049 -585 -956 754 870 -881 -736 1007 562 -1105 -407 1181 219
2216B19j435J186J239j355j021J504P69j595n38J653K97j674m3J653j72j608L82
$$ 219 -1216 -30 1209 -146 -1167 337 1106 -489 -1027 626 923 -751 -794 859 687 -921 -539
2233e39J534n87j435P60J340r46j207J120J045j276q78J417O77j544m28J613J78
$$ -539 995 408 -1027 -267 1073 127 -1080 40 1085 -191 -1069 348 1025 -519 -947 666 844
2250H44j660Q8J649l43j603O22J495q76j347J090J164j257r57J404P17j492m87
$$ 844 -816 -728 921 578 -1025 -403 1092 216 -1131 -41 1123 -134 -1091 313 1030 -462 -949
2267i49J542K69j563n2J549j58j508L60J456n37j380P16J285q94j194J083J030
$$ -949 593 862 -701 -753 796 638 -870 -510 946 409 -971 -255 1030 136 -1058 25 1055
2284A055j230q56J363O67j475m48J551J96j575N3J566l12j504N50J398p68j252
$$ 1055 -175 -1031 332 999 -476 -924 627 823 -752 -699 867 555 -949 -399 999 231 -1021
2301a021R50J089j101r15J230P28j320n31J385L23j423j21J457q3j448K98J406
$$ -1021 -71 1018 -83 -998 232 960 -360 -891 494 817 -606 -727 730 647 -801 -503 903
2318I03n07j332O93J262r10j140J083R68j227p84J340N93j446l50J487J33j495
$$ 903 396 -936 -243 1019 109 -1031 52 1020 -207 -991 349 942 -504 -854 633 766 -729
2335g29R4J459l20j387N14J292o83j181Q42J040r69r00J084P57j175n99J262M25
$$ -729 -635 824 504 -883 -369 923 240 -941 -99 941 -28 -928 156 913 -262 -861 401 826
2353H26j337k15J373J4j383J94J361l95j344O47J226q42j104J021R33j172p42
$$ 826 -511 -726 647 661 -722 -528 833 438 -906 -259 967 125 -979 42 975 -197 -939
2370i39J286N45j364l22J399R1j390J13J358l01j299M73J210o16j127P47J017
$$ -939 347 892 -472 -794 605 696 -694 -581 777 476 -823 -350 860 244 -883 -136 881
2387H81q62r08R85P83j095o41J188M91j272l00J329J02j364J22J352l37j299N43
$$ 881 19 -889 96 879 -216 -857 331 822 -450 -750 579 681 -683 -561 791 454 -845 -302
2405c02J211p50j065R08R23j061p39J174N29j232l40J270J51j283L6J256k17j214
$$ -302 909 159 -906 2 925 -136 -875 299 828 -404 -744 526 677 -606 -570 686 469 -745
2423g45L82J154n21j100O62J031q12r15R46P74j053o45J164M93j259k93J287J13
$$ -745 -363 791 270 -830 -168 863 51 -864 82 856 -197 -842 322 815 -444 -737 550 663
2441F63j314R7J284k95j221M98J135o66j021Q04Q86r31p29J018N73j096m09J139
$$ 663 -651 -554 730 435 -786 -288 847 181 -840 -36 850 -81 -810 208 781 -315 -724 415
2459D15K47j164p7J170q8j175K51J150m17j101N95J018p46r19Q99P85j018o49
$$ 415 662 -502 -579 591 503 -672 -421 729 312 -789 -194 824 78 -841 58 843 -175 -824
2477h24J147M53j201k69J235Q4j245J12J222l10j158M75J062o00r60P35Q31q31
$$ -824 323 776 -425 -694 541 625 -620 -508 714 404 -754 -279 783 183 -777 -42 789 -42
2495d2p19R20N94r98m59J047L23j113j61J144Nj147J60J149l50j109N24J032p03
$$ -42 -761 159 753 -245 -704 343 666 -447 -608 536 541 -606 -446 703 353 -756 -232 800 97
2514I7r18Q43Q08r89o31J087M39j136k65J186O4j166J06J144k85j066M10J007
$$ 97 -821 22 830 -159 -790 297 736 -400 -665 521 585 -581 -475 669 384 -682 -272 735
2532G35n49r21O74Q09p61p14Q53N95r36m92J026L39j068k01J120L6j132J25J125
$$ 735 186 -735 -61 748 -13 -727 126 721 -215 -707 319 658 -410 -611 509 545 -587 -462 663
2551F63l07j089M83J011o42q96P86P65r02o26R95M61j044k93J087J03j076M3J071
$$ 663 356 -733 -250 761 119 -777 9 774 -128 -754 241 702 -342 -635 452 555 -521 -478 593
2570E93j95j033L38R81m75q98N88Q21o99p41Q13O35r26n02R95L54j057j89J103
$$ 593 398 -635 -297 684 209 -689 -101 720 21 -720 93 728 -198 -700 295 649 -408 -597 506
2589E06K4j118J47J105l32j024M70R54o18q55P44P24q41n95R33M46r74k94R84
$$ 506 530 -588 -441 664 332 -692 -222 732 114 -741 3 727 -114 -709 224 670 -304 -598 386
2608C86J72j006l5J013j08r87K38R60l75r20N15Q63o57p58P62O62q91n13R71L59
$$ 386 558 -448 -483 530 422 -565 -327 633 258 -662 -147 716 59 -699 63 725 -166 -679 292 651
2628F51j039j93J062L0j070J46J044l15r85M67Q96n81q05O83P00p83n60Q38M53
$$ 651 -388 -581 481 511 -559 -413 631 316 -669 -202 694 113 -692 -9 691 -92 -652 186 639
2647F39q88l47R39K22r65q4R72m0r76J73R65l15r29M58Q67o01p85P42O70q55n24
$$ 639 -249 -596 343 565 -400 -484 488 448 -528 -355 610 295 -634 -176 691 90 -695 47 717 -138 -662
2668f62R31L64r91k04J015M4j011J16R80k77r12M03Q41n18p60O00O82o95n78P71
$$ -662 269 633 -358 -562 453 497 -514 -398 582 305 -607 -204 637 119 -641 -41 641 -54 -632 139
2688A39M63q22l64Q89K42r09j37R62j7r63J55R48k91r22M44Q57n76p68P05O37
$$ 139 602 -220 -584 305 547 -362 -499 463 446 -517 -362 586 295 -627 -183 674 98 -670 35 672
2708F72p95n11Q78L59r32k08R41O2r33O8R20j95q87L22Q22m22p58N21O90o26o07
$$ 672 -123 -634 244 603 -329 -537 404 466 -467 -399 521 326 -561 -239 583 161 -597 -76 614 -12 -619
2729f19P12N05p82m02Q63K77r13j45R52mr48J47R33l09q57M16Q19n76o96O68N84
$$ -619 93 598 -184 -586 277 554 -359 -504 448 444 -504 -357 576 267 -590 -174 645 69 -627 41 625
2750F25p36m60P93L40q34k25Q58R9q74K5Q61j46q24K40P98l43p73M69P08n66o42
$$ 625 -111 -571 222 562 -272 -497 361 460 -414 -389 472 326 -498 -258 540 197 -576 -107 601 35 -607
2771f07O70N53p68m22Q13L17q78j83R26J4r05J38Q79k77q30M04P44n16o41O03
$$ -607 63 616 -152 -574 239 556 -322 -505 421 435 -470 -332 547 270 -560 -156 588 72 -569 34
2791C4N37o66m38P18L37p64k25P74J34q01l4Q05q3p96J97P77l08p41M10O99n16
$$ 34 571 -95 -533 185 522 -242 -467 307 441 -360 -394 411 328 -468 -271 506 198 -543 -133 566 50
2812E0o20O23N28p16m21P76L02q25j53Q47K0q36J06Q14k47p51L42O93m32o21N26
$$ 50 -570 53 581 -135 -556 220 522 -303 -456 391 411 -425 -319 495 248 -503 -161 532 100 -521 5
2833EN27n91m33O33L45o65k72P15J54p29o8P60n5p63J65P44k69p22L97O59m95
$$ 5 532 -59 -492 141 486 -179 -451 264 418 -311 -379 381 326 -437 -272 472 203 -519 -122 537 42
2854D2n83N79M92o57l85P28K51p57j27P66K3p55Q7P25j95o79K83O38l64n92M48
$$ 42 -541 38 530 -127 -512 216 467 -290 -417 349 372 -383 -296 429 234 -445 -162 476 112 -480 -32
2875c2N21n11m54N75L78o24l09O90K05p28r6P39k0p46J42P29k64o81L64O30m75
$$ -32 489 -22 -476 99 477 -147 -456 234 439 -289 -385 354 334 -412 -270 459 195 -486 -122 508 33
2896C3n41N54M58o33l50O74K34o95j24O97L3o92P2O63j38o45K16O14l05n69L78
$$ 33 -508 46 504 -129 -479 195 429 -266 -390 307 340 -352 -280 383 245 -400 -184 430 125 -444 -66
2917f6N37m61m81N30M26o20l26O66K30p08j20P43j6p30J28P13k57o59L48O08m51
$$ -66 471 10 -471 59 485 -135 -461 205 435 -273 -393 350 334 -396 -268 445 188 -471 -123 485 34
2938C4n22N30M12n71l29O14K31o12j60O31O9o26OO38q4o45J90O16k66n92L56N50
$$ 34 -488 42 454 -117 -446 168 399 -213 -373 258 327 -299 -293 345 261 -384 -194 422 156 -436 -80 470
2960D70m49m75N10M15n87l23O47K09o89r4P02k8o81J15O71k26o23L14N71m05m94
$$ 470 21 -454 56 471 -116 -439 208 417 -272 -366 336 308 -373 -258 413 187 -436 -122 449 44 -450
2981d50M73M08n07l49N55K77n88j94O02J19o24l1O34o0o21J35O22k29n88L32N47
$$ -450 23 431 -76 -425 130 407 -181 -375 227 346 -278 -309 325 265 -356 -221 401 172 -416 -84 463
3002D63m30m88N16L99n75l14O38J93o54r0O55oo45R3O18j99n72K75N28l43m82
$$ 463 33 -455 61 460 -115 -429 209 402 -252 -342 313 307 -338 -245 373 174 -398 -123 405 62 -420
3023d20M09M26m55l73N14L05n63k26N87J67o33o4O42l0o35J32O20k26n96L28N48
$$ -420 -11 415 -40 -413 101 406 -157 -383 204 371 -262 -326 316 286 -349 -217 403 177 -419 -91 457
3044D57m40m49M98L75n53k80N73J85n87j01O14j5n85Q4N63j59n36K16N13k91m77
$$ 457 17 -432 66 441 -112 -392 181 366 -221 -322 292 277 -308 -224 339 180 -356 -140 373 82 -395
3065c95L57M28m20l74M84L29n31k64N67J77n98r2O46k7o40J35O08k22n77L27N07
$$ -395 -38 390 -30 -404 80 409 -122 -386 181 358 -240 -332 314 287 -353 -218 390 168 -409 -82 425
3086D25l90m38M57L53m93k89N26K01n56r8N41L8n52M2N48j20n19J73N10k60m76
$$ 425 35 -403 54 407 -86 -375 151 352 -204 -302 239 277 -275 -233 315 195 -324 -151 359 99 -377
3107c77L30M38m06l83M67L25n27k52N81J70o12o7O13k4o04J25N79k11n42L03M76
$$ -377 -47 391 -15 -398 69 394 -133 -385 196 366 -246 -313 300 276 -328 -203 376 165 -377 -74 402
3128D02l56m22M15L55m57k87M86K13n13j37N09Q2n38nN44p1n41J44N28k28m94
$$ 402 46 -376 39 394 -63 -350 136 349 -164 -301 208 290 -248 -253 291 220 -321 -177 351 123 -371
3149c71L00M64l86l99M54L27n16k32N49J58n81o0N78l7n53J10N45j97m93K54M46
$$ -371 -71 393 7 -392 62 389 -127 -359 190 348 -233 -293 285 248 -305 -195 350 153 -340 -86 360
3170C60l13l96L72L51m16k96M50K28m77j71N05J00n28l0N41m5n54J47N24k17n11
$$ 360 47 -349 23 374 -42 -338 112 340 -137 -308 197 297 -231 -261 280 235 -319 -172 352 135 -376
3191c76L03M71l83l95M50L14m99k30N21J48n43n7N41k0n29J01M86j56m47K12M33
$$ -376 -73 398 15 -380 70 384 -115 -345 176 324 -219 -276 265 245 -284 -183 303 147 -300 -88 345
3212C45k67m02L24L50l71l05M07K70m67j99M96J26n27m7N42l9n32J15N29k19m85
$$ 345 78 -324 0 350 -21 -326 81 351 -116 -315 181 307 -220 -267 275 236 -296 -181 348 129 -356
3233c56K88M34l61l59M03K93m48k21M75J51m84p3M83J5m92O9M64j26m34J59M43
$$ -356 -68 366 5 -354 49 342 -106 -327 148 299 -185 -258 225 240 -252 -183 281 155 -279 -120 323
3254C23k33m07K85L80l47l23L87K72m38k09M86J12n05l9N22m2n17J36M88k15m56
$$ 323 90 -317 -32 348 1 -322 65 337 -101 -310 176 288 -217 -256 266 224 -293 -157 331 116 -340
3275c40K88L95l40l36L85K65m10k05M21J59m45r2M62J9m40K5M47q9m37J47M31
$$ -340 -52 343 3 -333 52 317 -93 -298 123 282 -163 -255 207 226 -214 -189 258 169 -268 -121 310
3296C10k06m12K66L83l33l28L87K75m50k00M75J28n03k5M79m3m71J25M38j87m08
$$ 310 104 -308 -42 341 8 -320 67 342 -108 -308 167 295 -208 -233 246 203 -268 -143 295 108 -300
3317c00K52L56k91l08L16K63l47k24L84J76l98j32M25O9m38j6M55m6m52J19M40
$$ -300 -48 308 17 -291 25 288 -59 -283 101 277 -121 -253 172 241 -197 -213 242 196 -256 -137 303
3338C03j95m11K67L66l17l24L80K65m28j93M36J23m54m9M53l1m32R1M01j36l73
$$ 303 108 -303 -36 330 13 -311 69 334 -94 -287 149 272 -182 -231 222 191 -241 -150 251 115 -258
3359b58J96L32k43l05K73K78l08k42L45K03l72j68M15R9m26k4M37l0m48J05M27
$$ -258 -62 270 27 -278 -5 273 -35 -277 68 271 -101 -269 146 245 -181 -205 232 202 -246 -141 286
3380B86j75m05K53L55l08l05L48K49l75j77L85J29m10o0M09j2l92N4L82r6l68
$$ 286 111 -294 -41 314 6 -299 49 298 -77 -254 131 260 -150 -210 199 187 -205 -151 231 135 -233
3401b33J37L53j96l33K39L04k74k62L22K19l74j68M04J10m21m1M31k4m25R4M12
$$ -233 -96 257 61 -272 -33 271 -3 -265 57 276 -98 -266 138 248 -173 -214 217 193 -232 -138 274
3422B74j68l76K23L35k71k95L26K33l47j78L52J32l80o4L56M0l69RL70n0l89J09
$$ 274 106 -270 -47 288 17 -278 48 281 -66 -244 108 240 -140 -204 152 192 -177 -168 202 152 -237 -128
3444a28L63j53l47K06L28k71k81L19K31l52j87L97J11m16l4M25k3m17R3L92j52
$$ -128 235 82 -265 -59 269 -2 -283 36 267 -85 -272 125 236 -180 -214 211 188 -229 -136 256 104
3465A04l52J94L13k36k73K69K38k95k01L22J57l44j18L52P7l59k5L74k9l90R2
$$ 104 -248 -54 259 23 -250 19 257 -38 -239 83 240 -104 -222 130 207 -152 -177 197 168 -222 -130
3486a30L77j47l66K09L35k68k94L21K31l47j83L79J23l96m7L96ml99P5L71j23
$$ -130 247 100 -266 -57 278 10 -284 37 268 -79 -262 117 240 -156 -203 193 189 -210 -135 236 113
3507A13l42J66L03j81k89K36K40k50k28K88J93l28j33L41Q9l68n4L86j0l87P7
$$ 113 -229 -63 240 59 -230 6 246 -4 -232 56 249 -79 -212 129 218 -150 -204 182 172 -215 -138
3528a38L72j37l58K15L08k48k81L04K29l37j75L46J15l50o4L65J1l60M0L57r7
$$ -138 234 97 -261 -46 262 14 -267 37 266 -71 -246 100 215 -135 -199 166 177 -183 -143 214 117
3549A17l32J35L04j52k93K00K57k35k41K74K07k97j79L48J17l71n2L76j0l89P9
$$ 117 -215 -80 224 72 -221 -21 236 1 -240 34 241 -56 -235 113 230 -141 -193 183 173 -216 -137
3570a37L67j33l56K08K99k31k63K71K08k90j68L27J05l30o9L45K5l28PL28l4l43
$$ -137 230 97 -259 -51 248 17 -246 25 233 -57 -225 102 207 -123 -192 153 178 -150 -143 185 151 -192
3592a92R7L21j39l21J86L07k44k62K80K30l19j82L49J15l66n9L71jl71P5L43j32
$$ -192 -95 226 87 -234 -48 259 15 -247 33 263 -56 -238 111 226 -140 -199 172 171 -200 -125 218 86
3614H6l08J61K92k21k43K52K03k59j73K80J40l08q9L07O2l21j8L34k9l35P9L41
$$ 86 -222 -61 231 10 -233 19 222 -37 -210 70 210 -98 -187 120 182 -139 -157 177 148 -187 -108 233
3636B33j33l16J75K94k24k78K82K19l07j75L30J20l44n5L50rl37N4L22j19k95
$$ 233 100 -216 -41 253 29 -249 33 252 -55 -230 100 220 -124 -179 171 162 -175 -121 201 82 -213
3657b13J47K69j65k45K05K17k25j95K55J61k77j25K96Q5l21l1L31ml38N3L49j25
$$ -213 -66 203 38 -207 -2 215 -10 -205 50 211 -66 -191 105 190 -131 -162 169 165 -173 -120 229 104
3679A04l30J84K94k33k51K65K06k88j65L11J05l23m4L11Ql21M1L01p7k89J15K64
$$ 104 -226 -42 252 19 -232 33 239 -49 -214 97 202 -121 -165 146 154 -167 -126 175 98 -191 -76 188
3701A88j39k56J87K29k13k09K59J70k97j27L08R3l25l9L28Ol52P1L29j08l23J75
$$ 188 49 -207 -20 209 -4 -213 46 216 -81 -208 100 193 -132 -171 157 163 -189 -118 211 103 -220 -45
3723d5K76k12k27K34J96k67j41K78J02k94p0K95L6k96QK95n5k90Q2K74j08k62
$$ -45 231 19 -208 26 222 -45 -186 92 194 -100 -170 125 161 -135 -127 168 113 -177 -95 179 71 -191
3745a91J58K36j93k25K36K01k74j57L04J04l18m5L32j5l27O0L18j11k96J65K62
$$ -191 -33 203 10 -215 21 222 -52 -209 95 199 -119 -164 168 153 -174 -114 204 93 -203 -38 224
3766B24j99k10K00J93k32j51K44J23k64q5K68N0k70k3K69j8k71M6K85j00k79J49
$$ 224 25 -185 15 208 -24 -175 69 192 -72 -157 111 161 -109 -132 137 119 -152 -106 179 79 -200 -51
3788e1K69j96k34K25K04k74j39K84R2k86m9K99Jk88M3K86r4k51J10K37j43k07
$$ -51 218 22 -212 13 217 -57 -196 88 180 -106 -155 144 145 -143 -100 186 92 -159 -49 188 45 -162
3810a62J69J89j98j71K14J37k30j14K50R5k70m6K71Lk82M0K75p3k83J36K42j68
$$ -162 7 196 -2 -173 41 178 -52 -166 84 179 -91 -137 134 137 -145 -105 170 97 -186 -50 192 24
3832B4k22K11J87k49j38K51J06k74m4K63Lk30PK51m7k40R4K08j00k07J27K01j62
$$ 24 -198 13 200 -49 -187 64 170 -104 -148 115 118 -112 -105 146 99 -141 -47 161 61 -146 -19 182 20
3855B0j78J72J62k05j35K33R2k47n7K60K3k81L9K67p9k56J22K29j72j86J87J72
$$ 20 -158 14 176 -29 -164 69 161 -86 -143 117 140 -141 -102 165 86 -170 -48 181 9 -177 10 182
3877A82k16j36K26R8k33o3K36K6k16j1K31l1k20N4K24p8k17J07K11j35k17J96
$$ 182 -34 -170 56 154 -79 -142 94 120 -96 -107 124 93 -127 -73 151 73 -144 -37 174 39 -178 18
3899A8J80k10j58K39J08k53p1K52K9k70K2K62n8k36Q8K27j41j91J53J68j65j46
$$ 18 198 -12 -170 69 177 -76 -147 105 134 -136 -114 148 90 -146 -58 169 28 -163 -10 158 -7 -153
3921a53J98J01j96p7K03N3k09l8K26J0k29K9K23n2k31R6K17j27k08J73J68j93
$$ -153 45 146 -50 -127 76 129 -80 -118 108 118 -111 -82 141 89 -142 -46 171 44 -164 9 177 -16
3943a6j50K26J06k45n4K46K0k45J1K34n3k21Q4J86r7j84J30J71j59j32J60J20
$$ -16 -166 60 166 -79 -133 113 133 -112 -101 133 80 -141 -57 129 32 -152 -22 149 -10 -142 18 138
3965A38j73j05K03Q4k19m8K23K6k44K3K40m6k51R6K27j30j99J55J76j90j38K04
$$ 138 -35 -140 63 147 -72 -120 103 129 -115 -92 148 102 -149 -53 174 44 -155 0 176 -14 -152 52
3987E2J10k28o9K35K5k23lK20m5j94N4J77o2j81R4J78j22j63J32J59j70j22J94
$$ 52 162 -66 -135 100 125 -98 -101 119 74 -120 -66 111 49 -132 -38 140 18 -145 -13 146 -24 -146 48
4010D8R4k09p1K35K6k31RK36m8k26Q8K11j19j89J49J57j67j33J86J00k06o8K09
$$ 48 142 -67 -138 97 123 -108 -99 137 89 -137 -49 162 43 -146 3 160 -7 -140 46 146 -60 -128 81
4033H1L1j81k7J91Pk06K5J96n4j91Q2J82j06j79J36J61j59j39J88J03k02q3K39
$$ 81 112 -69 -96 95 102 -104 -79 117 63 -128 -46 136 30 -149 -13 148 -11 -150 38 141 -61 -144 95
4056I5K0k25RK30m4k14P8J96j08j67J18J53j35j27J58R4j65q6J84M5j74l3J79
$$ 95 115 -110 -101 129 85 -129 -51 145 37 -130 -12 141 6 -121 37 131 -34 -120 64 109 -65 -98 81
4079H1J6j80NJ86l9j87O8J91j06j76J39J46j59j28J93Q6j92n6K05L1k26K1K03
$$ 81 97 -83 -78 108 69 -118 -50 141 35 -141 -2 144 -15 -143 50 136 -56 -112 93 124 -102 -81 122
4102A22l2k11P4J74q6j53J09J38j19j40J44J11j55r5J65P8j72p2J98L1j94oJ98
$$ 122 90 -121 -47 127 41 -112 -3 135 16 -124 20 131 -24 -119 46 124 -48 -120 78 109 -85 -91 107
4125A07l6k03P0J98j06j75J27J53j53j22J82P6j77n3J96L0k00MJ84k8j74M9J66
$$ 107 71 -132 -62 136 30 -145 -18 135 -18 -140 42 118 -59 -112 84 114 -86 -82 102 74 -100 -51 115
4148A15o3j56Q9J40j01j45J27J28j42j04J52R1j79o7J88L3j88lJ87j9k00P2J79
$$ 115 52 -104 -15 125 24 -121 6 134 -8 -112 40 131 -48 -115 73 106 -82 -85 102 83 -117 -45 134
4171A34r8j64J22J39j50j03J51Q8j74n3J77L4j70rJ61%j68L1J70n6j59O4J59q9
$$ 134 36 -128 -6 133 -17 -120 31 119 -55 -108 69 103 -67 -76 85 85 -83 -52 118 62 -97 -33 126 37
4195C7j49J22J19j27j18J46J04j79o3J79M4j98mJ95m3j76P3J57r6j47J11J32j23
$$ 37 -112 10 129 2 -116 30 134 -45 -108 71 115 -83 -87 108 65 -111 -38 119 23 -124 -13 119 -4
4218dr8J34O6j40o2J61M0j61k5J71Nj71K2J70n1j54P0J54r4j43J11J20j24j16
$$ -4 -102 32 98 -42 -104 57 97 -64 -89 82 87 -84 -62 108 57 -97 -27 127 33 -110 1 121 -3 -119
4242a19J71P8j79n1J76J7j79J6J84n6j60O6J45p9j34R4J16j07r8J20O6j08p6J40
$$ -119 52 130 -49 -100 76 93 -86 -70 114 58 -102 -36 109 30 -104 -10 106 -1 -99 21 87 -21 -97 43
4266D3N6j49l0J52J0j58J1J65l6j63O6J60j07j34J20J26j48q5J57O6j70m7J65
$$ 43 99 -50 -80 72 82 -76 -65 100 64 -99 -33 127 20 -114 6 132 -16 -101 56 122 -48 -95 70
4289G0K0j64PJ56l1j49N2J42o7j28P4J19q8j15J06R7j15r7J37P2j46m3J54L2j64
$$ 70 90 -74 -67 89 58 -91 -39 103 36 -92 -18 101 13 -102 4 101 -14 -111 26 98 -48 -91 63 95 -69
4314f9JJ69l8j65O2J50q0j31J13J13j25r7J30P2j47l8J38L8j55mJ42l0j20L1J33
$$ -69 -68 101 63 -102 -40 110 30 -101 12 125 0 -97 33 105 -42 -80 58 96 -59 -63 79 49 -71 -40 93
4339I3m5j35N9J21p4j26J06R1j01j00J45P7j55m5J57K5j80K1J74m4j53O0J46q2
$$ 93 48 -87 -28 93 19 -107 -1 90 -11 -111 34 111 -44 -89 68 93 -87 -66 108 64 -89 -29 117 35
4363C5j25R7J06j14q5J26M8j13n9J25N0j38k0J28Oj28%J30j9j39M5J39p7j12Q3
$$ 35 -90 7 113 -1 -86 40 88 -25 -84 41 91 -47 -67 61 67 -61 -61 69 50 -89 -44 95 18 -94 -11
4388a1J13j10r2J28N9j31m9J58J8j46MJ51m8j24M8J32o5j25Q6J07j07p4J00O5
$$ -11 102 -8 -100 28 87 -44 -93 65 83 -63 -59 92 44 -80 -32 100 35 -90 -4 103 -4 -78 22 87
4412H7j08o4J35L9j26l1J32J6j40JJ35k1j42M4J38o4j38J06J03j25p6J30P0j40
$$ 87 -21 -85 50 89 -37 -68 64 80 -60 -59 76 55 -87 -43 95 31 -107 -1 102 -23 -99 31 101 -39
4436c9n1J39K4j43K1J24qj44M8J18n7j09O7R8p0j01R6P7j00o8J04O0j19m7J45
$$ -39 -90 49 73 -70 -49 75 67 -77 -29 89 32 -77 -10 88 18 -83 13 90 -10 -78 26 86 -33 -80 65
4461F5K2j51LJ43k7j39M9J43q6j23R5J05j10q1J19N6j18m6J36J3j26mJ41k6j18
$$ 65 87 -64 -61 82 55 -84 -35 108 22 -101 -6 99 -11 -92 27 83 -35 -81 55 68 -58 -62 79 53 -65
4486f5K0J28m7j09N4J04p1r9Q9J06j09r4J25P0j29m7J39J4j42MJ48k8j44M9J28
$$ -65 -45 83 36 -73 -19 85 14 -85 4 110 1 -93 32 102 -27 -74 65 79 -63 -59 89 61 -83 -34 94
4511I4p5j22J02R4j01q5J04P8j21m2J08K8j07j3J18lj21J2J28m2j00L0J22n3j15
$$ 94 19 -103 -1 93 -8 -93 11 89 -32 -74 34 62 -45 -58 60 57 -64 -52 76 34 -66 -36 86 33 -82
4536h2Q1J07j09p7J11O6j27n3J45K6j41oJ43k4j52N7J26p7r9P8R2r0p7R9O6j08
$$ -82 -1 106 -3 -80 31 97 -30 -83 62 88 -53 -59 84 60 -92 -35 91 14 -85 -7 85 -5 -82 17 83 -25
4562b5n0R8M6j14k5J27Nj11j0J42k8j35N9J18o7j24R6J18j23q4J21N5j33k9J34
$$ -25 -75 23 69 -45 -70 57 62 -49 -59 83 55 -80 -21 97 30 -94 2 120 -3 -87 34 89 -44 -73 61
4587F1J9j43KJ35k6j28N4J18o3j09O4R7p7q1Q5P0r3n9R5N8j16l9J25K3j24nJ36
$$ 61 80 -63 -61 74 48 -80 -26 92 29 -80 -16 81 4 -77 8 78 -15 -74 21 79 -37 -76 49 72 -52 -57 79
4614G9k3j33M6J27o2j28R8J02j18p3J20O0j32m3J55Lj31%J21k2j05K8R3l5j09
$$ 79 56 -77 -31 96 34 -94 4 106 -12 -85 35 95 -37 -80 75 78 -53 -53 68 46 -59 -31 62 27 -82
4639h2O6R3o5q1O7Q9r2p0R6O3j15m2J30J3j28QJ31l9j18N2J28p3j08R5Q7j06p7
$$ -82 -16 77 12 -69 -2 87 -5 -75 21 84 -31 -73 57 70 -58 -50 81 42 -76 -24 104 31 -77 18 105 -1 -78
4666g8J17N1j15k9J06K0j09j3J20k2j09K1J13m8r7N4R9p2q6O5R9j05p1J11N6j18
$$ -78 39 90 -25 -54 52 72 -37 -50 70 48 -61 -40 73 25 -72 -18 81 9 -77 -12 87 -18 -89 22 78 -40
4692d0l6J33J4j38J0J33l8j15N0J09o5j05J05O4r2o6J09M1r2m5J09K3j12KR8O
$$ -40 -76 57 71 -67 -57 76 38 -77 -27 82 17 -88 17 81 -11 -77 32 73 -19 -64 45 68 -44 -42 56 62
4718F2j19J2J18m2j06M7J06o7j06Q9R1j00o5J15L7j23k1J27Qj17K3J08m0j01N0
$$ 62 -57 -45 73 31 -75 -28 78 11 -95 -6 85 -15 -80 35 72 -51 -72 55 63 -54 -31 77 37 -64 -14
4743a4R1o3q2Q0O6p4o4P4N2q2n0J05K9j01k1J08Rj13QJ17l5j13M5J03p0p9P7P9
$$ -14 77 14 -68 12 78 4 -60 14 66 -16 -66 39 68 -33 -54 54 63 -50 -42 75 40 -73 -28 75 5 -74 3 82
4771H2j05m7J00L0j01l1J29Kj17J7R9k1r9M1R6o6o8O5P1o8o3O1O3q3n1R5L4j03
$$ 82 -23 -70 30 60 -41 -72 57 59 -58 -41 58 37 -62 -21 75 9 -59 6 77 9 -54 7 70 -13 -64 31 65 -38
4799c8k5J08Mj00LJ17l3j12M9R0n7q5R1O1q3n4Q1M1r4j9R2J6j00NR4j5r0K8P9
$$ -38 -63 45 49 -51 -48 69 36 -76 -27 63 6 -79 12 73 -10 -64 17 58 -36 -55 37 53 -47 -42 52 37 -53 -25 54
4828E4k8q2N3Q4o7p0P0O2q1n2J01K7j01k3J10Mj07J8R3k4r8K8R7n9q1O9P6r3m6
$$ 54 26 -56 -3 81 14 -56 14 76 -5 -57 44 71 -30 -53 57 61 -46 -28 65 41 -57 -29 68 9 -72 -3 73 -20 -66
4857f6Q2M4q2m1Q1K5q0rQ9jr0J1R9l4q2L2Q5n4o4O5O4p8o2R1N1j06j8J10jj06
$$ -66 16 60 -22 -63 18 43 -37 -46 43 42 -48 -37 62 28 -54 -22 63 9 -55 10 74 -4 -66 25 76 -30 -48 62 61 -45
4887d5MJ08k4j05N0Q3o4p3O9N2o5o0P6M9o7m4P7L4q8k1R4Rr7QJ04l3q5K7R7n6
$$ -45 -41 67 43 -62 -12 71 7 -66 3 55 -10 -70 6 55 -12 -56 21 55 -33 -54 40 49 -48 -40 64 31 -54 -27 70 14
4917A4p5P0O8q9n6J04L4j02k2J06Jr8%R8k2r7M6P1m4p1N7O0n3o1O2N0o4l9O3M5
$$ 14 -61 9 77 -12 -68 36 70 -32 -54 52 53 -45 -45 53 31 -66 -20 51 7 -64 -7 53 0 -61 1 51 -13 -52 11 56
4947E6p5l5J00Mr3MR4rj04M0Q0m1q1O4O0p4n0Q2M0r3j5R1Or0OR3k5q3K7O5k9p9
$$ 56 -19 -54 46 50 -43 -39 55 46 -58 -18 62 21 -60 4 64 -10 -60 22 62 -31 -46 45 51 -39 -33 60 35 -48 -21 44 15 -64
4979f4N7N7m8o3N5N7o6m2P3L4q4j6R5Mq6LJ00l1r3N4O8n8o3P8M9p4m3P0M5r4k4
$$ -64 -7 50 2 -61 -6 51 -15 -57 16 50 -34 -50 45 49 -37 -34 66 35 -58 -4 64 6 -57 21 70 -4 -47 23 68 -26 -50
5010e0R2J3q1j1P5kq0J2Q5j4r6M2P5n9p2N9O4o7m9Q4M0r5j2Q3Or4J7R0l0q1M7
$$ -50 42 55 -26 -37 38 36 -44 -32 53 39 -57 -15 60 1 -71 -12 52 -15 -64 20 60 -35 -47 36 42 -52 -35 55 25 -56 -9
5041iP6n1p5O5M9n5l2N0L3n5k4P0J5p3j8P6jp7J3P4j3r5M0P3m9p1O2O1p5m5P7
$$ -9 67 16 -59 6 55 0 -32 18 51 -4 -28 42 57 -16 -34 42 41 -36 -23 51 38 -57 -17 56 7 -64 -2 59 -16 -61 16
5072A6L3q4j8R1J7r7J6Q4l8o3K8P0m0o3M4O3n8m9O7M2o8l1O7L0q0k4R3nq0mQ9
$$ 16 49 -35 -53 38 55 -42 -26 58 20 -43 -15 55 15 -48 -4 59 1 -48 19 61 -7 -38 29 59 -21 -45 48 43 -37 -41 48
5103D8j5q2L2P7m8p9P3M7p1k7O4J8o8k0Q3Lp5J5O9j6o3K5O5l9p0M3N7l5n2O0M2
$$ 48 33 -49 -17 60 12 -67 6 53 -18 -45 19 37 -31 -51 32 35 -40 -25 44 28 -35 -10 55 16 -54 -11 46 11 -41 19 61
5134F1n7m9Q2J8q5%P1Jq7J0R0l6p3M2P6o1n5P0L4o8l9P2K8p2j5O8Lo2jP4k0n7
$$ 61 4 -45 37 55 -30 -30 41 42 -45 -35 55 19 -54 -12 64 3 -52 18 52 -16 -55 17 45 -27 -42 26 29 -33 -34 40 20 -37
5166c7J7O4k1p0N3M0l2o7O6M4o5k7P0J5p7KO7Kq5L3O9m6o1M1N4n3m6M4M3m4l9
$$ -37 -20 44 23 -47 6 46 14 -53 13 57 -8 -35 35 50 -27 -25 42 44 -41 -8 61 15 -46 -5 49 -4 -50 -6 37 -7 -46
5197d6N9K2o5j1O4Po4J3O1j0p3K6N9l1m8L5N3m2m9O6K9o4k3O6Ro4JO9j5p6K0O2
$$ -46 13 35 -30 -41 23 30 -34 -21 40 30 -43 -17 42 11 -37 -2 51 9 -40 26 55 -9 -32 34 43 -21 -20 49 34 -42 -22 40
5229D0j6o1L7M1m3m0L9M3m4l1M8J7l9k1N1%m9OM9om7RO7k4n4L2M5m2m9O0L5o3
$$ 40 24 -37 0 41 -2 -42 -3 40 -4 -35 13 30 -9 -30 21 21 -28 -22 27 21 -26 -17 50 26 -28 4 49 7 -42 18 53 -10
5261a0k4P3Lp1QO7qo4K1M7k6n2L7L2l0l2L5K0k2l8N1J9o0OM3J1n5lN8j0p3L1P0
$$ -10 -34 39 42 -29 -21 46 38 -26 -5 42 16 -36 1 33 3 -29 6 26 4 -34 17 36 -24 -18 25 36 -19 -22 36 26 -47 -16 54
5294E4m2n2N9K0n0k3O2J4n5j6N4Nm9J1N1pn0J0M4j8m5K6M5l6l7M0K5m0k9L7L1
$$ 54 12 -40 19 39 -11 -34 28 42 -13 -29 25 30 -19 -8 43 36 -14 -4 40 22 -23 3 48 12 -25 15 40 0 -29 8 39
5325C9m8k1N3J0n4NN2j5n1K7M4l5l5M1M4m8j8M0J6n3oM5Lm5pM8km7J5L3j8m0J8
$$ 39 -9 -30 23 33 -21 -16 36 21 -30 -3 41 6 -29 12 56 8 -10 30 46 -7 -13 32 35 -10 -17 31 29 -18 -3 30 12 -28 -10
5358a0M0k5l2L0L1m7k6N2J9n0rN1No3J9M7j1m8J7N2m2l6L9M1m8k2L7K4m3nL3l
$$ -10 30 5 -27 3 34 -13 -39 13 32 -18 -27 24 29 -34 -15 32 21 -27 -10 42 0 -36 3 44 -4 -26 11 35 -8 -13 20 17
5390A7l4LL8Kl8OL8pm7K3K4j2m5L7J9l7k4M5K1n2pN1nn3J7M9j9n0K4M3l1l1L7
$$ 17 -17 -14 24 26 -12 -6 32 25 -22 1 25 13 -32 5 24 -13 -37 8 29 -23 -30 21 16 -37 -20 29 10 -40 -16 27 -4 -35 2
5423BK4l1j6L0J6l1rK9Mk0j6L3J7l8JM1k3m1K9M4l8l6K4L8m1k2M3J1n8J3M7j0
$$ 2 26 -5 -21 9 25 -6 -15 14 18 -2 -18 15 32 -6 -5 36 13 -28 1 45 7 -29 -5 33 -8 -30 13 24 -34 -21 26 16
5455A6m2J9L0k0l7L1L5k4k2K4J7k3k4L0J4j8j8K8Qk6oL1Jl7RL2qm2K2M2l1l2L5
$$ 16 -26 -7 23 3 -34 -3 32 8 -14 10 27 4 -20 10 24 6 -12 16 24 -2 -8 23 24 -13 -4 28 20 -22 0 42 11 -21 14
5488A4Rl9qL4J2l3j4M1ql0PL5j4k5J9L1l0j3QK3j9j2K9J5k2k0L4ll3KL8pm0J4
$$ 14 23 -16 -24 10 22 -11 -25 16 8 -22 -15 20 6 -19 0 31 1 -12 -4 19 0 -12 17 32 10 -10 24 21 -12 -10 28 21 -19 -5
5522eM0k1m4L0L1k9k7L9Nk6j3L4jl2kL4ol2J0L2j6j8KL6j7l0K8K5k9j9L7Ml4j
$$ -5 35 14 -30 0 31 2 -25 14 19 -7 -20 14 13 -19 -21 13 7 -25 -15 17 1 -17 -15 21 4 -26 2 27 -2 -21 16 20 -14 -15
5556a5M4Nm0ML5k0l8K8K6k0l5K7L7m3j7L7Pk6j6L9j5j8KK9rj9%K7%m6J7K6rk3
$$ -15 29 34 -6 -2 33 13 -25 3 29 9 -26 1 38 -5 -22 15 22 -4 -20 19 4 -14 -12 17 8 -11 -11 16 16 -30 -13 13 4 -19
5590a9J2L7l9j2L3J0k7nM1pl9J1K5j6k5J6L6k6k7L4K1m4KK5Ml4lL6ok9mL1nk2
$$ -19 -7 30 -9 -21 12 22 -5 -10 31 24 -15 -4 21 5 -20 -4 32 6 -21 13 34 -10 -8 17 21 -13 -16 20 14 -15 -19 12 7 -15
5624a5PK5j4m1L3K8j6k0K5K0m0j0L6lk4oM1lm0RL3j1l9L6J9l5j0J9K0k7j5L6l
$$ -15 -8 17 3 -38 -5 23 7 -13 12 32 -8 -18 18 15 -9 -15 26 23 -17 -8 25 14 -25 11 30 -5 -15 4 24 -3 -18 18 15
5657A5j4pJ7Pl0LJ7Pm1J7M3l7k8K7L7l5l2M6Jj8k6M5%m1QM2j0l3K7K0j7k1J2K3
$$ 15 1 -6 11 18 -12 -9 8 15 -26 -9 34 -3 -31 -4 33 -2 -34 12 13 -5 -31 14 14 -27 -19 23 13 -20 7 27 10 -11 1 24
5691B4j9j8K6J0k2k2L6Ml1rM0om5K8K6j1k9LL9l1l0L1L6m1j5M4Pl9j0M7nl9J1
$$ 24 5 -13 13 23 1 -21 15 19 -12 -21 19 13 -32 -4 22 11 -18 -15 24 -7 -37 -6 30 -11 -26 18 25 -14 -24 23 18 -21 -10
5724a0L5j0l0J7K8k1j7K1J5k5j5K3Nk9lK8kk1kL2j3k9LL6j4k9J8L7l0l3L4K3m0
$$ -10 25 15 -15 2 30 9 -8 13 28 3 -12 11 16 -13 -16 12 10 -11 -13 19 6 -23 -20 16 2 -27 -9 28 -2 -35 -1 22 -18
5757a8%K8Mk3j4M3j0k6LL6j8k5K8J4j5j4K2Rj3k8K7J7l0j5L7Kl0j1M1nm6K6L4
$$ -18 -18 10 14 -9 -23 20 10 -16 -13 23 5 -20 8 22 7 -7 15 24 11 -17 10 27 -3 -18 19 21 -9 -20 21 16 -30 -4 30
5790C0m1k1L3K4m7lL3Mk9NK8jl3J4K1ol0K5J5j7j6QL0k8rJ9J3k3%J8J2m1kL5j0
$$ 30 -11 -32 1 25 -22 -25 8 12 -17 -12 16 15 -18 -4 17 11 -19 6 21 4 -12 -4 26 -2 -11 8 21 -2 -2 16 28 -13 -15 20 10
5825A0k5ML4j2l7K0K3k7k9M5K0l5k6L8J4n0J1K6Kl0K1J8j0j9J1K8j9k9J2M0k9
$$ 10 -15 -11 23 11 -26 -6 17 -10 -39 6 26 -9 -35 3 17 -33 -22 4 6 -24 -3 15 5 -14 -3 25 6 -23 -11 29 0
5856@j0K4K4m5j5L7Ml6RL7k2l5J3L8j2l8K6K0k0k7L8Rl2%K5ll1J2K0rk7RL4pk9
$$ 0 -10 14 38 -7 -22 15 19 -17 -8 29 7 -28 -15 23 11 -27 -1 19 -1 -28 10 19 -13 -13 12 9 -22 -10 10 1 -26 -17 17 10 -19
5891a9K5K6j8l8K6K6l0k4L5J8k9pM0j4k9jM0j4l5J2M2k5k4J5L0k8l1M7Ml1oK1
$$ -19 6 32 14 -24 2 28 -2 -26 9 27 -2 -9 31 17 -12 -13 27 13 -22 -10 32 7 -17 -2 28 0 -31 16 20 -11 -17 4
5923DQk2kK1Lk5lM2k1k9J5L2j5l7K6L5l2j9M4J4n1OL1Qm1mM5j3m8M0K1l2j8J3
$$ 4 12 -10 -12 9 12 -13 -16 26 5 -24 -9 23 8 -29 -3 32 0 -19 25 39 -12 -6 25 33 -8 -12 33 20 -28 12 33 1 -17 -4
5957dK5j7k7K8J2l2rL6Kl1KL8jl7%M3k0k8K3L1l9j6K6L0l3k2L9J4l5j4M6mm6J7
$$ -4 21 4 -23 5 17 -15 -24 12 14 -17 -15 23 22 -15 -15 28 8 -20 3 34 -5 -21 5 35 2 -20 19 33 -2 -16 30 26 -20 -3
5991cL1pm4K1K7j3k6J8J4j8j5J6K1l3j4K3J1k7qM0Ol6%M4j1m4K0L6k8k0K5K9l8
$$ -3 28 21 -23 -2 25 12 -14 4 18 0 -15 1 22 -11 -25 -2 9 -18 -26 14 20 -16 -16 28 17 -27 -7 29 1 -19 6 35 -3
6024cj9M6lk5j3M7j1k8J5J3ok9J6L0j8l8K5K6l0k0K8K9m3j5L6J5m3j7M2Ml7PL8
$$ -3 -22 24 21 -4 -17 30 19 -9 6 19 13 -16 0 30 12 -26 -1 25 -5 -25 3 32 -11 -26 10 25 -18 -35 7 11 -26 -19 19
6057A9ll9J9L0k4k8K6K7k7j7L3J3l8MM1qm0OL1ll4J2L6l0l0K7K7k6k0L1J2k6k8
$$ 19 16 -23 -4 26 2 -26 0 27 0 -17 16 29 -9 -5 36 28 -12 -6 25 22 -12 0 36 6 -24 3 30 4 -16 15 27 1 -27
6090b7M3Mm3%L5Pl0lM3j8l3J8M6l8k2L1J6k4j7L2Jj8j2L5ll1OK7j1k7J5L7k3m7
$$ -27 16 20 -23 -23 12 19 -11 -14 29 11 -22 -4 42 4 -18 13 29 5 -12 20 21 3 -9 26 23 -8 -2 25 14 -13 2 39 16 -31
6124c1L2K9k5k9L2L4n1j2L6J1l3j0M2om9K2L2j3m4L0L0k1k7L7K2l3k0L2Lk7pM0
$$ -31 1 30 5 -24 8 42 -9 -21 15 26 -7 -17 25 19 -30 -8 24 11 -33 -3 27 6 -21 16 38 5 -15 17 20 -7 -14 26
6156B6Ql7%L5rm1K1L8k0m6L1K6k9k6L3K0m0k4N2Km2NM1rl3ML7j7j7RK4j9k4K6
$$ 26 34 -3 -3 32 23 -18 3 41 21 -25 6 32 3 -23 10 30 -10 -34 18 20 -22 -17 24 15 -18 -14 23 6 -11 -2 22 3 -21 5
6190EJ7k2k6L8J9l9qN4j2m6RN0j5m6J7N0l3l4L2K8l1l9M5J4m4nN5j5m3J4L1pl7
$$ 5 22 0 -26 12 31 -8 -16 38 26 -20 -11 39 24 -22 -5 45 12 -22 10 38 7 -32 13 27 -17 -22 33 18 -25 -11 20 13 -24
6223b4QL6rm7M0L1l2l6M0K2k4l6N1K0n4lL2K3n7OM6j7m0K4M2l5l1L8J9l6j1L7
$$ -24 -16 20 11 -36 4 35 3 -33 7 29 5 -31 20 40 -14 -17 15 38 -19 -13 33 16 -24 0 42 7 -24 14 33 -3 -14 23
6255B3Mn6OM9lm7QM3j1l4J7K2k0k6K7K9l3k1K9L3l5l0M6J3m7kM8om6RM5j1m5J7
$$ 23 27 -29 -23 26 23 -24 -16 27 16 -18 -1 21 1 -25 2 31 -2 -23 6 39 4 -26 20 33 -14 -16 32 26 -20 -11 34 23 -22 -5
6289eN0l5l6K6K7k6k3L5J9m0j8M0Qm5J7K0j0k9J7M2l9l3K8M3m2l0M8K3l4k8M8
$$ -5 45 10 -26 0 27 1 -22 13 32 -8 -26 14 22 -23 -6 14 4 -25 -8 34 -5 -38 -10 33 -9 -39 9 32 -2 -30 18
6320A8K0m1j5N0km0pM3j1m3K4L7l1l4M4J9k9k0L8J2m5qL7Jm9J1M2j4n6M0L9k5
$$ 18 38 -3 -18 32 30 -10 -17 26 15 -28 -4 33 2 -32 12 31 2 -18 20 32 -13 -21 16 17 -32 -21 21 7 -49 -9 30 5
6352Em0L3L6l2l1M4K1n2j2N8ll8nN1ol7MM5k0m1K6L3k6k6K7K6l8j7L6Rk9k7M1
$$ 5 -35 -2 34 2 -29 15 36 -16 -28 30 27 -11 -16 35 29 -8 -4 41 21 -20 6 39 13 -13 14 40 2 -15 21 30 1 -26 15
6385A5J7n3kN9k2m3J7N1k7m7L3L5l3k7L7K5m7lM3%m8J2M2j7l1J6L4k3k7K5L9l3
$$ 15 32 -21 -23 36 14 -29 -12 39 12 -35 -2 33 0 -27 10 35 -12 -15 28 28 -20 -8 34 17 -14 2 36 13 -14 11 50 17
6417A7l9L6L5m5l4M9K5n4%L7Mn6JM9j5l4RN4k4m6L2L3m1j2L1J8l7j0M2J3n3MM9
$$ 17 -22 14 49 4 -30 19 44 -10 -10 27 31 -25 -24 25 10 -24 -15 39 15 -31 1 34 -7 -19 12 30 -7 -17 25 38 -15 -11 38
6450C8kn0J7L9j8m6J4M7k4l1J8L5m1k3M3J8m6j6N8nm9KO5k9m8L2L0k0m1L6J4k1
$$ 38 36 -14 3 42 24 -22 -8 39 15 -16 2 37 -4 -27 16 34 -12 -28 30 25 -24 -22 43 14 -34 -2 28 8 -33 3 17 -4
6482dk6M0J3k9k3N3ml4%M1Km0JM0j0m4K4N3l5l9L2L1m1k1M0Rl3k2N0on2J3M5j3
$$ -4 -30 10 23 -6 -29 24 20 -14 -14 27 29 -11 -10 30 20 -24 0 53 18 -21 11 42 1 -20 20 29 -4 -26 24 18 -34 -21 24 11
6516A1m2K6J6j6l1L8L0l4k1L7J1l9j1M2K0n7nM6%m6J1M3jo0L1L7l0l6L8M5n9j9
$$ 11 -31 -5 11 -5 -36 2 32 -2 -23 14 25 -14 -25 17 37 -20 -25 21 21 -25 -14 29 28 -32 -1 36 6 -30 8 53 -6 -25
6548b5L5K1m8KM8j4m6OM6j1l9J7K8j7k8K9L1m3k9M4K6m5rM2Om8MN3j4m5K0L9k1
$$ -25 10 31 -17 -15 33 19 -27 -21 25 14 -25 -8 20 3 -25 4 35 -8 -37 7 33 -12 -21 21 27 -21 -17 36 22 -23 -3 36 15
6581A5m0K1N0l1m6N3K3m2l2M4J9m1k0O5pn3J8M2l3l0QL3j0n3M9K7l4k4L7L9o0
$$ 15 -25 -4 46 15 -31 22 45 3 -29 15 34 -7 -27 38 31 -22 -4 38 5 -25 -17 16 6 -47 2 29 -5 -29 8 47 -13
6612a3k0N5J1n2LM4jm3NN3l2l8L0M0k7l2K4K9l4k2L6J6m8RM0pm5J1M8k5m2J6M2
$$ -13 -33 22 33 -19 -16 28 27 -16 -11 42 10 -28 2 42 15 -17 7 36 2 -20 16 32 -16 -7 33 26 -19 -8 40 15 -27 -11 31
6645C1j6m9K7L5l8k5M1K0l4k3N3J9o5JN5Lo1J2M3j0m6M1L5m1l7M9K2m9j6M4J5
$$ 31 15 -34 -7 28 -10 -35 6 26 -8 -31 22 41 -24 -23 32 35 -26 -14 29 19 -27 14 49 8 -29 20 42 -7 -23 21 36
6676C6m6j5M7J5n1nN2qn7J0M7j1n6L2M9l7l9L6L8n0k0N4J5n7NM7rm9J8O4l9m1
$$ 36 -10 -25 22 37 -14 -19 33 25 -32 -22 25 14 -42 -10 39 2 -37 -1 37 -13 -33 21 36 -21 -16 31 22 -27 -9 55 16 -25
6708b5L6L0k7l7M9J5m1k8N4J4m8j6N2J2n0mM0mn0J4N4k8n4L2N4m9l5M7K7n0j6
$$ -25 11 41 14 -23 26 41 0 -28 26 40 -8 -24 28 40 -10 -14 26 22 -28 -14 40 12 -42 -10 44 -5 -40 7 34 -16 -32
6739c2N3Rn2JM6Kn2J2N0j5n6L1L8k7l4M2L0m1l3N0J4n5lN1Mo0J5L5kn1K0M3k6
$$ -32 21 30 -22 -21 25 27 -25 -13 37 22 -34 -3 35 8 -26 16 46 5 -28 22 36 -19 -22 29 33 -27 -12 23 21 -30 -10 33 7
6772Gn3L9M3m6l8O5J8n9kM5%m3J2M8j5m7K0M6l0l8K5L8k4m2M0L9m2l1L9K4m4k5
$$ 7 -46 -7 36 -10 -48 17 35 -24 -26 19 19 -24 -12 36 21 -26 -6 40 10 -28 -3 35 11 -31 9 48 6 -25 14 38 -6 -31
6804c1O0Jn6J6N1rn4J3M9k2n6L2N1n5k8N5J5m9k0O0km2NM0pm6J0O2k8m1K7M8l3
$$ -31 29 30 -26 -10 41 32 -22 -9 40 18 -38 -6 45 -10 -38 17 32 -17 -37 23 21 -21 -16 24 17 -29 -19 43 15 -26 1 49 16
6837A6m4M4K5m8k2N7J9o5j1N8kn4QN4j0n6J5N4l9l8M8L4n1k8M5K0n9KN1mm6NN2
$$ 16 -28 16 41 -7 -29 28 47 -18 -29 29 27 -27 -19 35 25 -31 -16 38 -1 -39 9 43 -8 -36 9 29 -30 -28 23 19 -27 -22 30
6870C0j7l6KN3k0m4L4M8l7m2M4K0m3k2N6J8o0qN3pm6RN0k2n4K5N1k8m4L4L5m6
$$ 30 13 -23 -21 32 12 -32 2 50 13 -29 15 35 -8 -30 26 44 -16 -24 29 22 -24 -15 35 13 -41 -16 35 7 -37 -3 32 -14
6902a4j8L5J9m7pN1J2n1oN6%n5J1M7k2m8L6L6l4m1N0L5m9l4O6J7n6pO5rn5QM8
$$ -14 -32 3 22 -25 -32 19 31 -20 -26 30 30 -25 -14 33 11 -37 -1 35 1 -40 10 45 -4 -38 28 45 -11 -18 47 38 -17 -9 39
6935C9l1l2J4M8m2l4L0M1l8l2M8J6l5k6M6J3m6j5O1jm7RN2j9m8L1M0k5m4M5K7
$$ 39 8 -24 -10 38 -4 -38 -8 33 -5 -37 11 27 -8 -34 12 25 -21 -36 25 24 -23 -14 38 19 -29 2 42 17 -27 18 45
6966D5m9j9M0J9n0jM8ln8K4M0j6m7K3M3k1n3M6K4l3l6M4K1n3j4M2J5n0jO2no1
$$ 45 -4 -23 17 36 -14 -15 33 30 -28 -4 36 20 -27 -4 39 18 -35 11 35 2 -34 10 31 -22 -36 6 21 -29 -30 32 27 -34
6998c4J9N4l2m5L6L7l6k6M4K1m2k7O2%m0rO0j9n0J7M4j8m7K2M5l7l7L3L7m5k0
$$ -34 -15 39 7 -38 -2 35 -1 -27 17 38 -4 -31 31 31 -9 -18 42 23 -27 -10 34 16 -31 -9 36 -1 -38 -5 32 -13 -33
7029c3M9J6n0k6N5J6n0lM9j3m3K2M5k0n2M2L4k5m7M4K6l7j5M8Om0j5N1qn0RM8
$$ -33 16 32 -18 -44 11 27 -23 -26 23 10 -33 -11 34 14 -38 4 38 13 -34 10 36 -1 -16 32 38 -2 -17 34 26 -24 -15 33
7061C3j3m4J2M2k6l4K5M8n1l0M2L2m1k7O4j7l7nM6nm5K8M3k8m2L7K4k9l3N9J1
$$ 33 20 -24 -12 30 4 -30 -5 43 -8 -38 4 36 -5 -32 32 15 -22 -27 19 14 -31 -3 40 12 -30 7 31 2 -31 28 39
7092C9m4rK6K9n1j4O5j3n2J2O0k1n9J5N7k3m6K5L7n2k2M0L2n1j8N9ql8kM4jm6
$$ 39 -5 -14 12 41 -10 -24 41 28 -24 -12 48 27 -32 -17 40 17 -29 -4 33 -19 -41 -1 31 -20 -38 21 13 -25 -27 17 16 -30
7124c0JO1k4l9K4M1l4l0K6M6n2k5N1K0n2lM9J1o6J2M7qn1K0N2k9n1L7L0k9n2N5
$$ -30 -29 32 8 -31 -7 34 0 -30 -4 42 -10 -35 16 36 -16 -19 30 41 -25 -13 34 26 -25 -5 47 18 -33 4 34 5 -47 8
7156HK4n0j2N0Ln6nN7nn0L0M0k5l6K8L4k6l4K9K8l3k3N2J7n1j5N7jn4PM0Jn6J7
$$ 8 32 -18 -30 20 23 -33 -38 19 14 -36 -6 34 9 -27 1 35 9 -25 4 32 -1 -24 28 45 -6 -21 36 35 -19 -12 28 29 -27 -10
7190a0M9l1l4L9K8m0l5L7L1n9j7N8ll1mN1%n4NN4j1m6K6L7m3k6M6K5m3k4N0J8
$$ -10 39 8 -26 13 41 1 -34 3 34 -25 -42 16 13 -18 -22 29 29 -25 -20 34 23 -23 3 40 -3 -29 17 42 -1 -25 25 43
7222D3n2j9N7Nn9QO0j9n4K7M9m7l0M0L9n6l0M7K5n3pM3Lm6MM9%o1OO6j1o3L0M2
$$ 43 -9 -28 29 34 -25 -17 43 24 -30 -3 46 -1 -31 9 48 -8 -38 9 34 -19 -26 17 20 -26 -22 27 27 -34 -28 38 27 -36 -6 36
7256C6l1l4M1L1l8l1M7J5m7j0M9J4o5J9M5j7m5K2M9l2m6K8M2l9m1M6K4m6j5M8
$$ 36 5 -29 12 43 5 -26 21 36 -11 -21 28 42 -23 -4 41 24 -21 1 50 18 -28 0 42 3 -38 8 32 -14 -29 19
7286A9Mm5mN9j4n4K4N1k3m0J5N5m4k5L4L9m8k7M7K2o0jN7pm6NN4k3l9J5L5k3l1
$$ 19 23 -22 -26 33 19 -35 -11 40 17 -23 -8 47 3 -22 12 51 3 -24 23 45 -15 -16 41 34 -12 -7 47 24 -15 0 35 12 -19
7319a9L0L1m0l6M1L1n4k7N8J2n2oO1j3m3J1N1k9n3M2M6m1l0L7L9n8l1P6Lm0qN1
$$ -19 11 42 2 -34 7 38 -16 -43 15 27 -25 -31 30 17 -26 -15 36 7 -46 -4 42 1 -29 8 47 -11 -42 34 37 -3 -11 40
7351D0pn7J8N1l0m2K5L7j7n6M9L4l9m3M7L8n9k0M9J4n6lN4jo0J4M7j1n7L3N7n3
$$ 40 33 -24 -6 45 15 -27 -2 35 18 -38 11 45 6 -37 10 48 -11 -31 18 32 -24 -27 27 26 -34 -20 27 16 -41 -8 49 -4
7383dk8L1M0m8j6N3J6n7LM3j4m6J5O0k0m7K2L2k2m5M4L8m1l7N1J9m9j9M2J6n1
$$ -4 -32 -1 39 -9 -25 28 44 -13 -10 33 19 -27 -12 48 28 -19 3 35 13 -32 12 50 9 -28 23 42 -7 -26 16 32 -19
7414a9pO3j6n5J7M8k4m4L2M3l9l2M6K8n5j5M2K6n5mM3Jm0PN0k0m3J2N7k7m5L5
$$ -19 -26 37 21 -34 -17 31 7 -37 -5 38 -1 -33 13 41 -14 -29 13 39 -16 -20 23 24 -16 -9 41 21 -22 -10 47 20 -25 10
7446A0L1m8k1M2K2n5nL9J2m9j4O3kn0K0L6l1l2L5L3l9l3L2L7m3l1N0K8n1rM8J1
$$ 10 41 -7 -28 14 36 -19 -24 15 27 -22 -36 27 25 -25 -5 31 0 -32 3 36 -3 -36 -4 33 -10 -41 9 37 -14 -23 25 36
7478C6o1J1M5ln2K0M6k7m9L7M0m0k6L5K3m4j4M8Qn7kM7qm1RM3j9k9J0M6k5k5K2
$$ 36 -25 -14 31 28 -24 -4 42 15 -34 3 43 3 -23 12 35 -9 -23 25 33 -24 -26 21 13 -28 -19 24 5 -24 -14 32 7 -18 4
7511DM3n4j9M3J5m0j9O6Mn5PN0k2m8J4O2l3m1K7K5k0l9M5K2m4j8M2J1m7JN5k2
$$ 4 47 -7 -26 17 32 -8 -27 39 43 -12 -5 45 23 -25 -11 51 18 -23 4 29 9 -30 15 37 -7 -25 17 28 -19 -18 37 15
7543A5m4J5L6j5m1K6L7k0l5L8J8l3k6N2J3m2j7N4Nn7LN1j2m7J8O1l6m0L3K8l8
$$ 15 -29 -14 22 7 -34 -8 29 9 -26 12 30 -3 -29 23 36 -6 -23 31 36 -21 -18 33 21 -26 -8 53 17 -23 10 38 0
7574@k0M1J6m8j1M5J3l5j8M1j1m0J1L8j2m1K1M6k3m6L7L7l9k7M4J5m0j5M9Jn4
$$ 0 -20 21 37 -11 -22 23 36 1 -17 24 13 -27 -16 22 10 -31 -10 36 13 -33 4 41 2 -25 19 34 -6 -21 28 29 -25
7605b5J7N4j3n6L3L1k4l4L0K8l6l0M2K0m5j0L6Ol4j5M4J3n9pO2k0l3J5L4j4m2
$$ -25 -8 46 33 -23 10 41 17 -17 13 41 5 -25 17 37 -8 -18 18 24 -10 -25 19 32 -27 -34 28 8 -25 -10 24 10 -32
7636c2L6K9l8j5K9K2l5j8N3Km3oM6rn5L3M6k9k0K3K1m1j5K6K9m9j2L8J7m5j4M7
$$ -32 4 33 -5 -20 9 31 -4 -22 31 33 -10 -16 30 21 -34 -1 45 16 -4 19 40 -1 -16 10 39 -10 -22 16 33 -12 -26 21
7668B1ol7rN6j9m2J6M7j4m2L3L8m3k8M2J2l1k1N7Kn0KL9%m7K0M7l4l0L3K4l6k7
$$ 21 15 -22 -31 25 6 -36 -20 27 13 -29 4 42 -1 -29 13 25 -6 -27 30 32 -18 -16 23 23 -24 -4 43 9 -21 12 36 0 -27
7701b7L5L9m5k8N3Km7%L9J2n5PL6j4l4K0L2k4k3RM6m1k7L8L3n0j2N1Rm7jN0j7
$$ -27 8 47 2 -26 27 29 -18 -18 21 33 -22 -15 21 7 -27 -7 25 1 -22 -13 33 -8 -35 3 36 -14 -26 25 34 -13 -14 36 19
7734A9k6%M6k2l8K7L5l3l9M1K7m1l3N2J9m5j7N8mn3J8L8j4m9J2N1l3l7M7J4l6
$$ 19 -7 -7 39 17 -21 6 41 8 -31 10 37 -4 -37 15 34 -11 -28 30 26 -27 -9 29 15 -34 -22 29 -4 -41 6 20 -16
7765a6j7M5K2n1nM9%l7nM5mn4K6L2j9l1K1L8l3l8N0K0m6k6N1J2m2j3N1rm3PM7
$$ -16 -33 12 34 -17 -22 27 27 -10 -15 30 26 -28 -2 30 11 -20 1 39 6 -32 18 38 -8 -34 17 29 -13 -26 25 16 -27 -20 27
7798B7k3l6J9L5j9l1K8L4l9j9L3J3l5j3M9Pm2rM5Jl8KN7j6n8M2L2m0j8K2L3n8
$$ 27 4 -32 -13 22 3 -28 0 34 -5 -24 9 22 -13 -26 23 30 -12 -21 24 25 -13 -11 46 30 -28 14 46 6 -12 10 43 -15
7830a5k2O3Qm1qL7Jm3jN4k4l5K2L6k5l3K3L9m3j6L6J7n2NL5Ml6nN1rm3J0M7k0
$$ -15 -37 26 34 -7 -15 22 23 -20 -21 33 9 -26 -4 32 7 -26 -3 36 -7 -23 13 30 -22 -17 18 22 -14 -19 32 23 -20 -10 37 17
7864A7m4K9M2n2mL6J8m2k2L8J2m2rM8rl8jM5j4m4K5M1l0l5L2M4l6l2L3J9l3j6
$$ 17 -27 2 44 -8 -12 24 42 0 -22 16 28 -14 -23 25 16 -22 -23 22 8 -36 -11 30 0 -35 -3 41 5 -27 6 25 -8 -24
7896b4N2mm6J1M1pm6J5M4k2m7K3N0l0k7K9K0n1qM0K3n0j0M6Lm6kN2j5n1L1L7l1
$$ -24 28 24 -22 -11 30 23 -23 -8 36 14 -33 -10 40 10 -17 12 32 -19 -27 13 36 -14 -24 22 25 -21 -23 29 14 -37 -6 31 0
7929@k7K2L1k4l5L7K3m5qM2Nl9oN5rm5RN2k3l5K2M1m0k2K6L2m7k4M1K0l5j1L1
$$ 0 -27 -5 26 2 -33 4 27 -18 -26 16 21 -18 -24 31 22 -23 -14 38 15 -20 2 43 3 -19 7 39 -8 -32 9 29 -6 -17 14
7962A4J0m7%M4j3l4J6M0j9l8K1M2l7l4M3K6m0k1M8J3m6mM7rn1L3L4j9m6K7M4l1
$$ 14 24 -23 -23 21 8 -26 -10 30 11 -27 -6 36 -1 -35 8 34 -6 -27 21 34 -12 -16 31 22 -29 4 38 19 -27 0 44 13
7994A3l3L4K2k9k9N2Qm7lL1Jl7qN5j0n0K6L0k2k6J5M9m0k1L2K6m9oL4Qm3K3K8
$$ 13 -20 14 36 7 -22 30 38 -9 -12 19 20 -17 -25 30 20 -30 -4 26 4 -22 -7 42 2 -19 13 39 -10 -16 18 26 -17 6 34
8027C4j1l1RL8k2l5L1K7k6k9L4J3j8l2M2J2m5j0M1Ql8nL5kn2K1L3j8l3K8K7l3
$$ 34 23 -8 1 39 17 -18 13 40 14 -15 19 32 14 -18 24 36 -9 -19 22 30 -8 -13 22 20 -32 -11 22 4 -29 -1 26 -7
8059gj8L6J6l1k3N4Pm5%M7om6J9M1k9l4L5K9l1l0K9K6k4l5M4J1l7j5M1J5n5LL9
$$ -7 -25 11 27 -4 -27 27 34 -11 -11 36 30 -16 3 44 15 -19 16 45 14 -16 13 39 15 -20 24 35 -2 -17 24 39 -16 -13 26
8092B6pl9J4M2k6m7M2J2k0k8L5K3m4nM7Ll3pL0Pm4J0N3k5l3RL8k9k2J9M1l0l4
$$ 26 19 -20 -6 36 10 -37 5 17 -3 -31 4 27 -17 -22 25 28 -5 -12 18 25 -19 -9 44 19 -14 -5 33 4 -18 1 42 12 -22
8125b2M1Ok4j7M8km3kL8j4l4J3M0j7l4K5J8k9nK2K2l7j6M2J2m1j0L9jm5J1M5j0
$$ -22 19 25 1 -16 32 30 -13 -15 23 9 -25 -12 28 11 -23 2 20 -9 -14 8 30 -7 -23 19 31 -10 -20 19 18 -27 -16 29 19
8158A9l5J6L3k2l2L0L0l7j6L3J5m0j2M9pl6MM1j0m1J5L5k5k7K6J6k8j6L2Pl5k
$$ 19 -16 0 33 11 -21 9 39 2 -14 19 34 -6 -18 31 24 -12 -8 33 23 -18 -3 32 7 -20 6 22 -6 -22 10 17 -18 -20
8190b0L2
$$ -20 12
8191A2
$$ Imaginary data points
##PAGE= N=2
##DATA TABLE= (X++(I..I)), XYDATA
0@%%%%%%%%%%%qJ6j6J6j6K4l2M0m8N6o7P5q8J08j32J52j76K06k34K68l04L44l92
$$ 0 0 0 0 0 0 0 0 0 0 0 0 -8 8 -8 8 -8 16 -16 24 -24 32 -35 40 -48 60 -72 80 -96 110 -124 144 -160 184 -208
34b08M41m97N61o31P06p88Q78r76J084j201J331j472J624j792J977k178K397k639
$$ -208 233 -264 297 -334 372 -416 462 -514 570 -631 700 -772 852 -940 1037 -1141 1256 -1383
52a383K907l207L543l918M343m829N390o047O827p775Q953j0461J2473j5311J9634
$$ -1383 1524 -1683 1860 -2058 2285 -2544 2846 -3201 3626 -4149 4804 -5657 6816 -8495 11139
67A1139k7086M3377j39046J20471K62510l27263j50143K67394J13219k88057j2347
$$ 11139 -15947 27430 -111616 8855 271365 -55898 -206041 61353 174572 -113485 -125832
78a25832K79525m1981l14506J01517L19723j12739l22888J27341K81198j30255
$$ -125832 153693 111712 -202794 -101277 218446 105707 -217181 -89840 191358 61103
88F1103k30838J59804J63259j95707j14051K46389P6414k81151o1739K98370M6726
$$ 61103 -169735 -9931 153328 -42379 -156430 89959 166373 -114778 -176517 121853 168579
99A68579k84644k5658K56302j6874k21397P2579J98134j34526j87439J83962J87305
$$ 168579 -116065 -141723 114579 97705 -123692 -51113 147021 12495 -174944 9018 196323
110A96323k13132j82748K19255J63529k13138j23465K06651O8766k10502j0928
$$ 196323 -16809 -199557 19698 183227 -29911 -153376 53275 122041 -88461 -99389
120i9389K25477l6257k44444O5740K54870p9305k47023Q6758K18746r9286j76966
$$ -99389 126088 89831 -154613 -88873 165997 86692 -160331 -73573 145173 45887 -131079
131a31079J23655J33468j58099r9156J93539P8244k18366o6574K24814N4458k13016
$$ -131079 -7424 126044 -32055 -131211 62328 140572 -77794 -144368 80446 134904 -78112
142g8112l2555J90629k889j68510M7863J54792r2543j50817J26522J50722j44262
$$ -78112 -110667 79962 77073 -91437 -43574 111218 18675 -132142 -5620 145102 840
153H40j45071J47721J26327j44822r3037J44845N0779j53340r124J69088k3194
$$ 840 -144231 3490 129817 -15005 -108042 36803 87582 -65758 -74882 94206 71012
164G1012j84915M2859J91776n3167j83885O1955J61550p6776j31103J00637J01458
$$ 71012 -113903 -71044 120732 67565 -116320 -54365 107185 30409 -100694 -57 101401
175A01401j30310p9392J57915O6210j75214n7453J77989M5788j68126k5269J52223
$$ 101401 -28909 -108301 49614 115824 -59390 -116843 61146 106934 -61192 -86461 65762
186F5762n044j38154M0539J30731p3365j29378R6534J28682j07443j21754J09088
$$ 65762 60718 -77436 -36897 93834 20469 -108909 -12375 116307 8864 -112890 -3802
197c802J04080j08050p6168J10806M3322j20122j2850J33651r702j45299K3321
$$ -3802 100278 -7772 -83940 26866 70188 -49934 -62784 70867 61165 -84134 -60813
208f0813J48592l1709j40263M1045J21909n6259r9051P8226P8224j03268o3474
$$ -60813 87779 56070 -84193 -43148 78761 22502 -76549 1677 79901 -23367 -86841
219h6841J24945N4468j37532m6946J38897L5398j31625j6199J21187j0073j13157
$$ -86841 38104 92572 -44960 -91906 46991 82389 -49236 -65435 55752 45679 -67478
230f7478L8951J10042o4151j10300Q0996J09231q8672j01782R0333Q5528r1301
$$ -67478 -28527 81515 17364 -92936 -11940 97291 8619 -93163 -2830 82698 -8603
241h603o1922R5906L5819j05187j2842J16360l477j24429J3445J24857k0683j16085
$$ -8603 -70525 25381 61200 -43987 -56829 59531 56054 -68375 -54930 69927 49244 -66841
253f6841K9949J00386m4365q2498O3573O7247q3916n6923J00277N0288j08882
$$ -66841 -36892 63494 19129 -63369 204 67451 -16465 -73388 26889 77177 -31705
264c1705m3421J09073L2098j03550j4349R6895q496r2876L2219R2594n2086r3836
$$ -31705 -75126 33947 66045 -37505 -51854 45041 36545 -56331 -24112 68482 16396 -77440
276g7440O5120R2474p1488q4922P4306P0004p7580m9877Q4091K8782r3680j0931
$$ -77440 -12320 80154 8666 -76256 -1950 68054 -9526 -59403 24688 53470 -40210 -51141
288e1141J03417j630j09150R862J07858j6987r9219K6524Q5807m0219p1703N6952
$$ -51141 52276 50646 -58504 -48642 59216 42229 -56990 -30466 55341 15122 -56581 371
300C71O0358p3303n2850Q5382M7454r0793m0855Q9912K9979q5497j4005Q1281
$$ 371 60729 -12574 -65424 19958 67412 -23381 -64236 25676 55655 -29842 -43847 37434
312C7434n358p9682K4491Q0737l9881q2059M9828Q0227n5216p2727N8829N9366
$$ 37434 32076 -47606 -23115 57622 17741 -64318 -14490 65737 10521 -62206 -3377 55989
324E5989o3712m2389P1357K5392q0860j1362Q9378J281r3562O099R1552j3560
$$ 55989 -7723 -50112 21245 46637 -34223 -45585 43793 45074 -48488 -42389 49163 35603
336C5603q3763K3551P2759l6748o1838N1565N3395o5020m7631P4147M2774p7679
$$ 35603 -48160 -24609 48150 11402 -50436 1129 54524 -10496 -58127 16020 58794 -18885
348a8885l6086P6520K5551p3267j1128P0763n255p0516K0600P1930l2418p2732
$$ -18885 -54971 21549 47100 -26167 -37295 33468 28213 -42303 -21703 50227 17809 -54923
360e4923L9944P0232m4428o2857M8274N1044n3683l6964O1302K3507o9883j2652
$$ -54923 -14979 55253 10825 -52032 -3758 47286 -6397 -43361 17941 41448 -28435 -41087
372d1087P6832M711p9713J859P7419r283p0784J9159O2161l1509n4062M4608M7936
$$ -41087 35745 40456 -39257 -37398 40021 30738 -40046 -20887 41274 9765 -44297 311 48247
385D8247n5877m3480O3200L8879o5927l2065O5251K1819o3383q649O2387n519
$$ 48247 -7630 -51110 12090 50969 -14958 -47023 18228 40047 -23336 -31985 30402 24883
397B4883o3001J8188O4347k7666o4374L3749O1111l7759n3784M1735M3239m7181
$$ 24883 -38118 -19930 44417 16751 -47623 -13874 47237 9478 -44306 -2571 40668 -6513
409f513l1529N4218K0856o1444j2523O6759O270o8428n62O6013o403o0566J5623
$$ -6513 -38042 16176 37032 -24412 -36935 29824 36094 -32334 -32896 33117 26714 -33852 -18229
422a8229N4094k6694m8451L7990M4317m7375m0994N3374L6831n5872l0199N6034
$$ -18229 35865 9171 -39280 -1290 43027 -4348 -45342 8032 44863 -11009 -41208 14826
434A4826K0491n5639q542N6060l824n7443J4589N8717k2610n8177K8045N4421
$$ 14826 35317 -20322 -28864 27196 23372 -34071 -19482 39235 16625 -41552 -13507 40914
446D0914l2173m7229L6557L7708m2092k7741M8546J8990n4540j2240N8456O900
$$ 40914 8741 -38488 -1931 35777 -6315 -34056 14490 33480 -21060 -33300 25156 32056
458C2056n9095j608N6537m998n1988J3525M7084k3290m3130L2814M0335m0463
$$ 32056 -27039 -28647 27890 22892 -29096 -15571 31513 8223 -34907 -2093 38242 -2221
470b221l7759M5302L3933m7547k7719M8343J8923m9091q469N0572k021n2538J0983
$$ -2221 -39980 5322 39255 -8292 -36011 12332 31255 -17836 -26305 24267 22246 -30292 -19309
483a9309N3853j7760n3109K2755M9392k7085m2843L1891L4586l7603k6234M3685
$$ -19309 34544 16784 -36325 -13570 35822 8737 -34106 -2215 32371 -5232 -31466 12219
495A2219J9045m8883j3318N1865Q411n1961l144M9547l450m5727J1487M1908k0227
$$ 12219 31264 -17619 -30937 20928 29339 -22622 -25766 23781 20331 -25396 -13909 27999 7772
508G772l8882K8273L6611l4464l4154L8313L0309m0222k4342M1271J6352m2507
$$ 7772 -31110 -2837 33774 -690 -34844 3469 33778 -6444 -30786 10485 26837 -15670
520a5670p361M4396j310m6458Q541M7670j4139m6847J8604M3442k2889l7853K7807
$$ -15670 -23031 21365 20055 -26403 -17862 29808 15669 -31178 -12574 30868 7979 -29874 -2067
533b067L1144l3475k4552L9238J8835m3889j4055M6444R501m6513m257M4585k269
$$ -2067 29077 -4398 -28950 10288 29123 -14766 -28821 17623 27124 -19389 -23646 20939 18670
546A8670m1676R943L8794j7846l6450K4840L4355l0008l1692L3155K7595l4808
$$ 18670 -23006 -13063 25731 7885 -28565 -3725 30630 622 -31070 2085 29680 -5128
558e128k1711L5927J4367l7272o527L9007o84m0666O573M1316j1153m0162J5012
$$ -5128 -26839 9088 23455 -13817 -20344 18663 17979 -22687 -16114 25202 14049 -26113 -11101
571a1101L6996j9033l2248K3731K6851k9026k1731L4205J7345l8310j3441M0567
$$ -11101 25895 6862 -25386 -1655 25196 -3830 -25561 8644 25989 -12321 -25762 14805
583A4805R353m0849m322L9612j922l7693R045L5825j6187l4162K2349L2336k6874
$$ 14805 24158 -16691 -21013 18599 16677 -21016 -11971 23854 7667 -26495 -4146 28190 1316
596A316k9652K9752K5483l1460j9771L2766J3036l4209o163L5778Kl6985M979
$$ 1316 -28336 1416 26899 -4561 -24332 8434 21470 -12739 -18902 16876 16878 -20107 -15128
609a5128L7077q911l5530J2379L2380j6099k8142K0393K3615k5077j9435K9449
$$ -15128 21949 13038 -22492 -10113 22267 6168 -21974 -1581 22034 -3043 -22478 6971
621F971J5846l2763j2508L4528Q759l4747m069L3913j628l2720Q012L1577j4242
$$ 6971 22817 -9946 -22454 12074 20833 -13914 -17983 15930 14302 -18418 -10406 21171 6929
634F929l0488J9535K9021k3474k6579K6135K2760k8036j7601K9704J1678l1433
$$ 6929 -23559 -4024 24997 1523 -25056 1079 23839 -4197 -21798 7906 19584 -11849
646a1849n789L3138N35l4233L757L4153p357l2571J0746K9647j4413k5919J8495
$$ -11849 -17638 15500 16035 -18198 -14441 19712 12355 -20216 -9470 20177 5764 -20155 -1660
659a660K2030k2656j8503K6355J5336k8938j2214L0139Q625l0091m257K9360r18
$$ -1660 20370 -2286 -20789 5566 20902 -8036 -20250 9889 18514 -11577 -15834 13526 12608
672A2608k8413O432K7576j1645k6699J5976K5366j9182k3146K1518J9763k3425
$$ 12608 -15805 -9373 18203 6558 -20141 -4165 21201 2019 -21127 391 20154 -3271
684c271j5360K5328J0416k7366n515K9208J153l0399K577L0468n944k9223R370
$$ -3271 -18631 6697 17113 -10253 -15768 13440 14593 -15806 -13229 17239 11295 -17928 -8558
697h558K6834j3135k3773J7190K0542k1140j7481K4417J4594k6595j1548K7494
$$ -8558 18276 5141 -18632 -1442 19100 -2040 -19521 4896 19490 -7105 -18653 8841
709H841Q019k7370l825K6674q95k5805N657K5004r941k4071J3345K2725j5881
$$ 8841 16860 -10510 -14335 12339 11444 -14361 -8704 16300 6359 -17712 -4367 18358 2477
722B477k0569J7799J7483j9488j3667K1274R541k3169n593K4906K054k6047J137
$$ 2477 -18092 -293 17190 -2298 -15965 5309 14850 -8319 -13912 10994 13048 -12999 -11862
735a1862K6157m220k5179P528K3290j1210k0883J5106J8337j8830j5812K1854
$$ -11862 14295 10075 -15104 -7576 15714 4504 -16379 -1273 17064 -1766 -17578 4276
747D276J3265k3841j0399K4730O998k4779l015K4348j299k3768N533K3095r197
$$ 4276 17541 -6300 -16699 8031 15029 -9750 -12765 11583 10284 -13484 -7951 15144 5947
760E947k2205J2076K0833j4228j8707J5916J5844j7479j2464J9093Q950k0744
$$ 5947 -16258 -4182 16651 2423 -16284 -368 15476 -2003 -14467 4626 13576 -7168
772g168n612K2122K648k2900O8K2825k824k1868N851K0220r189j8250J2661J6188
$$ -7168 -12780 9342 11990 -10910 -10842 11983 9159 -12709 -6858 13362 4173 -14077 -1416 14772
786A4772j5877j4123J8451J1948k0203r404K1136O285k1425k649K1358j212k1151
$$ 14772 -1105 -15228 3223 15171 -5032 -14436 6700 12985 -8440 -11089 10269 9057 -12094
799a2094M937K0838q222k0171J0875J8941j2992j6968J4776J4315j6447j1234
$$ -12094 -7157 13681 5459 -14712 -3837 15104 2112 -14856 -80 14235 -2212 -13446
811a3446J8093Q061j9606n093K0754K402k1253J48K0897k707j9804N445J8221
$$ -13446 4647 12708 -6898 -11991 8763 11165 -10088 -9940 10957 8250 -11554 -6109 12112
824A2112q377j6427J1268J4620j3853j2828J5854J0916j7191q640J7905N915j8212
$$ 12112 3735 -12692 -1424 13196 -657 -13485 2369 13285 -3906 -12546 5359 11274 -6938
837f938k784J8346n10j8437L715J8367o561j7939R009J6921j1096j5207J3014
$$ -6938 -9722 8624 8114 -10323 -6608 11759 5198 -12741 -3732 13189 2093 -13114 -100
850a00J2866j4864j0135J6641P313j8209m604J9300K059j9688M23J9290k964j8207
$$ -100 12766 -2098 -12233 4408 11721 -6488 -11092 8208 10267 -9421 -8998 10292 7328 -10879
864a0879N571J6721q233j5100J0753J3455j2880j1813J4448J0022j5426p938J5930
$$ -10879 -5308 11413 3180 -11920 -1167 12288 -592 -12405 2043 12065 -3361 -11299 4631
877D631N517j6163k831J6343L2j6467K627J6456n029j6089P135J5205r057j3678
$$ 4631 10148 -6015 -8846 7497 7529 -8938 -6311 10145 5116 -10973 -3838 11367 2310 -11368
891a1368J0889J1663j2729r329J4515O897j6058m505J7124K160j7530K06J7219
$$ -11368 -479 11184 -1545 -10874 3641 10538 -5520 -10025 7099 9259 -8271 -8065 9154
904I154k637j6371N173J5162p722j3794J0050J2389j2000j0882J3412R181j4288
$$ 9154 6517 -9854 -4681 10481 2759 -11035 -985 11404 -596 -11478 1934 11115 -3173
917c173p204J4782M923j5060k450J5253m4j5335K367J5245m447j4784O281J3819
$$ -3173 -10377 4405 9328 -5732 -8182 7071 7027 -8308 -5941 9304 4857 -9927 -3646 10173
931A0173p944j2381R579J0554j1191q523J2734O445j4022m407J4887K395j5205
$$ 10173 2229 -10152 -573 9981 -1210 -9733 3001 9446 -4576 -8983 5904 8299 -6906
944f906l09J4985j907j4360M226J3467o557j2474Q756J1343j0597j0061J2011
$$ -6906 -7215 7770 5863 -8497 -4271 9196 2639 -9835 -1079 10264 -333 -10394 1617
957A617Q503j3018o617J3682M461j4160k077J4459k80j4603K500J4440m481j3833
$$ 1617 10120 -2898 -9515 4167 8628 -5532 -7609 6850 6570 -8033 -5533 8907 4426 -9407
971i407O190J2799p761j1313R216R568j0604p707J1857N849j2812m060J3384K318
$$ -9407 -3217 9582 1821 -9492 -276 9292 -1312 -9019 2838 8687 -4125 -8185 5199 7517
985G517j3530n27J3265j367j2769L399J2084n436j1321P370J0444r035r389J0388
$$ 7517 -6013 -6540 6725 5358 -7411 -4012 8072 2636 -8685 -1315 9129 94 -9295 1093
999A093Q021j1457o303J2299M265j2963k032J3428k03j3660K328J3540m268j2958
$$ 1093 9114 -2343 -8646 3653 7918 -5045 -7077 6351 6148 -7512 -5184 8356 4088 -8870
1013h870N995J1916p556j0493R019Q821j0308p081J1413N366j2202l728J2606
$$ -8870 -2875 9041 1485 -9008 11 8832 -1476 -8557 2856 8222 -3980 -7708 4898
1026D898K114j2621m68J2351j298j1835L098J1227m880j0562O533R773p986q796
$$ 4898 7012 -5609 -6077 6274 4976 -6859 -3761 7466 2586 -7976 -1443 8330 344 -8452
1040h452R183P524j0157n935J0965M077j1625k079J2126O0j2371J883J2264l655
$$ -8452 731 8255 -1902 -7837 3128 7205 -4420 -6499 5627 5687 -6684 -4801 7463 3808
1054C808j1762N316J0840o859r589Q301Q144r630o583J0733N028j1516l486J1936
$$ 3808 -7954 -2638 8202 1343 -8246 55 8199 -1431 -8014 2719 7747 -3769 -7255 4681
1068D681J922j2017k85J1794j427j1356L157J0787m838j0111O356R268p627q228
$$ 4681 6603 -5414 -5699 6095 4668 -6688 -3531 7256 2418 -7693 -1337 7931 304 -7924
1082g924Q637O957r458n419J0105L691j0599j929J0954J74j1061J459J0910k967
$$ -7924 713 7670 -1788 -7207 2898 6589 -4010 -5939 5015 5189 -5872 -4413 6497 3530
1096C530j0443M403R651n779q623P137P426q387o152R471M853j0328l474J0869
$$ 3530 -6913 -2510 7141 1362 -7261 -124 7302 -1085 -7237 2234 7087 -3241 -6715 4154
1110D154J982j1091l67J1033j352j0747L097J0282m759r653O250Q803p483p729
$$ 4154 6136 -4955 -5322 5711 4359 -6388 -3291 6991 2232 -7421 -1171 7632 149 -7580
1124g580Q445O410r176m885R694L253j0065j621J0250R8j0232J314R969k591r462
$$ -7580 865 7275 -1901 -6786 2908 6161 -3904 -5525 4725 4823 -5409 -4095 5874 3283 -6179
1139f179L815Q711m984p822O145O835p254n762Q235M651r027l422R558K079r857
$$ -6179 -2364 6347 1363 -6459 -314 6521 -733 -6495 1740 6391 -2636 -6058 3500 5579 -4278
1154d278n68R905j060r755K728R416m332q867N752Q094o969p075P957N790q682
$$ -4278 -4846 5059 3999 -5756 -3028 6388 2056 -6811 -1059 7035 66 -7009 948 6738 -1944
1169a944m368R239K833r600j334R765q0r715J371R443k576q916L698Q208m769
$$ -1944 -6312 2927 5760 -3840 -5174 4591 4511 -5204 -3833 5610 3034 -5882 -2184 6024 1255
1184A255p352N799O427o768n433P590M401q223l275Q643K031q848o71Q885q06
$$ 1255 -6097 -298 6129 -639 -6072 1518 5919 -2304 -5579 3064 5095 -3753 -4424 4461 3655
1199C655q726K276Q424l696p931M951P241o030o356O936N256p681l990Q281K632
$$ 3655 -5071 -2795 5629 1933 -5998 -1047 6194 164 -6192 744 6000 -1681 -5671 2610 5242
1214E242q732j278Q995k2r056J265Q874k445q456L603P839m723p064N779O164
$$ 5242 -3490 -4768 4227 4205 -4851 -3586 5288 2843 -5613 -2010 5829 1106 -5958 -179 5985
1229E985o694n188P450M144p980l015Q289J800q397n01Q312q24q075K100P702
$$ 5985 -709 -5897 1553 5697 -2283 -5298 2991 4791 -3606 -4107 4205 3381 -4694 -2594 5108
1244E108l256p224M294O578n203n753N956M794o609l733P169K610p659j432P988
$$ 5108 1852 -5372 -1078 5500 297 -5456 500 5294 -1315 -5048 2121 4731 -2928 -4360 3628
1259C628K72q141Q87Q077k059p784L240P269m388o600N490N783o447m837P214
$$ 3628 3900 -4241 -3354 4723 2664 -5120 -1880 5389 1001 -5599 -109 5674 -773 -5610 1604
1274A604L801p761k651Q043J448q107j90P982j045p699K178P308l215o773M076
$$ 1604 5405 -2356 -5007 3036 4484 -3623 -3813 4169 3124 -4575 -2397 4911 1696 -5077 -1001
1289a001O134m816n380N443M522n999l576O486K573o889j564P166N57p321M98
$$ -1001 5133 317 -5063 380 4902 -1097 -4673 1813 4386 -2503 -4067 3099 3656 -3665 -3167
1304c167P281j569p067K703O620l799o020M822N330n771m462O516L501p051k432
$$ -3167 4114 2545 -4522 -1819 4801 1002 -5018 -196 5134 -637 -5099 1417 4918 -2133 -4565
1319d565P375J275p495p5P427j085p208K160O889l160o415M000N806m698n094
$$ -4565 2810 4085 -3410 -3485 3942 2857 -4351 -2191 4698 1538 -4877 -877 4929 231 -4863
1334d863N330M250n861l350O309K399o650j458O863N00o920M67O819j464o527
$$ -4863 467 4717 -1144 -4494 1815 4214 -2436 -3894 2969 3469 -3451 -2984 3835 2371 -4156
1349d156K444O079l394n515M275M871n072m081N699L223o155k286O453J293o607
$$ -4156 -1712 4367 973 -4542 -267 4604 -468 -4549 1150 4373 -1782 -4068 2385 3678 -2929
1364b929k53O628p76o545J783O346k730n995L583N499m377m855N069M068n652
$$ -2929 -3182 3446 2670 -3875 -2092 4254 1524 -4471 -888 4611 234 -4621 448 4516 -1136
1379a136l205O164K266o532j314O746L32o765O39O572j572o234K470N761l303
$$ -1136 -4341 1823 4089 -2443 -3757 2989 3321 -3444 -2805 3767 2195 -4039 -1569 4192 889
1394H89n184M046M551m677l835N165L073n514k271N759J419n890n60N980l62n947
$$ 889 -4295 -249 4302 -375 -4210 955 4028 -1486 -3757 2002 3421 -2469 -3029 2951 2589 -3358
1410c358J246N838k123n582K957N187l753m642M496L938n154l140N722K227o124
$$ -3358 -2112 3726 1603 -3979 -1022 4165 412 -4230 266 4204 -950 -4090 1632 3859 -2265
1425b265j284O349L23o398O48O232j578n899K442N467l256m911L940M310m499
$$ -2265 -3549 2800 3123 -3275 -2627 3605 2027 -3872 -1430 4037 781 -4130 -190 4120 -379
1440c79l645M934K928n224k213N447J441n571o36N632j70n616R77N500j758n261
$$ -379 -4024 910 3838 -1386 -3599 1848 3289 -2282 -2918 2714 2544 -3072 -2095 3405 1647 -3614
1456c614K515M893l244m398L927L775m562l045N084K219n477j356N696M82n765
$$ -3614 -1099 3794 550 -3848 79 3854 -708 -3753 1331 3550 -1927 -3283 2413 2895 -2870
1471b870M09N665j277n427K107N084k884m631L581M098m163l513M626K867m977
$$ -2870 -2461 3204 1927 -3500 -1393 3691 807 -3824 -243 3855 -308 -3821 805 3672 -1305
1486a305k142N239J389n411n93N487k09n461J009N293j746n018K439M621l082
$$ -1305 -3447 1792 3181 -2230 -2823 2664 2455 -3006 -1997 3296 1550 -3468 -1029 3592 510
1501E10m124L675L509m193k834M601K112m899j363N072O22n135J45N066q96m910
$$ 510 -3614 61 3570 -623 -3457 1144 3256 -1643 -3006 2066 2688 -2447 -2302 2764 1868 -3042
1517c042J629M665k352m335L031L914l631l408M168K797m579k121M915J391n164
$$ -3042 -1413 3252 900 -3435 -404 3510 -121 -3529 639 3436 -1143 -3264 1651 3042 -2122
1532b122n79N283k69n244J077N076j830m774K510M355l141l801L667L190m104
$$ -2122 -2701 2582 2313 -2931 -1854 3222 1392 -3382 -872 3483 342 -3459 208 3398 -706
1547g06k524M406J854m613j201M719N49m729R4M660p56m508J392M296k005m034
$$ -706 -3230 1176 3030 -1583 -2784 1935 2484 -2245 -2151 2509 1753 -2755 -1363 2933 928 -3106
1563c106K618L681l176l241L679K726m134k082M479J374m725o04M853j69m863
$$ -3106 -488 3193 17 -3224 455 3181 -953 -3035 1444 2818 -1907 -2511 2342 2173 -2690
1578b690R52M721j691m438K363M034k958l535L463K969l893k347M190J717m382
$$ -2690 -1738 2983 1292 -3146 -783 3251 293 -3242 221 3190 -703 -3050 1140 2857 -1525
1593a525j107M501M86m540J59M440p61m297J361M094j931l838K480L496k985l065
$$ -1525 -2632 1869 2355 -2185 -2026 2414 1653 -2644 -1283 2811 880 -2958 -478 3018 33 -3032
1609c032L428K568l818j968M118J308m304o32M408o2m393P40M270j394m024K016
$$ -3032 396 2964 -854 -2822 1296 2604 -1700 -2332 2076 2014 -2379 -1639 2631 1237 -2787 -771
1625g71L686k578l258L052K789l490k255L815J697m069j114M228M94m297J41M266
$$ -771 2915 337 -2921 131 2920 -570 -2825 990 2687 -1382 -2496 1732 2226 -2071 -1930 2336
1641B336p75m147J384L960j981l678K543L288l016k824L398K304l700j711L909
$$ 2336 1561 -2586 -1202 2758 777 -2901 -358 2930 -86 -2910 488 2792 -908 -2619 1290
1656A290J127m052n01M076r3m030O65L890j208l653J708L379k186l037K616K664
$$ 1290 2417 -1635 -2136 1940 1847 -2183 -1518 2372 1164 -2489 -781 2598 412 -2625 -9 2655
1672B655l012k237L364J742l646j220L851O44l991j8M012o16l951J274L750j863
$$ 2655 -357 -2594 770 2512 -1134 -2354 1497 2141 -1850 -1868 2144 1528 -2423 -1149 2601 738
1688G38l488K430L115k927k626L295K107l581j524L745R53l825l94L846j59l757
$$ 738 -2750 -320 2795 -132 -2758 537 2644 -937 -2461 1284 2237 -1588 -1982 1864 1705 -2052
1704b052O60L627j144l426J591L162j988k869K377K531k732k170L064J741l349
$$ -2052 -1392 2235 1091 -2335 -744 2418 430 -2439 -62 2469 -263 -2433 631 2372 -977
1719i77j255L543P13l658j43L691m47l636J032L484j607l238K148K872k583k457
$$ -977 -2232 1311 2024 -1634 -1777 1914 1467 -2169 -1137 2347 740 -2498 -350 2522 -61 -2518
1735b518K957J964l221j464L436R19l546l82L573j15l537O12L425j080l246J521
$$ -2518 439 2403 -818 -2282 1154 2073 -1473 -1855 1718 1603 -1934 -1322 2103 1023 -2223 -702
1751g02L018j931k744K327K406k673k025K956J607l191j139L342O36l430j10L415
$$ -702 2316 385 -2359 -32 2374 -299 -2324 632 2239 -952 -2091 1251 1887 -1543 -1653 1762
1767A762m07l337R29L172j404k946J846K635k220k284K541J879k799j444L008
$$ 1762 1355 -1982 -1053 2119 715 -2231 -385 2250 30 -2254 287 2166 -633 -2077 931
1782I31R94l154n29L244P4l281M24L217q90l108J382K892j830k616K240K290k607
$$ 931 1925 -1229 -1758 1486 1560 -1721 -1297 1920 1030 -2078 -696 2196 366 -2250 -10 2280 -327
1799c27j889K881J448l086r77L213M76l254K3L190m90l087R38K906j331k685J686
$$ -327 -2216 665 2113 -973 -1950 1263 1739 -1515 -1492 1698 1208 -1879 -941 1965 634 -2051 -365
1816c65K412j991k114K257J779k474j420K667J048k828o53K944K33k996K14K987
$$ -365 2047 56 -2058 199 1978 -496 -1916 751 1799 -1029 -1682 1262 1495 -1501 -1287 1700
1832A700o73k901J161K712j596k479K030K139k374j758K658J322k864q55K962
$$ 1700 1027 -1874 -713 1999 403 -2076 -46 2093 -281 -2039 619 1941 -923 -1778 1184
1847A184L82k983P2K949n30k824R25K649j281k453J612K197j874j944K130J642
$$ 1184 1566 -1417 -1345 1604 1074 -1750 -825 1824 543 -1910 -298 1899 25 -1919 211 1853
1863A853k328j327K503R86k661o17K768K33k794J80K761n76k691J004K527j403
$$ 1853 -475 -1802 701 1687 -974 -1591 1177 1410 -1384 -1204 1557 981 -1710 -706 1821 418
1879D18k291J780J977k077j645K324J266k508q62K617M45k668k0K637l71k573
$$ 418 -1873 -93 1884 -193 -1838 486 1752 -756 -1618 999 1444 -1224 -1244 1393 1022 -1551
1895a551P58K454j122k293J439K084j735j838K004J568k256j219K416Q95k577
$$ -1551 -793 1661 539 -1754 -315 1769 34 -1804 200 1768 -488 -1707 709 1604 -973
1910i73n20K650J43k665K76K618o61k492J017K317j363k074J634J830j894j522
$$ -973 -1493 1157 1300 -1365 -1089 1529 868 -1624 -607 1710 347 -1727 -93 1737 -157 -1679
1926a679K094J182k220q76K319N27k373j78K403j79k386N36K309q92k180J218
$$ -1679 415 1597 -623 -1499 820 1347 -1026 -1204 1199 1020 -1366 -830 1479 587 -1593 -375
1942c75K024j543j810J848J527k099j205K312Q28k459m38K548L0k530L55K455
$$ -375 1649 106 -1704 144 1671 -428 -1633 679 1507 -952 -1390 1158 1188 -1342 -987 1468
1958A468p13k322J064K120j348j905J608J650j807j388J966J107k077q36K172
$$ 1468 755 -1567 -503 1617 269 -1636 -28 1622 -185 -1573 393 1500 -577 -1413 759
1973G59N46k238k32K264p7k277L99K226p43k121J057J986j381j775J678J511j942
$$ 759 1305 -933 -1165 1099 1022 -1255 -856 1370 627 -1494 -437 1549 168 -1607 71 1582 -360
1990c60j186K132Q52k283m76K363Q8k359K98K291o54k158R84J980j270j783J524
$$ -360 -1546 586 1438 -845 -1321 1042 1130 -1229 -931 1360 706 -1452 -468 1512 242 -1541 -17
2007a7J549j708j316J867J053k000p82K112M92k170j92K198j11k213M39K152p52
$$ -17 1532 -176 -1492 375 1428 -572 -1354 758 1250 -920 -1112 1086 975 -1238 -799 1353 601
2024F01k054J058J899j348j693J602J417j810j133J986Q21k101m78K140J50k136
$$ 601 -1453 -395 1504 156 -1537 65 1482 -328 -1461 525 1346 -755 -1233 907 1057 -1079
2040a079J77K103m91k004P85J878j059j720J315J521j532j306J736J052j896p95
$$ -1079 -902 1201 710 -1294 -509 1369 310 -1410 -95 1426 -106 -1412 324 1376 -520 -1315
2056a315K052M75k120j69K166j84k141N05K063q10j945J102J772j384j543J599
$$ -1315 737 1212 -908 -1077 1089 905 -1236 -731 1332 522 -1423 -321 1451 67 -1476 123
2072A23J284j761j019J894P31j951m56J989J74j989R7J951l52j888O14J814q80
$$ 123 1407 -354 -1373 521 1252 -699 -1155 834 1008 -981 -884 1067 715 -1173 -559 1255 375
2089C75j681J113J545j349j355J571J119j760q38J918N34k040j94K061j35k042
$$ 375 -1306 -193 1352 3 -1352 219 1338 -422 -1260 658 1192 -848 -1042 1019 884 -1158
2105a158M69J956p99j817J083J630j320j415J509J169j663r16J774O75j846m10
$$ -1158 -689 1267 468 -1349 -266 1364 44 -1371 138 1307 -356 -1272 502 1177 -669 -1079
2121a079J872J67j884Q0J871l32j813N62J763q13j641J034J514j273j326J488
$$ -1079 793 960 -924 -844 1027 695 -1118 -556 1207 394 -1247 -213 1301 28 -1298 190
2137A90J097j661q33J794N37j884k34J916q2j895L91J807o77j689R45J522j172
$$ 190 1287 -374 -1207 587 1124 -760 -994 922 840 -1055 -664 1143 466 -1223 -278 1244 72
2154G2j333J358J114j501q94J636O44j717m12J770J72j806Q5J819l43j756N75
$$ 72 -1261 97 1211 -290 -1184 452 1096 -621 -1033 737 909 -897 -812 1007 664 -1092 -517
2171e17J701q30j595J077J429j275j255J477J018j614p70J721N01j778k17J770
$$ -517 1184 354 -1241 -164 1265 -10 -1265 212 1230 -384 -1154 567 1068 -710 -927 843
2187H43m7j737K93J677n48j581P70J455r88j295J162J125j314r50J466P45j592
$$ 843 796 -941 -648 1029 481 -1100 -330 1125 137 -1158 4 1129 -185 -1135 331 1076 -516
2204e16n01J682K55j750L0J746k92j715N65J653q45j517J077J340j271j146J451
$$ -516 -1017 665 920 -830 -800 946 654 -1061 -496 1157 312 -1205 -128 1212 -59 -1205 246
2221B46R16j566o68J644M09j675j77J682n6j646K86J573n05j480O80J391q62j267
$$ 246 1162 -404 -1072 572 981 -694 -871 811 755 -891 -605 968 463 -1017 -337 1054 192 -1075
2239a075J016J135j192r81J352P91j482n66J577L14j628o2J670k18j645N03J558
$$ -1075 -59 1076 -116 -1097 255 1046 -436 -1002 575 889 -739 -801 869 651 -994 -491 1067
2256A067p54j437J000J247j168j058J329Q38j441o08J512L90j560j62J563n5j541
$$ 1067 313 -1124 -124 1123 -45 -1103 226 1064 -377 -985 527 917 -643 -805 758 703 -838
2273h38K56J488m44j426O22J353q17j250R94J109j153r44J289P67j428n45J511
$$ -838 -582 906 462 -964 -342 1011 194 -1056 -62 1047 -106 -1050 239 1006 -422 -967 544
2290E44L29j586n7J578j80j538M23J461o51j337Q62J186j037j006J175Q24j285
$$ 544 873 -713 -770 808 628 -910 -487 974 323 -1014 -152 1034 -3 -1009 166 990 -295
2307b95o17J356M29j423k28J455Nj438J85J430l93j391O04J291p97j194R91J057
$$ -295 -912 444 873 -550 -778 677 682 -756 -571 859 466 -925 -321 970 173 -1021 -30 1027
2325A027j159q97J295O99j400m87J482K41j497j4J489k16j429M22J337n96j228
$$ 1027 -132 -1029 266 965 -435 -922 560 801 -696 -710 779 563 -866 -444 893 297 -931
2342i31P50J123q99r64J010Q34j133o64J216N00j289l24J361J13j388P8J397l19
$$ -931 -181 942 43 -921 89 923 -210 -874 342 842 -447 -771 590 703 -685 -607 790 471
2360D71j349N31J286p50j175R48J012j104q52J239O57j340m33J386K06j396J6
$$ 471 -878 -347 939 189 -986 -38 974 -130 -982 257 914 -426 -859 527 733 -663 -647
2377f47J367j96j327L78J271n50j162O72J084q15r63R33Q50j045p22J158N57j235
$$ -647 720 524 -803 -425 846 296 -866 -194 890 75 -888 45 895 -150 -872 286 843 -392
2395c92l74J297J96j343rJ361k17j334M40J251o60j135Q47R84r94q29J118O48
$$ -392 -766 531 727 -616 -625 736 519 -815 -375 876 216 -919 -72 912 -82 -911 207 855
2413H55j209m47J257K40j288l9J277j32j240K92J196m42j132N92J075p57r55Q71
$$ 855 -354 -801 456 696 -592 -631 646 514 -726 -434 762 320 -812 -220 855 98 -857 14
2431A4Q57r95p26J111N71j207l93J277J95j310J8J295k18j252L93J179n69j089
$$ 14 871 -124 -850 261 832 -375 -768 509 704 -606 -588 707 489 -763 -370 809 240 -849
2449h49P37R59q74q15R89O40j055m92J123L23j165j55J169Oj184J76J159l34j111
$$ -849 -112 847 -27 -842 147 787 -268 -760 363 686 -479 -634 535 541 -643 -467 692 358 -753
2468g53M92J066o68r80Q31Q72r82p11J094N45j173l70J230J71j246K9J220k07
$$ -753 -261 805 137 -843 -12 860 -122 -833 261 806 -367 -737 493 664 -582 -553 667 460
2486D60j187L89J104n46j010O80Q97p90p89Q81O60r58n29J028L93j081k45J114
$$ 460 -727 -338 766 220 -790 -110 787 -3 -792 89 749 -209 -738 290 683 -398 -643 471
2504D71Q9j139Q0J153k54j126M23J080n95r91P63Q81r20p21J040N36j116l57J175
$$ 471 560 -579 -499 654 400 -726 -303 777 182 -809 -46 835 -85 -806 234 770 -346 -703 472
2523D72J65j176J5J165k09j101L43J041m95r57O07Q55p05p67Q04O58r02n35R87
$$ 472 637 -539 -524 641 432 -669 -326 715 220 -737 -130 725 20 -747 57 715 -187 -722 265
2542B65M15j056k72J091J24j128M7J134k30j091L88J062n61r63P16Q45q53o99
$$ 265 680 -376 -648 443 567 -561 -514 620 390 -701 -313 749 188 -775 -59 786 -67 -766
2560g66R63N41j028l72J067K00j075m4J081j27j044K63R91l89r43N17Q67o51p78
$$ -766 197 738 -290 -662 405 605 -470 -514 567 440 -604 -341 650 261 -682 -165 702 51 -727
2579g27P64O68q49n67R50M26j025k85J096R8j109P0J117k55j057M03J002n61q97
$$ -727 37 705 -144 -711 239 665 -360 -645 451 549 -560 -490 627 372 -685 -282 720 159 -738
2598g38O99P79p99o50Q80N25r48l72R78K30r94j01J013l5j016J77R78l09r44M50
$$ -738 -39 740 -59 -709 171 696 -252 -624 354 584 -410 -511 502 467 -549 -372 606 297 -647 -197
2618a97Q77n84q01P00P13q23n96R40M36j013k75J050J11j076P5J051k32r99L69
$$ -197 680 96 -705 -5 708 -115 -711 229 665 -348 -623 427 538 -538 -463 588 356 -643 -274
2637b74R55n25q54O55P45p47o15P99N15q51m01R01K79r45j54R54M2r75R9R74k44
$$ -274 681 156 -698 -43 702 -45 -660 139 654 -197 -598 303 582 -363 -517 437 479 -496 -397 577 333
2658C33r58L94R00n35q29O66P25p82o10Q91M53r65k91J003J27j029M2J004j99
$$ 333 -625 -231 669 134 -695 -29 696 -86 -696 195 648 -317 -608 395 522 -507 -465 539 340
2677C40r41L39Q82m55q07N61P27o55o20P32N26p98m22Q56L03r00j85R42N7r58
$$ 340 -601 -262 620 165 -642 -81 646 -9 -629 103 629 -169 -591 265 568 -332 -517 425 482 -476
2697d76P7R66k37r40L82Q77n17q06O46O99p62n74Q44M31r05k85R30J45r36%R39
$$ -476 -399 567 330 -610 -228 649 132 -674 -28 671 -91 -665 179 610 -295 -580 350 495 -441 -441 498
2718D98j48q96K53Q59l66p93M71P35n78o42O64N56p42m61Q17L42q76k18R34O3
$$ 498 350 -546 -293 566 200 -593 -122 613 35 -607 57 613 -129 -590 227 569 -307 -525 409 472
2738D72r41Q2R35k28r10L72Q41n08p57O27O30p05n23P74M02q28k81Q60J57q69
$$ 472 -469 -387 548 320 -590 -218 623 115 -642 -15 615 -90 -613 161 563 -265 -546 314 471 -398
2758c98l3Q57p8q44J95Q08k85p88M15P25n08o69O20N88p06m88P91L67q49k35Q94
$$ -398 -431 426 348 -496 -301 507 222 -566 -151 574 66 -603 17 605 -101 -589 202 569 -280 -515 379
2779C79Q5r21Q5Q92k18q56L57P78m70o98N59N97o29n17P04L87p35k77P57J83p82
$$ 379 464 -457 -372 520 302 -554 -197 581 111 -587 -28 569 -60 -577 127 514 -221 -498 259 442 -340
2800c40q0P98k0q03J40P75k32p65L49P16m53o51N74N78o71m80P56L50q08k21Q44
$$ -340 -420 378 358 -445 -305 470 238 -527 -178 538 85 -566 8 586 -85 -565 191 541 -267 -488 356
2821C56R4q54M8Q26j75p94L06P15l91o49M72N72n50m99O17L97o44l28O96K21p25
$$ 356 450 -404 -356 470 295 -499 -193 522 131 -518 -46 526 -24 -523 94 491 -153 -481 215 436 -289
2842b89j19P58Rp66R7P68k24p39L38O93m39o23N52N26o33m25O99L21p38k10P59
$$ -289 -408 350 359 -407 -310 458 234 -505 -167 526 87 -536 16 542 -91 -516 183 504 -234 -444 315
2863C15R0p68L5P50j39p24K49O63l20o30M12N50m81m76N30M18n99l46O50K65o96
$$ 315 405 -363 -328 422 283 -441 -192 471 151 -479 -67 483 2 -474 56 474 -125 -471 179 444 -252
2884b52j51P27K7p47Q9P44k14o95L27O41m26n75N21M89n87l93O46K86o76j81O99
$$ -252 -403 324 351 -396 -307 437 223 -472 -145 496 70 -505 16 505 -82 -475 171 457 -219 -400 299
2905B99Q3p11K0O90j12o57J81O33k62n99L48N47m23n19N12M33n62l80O47K81o95
$$ 299 382 -329 -309 381 269 -388 -207 426 164 -435 -87 460 37 -482 30 463 -99 -479 168 449 -246
2926b46j63P06O5p45P8P27j92o88L01O38m12n52M86M78n53l72N88K92o17j96O33
$$ -246 -409 297 362 -383 -305 422 230 -458 -157 481 69 -483 3 481 -72 -444 144 436 -181 -377 256
2947B56J05o38k3O32l7o41J27O38k27o07K99N67l89n28M75M49n47l65O18K67o71
$$ 256 361 -277 -300 332 295 -346 -219 419 192 -415 -116 451 62 -466 9 458 -89 -454 164 431 -240
2968b40j65O98N0p04O5O88j78o43K68N88l44n43M37M61m81l88N28L17n53k38N91
$$ -240 -405 293 343 -361 -296 392 214 -429 -161 427 83 -460 -23 438 -43 -431 97 414 -139 -377 214
2989B14J63o21q4O46j1o39R0O48k07o11K87N76l91n24M74M45n40l46N98K43o42
$$ 214 377 -244 -328 318 307 -332 -242 406 199 -412 -125 451 60 -464 10 455 -85 -431 167 410 -232
3010b32j51O64L4o51N8O38j55o02K33N58l01n24L85M52m17m02M75L40n27k61N66
$$ -232 -383 281 315 -336 -278 360 205 -397 -164 394 93 -431 -46 406 -11 -413 62 402 -125 -386 180
3031A80K04o12j08O32K3o46P3O44j86o14K84N62l75n00M53M20n25l28N69K26o01
$$ 180 384 -228 -336 296 319 -327 -254 390 204 -410 -126 436 61 -439 14 434 -91 -419 150 376 -225
3052b25j33N89N3n99N1N80j26n50J96N28k62m94L21M63l79m28M57L61m97k99N57
$$ -225 -358 231 284 -315 -264 316 190 -360 -164 364 102 -392 -71 392 13 -415 42 403 -94 -393 164
3073A64K19o10j06O22K2o32P0O31j78o04K74N54l63m85M32M08m95l12N21K23n43
$$ 164 383 -227 -333 289 311 -321 -251 380 202 -402 -128 426 63 -422 10 418 -77 -389 132 355 -188
3094a88j54N56O7n53KN52o8n44J43N33k18n02K95M56l54m22M32L63m93k87N47
$$ -188 -342 214 281 -272 -270 282 214 -330 -187 346 128 -374 -79 377 23 -399 33 396 -97 -384 163
3115A63K06n82j20O07L4o12P0N92j67n65K64N10l28m60L78M01m49l09M69K38m92
$$ 163 369 -213 -333 274 308 -304 -234 358 191 -374 -110 400 72 -388 -10 391 -58 -367 102 340 -152
3136a52j93N24J05n35l6N44k2n49R6N43j91n07K68M84l47m34M25L74m94k84N45
$$ -152 -345 179 284 -251 -287 257 235 -314 -218 325 134 -373 -105 379 32 -402 23 397 -97 -381 164
3157A64J94n65r9N74K2n75Q0N49j67n19K31M76k90m27L29L92l90l41M35K71m71
$$ 164 358 -207 -306 268 290 -285 -205 344 177 -342 -111 365 75 -352 -23 369 -21 -362 73 344 -127
3178a27k13M98J54n27q2N30J6n63R9N39j65n19K61M75l46m20M05L74m74k88N19
$$ -127 -340 158 312 -215 -297 233 249 -314 -215 324 159 -360 -99 376 30 -390 15 389 -85 -373 146
3199A46J90n33j06N43K6n26O3N03j25m89J90M54k50m12K92L73l50l32L99K72m30
$$ 146 336 -197 -303 240 266 -260 -197 306 181 -308 -118 336 86 -326 -34 339 -11 -343 56 328 -102
3220a02k35M86J63n19r4N39mn35Q1N32j66n06K54M58l17m07M00L30m28k69M72
$$ -102 -337 149 312 -207 -301 238 234 -301 -220 312 146 -360 -106 352 35 -372 28 358 -70 -339 133
3241A33J86m85j14M95M8m97L1M79r6m44J36M31j91m17K59L70l10l43L73K89m26
$$ 133 319 -166 -280 215 263 -234 -203 276 180 -264 -128 303 112 -305 -46 324 14 -329 44 333 -93
3262i3k38M63J65m89q7N16on20Q9N02j74m74K49M26l00l72L64L02l98k47M27J89
$$ -93 -331 132 297 -192 -279 237 231 -289 -200 302 128 -346 -97 329 29 -343 21 323 -75 -322 105 294
3284B94m35j23M53O7m55k2M66n1m57J13M38j59m39K49L97l07l57L66K95m31k28
$$ 294 -141 -264 189 256 -199 -221 245 194 -263 -150 288 129 -310 -61 336 29 -328 38 333 -98 -326
3305c26M69J52m84o7M82j6m74P9M53j49m35K35L86k84l37L12K96l38k48L78J91
$$ -326 143 295 -189 -256 226 210 -264 -185 268 119 -316 -81 305 21 -316 -4 292 -46 -294 84 275
3326B75l97j42M20Q8m26l7M45j2m60Q6M59j57m44K34L99k92l54L40L09m10k31
$$ 275 -122 -264 156 244 -182 -219 226 214 -246 -160 299 142 -302 -68 331 39 -315 25 334 -76 -307
3347c07M29J53m47q1M52%m50O7M36j41l80J68L68k21l24K51L07k97k69L31K29
$$ -307 122 275 -172 -253 199 199 -251 -184 252 111 -269 -101 267 46 -278 -27 280 -17 -286 45 274
3368B74l68j73L99J21m10p6M38Lm40O9M40j41m20K12L82k79l38L24K78l59k15
$$ 274 -94 -267 132 253 -157 -233 205 208 -232 -163 277 136 -284 -72 310 31 -307 17 295 -64 -279
3389b79L89J53m06j05M12K6m01L4L84p4l77J12L61j70l27K17L10k48k91L14K32
$$ -279 110 263 -143 -248 164 190 -211 -177 207 133 -244 -132 229 59 -268 -51 259 11 -280 34 266
3410B66l31k03L90J39m09p7M28J7m38O6M25j35m04K02L45k43l14K98K64l31k09
$$ 266 -65 -268 122 261 -148 -225 203 220 -218 -152 273 138 -266 -64 281 38 -276 22 286 -45 -254
3431b54L45J56l71r9L56P7l74j5L74m8l73Q9L60j42l36J86L29k32l11L01K71l52
$$ -254 91 247 -124 -223 133 210 -164 -179 195 147 -226 -137 223 81 -255 -69 260 28 -283 18 289 -63
3453f3k10L78J48m06o9M25%m16N9L97j13l73J82L23k15l00K56K60k90k17L02J81
$$ -63 -273 105 253 -153 -222 203 203 -213 -154 243 130 -243 -61 262 47 -253 3 263 -27 -244 58 239
3475B39l27j46L54R1l77l7L73Kl91O9L74j14l77J87L45k33l15K91K66l32k12L64
$$ 239 -88 -234 120 211 -166 -203 170 172 -219 -150 224 110 -267 -80 265 32 -283 8 274 -58 -270 94
3497I4J58l88q7M10Ml84M8L82j04l49J45L20j80l07K20K67k48k36K69K00l05j72
$$ 94 252 -136 -223 187 191 -193 -145 237 133 -216 -71 249 69 -238 -18 249 1 -235 34 234 -71 -243
3519b43L31J25l50p4L79J2l88M6L87j13l70J74L37k23l05K77K59l20j93L43J38
$$ -243 88 213 -137 -211 168 180 -208 -162 225 112 -258 -84 253 30 -275 2 261 -59 -252 91 229
3540B29l58r0L69L2l53J3L58n3l36R1L26j47l02J82K81k13k69K60K24k98j91L25
$$ 229 -129 -219 150 182 -171 -158 200 147 -189 -98 228 81 -221 -39 242 29 -240 20 244 -54 -245 80
3562H0J38l56p0L65K5l86N1L61j06l56J63L34k17k90K71K28k82j94L18J39l28
$$ 80 218 -138 -208 157 182 -204 -153 208 102 -254 -91 243 26 -264 7 235 -47 -241 77 216 -112
3583a12q4L25N5l26nL22k4l25O6L30j14l19J57L02k08k76K51K35k98j93L24J44
$$ -112 -196 129 184 -142 -147 175 151 -174 -108 222 108 -211 -54 248 40 -236 15 250 -48 -241 83 227
3605B27l56p7L71K0l88M9L67j16l32J50L13k05k56K24K29k46j94K75J53k79j31
$$ 227 -129 -206 165 185 -203 -154 213 97 -235 -85 228 23 -233 -9 220 -26 -220 55 208 -71 -202
3626b02L16Q2l26l9L38j2l26M6L31r7l25J55L09k00k97K49K52k97k03L29J34l38
$$ -202 114 196 -130 -169 169 157 -169 -123 208 111 -214 -59 250 50 -247 2 254 -43 -246 83 217 -121
3648a21q8L58J4l44M0L27q2l18J30K74j46k65J93K39k20k11K47J67k53j36K85
$$ -121 -209 149 163 -181 -141 186 104 -214 -84 190 44 -221 -28 211 -9 -220 27 194 -59 -195 90
3669I0J07l17n5L28K2l40L7L48j04l28J45L14k02k70K41K24k84j72L09J25l28
$$ 90 197 -120 -175 153 175 -165 -128 220 116 -212 -67 247 45 -225 16 240 -44 -216 93 218 -110
3690a10q1L22K4l12J0L16o6k86Q3K77j22k67J64K41j77k32K28K09k71j59K98J31
$$ -110 -191 131 155 -157 -147 169 103 -183 -100 177 55 -212 -48 193 16 -216 12 221 -50 -209 89 220
3712B20l23p6L32L2l58N2L36r8l22J45K88j91k56K27K21k59j71K61J41k92r5K94
$$ 220 -103 -179 153 185 -173 -121 215 117 -205 -60 228 37 -219 8 229 -30 -201 60 201 -91 -186 108
3734A08M8k94mK88k9k90O2K94r7k94J44K70j82k39K15K20k62j72K95J35l22p1
$$ 108 156 -138 -142 146 117 -173 -111 183 86 -208 -64 206 24 -215 0 220 -42 -214 81 216 -106 -177
3756a77L25K5l35K8L30q5k98J25K71j61k40J90K05k21j64K26J40k43j17K63O0
$$ -177 148 173 -162 -134 196 111 -187 -62 209 48 -192 -2 203 -18 -182 44 184 -59 -176 87 147
3777A47k62m5K75Qk82L8K92q5k77J09K78j64k38J90K26k36j87K76J33k85q4L05
$$ 147 -115 -160 115 123 -159 -121 171 86 -191 -82 196 32 -206 -16 210 -26 -213 63 196 -89 -173 132
3799A32K4k98K4K88o1k77J04K45j31k18J46K16j89j86K00J50k10j24K25R9k47
$$ 132 156 -142 -118 170 109 -168 -64 181 50 -168 -22 194 5 -181 19 169 -41 -165 60 159 -88
3820h8p4K60L9k82J1K92o7k78J11K70j59k47K02J94k07j63K52J10k62o6K66L1
$$ -88 -162 98 137 -145 -134 158 91 -187 -76 194 35 -212 -10 184 -23 -186 66 176 -86 -152 114 145
3842A45k60OK56l6k49O2K43r0k25J20K11j54j88J66J70k03j50K31J03k45p4K57
$$ 145 -115 -109 147 111 -138 -76 167 77 -148 -28 183 29 -159 7 177 -26 -176 55 158 -87 -161 96
3864I6M1k73MK71m4k73J13K41j47k13J62K03k06j51K26J19k32r1K54M1k34k6K47
$$ 96 137 -136 -132 139 95 -178 -65 176 29 -184 -22 181 -25 -176 50 169 -63 -154 100 141 -93 -119 128
3887A28k1k27L4K29n4k36Q7K32j27k11J66J75j87j53K05J27k46q2K46M1k54%K56
$$ 128 107 -120 -86 143 89 -147 -60 172 45 -166 0 175 -12 -165 40 167 -79 -161 85 126 -128 -128 128
3910A28m4k50R8K23j23k07J53J79j71j56K02J22j99r2K10P7k25m8K31K3k33MK30
$$ 128 84 -166 -68 155 32 -175 -22 157 -14 -170 32 154 -45 -137 73 150 -75 -123 108 131 -102 -98 132
3933A32l0k43Q0K34j06k34J62J79j78j75K17J20k31r3K48N0k57OK49n1k24O2K23
$$ 132 102 -141 -61 173 67 -167 -5 174 -4 -179 38 158 -73 -166 82 132 -125 -119 130 79 -145 -83 140
3956A40j03j90J15J76j34j59J57J35j71j12J92R8j99o5K18L8k36lK45l0k48P6
$$ 140 37 -153 -38 138 4 -155 2 137 -34 -146 46 144 -55 -120 98 136 -100 -103 142 112 -136 -60
3978f0K32j33j92J47J79j74j65K10J17k14q5K25M0k39kK12k4k04L8K16p2j85Q8
$$ -60 172 39 -153 -6 173 -1 -166 44 161 -53 -138 87 127 -112 -114 98 74 -130 -92 124 52 -133 -45
4001d5J74r7j75J29J56j61j28J83J14j98q4K22M0k26j4K55m2k32O0K36j12k01
$$ -45 129 32 -143 -14 142 -19 -147 36 150 -48 -132 90 130 -96 -110 145 103 -129 -69 167 55 -146
4023a46J41J75j72j43J77J15j89r7K01N7k02l7K00Rj90%K07n1j73O3J77r1j67
$$ -146 -5 170 -2 -145 32 147 -42 -139 62 119 -83 -120 80 89 -101 -101 106 55 -118 -55 122 31 -136
4046a36J21J50j44j46J82J23k04q5K18N0k29OK20l5k20Q2J93r8j83J22J66j46
$$ -136 -15 135 -9 -155 27 150 -54 -139 79 129 -100 -94 126 91 -129 -47 146 48 -135 -13 153 7
4068Gj38J47J18j58j07J71P9j76n8J83K8j81lJ86k6j94M5K00q6j74J07J74j46
$$ 7 -131 16 134 -24 -131 40 119 -57 -115 68 96 -85 -88 98 72 -122 -77 123 37 -137 -30 144 -2
4091bj51J73J22j95p8K17L3k09kK11k1j94M4J87r2j55J02J46j22j23J20J14j41
$$ -2 -153 20 142 -53 -131 86 119 -90 -92 119 98 -96 -52 135 43 -112 -10 136 14 -109 11 125 -16
4114a6j05J61P8j65o4J75M0j84k3J95pk08M9K02q5j89J24J51j36j36J71J04j82
$$ -16 -121 40 118 -47 -111 64 104 -80 -103 92 85 -123 -74 128 43 -146 -22 129 -7 -143 28 132 -50
4137e0p2K02L5j91qJ84qj90N4J61n9j63Q2J46q7j42J19J43j58j17J41J02j73p6
$$ -50 -122 80 115 -76 -84 100 92 -98 -44 117 58 -105 -23 123 36 -106 13 156 -2 -119 22 124 -49 -125
4161a25J82M2j87j5K02k4k00N1J91r0j65J29J42j33j25J54R7j68p0J75M2j73j4
$$ -125 57 99 -88 -103 99 75 -125 -74 117 27 -138 -9 133 0 -125 29 126 -42 -112 63 105 -68 -82
4184h2J72oj70L2J64m2j48N4J45p9j42R6J44j34j23J49J03j60r3J80M6j87j3J91
$$ -82 90 84 -86 -54 110 68 -80 -26 119 40 -102 -6 138 4 -119 30 133 -27 -120 60 106 -81 -94 97
4208I7k1j96N9J76r0j47J11J30j23j12J25J02j46p8J63M7j44l1J59J8j74K3J56
$$ 97 76 -120 -61 115 25 -122 -11 119 -4 -116 9 111 -35 -113 50 97 -47 -78 81 99 -75 -52 104
4231A04l2j69N4J69q8j40R2J42j30j22J49R9j75n9J71L5j69j1J75l2j69N2J71
$$ 104 72 -97 -43 126 38 -102 -10 132 2 -120 29 128 -47 -106 65 100 -69 -80 95 63 -106 -54 117
4254A17r2j47J04J29j11j08J14R8j28q0J46N9j44n2J59J8j54NJ64k1j61N5J62
$$ 117 25 -122 -18 111 0 -108 6 104 -24 -104 42 101 -43 -95 64 82 -72 -67 97 76 -85 -30 132
4277A32q7j56J07J41j39j16J50Q6j58o1J67K3j62j0J67j9j64M9J27n7j19O6J26
$$ 132 45 -111 -4 137 -2 -118 32 118 -40 -101 66 89 -73 -83 84 65 -99 -50 77 20 -99 -33 93
4300I3q7j07R8Q6r1q7J21P0j30o4J52M3j56j5J73j7j72N1J57o7j54J16J09j35
$$ 93 6 -101 -3 83 -8 -95 26 96 -34 -98 54 97 -59 -74 99 82 -90 -39 118 51 -103 13 122 -13
4324a3r6J36P1j35n1J47K4j47j6J52k4j28K1J25j8j44O6J24q7j03P8J16j10r7
$$ -13 -109 27 98 -37 -88 59 83 -64 -80 72 48 -80 -59 66 48 -96 -30 94 7 -96 -18 98 -12 -109
4348a09J21Q4j27o4J53L9j61kJ64l8j46M7J55o9j51R4J17j04j11J27P0j14o0J26
$$ -109 12 96 -31 -95 58 97 -64 -66 98 60 -86 -39 116 47 -104 -10 107 3 -108 19 89 -25 -85 41
4372D1L4j21k8J23J7j47J6J28j3j40L4J40o0j34R3J13j12j00J32Q6j40o0J44L3
$$ 41 75 -46 -74 49 66 -81 -65 63 50 -90 -56 84 24 -110 -17 96 -16 -116 16 102 -38 -98 46 79
4396G9j44j3J59j5j43L5J44n6j31P6J12r6j04J07P5j10n6J19M3j15m6J26K6j39
$$ 79 -65 -78 81 66 -77 -42 102 46 -85 -9 103 7 -97 10 85 -25 -81 38 81 -34 -80 46 72 -67
4420f7j1J29mj48L9J44m8j45Q4J24j08j02J43N6j22o2J43L5j34qJ39rj38M5J14
$$ -67 -78 51 47 -101 -62 82 34 -111 -27 97 -11 -113 30 86 -36 -98 45 80 -54 -62 77 68 -70 -25 89
4445H9m4j11O5J06p6j00R3P4j00q8J29M7j09n2J28L7j50pJ37j1j55M6J53q0j27
$$ 89 45 -66 -1 105 29 -71 22 96 -4 -92 37 84 -25 -77 51 88 -62 -69 68 57 -98 -52 101 21 -106
4470a06R0J02r6r2J06R2j26n2J36J8j24j0J34qj17RJ26k8j14L8J16p1j06Q0R8
$$ -106 -16 86 -10 -102 4 96 -30 -82 54 72 -52 -62 72 64 -53 -44 82 54 -60 -22 94 23 -83 -3 95
4495I5q5r9J01P8j26n6J44L6j49j9J53k1j40K7J47p4j19Q2J22j07q0J02P4j22
$$ 95 10 -89 12 90 -36 -92 52 88 -61 -80 73 52 -88 -61 86 12 -107 -25 97 -10 -90 12 86 -36
4519c6m0J20L2j16k2J42j4j15KJ20k4j20K8J38o1j16Q2J06r5r4J01P4j20o0J30
$$ -36 -76 44 76 -40 -62 80 66 -49 -47 73 49 -71 -43 95 34 -82 0 106 11 -83 18 92 -28 -88 42
4544D2L8j43kJ41j0j57M0J33o7j06P2R8q4q6J04O0r3o5J05N1j13l1J26J3j15m
$$ 42 80 -63 -65 76 66 -91 -51 82 15 -91 -19 79 -5 -91 13 73 -20 -85 20 71 -42 -73 53 66 -49 -53
4570e3J25rj39M7J21m8j16P4J06r5r5J15O8j29n1J38J9j34qJ25mj37M0J19m7j20
$$ -53 72 63 -76 -29 92 44 -72 2 108 13 -82 33 101 -28 -79 59 78 -56 -64 61 57 -80 -40 79 32 -88
4596h8P3R4p3r4P7Q0p9p9J13N1j09l4J13L0j13j3J25j4j34N6J12n2j34Q7J16r7
$$ -88 -15 79 6 -88 -11 69 -10 -89 24 75 -34 -68 45 75 -38 -51 74 60 -74 -18 94 42 -92 -5 111 14
4622A4j00J16O5j13o0J23L2j26k3J37j6j18L0J09m0j05M6R1m4j13P9R4r8p4J01
$$ 14 -86 30 95 -18 -78 45 77 -49 -72 65 49 -69 -39 70 30 -75 -29 62 18 -95 -16 78 -20 -94 7
4647GP0j06n0J30K2j35LJ34k0j31M2J25n4j20Q6R4r9o7J05N6j22l7R8K8j11lJ08
$$ 7 77 -29 -79 51 73 -62 -59 75 55 -76 -34 91 37 -83 3 97 -2 -69 36 92 -30 -67 31 59 -52 -55 53
4674E3lj21K3J09k9r7L7R5o3j00P8Q5p3r2J21O1j19n5J35J9j24PJ17k1j28O0J07
$$ 53 50 -71 -48 61 32 -65 -28 67 4 -96 -18 67 -6 -98 23 84 -35 -90 45 64 -60 -53 64 43 -85 -25 82
4701H2n6j00P5Q5q4p4J07M9j12l2R8L1j12j6R2J9j05jJ09k3j06L2J14o2j01O8
$$ 82 26 -74 1 86 2 -72 35 84 -28 -60 38 69 -43 -59 33 52 -53 -54 55 32 -74 -42 72 10 -91 -23
4727b3R2q8p3J06O3j21l0J28J7j22qJ34k3j20N3R8n1r8P0P1o7o3P3N9q2n2Q5L3
$$ -23 69 -19 -92 14 77 -44 -74 54 71 -51 -59 75 52 -68 -15 83 32 -66 4 75 8 -55 18 77 -5 -57 28 61
4755F1r0k7J05Mj08nJ20k5j08M0J03o0j02Q1Q5q1p4J03M7j08k6J21pj04QJ19l6
$$ 61 -29 -56 49 53 -55 -60 60 35 -73 -33 70 10 -92 -11 74 -7 -81 22 69 -39 -65 56 49 -55 -47 72 36
4782C6r9M5R0l8q6M7P9n9o6P1M7o1o6R5L6j03l2J11Pj13NJ11oj24M3R7o4r0Q0
$$ 36 -63 -18 72 34 -52 -5 74 15 -51 20 67 6 -60 35 71 -32 -64 47 54 -59 -54 57 51 -73 -30 67 3 -87 -7
4811gQ5q8o8R1N2r8k3J03Jr8NR4oq4J4R5m3p3L3R8n8q7Q3N9q0n6Q0N2r9l3J08
$$ -7 78 -10 -78 13 65 -33 -56 47 48 -50 -45 49 43 -41 -27 68 25 -48 -15 83 25 -62 21 80 0 -56 24 76 -23 -56 52
4842E2Jj12NJ17l5j04M9Q8n5q4P2O5o8o1P1N5q5l0Q3K8r5mQ5Qq3QQ8j8q1K3Q8
$$ 52 53 -59 -54 63 28 -76 -27 61 6 -78 -6 59 -9 -70 1 56 -29 -59 24 52 -43 -47 38 46 -37 -29 59 41 -40 -17 71
4873G1n6p3O3P4p7p2R6N3j04l4J03J0j03MR8j1j02K5Q6m2p9O6O4o9n7O4O6q8k6
$$ 71 15 -58 5 79 2 -70 26 79 -25 -59 44 54 -49 -45 53 42 -60 -35 51 9 -70 -4 60 -9 -66 -2 64 -24 -50
4902e0P3L5r5j7R9J5j04LJ03k3r6L9R8n5q2N9P8q2n9R4K9r3k5R8J0j08J3R0j7
$$ -50 23 58 -37 -54 45 60 -44 -41 62 39 -57 -18 80 25 -57 2 80 -2 -61 33 62 -31 -56 42 52 -56 -43 47 30
4931C0r8L5P6l9o1L6O6m5o0O1M9o9m8P3M5q2k7R0K4j02MJ15l5q1L0R0n3q6O0P6
$$ 30 -68 -33 43 4 -57 -21 45 0 -60 1 50 -19 -67 6 51 -31 -58 32 56 -46 -42 73 38 -43 -13 77 24 -62 -2 74
4961G4p6m9P8L9q6k5Q1K1r8jQ1j1r1L3Q1l2p5K8O7m1o9N9N7o3n5Q4M5q9l1R2J3
$$ 74 -2 -51 27 66 -20 -45 36 57 -41 -42 39 28 -63 -30 51 19 -56 -28 39 -2 -71 -12 45 -18 -73 11 56 -33 -64 28 41
4992D1r3KJ00nj03M1P8m9o9P9M5o5n6P2M2q6k3Q9Np3mO9qo5lP7j9o7K2Q1l9r6
$$ 41 -52 -50 50 45 -58 -17 61 12 -57 22 67 2 -54 18 60 -26 -49 40 45 -28 -32 37 29 -36 -39 38 19 -48 -26 55 16 -80
5024h0O8O1o8n5P8M2q0l0R2J5q6J3Q0j3q5L7P4m7o5N1O3o6l9O3L3o6k9P5J4p4
$$ -80 -12 49 -19 -74 4 46 -34 -64 28 43 -43 -30 50 37 -48 -11 63 16 -49 2 65 -1 -40 23 56 -10 -39 36 50 -24
5054b4k4Q0Pq2NQ5k5q0K9Q6n0p4N6P2p1n2P3L0p6k5Q8J4q3JP6j3p5K9Q3n1o0M3
$$ -24 -48 32 39 -43 -38 47 22 -58 -29 57 7 -67 -11 61 -10 -62 11 41 -35 -60 28 42 -41 -40 36 23 -52 -23 60 9 -51 -8
5086hO5o8l2N3M7o5l7O4L3p7k3R2jq1NQ3k5r0L3P8m4p6N7P0p7m4R5K7r3rP7Rq2
$$ -8 57 -11 -43 10 57 -8 -45 19 52 -25 -48 44 43 -38 -33 50 25 -65 -32 46 2 -74 -17 53 -24 -68 27 54 -39 -48 29 38 -44
5119d4JQ5j7o1K3O9l8m9L2N3m4n2N9M1n7m0O6L2q3k9R7jr7K3P0j9q4M8O3n3n4
$$ -44 -43 42 25 -36 -13 56 18 -31 1 54 10 -42 17 58 1 -39 27 59 -24 -53 44 43 -54 -31 39 20 -64 -16 47 -6 -60
5150f0N6N7p0m1P5K9p4j7O2K0p8PN7mn5J5O2k0o1M1N0l1o8N5M6n4m0O2M4r2j1
$$ -60 -4 53 -17 -58 17 46 -28 -45 17 37 -41 -34 23 19 -36 -21 41 21 -40 1 51 20 -48 7 53 -1 -41 21 65 -27 -38
5181c8P5Jp2NQ7l5p3L7N3m0n2M2M5o3l2O8K2m8k3P0mn4KN8ko3K1N6k5m2K0O0m1
$$ -38 37 38 -34 -29 58 23 -50 -13 40 0 -52 -10 35 -28 -60 8 30 -18 -41 29 25 -29 -27 31 29 -34 -13 43 18 -24 -4 56 15
5214A5m1M0M5o2m3P6J8p6rP0J0p7J0O5l3n7L8M0m4l2L9L9n3l0N8K5o3lN8%m8j4
$$ 15 -26 14 59 -3 -46 30 48 -28 -37 33 43 -34 -24 41 8 -49 -11 29 -15 -47 -8 31 -22 -52 6 31 -32 -35 23 23 -25 -39
5246c9O9no0J4O4j9o0L7M7m1m3N0M3p0k7O8J4p0%O1j1n4J5N2k9l6K9L1l2m4L7
$$ -39 30 25 -35 -21 43 24 -36 1 48 7 -36 14 57 -13 -40 28 42 -28 -28 33 22 -32 -17 35 6 -30 -1 30 -2 -46 -9
$$ [...]
8190AJ9
8191B0
##END NTUPLES=NMR FID
##END=
