##TITLE=1H_ES-AC-MeOH-st
 
 8 sc, 
 18.1.2022
##JCAMPDX= 6.0         $$ Bruker NMR JCAMP-DX V2.0
##DATA TYPE= NMR FID
##DATA CLASS= NTUPLES
##ORIGIN= UXNMR, Bruker Analytische Messtechnik GmbH
##OWNER= root
$$ XWIN-NMR		Version 3.5
$$ Tue Jan 18 10:42:37 2022 Russian Standard Time (UT+4h)  she@DPX200
##.OBSERVE FREQUENCY= 200.131346
##.OBSERVE NUCLEUS= ^1H
##.DELAY= (6, 6)
##.ACQUISITION MODE= SIMULTANEOUS
##.ACQUISITION SCHEME= undefined
##.AVERAGES= 8
##.DIGITISER RES= 18
##SPECTROMETER/DATA SYSTEM= spect
##.PULSE SEQUENCE= zg30
##.SOLVENT NAME= CDCl3
##.SHIFT REFERENCE= (INTERNAL, CDCl3, 0, 15.7039)
##AUDIT TRAIL= $$ (NUMBER, WHEN, WHO, WHERE, WHAT)
$$ ##TITLE= Audit trail, XWIN-NMR		Version 3.5
$$ ##JCAMPDX= 5.01
$$ ##ORIGIN= Bruker BioSpin GmbH
$$ ##OWNER= she
$$ F:/spectra/data/she/nmr/H-F/1/audita.txt
$$ ##AUDIT TRAIL=  $$ (NUMBER, WHEN, WHO, WHERE, WHAT)
(   1,<2022-01-18 10:41:39.43 +0400>,<she>,<DPX200>,
      <created by zg, POWCHK disabled, PULCHK disabled
       configuration hash MD5:
       00 E9 B6 7A A2 85 ED C7 34 08 36 98 17 FE 4E 26
       data hash MD5: 16K
       E9 1A 29 53 27 F4 4B 4E F7 DB 60 4C 9B 41 12 11>)
$$ ##END=
$$ 
$$ hash MD5
$$ 26 AC 15 A9 21 AD 56 8F 6D 8B B7 A9 95 FF 2F 08
##$RELAX= 
##$RELAX= 
##$RELAX= 
##$RELAX= 
##$RELAX= 
##$RELAX= 
$$ Bruker specific parameters
$$ --------------------------
##$DU= <F:/spectra>
##$EXPNO= 1
##$NAME= <H-F>
##$PROCNO= 1
##$TYPE= <nmr>
##$USER= <she>
##$AMP= (0..31)
100 100 100 100 100 100 100 100 100 100 100 100 100 100 100 100 100 100 
100 100 100 100 100 100 100 100 100 100 100 100 100 100 
##$AQSEQ= 0
##$AQ_mod= 1
##$AUNM= <au_zg>
##$AUTOPOS= <>
##$BF1= 200.13
##$BF2= 200.13
##$BF3= 200.13
##$BF4= 200.13
##$BF5= 200.13
##$BF6= 200.13
##$BF7= 200.13
##$BF8= 200.13
##$BYTORDA= 1
##$CFDGTYP= 0
##$CFRGTYP= 5
##$CHEMSTR= <none>
##$CNST= (0..31)
1 1 145 1 1 1 1 1 1 1 1 1 1 1 1 1 1 1 1 1 1 1 1 1 1 1 1 1 1 1 1 1 
##$CPDPRG= <>
##$CPDPRG1= <>
##$CPDPRG2= <>
##$CPDPRG3= <>
##$CPDPRG4= <mlev>
##$CPDPRG5= <mlev>
##$CPDPRG6= <mlev>
##$CPDPRG7= <mlev>
##$CPDPRG8= <mlev>
##$CPDPRGB= <>
##$CPDPRGT= <>
##$D= (0..31)
0 1.2 0 0 0 0 0 0 0 0.06 0 0.03 0 0 0 0 0.0002 0 0 0 0 0 0 0 0 0 0 0 0 
0 0 0 
##$DATE= 1642488099
##$DBL= (0..7)
120 120 120 120 120 120 120 120 
##$DBP= (0..7)
150 150 150 150 150 150 150 150 
##$DBP07= 0
##$DBPNAM0= <>
##$DBPNAM1= <>
##$DBPNAM2= <>
##$DBPNAM3= <>
##$DBPNAM4= <>
##$DBPNAM5= <>
##$DBPNAM6= <>
##$DBPNAM7= <>
##$DBPOAL= (0..7)
0.5 0.5 0.5 0.5 0.5 0.5 0.5 0.5 
##$DBPOFFS= (0..7)
0 0 0 0 0 0 0 0 
##$DE= 6
##$DECBNUC= <off>
##$DECIM= 32
##$DECNUC= <off>
##$DECSTAT= 4
##$DIGMOD= 1
##$DIGTYP= 9
##$DL= (0..7)
0 120 120 120 120 120 120 120 
##$DP= (0..7)
150 150 150 150 150 150 150 150 
##$DP07= 0
##$DPNAME0= <>
##$DPNAME1= <>
##$DPNAME2= <>
##$DPNAME3= <>
##$DPNAME4= <>
##$DPNAME5= <>
##$DPNAME6= <>
##$DPNAME7= <>
##$DPOAL= (0..7)
0.5 0.5 0.5 0.5 0.5 0.5 0.5 0.5 
##$DPOFFS= (0..7)
0 0 0 0 0 0 0 0 
##$DQDMODE= 0
##$DR= 18
##$DS= 0
##$DSLIST= <SSSSSSSSSSSSSSS>
$$ [...]
##$SUBNAM2= <"">
##$SUBNAM3= <"">
##$SUBNAM4= <"">
##$SUBNAM5= <"">
##$SUBNAM6= <"">
##$SUBNAM7= <"">
##$SUBNAM8= <"">
##$SUBNAM9= <"">
##$SW= 18.0517287032376
##$SWIBOX= (0..15)
0 0 2 0 0 0 0 0 0 0 0 0 0 0 0 0 
##$SW_h= 3612.71676300578
##$TD= 16384
##$TD0= 1
##$TE= 0
##$TE2= 300
##$TE3= 300
##$TEG= 300
##$TL= (0..7)
0 120 120 120 120 120 120 120 
##$TP= (0..7)
150 150 150 150 150 150 150 150 
##$TP07= 0
##$TPNAME0= <>
##$TPNAME1= <>
##$TPNAME2= <>
##$TPNAME3= <>
##$TPNAME4= <>
##$TPNAME5= <>
##$TPNAME6= <>
##$TPNAME7= <>
##$TPOAL= (0..7)
0.5 0.5 0.5 0.5 0.5 0.5 0.5 0.5 
##$TPOFFS= (0..7)
0 0 0 0 0 0 0 0 
##$TUNHIN= 0
##$TUNHOUT= 0
##$TUNXOUT= 0
##$USERA1= <user>
##$USERA2= <user>
##$USERA3= <user>
##$USERA4= <user>
##$USERA5= <user>
##$V9= 5
##$VALIST= <valist>
##$VCLIST= <CCCCCCCCCCCCCCC>
##$VD= 0
##$VDLIST= <DDDDDDDDDDDDDDD>
##$VPLIST= <PPPPPPPPPPPPPPP>
##$VTLIST= <TTTTTTTTTTTTTTT>
##$WBST= 1024
##$WBSW= 4
##$XGAIN= (0..3)
0 0 0 0 
##$XL= 0
##$YL= 0
##$YMAX_a= 244672
##$YMIN_a= -330452
##$ZGOPTNS= <>
##$ZL1= 120
##$ZL2= 120
##$ZL3= 120
##$ZL4= 120
##$ABSF1= 10
##$ABSF2= 0
##$ABSG= 5
##$ABSL= 3
##$ALPHA= 0
##$AQORDER= 0
##$ASSFAC= 0
##$ASSFACI= 0
##$ASSFACX= 0
##$ASSWID= 0
##$AUNMP= <proc_1d>
##$AZFE= 0.1
##$AZFW= 0.1
##$BCFW= 1
##$BC_mod= 2
##$BYTORDP= 1
##$COROFFS= 0
##$CY= 11.3945322036743
##$DATMOD= 1
##$DC= 2
##$DFILT= <>
##$DTYPP= 0
##$F1P= 2.36226072786647
##$F2P= -0.459571619588291
##$FCOR= 0.5
##$FTSIZE= 0
##$FT_mod= 4
##$GAMMA= 1
##$GB= 0.15
##$INTBC= 1
##$INTSCL= 1
##$ISEN= 128
##$LB= 0.24
##$LEV0= 0
##$LPBIN= 0
##$MAXI= 10000
##$MC2= 0
##$MEAN= 0
##$ME_mod= 0
##$MI= 1.114404
##$NCOEF= 0
##$NC_proc= 0
##$NLEV= 6
##$NOISF1= 3.799351
##$NOISF2= 2.8
##$NSP= 1
##$NTH_PI= 0
##$NZP= 0
##$OFFSET= 15.70392
##$PC= 1
##$PHC0= -15961.29
##$PHC1= 29.60078
##$PH_mod= 1
##$PKNL= yes
##$PPARMOD= 0
##$PSCAL= 0
##$PSIGN= 0
##$REVERSE= no
##$SF= 200.130013532006
##$SI= 16384
##$SIGF1= 3
##$SIGF2= 2
##$SINO= 400
##$SIOLD= 16384
##$SREGLST= <1H.CDCl3>
##$SSB= 0
##$STSI= 0
##$STSR= 0
##$SW_p= 3612.71676300578
##$SYMM= 0
##$S_DEV= 0
##$TDeff= 0
##$TDoff= 0
##$TI= <>
##$TILT= no
##$TM1= 0
##$TM2= 0
##$TOPLEV= 0
##$USERP1= <user>
##$USERP2= <user>
##$USERP3= <user>
##$USERP4= <user>
##$USERP5= <user>
##$WDW= 1
##$XDIM= 8192
##$YMAX_p= 0
##$YMIN_p= 0
$$ End of Bruker specific parameters
$$ ---------------------------------
##NTUPLES= NMR FID
##VAR_NAME=  TIME,          FID/REAL,        FID/IMAG
##SYMBOL=    X,             R,               I
##VAR_TYPE=  INDEPENDENT,   DEPENDENT,       DEPENDENT
##VAR_FORM=  AFFN,          ASDF,            ASDF
##VAR_DIM=   8192,          8192,            8192
##UNITS=     SECONDS,       ARBITRARY UNITS, ARBITRARY UNITS
##FACTOR=    0.0002768,     1,               1
##FIRST=     0,             0,               0
##LAST=      2.2672688,     0,               0
##MIN=       0,             -330452,         0
##MAX=       2.2672688,     244672,          0
$$ Real data points
##PAGE= N=1
##DATA TABLE= (X++(R..R)), XYDATA
$$ [...]
889A056K663K423K099J581J003L82k51q77j440j902k240k435k542k484k222j939
905g125j527j006m54J47O73J230J649K002K210K356K338K137J876J513J038M78
921I535q7o62j184j650k005k226k374k340k117j848j438r40l54K34Q06J324J757
938e569K080K268K370K273K041J722J297Q03K41l05q40j303j705j966k129k246
954i68k130j910j642j250q23l01J98P13J148J543J837K023K147K101J926J686
970F298J346Q83M04j30o51j115j551j855k045k208k163j945j704j314q71l47J86
987h782P13J170J570J861K015K137K047J838J559J194P42K75k14o71j095j450
1003D909j671j827j911j859j664j410j109p06k84J50N82R79J332J530J739J851
$$ y = [1056, 3719, 6142, 8241, 9822, 10825, 11207, 10956, 10079, 8639, 6737, 4497, 2062, -480, -2964, -5186, -7125, -8652, -9658, -10112, -9965, -9292, -8062, -6413, -4411, -2201, 155, 2493, 4630, 6506, 8019, 9057, 9535, 9448, 8786, 7602, 5952, 3947, 1721, -653, -2993, -5110, -6958, -8396, -9336, -9690, -9456, -8650, -7326, -5569, -3489, -1221, 1149, 3422, 5463, 7185, 8482, 9285, 9526, 9221, 8381, 7078, 5373, 3407, 1278, -968, -3098, -5008, -6650, -7900, -8723, -9024, -8826, -8113, -6965, -5422, -3585, -1562, 585, 2686, 4612, 6298, 7644, 8527, 8931, 8801, 8150, 7035, 5484, 3629, 1584, -624, -2787, -4732, -6436, -7750, -8621, -8968, -8782, -8069, -6899, -5329, -3468, -1453, 684, 2731, 4569, 6128, 7322, 8064, 8339, 8125, 7454, 6359, 4909, 3238, 1411, -500, -2359, -4023, -5433, -6542, -7248, -7532, -7382, -6800, -5821, -4489, -2959, -1220, 631]
1019F31J807J627J397J113P13K77j76o34j052j418j640j842j952j867j679j430
1035f125j081o58j88K88P56J169J502J728J885J940J845J632J361J037O07J69
1051G867k66o94j062j392j565j728j791j729j557j304j039o56k83J41N27Q96J217
1068d418J436J596J706J675J538J314J050O97K90j11n25r19j218j453j654j726
1084g22j664j523j235r84n82j79K42O33J005J294J475J639J660J591J383J116
1100E149Q53M79Q6k77o57r35j211j379j507j547j473j298j065q13n09j47K09N56
1118e486Q82J125J322J484J545J486J337J126Q73N39J74k13n76r16j191j391j548
1135E72j620j536j363j125q54m96j25K77O31R77J185J388J523J525J436J273J040
$$ y = [631, 2438, 4065, 5462, 6575, 7288, 7565, 7389, 6755, 5703, 4285, 2645, 803, -1149, -3016, -4695, -6125, -7206, -7864, -8052, -7764, -7008, -5839, -4337, -2609, -724, 1216, 3061, 4693, 6054, 7091, 7698, 7867, 7601, 6907, 5845, 4453, 2888, 1160, -631, -2360, -3917, -5221, -6260, -6916, -7199, -7058, -6531, -5635, -4418, -2982, -1386, 320, 1995, 3533, 4847, 5897, 6594, 6884, 6773, 6248, 5329, 4111, 2658, 1004, -722, -2386, -3909, -5144, -6128, -6710, -6889, -6647, -6014, -5009, -3715, -2240, -601, 1059, 2650, 4033, 5149, 6002, 6481, 6567, 6290, 5633, 4698, 3487, 2108, 601, -946, -2419, -3717, -4782, -5595, -6104, -6251, -6042, -5486, -4604, -3479, -2157, -673, 872, 2358, 3695, 4821, 5694, 6233, 6407, 6194, 5618, 4702, 3511, 2120, 572, -1048, -2584, -3947, -5072, -5926, -6422, -6547, -6270, -5639, -4662, -3477, -2089, -566, 959, 2395, 3668, 4708]
1152D708P61M46R5k52n48q40j054j210j343j370j297j184r54p03m65j45J51M68
1170d736P21R63J141J264J342J267J159R64P00M51J05j96n52q06j031j230j362
1187A64j375j293j151r06o63l51mL08O45Q81J099J256J358J344J255J087Q34O15
1205E103L12J5k92n77q16r88j153j232j271j179j062q73o28l82j08J79M60P27
1223c765R04J092J209J261J216J086R11O54M38J20j94m98p38r67j135j256j288
1240i50j205j082q65n98l58j8K40N60P74R69J130J186J211J101R92P69N22K95
1258D673J6k42m84o93q54j026j093j089j032r18p70n52k83p9K07M19O49Q42R87
1277a322J092J127J057R63Q01N36L21M0k42m87p35r10j080j181j180j103r70p48
$$ y = [4708, 5469, 5915, 6010, 5758, 5210, 4370, 3316, 2106, 763, -607, -1904, -3088, -4042, -4745, -5210, -5355, -5204, -4736, -4015, -3052, -1911, -647, 695, 1962, 3121, 4085, 4785, 5236, 5341, 5145, 4593, 3787, 2756, 1526, 164, -1211, -2504, -3655, -4561, -5224, -5575, -5579, -5271, -4626, -3745, -2646, -1390, -32, 1312, 2567, 3654, 4488, 5103, 5415, 5430, 5138, 4561, 3745, 2757, 1604, 372, -899, -2078, -3140, -4013, -4641, -5023, -5131, -4952, -4492, -3765, -2861, -1769, -560, 701, 1917, 3003, 3914, 4568, 5006, 5126, 4932, 4434, 3696, 2729, 1594, 338, -950, -2155, -3237, -4102, -4700, -5058, -5076, -4836, -4276, -3502, -2533, -1403, -217, 994, 2095, 3087, 3856, 4378, 4673, 4689, 4447, 3963, 3270, 2416, 1390, 297, -792, -1824, -2742, -3512, -4064, -4347, -4426, -4219, -3800, -3151, -2309, -1322, -230, 897, 1954, 2917, 3718, 4254, 4575, 4615, 4373, 3886, 3151, 2241, 1161, -20, -1200, -2303, -3273, -4021]
1295d021n23k74K7K77N46P52R38J065J126J129J038R22P30M75K72J9k23m47o40
1314C188p98r34j023j034r69q89p21n65l22o3J36L54N56P48R03R84J031R84Q77
1333B443P52N45L14M4j78m08o18q19r48j021j044r75q46o86m86k09L2K34M77O57
1353b740Q26R22R95R78Q96P82O34M28K19Jk16l94o09p50q58q98r19q75p74o55
1373c007m81k74o5J55L64N57P14Q63R20R63R07Q37O82M92K94M5j93m02o14p74
1393A983r14r61r84r18q12o48m60k31K0K07M22N97P43Q44R05R12Q35P48N99M28
1413C315K42M3j42l32n06o51p44q11q22q02p28o01m62k91q8R8L17M73O41P45Q18
1434b88Q53Q29P27O22M45K56M2j61l67n69p10q13q78q86q29p10n71m00j96J2K23
$$ y = [-4021, -4544, -4818, -4791, -4514, -3968, -3216, -2278, -1213, -87, 1042, 2080, 3002, 3732, 4207, 4479, 4498, 4275, 3828, 3188, 2390, 1456, 433, -601, -1570, -2459, -3180, -3745, -4067, -4130, -3994, -3640, -3084, -2336, -1433, -449, 582, 1566, 2443, 3195, 3740, 4054, 4098, 3920, 3512, 2894, 2075, 1127, 106, -938, -1913, -2759, -3445, -3931, -4140, -4108, -3874, -3397, -2740, -1914, -992, 3, 981, 1877, 2659, 3293, 3721, 3940, 3941, 3725, 3331, 2722, 1972, 1114, 216, -703, -1578, -2352, -3007, -3488, -3762, -3827, -3672, -3308, -2751, -2037, -1174, -254, 709, 1616, 2453, 3135, 3627, 3921, 3966, 3773, 3371, 2757, 1983, 1069, 108, -876, -1794, -2606, -3254, -3714, -3945, -3925, -3718, -3296, -2699, -1956, -1112, -207, 705, 1540, 2288, 2887, 3315, 3557, 3600, 3458, 3126, 2620, 1969, 1225, 414, -408, -1210, -1938, -2539, -3001, -3292, -3380, -3282, -2965, -2492, -1851, -1106, -288, 565, 1394, 2121, 2743, 3188, 3444, 3486, 3325, 2958, 2389, 1679, 866, -12, -898, -1727, -2437, -3008, -3408, -3604, -3592, -3369]
1455c369M09N56P12P95Q35Q26P79O74N56M03K06L7j50l23m80o23p10p65q00p60
1475a192o90n85m37k81j00J05K77M51N92P08P95Q03P95P03N97M46K60N3j46l21
1495B833n12o38p46p87q23p68o63n22l95k05NJ74L52N01O11O84P51P40O87O06
1515A885M91L59J99L2j21k70m33n26o40o62p15o71o07n14l89k30p5Q9K64M24N57
1536a553O47P19P30P07O37N16L77K13J8j43l28m89o04o87p57p32o93o11m79l32
1556b844j83K0J64L27M53N80O32O85O74O48N52M75L35J94N8r4k52l75m81n72o08
1577C88o39o20n67m76l79k33p9O4K32L61M81N75O31O71O23N80M55L44J94J4j28
1598B492k96m11n31o06o53o53n97n23m23k74j36K2J53K92M08M99N68N99O10N50
$$ y = [-3369, -2960, -2404, -1692, -897, -62, 764, 1543, 2217, 2773, 3176, 3382, 3419, 3269, 2946, 2466, 1843, 1133, 368, -432, -1192, -1882, -2467, -2904, -3185, -3285, -3180, -2903, -2452, -1860, -1152, -357, 446, 1241, 1944, 2541, 2987, 3247, 3300, 3154, 2833, 2321, 1683, 937, 150, -673, -1441, -2104, -2626, -3021, -3226, -3221, -3047, -2695, -2194, -1583, -899, -148, 592, 1279, 1885, 2376, 2735, 2934, 2966, 2845, 2575, 2142, 1616, 976, 314, -401, -1072, -1679, -2193, -2582, -2812, -2887, -2798, -2534, -2110, -1553, -906, -187, 543, 1250, 1887, 2403, 2780, 2993, 3011, 2868, 2540, 2051, 1447, 760, 3, -729, -1422, -2033, -2512, -2844, -3027, -3007, -2843, -2516, -2063, -1483, -851, -166, 508, 1156, 1708, 2183, 2518, 2712, 2770, 2676, 2424, 2049, 1568, 996, 388, -251, -871, -1438, -1914, -2293, -2526, -2605, -2541, -2309, -1948, -1467, -892, -261, 410, 1033, 1613, 2068, 2412, 2606, 2620, 2492, 2196, 1785, 1254, 648, -5, -658, -1255, -1778, -2201, -2475, -2611, -2589, -2436, -2144, -1736, -1237, -669, -70, 540, 1090]
1618A090M82L90K97J71K5j15k28l42m33n23n72n71n60n12m33l20k01o8Q3K13L50
1639a777M61N54N94O17N81N33M10L15J59K0j34k73l94m78n85n96n95n50m74l81
1659a993k61j42RJ47K51L66M49M90N43N32N08M41L58K70J62K1p9j98k92l91m47
1680G44n09n09n02m46l78k81j75l1Q6K01L13M19M85N35N50M92M50L62K49J18j2
1701B161j40k65l73m68m99n48n29m90m09l25k05r1K8J44K57L45M20M74M84M82
1721D53M44M02L28K33J26J7q1k03k68l60m33m59m74m50m31l38k58j51l6P9J95
1742a665L04L77M55M81N03M47L97L27K01J13j5j43k46l36m12m63m69m60m18l62
1762a384k66j79o3M5J26K39L13L65M14M28M18L94L22K72K00J08jr6j86k60l32
$$ y = [1090, 1572, 1962, 2259, 2430, 2455, 2340, 2112, 1770, 1337, 814, 242, -329, -889, -1401, -1834, -2154, -2355, -2423, -2340, -2127, -1777, -1316, -762, -168, 449, 1030, 1563, 1973, 2288, 2447, 2467, 2333, 2060, 1666, 1188, 603, 7, -588, -1138, -1612, -1993, -2254, -2396, -2387, -2240, -1989, -1623, -1174, -684, -141, 391, 899, 1340, 1698, 1968, 2130, 2151, 2072, 1874, 1582, 1191, 744, 235, -274, -776, -1222, -1600, -1881, -2056, -2087, -2001, -1800, -1487, -1068, -583, -48, 502, 994, 1444, 1806, 2055, 2173, 2161, 2021, 1756, 1383, 915, 416, -132, -661, -1151, -1560, -1885, -2090, -2181, -2153, -2009, -1752, -1407, -987, -513, -29, 453, 897, 1299, 1627, 1860, 1986, 2003, 1922, 1719, 1451, 1091, 658, 199, -275, -725, -1156, -1494, -1752, -1903, -1939, -1860, -1665, -1361, -984, -529, -48, 455, 902, 1299, 1626, 1827, 1940, 1925, 1782, 1536, 1200, 788, 325, -144, -604, -1022, -1384, -1650, -1829, -1892, -1847, -1721, -1482, -1169, -804, -390, 38, 456, 850, 1172, 1444, 1644, 1752, 1751, 1655, 1469, 1209, 877]
1783H77l83m23m24m08l60l00k17j08j9J03J99K87L68M34M43M36M27L53K84J88
1803A757P3l5j40k47l08l90m25m45m23l93l17k51j53o3L2J27J94L08L18L75L83
1824b3M04L59L13K54J89R0Oq2j48k32l10l54l85l86l73l20k71k01j04KQ2J81K70
1847a039L43L83M07M06L76L29K46J49O6m8j33k33k97l61m05l89l88l60k90k19
1867a457j31m9L6J27J99K54L16L59L66L54L47K83K30J80R0Mo3j47k29k82l33l64
1889I0l70l58l15k62j70j04j4J06J67K47L15L58L86L61L61K87K34J49N3m0j24
1910A357k15k70l28l47l70l45l10k72j93j22n6M1J23J69K36K89K98L36L24L03
1930F48K62K12J63O1K2p5j46k16k65l02l38l36l18k80k33j59o2JR3J60K42L02
$$ y = [877, 494, 71, -353, -761, -1121, -1421, -1638, -1746, -1765, -1662, -1463, -1176, -808, -374, 69, 505, 932, 1285, 1569, 1757, 1830, 1795, 1655, 1408, 1100, 710, 285, -160, -583, -976, -1293, -1544, -1697, -1760, -1728, -1601, -1407, -1099, -781, -406, -23, 381, 740, 1053, 1307, 1496, 1586, 1592, 1510, 1362, 1130, 820, 466, 81, -305, -678, -998, -1269, -1470, -1574, -1572, -1490, -1309, -1039, -696, -313, 94, 500, 876, 1205, 1451, 1600, 1666, 1618, 1485, 1252, 955, 594, 189, -200, -588, -948, -1238, -1457, -1588, -1637, -1601, -1474, -1275, -1021, -705, -346, 20, 374, 721, 1004, 1234, 1414, 1504, 1508, 1445, 1298, 1069, 787, 454, 90, -280, -638, -953, -1215, -1385, -1489, -1503, -1397, -1230, -983, -668, -310, 76, 437, 798, 1085, 1319, 1468, 1521, 1481, 1357, 1142, 872, 544, 197, -173, -518, -828, -1100, -1293, -1415, -1471, -1430, -1307, -1138, -902, -613, -315, 21, 345, 648, 910, 1122, 1285, 1346, 1368, 1293, 1147, 931, 666, 364, 26, -310, -628, -908, -1141, -1300, -1362, -1361, -1268, -1108, -866, -564]
1952e64L25L62L48L21K64K01J22L6m0j31j98k64l01l35l40l31k65k32j83j11m9
1973a365M6R4J70K28K48L04K98K94K85K34K01J41O5Ko6j34j86k50k89l07l12k93
1995e92k49k15j31o1OR4J64K31K81L12L20L32K71K43J63J05K1o3j24j87k46k92
2017C83l06l02l02k44k28j34j03k7M7J02J66K09K46K74K80K74K64K28J79J22N5
2038A183%p7j40j95k43k59l17k87k65k58j73j18n8K5J04J62K33K72K89K96L18
2059D92K45K30J48Q2K2p1j23j84k28k69k88k83k68k31j85j42q6k5N6R0J57J93
2081f68K31K67K59K48K41K06J49J11N0j8p6j34j83k42k66k70k76k50k11j54r3
2102a079m0M0J08J80K23K55K84K87K72K27K02J23N5Op2j37j77k20k64k73k65k44
$$ y = [-564, -239, 123, 471, 792, 1056, 1257, 1379, 1415, 1375, 1244, 1046, 782, 481, 146, -194, -525, -790, -1022, -1205, -1316, -1365, -1319, -1225, -1055, -827, -579, -275, 23, 317, 602, 836, 1037, 1178, 1243, 1245, 1179, 1045, 859, 609, 320, 13, -299, -592, -841, -1056, -1187, -1248, -1242, -1148, -984, -753, -472, -160, 160, 492, 763, 1006, 1169, 1274, 1295, 1232, 1108, 921, 675, 383, 77, -225, -527, -771, -999, -1133, -1236, -1263, -1216, -1114, -948, -739, -493, -219, 61, 335, 599, 827, 1006, 1128, 1183, 1183, 1106, 966, 771, 528, 269, -48, -335, -600, -858, -1031, -1149, -1207, -1182, -1078, -916, -683, -411, -122, 174, 492, 737, 967, 1115, 1197, 1219, 1148, 1025, 841, 613, 344, 56, -227, -495, -726, -911, -1053, -1139, -1164, -1108, -1018, -861, -668, -437, -170, 89, 337, 578, 784, 933, 1044, 1094, 1076, 1000, 866, 683, 441, 175, -95, -371, -621, -832, -986, -1079, -1119, -1079, -971, -791, -568, -313, -29, 258, 530, 757, 959, 1082, 1137, 1143, 1071, 934, 757, 537, 273, 0, -265, -509]
2124e09k23j58j27p0pL7J22J41J84K23K45K46K32K26J87J46R3L6l1p5j32j75k27
2147C84k45k64k44k32j86j37q9j5N5J04J70K16K45K67K57K48J99J54J13M9l2p0
2169I47j34j70k24k40k40k38k27j78j51r2m1nN6R9J48J88K00K29K29K10K13J58
2191G37J25P1J9k5r0j38j89k13k24k52k26k10j70j28n4kN7J17J60K10K47K38K44
2214C04K26J83J45Q9K6k6q2j25j66j99k12k32k30j80j83j21q9m6J1N3J05J35J62
2237d52J96K14J96J97J85J48J02O3J3l2q2j45j84j89k19k16k10j96j36j06m8J2
2259h89P4J14J52K15K35K07K37J86J72J29P1K5m0q2j26j64k04j96k14j94j91j59
2281f42j13p8l3QN5R8J36J53J86K05K00J77J71J38R7N9J1m5q9j35j54k20j81k22
$$ y = [-509, -732, -890, -1017, -1087, -1094, -1057, -935, -794, -610, -387, -142, 104, 336, 562, 749, 895, 988, 1024, 993, 918, 786, 611, 384, 139, -125, -369, -601, -787, -924, -1013, -1028, -973, -869, -699, -483, -238, 29, 286, 534, 733, 887, 1000, 1049, 1017, 947, 813, 643, 419, 179, -61, -299, -526, -704, -855, -947, -988, -993, -937, -838, -690, -502, -302, -73, 156, 366, 579, 737, 862, 933, 952, 927, 837, 699, 510, 297, 73, -179, -405, -615, -785, -913, -967, -969, -912, -795, -635, -425, -178, 60, 304, 530, 713, 858, 947, 973, 947, 865, 740, 574, 375, 163, -69, -299, -479, -662, -783, -872, -918, -907, -854, -749, -614, -452, -256, -42, 154, 351, 536, 684, 786, 849, 862, 830, 748, 603, 419, 230, 11, -205, -415, -611, -747, -853, -901, -889, -815, -701, -549, -334, -99, 108, 345, 531, 703, 832, 903, 928, 888, 806, 680, 516, 312, 116, -98, -292, -483, -642, -755, -833, -866, -858, -803, -705, -569, -416, -230, -25, 175, 352, 523, 661, 758, 817, 828, 783, 694, 559, 405, 185, 4, -218]
2305b18j89j74j42q3l2J0P1J16J52J88K10K13K08J86J43J11O3Pk2r1j20j54j89
2328B64j89j89j85j59j50r2p0l7K1M5Q9J33J51J80J89J67J77J57J20R6M9Km4r3
2352F32j34j51j86j90j97j89j56j18o7m3K5P2J12J61J75J97J98J98J63J44R3M7
2374G86Ol7p1j35j28j70j85j70j73j58j39j01o6k8K7M2R9J11J44J62J71J71J71
2397C29J51J11R2L1J1l7j00j05j56j78j82j78j73j54j10p2k3K5P3J03J35J86J79
2420d2J72J79J65J06J06M6J4m3p0j12j34j54j70j61j69j45j19r9n3l2J6L8P8J16
2444d67J46J47J71J77J47J49J12Q1L8mm7q2j20j53j70j75j84j52j50r4p8j7K6
2467f99O7J05J43J55J79J81J49J66J21P6M2J0j7p1r2j29j45j58j60j56j37j19
$$ y = [-218, -407, -581, -723, -806, -838, -828, -757, -641, -489, -301, -91, 122, 330, 516, 659, 770, 833, 840, 818, 727, 607, 453, 264, 75, -114, -299, -458, -608, -700, -770, -807, -786, -741, -652, -519, -368, -188, 1, 168, 345, 502, 622, 718, 767, 769, 725, 632, 498, 347, 161, -29, -226, -415, -571, -689, -756, -799, -774, -702, -590, -429, -254, -57, 141, 339, 502, 646, 739, 786, 792, 755, 684, 549, 421, 251, 66, -104, -277, -435, -574, -675, -741, -769, -742, -700, -601, -490, -346, -184, -13, 158, 329, 480, 591, 683, 714, 725, 688, 588, 483, 327, 149, -33, -211, -384, -538, -648, -720, -743, -718, -645, -542, -407, -221, -42, 130, 309, 474, 580, 686, 732, 746, 703, 633, 521, 387, 233, 63, -98, -267, -412, -531, -630, -683, -715, -699, -661, -583, -467, -321, -174, -3, 174, 321, 470, 582, 663, 701, 697, 650, 568, 448, 295, 125, -50, -234, -386, -536, -630, -708, -725, -699, -632, -527, -384, -229, -50, 131, 280, 446, 567, 643, 685, 695, 678, 607, 515, 386, 241, 83, -77, -233, -370, -489]
2489d89r0o9j5lM0P2J17J28J41J61J47J72J24J02O7M0Ll5r0j10j41j69j72j65
2513b34j52j27j02m8j9M1Q0R4J27J68J62J65J51J32J16P7K8J6l2o8q8j29j32j60
2537F6j51j47j34j15q4o0l9J9L0R1J00J19J50J51J58J36J29J13P1K2Kn2p4j09
2561C92j40j69j48j57j48j19q2o3pL8Q1R7J15J59J49J60J36J27R0P5L8nl6p4p6
2586D33j10j34j46j54j33j17j04p1n1k3J3N0O5J13J02J55J47J33J41J20Q0O9K0
2609E98on8q2j02j38j47j59j58j30j03q0l3j1L2P0J09J26J45J37J41J34J15R6
2632D96O3L0kl7n5q4j14j28j32j31j18j24r0r3l7j1JM0P9J02J15J24J48J33J17
2657B92J20Q3N2J8j3n8q3j05j33j50j24j47j26r1o3m0J7K3O9J02J19J32J37J20
$$ y = [-489, -579, -648, -663, -666, -626, -554, -437, -309, -168, -7, 140, 312, 436, 538, 605, 645, 648, 613, 523, 413, 272, 103, -69, -234, -386, -513, -615, -663, -682, -641, -561, -467, -340, -172, -10, 155, 306, 438, 554, 631, 659, 675, 643, 575, 487, 358, 226, 66, -85, -232, -366, -481, -565, -625, -664, -645, -615, -524, -424, -305, -155, -4, 154, 290, 419, 532, 603, 625, 627, 575, 501, 392, 252, 83, -65, -222, -370, -489, -571, -634, -641, -603, -522, -425, -310, -151, -2, 158, 294, 421, 511, 586, 624, 619, 583, 509, 433, 323, 189, 43, -111, -244, -361, -465, -536, -587, -610, -597, -547, -482, -369, -267, -112, 35, 168, 309, 429, 509, 578, 598, 592, 534, 452, 350, 212, 65, -94, -252, -382, -485, -565, -598, -609, -577, -507, -398, -272, -127, 10, 151, 285, 400, 496, 559, 589, 587, 550, 495, 411, 297, 169, 37, -94, -212, -336, -426, -519, -556, -567, -566, -526, -447, -345, -230, -106, 42, 175, 292, 412, 495, 547, 565, 552, 494, 411, 306, 173, 23, -101, -248, -374, -465, -528, -568, -551, -528, -459, -357, -238, -106, 31, 151]
2681A51J23J02R2N5K3%l8o2r0q8j31j07j22j17j25p9o6n3j3J5M3O7R9J09J27J37
2707E2J19J15J02O8M8J4k8m8p8j06j23j12j45j33j02j02k7m6J4L1P8Q7J17J18
2731h7J14J22J18Q9P1N3K6ol2o4p2r7j16j07j03j13j10p1o5l0j0J9L8O9O8J13
2757a83J15J13J25R6R4P1L1Mk4m9q2j02j23j03j27r6j06p2m0j3QL8O4R6J10J03
2783e2J25R4J04Q8N1L0K2%m7n1q4r2r2r3j11r4p8q0n9l4rK4M4N7Q7R7J05J11J14
2812A77Q5P3N9K2K1l4n1p7j05j00j04j05q8r6n8k7j6J5M8N8P9J09P8J14Q1R0P0
2839C18M6L1K3k6j8o5p7p5q5q5j09p0p8o5m7j7j3K3K8Q1P7R1R9J02Q4R2O0N6J1
2868C92rj4m6q0q6j04r7j03q2p1n5l1oJ4M3O0P6Q2J03R3P2P3O7N5J9KJl7n2n8
$$ y = [151, 274, 376, 468, 523, 546, 546, 508, 446, 356, 268, 137, 30, -92, -209, -334, -413, -479, -532, -545, -530, -487, -420, -321, -212, -85, 52, 171, 286, 388, 456, 504, 518, 490, 442, 364, 258, 135, 23, -122, -255, -357, -459, -486, -532, -518, -487, -409, -322, -205, -87, 27, 149, 267, 356, 427, 480, 506, 500, 468, 404, 332, 235, 119, 12, -91, -204, -314, -385, -450, -480, -490, -471, -433, -364, -296, -183, -68, 45, 170, 266, 360, 431, 462, 466, 442, 393, 311, 209, 86, -17, -144, -240, -346, -418, -458, -471, -463, -425, -361, -265, -155, -52, 73, 167, 271, 359, 410, 440, 462, 462, 415, 364, 280, 188, 96, 3, -108, -202, -280, -360, -419, -453, -462, -438, -394, -337, -250, -153, -48, 63, 177, 262, 335, 394, 416, 437, 403, 352, 275, 170, 70, -34, -139, -227, -323, -381, -408, -424, -409, -361, -303, -224, -115, -37, 77, 158, 248, 318, 364, 395, 418, 392, 374, 309, 232, 157, 72, -13, -122, -192, -270, -335, -382, -399, -412, -389, -361, -280, -203, -112, -13, 89, 173, 265, 325, 381, 392, 383, 369, 323, 243, 157, 53, -44, -147, -229, -300, -355, -386, -392, -378, -335, -275, -199, -117, -14, 79, 151, 224, 291, 346, 365, 367, 368, 331, 279, 221]
2898B21q2p7p7q5q1p3n0m0l0mJ8N8O7P0R2P4J03O8Q3N8M5Ork0p9n9q6r8r5p9p8
2929b39o0n1k6J1K3M0N5Q6P6Q9Q9O8P2M7M6L3rj2k8n4n8q4o1q8o3r1n3o3k3k7
2959c55J8PM6O6O0R0Q9Q2P3P8L8M0prl5n2p8p5q4r8p4n9n6m0j7J5K9N1N1P3Q3
2990e0P6R1O2N3N6K4J7kj7l1n3p1o3p6p0p1o0o3m9j9j0OJ6N5N4Q6P4P9P9O9O6
3021B58M1L0j5j2l3o5p5p7q7q2n9o5n8k1mkL9M8O6O9O8Q9O7O8N4M9J4J4Ll4l1
3052B57n4o9o3q1n7p2o9n7l6k4oL2K8M1P6P1O8Q2P7Q1M6N1%j2j5m2o5p8p8q5o7
3083a20p9m7n3k5J4QL6M9N3Q3O7P3O5N9N6N1J4Oml1l6n3o9p2p2p4o0o5n4k4j1
3114c15QJ6L9N0Q5Q1O1P7P9N8M5L1n%l1n5n9r0q1p3q4o3n3m5OlK3L3N4P0P5Q0
$$ y = [221, 139, 62, -15, -100, -181, -254, -304, -344, -374, -378, -360, -302, -235, -165, -73, 1, 104, 172, 255, 313, 358, 364, 355, 335, 256, 197, 111, 13, -82, -161, -239, -299, -350, -376, -365, -342, -302, -247, -161, -85, 4, 93, 161, 233, 280, 326, 359, 350, 338, 310, 256, 198, 114, 53, -35, -98, -189, -242, -305, -328, -355, -337, -330, -284, -218, -158, -68, 21, 103, 176, 254, 292, 332, 325, 316, 281, 229, 151, 76, -8, -106, -180, -239, -295, -335, -352, -337, -308, -257, -206, -133, -50, 26, 117, 179, 232, 288, 312, 329, 327, 310, 279, 226, 155, 92, 16, -54, -125, -185, -248, -297, -316, -326, -320, -304, -249, -195, -109, -35, 44, 123, 192, 258, 299, 329, 314, 302, 269, 204, 129, 52, -35, -117, -176, -241, -299, -320, -324, -326, -287, -239, -173, -104, -36, 53, 120, 188, 242, 291, 305, 319, 322, 288, 257, 203, 134, 71, -10, -67, -139, -208, -265, -301, -325, -331, -299, -271, -230, -154, -83, -15, 67, 144, 225, 271, 322, 322, 310, 295, 253, 188, 110, 32, -53, -120, -199, -246, -299, -324, -310, -302, -266, -217, -164, -81, -14, 59, 124, 183, 239, 290, 304, 310, 306, 275, 239, 186, 117, 45, -27, -101, -161, -226, -280, -304, -315, -307, -291, -252, -202, -117, -36, 25, 102, 181, 239, 284, 315, 310, 310, 279, 224, 165, 75, -6, -79, -163, -226, -279, -324, -318, -321, -298, -265, -211, -141, -66, 14]
3146A4P5O2P3K7M0K5oj9j6n3n8o0p2q3o4o0n6m1k0qNK0N6M9O9Q1P9P4P0M8L1L2
3178C14j4j2m5n6p6o5p5p3p7o8m7j3j6J4L3L7O2O9O5Q5N8O0O3L9K9K2pj7k4n9
3208B06n1p4p1p2o7o0m2l2m5OJ6L6M0N7O6P7P4P3M9O3K2K0kl1l4o7m8q9o7p2o5
3239a84n7m1j9J2LL5M2M7Q4O2O2O4N8M4M6K8J3j1j3m3n0o0o5o2n8p8n1m5n3qj
3270b99K4K5N4N9O1P4P0P8N6M3K4K3k2k2m7m5o6p5n9p7n5m3m5j5j0J2L6M3O0N4
3300h4O9O4N9N2N5L2J6J7j8j4l2n5m9p3n2p6m6n6m0l2j8KJ5N0M0M9R0O5O4N9O4
3331B17L2K6Jj6j2o0m7p7o9o5o1o9k9l1k8J4K1K2N1N3M3P1O0O0N2M0N1J5oKk2
3362B39l6n5n9n7n2o3n5n1m7j7j3NJ6L6N9O0O2P1N8N6N8L4J8J3l0k3n3o5p0o4
$$ y = [14, 89, 151, 224, 251, 291, 316, 310, 291, 275, 222, 164, 104, 32, -51, -115, -175, -231, -272, -292, -300, -295, -275, -219, -170, -101, -20, 59, 133, 203, 251, 282, 314, 300, 288, 243, 187, 111, 46, -29, -102, -179, -247, -294, -307, -323, -309, -276, -239, -177, -108, -43, 42, 100, 160, 223, 262, 291, 313, 306, 289, 265, 206, 155, 81, 10, -62, -129, -189, -231, -263, -308, -302, -286, -250, -210, -153, -87, -10, 64, 137, 186, 249, 271, 291, 289, 258, 224, 157, 109, 20, -47, -119, -184, -241, -282, -301, -289, -286, -251, -209, -162, -78, -16, 46, 110, 168, 212, 258, 286, 299, 288, 275, 232, 182, 122, 57, -5, -63, -141, -192, -237, -290, -298, -299, -275, -250, -196, -137, -76, -2, 68, 146, 202, 245, 269, 292, 270, 248, 201, 156, 90, 15, -44, -121, -176, -219, -264, -279, -289, -277, -241, -198, -138, -84, -15, 49, 108, 160, 215, 247, 263, 280, 262, 248, 216, 161, 112, 39, -13, -89, -135, -191, -231, -263, -281, -279, -264, -214, -174, -125, -35, 30, 94, 153, 217, 249, 275, 276, 260, 248, 188, 141, 64, -5, -70, -131, -200, -229, -260, -288, -274, -253, -231, -180, -127, -84, -13, 47, 107, 159, 199, 250, 265, 259, 261, 239, 203, 148, 89, 32, -20, -83, -138, -189, -236, -253, -266, -261, -245, -209, -150, -90, -28, 43, 101, 157, 215, 249, 267, 280, 250, 227, 174, 109, 39, -25]
3392b5o1n7n4m2k4j6kK7L7M0O4N3O4N5P2M3M4K0K8jj5j5m3m7n3o3n6o4m7o3k5
3423b26k3oRJ2N0M9N3O1P2N7O7K8M5J1mj3m3m3n0p4n2p1n8n1l2k6kRJN0M1N7N6
3456d6M6N8O1N8L9K4J7Qj4k5l5n8n7n2n8o7m9o4k5k0k2L2PO2M3N3O9O8O0N8M0
3487B11K7J5Mk3l6l6o0o6n3o5n0n5l9j5j1NJ5L3M4M0O1O2N6N4N3L7L5RNj2k3l7
3519A85m9n8o6o0o8m6m5m5k7J2J0L3M4N1N4Q0O2N9N1M7K6K0mk7k4o4m4o2n9o4
3549g8o1o0j8l0j4%J3M5M5M6N4N3P0N5N1M6K5K9j5pl0m1m1o6n4o4n8n4o4j9j3
3580b55j8J2L4N2N1O0O2O9N0O9L5K7OJ8l1l7n2n8o6n2p6m7n4l7j9j0NJ6L0M3N6
3611a17N6O3O2N7O1K9K8K5rJ1m2m4n3m9o0o3o3n7m1l3j6oQL2N2N4M7P9N5O5M8
$$ y = [-25, -86, -143, -197, -239, -263, -279, -281, -254, -217, -177, -113, -60, 4, 59, 131, 174, 218, 238, 266, 265, 250, 235, 192, 145, 92, 29, -27, -91, -138, -201, -226, -249, -255, -246, -234, -184, -135, -82, -21, 51, 108, 175, 203, 248, 259, 255, 242, 199, 156, 106, 32, -20, -91, -149, -200, -232, -258, -260, -251, -250, -200, -159, -102, -46, 0, 58, 119, 177, 216, 240, 257, 265, 251, 226, 191, 133, 76, 24, -34, -101, -150, -214, -239, -259, -281, -249, -242, -180, -137, -84, -15, 53, 113, 171, 211, 238, 253, 257, 234, 198, 162, 102, 36, -17, -82, -132, -187, -226, -241, -252, -247, -232, -199, -155, -115, -54, 8, 64, 118, 171, 208, 243, 252, 257, 245, 222, 185, 136, 78, 12, -48, -116, -162, -207, -252, -279, -267, -257, -224, -180, -129, -75, 5, 67, 126, 177, 224, 250, 270, 266, 239, 215, 151, 107, 45, -14, -78, -139, -199, -217, -247, -261, -261, -248, -203, -158, -112, -58, -5, 65, 120, 171, 217, 242, 271, 256, 249, 219, 178, 137, 71, 17, -47, -105, -159, -223, -242, -255, -273, -261, -227, -175, -124, -64, -2, 67, 117, 186, 221, 248, 254, 272, 241, 204, 152, 94, 28, -24, -100, -147, -201, -238, -257, -267, -262, -246, -216, -173, -117, -61, 2, 64, 121, 182, 211, 239, 264, 255, 266, 224, 180, 127, 78, 18, -45, -108, -165, -206, -239, -255, -261, -253, -221, -169, -115, -68, 11, 66, 131, 179]
3642A79M7K9qkj1l7n8o3n9n0n8m8o4k3k1k6K0K3L7L1N6M6P4O0N3M7N0K8kQj3j7
3674B28n3m6o1n8n4p7n4l8k9l1QRL6M4N3P0N7O7N3N4L2K0K4qk5l1n8m6n2o9m8
3705h3o1m5m5j8jNJ8L4L6O6M4P5N0M8N0L2M1ONj4l0m4n2n9o1o6o5n0m0k8j9PJ9
3738b45L3L5O3O1P7N7N9O0K9J9Kkk5l4n9n1o2n2o6n3m2j8k7k1J2J6L3M8M2O9N8
3769A6O1M7M6L7L1J6%j6k9m1n7o1p0n8n9m3m9k1rjK4L0O1M8O5O3N6N6N0L5K7M
3801B59m3km4l0o9n1o6l8o6l5l6k3kNJ0L6M7M0N9M8P1M4O2L4K4J9nj3l7m5n4n3
3833D6n5o1o3m6m4k8kK0OL2O1N1N2N9M6O8L7L3K3j1j1k5k2n5m8n9m1o2n7l8k8
3864b22k2pJ8J2K5M4N2N1N9M8O2M1M0M0Nmk5k6l3m7n6p0n1n6n8l0k4j3jK0M7M3
$$ y = [179, 226, 255, 247, 245, 234, 197, 139, 76, 17, -33, -91, -139, -203, -226, -247, -273, -253, -230, -193, -162, -106, -60, 14, 74, 127, 174, 224, 252, 250, 258, 245, 228, 175, 129, 68, 10, -44, -121, -175, -213, -242, -273, -265, -256, -220, -176, -123, -53, 4, 71, 124, 178, 210, 230, 254, 246, 221, 190, 132, 86, 34, -35, -83, -144, -189, -234, -252, -253, -248, -230, -196, -160, -94, -50, 25, 75, 123, 173, 205, 246, 252, 257, 243, 213, 169, 117, 58, -3, -69, -134, -184, -224, -252, -271, -264, -245, -212, -177, -114, -53, 24, 81, 140, 200, 229, 248, 250, 248, 223, 189, 130, 79, 17, -35, -101, -154, -196, -214, -241, -262, -250, -234, -201, -153, -111, -42, 16, 77, 124, 170, 207, 238, 254, 254, 238, 209, 168, 111, 50, -20, -78, -137, -180, -229, -250, -259, -260, -236, -206, -145, -97, -32, 31, 87, 143, 193, 228, 255, 259, 216, 214, 170, 140, 71, 20, -46, -84, -150, -185, -221, -244, -246, -241, -231, -195, -148, -108, -49, -1, 70, 114, 176, 210, 234, 253, 248, 235, 198, 153, 99, 46, -9, -70, -133, -179, -223, -251, -253, -233, -227, -195, -134, -83, -31, 28, 74, 142, 179, 212, 235, 224, 213, 188, 166, 111, 63, 4, -37, -99, -156, -194, -222, -244, -251, -233, -221, -196, -152, -100, -49, 10, 58, 120, 161, 201, 241, 246, 242, 217, 191, 158, 111, 55, -15, -66, -122, -180, -210, -234, -247, -248, -228, -181, -138]
3896a38N0N7N7N5N1L8K0K7Ljl2l6l7n4n6n2m5n5k7l4k6lJ1PL9M4N0M8N6O6L7N3
3928A73K3L6J1mj6l5l8m3o9o0n2n9l9m1k0j5LK8L2M9M8N2N9M9N0M8K8K8rmj9l3
3960A61m4o3m5m1o1m1l4l1k1pMJ4L9K4N1N9M4O0N2M8L1K9J0kj7l8l7n3m4n7o9
3991g9m7m0m7k0nMK1L3N1M6O4N1N6L9M7L8K1j7kj1k7n1n3n5m3o6l5m2l4k2j4M
4023b35K2K3L6O5M3N5O1L9O0K3K9J9j6j2k5m8m7o0n3m9o1m1l4j7pKL2K4N3M1N8
4054b0M5O3M8L3K8J4J2j4l0k4m3l8m6o0n5m4m6m6rqjK2K9L9N9M7O1N7N6L9M1K4
4086B33Okk6l0l5m9o2m6o2n0n3k7k2jRJ8L0L4O2N1M8M7M8M0K9KQnj6m0l1m7m8
4119A3n8m3n8l8k4j9Mj7L0L5M3M0N5P3M0N7M4L2K0J6qk4l3m4m4n5o4m8n8m5k7
$$ y = [-138, -88, -31, 26, 81, 132, 170, 190, 217, 220, 219, 187, 151, 114, 60, 4, -48, -93, -148, -175, -209, -235, -238, -227, -220, -181, -137, -87, -39, 17, 83, 120, 173, 196, 232, 243, 239, 223, 188, 150, 107, 38, -22, -74, -133, -172, -213, -233, -248, -245, -217, -185, -136, -88, -36, 23, 72, 122, 170, 198, 226, 217, 213, 194, 161, 117, 54, 9, -32, -93, -134, -168, -199, -220, -227, -223, -209, -170, -146, -95, -36, 8, 68, 120, 168, 199, 228, 238, 236, 219, 181, 144, 91, 47, -10, -79, -126, -166, -213, -233, -238, -234, -213, -180, -129, -83, -19, 32, 88, 127, 174, 212, 233, 216, 214, 203, 176, 125, 72, 17, -26, -92, -127, -169, -203, -225, -239, -235, -213, -190, -154, -89, -46, 9, 70, 109, 169, 192, 221, 240, 224, 212, 187, 139, 92, 32, -21, -70, -131, -172, -206, -223, -230, -228, -196, -172, -119, -78, -20, 25, 88, 136, 169, 197, 211, 223, 209, 179, 155, 112, 74, 28, -32, -87, -131, -177, -223, -232, -240, -241, -219, -190, -151, -92, -45, 16, 73, 129, 168, 209, 233, 239, 237, 211, 181, 146, 97, 35, -11, -73, -123, -176, -203, -225, -226, -217, -199, -169, -135, -73, -22, 26, 73, 121, 161, 190, 192, 200, 195, 179, 139, 108, 61, 13, -45, -88, -146, -184, -208, -227, -223, -240, -210, -175, -132, -92, -37, 36, 76, 133, 177, 209, 229, 245, 237, 213, 180, 136, 92, 37, -27, -75, -133, -178, -205]
4150b05j6j1JK6L6M6M4N7M8N7M4K8M1J0J3j7j5m5l5m2m9l9o1n5l1j4l1k1J9J7
4180b00K5L5O3M8N0N3M6M3M4K3j0Mk5j6o1l9o2n8o1l9l5m0j0nOK8K7N1M0N8M5
4211B8N2N2L7L1RoKk5k6n3k9o1n4m8l6m5j6k2j7J1J1K7M1M6M5N7N6N1M0L0K6J
4243B15qj3k6m4m9o6n3m8m1l4k4k5j0J9L3L0M6L3N6M6O3J9K8M2J5jj1k6k0l6n7
4274E3m4m1n5l9l8l5k4pLK1M5K8M7N9L8O0N2L7L5PJ6j2lm2l0m8n6n5n0m0l3k1
4306a72l7NQK6L4L8M3L9M7M7L1L7K5K1nLk8l0m1k7n9m7m6m4k9l4j6r%L3L5K8M3
4339h1N1N5N3M6M3K4J8kNol8l9m2o0n3m5m6m1j5rj5PJ8L2L6L5M2O5M4K8L6J5K2
4372A83J4ok7k9k9m8m2n0l4m3m1k8j9nPK5QM9L4O2M4N0L5L8L7K9lrk8k9m3k9n4
$$ y = [-205, -221, -232, -231, -205, -169, -123, -79, -22, 26, 83, 127, 155, 196, 206, 219, 202, 187, 142, 107, 65, 16, -23, -84, -139, -170, -184, -215, -236, -217, -200, -175, -140, -77, -29, 21, 74, 120, 163, 207, 230, 220, 224, 199, 183, 122, 83, 21, -37, -98, -137, -172, -212, -222, -227, -221, -193, -166, -115, -75, -17, 28, 80, 132, 169, 200, 209, 203, 205, 180, 154, 101, 72, 11, -43, -91, -127, -172, -188, -210, -227, -216, -205, -178, -137, -91, -46, 11, 67, 118, 158, 188, 214, 215, 207, 194, 168, 124, 75, 9, -44, -92, -133, -167, -191, -216, -226, -207, -174, -144, -98, -65, -9, 37, 100, 119, 147, 189, 204, 203, 192, 166, 146, 110, 53, 9, -32, -87, -126, -164, -199, -223, -230, -227, -206, -161, -133, -86, -27, 11, 71, 123, 160, 195, 202, 218, 206, 203, 161, 131, 83, 27, -28, -78, -118, -151, -172, -209, -204, -196, -170, -136, -98, -55, -16, 31, 78, 109, 146, 171, 192, 187, 190, 162, 132, 91, 64, 5, -42, -88, -132, -161, -195, -211, -220, -220, -187, -152, -124, -81, -30, 25, 78, 124, 167, 191, 209, 207, 212, 206, 168, 129, 87, 27, -26, -71, -117, -158, -173, -182, -197, -190, -172, -140, -104, -69, -27, 38, 82, 110, 146, 161, 183, 197, 191, 164, 135, 106, 58, 16, -34, -68, -111, -152, -180, -199, -204, -197, -172, -164, -115, -81, -19, 25, 75, 110, 148, 185, 214, 211, 202, 174, 145, 102, 73, 19]
4405A9n3l1n2m2k9jrPL4J4L8L6M0M8M3M9L2K3K1rQj9k0k4n0m8l1m7n7l7k3nk6
4438b01JK3K9K8M1N6M1M3M2M1K0L0Lnj6m1k4n0m1n2k8m4l3k5k3JNJ8L2L6L5L9
4470a9L4M7M8K8K3J3J4Jj8j9m1m4m1m2l9m2l0l9nj7j2J6K9K7M7M5L8N0M5L9K5
4501A61K6Oqj6k2l7k8m3n5l6m4k9k5k1lJ0J0J8M8L5L9M0L4M2K3K4J7J2j0j5j7
4532A36l1l1n2l1m9l7l8l3j3k2OK7OM4L8N0L5M0M8L8K5K5Pkj0l1k4l4n2l7m0m4
4564h6l1k3k7MJ0LK6K0M5L6L7L1M9K8K0OK4j6kj7l7l5l8m0m0l2m1l9k3MrK1K5
4597a47L4L2N3M7M0L0N2J6K2J1j5j1l1l2l6l0m3m1m7l2j7k9R%QK9J6L7M2L0L7
4628C4N2K6J6K2J6njk7l2l4k5m3n2m3l5k0j4j3RQK7K1L9N2L1L3M4M3K2QJ6j2j4
$$ y = [19, -34, -65, -117, -159, -188, -189, -198, -191, -157, -143, -105, -69, -29, 19, 62, 111, 143, 166, 187, 178, 186, 167, 147, 123, 73, 25, -6, -53, -110, -147, -170, -175, -201, -200, -177, -148, -120, -79, -23, 18, 61, 103, 144, 164, 194, 197, 192, 176, 135, 111, 61, 20, -32, -60, -104, -137, -162, -185, -184, -179, -161, -129, -93, -58, -19, 15, 62, 110, 138, 161, 174, 188, 189, 171, 152, 111, 67, 26, -16, -55, -97, -127, -166, -171, -188, -200, -184, -155, -128, -81, -36, 2, 52, 97, 136, 161, 187, 193, 185, 169, 147, 110, 82, 39, -16, -52, -96, -125, -150, -171, -174, -164, -154, -136, -88, -53, -14, 26, 60, 102, 125, 149, 166, 178, 168, 153, 136, 105, 74, 22, -9, -58, -95, -133, -166, -179, -201, -195, -168, -162, -118, -80, -30, 5, 45, 93, 131, 156, 181, 188, 186, 176, 145, 121, 87, 35, -2, -42, -86, -117, -140, -167, -163, -153, -150, -124, -104, -59, -23, 14, 45, 94, 122, 142, 148, 172, 156, 154, 137, 100, 65, 27, -13, -53, -85, -126, -165, -188, -184, -193, -172, -147, -113, -81, -28, 19, 59, 89, 141, 157, 179, 190, 175, 164, 133, 101, 65, 35, -8, -49, -96, -128, -145, -174, -165, -165, -157, -128, -112, -75, -33, -3, 34, 86, 112, 128, 150, 166, 161, 160, 133, 101, 67, 42, -1, -53, -96, -131, -151, -165, -178, -169, -161, -134, -113, -74, -22, 9, 42, 86, 129, 151, 159, 175, 163, 149]
4661A49j6m0k9m3m0l5k8m0k0j1QlJ1K3L0L0L7K6M1L7K9K3PJ7j3Lk9k9l7k5n0k8
4693d5m1k9l0k1j6OJ5K4L6L1L9L6M4K6L4K7J6Qj1k2j8k3l2l2m6l3k3l4pk7qJ2
4725a44K4J1K6L0M4K7L5K7K4L6%J4j2kk7k0l2m0m3m7l1k9k9j6PqK2K8K5L6L3L5
4757DN0J8N3J1J5J5k1j6j4m1j6l7l5l3l4k4j7k0nJ0J2K2L0K8K9K9L2K4L3J9J9
4788A40Qj5pj2l4l1l5k6n5k5l5qj4j4RPK9M0K2M0M7K6M2K1J5K0Mj6j9k1k0l8k2
4821B3m2l1l1k6k0rmK1MJ2L2J9L4L1L6K5L0J0J1MRk1j6k1l5l0l4m0k5k6k1j2l
4854a46mJ8K3L2L5L3L2L8K0K4J5J6Oj2j3l0k3j7l7l6k8k0k3j9j0OnPJ9K9K4L1
4886a5K6L0L7J4K5K0J5k1j3j0l0j9m2l7l1k8k0k2j7mLK5NL7K4M7K9K5L2K1J2N
$$ y = [149, 133, 93, 64, 21, -19, -54, -82, -122, -142, -153, -145, -148, -137, -114, -84, -54, -17, 9, 50, 87, 116, 139, 146, 163, 150, 153, 124, 95, 58, 33, -17, -45, -86, -115, -145, -166, -182, -176, -161, -137, -101, -70, -31, 5, 49, 75, 109, 136, 152, 160, 149, 127, 109, 86, 54, 22, -24, -57, -80, -114, -121, -148, -156, -144, -120, -109, -83, -53, -9, 18, 53, 80, 104, 140, 140, 154, 142, 140, 113, 93, 61, 21, -22, -69, -100, -129, -158, -174, -167, -175, -153, -125, -100, -64, -31, 4, 54, 72, 125, 136, 151, 166, 145, 129, 115, 74, 58, 21, -14, -47, -81, -105, -122, -142, -147, -137, -125, -103, -73, -45, -16, 13, 45, 69, 102, 121, 140, 148, 133, 126, 114, 80, 49, 14, -12, -67, -92, -127, -135, -149, -163, -154, -147, -118, -78, -56, -16, 31, 57, 99, 120, 135, 155, 159, 143, 124, 103, 83, 45, 23, -19, -50, -81, -107, -127, -136, -140, -119, -115, -103, -71, -52, -18, 13, 49, 74, 104, 114, 125, 129, 138, 117, 101, 80, 45, 15, -19, -59, -84, -110, -131, -143, -146, -150, -132, -109, -77, -42, -9, 23, 61, 81, 105, 120, 136, 142, 130, 117, 87, 64, 47, 10, -26, -54, -74, -97, -116, -126, -120, -125, -118, -99, -70, -46, -15, 11, 41, 78, 92, 117, 137, 152, 131, 118, 108, 78, 59, 17, -20, -51, -79, -99, -121, -138, -142, -139, -114, -109, -72, -48, -1, 28, 53, 85, 106, 118, 123]
4918A23Opj8pk9k7k9l9k9j4j7k6omMJ7JM0K5K7L2L0K7M1%LJ1qj0k1k0k9k2n8k3
4953e6k0l2j6qjLMJ9L9J8L7K5L6K0K5J6PN%pk3k5j0l0l8k0l4mk3qqNMJ8K2J9K3
4990a8L5L4K3J6L1lOpj4k2j6k5l6k6l5l1k2j0j8mNK6J4K2L3L7K5L7K5J0J4QOl
5024A17rk2j3l5j8l2k2k8j9j5k0J2j0J7J0K3K4L4J9L4J5K8KJ9Llj8k7ql1j7l6
5056b6l3k9j3k0oJNJ8K2K5K3L6J7L9K2RK1Lnlj3rk9k1k0l0k8k5j6k2mkOOL4OK6
5093c5K2K5L6K8J0K4JOjj4j5l9j7k7l5k4j9k5mk0OJ3J4K7NJ6M2L3J5K0J5J3kJ1
5127A05j6mom6j9j7l8kk8j2j2lmMJ4J6K2J5L9K3K1J4L2J0J0Klk3k2j7k3l5j7m0
5161f0k3k3pmoJ3J4J1L6J7K4M0NL0KK3PJj2j3j6j4k1k6k1l0qk3rnQ%OL3J1K8J8
$$ y = [123, 129, 122, 104, 97, 68, 41, 12, -27, -56, -70, -87, -113, -119, -123, -119, -102, -101, -61, -36, -9, 23, 53, 80, 121, 121, 124, 135, 127, 117, 96, 76, 47, 25, -33, -56, -76, -108, -124, -132, -133, -130, -126, -107, -68, -50, -13, 12, 48, 68, 93, 109, 116, 121, 121, 114, 91, 66, 56, 26, -12, -32, -66, -70, -93, -101, -109, -104, -100, -82, -60, -41, -18, 17, 51, 74, 90, 121, 118, 124, 117, 103, 81, 65, 40, 4, -22, -57, -88, -110, -120, -138, -142, -137, -111, -97, -75, -42, -5, 20, 57, 82, 92, 106, 114, 120, 117, 108, 86, 73, 38, 20, -12, -34, -62, -81, -96, -116, -104, -114, -97, -87, -64, -40, -6, 13, 47, 62, 90, 92, 111, 114, 111, 93, 66, 58, 27, 10, -26, -59, -88, -101, -121, -127, -126, -121, -103, -81, -56, -33, 3, 20, 59, 81, 90, 111, 114, 109, 106, 93, 84, 55, 34, 14, -16, -44, -69, -85, -107, -111, -113, -107, -101, -67, -61, -35, -13, 12, 48, 76, 86, 110, 111, 117, 116, 102, 87, 48, 31, 4, -31, -55, -74, -99, -103, -123, -117, -104, -90, -63, -58, -42, 0, 33, 48, 68, 83, 96, 94, 105, 89, 85, 79, 33, 14, -3, -41, -43, -71, -83, -95, -98, -102, -98, -84, -68, -46, -31, 8, 31, 52, 66, 98, 108, 118, 120, 117, 94, 72, 55, 32, -3, -20, -60, -83, -106, -113, -117, -123, -110, -96, -85, -49, -32, -8, 32, 37, 67, 69, 92, 99, 100, 88, 75, 59, 45, 24, -2, -23, -53, -61, -84, -93, -98, -90, -90, -84, -51, -40, -12, 6]
5198FK9K5K2J0RRprml3j0k6l4l5j6j7k0j2rJ0%J2K5K4L0K2K5K5K2J5J5lj4jlj4
5234F8k5k6j4k9k4j9rpj3OKKL4J4K4K9J5K3J2K4kJ2oJj5j3k6k7k2l2k5jl7MJ%
5270a01LK3J6K4K0K5K0L3J3J2QLjj3rk3k4j4j8j2k3l3j3pLlJNK3J9K9K6J9K0J8
5305F9NK5%jj2ok3j8k7k1k5k4k3%r%mJ4OK5OM6QK7K2RJ4J0pjlk1j7j8j1l2k0j8
5343e5qj4j9mJ4lJ6K7J3J0L6J8K0J9J2J3J4j4jj7k7j7k8j6k7k1j6mj4kkOL0KK3
5378c6J5L0PJ7K0J8MqJ8j8j0j2k5k0pk5j2k5jj0qJ2MJ5J3K2J7K2J9K1RK3Pokj6
5414G2j2j3k0k2j8l1k4Kk2rNOJ0NJ7K3L1J4J2J8J8QOJ3j1Jj9rk0kl2j5l1mj2n
5450g0%RLRJ6J2J7K0K9PJ4QJ0%Krj6k7j6k3k1j6j7j6rNn%PK1RJ8K3K2J7K7JJ6
$$ y = [6, 35, 60, 82, 92, 101, 110, 103, 94, 90, 57, 47, 21, -13, -48, -64, -81, -101, -113, -122, -112, -112, -100, -75, -51, -21, 1, 26, 51, 73, 88, 103, 100, 86, 85, 82, 68, 43, 17, 3, -26, -50, -69, -78, -85, -98, -92, -90, -88, -54, -40, -16, 13, 28, 51, 63, 87, 85, 97, 91, 92, 77, 64, 38, 11, -11, -43, -68, -69, -106, -102, -101, -101, -98, -75, -59, -35, -15, 10, 30, 63, 76, 88, 96, 99, 98, 85, 76, 53, 29, 15, -3, -15, -38, -71, -84, -91, -88, -91, -90, -85, -62, -43, -14, 12, 31, 51, 69, 74, 99, 99, 98, 86, 80, 57, 39, 12, -9, -34, -58, -81, -81, -90, -90, -94, -80, -74, -49, -43, 3, 11, 38, 60, 69, 83, 93, 86, 85, 82, 61, 44, 26, 15, -17, -37, -55, -63, -77, -96, -100, -86, -89, -73, -46, -33, -23, 13, 31, 51, 70, 82, 95, 109, 95, 94, 77, 50, 33, 5, -11, -38, -59, -75, -79, -93, -95, -97, -91, -61, -59, -36, -21, 9, 16, 33, 53, 71, 75, 67, 85, 67, 57, 45, 20, 0, -7, -32, -44, -69, -70, -80, -88, -76, -72, -57, -44, -22, -5, 17, 36, 57, 66, 89, 96, 90, 88, 72, 60, 47, 27, 5, -13, -44, -68, -66, -88, -97, -92, -86, -76, -71, -54, -31, 0, 14, 26, 44, 62, 70, 76, 89, 78, 79, 60, 51, 31, 29, -3, -18, -49, -53, -65, -70, -70, -61, -58, -49, -33, -21, -4, 16, 45, 52, 66, 74, 84, 84, 86, 77, 61, 34, 18, -5, -26, -42, -59, -75, -84, -79, -84, -84, -77, -56, -47, -29, -6, 16, 33, 60, 61, 77]
5488G7KJmj4Nk6ll1j4k4%j9k0j1LRMJ0J5J5J1L0J6J5J3J6j2J0Mj9j3j0j6j5k2
5523a7j1k3k3jkLkJ5OJ9J3K5J0K1J5J0J2kNJj2j0j8pj8k4j7j9k4J3j7JRJ4KK3
5559c0%K1K3J2K7J0J5lKjnj5jl3j5j5k3j1j0rj0j1RJ6MJ3K1J4K2OQJ7JQOMj2j2
5597D3j6j5j3j1k2j2j1j0j8J1MQJ6J2J4K0K2K4QJ7JMQoj1j4k5k1qnl1rk2LmlL
5634f9jJ3J6OK0J6J8J4J6JJ4npJ0j3j0j9ol2nk1nj5JnNJ8NJ8QJ7J8J9J1J4kJ5
5671G8Krj3j3j4k1k4j5j0j3j3nmlJ1J4jK2J1J7K2LJ4J3J1OjMmj5kl8mj9j2k6k
5708e3mrmlJ2KK7J3K1J5J7LJ7J6lNj1j4qk1rj7j4k2j0j5J0j3lJ5J0K3%K3nL2J7
5745D0J6oJ8Qj2Jj1j0qj5k1j8qj9lmj0JOoJ5J0J3J8L0J5J8oK1%r%j7kj5k2j9p
$$ y = [77, 79, 80, 76, 62, 67, 41, 38, 7, -7, -31, -31, -50, -70, -81, -78, -69, -65, -55, -40, -25, -14, 16, 32, 47, 60, 76, 64, 74, 78, 59, 46, 36, 20, 5, -17, -28, -51, -74, -75, -77, -74, -76, -61, -55, -36, -23, 2, 12, 33, 48, 58, 70, 68, 73, 74, 62, 52, 34, 27, 9, -15, -32, -51, -75, -62, -79, -78, -69, -55, -53, -30, -30, -9, 14, 26, 53, 63, 78, 75, 77, 76, 71, 56, 55, 22, 7, -8, -31, -42, -52, -61, -71, -82, -73, -57, -53, -40, -19, -5, 17, 23, 31, 48, 49, 57, 63, 67, 55, 43, 27, 12, -1, -12, -34, -46, -57, -67, -85, -74, -70, -62, -46, -34, -20, 0, 22, 46, 54, 71, 72, 76, 84, 78, 67, 53, 28, 7, -1, -6, -37, -46, -68, -65, -69, -72, -69, -70, -57, -41, -35, -15, 1, 19, 33, 49, 50, 64, 59, 52, 62, 49, 39, 20, 14, -18, -23, -44, -49, -64, -63, -68, -63, -45, -40, -22, -14, 3, 21, 40, 51, 65, 63, 78, 80, 71, 58, 45, 31, 10, -14, -29, -39, -52, -65, -70, -74, -77, -66, -52, -53, -31, -20, -3, 19, 22, 36, 49, 60, 66, 65, 69, 65, 50, 48, 10, 6, -13, -25, -51, -53, -57, -66, -70, -73, -61, -59, -32, -19, 2, 17, 34, 37, 54, 70, 67, 72, 61, 47, 39, 18, 9, -8, -22, -44, -54, -69, -59, -72, -75, -60, -50, -27, -27, -4, -9, 23, 40, 56, 50, 68, 76, 64, 65, 54, 44, 36, 21, 0, -18, -26, -45, -48, -52, -62, -61, -55, -61, -46, -36, -23, -5, 25, 40, 58, 52, 73, 73, 64, 64, 47, 45, 30, 8, -11, -18]
5783a8j4j6j0nJ2kLkJ1K6RRJ5K0JJ0JoRj1j0Jj1k1pk2j7mnj1jj%J5J5J7J0J9J8
5822B7PJ8J1J1Rj4j4Mj1k2j7j0k3rpmj0Oj1J3jJ0J4MJ9OK2lJ3JJNqJ2k5rj7Jj2
5861a3k1Kj7Pj2qK4jLK1NK3J9J3J1POmnj1Kk0j5j5j9Lk3j1rjJ1j2RJ3OQJ1J7J9
5900B3MJ2kQPkkrnkj3k1j2j5mpLnlKOJ7NRMJ8J9J1KN%lKoj8k1j9Kj0j3j1k1J2
5943e3j5K0nNJ5J1K2J3jMK7JJ1Norlpnj1j9j9j5Pk6KmMJ1%RJ4KJ4J8RRNLPKj0
5985D2j2lj4Kj4j4j1rmjrPlJ1PPQJ8QORkJ4Rj0Lj2rqj2j4k5%jj1oMlNkJ7J4J4
6028dMK5kK0KJ8nlonj4oj9j2%j3pk1PL%mJ3LJ1QQNJ5NJ3%nPqj0nj3j2%j6j2nj2
6072e2Jl%QK4MJK5NRK1J4Rj1j4Onj2%j5j5j7j3oj0J1j3JKNKJK0J4mJ8J1QPpJ3
$$ y = [-18, -32, -48, -58, -63, -51, -53, -50, -52, -41, -15, -6, 3, 18, 38, 39, 49, 50, 44, 53, 42, 32, 33, 22, 1, -6, -28, -45, -49, -54, -65, -66, -67, -67, -52, -37, -20, -10, 9, 27, 34, 52, 63, 74, 83, 69, 55, 59, 48, 26, 9, -1, -24, -33, -40, -44, -54, -48, -59, -46, -47, -37, -23, -19, 0, 6, 28, 25, 38, 39, 40, 45, 37, 49, 24, 15, -2, -1, -13, -34, -32, -49, -42, -54, -62, -38, -39, -36, -15, -10, 13, 32, 45, 56, 63, 69, 65, 60, 49, 51, 31, 16, 1, -18, -15, -38, -49, -58, -59, -48, -60, -51, -38, -32, -24, -13, 4, 23, 27, 39, 37, 45, 52, 50, 48, 39, 34, 32, 19, -2, -14, -29, -33, -40, -37, -42, -45, -43, -37, -20, -15, -6, -2, 16, 35, 46, 48, 53, 53, 50, 52, 46, 28, 7, -12, -10, -20, -33, -44, -65, -53, -68, -48, -53, -48, -33, -22, 0, 13, 12, 16, 43, 44, 55, 60, 54, 45, 42, 35, 30, 19, 0, -19, -34, -27, -53, -51, -55, -51, -40, -40, -31, -17, -15, -1, 17, 26, 35, 40, 43, 50, 52, 42, 30, 27, 13, 15, 1, -13, -24, -33, -37, -38, -47, -40, -43, -32, -25, -18, -10, 8, 16, 22, 31, 29, 43, 52, 42, 45, 33, 24, 16, 4, -10, -35, -35, -36, -47, -53, -49, -52, -47, -49, -32, -18, -4, 0, 25, 23, 43, 45, 63, 58, 55, 49, 44, 30, 24, 5, -7, -7, -20, -27, -48, -41, -38, -38, -42, -29, -26, -15, -7, 1, 6, 21, 26, 39, 39, 34, 41, 33, 23, 18, 5, -7, -7, -23, -35, -40, -52, -51, -54, -54, -46, -22, -18, -17, 8, 13, 22, 43, 57, 66, 55, 41, 47, 42, 30, 30, 15, 0, -17, -30, -36, -46, -35, -48, -47, -45, -40, -38, -37, -17, -3, -7, 11, 22, 30, 37, 30, 43]
6113D3j2Qoj3j8kj0j2Lj1rqPKMRJ8OQJ2QJ2pJ2MkQk1j2nmj4j7lrj2j%j1J0MJ2
6155b9mJ5J7LNQRJ1OJqOrlj2pj5j1nj4j1%KmJ3LJ3KK4JJ0RRJ5rqkkj8Nmj1rk4
6199c2oJ2j3jNQMkQROJ9JJ1PJkJ0qk0K0j9lj7lk0jj3pnNP%OJ6NJ0J2MJ3kOJ0N
6243D6j1qnjj1j8j1mLj3J1j8LoJ5NOJ1OJ6%Q%PLnQqj8%j0j6J1j1j8j0okOJRJ2
6285b3J1PJ1MOK3oJ3Qj3Jkj6Kpk1Nj5k0jklNkJ3NLMkJ6J0NrJ8kJPqj1j1Nj3mj1
6329a9j2oJkJ1j0OK0jJ5NRNJ2ljOjJrlj3pqj2j7Pnj0KqMJJ2QRNJ6jOJ4J7jj2M
6374C5j0njj6Mj2j0lj3jLlkJ3%J0PJ5kQNPQjlj2lrj2Npkpj3qJ6j4QnQ%J3NJJ7
6419A4NJ2Rj0Rkj3J2qk2Nj1rj7Oj0j3J8KnKJRRMRJ2%PJLNoj1%mjj1j2qNnKlNp
$$ y = [43, 31, 39, 33, 20, 2, 0, -10, -22, -19, -30, -39, -47, -40, -38, -34, -25, -7, -1, 7, 19, 27, 39, 32, 44, 48, 46, 54, 33, 21, 16, 12, -2, -19, -22, -31, -43, -44, -44, -55, -45, -41, -29, -33, -18, -1, 2, 7, 15, 24, 35, 41, 42, 34, 40, 31, 28, 16, 9, -6, -17, -22, -36, -47, -47, -45, -49, -36, -33, -20, -18, 6, 7, 17, 26, 35, 50, 41, 33, 31, 29, 11, 16, 12, 1, -8, -32, -38, -26, -39, -40, -35, -27, -23, -25, -17, -8, -2, 17, 18, 29, 36, 37, 35, 45, 37, 17, 37, 18, 15, -2, -5, -25, -26, -39, -46, -51, -46, -39, -39, -33, -17, -12, -2, 10, 14, 27, 25, 31, 41, 46, 35, 27, 22, 21, 10, -8, -19, -23, -20, -33, -22, -40, -37, -43, -28, -23, -17, -6, 0, 16, 16, 24, 24, 31, 34, 29, 37, 29, 11, 11, 1, -15, -4, -15, -33, -43, -49, -51, -45, -44, -35, -23, -12, -5, 6, 10, 16, 39, 33, 46, 54, 41, 42, 40, 24, 26, 19, -2, 3, -12, -32, -33, -35, -38, -33, -35, -22, -17, -14, -10, -12, 4, 14, 19, 10, 28, 26, 27, 34, 26, 15, 4, 9, -4, -8, -19, -31, -37, -36, -38, -27, -37, -31, -11, -12, 3, 8, 17, 22, 34, 31, 30, 36, 35, 36, 27, 24, 11, 4, -4, -16, -33, -26, -31, -41, -39, -47, -43, -42, -30, -22, -13, -8, 8, 7, 13, 27, 44, 43, 31, 35, 25, 20, 19, 3, 7, -5, -15, -18, -31, -32, -29, -32, -34, -21, -21, -11, -4, 11, 9, 17, 22, 29, 37, 36, 33, 21, 18, 9, -3, 2, -5, -7, -14, -27, -35, -19, -33, -25, -30, -22, -22, -9, -4, -3, 14, 19, 31, 40, 30, 39, 37, 24, 36, 28, 6, 11, 0, -9, -26, -20, -30, -43, -25, -23, -28, -26, -25, -16, -7, -3, 6, 18, 18, 25, 26, 29, 34, 28, 17, 17, 13, 12, 1, -11, -19, -14, -19, -17, -20, -15, -22]
6465b2%NJ1J2OP%jlJ8Lrnmnnlj2Ll3J3j5rJ7qQJ8rJ4MMJ6OMjJ2oLKrj2Oj6%nj4
6511a4nJ3j5jnJ3mmJ1nLJ0PNmJ2J9j6qknpJj8Mj0o%OMjRJNLJ1nJ8LJ1Nnl%OrK
6558C0k0j8K1j2k2J0nomLpLJ0KLJ6kNMQlJ4j1NmpmqKqmnj1mNpK0M%jJ0NJ2nJ1
6603B5k%PJj2lpnjmj3Qj1j9jOj4J7OoK2KkJ7oJ5KLpJ4Jj2q%mj2Lj1j8Jj0J2%L
6647b3lNMJ2LJ0J2n%KRj2Omo%j4Mj0j4Qj0LOrNkNNJ2NRPmJ7lkPj2%Jrj3rj6nP
6694b1mrMPj1J7MJ1NklQJJ4JKMjLmrj0rJKj3klpOjLLQMj%J0J2%nP%mnnMj4pjj6
6745b6nMpl%J5MNMPJ6J1lLKLQp%Jk9J1j3Nk0J0qj8O%qJOkJ3MJ1OjOoJ4nKKMok1
6793dPprNj0mmQmkJ2K1pkJ2KMQpPjj0J0j2j5J4j5MmrnmMj9J0pJ0QJJ0%J5KKOJ
$$ y = [-22, -22, -17, -6, 6, 12, 19, 19, 18, 15, 33, 36, 27, 22, 18, 13, 8, 5, -7, -4, -37, -24, -39, -48, -31, -39, -31, -13, -22, -8, -4, 0, 16, 22, 26, 25, 37, 31, 34, 36, 27, 15, 21, 5, 5, 0, -14, -19, -6, -21, -22, -27, -14, -18, -22, -11, -16, -13, -3, 4, 9, 5, 17, 36, 20, 12, 10, 5, -2, -1, -19, -15, -25, -31, -31, -25, -21, -22, -13, -12, -7, -4, 7, 2, 20, 23, 34, 39, 34, 31, 31, 37, 28, 30, 10, -8, 13, 1, -21, -11, -16, -22, -26, -23, -30, -27, -17, -15, -12, 4, 2, 7, 11, 19, 16, 30, 19, 24, 20, 13, 9, 1, 3, -5, -9, -14, -25, -29, -24, -31, -11, -7, -7, -8, 2, 7, 19, 14, 25, 23, 23, 30, 31, 19, 16, 9, 4, 3, -1, -14, -6, -17, -36, -37, -31, -45, -28, -22, -28, -6, -4, -6, 11, 5, 20, 22, 25, 18, 32, 33, 21, 13, 13, 9, -3, 0, -11, -29, -28, -38, -26, -26, -23, -26, -21, -17, -5, -2, 8, 20, 15, 15, 17, 26, 14, 20, 16, 10, 10, -4, 0, -10, -24, -16, -26, -23, -17, -26, -21, -23, -18, -13, -1, 4, 13, 20, 16, 33, 30, 28, 35, 23, 23, 24, 15, 2, -7, -23, -28, -21, -25, -34, -30, -23, -34, -17, -13, -2, 3, 1, -2, 6, 7, 21, 22, 24, 28, 27, 30, 26, 17, 7, -2, -1, 1, -12, -14, -17, -24, -18, -19, -16, -13, -5, -1, -2, -2, 8, 20, 20, 15, 22, 22, 18, 13, 8, 12, -2, -9, -10, -26, -31, -27, -34, -37, -37, -22, -18, -13, -9, -2, 14, 25, 22, 25, 27, 30, 38, 31, 31, 32, 3, 14, 1, 6, -14, -4, -12, -30, -24, -24, -32, -31, -25, -27, -14, -10, 1, 7, 6, 12, 6, 20, 15, 17, 19, 23, 17, -4, 3, -4, -13, -8, -18, -22, -26, -18, -22, -24, -12, 9, 2, 0, 12, 14, 18, 26, 19, 26, 25, 15, 25, 13, -2, 12, -3, 1, -3, -12, -17, -21, -17, -36, -26, -33, -23, -15, -14, -4, -4, 11, 13, 15, 21, 22]
6839B2JnkOmj2pMj2j1jJ6j5MnQJ0l%mK0jP%Mj1LJlOpmlkj5knJ0koKqJ4PjJ2PM
6887A7RnoNJ6j7Oj1j0ojrNqOqmjpMOJ0nJ2pQJ6m%OKjkJrn%jj7LKmpJ5j2KMJ0k
6936dLMOjMJ0pKj3J4j4qjnom%JKllJ0%NKRo%J1LLQkLJ1lj6PqrQj2j0%qKQj4NJ
6986a5oJ2LKOJ3qpO%%mJ0r%qmNk0mRJOmqJ1KQkJ0J1rK3j6Nj%kLj1j%j8Rj1%j0
7033b3mJJ1kPrNRNmJ7lJ0MlpKLj3%j0kLpJqNmPQmJmPM%RKlkQj2mJ2rl%j3J1nn
7084a1lo%KjLJ0k%J6LJ2nNmkjjmnJojqolnLoJ5jnLjJ6jJ0nOJoNljPj0j3jOJqM
7136f%j6J5pLPj1MJ4O%NmOj4K1j4jPj4%j4Mj3J3rJ1nqPRj4OMP%J4%lQ%LnJjr%
7183GKrkqKmJnPjR%qJ1J2olQj0RqKkjJoj4KMnJ0nj0%J3J%PjkQJ3jOj3LjJKkLj4
$$ y = [22, 23, 18, 16, 22, 18, 6, -1, 3, -9, -20, -21, -5, -20, -16, -21, -13, -3, -6, -6, -10, 10, 9, 16, 16, 20, 9, 12, 13, 10, 16, 9, 5, 2, 0, -15, -17, -22, -12, -14, -20, -18, -26, -12, -5, -6, 6, 13, 17, 26, 21, 15, 20, 36, 19, 25, 14, 4, -2, -3, -12, -7, -15, -9, -17, -21, -22, -29, -25, -19, -9, -14, -2, -9, -1, 15, 11, 11, 17, 19, 18, 16, 17, 8, 3, 3, 2, -15, -12, -10, -14, -21, -6, -18, -16, -12, -2, -4, -1, 3, 9, 8, 12, 22, 15, 17, 4, 18, 4, -4, -5, -10, -16, -20, -20, -19, -17, -20, -23, -13, -13, -8, -6, 3, -3, -3, 8, 11, 14, 22, 20, 23, 34, 31, 15, 22, 14, 5, 13, 1, -9, -9, -17, -15, -7, -21, -16, -15, -21, -9, -6, -4, 2, 15, 7, 0, 6, 6, 6, 2, 12, 3, 3, -5, -9, -4, -24, -28, -19, -18, -12, -16, -24, -13, -11, -3, -5, 5, 16, 7, 30, 14, 19, 18, 18, 16, 19, 8, 7, 7, -11, -2, -13, -13, -23, -27, -26, -15, -17, -10, -19, -14, -5, 0, -4, 13, 10, 20, 24, 21, 14, 16, 19, 6, 6, -4, -6, -3, -10, -9, -17, -12, -16, -9, -1, -5, -4, -8, -1, 3, 3, 12, 14, 11, 9, 17, 5, 1, 13, 4, 1, 1, -12, -1, -6, -11, -14, -20, -20, -18, -19, -16, -6, -8, -8, 8, 11, 23, 18, 23, 19, 17, 16, 15, 11, 6, 7, 1, 0, -8, -14, -17, -22, -19, -25, -10, -11, -16, -13, -14, 2, 1, 11, 6, 12, 13, 7, 12, 9, 8, 15, 5, -8, -9, -3, -2, -10, -6, -6, -22, -7, -14, -11, -4, -15, -11, 3, 9, 9, 14, 10, 16, 2, 23, 9, 8, 15, 1, 1, -13, -9, -22, -9, -18, -7, -12, -20, -13, -4, -18, -12, -8, -1, -1, 13, 13, 10, 18, 18, 21, 16, 17, 16, 7, 7, 9, 0, -2, -10, -8, -12, -11, -16, -9, -10, -1, -1, -9, 2, 14, 8, 5, 13, 3, 12, 4, 6, 4, 3, 4, -2, -16, -14, -10, -15, -5, -10, -20, -20, -7, -6, -6, 1, 0, -2, 6, 19, 18, 24, 11, 14, 13, 14, 16, 14, 17, 3]
7235Cmk%j8J2pKKpJ1Lj2QJ3JkJ0KJjjj5Pm%kmkj4MnJ0J8r%NKpJ1Jj0jJ2llKjQ
7283A4j4Nj4J3rnOlooLJoJ7jNJ2j8K5kJj0LN%kLmJj3Mj8jJmKLJ0%m%jpK6j4Rr
7330bJ1lLJ2j7NnMj5jkKlJ0j2%lJ3JNQjJ3j4J1pjkQJmoJj0llj0Qj%j3OJ3rJLJ
7377gJ5jlJ1%mO%Opj0kPppLq%jLMj6J9rJ6oNJ4ooNNlj1jJj4Lj3J6lj0o%OpJ4l
7425a2OmJ6MjLmOJ2Kj1Mj2LJm%lnnnOrmJ3lqQLJ0nj0K4PrmJKpKJj5k%KJjpKNj
7476gKJPLjNJ0p%jkP%omJknqlNj1OrQMqLPjJ0Q%jlMLMojkmkQj1J2j6j5J6kMJJ
7529BLmMPjJj0mJ0%LojL%j0pmPmqJ1J0j2MO%LJ1j0KkJ4rJ0qMkKj6loNmoJLnKJ3
7579arJ0j0kJ4okOj%PmLL%j0%JLj0lJ3prJ3pkNJNMKMJ0mjj3J1nmPpJj0j3J0%r
$$ y = [3, -1, -3, -3, -21, -9, -16, -14, -12, -19, -8, -5, -17, -9, 4, 5, 3, 13, 15, 16, 15, 14, -1, 6, 2, 2, 0, -4, -6, -20, -16, -21, -11, 7, -2, -2, 3, 5, -2, 9, 10, 0, -1, 11, 8, 5, 7, 6, 14, 0, 5, -9, 4, -5, -10, -4, -7, -13, -19, -16, -15, -21, -4, -5, 0, 12, -6, 19, 17, 18, 8, 11, 16, 16, 14, 17, 13, 14, 1, 5, -13, -14, -13, -17, -15, -12, -2, -2, -6, -6, -7, -14, 12, -2, 7, -2, 9, 6, 9, 21, 4, 9, 4, 8, -7, -8, -10, -8, -11, -1, -13, -13, -16, -3, -2, 3, 11, 10, 23, 9, 20, 13, 12, 10, 18, 19, 15, 9, 10, 0, -3, -6, -16, -8, -9, -9, -22, -16, -3, -12, -11, -8, -7, 8, 7, 4, 15, 15, 11, 17, 17, 23, 16, 6, 4, 11, 4, -3, 0, -8, -8, -9, -6, -2, -18, 1, -8, 8, 2, 7, 21, 15, 9, 14, 19, 16, 5, 4, 5, -9, -6, -19, -3, -6, -16, -22, -22, -16, -23, -9, -12, -6, -10, 6, 10, 9, 12, 8, 14, 26, 28, 17, 21, 9, 12, 13, 9, 9, 6, 1, -4, -9, -3, -12, -16, -3, -6, -14, -6, -3, 7, 2, -8, 16, 23, 14, 10, 11, 13, 6, 8, 9, -6, -8, -8, -6, -5, -6, -13, -11, -6, -7, -5, -4, 3, 6, 5, 10, 20, 13, 13, 12, 10, 17, 17, 11, 7, 8, 6, 1, -7, -10, -5, -16, -10, -19, -11, -7, -15, -12, -5, -6, 4, 12, 12, 11, 8, 12, 15, 19, 13, 12, 10, 6, 4, 12, 1, 13, -3, -18, -2, -4, 0, 1, 2, 5, 1, 5, 12, 11, 12, 2, -2, 8, 8, 11, 5, 4, 7, 7, -3, -10, -14, -7, -11, -19, -8, 2, -10, -6, 0, 0, 3, 14, 4, 6, 4, 18, 9, 19, 11, 15, 13, 15, -1, -4, -10, -5, -9, -15, -14, -11, -16, -14, -1, -10, 0, -10, -12, 2, -4, -6, 0, -1, -1, 6, 2, 5, 8, 8, -2, -2, -1, 2, -8, -11, 2, -5, -14, -1, -8, -10, -5, -4, 1, 5, 7, 11, 21, 17, 16, 3, 14, 9, 5, 12, 5, 6, -4, -17, -7, -7, -16]
7627a6jkMjMJjPLMJJ1lPlMj2jLJkpmPj0J0j1Oj1J0j2ONKN%J4j1LJ0j1jJMqjlK
7675Cqj4QmnNNNpJ6LqMPNJPKLj3PorONj2jj0pK%Op%lMjQjJ0kJLJJ1kjj6Pklnj
7728ckJJnPJqrJ1J7qlRKJJ8oj1jMkpJmj3Mn%Ok5jJ2OKlJ5MkOPjKOrLlKmrJ1j2
7779CrjNj7L%OMKKkjKOnJ5moJ%KMj1Qlqj0LojjKRKNNL%J2rRqRLj7NOoMpk1Rqr
7833b1J6rllJ%MJ4okJ3nJ1Oj8RQJlnQj8Nj1OnkoOJ1r%J2jLlPNNlml%Qj8OJrlk
7883f%rj3L%ROlMQnMJ0J%MjLpJ4j7NLj0lmkkJKrMjKjJJ1%MlOloMJ0j0JJ%j4J2
7934Dpj1oJ1%Mjj0J2mJN%J0%RlLlOKnpqQj8kNj2LjloKKQpK3%QpRqPnjJ3j9J0j1
7984@J0Jnplj0OkjOKpJ8klLjjJ6pl%noKj2nQj2J2p%mj0K2j3JJ3nJ0LMMJ3Jkj5
$$ y = [-16, -17, -19, -15, -16, -12, -11, -12, -5, -2, 2, 3, 14, 11, 18, 15, 19, 7, 6, 9, 10, 8, 1, -3, 4, -6, 4, -7, -1, -12, -2, -14, -8, -3, -1, 4, 4, 18, 7, 10, 20, 9, 8, 9, 13, 5, 4, 1, 3, -5, -19, -11, -15, -20, -15, -10, -5, -12, 4, 7, -1, 3, 10, 15, 16, 23, 25, 28, 15, 22, 16, 7, 13, 18, 6, 5, -5, -12, -10, -10, -4, -11, -11, -14, -10, -11, -3, -4, 6, 4, 5, 8, 9, 20, 18, 17, 1, 8, 6, 3, -2, -3, -5, -4, -3, -8, -1, 0, -8, -17, -6, 11, 3, 0, 9, 11, 12, 30, 24, 13, 12, 16, 14, 7, 8, 4, -9, -5, -10, -10, -4, -29, -30, -18, -12, -10, -13, 2, 6, 4, 10, 17, 16, 18, 24, 15, 18, 15, 17, 13, 4, 15, 3, -6, -7, -2, -19, -16, -16, -10, -6, -4, -2, -4, -5, -3, 3, -2, 13, 9, 3, 4, 4, 6, 10, -1, 7, 4, -4, -14, -11, -17, -18, -19, -17, -8, -6, -1, 4, 7, 7, 19, 10, 19, 11, 20, 23, 6, 11, 17, 11, 15, 8, -13, -4, -12, -21, -5, -14, -17, -20, -19, -19, -15, -1, -7, -9, 4, -1, 10, 16, -2, 7, 15, 16, 13, 8, 16, -2, 3, -8, -2, -7, -9, -15, -9, 2, -7, -7, 5, 4, 7, 4, 11, 16, 21, 18, 14, 11, 11, 19, 1, 7, 8, -1, -4, -6, -6, -15, -28, -25, -25, -16, -10, -13, -9, -1, -6, -2, 8, 9, 9, 13, 12, 15, 8, 22, 5, 10, 13, 3, 0, -4, -6, -8, -7, -5, -14, -10, -11, -9, -10, -9, 2, 2, 6, 3, 9, 6, 0, 4, 14, 4, 5, 6, 6, -8, 4, -3, -14, -20, -9, -9, -5, -6, -16, -4, -8, -7, -2, -2, 8, 8, 17, 14, 17, 14, 20, 22, 17, 10, 2, 10, -8, -10, -5, -17, -14, -15, -18, -24, -22, -20, -12, -19, 4, 4, 12, 5, 14, 6, 13, 8, 7, 20, 1, 11, 0, 10, 11, 6, -1, -4, -14, -8, -10, -11, -5, -3, -10, 8, 6, 3, 6, 5, 4, 20, 13, 10, 10, 5, -1, 1, -11, -16, -8, -20, -8, -15, -15, -19, -29, -7, -20, -19, -6, -11, -1, 2, 6, 10, 23, 24, 22, 7]
8031GQMKMk3K0k1qKkp%KLmLRoLMnPQKnJnPjJkroQoj5RmJ2pjJ1nLNJ3KjjjK%qK
8085A1oJ0j8J0kj6KlJqjKpPKJ1LMJlOJ%QlKmmJ0qolMr%qmROmJJ1OLj3NL%LJoM
8137A1oj2QlknOnrJ1nnLL%NmJ3LORlj2LJ6j7%mlmkopNkq%lNPRmOJnJ4nOOj1Ro
8189GJj1
$$ y = [7, 15, 19, 21, 25, 2, 22, 1, -7, -5, -7, -14, -14, -12, -9, -13, -10, -1, -7, -4, 0, -5, 2, 10, 12, 7, 8, 3, 10, 9, 10, 8, -1, -7, 1, -5, -20, -11, -15, -3, -10, -11, 0, -5, -2, 3, 16, 18, 17, 16, 15, 17, 17, 9, 11, 5, 15, -3, 7, 5, -11, -9, -12, -11, -19, -20, -18, -25, -18, -16, -5, -2, 2, 3, 0, 6, 7, 7, 15, 12, 14, 10, 6, 16, 8, 2, -1, 3, -6, -6, -14, -18, -9, -3, -7, -6, 5, 11, 14, 1, 6, 9, 9, 12, 13, 7, 11, 5, -7, 1, -2, -4, -9, -3, -8, -17, -6, -11, -16, -13, -10, -10, -5, -9, 4, 7, 13, 22, 19, 7, 10, 26, 9, 9, 5, 2, -2, -4, -10, -17, -12, -14, -22, -22, -25, -20, -13, -4, -8, -2, -1, -6, 8, 3, 9, 15, 4, 13, 7, 8, -3]
8191c
$$ Imaginary data points
##PAGE= N=2
##DATA TABLE= (X++(I..I)), XYDATA
0@%%%%%%%%%%%qJ6j6J6k3L1l2M0m8N6p2Q0q8J12j36J52j76K08k40K72l04L44l92
34b08M47n06N67o36P12p95Q86r85J092j211J339j481J636j802J986k189K413k659
52a394K931l232L572l954M383m875N444o112O910p879R090j0652J2755j5761K0437
67A1663k8801M8433j82933j78814J12761J0043J10320Q2896P2850O1363P7499
78A97280J7339K3290O763j3801l4607k0707m4065m2369l9014l5902m4660k9681
90f0134l1535k8831k3841j3283j3829j348P234J6071K3414L5712L9250M4515M6087
103C9482M5007L8257L2168K1087R506l203j4632k6232l4546m1179m4145m4637
115b3067m1892l6820k9277k0901j1109j177Q174J6713K4434L0040L3972L6430
$$ y = [0, 0, 0, 0, 0, 0, 0, 0, 0, 0, 0, 0, -8, 8, -8, 8, -15, 16, -16, 24, -24, 32, -40, 40, -48, 64, -72, 80, -96, 112, -128, 144, -160, 184, -208, 239, -267, 300, -336, 376, -419, 467, -518, 574, -637, 702, -779, 857, -945, 1041, -1148, 1265, -1394, 1537, -1695, 1877, -2077, 2306, -2569, 2875, -3237, 3673, -4206, 4884, -5768, 6987, -8774, 11663, -17138, 31295, -151638, -330452, -217691, -207648, -97328, -14432, 58418, 119781, 197280, 214619, 237909, 244672, 230871, 196264, 175557, 131492, 89123, 50109, 14207, -30453, -60134, -91669, -120500, -144341, -157624, -171453, -172801, -165567, -149496, -126082, -90370, -51120, -6605, 39482, 84489, 122746, 154914, 176001, 185507, 182304, 167672, 141440, 106894, 65715, 21570, -23067, -64959, -101779, -131056, -151957, -163066, -164243, -156069, -139356, -114922, -84882, -50910, -14480]
127a4480L6482L4589L1382K6324J9598J2347M431m205j2257j9513k6194l1179
139E7325l4164l5438l4829l1794k7141k1046j3410n190L096J1293J8822K4964
151h7512K9639L2678L3534L2541K9869K5395J9498J2719N326k349r656j6312k2036
164H3334k6373k9126l0222k9663k7350k3585j8519j2399n691J241Q038J4278J9562
177g6475K3671K6387K7402K6878K4836K1299J6602J0987M832j517p666j3273j8016
190F5947k1629k3917k4758k4193k2250j8964j4711r590l966J827P433J2606J6987
203e9178K0380K2598K3397K2954K1189J8156J4074R208L807j799p298j2369j6694
216E8425k0068k2236k3060k2637k0869j7890j3885r118l834J623O944J1833J5965
$$ y = [-14480, 22002, 56591, 87973, 114297, 133895, 146242, 150673, 146468, 134211, 114698, 88504, 57325, 23161, -12277, -47106, -78900, -106041, -127087, -140497, -145687, -142591, -131298, -112476, -87512, -57873, -25195, 8339, 40880, 70749, 96144, 115642, 128361, 133687, 131338, 121682, 105370, 83334, 56961, 27835, -2387, -32050, -59400, -82985, -101504, -113903, -119594, -118353, -110315, -96037, -76475, -52804, -26417, 985, 27863, 52699, 73998, 90600, 101587, 106419, 104902, 97236, 83963, 65947, 44318, 20401, -4357, -28550, -50800, -69764, -84475, -94065, -98031, -96204, -88771, -76165, -59178, -38798, -16200, 7197, 30151, 51340, 69496, 83570, 92778, 96585, 94786, 87488, 75119, 58425, 38357, 16121, -6939, -29576, -50445, -68335, -82220, -91338, -95172, -93549, -86605, -74772, -58807]
229e8807J9136K1206K1974K1539J9904J7110J3398Q951M073r48n886j0395j4277
242E6978j7272j9304k0151j9879j8561j6156j2861q871m449K02M791R062J2802
255e3669J5754J7782J8780J8662J7541J5341J2297Q536M314j46m569q684j2263
268D9676j5105j7036j7889j7726j6552j4359j1347p684l600O61M820Q691J1981
281d5469J4534J6259J6887J6635J5423J3259J0394O923L123q65m736q293j1376
294D2698j3727j5364j5996j5775j4714j2755j0103o849l269N10M245P717J0780
307d2602J3175J4859J5624J5514J4603J2768J0252P097L583j33l826p292j0335
320D3287j2721j4412j5174j5117j4209j2466r999o979l605m4L463O721R566J1811
$$ y = [-58807, -39671, -18465, 3509, 25048, 44952, 62062, 75460, 84411, 88484, 87536, 81650, 71255, 56978, 39706, 20402, 251, -19628, -38189, -54345, -67206, -76077, -80526, -80324, -75533, -66471, -53669, -37915, -20133, -1353, 17309, 34850, 50191, 62488, 71024, 75338, 75192, 70623, 61939, 49676, 34571, 17535, -354, -18080, -34632, -48991, -60338, -68022, -71622, -70961, -66141, -57450, -45469, -30935, -14676, 2211, 18846, 34269, 47528, 57922, 64845, 67968, 67103, 62367, 54074, 42698, 28971, 13607, -2389, -18164, -32878, -45633, -55736, -62585, -65854, -65344, -61099, -53382, -42602, -29427, -14568, 1056, 16570, 31173, 43941, 54193, 61290, 64873, 64740, 60914, 53622, 43287, 30566, 16154, 980, -14137, -28346, -40812, -50811, -57790, -61395, -61439, -57976, -51255, -41689, -29878]
334b9878J3353J4061J3949J3159J1513R272O509L454K17k983n979q566j0645j2129
348A5307j2821j2785j2120j0703q656o177l349k99K709N570Q080J0118J1574J2307
362a245J2337J1709J0329Q383N886L114J16k867n663q142j0112j1507j2149j2100
376a1911j1411r989p991n558k801J10K966N637P949R785J1041J1601J1526J0816
390B1770R486P613N327K752P0k607n106p299r045j0298j0916j0924j0357r193
404b8727p504n401k980m29K173M614O784Q592R881J0593J0643J0176R084P444
418C4943N376L014M72k088m506o631q379r627j0264j0268r774q640p025m994k717
433d1108k78K133M370O355P936R026R578R546R030P967O463M587K484K52j984
$$ y = [-29878, -16525, -2464, 11485, 24644, 36157, 45429, 51938, 55392, 55609, 52626, 46647, 38081, 27436, 15307, 2486, -10299, -22419, -33122, -41778, -47955, -51304, -51603, -48894, -43324, -35244, -25126, -13552, -1245, 11092, 22801, 33130, 41513, 47399, 50513, 50629, 47762, 42099, 33957, 23845, 12338, 189, -11911, -23322, -33311, -41302, -46860, -49661, -49551, -46585, -40948, -32999, -23214, -12173, -572, 10954, 21770, 31256, 38869, 44196, 46948, 47018, 44411, 39305, 32006, 22961, 12663, 1747, -9177, -19534, -28727, -36231, -41632, -44612, -45041, -42868, -38254, -31470, -22878, -12997, -2404, 8239, 18415, 27499, 34943, 40319, 43333, 43805, 41717, 37211, 30580, 22201, 12574, 2310, -7958, -17732, -26372, -33397, -38391, -41108, -41386, -39253, -34883, -28528, -20592, -11566, -1988, 7558, 16588, 24555, 31018, 35605, 38089, 38341, 36357]
448C6357m048n887p401q448q991r010q596p641o238m498k476l24J836L917N759
463b5689P270Q345Q932R000Q593P650O227M482K434K67j912m006n820p315q360
478A0098q879q886q418p469o032m289k310j95J889L831N549O920P886Q346Q340
493F381P907P000N706M120K289L79j573l376m986o323p257p786p824p522o720
508a9585n576m075k360n22J355L133M744O095P053P587P688P382O597N453L947
523B8916K236L85j467l217m810o065o975p443p456p081o293n095l629j974k05
538c0173J524L184M618N763O580O972O977O602N871M779L455J904K92j346k868
553B4134m241n371o167o605o675o394n756m724l490k023m14J162K749M105N261
$$ y = [36357, 32309, 26422, 19021, 10573, 1582, -7428, -16024, -23665, -29903, -34401, -36877, -37201, -35365, -31448, -25689, -18419, -10074, -1142, 7858, 16451, 24101, 30328, 34810, 37244, 37511, 35599, 31593, 25773, 18458, 10098, 1219, -7667, -16085, -23554, -29586, -33875, -36185, -36380, -34491, -30660, -25111, -18191, -10305, -1959, 6381, 14288, 21288, 26994, 31114, 33403, 33782, 32209, 28833, 23847, 17524, 10267, 2481, -5343, -12865, -19585, -25161, -29236, -31596, -32118, -30763, -27630, -22886, -16791, -9738, -2151, 5537, 12919, 19516, 24969, 28916, 31152, 31537, 30070, 26853, 22043, 15978, 9003, 1560, -5896, -12977, -19270, -24365, -27994, -29968, -30173, -28649, -25465, -20847, -15084, -8504, -1532, 5445, 12047, 17918, 22697, 26152, 28056, 28348, 27002, 24134, 19893, 14522, 8355, 1750, -4925, -11319, -17075, -21799, -25289, -27312, -27726, -26564, -23815, -19710, -14449]
568a4449O124O579O666O399N751M735L465J972L84j226k771m125n223o039o434
583A808o474o140n501m476l231j828l05J210K621L862M877N579N935N969N683
598I589N080M159L049J752L81j005k317l499m479n177n577n649n411m913m083
613a8100l004j766m09R56K259L467M461N179N571N674N431M875M016K906J641
628B3157K71j108k418l570m523n190n512n547n246m679l794k725j497j92J102
643b1471K301L392M243M837N157N177M922M394L640K651J515L60q66k014l045
658A5193l884m525m880m954m777m321l624k685j605m45P67J921K972L847M493
673f507M841M939M722M282L531K588J480L23q75k002l022l833m409m700m730m470
$$ y = [-14449, -8325, -1746, 4920, 11319, 17070, 21805, 25270, 27242, 27626, 26400, 23629, 19504, 14281, 8242, 1808, -4666, -10806, -16307, -20783, -24014, -25842, -26147, -24937, -22316, -18454, -13577, -7998, -2063, 3906, 9589, 14669, 18828, 21877, 23629, 24010, 23005, 20688, 17189, 12710, 7533, 1956, -3693, -9104, -14017, -18100, -21104, -22870, -23279, -22323, -20064, -16597, -12136, -6957, -1386, 4288, 9719, 14594, 18610, 21516, 23157, 23428, 22320, 19902, 16332, 11809, 6619, 1107, -4440, -9686, -14365, -18159, -20884, -22381, -22573, -21471, -19170, -15778, -11535, -6698, -1541, 3636, 8558, 12952, 16592, 19243, 20758, 21118, 20252, 18238, 15193, 11309, 6784, 1904, -3050, -7827, -12148, -15772, -18457, -20062, -20507, -19740, -17819, -14847, -11000, -6507, -1666, 3273, 7995, 12277, 15808, 18396, 19876, 20199, 19324, 17322, 14300, 10467, 6058, 1358, -3372, -7842]
689g842m013l258k361j303k17Q99J921K825L541M085M314M373M145L733L039K243
705A6124J325K77p34j713k586l304l847m124m239m052l687l067k266j366l42O84
721a6917J715K569L338L891M188M285M056L693L043K219J283K57p73j747k610
736A2490l306l804m035m098l860l477k838k054j170k58P05J573K346K988L439
751e359L649L733L526L209K668J965J204L36n27j349k099k716l206l432l580l398
767e376l107k630j952j171l14N31J386K136K803L237L498L587L396L074K515J829
783A3442J028J48o81j525k238k831l228l392l469l227k896k344j677r28j37O74
799a3281J419K051K610K964L140L238L015K725K285J675R95K53m82j205j858k398
$$ y = [-7842, -11855, -15113, -17474, -18777, -18994, -18095, -16174, -13349, -9808, -5723, -1409, 2964, 7109, 10842, 13881, 16124, 17449, 17726, 16992, 15279, 12693, 9389, 5542, 1418, -2821, -6873, -10560, -13627, -15893, -17259, -17601, -16917, -15202, -12633, -9295, -5404, -1216, 3069, 7125, 10818, 13861, 16080, 17363, 17620, 16847, 15100, 12490, 9184, 5380, 1345, -2753, -6613, -10090, -12928, -14982, -16152, -16410, -15705, -14132, -11786, -8798, -5359, -1710, 2023, 5549, 8758, 11426, 13391, 14595, 14931, 14404, 13055, 10956, 8240, 5034, 1602, -1978, -5376, -8483, -11113, -13065, -14236, -14550, -14019, -12633, -10497, -7694, -4457, -959, 2628, 6024, 9098, 11613, 13442, 14470, 14618, 13937, 12412, 10174, 7343, 4115, 723, -2746, -5973, -8869, -11213, -12890, -13818, -13955, -13281, -11862, -9811, -7201, -4237, -1097, 2141, 5156, 7881, 10166, 11841, 12836, 13089, 12607, 11402, 9544, 7146]
815G146k813l005l140k990k726k310j716j038k96M76J192J874K438K816L033L152
831B093K957K663K220J593R04J79n75j281j905k413k720k902k957k745k430k002
847i321j438p76j04N65J190J760K206K480K661K720K544K266J898J388P89J48
863A0976m89j093j650k112k434k618k724k548k308j946j397q07j25N30J169J748
879g828K244K532K738K818K582K338J907J362P12N6n87j252j765k215k480k626
895E36k667k452k192j791j275p11r4M86J065J564J938K217K371K429K291K045
911E760J712J278P64K04l61r07j401j813k093k283k376k240k014j699j247p32
927i448j30M29J008J500J898K172K352K385K202J969J595J119N66Jn86j108j568
$$ y = [7146, 4333, 1328, -1812, -4802, -7528, -9838, -11554, -12592, -12888, -12412, -11220, -9346, -6908, -4092, -1059, 2093, 5050, 7713, 9933, 11526, 12430, 12609, 12034, 10753, 8848, 6435, 3715, 813, -2144, -4889, -7319, -9321, -10759, -11535, -11639, -11074, -9884, -8124, -5918, -3438, -777, 1943, 4487, 6753, 8651, 10039, 10828, 10976, 10487, 9394, 7744, 5632, 3198, 580, -2144, -4692, -7000, -8946, -10343, -11150, -11275, -10745, -9576, -7828, -5584, -3052, -314, 2504, 5086, 7424, 9331, 10693, 11405, 11461, 10874, 9622, 7857, 5642, 3162, 536, -2131, -4583, -6775, -8566, -9841, -10552, -10646, -10160, -9095, -7531, -5593, -3376, -1005, 1424, 3715, 5760, 7472, 8750, 9514, 9718, 9357, 8450, 7049, 5236, 3143, 860, -1516, -3756, -5770, -7469, -8716, -9448, -9578, -9149, -8141, -6641, -4743, -2571, -219, 2166, 4368, 6337, 7932, 9051, 9617, 9618, 9032, 7924, 6356]
944F356j926k130k277k288k084j820j487j015n38RN33J022J427J771J963K130
960c54K169K011J778J485J078O32J00m14q89j317j689j930k129k187k052j830
976e538j547j131o55j22M14R32J366J746J988K135K197K031J770J483J043N48
992H660M3m70r35j354j673j866j993k005j859j594j319r29m94n6M05Q36J189J503
1010c911J662J813J843J740J512J252R18N06Q0l79p84j169j474j697j845j882
1026a815j762j542j286q97m72QM69R18J314J613J796J957J944J783J539J246Q38
1043G651M04q1n39r41j324j575j751j873j858j698j445j198q22m30mM13P83J153
1061e135J381J566J701J718J644J415J188Q75N12J00k88p09j037j324j518j691
$$ y = [6356, 4430, 2300, 23, -2265, -4349, -6169, -7656, -8671, -9209, -9200, -8667, -7645, -6218, -4447, -2484, -354, 1815, 3826, 5604, 7089, 8167, 8799, 8899, 8485, 7596, 6279, 4590, 2660, 531, -1656, -3708, -5538, -7085, -8216, -8871, -8993, -8579, -7647, -6281, -4535, -2547, -412, 1785, 3816, 5586, 7069, 8112, 8660, 8703, 8233, 7298, 5944, 4271, 2405, 412, -1593, -3452, -5046, -6365, -7294, -7788, -7844, -7439, -6603, -5414, -3911, -2249, -436, 1407, 3147, 4659, 5911, 6829, 7335, 7415, 7036, 6252, 5083, 3609, 1912, 67, -1815, -3577, -5119, -6405, -7302, -7774, -7766, -7297, -6379, -5065, -3452, -1656, 301, 2245, 4028, 5567, 6813, 7651, 8055, 7974, 7435, 6494, 5170, 3595, 1844, -29, -1887, -3585, -5030, -6228, -7050, -7480, -7484, -7071, -6288, -5135, -3754, -2188, -487, 1231, 2875, 4290, 5478, 6353, 6865, 6965, 6677, 5968, 4931, 3607, 2089, 398]
1077C98j710j634j404j168q47m66l6L90P66J149J382J582J698J678J572J313J064
1094E727P10L33r0m73q42j145j347j514j608j576j425j208r61o40l02P6M31P50
1112e104J042J242J416J508J502J393J208R68P04L54%l89p17j027j251j437j580
1129a68j549j462j253j027p03l51M6M44P69J122J308J493J614J550J444J197R46
1146E420O51K80q9m50p70j043j229j365j458j417j291j117q43n97k90K6L47O47
1164d588Q86J056J237J297J322J210J076Q38N96L11j2l26o32q68j078j250j353
1181b78j322j247j059q06n58k34J09M32P53R72J182J336J393J337J221R89P58
1198D978M81J55j63m82p64r76j126j279j309j258j154r57p21m93k03Q3L73O52
$$ y = [398, -1312, -2946, -4350, -5518, -6365, -6831, -6867, -6477, -5711, -4562, -3180, -1598, 100, 1778, 3350, 4663, 5727, 6437, 6770, 6680, 6207, 5365, 4220, 2873, 1359, -249, -1825, -3250, -4458, -5419, -6059, -6361, -6285, -5854, -5104, -4062, -2820, -1404, 104, 1606, 2999, 4207, 5175, 5879, 6233, 6233, 5844, 5127, 4100, 2849, 1412, -168, -1717, -3179, -4432, -5459, -6162, -6513, -6467, -6023, -5254, -4132, -2824, -1331, 283, 1833, 3277, 4474, 5420, 6071, 6351, 6262, 5812, 5042, 3999, 2770, 1405, -53, -1470, -2761, -3878, -4721, -5318, -5608, -5582, -5235, -4588, -3702, -2646, -1409, -112, 1210, 2420, 3496, 4334, 4930, 5241, 5229, 4903, 4271, 3403, 2325, 1075, -278, -1600, -2847, -3906, -4712, -5270, -5504, -5395, -4963, -4210, -3238, -2056, -720, 673, 2010, 3231, 4220, 4978, 5459, 5614, 5451, 4969, 4205, 3229, 2103, 824, -485, -1743, -2897, -3854, -4575, -5068, -5271, -5188, -4815, -4163]
1216d163Q49J020J165J229J236J138R97P53N66K76j7l25o05q23j011j186j269
1233a70j257j172j007p75n27k31O7L82O71Q75J079J202J256J229J115R32O85M33
1251D787J65j15m23o52q25r97j113j153j118r98q64o30m10j72Q8L45N47P39R28
1270a871J025J080J091R92Q68O72M24J93o2l32n74p81r53j098j161j144j029q91
1288c551o60m17j62J40M02O56Q56J029J139J187J127J019Q65O12L66J35j49l90
1306D204o23p78r55j039j081j047r65q00o43l96j50M0K89M79O78Q37R40J010J007
1325A007R26Q19O59M64K12m6k66m66o82q63r66j033j019r41q13o20m16j22J11
1344d055L51N44P49Q98R99J031R92Q64P47N59L29P4j54l54n34o99q41r21r55r04
$$ y = [-4163, -3314, -2294, -1129, 100, 1336, 2474, 3471, 4224, 4790, 5066, 5049, 4724, 4119, 3296, 2285, 1099, -170, -1427, -2599, -3606, -4381, -4908, -5139, -5072, -4690, -4019, -3144, -2065, -863, 393, 1622, 2737, 3669, 4354, 4787, 4952, 4837, 4414, 3762, 2937, 1940, 827, -326, -1444, -2442, -3306, -3936, -4346, -4518, -4430, -4085, -3538, -2799, -1871, -846, 234, 1325, 2317, 3185, 3857, 4281, 4474, 4412, 4080, 3506, 2725, 1772, 674, -487, -1631, -2660, -3551, -4211, -4628, -4790, -4650, -4248, -3592, -2736, -1707, -568, 619, 1746, 2765, 3630, 4242, 4608, 4743, 4594, 4204, 3581, 2803, 1848, 809, -272, -1319, -2284, -3084, -3727, -4123, -4273, -4233, -3944, -3465, -2787, -1950, -1010, 0, 1007, 1933, 2752, 3411, 3875, 4087, 4041, 3775, 3309, 2627, 1764, 798, -235, -1254, -2195, -3008, -3628, -4044, -4166, -4055, -3704, -3160, -2411, -1513, -514, 517, 1509, 2373, 3120, 3679, 4008, 4082, 3928, 3574, 3040, 2341, 1500, 579, -376, -1280]
1364a280q27p06n51l50j43O3K90M69O46P79Q65R37R19Q53P40N79M07J83m4k74
1384C555m75o75q17r31r75r69q88p53n77l82j39J00L30N29O94Q62R15R59R26Q42
1404B131O96N42L39J28q5l12m66o35p60q23q57q35p89o49n22l65j70K0K06L98
1424b808N47O71P80Q25Q21P70O78N43L82J83l0k12m44o03p25q22q80q64p84o76
1444b648n19l19j12R9L23M95O61P67Q41Q84Q46P44O36M72K85J05j06k80m58n96
1464B120p19p71q10p92p11o28n01l40j72L7J95L75N28O40P35P96P99P43O47N31
1484B702L71J82pk01l86n50o83p67q23q22p39o40n00l21j23P6K49M56N77P06P44
1505d99P94P51O85N76M31K87R4p7k43l89n17o11o82p08o92o47n55m31l07j49K1
$$ y = [-1280, -2107, -2813, -3364, -3714, -3857, -3794, -3504, -3035, -2389, -1610, -745, 192, 1111, 1964, 2704, 3283, 3690, 3873, 3829, 3555, 3080, 2405, 1588, 657, -318, -1287, -2175, -2928, -3505, -3887, -4026, -3926, -3596, -3067, -2373, -1511, -596, 363, 1289, 2131, 2827, 3369, 3708, 3836, 3751, 3439, 2973, 2338, 1578, 755, -102, -937, -1726, -2375, -2897, -3262, -3432, -3412, -3206, -2808, -2261, -1590, -810, 15, 836, 1606, 2284, 2827, 3209, 3392, 3362, 3150, 2706, 2103, 1378, 556, -324, -1188, -1972, -2648, -3167, -3486, -3598, -3499, -3176, -2681, -2020, -1253, -412, 472, 1318, 2062, 2698, 3170, 3455, 3560, 3454, 3174, 2716, 2120, 1401, 630, -180, -972, -1683, -2311, -2812, -3152, -3324, -3287, -3092, -2717, -2189, -1549, -814, -18, 781, 1524, 2171, 2702, 3073, 3255, 3248, 3047, 2661, 2111, 1428, 661, -162, -984, -1723, -2363, -2863, -3184, -3307, -3231, -2982, -2526, -1949, -1243, -499, 295, 1046, 1731, 2307, 2738, 3025, 3119, 3042, 2799, 2410, 1893, 1282, 600, -108, -800, -1447, -2002, -2433, -2740, -2889, -2868]
1526b868J90L25M75N77O61P12P04O60N87M58L21J42l0k08l86n23o35p14p43p38
1546a033o78n58m44k71r6R1K69M12N54O42P04P29O89O40N10M13K44J09o3k24l46
1567B293m85n58o21o38o66n88n21m01k93j55OJ41K89M14N14N98O42O21O17N19
1587A728M32K98J44j3j89l24m57n56o27o70o45n93m96l74k33p8Q0K34L76M75N70
1608i18O18O27O07N42M57L34K07O6o6j91l29m24n04n53n79n70n24m55l65k53j29
1629b402J3J48K70L98M83N58N93N84N52M80L94K60J12k5j78l19m35n26n84o25
1649b49o01n29m66l42k12p7Q7K15L31M39N07N64N81N43N02M01L14K06N7m9j73
1670B049k60l77m46m92n21m97m66m17l18k28j16J0J28K37L58M29M83N28N19M91
$$ y = [-2868, -2678, -2353, -1878, -1301, -640, 72, 776, 1436, 2023, 2481, 2802, 2944, 2914, 2706, 2320, 1797, 1162, 448, -295, -1033, -1711, -2269, -2713, -2984, -3080, -2989, -2720, -2308, -1754, -1112, -408, 321, 1010, 1650, 2160, 2573, 2817, 2926, 2863, 2639, 2293, 1808, 1250, 629, -9, -675, -1263, -1784, -2185, -2478, -2633, -2627, -2486, -2197, -1783, -1269, -671, -29, 592, 1209, 1728, 2160, 2458, 2602, 2589, 2400, 2076, 1619, 1063, 436, -234, -879, -1472, -1968, -2342, -2575, -2653, -2573, -2339, -1963, -1488, -918, -300, 327, 934, 1476, 1933, 2267, 2474, 2540, 2474, 2283, 1954, 1530, 1026, 473, -106, -676, -1200, -1655, -2020, -2273, -2402, -2389, -2241, -1971, -1573, -1090, -532, 61, 645, 1197, 1677, 2071, 2331, 2443, 2418, 2240, 1921, 1486, 960, 376, -249, -850, -1379, -1845, -2187, -2399, -2476, -2389, -2174, -1843, -1404, -897, -333, 248, 791, 1293, 1694, 2008, 2214, 2271, 2222, 2049, 1789, 1412, 966, 474, -47, -544, -1010, -1427, -1745, -1973, -2089, -2079, -1951, -1714, -1356, -927, -444, 84, 603, 1094]
1690A094M17L22K15Q1m7j74l08l91m69n44n51n28m71l84k73j64m5J10K15L25M24
1711a146M69N16N05M90M39L52K63J68N3p9j67k63l47l93m57m95m65m14l94k83
1731a648k10q2LJ25K34L35M02M47M89M75M44L72K82J98P6m8j69k84l64m23m80
1752A74m95m70m04l39k46j21k9J02J97K91L69M24M36M59M29L58L14K13J22M3p6
1773A751j69k40l16l70m05m15m04l69l25k47j60p3L5J35K22L10L76M24M44M36
1793F40L85L34K44J65M8o9j89k62l54m09m51m49m34l65l05k31j02j3R9J83K66
1814a269L45L91M23M11L83L50K71K12J18N7p1j39k12k89l30l67l82l75l52l01
1834a126k18j64o4K6J08K09K86L58L65M17L85L59K99K14J35K9n5j77k48l23l75
$$ y = [1094, 1511, 1833, 2048, 2129, 2082, 1908, 1600, 1209, 740, 196, -355, -883, -1354, -1738, -2011, -2175, -2220, -2110, -1895, -1570, -1146, -677, -161, 344, 834, 1273, 1625, 1888, 2056, 2109, 2030, 1863, 1600, 1253, 860, 403, -92, -557, -971, -1365, -1648, -1858, -1940, -1937, -1812, -1578, -1243, -841, -394, 95, 570, 1014, 1386, 1668, 1866, 1942, 1894, 1725, 1441, 1077, 654, 174, -321, -791, -1195, -1534, -1780, -1901, -1930, -1828, -1631, -1340, -971, -547, -111, 348, 777, 1135, 1449, 1662, 1784, 1827, 1751, 1582, 1342, 1026, 656, 251, -164, -568, -937, -1262, -1509, -1669, -1742, -1707, -1572, -1350, -1040, -664, -240, 204, 640, 1025, 1359, 1603, 1768, 1816, 1747, 1558, 1296, 942, 533, 82, -367, -801, -1166, -1471, -1702, -1804, -1817, -1718, -1535, -1269, -924, -533, -110, 301, 684, 1034, 1305, 1517, 1635, 1692, 1621, 1482, 1270, 981, 651, 284, -98, -473, -825, -1126, -1344, -1508, -1572, -1546, -1438, -1229, -943, -585, -220, 197, 582, 941, 1240, 1454, 1589, 1618, 1563, 1386, 1138, 815, 440]
1855D40m21m03l94l44k65j82j01OR8J87K58L12L64L81L92L52L11K67J86J17J6
1876A577n6j33k13k62l10l59l50l61l30k81k13j53n6L2J01K03K69L18L62L82L59
1897E26L49K68K04J41J4n3j59k35k90l54l72l86l38l14k38j80q5NR0J67K23K90
1919g27L21L40L45L17K85K35J75R2K1m8j25k03k21k86l24l20l23k94k47j97j29
1940a313n8M8J11J77K54L08L41L44L37L02K54J79R6L0p9j60k36k61l44l44l49
1961c63l21k94k05j58n3MR8J54K14K70K90L20L14L02K38K16J53R2K2m0j23j65
1983I65k19k66k96l01k94k77k25j90j01m4L2J10J83K43K68L28L18L04K70K20J49
2004A177Q7J1q5j45k20k71l01l19l17k94k42j92j18n9K6R5J51K02K51K92K77K93
$$ y = [440, 19, -384, -778, -1122, -1387, -1569, -1670, -1664, -1566, -1379, -1121, -809, -445, -64, 328, 680, 991, 1258, 1444, 1561, 1577, 1521, 1388, 1175, 913, 603, 244, -106, -467, -797, -1078, -1291, -1444, -1500, -1468, -1367, -1164, -895, -577, -215, 167, 526, 875, 1143, 1347, 1488, 1502, 1449, 1290, 1055, 765, 411, 39, -347, -685, -999, -1237, -1417, -1502, -1497, -1407, -1240, -1017, -727, -406, -66, 279, 596, 881, 1116, 1291, 1383, 1404, 1356, 1231, 1028, 807, 521, 197, -123, -446, -740, -987, -1184, -1313, -1371, -1323, -1212, -1035, -781, -473, -132, 212, 549, 851, 1105, 1284, 1380, 1410, 1331, 1171, 935, 674, 330, -14, -363, -684, -978, -1183, -1341, -1394, -1390, -1292, -1138, -924, -654, -364, -44, 270, 572, 810, 1026, 1179, 1271, 1293, 1253, 1130, 965, 746, 480, 184, -117, -411, -688, -913, -1103, -1204, -1248, -1216, -1106, -923, -680, -412, -84, 234, 538, 808, 1028, 1177, 1264, 1275, 1190, 1045, 825, 554, 253, -66, -383, -677, -919, -1111, -1229, -1288, -1262, -1167, -1016, -814, -563, -271, 6, 299]
2026B99K64K30J91J33P5K0n1j09j73k11k61k90k80k64k67k15j62r5j4L4J20J78
2048h48K23K87K90K98K99K60K00J42N5jp5j61k17k39l13k83k96k66k28j82j09
2069a164l5K9Q4J54J88K40K61K69K70K39K17J67J18N9J5n4j10j61k10k38k61k65
2091a88k59k19j93j46p9rO2J11J84K27K58K88K85K62K26J78J06M3j6j05j44k17
2113F55k48k77k92k58k60j92j50q8k2K8R4J49J95K29K60K35K48K43J86J60J05
2134A000N5rn0j16j62j92k32k44k55k41k04j69j27o7kO2J22J74K25K41K61K51
2156C21K42K00J53R6J8k0j03j62k01k37k49k57k46k10j65j23p2nM2R3J52J79K16
2179c38K25K30K18K17J59J36Q8L9oq2j02j67j94k16k18k35k19j95j48j03m9K2
$$ y = [299, 563, 793, 984, 1117, 1192, 1212, 1161, 1052, 879, 668, 407, 117, -163, -427, -694, -909, -1071, -1166, -1180, -1146, -1026, -848, -625, -338, -48, 250, 549, 809, 1009, 1151, 1206, 1205, 1130, 969, 752, 513, 200, -83, -379, -645, -873, -1055, -1164, -1199, -1170, -1086, -932, -744, -504, -243, 26, 296, 535, 752, 919, 1037, 1096, 1111, 1057, 947, 786, 576, 338, 77, -188, -447, -666, -859, -1005, -1084, -1093, -1031, -920, -736, -509, -251, 37, 322, 584, 810, 988, 1094, 1137, 1121, 1016, 872, 655, 407, 130, -162, -420, -680, -872, -1022, -1110, -1132, -1104, -1010, -861, -666, -437, -177, 58, 306, 549, 735, 895, 1000, 1055, 1046, 996, 880, 718, 526, 294, 50, -205, -446, -650, -819, -946, -1013, -1015, -953, -831, -657, -432, -191, 70, 321, 563, 763, 916, 1012, 1030, 1010, 907, 745, 544, 307, 58, -199, -445, -655, -820, -943, -1015, -1020, -978, -885, -733, -554, -338, -113, 117, 335, 552, 711, 847, 935, 974, 968, 886, 784, 617, 423, 207, -11, -246, -465, -660, -808, -911, -960, -938]
2201i38O3J32J75K14K40K29K44K18J81J43P0J2l3j18j42j94k24k34k54k17j82
2222f15j59j13n9qN1J04J19J77J97K16K07K02J84J53J25P4L2nq1j11j48j78j97
2245A67k19k14j88j74j34q3l9K6O7J41J73J94K26K26K22K01J66J03N6ln7r0j70
2268E97j87k11k17k19k14j73j42p8m7j3N1J00J27J75J87K05J86J95J79J33J17
2289G51O2L7k0o4j07j47j75k08k06j87j79j61j17p7k1J2P2J42J61J92K08K15J98
2312C81J76J37J06M0J0o6j05j40j80j97k12j89j83j55j29p4l8%M9Q7J30J51J74
2335b27J82J76J83J49J42R3P5K2l3o2j09j40j66j77j94j93j63j50j09n4k7K8Q2
2358f72J24J58J92J99J85J96J64J21Q8L5jo3r9j39j72j82j87j84j77j36j22o7
$$ y = [-938, -875, -743, -568, -354, -114, 115, 359, 577, 758, 901, 971, 983, 950, 832, 690, 496, 272, 38, -216, -433, -615, -774, -887, -946, -954, -903, -799, -680, -503, -306, -90, 117, 319, 503, 656, 781, 855, 887, 882, 801, 690, 542, 364, 167, -52, -266, -454, -628, -762, -845, -884, -858, -791, -650, -477, -283, -57, 169, 391, 592, 758, 861, 917, 914, 857, 767, 597, 410, 199, -18, -237, -451, -624, -766, -844, -891, -904, -853, -753, -626, -451, -264, -59, 127, 322, 501, 634, 751, 813, 850, 830, 766, 659, 512, 337, 129, -77, -264, -443, -604, -721, -798, -819, -807, -735, -593, -432, -240, -32, 183, 381, 557, 694, 800, 840, 850, 784, 679, 539, 359, 162, -50, -239, -422, -577, -706, -780, -818, -818, -769, -682, -552, -401, -227, -45, 131, 314, 463, 605, 698, 773, 795, 762, 700, 591, 451, 285, 108, -86, -279, -442, -592, -701, -755, -782, -754, -672, -548, -390, -198, 1, 186, 382, 546, 667, 755, 790, 789, 726, 627, 488, 316, 134, -53, -237, -414, -550, -672, -739]
2380g39l6lN4Q6J11J33J75J79J70J66J43J31R4O3Oj5n8r6j26j69j73j67j82j66
2404d19j37j03o2j8L3Q9J15J49J67J97J80J77J50J09Q1M2j9n1r8j27j61j60j88
2427e4j68j65j34r7q1k3lM1R2J09J25J56J61J57J66J46R9J14M5K3j3o0r8j34j58
2452B46j73j61j74j60j25j03n6j0L0P8J12J41J80J84J80J56J66J06P1L5rn2r8
2475E64j17j64j50j63j68j51j31j04p4l6OL0R0Q8J33J38J51J57J47J45J11Q3N7
2498F42J3j5n6q5j30j41j62j58j57j53j18r5m3oL1Q8R9J69J48J76J56J59J43J02
2522F07N2K4ro0q2j32j41j52j66j53j36j21j00p4j9lM6N4J04J38J31J50J35J60
2546B53J28J15Q7M9J6k3m5j11r9j57j57j49j65j26j20p9l2qL4P6J14J43J37J61
$$ y = [-739, -775, -778, -724, -638, -527, -394, -219, -40, 130, 296, 439, 570, 664, 727, 733, 718, 660, 564, 438, 269, 96, -71, -253, -419, -556, -659, -721, -739, -706, -617, -502, -353, -186, 11, 191, 368, 518, 627, 708, 750, 731, 680, 582, 455, 294, 134, -54, -222, -387, -521, -618, -699, -722, -725, -684, -592, -483, -358, -202, -41, 116, 282, 428, 527, 641, 686, 709, 696, 636, 538, 404, 246, 73, -88, -262, -422, -547, -650, -706, -716, -686, -608, -496, -355, -175, 9, 189, 345, 511, 617, 688, 723, 714, 662, 564, 447, 283, 133, -30, -198, -349, -480, -584, -658, -694, -688, -658, -568, -480, -347, -209, -58, 99, 246, 391, 502, 585, 642, 655, 640, 584, 499, 369, 228, 66, -92, -249, -402, -520, -615, -658, -664, -633, -545, -446, -277, -129, 47, 203, 362, 505, 607, 659, 683, 674, 614, 532, 400, 259, 107, -59, -212, -348, -469, -569, -643, -662, -665, -619, -565, -461, -323, -192, -42, 93, 253, 381, 496, 583, 632, 648, 625, 580, 469, 370, 213, 56, -93, -258, -384, -504, -583, -615, -623, -589, -513, -399, -256, -119, 42]
2570D2J59J40J26R3M7K1j5m9r7j16j21j60j47j30j28j21q3n2k0jL1Q4Q4J23J37
2595a53J37J33J40J16J11P4M4Rl2o0q8j22j45j41j49j35j42r3q2l7QN1Q3J04J28
2620b41J59J46J47J35J13Q1M4J9k5n2r0j03j27j52j20j34j21j11p8m9l1J2L5O8
2644d75Q5J21J23J22J34J30J24R2O8M2Kl1m9q3j33j25j36j51j37j14r5n5k1kN6
2669e08P8J10J25J35J38J35J27J04P5L7%k0m7q5j11j06j41j19j23j17q9p6m1k0
2693e39RK6O2Q5J09J14J28J20J09J24R8N6K5J2l2o1r0j06j26j47j05j37j18p2
2717d56n3j8J3N4O0J11J27J22J31J21J15R9N8K6J0l3n2p4r5j07j18j13j19j00
2741b91q9o3l3k0QL3N7R4R1J09J07J07J16Q9P6N5K7ok6o4o7j13j04j18j25j03
$$ y = [42, 201, 341, 467, 560, 607, 628, 613, 564, 467, 351, 230, 70, -77, -207, -335, -456, -539, -591, -611, -612, -581, -497, -413, -290, -153, -16, 117, 257, 373, 484, 558, 602, 611, 579, 519, 431, 309, 164, 23, -126, -261, -403, -496, -578, -615, -607, -556, -473, -369, -241, -82, 64, 211, 346, 459, 540, 584, 603, 578, 526, 436, 333, 206, 54, -66, -200, -321, -432, -510, -559, -590, -578, -543, -475, -390, -269, -146, -24, 110, 240, 364, 456, 524, 566, 568, 537, 488, 405, 272, 147, 11, -140, -277, -391, -486, -541, -562, -564, -508, -430, -320, -195, -60, 78, 213, 340, 444, 519, 556, 556, 536, 489, 404, 293, 187, 46, -73, -196, -313, -402, -478, -519, -539, -530, -504, -442, -357, -248, -134, -6, 114, 223, 347, 445, 501, 526, 538, 506, 445, 355, 249, 123, -24, -129, -266, -384, -456, -509, -527, -514, -460, -400, -289, -162, -40, 91, 212, 327, 426, 484, 510, 520, 487, 435, 361, 266, 159, 41, -72, -191, -291, -380, -443, -476, -496, -488, -455, -398, -304, -213, -104, 3, 110, 226, 315, 391, 446, 473, 467, 441, 377, 310, 197, 93, -25, -150, -253]
2767b53j04o3l4j6K2M8O7R9J13J28J07J09R6P5M9K7j0k5n4o4j08r3j07j09r0r1
2793b81q1n5l9JNM2M8Q0R8R2J16J02Q9R4O4N0J2mk2n7q8j01r8j16j04r5q3n3k0
2822d04k5K7M8P2R0R6J07R8R8R6N9M4J3kk3n7q1o4r8r0j03r0q1n6n4l0LK0J8N5
2852c14P9P8J02R4R6Q6P2O4L2K8j5l3n5q3q9j04r7j05r6o6m6l3QJ3N4P3Q7J00
2880g0J00Q4R6O8O3L7J6j0l0n1o2o8q6r3q7p2q1n5k7m2LKL8N1O5Q0Q9Q9P6Q8O7
2911B78M4M0Rj9l7m6q5r0r2q3q8q7n0l1l9J2L4N4N5J00P4R9Q3Q5O8N8J2J4j1k6
2941C35n6o3p0r5p2r5o7n7n4l1k5KJ7L9M3P0P1P2Q7P8P3O3M3K2K0k5m3m7q5o9
2971H1q7r1q4o6n9k9mNM1N6P2O9Q3R1P6P7M8M2K3Ml2k8n0o8o5o9p5q0o8n0n3l4
$$ y = [-253, -357, -420, -454, -470, -448, -400, -333, -234, -121, 7, 114, 223, 319, 394, 443, 470, 460, 435, 381, 317, 209, 116, 9, -100, -190, -281, -362, -417, -456, -455, -450, -408, -360, -280, -182, -90, 26, 128, 217, 311, 375, 425, 437, 433, 411, 354, 266, 165, 67, -49, -153, -248, -331, -384, -404, -429, -402, -354, -282, -192, -96, 11, 109, 207, 303, 362, 406, 419, 417, 394, 337, 256, 192, 94, 4, -99, -189, -270, -326, -380, -410, -407, -387, -369, -314, -235, -157, -55, 39, 135, 221, 293, 357, 389, 417, 402, 369, 314, 231, 142, 38, -59, -164, -260, -326, -372, -405, -397, -384, -330, -257, -170, -70, 30, 114, 210, 278, 341, 378, 394, 384, 354, 303, 241, 173, 87, -6, -93, -165, -246, -301, -328, -370, -367, -365, -327, -276, -211, -131, -42, 47, 123, 211, 278, 322, 362, 371, 352, 315, 269, 184, 94, 2, -81, -169, -256, -306, -337, -376, -364, -330, -276, -221, -121, -47, 52, 135, 220, 288, 346, 358, 372, 361, 335, 279, 216, 146, 51, -21, -116, -183, -240, -294, -325, -350, -348, -331, -292, -249, -179, -108, -36, 51, 129, 202, 265, 308, 330, 350, 325, 282, 235, 150, 81, -6, -97, -181, -247, -306, -335, -339, -334, -293, -237, -165, -96, -13, 78, 154, 231, 279, 321, 344, 348, 316, 288, 238, 170, 105, 36, -39, -119, -187, -237, -290, -324]
3003c24j0%K5L4N9N6Q0Q0P2P3Q4L8M5J4nk4l3o7p4o7q1r6p1o0m8k4j3L4K1P4O2
3034a46P4Q2Q0P3P1L6L8J1%j5l6o7n6q0n5p9o4n6o3l7k9lJK9L8O5O6P4P7P7P0
3065A76O6M5K9Rpk9m3o8q6p3r1p0o5n7m8j5NK1M3O0P8O3Q7O8P4N8N3M5j4%k0l5
3097B59o0p1o5p8n9p7n3m6l7k0mJ8K9L8O9O5O1Q3P6O6O5K8K4Pj7k8o6o4p6p3q8
3128i4p3o0o1k3j8J1L3M6O4O5R5P3P1P0O2L5L3jk1k8l8p6m8p7o9n6p8n2m5k6k9
3159c15JJ7L8N6O0O4P6P4O8O0N4M9Qpl4l4n4p3o8r5p7n7o7k7l5MPM1O8O2P2O1
3191cR3N5O1N8M1J2jk1l6m7m7p3p4o9p1n1n7n1oj2OJ9K7N5N5P6P7P2O2O5M4K2
3223B81J8j3j9m7n4p5p6p1p5p7m6k7j5pK8L3O7M2Q1P1O1P1N9M5K8K1j7kn0l6o7
$$ y = [-324, -334, -334, -309, -275, -216, -160, -80, 0, 72, 145, 229, 267, 312, 326, 321, 297, 264, 197, 123, 56, -25, -121, -192, -252, -300, -324, -337, -303, -282, -208, -146, -72, 10, 90, 163, 234, 270, 308, 319, 319, 304, 268, 201, 145, 65, 10, -69, -133, -189, -252, -289, -318, -321, -320, -291, -253, -188, -122, -48, 29, 106, 176, 242, 287, 316, 325, 318, 289, 246, 178, 92, 19, -72, -142, -207, -264, -312, -327, -322, -301, -258, -198, -120, -57, 30, 98, 172, 230, 283, 328, 314, 314, 294, 259, 199, 128, 63, -15, -74, -151, -204, -250, -287, -307, -311, -293, -264, -226, -157, -92, -31, 52, 128, 194, 259, 287, 311, 318, 301, 273, 207, 143, 67, -6, -94, -167, -227, -288, -311, -329, -318, -285, -239, -175, -110, -15, 58, 129, 199, 261, 296, 329, 328, 307, 279, 241, 165, 117, 40, -29, -85, -163, -215, -260, -286, -315, -314, -297, -259, -203, -143, -79, -3, 71, 139, 199, 253, 302, 310, 303, 269, 235, 181, 108, 40, -55, -132, -189, -256, -283, -318, -314, -307, -266, -198, -136, -64, -3, 90, 145, 206, 264, 305, 317, 316, 295, 259, 212, 165, 92, 18, -51, -122, -173, -230, -281, -287, -299, -293, -274, -247, -192, -137, -61, 16, 88, 150, 215, 259, 281, 299, 286, 267, 220, 166, 91, 15, -56, -131, -208, -254, -281, -296, -303, -275, -242, -175, -133, -52, 19, 80, 151, 210, 255, 283, 304, 287, 285, 235, 199, 132]
3254A32n9o6o7o3o0m3m5j6j3JL0L8M4Q1N7Q3O7N6N8M6K8J2k0k6n1o0p5o6p5o2
3284a34n2n2l0j5OK2L6M7O5O2O6O0O9N1L8L3J4pk4m3m2m4p8n6m5p4m8l5m4qj2
3315b74MK5N7L4O5O8P1N0P1M7M9J4Mj8l6n3n6p4o0o5p2n3l7l9rJ0K9N0L5O1O2
3346d0Q4N0O9M5L2K4KJ0k6m4l1n8o4m9n5o9m3n3l6oLPJ8M6N4N3P4O3P5N0K7L1
3378B43J9mmm8n0m7p2o8o4o0o0k9k7j2K8K8L4M4P8M7O8P1O0M5L1J1J4qk7m1l4
3409A66o0n4o0n4o5n2l6k4l2QK3J8N0N5N5O0N3P1N7L7L9J6rk2l6o8m2p2m6p8m9
3440a51n7k9k2KK2J7L8M6O5N7N7O4N1M8K9K4J1k0j4m5l9n3o6n4n1o2n2m3l0pj0
3471b74K5M0L5M0O7Q0N1O2M8M8L4%lj5m2m0o1o8o4o1n9m4l1k6MPL0L5N5N6O7N9
$$ y = [132, 73, 7, -60, -123, -183, -226, -271, -287, -300, -299, -269, -231, -187, -106, -49, 34, 101, 157, 215, 261, 289, 301, 281, 255, 204, 144, 69, 3, -72, -134, -186, -238, -268, -283, -277, -255, -219, -172, -107, -45, 21, 81, 150, 201, 239, 272, 286, 279, 255, 212, 170, 126, 48, -8, -53, -127, -175, -210, -254, -262, -274, -270, -245, -188, -154, -89, -21, 50, 100, 171, 218, 267, 281, 285, 267, 231, 178, 122, 48, -12, -77, -149, -202, -239, -278, -287, -277, -248, -198, -163, -102, -40, 44, 94, 163, 208, 240, 264, 266, 276, 250, 206, 175, 117, 53, 4, -51, -120, -163, -216, -252, -258, -255, -248, -230, -184, -130, -77, -3, 60, 135, 185, 212, 243, 262, 258, 254, 206, 156, 109, 37, -31, -95, -155, -215, -244, -271, -283, -255, -227, -193, -149, -71, -24, 44, 115, 175, 220, 251, 262, 276, 268, 241, 200, 166, 106, 52, -8, -62, -127, -179, -215, -239, -271, -263, -240, -222, -172, -117, -62, -2, 51, 122, 179, 216, 255, 271, 262, 240, 204, 136, 94, 22, -24, -102, -151, -208, -237, -259, -257, -235, -218, -180, -134, -69, -12, 45, 109, 160, 208, 237, 261, 272, 252, 238, 193, 154, 101, 35, -19, -70, -132, -184, -227, -257, -264, -274, -249, -209, -174, -134, -67, 13, 64, 126, 174, 222, 256, 256, 253, 238, 196, 156, 95, 27, -37, -98, -157, -201, -232, -258, -254, -247, -217, -182, -127, -71, -4, 55]
3503E5N0O1L6K0L5rok1l2m6n0n6n7o3n6m9l0l0qLJ6K2M8O0M5O7P3O2O2L4K9jj1
3536B53j9m3m6n8o3p1o7n2l7k8k2k1K6K5L9N2N3N3N8P3N6M1L6J7Pj3k1l0n1m9
3566I8n2p7m7o6l9n2k0j2J6kN7M8N8N6O6N3O8M9K8L5Loj9n8m6p1n1p0o3n7l6l8
3598b47j7jPK8M6N9N1N8O4N8O3L2M6J6MJl2l1l4o2o6p1p1k2p7k8k8j6KJ6M3M9
3630a60O1O1N8P3O4M7L7J2J5j5k2n1m1o9o8n7o3n7l2m3kjJ4K0M5N8O2M3O8O4L7
3661A58N7K8K3%kk5m9l5n8o8n2o2n1n6m6k2moK7M5K6O9N7P1P7N0M4L8K5Oj3k8
3693B24l8n4n4p1n6o4m6n3j4k1rK7K6M5M4N0O8O0M6N0N3K7J8Jj8j4m4m0m9o2o4
3724c2p0m9m4l1l0j5RL2L7N0O0O2O4O6N1M5M5J3Ok0k9m0n6n8o5o1n0o3l3l0j7
$$ y = [55, 105, 166, 202, 222, 257, 248, 242, 221, 189, 143, 93, 37, -20, -83, -139, -188, -218, -248, -256, -253, -237, -215, -167, -107, -62, 5, 78, 140, 202, 236, 265, 264, 253, 234, 191, 145, 87, 24, -47, -114, -166, -203, -231, -253, -274, -248, -223, -184, -132, -79, -26, 32, 105, 161, 202, 238, 255, 262, 249, 228, 198, 147, 98, 46, -31, -78, -144, -183, -235, -255, -267, -251, -253, -196, -148, -90, -34, 32, 85, 153, 202, 230, 265, 268, 262, 243, 185, 139, 68, 17, -53, -116, -173, -209, -247, -264, -265, -258, -230, -184, -125, -74, -16, 48, 106, 169, 201, 247, 263, 267, 268, 236, 205, 171, 109, 43, -28, -99, -121, -198, -226, -254, -270, -268, -252, -209, -160, -99, -38, 20, 93, 157, 204, 241, 253, 268, 253, 231, 180, 139, 70, 2, -55, -118, -175, -207, -250, -252, -253, -239, -219, -174, -116, -54, -11, 57, 121, 158, 215, 243, 266, 266, 264, 239, 190, 155, 97, 29, -23, -85, -136, -192, -238, -260, -264, -270, -243, -198, -172, -103, -46, 25, 102, 152, 196, 234, 259, 265, 252, 224, 186, 132, 78, 7, -49, -113, -159, -212, -226, -247, -256, -229, -203, -158, -114, -64, 4, 64, 110, 160, 213, 240, 258, 259, 241, 227, 183, 143, 94, 32, -32, -102, -151, -195, -226, -256, -271, -262, -230, -193, -143, -83, -21, 43, 109, 160, 205, 250, 263, 269, 249, 220, 180, 124, 66, 1, -60, -110, -173, -206, -236, -253]
3755b53NJ7K7K8N5O7O2M2O4M6L6M2J0Lj4j2l2n4n8o1o5n4n5m8k9k4%QL0L8M2O4
3787g3O3N8N5N6N2K7K1%k4j9n6n5n5o3o2n9m0k8l2j6lK0L9J1O7M8O9N0O1M8L8
3818A98L4K2m%k0m6m5m8o5o4o2m9m5l4k3kK3J6M1N3M4O8O5M5N5M0L5J3Kk0l7l2
3850A58o1m6n8n6m8n5l5k4j3J1%L0M2L7O9O2M2O0N1L0L6J0Kqk2m0m1m4n9p4m7
3881i1m8n2m3prJ5K4L8M9N4N1O9M1N3M3K2J4Mj8l1l4m8o0m7m7m6m2l7k6k5J3J0
3913b11K6L9M4N1N5O1M8L8L2L9J8lLl8l5n2l6n6p7n0m6l3m0j8J1pL9K5N3N2N5
3944a3O3M4O2M2K0J6Rl2j7m5m3n5n9n2m9k9m7l5JMKL1M0M6L3N9N8M7N0L1K7K6
3976B35Lj0j8l4m8m9o2n8o6m2l7k4k4mJ9K1L6M2O8M7O7N9L9M0K6J7lk1k6l9n0
$$ y = [-253, -248, -231, -204, -176, -121, -54, 8, 50, 114, 160, 196, 238, 248, 251, 237, 225, 193, 139, 81, 20, -45, -99, -154, -202, -231, -255, -255, -247, -217, -179, -137, -73, -10, 48, 103, 159, 211, 238, 259, 259, 235, 216, 160, 105, 50, -13, -75, -134, -174, -202, -234, -250, -253, -233, -194, -183, -116, -68, 1, 51, 112, 160, 198, 232, 254, 250, 250, 230, 184, 139, 91, 26, -38, -100, -149, -194, -228, -251, -253, -230, -214, -173, -120, -76, -8, 57, 102, 157, 197, 232, 245, 247, 227, 190, 158, 97, 51, -7, -63, -111, -166, -201, -225, -238, -227, -227, -197, -155, -118, -49, 13, 55, 115, 166, 196, 232, 242, 244, 236, 214, 174, 133, 89, 30, -44, -91, -139, -191, -234, -241, -250, -235, -211, -173, -124, -70, -19, 50, 91, 144, 187, 209, 223, 227, 209, 178, 144, 96, 36, -11, -58, -104, -146, -183, -209, -234, -221, -211, -185, -146, -102, -51, 4, 65, 113, 151, 183, 222, 240, 237, 240, 202, 167, 115, 79, 23, -54, -104, -150, -183, -223, -241, -230, -237, -198, -173, -120, -68, -13, 50, 94, 156, 198, 218, 234, 243, 211, 194, 149, 106, 51, -8, -60, -109, -138, -185, -220, -219, -215, -213, -182, -142, -96, -63, -4, 54, 101, 151, 182, 209, 235, 238, 228, 210, 176, 128, 79, 17, -41, -107, -149, -186, -210, -234, -238, -219, -198, -162, -120, -52, -5, 62, 121, 160, 200, 226, 243, 240, 219, 193, 154, 104]
4007A04n3n2n2n0m9k1l3k0kJ9K4L4M6M3O1N4M4M4O0K4POok8j9n9n0n0o5n2m9l5
4039a75k8k9NQL7L7L1N6N2O6N9L5L8K6Pojm4k8m5o0n6m3m4n3l0j8j4NkL2M2L5
4072a05O2M9M6M6O0N2K2LOj8j1k7o2m6n5p4l6n5n9j3j4pJ5K3M3N3M4O2M8M6N8
4103A56K0L8J4jk0k9m2n0m4n4m9l6n2k1l5nkJ9J5N3K7N7N5M9M8M7M5K2J5Nj1l5
4135A99k8m8n4p1l7n8n0m0j8k5qK2J7M5N8M5N3O3M6L8L8K7lJ3l2j8l1l5o0n1o0
4166f3l4l5n2j5j2KJ9J0M1M7M4O3M2N5L9N5J6J2Nj6k1m2n1m7o5m6o6m0l9j0k4
4197b28%J7J7N3M9M9N6N3N2M0L9J8jMk4j9m0m7n0m2o1m5m4k4k0j7KNL3L9M0M6
4229e0N8N9L5M7L6L0J2Ppm1k3m8m9n9o2m1l9m4k2rqK6K1M2N1N1N5N1L6M0M5PJ1
$$ y = [104, 51, -1, -53, -103, -152, -173, -206, -226, -228, -209, -185, -151, -105, -62, -1, 53, 97, 141, 201, 225, 232, 238, 232, 204, 185, 126, 76, 26, -39, -91, -140, -175, -203, -232, -227, -219, -182, -145, -114, -58, -6, 60, 119, 154, 192, 218, 225, 219, 218, 174, 146, 101, 41, -15, -58, -102, -155, -185, -203, -217, -212, -214, -182, -140, -105, -43, 6, 52, 98, 158, 210, 232, 235, 241, 223, 212, 185, 123, 77, 22, -52, -88, -143, -202, -215, -229, -236, -221, -198, -155, -102, -58, 4, 52, 98, 156, 176, 214, 228, 227, 207, 178, 136, 86, 42, -12, -61, -97, -149, -170, -205, -210, -212, -193, -178, -125, -98, -41, 14, 63, 111, 158, 203, 225, 240, 245, 234, 199, 171, 123, 69, -2, -39, -97, -147, -187, -205, -230, -238, -216, -199, -154, -96, -51, 2, 65, 111, 149, 187, 214, 211, 224, 192, 174, 143, 108, 48, -3, -63, -97, -132, -184, -199, -211, -209, -190, -180, -139, -92, -48, 15, 57, 112, 151, 206, 222, 234, 239, 223, 202, 160, 109, 62, -3, -49, -115, -155, -194, -204, -228, -228, -211, -194, -141, -92, -43, 13, 66, 118, 158, 197, 215, 214, 218, 194, 175, 135, 88, 38, -4, -65, -110, -154, -178, -198, -215, -213, -208, -175, -136, -96, -50, 8, 67, 102, 149, 185, 215, 227, 234, 227, 186, 163, 115, 66, 7, -55, -96, -135, -179, -201, -210, -218, -192, -171, -129, -78, -27, 28, 79, 115, 155, 200, 207, 218]
4262B18rj3j9m4n2l9m6m4o0k8l9k3j3PMJ4N9M1M4M2N4N9L3M7K9POk8k0l2l6n4
4294F5o2m9m3n1k5l2LpNK4M5L6N4N0L8O1L0K6L7nnol2m3l6l7n1n2m5k9l2j7j2
4327a97JJ7J6M1L8M5N1M1N2M0L2L3J5J0k5k8l8l0n5n1n8n0l3l2k3j9RJ6J8L6N6
4358g2K5N5M3M4M1K8K0RNj0k9l4m1l4n2l6m5m9k5k3j1%J1L7K5M2L7M7M2M8L9L8
4390A75J7K0mnk3m2m0m5n2m4m6m4k0m5PjRK7L0L7M2M8M3M8L3K7L5jmj4k0k1l9
4423H8m2m4m0l7m0l2j5k3lQL0K1L6L1N3N2M9L8L0L3J2r%k8k7m3m2o3l8l8l8l3
4455a54j8k0J0J2K2K6L6M4M4N8L4K7L8J7mJ0j5j6k8l7m2k8m9l6m4l4j4k0lQK5
4486a51K2K9L9M3N6M7L3M8J3K0mKl2k5l2m5m5n1l2m4l2k8kpJ1J5L0M2M5M2M2K9
$$ y = [218, 209, 196, 177, 133, 81, 42, -4, -48, -108, -136, -175, -198, -211, -204, -200, -186, -127, -86, -42, 0, 54, 113, 146, 193, 222, 229, 235, 207, 187, 155, 119, 65, 3, -46, -89, -140, -165, -197, -194, -201, -196, -172, -127, -91, -37, 13, 51, 112, 142, 168, 205, 200, 195, 189, 157, 114, 78, 41, -10, -62, -107, -136, -168, -185, -197, -196, -179, -163, -122, -84, -39, 12, 53, 105, 145, 177, 210, 225, 235, 210, 182, 144, 114, 59, 8, -50, -100, -133, -165, -188, -207, -198, -182, -164, -128, -72, -47, 8, 51, 95, 136, 164, 184, 193, 198, 188, 159, 125, 84, 50, -2, -38, -83, -132, -157, -180, -191, -191, -180, -143, -118, -76, -39, 8, 50, 98, 137, 175, 192, 212, 208, 203, 180, 138, 98, 53, 1, -43, -89, -133, -153, -198, -191, -192, -183, -156, -126, -89, -47, 1, 44, 92, 125, 152, 187, 186, 182, 168, 148, 127, 88, 46, 2, -38, -75, -115, -147, -162, -185, -188, -180, -150, -129, -93, -62, -9, 43, 92, 130, 160, 193, 205, 196, 196, 168, 141, 98, 56, -7, -45, -83, -121, -154, -172, -192, -182, -170, -148, -122, -86, -42, 2, 60, 94, 121, 159, 176, 172, 182, 167, 151, 123, 86, 44, 16, -33, -69, -113, -147, -161, -181, -184, -176, -151, -129, -100, -61, -18, 38, 85, 118, 166, 179, 199, 195, 197, 165, 140, 108, 63, 18, -33, -65, -109, -141, -169, -171, -178, -167, -152, -122, -80, -35, 7, 49, 78]
4518G8M4K3J3Rjrk0l3k1l3m8m7k5l9k7l1j4mJ6J5L4L0M2L4N4M4M0L6J9J6Mok0
4551A73k8n6l7k3m6m6n0j6l1j9J6POK3M2L2M7M5L5L6K3J7J3Jkql9k0m0l6m0m9
4583g0l7k3k8J7l5J4K2K7K6L5N0L8M7L7M7J0K0oJl8j3m3l3m1n7m2k5l3k8Lj2J0
4615a60K1L0L1L5L0M1L7K6L7J2K1Mrj2k4l4l4l5l1m2l7l2l0qKjK2K1M4K9L6M8
4647C8L6L8L4K1PJ0j8j9l2l0l5m6m0l5l6k5j7plJ5K1J9K4N1L4L7L5K3M1MJ0RN
4680A69l4j2l9k8l8m0m0l8j9k4j5pJ0J4L2L2L6L6L7L5N4J7K3K2mnl2k4k8m8k5
4711A7m8k5l7l5nmj1K0QK4L2K9L5L9L6K3K6K6rJJj9j6l7l1k8n9k0k6l8k6PqJ0
4745a48K3J7M1L2M4L0M7K1M2J6OJ0j0k9l4k4l4m7l4k3l9j3j9k0KJ8J6K6K8K8L5
$$ y = [78, 122, 145, 158, 167, 166, 157, 137, 104, 83, 50, 2, -45, -70, -109, -136, -167, -181, -185, -169, -154, -120, -90, -48, -14, 40, 84, 124, 160, 179, 195, 199, 193, 173, 145, 89, 52, 29, -17, -63, -113, -129, -160, -179, -163, -156, -150, -127, -85, -53, -6, 39, 74, 110, 133, 150, 163, 164, 162, 154, 115, 95, 55, 19, -21, -70, -107, -130, -158, -141, -176, -162, -140, -113, -87, -52, -2, 36, 83, 120, 167, 177, 197, 191, 192, 154, 141, 98, 65, 24, -33, -75, -100, -133, -161, -158, -170, -160, -139, -109, -78, -43, -13, 28, 65, 91, 128, 140, 161, 165, 156, 144, 120, 86, 52, 17, -14, -56, -93, -125, -155, -163, -161, -162, -140, -119, -75, -46, -10, 38, 74, 112, 146, 167, 174, 184, 166, 147, 115, 85, 50, 4, -36, -71, -107, -132, -149, -156, -159, -144, -123, -104, -80, -29, 5, 42, 77, 100, 141, 145, 155, 164, 169, 135, 123, 84, 56, 18, -22, -62, -100, -119, -143, -158, -165, -155, -141, -109, -77, -41, -5, 32, 67, 121, 138, 161, 183, 179, 174, 142, 118, 90, 42, 17, -31, -56, -93, -128, -133, -137, -148, -128, -120, -96, -64, -35, 0, 39, 75, 98, 124, 150, 141, 142, 143, 124, 108, 71, 40, 12, -47, -67, -93, -131, -157, -150, -158, -148, -125, -108, -67, -35, 9, 39, 86, 107, 149, 165, 171, 181, 171, 142, 108, 84, 50, 3, -31, -54, -93, -106, -125, -145, -143, -125, -109, -83, -55, -27, 8]
4776HK7L2L0QK8LLj0j4j8l2k4m0l7l6k7k7kk2MPJ8J6M6M0L4L1L8K5L0K5MKk7j6
4811A27k9l3k8l8l6l1j5k9j5qqJ4OL3L1L1L6K9L0K9J7J0J7Mj1j8k1k3l4l7l1k1
4843e2n0j0j2rlJ1kM2L3K2L9L9K2L7K2J4MLj4k2k8j6m6k2m3l1ol4q%j5J0K1L0
4877g4K4K1L6K6M1K1J6J0J5Kj2nl2l5j3l8k8l3l3k0j0k0J2jJ0L9J4L3L4L8L1K3
4909I2K6K0mMj6j6k6k3k5k6l0l7j7k1j4kqPK2K3L2K2J8L7K2L6NK5pQmj8k3k0l3
4944B9k5m3l5j3j6k5qJLK5J4L8L3J9M7K5K6K3J3J0lrj7j8k9l0j5m7k3k5j6j2l
4977a06L%K0J7PL7L4K1L7J8RJ6JRqj8j6k6l1l1k7l2j8k4k0%kRK6K3J8L2L2L8J8
5012F6L5J1J9Koj1pk9k7k6l0k7l0j0l0j3OLmK2RK9J6L5K8K3J6J4J2J1Lqk1nk0
$$ y = [8, 35, 67, 97, 105, 133, 136, 139, 129, 115, 97, 65, 41, 1, -36, -72, -99, -126, -128, -150, -146, -139, -121, -105, -59, -19, 15, 46, 84, 109, 139, 164, 168, 170, 143, 127, 98, 65, 37, -1, -37, -68, -83, -112, -127, -135, -143, -129, -123, -90, -59, -28, 8, 37, 67, 96, 113, 123, 140, 144, 133, 115, 94, 71, 37, 0, -31, -52, -102, -112, -124, -133, -136, -125, -127, -85, -52, -30, 9, 48, 70, 107, 129, 143, 147, 150, 136, 114, 86, 70, 24, 2, -41, -72, -78, -112, -120, -120, -135, -125, -104, -74, -50, -29, 7, 33, 74, 95, 111, 121, 136, 138, 126, 121, 89, 54, 41, 3, -25, -58, -91, -111, -121, -141, -129, -130, -120, -81, -67, -34, 0, 38, 69, 92, 118, 138, 134, 138, 122, 106, 80, 57, 32, 6, -24, -61, -78, -99, -113, -115, -123, -116, -94, -71, -39, -17, 1, 38, 60, 96, 101, 126, 119, 127, 123, 105, 82, 62, 29, 4, -39, -74, -87, -103, -128, -136, -135, -132, -107, -93, -55, -22, -3, 44, 69, 95, 118, 131, 141, 138, 129, 112, 94, 65, 35, 20, -27, -50, -75, -91, -103, -106, -103, -103, -83, -66, -59, -22, 12, 33, 70, 88, 97, 113, 114, 123, 115, 97, 81, 55, 24, -7, -34, -66, -84, -108, -128, -128, -130, -121, -95, -72, -54, -22, 10, 48, 66, 101, 112, 131, 133, 127, 116, 109, 80, 53, 27, -3, -30, -60, -70, -100, -113, -107, -104, -108, -86, -77, -48, -32, 3, 31, 54, 70, 84, 96, 107, 110, 102, 81, 76, 56]
5047E6k9k7k7l4j7j6k1QmpL6K2J0K5K9L8K8J4K6QJ2nj6k4qk7l5k0k4k7j4j5rj2
5081a06KJ0J3K7QK7L1L0K9J5J3J6kojok0l1j8m7j2k7l2pj3pkJ8J4K2L0J2L5L0
5115D5J6L4jL1j9Opk0j6k5k9k2l2k0j8j6lMqJ3QL2J3J9L9K2K2J5J2Q%NJ0k5k9
5150F4k6k0k5l2k4k8j6pj7J2J4K7J4K0L4K1M7J0J4K5j0J8j3mj3l4j0l2j2l5k0
5181e8oj9j0m%K2JJ7K8K6J3K4K8L1PKJ3qj1k4j0l0k0l6j7l7j0j3%j4J2QJ4L0K
5216d9M1K8K9K3L0jJ4pMj3k0k3j7k8j6k1k9j4j2j2R%JJ3J2L1K1J9K3K0K0RJ1J1
5250A07j1j2j3j3l3j7l3k8j9j6pnLKJ5J5K1L0J1K8K9J9J8PJ1j7klk0j5k0k6k4
5283a8pl1j0j4j3KlJ9J4K2J3K8J4L3RK2J8OpqOk3l5j5j4l5j2k5j4qlpPJ5J5K7
$$ y = [56, 27, 0, -27, -61, -78, -94, -115, -107, -111, -118, -82, -60, -50, -25, 4, 42, 70, 84, 110, 118, 130, 125, 109, 85, 77, 50, 15, -5, -29, -56, -70, -85, -94, -106, -104, -94, -81, -54, -46, -19, 12, 42, 71, 86, 99, 115, 113, 107, 106, 100, 80, 49, 31, -16, -28, -55, -87, -94, -107, -114, -116, -98, -84, -62, -32, -20, 15, 45, 61, 95, 94, 125, 106, 112, 105, 85, 69, 44, 15, -7, -39, -59, -77, -93, -96, -92, -100, -87, -79, -47, -34, -15, 24, 46, 68, 83, 95, 103, 103, 108, 118, 93, 64, 38, 18, -7, -39, -63, -91, -107, -114, -131, -119, -105, -78, -64, -44, -10, 11, 58, 68, 82, 107, 97, 115, 102, 98, 85, 51, 41, 9, -3, -38, -58, -64, -83, -93, -97, -97, -75, -74, -57, -29, -3, 10, 34, 62, 93, 100, 102, 115, 107, 96, 72, 62, 32, 12, -24, -41, -78, -88, -101, -101, -115, -103, -95, -81, -51, -49, -8, 20, 49, 72, 102, 101, 115, 108, 112, 99, 79, 56, 39, 11, -5, -26, -55, -69, -81, -93, -84, -84, -83, -70, -58, -27, -6, 13, 36, 56, 76, 85, 96, 107, 96, 84, 71, 58, 25, 8, -25, -53, -72, -88, -95, -100, -97, -95, -80, -65, -44, -14, -3, 25, 54, 73, 91, 98, 109, 92, 90, 87, 67, 52, 32, 6, -18, -25, -56, -66, -80, -93, -91, -94, -75, -61, -39, -26, 2, 16, 49, 58, 80, 98, 104, 97, 89, 95, 72, 37, 22, 8, -27, -39, -64, -78, -86, -89, -96, -89, -74, -59, -32]
5319c2PL3J4L4OK1J2Jklok9j3k3l0k0oj6j7JplLRML3K0QK2K0L3J0J3%jj2%k3r
5358E2k5k2k9k4k6Jj8JmROJ7J9J6L6KL2RK1J1Kj4Ooqk4k2j1k4k3j0j0k4MMKNJ7
5396e2K5J6J7J3K3K0J7%J9j0Jj5ok5k7k1j2k7k1qj5qlJ6J1K3J8K5J2K8J6J9OJ4
5430H9LKj0Jk4pl5rj5j5k5j0rqkMJ6J8LJ3J6K5J6K0K1NQj0%j9j4ol5j1k1k8Lk0
5468g0lmqJ3OJ8J5K0J9K7J2J1J9NKNlk1j5j0rk7j9k3lqk4Mq%J7J4K0J2J5K0RK0
5506D8J3J3nQj2%k0pml3k2j8j4pj2loK0jJ2K2J8K2J2K2J8JJ0Nj0Klj9k6pj6j1
5543a0k7j0j4n%JROjJ8K1J2L1J6JK8jJ0Kj5j0j8j0j4k3k1k0Kk5rQn%QJ9J5QK5
5581BJ8J4J2J0RQKj7jj0j3k8j5j7rj6%q%jkJ1QK1J5K4J7J4J1kJ9kkkj2j1k4ql4
$$ y = [-32, -25, 8, 22, 56, 62, 83, 95, 96, 94, 91, 85, 56, 43, 20, -10, -30, -36, -52, -69, -68, -75, -78, -75, -66, -62, -29, -9, -1, 21, 41, 74, 84, 97, 97, 96, 84, 84, 61, 52, 27, 5, -24, -48, -74, -73, -91, -90, -94, -85, -79, -62, -43, -27, 9, 11, 43, 52, 73, 84, 86, 72, 78, 72, 64, 40, 18, 7, -17, -40, -50, -60, -84, -80, -76, -74, -69, -52, -27, -11, 6, 19, 42, 62, 79, 79, 98, 88, 89, 74, 68, 43, 16, -5, -17, -44, -65, -73, -88, -96, -99, -83, -72, -49, -31, -6, 6, 34, 50, 69, 75, 89, 92, 94, 84, 85, 61, 54, 19, 10, -5, -20, -45, -55, -64, -72, -74, -70, -54, -36, -33, -20, -4, 21, 37, 57, 78, 83, 91, 81, 81, 62, 48, 42, 7, -4, -25, -53, -50, -70, -73, -77, -85, -72, -66, -48, -33, -13, 6, 33, 45, 56, 75, 80, 82, 87, 84, 63, 48, 38, 29, 2, -17, -40, -43, -51, -75, -71, -79, -79, -62, -48, -28, -16, -1, 19, 28, 48, 61, 74, 69, 77, 65, 65, 45, 38, 34, 1, -21, -39, -53, -60, -72, -75, -81, -61, -62, -50, -28, -10, 12, 24, 46, 64, 65, 75, 80, 70, 72, 69, 50, 24, 17, 1, -10, -37, -47, -61, -66, -66, -65, -56, -50, -51, -33, -12, 0, 31, 47, 48, 76, 75, 85, 87, 72, 62, 44, 34, 20, -3, -24, -44, -42, -67, -76, -68, -73, -73, -65, -46, -31, -23, 2, 20, 34, 46, 56, 65, 73, 75, 58, 57, 47, 34, 6, -9, -26, -35, -51, -51, -59, -59, -60, -62, -51, -43, -22, -7, 17, 34, 48, 59, 57, 76, 74, 72, 70, 58, 47, 23, 15, -19]
5620a9pj9j6kj8QkJ3QLL1J1OK4J4J9nJ5J5j0lj5rrj7k0j3%l0j0Jj6J7%%K1K0J1
5658cJ2K3J7PKJ4Jnj1j2j2rk9rj5j7j8j1kMKMRJ8OL4J4K2J3RNJ5qpkj5rqj9j2
5698bj3j4j0j8PnnJ0OJ0KK8J5J5NK3MPJ%Jj3j7k6j7j8lk2j2j2LkNJ6%J9J0K0J8
5737A6LK1RRJ1om%j5qk1j6j0j3j9j1knoOMMJ7J1OL6J0J3K7kPJrj0rmj8k3j6mj2
5778c2j8j6mQmJ0J2J0K3J0J3J4POK0rJPpj5nj4lk2k5Qj9j3LnlQJ9JK2QK2J6J2
5817D6NJ7omKj4lj0j7j6oj6k3pj1qMJ1LJ6J5LKL1KJ4J1J4okJ7k2Ok2j1j1k1j0
5855b7kj2Pj1pQjJ9nJ1K7J2OJ8PlQOplj1j6j4j4j8j2j2k0J0lMlJ4J2ORK4qK3J7
5895C9POLmoqJ1k5Pj7j1pk2rlkLj3J1J6JK1J2J5J1POJLJoqjrrj5k4pj5j6J5kj9
$$ y = [-19, -26, -45, -61, -63, -81, -73, -75, -62, -54, -51, -20, -9, -3, 21, 35, 54, 49, 64, 79, 69, 66, 51, 42, 33, 16, -4, -17, -17, -47, -57, -56, -72, -55, -55, -55, -34, -14, -3, 9, 32, 49, 56, 58, 72, 73, 68, 57, 45, 33, 24, -5, -14, -29, -46, -64, -75, -77, -73, -71, -67, -58, -40, -34, 0, 14, 36, 49, 58, 63, 78, 70, 63, 61, 46, 37, 29, 10, -2, -15, -29, -39, -57, -50, -55, -60, -50, -44, -34, -32, -4, 11, 26, 31, 54, 58, 65, 66, 66, 67, 54, 37, 11, -6, -24, -27, -49, -61, -73, -70, -72, -67, -51, -51, -32, -22, -2, 16, 19, 40, 49, 58, 69, 63, 59, 59, 44, 36, 15, -1, -11, -24, -43, -54, -56, -61, -67, -61, -57, -53, -36, -25, -19, 17, 27, 40, 67, 65, 72, 73, 64, 54, 45, 41, 23, 0, -16, -20, -32, -50, -66, -70, -62, -66, -56, -44, -34, -11, -1, 12, 26, 33, 39, 59, 50, 51, 58, 51, 36, 31, 17, 14, -8, -33, -25, -44, -57, -54, -59, -62, -54, -35, -34, -12, -4, 18, 34, 46, 51, 68, 62, 58, 60, 46, 43, 33, 16, 0, -6, -22, -45, -52, -63, -71, -67, -56, -53, -37, -22, -19, -17, 14, 16, 30, 41, 55, 49, 47, 64, 42, 48, 26, 15, 4, -17, -27, -29, -41, -34, -45, -52, -44, -45, -26, -31, -20, 7, 19, 25, 43, 50, 47, 55, 61, 54, 51, 40, 24, 10, -4, -22, -34, -46, -66, -56, -59, -55, -58, -44, -32, -26, -17, 7, -1, 22, 39, 46, 52, 55, 51, 45, 37, 48, 23, 30, 13, 2, -5, -27, -36, -39, -41, -38, -51, -40, -24, -23, -2, 10, 25, 36, 43, 49, 50, 53, 54, 48, 40, 39, 30, 21, 6, -18, -25, -40, -56, -41, -43, -62]
5938f2K1oJ8QJ5J6RJ7KMOK0qoj1rrnj4j6mj3j0LprJ1oOJ6RJ4J5J7KOJ6lJ2j3o
5979D6rj1rj7rqj8mj0J3ljJ1pL1nJ4RQJ3KNRJnLj8nj2pj8j5mJj4%OpPjJ8J0J5
$$ y = [-62, -41, -47, -29, -21, -6, 10, 19, 36, 38, 42, 48, 68, 60, 54, 43, 34, 25, 20, 6, -10, -14, -27, -37, -34, -41, -50, -39, -45, -39, -23, -14, 0, 15, 32, 34, 40, 56, 53, 65, 52, 46, 37, 26, 17, 0, -9, -17, -35, -39, -49, -36, -39, -40, -29, -36, -5, -10, 4, 13, 21, 34, 36, 41, 50, 51, 46, 49, 31, 26, 14, 7, -11, -26, -30, -29, -43, -43, -37, -44, -37, -38, -20, -10, 5]
$$ [...]
8191a
##END NTUPLES=NMR FID
##END=
