##TITLE=1H_ES-AC-MeOH-C2
 
 8 sc, 
 20.1.2022
##JCAMPDX= 6.0         $$ Bruker NMR JCAMP-DX V2.0
##DATA TYPE= NMR FID
##DATA CLASS= NTUPLES
##ORIGIN= UXNMR, Bruker Analytische Messtechnik GmbH
##OWNER= root
$$ XWIN-NMR		Version 3.5
$$ Thu Jan 20 11:08:30 2022 Russian Standard Time (UT+4h)  she@DPX200
##.OBSERVE FREQUENCY= 200.131346
##.OBSERVE NUCLEUS= ^1H
##.DELAY= (6, 6)
##.ACQUISITION MODE= SIMULTANEOUS
##.ACQUISITION SCHEME= undefined
##.AVERAGES= 8
##.DIGITISER RES= 18
##SPECTROMETER/DATA SYSTEM= spect
##.PULSE SEQUENCE= zg30
##.SOLVENT NAME= CDCl3
##.SHIFT REFERENCE= (INTERNAL, CDCl3, 0, 15.7039)
##AUDIT TRAIL= $$ (NUMBER, WHEN, WHO, WHERE, WHAT)
$$ ##TITLE= Audit trail, XWIN-NMR		Version 3.5
$$ ##JCAMPDX= 5.01
$$ ##ORIGIN= Bruker BioSpin GmbH
$$ ##OWNER= she
$$ F:/spectra/data/she/nmr/H-F/1/audita.txt
$$ ##AUDIT TRAIL=  $$ (NUMBER, WHEN, WHO, WHERE, WHAT)
(   1,<2022-01-20 11:07:23.96 +0400>,<she>,<DPX200>,
      <created by zg, POWCHK disabled, PULCHK disabled
       configuration hash MD5:
       00 E9 B6 7A A2 85 ED C7 34 08 36 98 17 FE 4E 26
       data hash MD5: 16K
       E4 E7 1D DE 34 8F 9A 6A 1D 44 EB FB DA 0D 2F 61>)
$$ ##END=
$$ 
$$ hash MD5
$$ 35 D3 66 83 F9 84 CD 0F B5 27 F1 AC B2 D4 10 44
##$RELAX= 
##$RELAX= 
##$RELAX= 
##$RELAX= 
##$RELAX= 
##$RELAX= 
$$ Bruker specific parameters
$$ --------------------------
##$DU= <F:/spectra>
##$EXPNO= 1
##$NAME= <H-F>
##$PROCNO= 1
##$TYPE= <nmr>
##$USER= <she>
##$AMP= (0..31)
100 100 100 100 100 100 100 100 100 100 100 100 100 100 100 100 100 100 
100 100 100 100 100 100 100 100 100 100 100 100 100 100 
##$AQSEQ= 0
##$AQ_mod= 1
##$AUNM= <au_zg>
##$AUTOPOS= <>
##$BF1= 200.13
##$BF2= 200.13
##$BF3= 200.13
##$BF4= 200.13
##$BF5= 200.13
##$BF6= 200.13
##$BF7= 200.13
##$BF8= 200.13
##$BYTORDA= 1
##$CFDGTYP= 0
##$CFRGTYP= 5
##$CHEMSTR= <none>
##$CNST= (0..31)
1 1 145 1 1 1 1 1 1 1 1 1 1 1 1 1 1 1 1 1 1 1 1 1 1 1 1 1 1 1 1 1 
##$CPDPRG= <>
##$CPDPRG1= <>
##$CPDPRG2= <>
##$CPDPRG3= <>
##$CPDPRG4= <mlev>
##$CPDPRG5= <mlev>
##$CPDPRG6= <mlev>
##$CPDPRG7= <mlev>
##$CPDPRG8= <mlev>
##$CPDPRGB= <>
##$CPDPRGT= <>
##$D= (0..31)
0 1.2 0 0 0 0 0 0 0 0.06 0 0.03 0 0 0 0 0.0002 0 0 0 0 0 0 0 0 0 0 0 0 
0 0 0 
##$DATE= 1642662443
##$DBL= (0..7)
120 120 120 120 120 120 120 120 
##$DBP= (0..7)
150 150 150 150 150 150 150 150 
##$DBP07= 0
##$DBPNAM0= <>
##$DBPNAM1= <>
##$DBPNAM2= <>
##$DBPNAM3= <>
##$DBPNAM4= <>
##$DBPNAM5= <>
##$DBPNAM6= <>
##$DBPNAM7= <>
##$DBPOAL= (0..7)
0.5 0.5 0.5 0.5 0.5 0.5 0.5 0.5 
##$DBPOFFS= (0..7)
0 0 0 0 0 0 0 0 
##$DE= 6
##$DECBNUC= <off>
##$DECIM= 32
##$DECNUC= <off>
##$DECSTAT= 4
##$DIGMOD= 1
##$DIGTYP= 9
##$DL= (0..7)
0 120 120 120 120 120 120 120 
##$DP= (0..7)
150 150 150 150 150 150 150 150 
##$DP07= 0
##$DPNAME0= <>
##$DPNAME1= <>
##$DPNAME2= <>
##$DPNAME3= <>
##$DPNAME4= <>
##$DPNAME5= <>
##$DPNAME6= <>
##$DPNAME7= <>
##$DPOAL= (0..7)
0.5 0.5 0.5 0.5 0.5 0.5 0.5 0.5 
##$DPOFFS= (0..7)
0 0 0 0 0 0 0 0 
##$DQDMODE= 0
##$DR= 18
##$DS= 0
##$DSLIST= <SSSSSSSSSSSSSSS>
$$ [...]
##$SUBNAM2= <"">
##$SUBNAM3= <"">
##$SUBNAM4= <"">
##$SUBNAM5= <"">
##$SUBNAM6= <"">
##$SUBNAM7= <"">
##$SUBNAM8= <"">
##$SUBNAM9= <"">
##$SW= 18.0517287032376
##$SWIBOX= (0..15)
0 0 2 0 0 0 0 0 0 0 0 0 0 0 0 0 
##$SW_h= 3612.71676300578
##$TD= 16384
##$TD0= 1
##$TE= 0
##$TE2= 300
##$TE3= 300
##$TEG= 300
##$TL= (0..7)
0 120 120 120 120 120 120 120 
##$TP= (0..7)
150 150 150 150 150 150 150 150 
##$TP07= 0
##$TPNAME0= <>
##$TPNAME1= <>
##$TPNAME2= <>
##$TPNAME3= <>
##$TPNAME4= <>
##$TPNAME5= <>
##$TPNAME6= <>
##$TPNAME7= <>
##$TPOAL= (0..7)
0.5 0.5 0.5 0.5 0.5 0.5 0.5 0.5 
##$TPOFFS= (0..7)
0 0 0 0 0 0 0 0 
##$TUNHIN= 0
##$TUNHOUT= 0
##$TUNXOUT= 0
##$USERA1= <user>
##$USERA2= <user>
##$USERA3= <user>
##$USERA4= <user>
##$USERA5= <user>
##$V9= 5
##$VALIST= <valist>
##$VCLIST= <CCCCCCCCCCCCCCC>
##$VD= 0
##$VDLIST= <DDDDDDDDDDDDDDD>
##$VPLIST= <PPPPPPPPPPPPPPP>
##$VTLIST= <TTTTTTTTTTTTTTT>
##$WBST= 1024
##$WBSW= 4
##$XGAIN= (0..3)
0 0 0 0 
##$XL= 0
##$YL= 0
##$YMAX_a= 257340
##$YMIN_a= -261017
##$ZGOPTNS= <>
##$ZL1= 120
##$ZL2= 120
##$ZL3= 120
##$ZL4= 120
##$ABSF1= 10
##$ABSF2= 0
##$ABSG= 5
##$ABSL= 3
##$ALPHA= 0
##$AQORDER= 0
##$ASSFAC= 0
##$ASSFACI= 0
##$ASSFACX= 0
##$ASSWID= 0
##$AUNMP= <proc_1d>
##$AZFE= 0.1
##$AZFW= 0.1
##$BCFW= 1
##$BC_mod= 2
##$BYTORDP= 1
##$COROFFS= 0
##$CY= 11.3945322036743
##$DATMOD= 1
##$DC= 2
##$DFILT= <>
##$DTYPP= 0
##$F1P= 2.36226072786647
##$F2P= -0.459571619588291
##$FCOR= 0.5
##$FTSIZE= 0
##$FT_mod= 4
##$GAMMA= 1
##$GB= 0.15
##$INTBC= 1
##$INTSCL= 1
##$ISEN= 128
##$LB= 0.24
##$LEV0= 0
##$LPBIN= 0
##$MAXI= 10000
##$MC2= 0
##$MEAN= 0
##$ME_mod= 0
##$MI= 1.114404
##$NCOEF= 0
##$NC_proc= 0
##$NLEV= 6
##$NOISF1= 3.799351
##$NOISF2= 2.8
##$NSP= 1
##$NTH_PI= 0
##$NZP= 0
##$OFFSET= 15.70392
##$PC= 1
##$PHC0= -15951.22
##$PHC1= 11.80078
##$PH_mod= 1
##$PKNL= yes
##$PPARMOD= 0
##$PSCAL= 0
##$PSIGN= 0
##$REVERSE= no
##$SF= 200.130013532006
##$SI= 16384
##$SIGF1= 3
##$SIGF2= 2
##$SINO= 400
##$SIOLD= 16384
##$SREGLST= <1H.CDCl3>
##$SSB= 0
##$STSI= 0
##$STSR= 0
##$SW_p= 3612.71676300578
##$SYMM= 0
##$S_DEV= 0
##$TDeff= 0
##$TDoff= 0
##$TI= <>
##$TILT= no
##$TM1= 0
##$TM2= 0
##$TOPLEV= 0
##$USERP1= <user>
##$USERP2= <user>
##$USERP3= <user>
##$USERP4= <user>
##$USERP5= <user>
##$WDW= 1
##$XDIM= 8192
##$YMAX_p= 0
##$YMIN_p= 0
$$ End of Bruker specific parameters
$$ ---------------------------------
##NTUPLES= NMR FID
##VAR_NAME=  TIME,          FID/REAL,        FID/IMAG
##SYMBOL=    X,             R,               I
##VAR_TYPE=  INDEPENDENT,   DEPENDENT,       DEPENDENT
##VAR_FORM=  AFFN,          ASDF,            ASDF
##VAR_DIM=   8192,          8192,            8192
##UNITS=     SECONDS,       ARBITRARY UNITS, ARBITRARY UNITS
##FACTOR=    0.0002768,     1,               1
##FIRST=     0,             0,               0
##LAST=      2.2672688,     0,               0
##MIN=       0,             -261017,         0
##MAX=       2.2672688,     257340,          0
$$ Real data points
##PAGE= N=1
##DATA TABLE= (X++(R..R)), XYDATA
$$ [...]
$$ plain form
914 6434 8683 -1624 -9555 -3641 7534 7793 -3253 -9560 -2001 8452 6626 -4805 -9242 -254
928 -254 9059 5191 -6185 -8519 1501 9283 3583 -7235 -7479 3096 9084 1901 -7924 -6186 4448
943 4448 8530 263 -8241 -4743 5544 7702 -1252 -8253 -3245 6372 6688 -2648 -8052 -1757 7030
958 7030 5562 -3962 -7698 -226 7555 4340 -5211 -7186 1318 7946 2987 -6379 -6489 2889 8121
973 8121 1510 -7373 -5563 4414 8043 -33 -8124 -4409 5762 7618 -1571 -8508 -3105 6804 6885
988 6885 -2979 -8491 -1723 7506 5904 -4155 -8151 -403 7838 4772 -5097 -7543 828 7907 3587
1003 3587 -5799 -6753 1962 7741 2357 -6348 -5823 3041 7435 1090 -6765 -4782 4073 6978 -254
1018 -254 -7068 -3586 5077 6332 -1627 -7194 -2239 5981 5466 -3015 -7066 -786 6644 4383 -4270
$$ packed form
914F434K249j0307p931N914J1175K59j1046o307P559J0453j826j1431m437Q988
928b54R313l868j1376k334J0020P782n700j0818k44J0575N988p183r825J738J0634
943D448M082q267q504L498J0287K158q954p001N008R617L16r336n404O295Q787
958G030j468r524l736P472P781l215r551j975Q504O628m959r366j10R378N232
973H121o611q883J810R977L629q076q091L715J0171J856r189o937N403R909Q1
988F885r864n512O768R229j602j0059l996P748Q241l066r869k446Q371P079m320
1003C587r386r54Q715N779n384q705N25Q864M394o345p855J983Q855K905p232
1018b54o814L482Q663J255p959n567M955Q220n15q481m051O280P430k261q653
$$ plain form
1033 -4270 -6675 670 7030 3142 -5304 -5988 2045 7073 1798 -6056 -5085 3225 6804 517 -6484
1048 -6484 -4077 4211 6338 -700 -6686 -2989 4983 5736 -1805 -6702 -1903 5636 5007 -2855 -6580
1063 -6580 -775 6168 4201 -3864 -6337 397 6594 3245 -4845 -5918 1619 6856 2142 -5707 -5293
1078 -5293 2836 6887 953 -6374 -4454 3939 6613 -292 -6758 -3433 4829 6068 -1453 -6820 -2330
1093 -2330 5448 5314 -2457 -6577 -1218 5804 4406 -3281 -6131 -161 5941 3443 -3944 -5551 849
1108 849 5917 2419 -4509 -4829 1819 5794 1353 -5010 -4046 2800 5541 207 -5418 -3130 3739 5145
1124 5145 -984 -5702 -2070 4616 4565 -2193 -5789 -925 5318 3803 -3301 -5610 245 5760 2895
1139 2895 -4213 -5205 1372 5941 1904 -4887 -4576 2338 5856 928 -5304 -3851 3139 5560 -16
$$ packed form
1033d270k405P345O360l888q446o84Q033N028n275p854R71Q310L579o287p001
1048f484K407Q288K127p038n986L697P972P53p541m897M799P539o29p862l725
1063f580N805O943j967q065k473O734O197l349q090j073P537N237m714p849M14
1078e293Q129M051n934p327J920Q393K674o905o466L325Q262J239p521n367M490
1093b330P778j34p771m120N359P022j398p687k850N970O102k498p387j607O400
1108H49N068l498o928l20O648L975m441o363R64O846K741n334n625K288O869J406
1124E145o129m718L632O686n1o758l596M864O243j515p104k309N855N515k865
1139B895p108r92O577M569m037o791L11O914L518m928o232J453O990K421n576
$$ plain form
1154 -16 -5512 -3047 3781 5140 -884 -5597 -2225 4305 4606 -1717 -5540 -1355 4758 3981 -2555 -5387
1170 -5387 -422 5147 3246 -3370 -5101 578 5401 2365 -4130 -4616 1601 5485 1381 -4735 -3942
1185 -3942 2554 5328 352 -5112 -3126 3376 4945 -645 -5246 -2202 3988 4384 -1522 -5142 -1306
1200 -1306 4368 3677 -2271 -4874 -430 4579 2940 -2902 -4499 412 4660 2155 -3455 -4016 1230
1215 1230 4669 1337 -3939 -3466 2040 4592 446 -4369 -2822 2878 4401 -494 -4702 -2043 3635
1230 3635 4050 -1459 -4870 -1171 4268 3513 -2369 -4818 -260 4705 2865 -3131 -4564 613 4901
1245 4901 2102 -3694 -4127 1376 4879 1348 -4077 -3599 2021 4688 614 -4279 -3008 2550 4380
1260 4380 -70 -4374 -2356 3017 4010 -762 -4405 -1656 3456 3544 -1490 -4335 -880 3848 2995 -2216
$$ packed form
1154a6n496K465O828J359o024m713L372O530L01o323l823M185O113p77o536k832
1170e387M965N569j901o616j731N679M823l036o495m86O217L884m104o116P93
1185c942O496K774m976n464J986O502J569n590m601L044O190L96n906l620L836
1200a306N674o91n948k603M444N009j639n842j597M911M248k505n610n61N246
1215A230L439l332n276M73N506K552m146m815J547N700J523m895m208K659N678
1230C635M15n509l411L699N439p55n882k449M558M965j840n996j433N177M288
1245D901k799n796m33N503L503l531n425M78N620K667m074m893J271N558J830
1260D380m450m304K018N373R93m772l643K749N112Q8n034k845L455M728q53n211
$$ plain form
1276 -2216 -4181 -40 4162 2306 -2906 -3865 835 4331 1514 -3504 -3388 1680 4302 664 -3923
1291 -3923 -2792 2397 4092 -158 -4149 -2111 2966 3713 -894 -4186 -1418 3360 3249 -1530 -4058
1306 -4058 -736 3622 2741 -2071 -3846 -66 3788 2171 -2563 -3565 587 3887 1572 -3021 -3192
1321 -3192 1276 3906 865 -3440 -2738 1963 3846 125 -3787 -2181 2629 3615 -671 -4010 -1512
1336 -1512 3196 3247 -1426 -4024 -783 3616 2765 -2084 -3906 -86 3823 2185 -2584 -3603 572 3885
1352 3885 1605 -2934 -3196 1109 3777 1013 -3147 -2743 1580 3595 440 -3301 -2251 2023 3350
1367 3350 -141 -3402 -1709 2445 3045 -752 -3436 -1113 2838 2642 -1413 -3397 -423 3165 2126
1382 2126 -2035 -3235 296 3407 1529 -2599 -2931 1017 3487 875 -3020 -2506 1647 3408 217
$$ packed form
1276b216j965M141M202j856n212r59M700L496k817n018J16N068K622l638m587
1291c923J131N189J695m250l991K038N077P47m607l292K768M778j11m779k528
1306d058L322M358q81m812j775L780L854j617m734j002M152L300k315m593j71
1321c192M468K630l041m305P02M701J883l721l912J606M810R86m286l339K498
1336a512M708N1m673k598L241M399q51m849j822L820L909j638m769j019M175L313
1352C885k280m539k62M305K668k764m160M04M323K015l155l741J050M274J327
1367C350l491l261J693M154O00l797k684K323L951j96m055j984K974L588j039
1382B126m161j200L531L111j878m128l32L948K470k612l895N14M153J761l191
$$ plain form
1397 217 -3256 -2019 2146 3182 -369 -3347 -1483 2502 2873 -873 -3325 -967 2752 2508 -1320 -3211
1413 -3211 -471 2928 2102 -1736 -3058 48 3065 1659 -2142 -2821 597 3142 1137 -2538 -2524 1158
1429 1158 3156 545 -2879 -2111 1736 3070 -81 -3116 -1596 2251 2843 -704 -3213 -1025 2650
1444 2650 2492 -1257 -3158 -474 2888 2076 -1712 -2984 55 2988 1609 -2041 -2720 503 2968 1145
1460 1145 -2281 -2393 926 2885 689 -2460 -2052 1304 2757 221 -2624 -1648 1703 2576 -283 -2724
1476 -2724 -1181 2097 2319 -837 -2774 -645 2458 1981 -1381 -2718 -39 2722 1534 -1896 -2544 549
1492 549 2854 1016 -2293 -2274 1070 2861 516 -2570 -1920 1496 2744 29 -2695 -1541 1825 2543
1508 2543 -384 -2729 -1137 2062 2291 -751 -2689 -751 2248 2001 -1111 -2601 -330 2413 1679 -1467
$$ packed form
1397B17l473J237M165J036l551k978J864L985L71l746k452K358L719k44l828j891
1413c211K740L399q26l838j322L106L017j406l801o79L418K545k005l675J4L682
1429A158J998k611l424P68L847J334l151l035J520L847N92l547k509K188L675
1444B650j58l749j901K684L362q12l788j272L039K933j379l650o79L223K465j823
1460A145l426j12L319J959k196l149M08L356J453k536k845R76L351Q73k859k441
1476b724J543L278K22l156j937K129L103m77l362j337K679K761j188l430o48L093
1492E49K305j838l309J9L344J791k345l086O50L416J248k715k724J154L366P18
1508B543k927k345J592L199K29l042j938J938K999k47l112j490K271K743p34l146
$$ plain form
1524 -1467 -2466 121 2542 1286 -1830 -2261 615 2613 789 -2158 -1956 1132 2581 274 -2425 -1577
1540 -1577 1587 2435 -275 -2567 -1115 1951 2184 -768 -2596 -661 2208 1868 -1173 -2496 -225 2343
1556 2343 1506 -1473 -2313 178 2401 1159 -1708 -2095 527 2387 805 -1902 -1833 882 2332 429
1572 429 -2066 -1540 1224 2233 3 -2217 -1202 1587 2063 -458 -2315 -770 1912 1817 -940 -2327
1588 -2327 -308 2181 1475 -1383 -2226 173 2334 1097 -1740 -2045 615 2384 690 -1982 -1792 983
1604 983 2319 314 -2105 -1480 1272 2170 -15 -2144 -1174 1486 2005 -323 -2149 -871 1655 1803
1620 1803 -637 -2122 -527 1810 1545 -950 -2046 -157 1959 1216 -1285 -1917 249 2056 845 -1603
1636 -1603 -1712 692 2080 418 -1859 -1419 1115 2009 -20 -2013 -1066 1458 1858 -434 -2083 -701
$$ packed form
1524a467r99K587K421j256l116m31K876J998j824k947K02L088J449k307k699Q48
1540a577L164Q48k710k292J452L066K33k952j828J935K869l40l041j323K271K568
1556B343q37k979q40K491K223j242k867l87K622J860j582k707O9K715J450j903
1572D29k495N26K764J009k230k220J015K789M76k521j857J545K682r5k757j387
1588b327K019K489p06k858q43K399K161j237k837l05K660J769j694k672J90K775
1604I83J336k005k419O25K752Q98k185k129R70K660N19k328j826J278K526J48
1620A803k440j485J595K337k65k495j096J889K116p43k501o32K166J807j211k448
1636a603j09K404J388j662k277M40K534Q94k029j993R47K524M00k292j649J382
$$ plain form
1652 -701 1706 1654 -780 -2034 -348 1841 1390 -1040 -1940 -34 1907 1118 -1249 -1803 235 1927 842
1669 842 -1445 -1634 526 1922 548 -1596 -1449 812 1875 220 -1756 -1162 1118 1779 -163 -1867
1685 -1867 -842 1435 1621 -551 -1903 -459 1674 1374 -934 -1871 -63 1844 1069 -1255 -1731 320
1701 320 1919 759 -1481 -1552 626 1892 442 -1622 -1329 873 1809 152 -1694 -1098 1058 1688 -114
1718 -114 -1747 -875 1237 1540 -363 -1737 -596 1399 1371 -644 -1712 -276 1559 1142 -938 -1639 72
1735 72 1688 858 -1238 -1506 450 1759 505 -1472 -1293 803 1740 146 -1661 -1026 1105 1635 -198
1752 -198 -1735 -737 1326 1481 -502 -1750 -483 1464 1292 -725 -1689 -239 1534 1091 -909 -1596 -1
1769 -1 1575 882 -1059 -1466 241 1591 666 -1210 -1308 490 1597 390 -1373 -1112 774 1545 78
$$ packed form
1652g01K407n2k434j254J686K189m51k430r00J906J941p89k367n54K038J692j085
1669H42k287j89K160J396j374k144J47K261J063j655j976N94K280O61j942j704
1685a867J025K277J86k172j352J444K133l00k308r37J808J907p75k324m76K051
1701C20J599j160k240p1K178J266j450k064K93K202R36j657j846N96K156O30j802
1718a14j633Q72K112L03j903j374J141J995k8k015j068J436J835m17k080p01J711
1735G2J616q30k096k68J956J309j254j977J79K096R37j594j807O35K131N30j833
1752a98j537R98K063J55j983j248J267J947j72k017r64J450J773m43k000o87J595
1769aJ576o93j941m07J707J350r25j876r8J798J107j207j763K61J886P71j467
$$ plain form
1786 78 -1496 -865 1049 1422 -282 -1565 -553 1287 1236 -617 -1567 -223 1450 1005 -905 -1488 96
1803 96 1534 756 -1122 -1362 349 1546 521 -1258 -1193 573 1517 292 -1326 -1033 753 1455 82
1820 82 -1387 -852 903 1368 -115 -1404 -651 1048 1254 -354 -1433 -419 1206 1082 -603 -1401 -154
1837 -154 1331 848 -883 -1317 158 1404 601 -1105 -1185 454 1420 310 -1255 -981 715 1382 43
1854 43 -1338 -753 933 1280 -197 -1359 -535 1050 1143 -388 -1334 -354 1136 1002 -544 -1286 -162 1189
1872 1189 855 -697 -1213 19 1225 667 -840 -1139 214 1244 446 -1008 -1008 458 1245 213 -1145
1889 -1145 -807 709 1190 -71 -1234 -582 938 1090 -355 -1259 -304 1114 925 -593 -1229 -59 1213
1906 1213 750 -781 -1166 140 1249 569 -914 -1068 311 1244 400 -989 -932 448 1193 238 -1040
$$ packed form
1786G8j574O31J914L73j704j283J012J840n1j853r50J344J673m45j910n83J584
1803I6J438p78j878k40J711J197j025j779O5J766R44j225j618K93J786P02j373
1820H2j469N35J755M65j483j289P53J699K06j608j079J014J625j24j685p98J247
1837a54J485m83j731m34J475J246q03j706q0J639R66j110j565K74J696O67j339
1854D3j381N85J686L47j477j162Q24J585R3j531r46R80J490j34j546p42J124J351
1872A189l34j552n16J232J206n58j507k99J353J030p98j454%J466P87j032j358
1889a145L38J516M81j261j163O52J520J52j445r04R55J418j89j518o36J170J272
1906A213m63j531l85J306J109o80j483j54J379R33q44j389N7J380P45r55j278
$$ plain form
1923 -1040 -830 578 1151 85 -1100 -692 719 1066 -115 -1141 -502 864 960 -326 -1128 -274 994
1940 994 817 -555 -1087 -10 1101 612 -754 -983 251 1137 369 -918 -852 470 1111 137 -1015 -686
1958 -686 647 1049 -65 -1069 -526 762 959 -222 -1074 -385 853 869 -366 -1049 -245 915 763 -470
1976 -470 -1018 -88 977 639 -607 -967 83 1019 475 -732 -865 284 1073 292 -878 -743 496 1027
1994 1027 63 -974 -558 691 953 -173 -1031 -368 840 831 -377 -1033 -180 922 693 -539 -980 -9
2012 -9 960 559 -648 -910 139 982 425 -726 -815 278 974 302 -780 -720 374 950 171 -826 -615
2031 -615 497 891 19 -875 -476 629 822 -182 -902 -288 764 703 -375 -888 -83 855 542 -564
2049 -564 -832 124 902 357 -717 -746 315 915 179 -827 -627 477 895 37 -865 -510 586 845 -91
$$ packed form
1923a040K10J408N73j066j185M08J411L47j181j026O39J366R6j286q02Q54J268
1940I94j77j372n32J077J111m89j366k29J234Q86p68j287O6J322O41r74j152L29
1958f86J333M02j114j004N43J288J97j181q52O89J238J6j235o83Q04J160j52j233
1976d70n48R30J065l38j246l60J050R36n44j207j33J149P89p81j170J35J239N31
1994A027r64j037M16J249K62j126q58O63J208rj208o56Q53J102k29j232m41R71
2012iR69m01j207k62J049Q43n57j151q9J093O96o72j082O0J094N76p79r97K11
2031f15J112L94q72q94L99J105J93j004p20O14J052o1j078n13Q05R38l13j106
2049e64k68R56P78n45j074k9J061O00p36j006K00J104M18q58r02L55J096K59r36
$$ plain form
2068 -91 -892 -387 666 773 -200 -874 -285 725 713 -309 -861 -169 786 622 -425 -836 -32 840 494
2087 494 -543 -785 131 861 330 -678 -677 316 856 140 -781 -552 493 817 -60 -818 -381 636 734 -223
2107 -223 -818 -209 731 619 -363 -813 -60 788 515 -465 -752 65 797 420 -540 -711 151 798 308 -608
2127 -608 -654 260 792 199 -681 -568 360 771 63 -743 -451 484 721 -94 -767 -305 609 635 -258 -766 -131
2148 -131 711 522 -426 -731 49 779 387 -550 -657 217 793 228 -638 -567 348 785 106 -704 -483 430
2168 430 735 -9 -732 -403 500 672 -100 -735 -315 546 635 -188 -733 -229 618 567 -282 -710 -96 667 474
2189 474 -396 -674 46 702 343 -512 -587 215 709 166 -608 -472 375 680 9 -663 -355 481 628 -141
2209 -141 -692 -217 563 525 -259 -675 -95 616 443 -361 -649 -8 629 366 -417 -611 78 657 291 -473
$$ packed form
2068i1q01N05J053J07r73o74N89J010j2j022n52O92R55j64j047m11Q04Q72l46
2087D94j037k42R16P30n31j008JR93N40p16r21K29J045L24q77p58M37J017R8r57
2107b23n95O09R40j12r82m50P53Q48k73r80k87Q17P32l77r60j71Q62O47m90r16
2127f08m6R14N32n93q80J13R28M11p08q06K92R35K37q15o73M62R14K6q93n08O35
2148a31Q42j89r48l05P80P30l92r37j07Q74N76n65q66P1R15M37o79q10K21R13
2168D30L05p44p23L29R03J72p72o35M20Q61Q9q23n45N04Q47n1q49m28O14P63j93
2189D74q70k78P20O56l59q55p5Q02M94n43p74J36Q47L05o71o72L08Q36J47p69
2209a41n51M75P80l8p84m16N80P11j73q04k88O41O37k63p83j94O89N79l66p64
$$ plain form
2229 -473 -561 157 659 217 -524 -492 258 664 117 -570 -411 368 622 -16 -615 -294 473 559 -165 -625 -162
2250 -162 555 458 -306 -616 -14 611 340 -425 -564 128 623 221 -506 -490 228 620 118 -542 -424 305 602
2271 602 36 -567 -354 373 583 -17 -561 -272 425 532 -97 -571 -199 472 481 -187 -571 -120 512 406 -282
2292 -282 -545 1 552 284 -386 -499 117 565 164 -481 -419 241 549 28 -533 -314 368 513 -81 -556
2312 -556 -199 441 456 -187 -537 -93 487 404 -253 -527 -20 522 356 -305 -496 26 540 290 -347 -478 90
2333 90 532 217 -411 -440 161 540 136 -463 -375 244 516 29 -499 -298 331 476 -80 -517 -172 419 416 -204
2355 -204 -509 -46 486 309 -300 -461 64 499 230 -364 -404 160 503 142 -418 -366 223 505 70 -440 -314
2376 -314 258 461 13 -450 -279 298 444 -61 -469 -228 329 402 -117 -483 -139 398 354 -193 -459 -46 433
$$ packed form
2229d73q8P18N02m42p41L2P50M06n47o87J59P79K54o38n99L21P67Q6p24m60M63
2250a62P17r7p64l10O02O25k71p65j39O92M95m02p27J6P18L92n02o60J18P29K97
2271F02n66o03K13P27K10o00n44K89O97J07o29m74L72O71Ro68l84M51O32j06o88
2292b82k63N46N51k68o70j13O16M48m01o45O2O60L08n21n61K19O82J45n94m75
2312e56L57O40J5o43l50M44N80q3o57k74N07N42j66o61j91N22N14k50o37j31N68
2333I0M42l15o28k9O01L79m04n99Q8O19K72m87n28K01O29J45n56m37L45N91lo20
2355b04l05M63N32j77o09j61N25M35k69n94m0N64L43l61n60N2N89K82m35n10J26
2376c14N72K03m48m63J71N77J46n05m08K41N57P3n19l66L44N37m4n47k66M13M79
$$ plain form
2397 433 272 -279 -416 70 472 188 -357 -350 183 453 80 -399 -270 271 435 -35 -437 -194 341 392 -116
2418 -116 -442 -127 366 332 -174 -428 -71 382 298 -220 -416 -32 398 256 -261 -410 26 424 213 -300 -390
2439 -390 83 429 150 -339 -324 168 426 69 -359 -255 249 393 -17 -385 -152 323 339 -118 -397 -67 367
2460 367 271 -217 -374 17 391 184 -278 -339 78 382 126 -327 -317 139 390 81 -339 -270 190 385 38
2481 38 -350 -228 214 368 3 -357 -187 261 345 -55 -367 -144 315 316 -104 -357 -60 342 249 -196 -342 28
2503 28 364 176 -255 -305 119 360 78 -326 -245 189 347 -3 -349 -179 243 312 -78 -355 -133 304 292 -105
2525 -105 -339 -81 310 285 -140 -347 -38 326 243 -173 -322 0 339 204 -207 -316 52 344 156 -258 -291
2546 -291 110 336 81 -307 -232 168 322 -3 -323 -164 241 289 -99 -343 -88 284 233 -169 -325 -5 315
$$ packed form
2397D33j61n51j37M86M02k84n45PN33K70l73m79J29N41J64m70m02K43N35N1n08
2418a16l26L15M93l4n06k54L57M53q4n18j96L84M30j42n17j49M36L98k11n13r0
2439c90M73L46k79m89J5M92K58l57m28J04N04J44m10l68K33M75J6m57k79L30M34
2460C67r6m88j57L91L74k07m62o1M17L04k56m53J0M56K51l09m20O9M60J95l47
2481C8l88J22M42J54l65l60J70M48Q4m00l12K23M59Jm20k53K97M02r3m45j46L70
2503B8L36j88m31n0M24K41k82m04Q1M34J58l50l46J70M22O9l90k77K22M37j2l97
2525a05k34K58L91k5m25k07L09L64q3m16j49L22L39j35m11j09L68K92j88m14l3
2546b91M01K26k55l88P5M00J54l25l20J59M05M8l88k44K55L72n1m02j56L20L20
$$ plain form
2567 315 191 -217 -284 69 343 138 -233 -259 117 335 83 -272 -247 146 332 58 -297 -223 177 312 14
2588 14 -321 -200 208 300 -38 -327 -141 246 267 -89 -328 -89 280 224 -169 -307 -2 296 165 -225 -278 82
2610 82 322 92 -265 -208 160 309 14 -286 -167 201 292 -39 -301 -121 248 266 -85 -304 -85 248 236 -122
2632 -122 -308 -62 275 214 -157 -294 -31 281 184 -185 -288 23 294 146 -213 -260 81 298 87 -246 -201
2653 -201 163 285 18 -278 -150 206 253 -59 -280 -72 253 220 -132 -277 -12 281 171 -177 -246 53 294
2674 294 114 -228 -244 71 271 83 -241 -225 113 275 60 -258 -196 133 283 30 -262 -177 162 278 -9
2695 -9 -258 -120 206 260 -53 -266 -73 251 211 -113 -256 -4 265 157 -169 -219 62 261 85 -226 -195 114
2717 114 257 23 -237 -157 163 235 -37 -254 -120 183 207 -66 -260 -74 217 203 -93 -244 -46 242 191 -110
$$ packed form
2567C15j24m08o7L53K74k05l71k6L76K18k52l55K5L93J86k74l55P4M00J35k98
2588A4l35J21M08R2l38k89J86L87K1l56k39K39L69n6l93j38L05K98j31l90n3L60
2610H2K40k30l57N7L68J49k95l00J19L68R1l31k62J80L69J8l51k19K19L33j2l58
2632a22j86K46L37o1l71j37K63L12r7l69j03L11K71j48l59m7L41K17k11l33M5
2653b01L64J22k67k96J28L56M7l12k21K08L25l3l52j45K65K93j10l48o9K99K41
2674B94j80l42j6L15K00j88l24J6L38J62k15l18O2L29J50k53k92Q5L39J16k87
2695ik49J38L26N4l13k13J93L24m0l24j43K52K69j08l26n0K81J99j76l11L1L09
2717A14J43k34k60Q0L20P2k72k17J34L03K4k73j94J86K91j4k96j51J98K88n1l01
$$ plain form
2739 -110 -238 -8 246 172 -148 -234 34 261 142 -176 -214 77 250 77 -217 -188 111 246 17 -234 -118
2760 -118 160 220 -59 -251 -86 202 184 -118 -248 -18 232 142 -151 -221 24 242 120 -176 -195 75 248 82
2782 82 -178 -176 97 237 56 -203 -164 116 230 29 -212 -140 133 222 -2 -228 -119 162 200 -56 -229 -76
2804 -76 181 163 -104 -220 -13 206 114 -147 -195 61 219 71 -180 -146 123 234 15 -201 -112 159 209 -29
2826 -29 -214 -73 175 197 -69 -214 -54 196 176 -82 -214 -42 195 152 -105 -212 -9 193 125 -130 -205 23
2848 23 203 103 -148 -187 46 201 63 -178 -147 95 207 3 -188 -102 140 194 -37 -198 -52 173 157 -84
2870 -84 -181 -13 195 116 -113 -170 28 195 76 -150 -166 61 185 47 -170 -167 74 180 24 -175 -129 90 178
2893 178 12 -188 -126 101 178 -12 -187 -94 151 175 -41 -179 -48 173 137 -76 -168 -2 186 112 -118 -160 53
$$ packed form
2739a10j28K30K54p4l20q6K68K27j19l18l8K91J73j73k94K9K99J35k29k51J16
2760a18K78O0k79j92J65K88j8l02j30K30K50r0k93p0K45K18j22k96j9K70J73j66
2782H2k60KK73J40j81k59L9K80J14k01k41P2K73Q9k24k26J09K81L8k56j73J53
2804g6K57j8k67j16K07K19r2k61m8K56J58j48k51L4K69J11k19k16Q9K71N0k38
2826b9j85J41K48K2k66j45J60K50k0k58j32J72K37m3k57j07K03K02o8k55p5K28
2848B3J80j00k51l9K33J55j38k41L1K42J12k04j91Q6K42N4k31j61J46K25j6k41
2870h4r7J68K08p9k29n7J98J67j19k26j6K27J24j38k17LK41J06j56j99M6K19Q8
2893A78j66k00O2K27P7j90j75R3K45K4k16j38J31K21l6k13r2J66J88p4k30m2K13
$$ plain form
2916 53 184 66 -158 -133 86 180 7 -177 -112 118 170 -14 -183 -77 136 149 -41 -169 -58 141 129 -68
2938 -68 -167 -42 150 136 -61 -172 -27 158 131 -77 -162 1 179 109 -117 -151 34 174 69 -125 -130 66 167
2961 167 29 -156 -112 103 150 -22 -170 -64 133 115 -70 -153 -15 145 95 -94 -151 4 163 75 -108 -144 40
2984 40 161 60 -142 -128 62 166 47 -128 -113 65 179 30 -138 -111 88 175 11 -157 -91 112 154 -31
3006 -31 -163 -62 130 120 -58 -168 -29 143 97 -95 -156 22 160 58 -119 -125 47 150 29 -126 -93 90
3028 90 140 3 -137 -68 99 138 -17 -140 -51 112 128 -32 -144 -48 118 117 -49 -145 -18 131 112 -74 -147 -15
3052 -15 135 78 -91 -151 12 140 64 -120 -116 48 139 18 -128 -83 97 138 -16 -130 -47 127 117 -39 -130 0
3076 0 137 106 -64 -115 24 137 85 -92 -117 35 144 58 -100 -121 38 134 38 -104 -112 48 127 13 -122 -103 51
$$ packed form
2916E3J31j18k24K5K19R4j73j84O5K30N2j84j69J06K13J3j90j28J11J99j2j97
2938f8r9J25J92j4j97j11J45J85k7k08q5J63J78p0k26l4J85J40j05j94nJ96J01
2961A67j38j85M4K15M7j72j48J06J97j8j85q3J38J60n0j89n7J55J59q8j83l6J84
2984D0J21j01k02J4J90J04j19j75J5J78J14j49j68K7J99Q7j64j68O6K03M2j85
3006c1j32J01J92j0j78j10J39J72m6j92o1J78J38j02j77oJ72J03j21j55L3J83
3028I0N0j37j40O9J67L9j55j23Q9J63J6j60j12R6J66jj66r6J27J49j9j86p3J32
3052a5J50n7j69o0J63J28p6j84MJ64R1j21j46M5J80M1j54j14Q3J74j0j56r1J30
3076@J37l1j70n1J39J13n2j77k5J52J09q6j58k1J59R6r6j42qJ60P9j14j35J9J54
$$ plain form
3101 51 139 15 -126 -81 86 132 0 -128 -53 99 105 -32 -124 -17 120 106 -59 -108 20 133 65 -85 -93 61
3125 61 133 33 -106 -82 64 123 -12 -122 -61 82 98 -26 -122 -56 85 98 -43 -124 -48 99 108 -49 -124 -25 111
3150 111 108 -44 -120 -4 142 88 -64 -100 21 140 55 -95 -89 61 124 28 -106 -59 79 112 -11 -113 -44 105
3174 105 106 -49 -133 -13 122 81 -77 -118 4 105 59 -90 -115 18 122 50 -87 -91 45 126 49 -96 -81 56
3198 56 132 38 -93 -74 69 135 17 -111 -56 92 115 8 -120 -38 110 103 -45 -122 -15 109 75 -73 -108 12
3222 12 120 44 -99 -98 44 115 24 -102 -71 75 121 -2 -115 -60 98 111 -17 -107 -29 113 113 -26 -106 -25 113
3247 113 111 -41 -106 -16 124 100 -56 -116 -5 113 72 -88 -118 18 120 41 -109 -101 38 108 12 -112 -80 66 104
3272 104 -4 -113 -42 94 100 -32 -104 -8 110 80 -47 -101 19 119 56 -72 -94 38 116 50 -71 -87 39 118
$$ packed form
3101E1Q8j24j41M5J67M6j32j28P5J52Oj37r2J07J37j4j65m9J28J13o8j50qJ54
3125F1P2j00j39K4J46N9j35j10O1J43J6j24r6O6J41J3j41q1P6J47Rj57p5R9J36
3150A11lj52p6J16J46n4j52l6J21J19q5j50OJ50O3r6j34M7J38L3j23j02O9J49
3174A05Jj55q4J20J35m1j58m1J22J01m6j49k5J33J04p2j37mJ36Q1p7j45J5J37
3198E6P6r4j31J9J43O6j18j28N5J48K3j07j28Q2J48pj48p7J07J24l4j48l5J20
3222A2J08p6j43JJ42P1r1j26L1J46M6j23j13N5J58J3j28r0P8J42%j39q0Q1J38
3247A13kj52o5R0J40k4j56o0J11J18m1j60l0J36J02p9j50QJ39P0r6j24L2J46L8
3272A04j08j09P1J36Oj32p2R6J18l0j27n4J20J00o3j28k2J32P8o6j21j6J26P9
$$ plain form
3296 118 37 -97 -94 38 116 19 -109 -84 54 103 0 -107 -62 79 109 -26 -108 -39 101 92 -50 -104 -3 112 84
3321 84 -71 -92 36 133 54 -89 -80 60 123 25 -99 -50 74 123 -9 -106 -37 90 96 -28 -114 -36 90 91 -41 -116
3347 -116 -40 88 81 -48 -99 -17 94 68 -65 -109 -2 108 70 -66 -91 30 127 40 -90 -80 57 113 28 -87 -49
3372 -49 81 109 -13 -109 -28 94 82 -47 -106 0 101 59 -63 -99 5 92 39 -82 -91 30 107 35 -86 -81 38
3397 38 98 28 -92 -79 55 112 23 -97 -63 71 101 11 -82 -36 91 106 -6 -90 -26 94 95 -37 -107 -7 92 50
3423 50 -67 -87 13 103 29 -96 -78 29 94 -3 -102 -67 55 97 -6 -106 -42 82 82 -27 -94 -21 84 86 -25 -90
3449 -90 -16 95 88 -38 -88 3 103 77 -50 -83 9 99 63 -61 -94 31 93 35 -87 -71 44 87 7 -103 -61 58
3475 58 88 -29 -94 -36 75 79 -47 -91 -10 94 69 -47 -84 17 100 45 -63 -75 36 95 35 -64 -66 46 110 26 -82
$$ packed form
3296A18q1j34LJ32P8r7j28K5J38M9j03j07M5J41L0j35q2O9J40rj42n4J01J15k8
3321H4j55k1J28R7p9j43RJ40O3r8j24M9J24M9j32r7O9J27Oj24q6P8J26Jj32p5
3347a16P6J28pj29n1Q2J11k6j33m4J07J10l8j36k5J21R7q7j30J0J37N6q5j15L8
3372d9J30K8j22r6Q1J22j2j29n9J06J01m2j22l6J04Q7n3j21rJ21P7p2j21NJ19
3397C8O0p0j20J3J34N7q9j20L4J34L0r0r3M6J27J5j12q4O4J20Jj32p0J00R9m2
3423E0j17k0J00R0p4j25J8J07O5r7r9L5J22M2j03j00O4J24%j09o7P3J05Kj11o5
3449i0P4J11pj26n0R1J00k6j27l3R2R0l6j24l3J25O2n8j22J6J15M3q0j10M2J19
3475E8L0j17o5N8J11Mj26m4Q1J04k5j16l7J01Q3n5j08j2J11N9o0r9kJ12O4q4j08
$$ plain form
3502 -82 -68 40 87 18 -79 -53 53 86 -8 -98 -56 63 85 -16 -103 -38 76 71 -43 -89 -14 79 58 -59 -84 28 109
3529 109 39 -67 -75 38 97 12 -80 -51 65 104 9 -79 -34 66 89 -12 -84 -27 76 78 -31 -99 -24 63 64 -43 -92
3556 -92 -20 77 52 -62 -89 -14 80 44 -63 -81 4 95 38 -71 -72 31 96 27 -80 -48 63 98 0 -77 -33 77 80 -29
3584 -29 -79 -7 96 55 -51 -79 0 88 45 -68 -82 12 81 25 -80 -68 17 94 34 -74 -63 29 93 32 -66 -61 49 98
3612 98 24 -78 -49 67 90 2 -77 -25 86 86 -20 -77 -10 84 64 -30 -76 18 84 40 -70 -72 28 85 10 -85 -54 38
3640 38 81 -8 -94 -57 55 83 -17 -89 -42 70 77 -18 -78 -25 76 78 -13 -72 -4 80 71 -26 -76 5 98 69 -43 -75 15
3669 15 88 38 -65 -71 31 88 2 -91 -55 49 82 -19 -79 -45 60 63 -33 -84 -28 65 61 -40 -97 5 84 59 -63 -73
3697 -73 12 89 54 -57 -69 33 101 42 -50 -63 37 101 27 -68 -59 52 95 7 -69 -59 50 71 -17 -94 -47 56 69 -36
$$ packed form
3502h2J4J08M7o9r7K6J06L3r4r0M2J19K2j01q7O5J14nj14m6P5R3k1j17k5J12Q1
3529A09p0j06qJ13N9q5r2K9J16L9r5q8M5J00K3j01p2N7J03Kj09o8P5Q7Jj07m9
3556i2P2R7k5j14k7P5R4l6j07j8Q5R1n7j09jJ03O5o9j07L2J11L5r8p7M4J10Lj09
3584b9n0P2J03m1j06k8P9Q8m3j13j4R4O9n6j05J2Q5P7o0j08J1R2O4o1r8NJ10M9
3612I8p4j02K9J16K3q8p9N2J11%j06n7O7R4k0r4m6R4O6m4j10kJ00N7p5r5L1R2
3640C8M3q9q6L7J12K8j00p2M7J12Pr5o0N3J01Kr1n9O8Q4rr7n0Q1R3k9j12l2R0
3669A5P3n0j03oJ02N7q6r3L6J04L3j01o0L4J05Lr6n1N6R3mj01n7J02P9k5j22j0
3697g3Q5P7l5j11j2J02O8n9r2j3J00O4p4r5RJ11M3q8p6J0J09K1q8p7M7J03J3j05
$$ plain form
3725 -36 -88 -11 81 55 -60 -87 4 83 28 -62 -66 32 85 17 -69 -58 47 81 14 -75 -36 73 93 -6 -83 -38 69 77 -12
3754 -12 -82 -21 76 76 -34 -83 -26 68 60 -48 -92 -17 74 47 -58 -97 -1 80 30 -62 -71 26 92 22 -76 -53 48 90 13 -71
3784 -71 -27 65 80 -10 -68 -10 74 68 -29 -79 -5 86 59 -42 -77 4 80 33 -53 -72 16 91 26 -72 -69 22 93 9 -81 -71 35
3815 35 92 8 -78 -60 54 80 -1 -69 -23 76 85 -19 -76 -8 92 78 -37 -76 6 96 41 -60 -63 31 88 4 -76 -68 28
3844 28 76 -3 -85 -46 36 77 -11 -97 -60 45 74 -10 -97 -33 79 71 -25 -79 -18 84 69 -33 -79 4 87 71 -37 -72
3872 -72 26 97 56 -59 -65 34 93 25 -68 -65 52 73 -8 -92 -50 41 59 -39 -89 -40 64 57 -38 -91 -8 77 50 -50 -68 2
3902 2 79 46 -56 -79 17 99 46 -50 -66 41 105 40 -64 -63 52 100 16 -66 -50 64 83 -1 -81 -44 59 71 -31 -84
3930 -84 -18 67 50 -52 -92 -11 74 33 -60 -77 17 67 25 -59 -71 43 92 20 -66 -47 50 95 6 -68 -28 66 79 -7 -70
$$ packed form
3725c6n2P7R2k6j15k7R1P9n5r0mR8N3o8q6J1J05L4o7q9L9J09K0r9p7M5J07Qq9
3754a2p0O1R7%j10m9N7R4qj08m4P5R1k7j05l9R6Q1n0r2rR7O6p0r8K3J01M2p7q4
3784g1M4R2J5r0n8N8Q4or7n0P4R1k7j01l5Q1P6m7q6j9Q8P5o5r8LR1P1q4r0J0J06
3815C5N7q4q6J8J14K6q1o8M6R9Rj04n7O8J00j4j15l9Q2R0n5j01lR4N7q4q0QR6
3844B8M8p9q2L9Q2M1q8q6L7J05K9q4q7O4J12qr6n4O1J02j5j02m6Q3Q3j6j08l5
3872g2R8P1m1j15oR9N9o8r3LJ17K1q1q4M2R1J8r8n0M9J04pr5n3Q3Q5k7j00j8P0
3902BP7l3j02k3R6Q2n3r6j6J07O4o5j04JJ15M8q4q2J6J14J9q4q0L7J03J2j02n3
3930h4O6Q5j7j02m0Q1Q5m1r3j7R4N0m2q4j2J14M9p2q6J9R7M5q9p4M0R4J3q6o3
$$ plain form
3959 -70 -27 61 76 -17 -85 -15 69 67 -36 -81 -23 72 55 -63 -73 -1 72 32 -78 -80 25 74 14 -70 -64 32 83 0 -79 -41
3989 -41 61 70 3 -56 -14 82 71 -20 -55 -4 77 63 -47 -69 2 71 47 -48 -74 6 68 32 -61 -76 18 82 22 -65 -66 27
4019 27 71 3 -80 -57 32 72 1 -74 -34 58 73 -9 -66 -23 76 60 -29 -70 5 85 53 -35 -55 21 85 42 -51 -51 33 69 24
4050 24 -67 -60 35 68 -7 -82 -54 31 64 -10 -77 -43 46 54 -27 -78 -37 65 58 -28 -77 -5 73 53 -33 -72 6 65 50 -47 -57
4081 -57 27 82 30 -55 -50 36 70 3 -68 -37 43 70 -17 -79 -33 50 50 -24 -80 -29 60 39 -38 -70 -14 63 44 -46 -76 -1 68
4112 68 31 -57 -62 18 84 33 -55 -48 22 86 26 -65 -50 29 78 10 -69 -44 50 67 -10 -86 -32 52 55 -30 -79 -17 62 33 -49 -73
4144 -73 -1 66 25 -62 -74 15 72 16 -55 -64 29 70 16 -62 -50 57 68 11 -54 -37 53 76 3 -61 -21 58 71 -24 -74 -25
4174 -25 59 54 -45 -84 -14 64 38 -56 -85 2 57 22 -58 -71 14 67 13 -60 -48 37 63 3 -63 -33 46 54 -11 -66 -19 64 55 -17
$$ packed form
3959g0M3Q8J5r3o8P0Q4kj03m5N8R5j7j18j0P2P3m0j10kJ05M9o0q4OR6N1q3p9L8
3989d1J02Ro7n9M2R6j1r1l5N1Q1j4j10k2P1O9k4r5k6Q0O2l6r3j5R4O4o0q7jR3
4019B7M4o8q3K3Q9M0p1p5M0R2J5q2n7M3R9j6q9m1P5Q0l2q8k0P6O4m3r3%Q4L6m5
4050B4r1PR5L3p5p5K8Q5L3p4o7L4Q9Qq1n1M1J02pq6m9P2P8k0q6l9P8N9j5r7j0
4081e7Q4N5n2q5NQ6L4o7p1L1Q0K7q7o2M6Q3%p4n6N1Q9k1p7l2N6P7j9r0l0P5O9
4112F8l7q8nQ0O6n1q8PP0O4o0r1J5P9M9o8p9K5R4J7p7p6N4Q4Lq5m9O2P9k9q2k4
4144g3P2O7m1q7j2Q9N7n6p1rR3M1n4p8J2J07J1n7o5J7R0K3p3o4M0P9J3r5n0M9
4174b5Q4nr9l9P0P8k6r4k9Q7N5l5q0j3Q5N3n4p3J2Q5K6o0o6L0P9Qo5n5M7Q3rp2
$$ plain form
4206 -17 -69 -7 78 55 -36 -57 5 63 36 -48 -64 11 64 27 -61 -78 2 66 32 -60 -71 14 56 -1 -79 -48 32 61 -8 -63
4236 -63 -34 53 70 -29 -72 -12 69 53 -35 -56 16 71 35 -34 -53 19 76 25 -48 -52 19 63 5 -60 -57 19 56 9 -71 -57 36
4267 36 56 -10 -88 -46 41 41 -15 -72 -29 54 51 -30 -69 -12 68 50 -42 -65 2 72 39 -36 -54 30 76 28 -43 -39 33 62 8 -59
4299 -59 -40 46 57 -4 -65 -41 46 43 -33 -78 -37 47 45 -49 -79 -23 47 41 -51 -65 -1 66 39 -55 -53 19 73 20 -33 -45 37 90
4331 90 14 -58 -37 49 79 10 -64 -32 49 61 -16 -67 -30 42 50 -29 -65 -14 55 27 -43 -74 -1 55 17 -56 -70 14 54 18 -51
4362 -51 -43 32 73 25 -55 -44 52 74 7 -51 -28 58 70 9 -58 -15 64 67 -14 -61 -12 65 46 -35 -60 -2 63 36 -49 -74 -3
4393 -3 52 17 -57 -57 24 63 13 -51 -47 36 63 -15 -64 -20 63 64 -7 -47 -13 59 58 -17 -57 -7 72 60 -21 -58 -4 50 34 -40 -59
4426 -59 17 67 30 -52 -63 -6 58 8 -55 -61 19 63 13 -66 -36 42 63 -1 -65 -12 53 64 -12 -56 7 75 61 -17 -45 14 72
$$ packed form
4206a7n2O2Q5k3r1k1O2N8k7q4j6P5N3l7q8j7Q0O4l4r2j1Q5M2n7p8L1Q0K9o9n5
4236f3K9Q7J7r9m3O0Q1j6q8k1P2N5l6o9j9P2N7n1p3mP1M4n8o5LP6L7m7q0J4R3
4267C6K0o6p8M2Q7%n6n7M3Q3lq1l9N7Q0j8r2k3O7P0l3p5j8Q4M6m8p1MP2K9n4o7
4299e9J9Q6J1o1o1K4Q7lp6m5M1Q4kr4l0N6P0or2j4O4O7k7r4KP2N4n3n3j2Q2N3
4331I0p6p2K1Q6L0o9p4L2Q1J2p7n1L7P2Qp9l6N1O9k8p0l1P3N6l8p3j4Q4M0l6o9
4362e1QP5M1m8q0J1R6K2o7n8K3Q6J2o1o7M3P9Lq1m7M9P7j9q1k5N8O5k7q5k5P1
4393cN5l5p4%Q1L9n0o4MQ3K7p8m9M4Q3Jp1m0L4P2jp5m0N0P9j2q1l7N4N4j6p4j9
4426e9P6N0l7q2j1N7O4n0o3oQ0M4n0p9L0P8K1o4o4N3O5J1p6m4O3O8j4p8k8N9N8
$$ plain form
4457 72 45 -36 -37 19 68 27 -46 -51 25 65 18 -58 -40 24 53 0 -61 -39 28 59 -11 -69 -36 49 67 -13 -69 -25 59 55 -34 -51
4489 -51 -2 61 50 -19 -53 19 80 36 -30 -37 31 62 20 -49 -30 36 59 7 -53 -37 39 43 -12 -63 -26 30 45 -14 -59 -20 49
4520 49 42 -28 -54 -5 56 42 -35 -66 4 70 37 -39 -59 20 69 41 -27 -53 32 91 22 -42 -31 44 65 6 -52 -29 42 47 -9
4551 -9 -67 -17 40 43 -36 -63 -12 35 28 -51 -57 0 56 29 -48 -51 9 57 21 -49 -38 24 71 18 -54 -28 41 67 14 -48 -28 50 56
4584 56 10 -51 -26 53 51 -10 -48 -4 62 41 -33 -54 1 61 31 -31 -50 3 55 20 -40 -44 16 52 11 -50 -34 42 48 7 -44 -20
4616 -20 44 57 0 -35 -16 52 62 -4 -46 -4 66 58 -19 -57 4 62 29 -36 -51 10 55 28 -39 -58 6 53 15 -56 -45 20 37
4647 37 -10 -55 -34 36 50 -10 -43 -21 29 50 -10 -42 -5 52 50 -18 -37 7 51 49 -19 -30 16 52 32 -26 -47 10 78 21 -39
4678 -39 -38 18 42 -5 -58 -49 14 46 -7 -65 -44 32 53 -8 -56 -20 49 47 -20 -47 -13 51 40 -12 -41 5 62 39 -26 -31 20 54
$$ packed form
4457G2k7q1jN6M9m1p3nP6M0m7p6J8O4K9n3o1K2O7L1p0n8L3Q5J8q0n6M4Q4mq9j7
4489e1M9O3j1o9l4P2O1m4o6pO8L1m2o9J9O6K3n2o0J6P6Mn5n1L7N6J5n9m5L9O9
4520D9pp0k6M9O1j4p7l1P0O6l3p6k0P9M9k8o8k6Q5N9o9o4J1P5K1n9n8K3P1Nn6
4551in8N0N7Lp9k7N1M7pp9oN7N6k7p7lO0M8l6p0J1O2M7n3p2K6O9K6n3o2K0P8O
4584E6m6o1K5P9ko1l8M4O6k1p4k1N5O0l0o2j9N3N2l5o0mO0L6m1o1J6P6Om1n1K4
4616b0O4J3n7l5J9O8J0o6m2M2P0qp7l8O1N8l3o5j5O1M5k7o7j9O4M7l8p1J1O5J7
4647C7m7m5K1P0J4o0l3K2N0K1o0l2L7N7ko8j9M4M4ko8j1M6L6k0n8k1N7O8n7o0
4678c9JN6K4m7n3RO3L2n3n8K1P6K1o1m8L6O9ko7k7L4O4j1n2k9M6N7k3o5nN1L4
$$ plain form
4710 54 23 -34 -35 26 50 14 -49 -29 29 43 -2 -53 -31 22 44 -13 -63 -30 27 32 -30 -73 -15 47 28 -21 -58 -5 56 36 -30
4741 -30 -53 7 61 32 -33 -37 21 61 17 -43 -31 27 54 14 -43 -22 25 46 -8 -44 -24 24 28 -31 -64 -16 39 23 -22 -53 -16
4772 -16 38 24 -42 -57 4 58 28 -35 -40 24 67 22 -40 -36 38 70 19 -40 -24 47 59 3 -42 -14 47 52 -16 -53 -15 38 42 -16
4804 -16 -55 -17 42 20 -42 -51 -4 40 13 -37 -44 8 52 8 -47 -28 26 45 7 -37 -33 35 59 -5 -29 -19 35 56 -4 -41 -9 54
4836 54 52 -13 -46 4 58 46 -32 -40 2 53 27 -44 -59 9 30 14 -45 -39 14 44 -9 -60 -28 25 43 -4 -47 -18 34 39 -7 -39
4868 -39 0 49 42 -17 -44 8 60 48 -26 -40 7 54 32 -32 -42 6 59 26 -31 -34 13 45 3 -54 -43 16 43 -14 -60 -36 29
4899 29 39 -5 -55 -18 38 29 -15 -43 -4 57 40 -20 -43 13 47 29 -26 -27 23 50 20 -30 -32 25 61 13 -30 -33 29 51 -15 -53
4931 -53 -26 35 31 -10 -54 -32 38 39 -20 -47 -9 53 37 -26 -48 4 58 36 -32 -37 13 51 25 -22 -33 33 68 19 -32 -14 42 53
$$ packed form
4710E4l1n7jO1K4l6o3K0N8J4m5n1K2N3K2n7n0L3N7No2m3N8O2j9m9l7N3O1k0o6
4741c0k3O0N4k9o5mN8M0m4o0J2N8K7m0n7K1M7K1n4l6K0M8Mn9l3M8N5j6m5l1L7
4772a6N4j4o6j5O1N4l0o3nO4M3m5o2MP4L2n1n9J6P1J2n6m5K8O1No8l7L8N3Mn8
4804a6l9L8N9k2o2rM7M4k7n0pN2M4m4n5J9N4J9l8m4MO8K4o4k4J0N4K1o0l7L2O3
4836E4ko5l3N0N4j2p8qM2N1k6p1j5O8K1j6n9ON3L0n3n1L2N3J8m7m3K9N2Nm6l2
4868c9L9M9pn9k7N2N2j2p4j4M7M7k2o4j0M8N3l3n7lM7L2m2n7J1N9K7n7m6K4O5
4899B9J0m4n0L7N6rm4k8L9O1j7o0k3N6L4j8n5jN0K7l0n0kN7L6m8m3lO2K2o6l8
4931e3K7O1mm1m4K2P0Jn9k7L8O2j6o3k2N2N4k2o8nN0L8k6m7j1O6L5m9n1J8N6J1
$$ plain form
4963 53 6 -44 -19 30 45 -15 -50 -27 30 34 -13 -47 -18 30 23 -11 -51 -15 36 22 -38 -46 12 47 24 -30 -34 26 59 27 -38 -25
4995 -25 37 66 11 -31 -10 38 53 9 -37 -23 40 41 -11 -35 -5 43 35 -23 -40 -1 36 21 -28 -50 -5 37 2 -40 -44 6 42 11
5027 11 -48 -28 26 44 7 -35 -17 36 48 0 -45 -18 42 41 2 -42 2 40 42 -8 -38 8 44 25 -24 -48 0 33 10 -36 -44 9
5059 9 35 0 -48 -42 7 34 -12 -50 -47 19 28 -11 -36 -17 42 35 1 -35 -1 39 48 -10 -29 -1 56 43 -11 -29 12 57 28 -29 -40
5092 -40 9 50 14 -40 -33 16 45 -6 -42 -34 16 34 -8 -46 -23 28 34 -10 -42 -10 31 28 -11 -27 3 34 41 -8 -25 18 45 27 -16
5125 -16 -20 24 53 18 -27 -24 28 48 7 -38 -33 29 39 -9 -52 -39 14 29 -15 -47 -19 29 27 -27 -49 -17 40 30 -33 -35 -3 42 31
5158 31 -14 -31 17 40 26 -18 -34 25 44 15 -20 -3 25 45 12 -25 -19 24 28 -10 -39 -20 32 30 -24 -53 -13 7 17 -30 -48 -6
5190 -6 28 13 -27 -39 -5 30 12 -27 -26 16 47 9 -22 -23 28 39 15 -20 -12 38 47 11 -24 -9 29 41 -6 -25 -6 17 31 -13 -39
$$ packed form
4963E3m7n0K5M9J5o0l5K3N7Mm7l4K9M8pl4m0L6N1j4o0qN8L5k3n4mO0L3l2o5J3
4995b5O2K9n5m2K1M8J5m4m6J4O3Jn2k4L0M8qn8j7L9L7j5m9k2M5M2l5m2mN0L6l1
5027A1n9K0N4J8l7m2J8N3J2m8m5K7O0jl9m4M4L8Kn0l0M6L6j9m9k4M8L3k3m6qN3
5059IK6l5m8OM9K7m6l8LO6Rl9k5J9N9pl4l6L4M0Rn8j9K8N7j3n4j8M1M5k9n7j1
5092d0M9M1l6n4PM9K9n1l6QN0J8m2l8K3N1Om4l2L2M1ll9j6L0L1Pm9j7M3K7j8m3
5125a6mM4K9l5m5LN2K0m1m5NO2J0m8m3J3N3J5m4l2K8M8kn4k2L2N7j0o3kL2M5j1
5158C1m5j7M8K3j4m4j6N9J9k9l5J7K8K0l3l7OM3Ml8k9J9N2kn4k9M0K0J0m7j8M2
5190fL4j5m0j2L4L5j8l9JM2L1l8l1jN1J1k4l5QN0Rl6l5J5L8J2m7j9J9K3J4m4k6
$$ plain form
5223 -39 -12 23 15 -30 -43 -10 22 1 -34 -43 -7 18 6 -39 -39 10 30 4 -34 -18 29 41 8 -30 -9 36 42 -2 -27 0 32 37 -12
5256 -12 -19 7 36 29 -21 -28 -3 32 7 -26 -43 -3 29 -1 -36 -32 6 17 3 -30 -26 8 36 -8 -32 -15 26 29 3 -31 -9 35 31 -1
5290 -1 -21 1 39 25 -11 -29 9 40 35 -17 -33 5 31 15 -29 -29 8 27 -9 -48 -40 2 16 -11 -33 -38 12 29 -11 -41 -19 27 13
5323 13 -17 -33 -9 34 16 -18 -24 -4 28 21 -24 -30 15 39 23 -29 -26 18 36 14 -17 -25 17 31 -1 -32 -19 8 16 -27 -42 -29 16
5356 16 12 -12 -45 -16 22 23 -21 -37 -6 20 17 -20 -29 15 32 21 -6 -21 20 39 16 -20 -13 18 36 9 -23 -21 19 30 -5 -32 -16
5389 -16 22 14 -13 -40 -12 18 2 -27 -44 -11 26 -5 -32 -38 5 19 -1 -31 -22 8 32 11 -22 -15 28 50 19 -19 4 35 43 3 -16
5422 -16 -5 27 22 -5 -25 -11 29 15 -17 -28 -7 15 10 -27 -37 -3 25 1 -29 -28 2 23 -11 -22 -27 13 38 4 -38 -11 28 34 4
5455 4 -29 -7 37 46 2 -24 7 34 32 -7 -18 5 36 20 -19 -31 8 27 12 -27 -35 -4 14 7 -25 -25 0 22 -3 -31 -17 9 27
$$ packed form
5223c9K7L5qm5j3L3L2k1l5rL6K5j2m5%M9K0k6l8J6M7J2l3l8K1M5Om4k5K7L2Nm9
5256a2pK6K9pn0pK5L5k5l3j7M0L2l0l5ML8J1j4l3ML4K8m4k4J7M1Lk6l4K2M4ml2
5290ak0K2L8j4l6j8L8L1nn2j6L8K6j6m4%L7J9l6l9QM2J4k7k2nN0J7m0l0K2M6j4
5323A3l0j6K4M3j8l4oK0L2pm5oM5K4j6n2LM4J8k2l1qM2J4l2l1J3K7Qm3j5J3M5
5356A6mk4l3K9L8Jm4j6L1K6ll7rM4J7j1k7j5M1J9k3l6PL1J8k7l2KM0J1l5k7J6
5389a6L8qk7k7K8L0j6k9j7L3L7l1k7oM3J4k0l0RL0K4k1l3PM3K2l1l8K3L1Qm0j9
5422a6J1L2nk7k0J4M0j4l2j1K1K2nl7j0L4K8k4l0JL0K1l4j1nM0K5l4m2K7L9Ol0
5455Dl3K2M4Rm4k6L1K7kl9j1K3L1j6l9j2L9J9j5l9qL1J8pl2%K5K2k5k8J4K6J8
$$ plain form
5488 27 -6 -24 -9 23 23 2 -27 -9 28 37 -6 -19 -1 42 28 -6 -20 17 39 20 -19 -25 5 15 18 -34 -38 1 26 -7 -29 -27 14
5521 14 16 -9 -38 -26 12 13 0 -27 -15 22 27 -5 -14 2 31 24 7 -24 26 40 26 -12 -14 15 31 19 -23 -11 21 26 -2 -36 -21 7
5555 7 29 -6 -31 -7 12 17 -18 -44 -17 18 12 -17 -32 -7 19 3 -9 -21 -11 23 13 -7 -17 17 30 7 -8 -4 16 27 16 -18
5587 -18 1 20 26 12 -12 -10 21 21 -10 -31 -16 15 10 -14 -39 -9 21 17 -20 -36 -1 31 19 -16 -27 -8 31 11 -26 -24 9 27 18 -16
5621 -16 -13 30 31 19 -11 -4 26 26 8 -12 -9 19 24 -6 -18 3 15 10 -19 -31 -7 21 5 -31 -29 -8 18 4 -26 -25 4 25 -4 -24 -12
5656 -12 13 26 8 -26 -6 29 25 -1 -25 1 25 35 -1 -10 5 33 21 -6 -13 8 23 24 -7 -13 -3 21 4 -25 -11 -6 9 -5 -33
5689 -33 -23 7 7 -19 -34 -19 18 11 -5 -22 -6 23 24 -2 -8 -1 35 24 -3 -17 14 36 19 -1 -14 20 26 24 -12 -12 6 24 10 -20
5723 -20 -24 1 20 -3 -30 -20 13 5 -10 -31 -6 16 20 -18 -26 -9 16 15 -1 -19 -2 30 20 -9 -8 15 45 23 -4 -2 19 29 12 -8
$$ packed form
5488B7l3j8J5L2%k1k9J8L7Rm3j3J8M3j4l4j4L7K2j9l9oL0J0Ln2mL9K5l3k2KM1
5521A4Kk5k9J2L8Jj3k7J2L7Nl2rJ6K9pj7l1N0J4j4l8kK9J6j2m2J2L2Nk8l4J5K8
5555GK2l5k5K4J9Nl5k6K7L5ok9j5K5K6j6j2j2J0L4j0k0j0L4J3k3j5MK0J1j1l4
5587a8J9J9Oj4k4KL1%l1k1J5L1nk4k5L0L0ml7j6L5L2j2l5j1J9L9k0l7KL3J8rl4
5621a6LM3Jj2l0PL0%j8k0LK8Nl0j2K1J2nk9j2K4K8j6l6KK1K6j4l0JK9K1k9k0J2
5656a2K5J3j8l4K0L5mk6k4K6K4J0l6rJ5K8j2k7pK1J5Jl1oJ0K4j7k9J4NJ5j4k8
5689c3J0L0%k6j5J5L7pj6j7J6K9Jk6oPL6j1k7j4L1K2j7k0j3L4Okl6%J8J8j4l0
5723b0mK5J9k3k7J0L3qj5k1K5K2Ml8qJ7K5jj6j8J7L2j0k9JK3L0k2k7KK1J0j7k0
$$ plain form
5757 -8 -11 6 26 11 -18 -11 2 19 -1 -31 -9 6 21 -9 -35 -11 3 0 -17 -31 -3 8 6 -2 -22 9 12 12 -14 -13 10 12 8 -13 -6 24
5793 24 41 15 1 7 24 33 16 -15 -7 21 27 -5 -30 -13 16 15 -18 -25 -3 0 2 -21 -35 -1 15 -5 -12 -26 2 11 10 -16 -14 10 18 -2 -14
5830 -14 0 12 26 9 -15 -7 24 34 -9 -18 -7 18 23 -9 -25 3 16 15 -16 -27 -13 18 3 -27 -28 -5 13 -3 -33 -28 -1 9 -3
5863 -3 -28 -6 7 17 2 -15 0 21 24 10 -7 6 30 28 13 -1 15 33 14 4 -16 8 21 17 -14 -26 2 12 7 -20 -20 -9 10
5896 10 -5 -19 -16 4 11 -15 -31 -21 6 7 -3 -10 -12 4 26 -8 -13 7 30 28 -11 -11 17 33 25 6 -7 27 34 12 -16 -8 2 29 5 -30
5932 -30 -20 -2 10 -9 -27 -25 1 -2 -11 -30 -24 4 4 -17 -21 6 21 15 -15 -22 8 32 11 -10 -1 9 33 8 -8 -15 8 27 12 -15 -16 18
5968 18 21 -4 -22 -19 5 11 -10 -34 -16 4 6 -15 -39 -13 -5 7 -22 -24 -8 12 9 -28 -18 2 20 11 -19 -3 18 16 18 -17 -8 17 26 12
6004 12 -17 -11 20 24 3 -9 -9 25 17 -13 -20 -2 16 10 -20 -32 -15 10 0 -29 -36 -8 11 -5 -28 -29 -9 11 5 -15 -18 17 29 7 -15
$$ packed form
5757hlJ7K0j5k9PJ3J7k0l0K2J5J5l0k6K4J4lj7j4K8J1kqk0L1L%k6JK3Kmk1PL0
5793B4J7k6j4OJ7Rj7l1QK8Ol2k5J7K9jl3pK2LKk3j4L4J6k0pj4K8Rjk6KK4Qk0j2
5830a4J4J2J4j7k4QL1J0m3rJ1K5Nl2j6K8J3jl1j1J4L1j5l0jK3J8j6l0NK7J0j2
5863ck5K2J3J0j5j7J5K1Lj4j7J3K4kj5j4J6J8j9j0k0K4J3ml1j2K8J0nk7%J1J9
5896A0j5j4LK0Pk6j6J0K7Jj0pkJ6K2l4nK0K3kl9%K8J6qj9j3L4Pk2k8QJ0K7k4l5
5932c0J0J8J2j9j8KK6lrj9OK8%k1mK7J5ol0pL0K4k1k1RJ0K4k5j6pK3J9j5k7jL4
5968A8Lk5j8LK4Ok1k4J8K0Kk1k4K6QJ2k9kJ6K0ll7J0K0J8rl0J6K1kKl5RK5Rj4
6004A2k9OL1Mk1j2%L4ql0pJ8J8ol0j2J7K5j0k9pK8J9j6k3jK0K0ok0lL5J2k2k2
$$ plain form
6039 -15 -15 22 25 13 -6 3 26 24 4 -10 4 19 11 -9 -14 -4 18 6 -10 -27 -16 13 -1 -28 -34 1 -1 -2 -35 -26 -3 3 -5 -17 -12 16 11
6076 11 2 -29 -14 13 15 9 5 5 15 17 2 -6 7 20 23 -6 0 6 14 3 -20 -27 -1 13 -4 -22 -13 0 3 -19 -34 -23 -10 2 -7 -33 -15 -1
6114 -1 12 -2 -25 -5 11 10 -7 -12 -6 22 14 4 -15 6 19 13 -3 -5 4 18 -4 -5 -6 6 14 -8 -16 -16 8 10 -21 -37 -16 -8 2 -17 -21 -20 0
6153 0 -12 -8 -28 -6 6 4 -22 -12 -4 11 5 -5 -13 15 24 13 -6 -2 19 20 6 -13 -2 18 17 -6 -17 -3 10 4 -12 -28 -10 4 -3 -21
6189 -21 -26 -19 0 -4 -20 -24 -4 8 -6 -22 -21 3 14 5 -6 -4 9 21 -1 -1 17 21 30 19 -10 -6 25 19 0 -22 -2 21 10 -19 -29 0
6225 0 -2 2 -16 -17 -9 2 6 -19 -24 -1 7 -20 -28 -21 0 4 0 -20 -3 8 12 6 -12 -8 12 21 -5 -6 -2 23 12 -4 -14 10 17 0 -7 -20 1 2 -8
6266 -8 -14 -23 -8 5 -9 -22 -26 -5 4 -12 -21 -21 -7 -2 -6 -27 -27 9 6 -10 -11 9 15 3 3 -10 7 22 11 -2 -12 2 26 20 -1 -7 0 14 1
6305 1 -22 -9 -1 2 0 -31 -12 1 4 -12 -31 -22 4 1 -24 -25 -16 10 -3 -12 -21 1 14 11 -7 6 15 21 5 -8 1 17 21 13 -2 -8 13 9 4 -9
$$ packed form
6039a5%L7Lj2j9RK3kk0j4J4J5qk0nJ0K2j2j6j7J1K9j4k7oL5kjl3RK3Oqj2NK8n
6076A1rl1J5K7Kom%J0Kj5qJ3J3Lk9OOQj1k3pK6J4j7j8RJ3Lk2j5J1J3J2rk6J8J4
6114aJ3j4k3K0J6jj7nOK8qj0j9K1J3oj6kRJ4k2jjJ2Qk2q%K4Kl1j6K1QJ0j9mJK0
6153@j2Mk0K2J2kk6J0QJ5oj0qK8Rj1j9MK1Jj4j9J1K0jk3j1J4J3oj6j6J8J4pj8
6189b1nPJ9mj6mK0J2j4j6JK4J1rj1KJ3J2k2%J8MRj1k9ML1oj9k2K0K3j1k9j0K9
6225@kMj8jQJ1Mk5nK3Qk7qPK1Mmk0J7J1Moj8MK0Rk6jMK5j1j6j0K4Pj7pj3K1Jj0
6266horJ5J3j4j3mK1Rj6r%J4Nmk1%L6lj6jK0Oj2%j3J7J5j1j3j0J4K4ok1oPJ4j3
6305Ak3J3QLkl1J9J3Lj6j9RK6lk5jRK6j3rrK2J3lj8J3ROj6j3RJ6Mqj5oK1mnj3
$$ plain form
6345 -9 -11 1 22 0 -21 -17 -2 3 -5 -19 -26 -5 9 -14 -31 -14 -4 -5 -12 -13 -1 6 -10 -9 -8 2 17 16 -12 -5 8 24 7 -12 -8 17 19 10 -8
6384 -8 7 5 14 6 -11 -3 12 -5 -10 -20 -16 3 0 -17 -26 -12 1 -7 -12 -16 0 3 -4 -21 -18 4 20 -4 -15 -7 12 19 -3 -1 4 20 17 4 -3 4 30
6425 30 10 -17 -6 -2 14 10 -16 -8 -1 8 -7 -26 -25 -15 0 -6 -27 -27 -8 12 -18 -20 -7 3 10 5 -9 -7 11 11 -5 0 1 17 17 9 -4 -4 14
6464 14 14 -11 -7 -3 13 -4 -2 -25 1 7 2 -15 -19 7 0 -14 -22 -23 -17 1 -12 -31 -24 -9 -2 -25 -17 -11 -2 1 -19 -9 -4 11 19 8 -14 0 20 30
6504 30 5 -3 7 22 16 1 -15 7 18 1 -11 -8 3 7 -7 -20 -20 -1 5 -15 -9 -20 3 -3 -12 -26 -11 5 7 -16 -17 -3 26 2 -1 -5 2
6541 2 27 11 7 -1 14 17 20 3 -2 17 14 14 0 -7 9 19 -5 -31 -14 -10 -5 -6 -21 -3 10 -4 -20 -22 -14 3 -2 -24 -16 -13 11 9 -16 -20 9 14
6581 14 4 -5 -1 18 23 17 0 3 17 31 12 -6 2 7 10 3 -4 1 -5 -11 1 -12 -10 7 -1 -26 -29 -15 -7 -2 -23 -18 -3 -1 -9 -23 5 10 12 -6 -13 -2
6623 -2 17 15 1 4 10 14 22 9 0 8 24 17 -9 -11 0 11 10 -3 -8 -7 3 -6 -23 -6 -4 -3 -7 -23 -23 -3 1 -2 -24 -9 -1 9 -2 -12 4 9 16 3
$$ packed form
6345ikJ2K1k2k1MJ5Nqj4pK1J4k3j7J7J0jpjJ2Pj6JJJ0J5jk8PJ3J6j7j9MK5Krj8
6384hJ5kRqj7QJ5j7nj0MJ9lj7rJ4J3qnmJ6Lpj7LK2J6k4j1QJ9Pk2KNJ6lj3pPK6
6425C0k0k7J1MJ6mk6QPRj5j9JJ0J5ok1%J9K0l0kJ3J0Pnj4KJ8%j6NJJ6%qj3%J8
6464A4%k5MMJ6j7Kk3K6Onj7mK6pj4qjOJ8j3j9PJ5Pk3QORLk0J0NJ5Qj1k2J4K0J0
6504C0k5qJ0J5oj5j6K2J1j7j2LJ1Mj4j3%J9Ok0Oj1K3orj4J5J6Kk3jJ4K9k4lmP
6541BK5j6mqJ5LLj7nJ9l%j4pJ6J0k4k6J7MNjj5J8J3j4j6kQJ7nk2QLK4kk5mK9N
6581A4j0rMJ9Noj7LJ4J4j9j8QNLppNooJ2j3KJ7qk5lJ4QNk1NJ5Kqj4K8NKj8pJ1
6623bJ9kj4LOMQj3rQJ6pk6kJ1J1jj3nJJ0rj7J7KJmj6%K0Mlk2J5QJ0j1j0J6NPj3
$$ plain form
6665 3 -6 11 7 9 11 -13 9 23 28 -10 3 7 20 14 -3 -13 13 15 -5 0 -26 -7 1 -1 -13 -14 -12 -6 -4 -14 -14 -6 -2 -11 -3 4 6 12 -10 -9 4 10 13 12
6709 12 6 10 30 18 2 2 10 11 0 6 1 13 12 -10 -12 -12 -3 4 -3 -33 -21 2 -2 -19 -22 -13 -10 -18 -20 -22 -3 3 1 -19 -23 3 11 18 -8 2 8 24 6
6752 6 -5 4 6 15 16 -1 -3 10 19 12 -4 -1 11 17 -4 -14 -7 -13 2 -19 -28 2 4 1 -16 -25 -19 -1 -8 -23 -8 0 3 0 -6 -10 5 11 11 -3 -8 25 21 -3
6796 -3 1 -11 7 18 0 -5 2 8 9 0 1 -1 5 2 -8 -17 -8 3 -8 -17 -19 -15 -5 -6 -14 -16 -8 9 -7 -25 -7 7 13 -8 -9 -3 8 17 5 4 6 18 15 5
6840 5 -9 11 8 17 9 -5 6 8 -1 -14 -16 1 9 -3 -14 -20 -11 -1 -2 -18 -10 -13 4 -8 -21 -5 -9 6 3 -13 -13 8 3 1 -2 9 17 17 5 0 9 19
6882 19 18 2 -6 -3 13 -2 0 -7 -14 5 0 -18 -18 -13 2 -17 -29 -16 -8 -9 -21 -19 -12 -8 -5 -13 -16 -9 9 10 -1 -12 4 17 22 2 -15 2 16 10 2
6923 2 3 10 28 13 -11 -3 11 19 7 -4 -7 2 -1 0 -7 -13 2 -6 -12 -29 -17 -2 9 -16 -16 -17 4 1 -11 -11 0 14 10 16 -12 17 13 16 -6 4 19
6964 19 18 16 -3 3 13 11 3 -15 3 -4 3 12 -13 5 -6 -8 -8 -15 -6 5 -6 -22 -12 -6 14 6 -16 -13 -7 2 1 -2 -1 7 27 3 0 13 11 22 6 8
$$ packed form
6665CrJ7mKKk4K2J4Nl8J3MJ3oj7j0K6Kk0Nk6J9Qkj2jKOKj0%QMrQPKOk2JJ3OLj
6709A2oMK0j2j6%QJj1OnJ2jk2k%RPpl0J2K3mj7lRLqkkJ9Okk0mK6QPk6J0OJ6j8
6752Fj1RKRJj7kJ3Rpj6LJ2Ok1j0PoJ5k1rL0Klj7rOJ8pj5J5QLlomJ5O%j4nL3mk4
6796cMj2J8J1j8nPOJrJkOlj0rRJ1j1rkMJ0jqkQJ7j6j8J8J4Ok1jOJ1Rj2jKJ2lj0
6840Ej4K0lRqj4J1Krj3kJ7Qj2j1oRJ0jj6QlJ7j2j3J6mJ5lj6%K1nklJ1Q%j2nRJ0
6882A9jj6qLJ6j5KppJ9nj8%NJ5j9j2J3Qjj2KPMLqlPJ8Jj1j1J6J3Nk0j7J7J4oq
6923BJPJ8j5k4QJ4Qj2j1lRlJpoJ5qoj7J2J5J1k5%jK1lj2%J1J4mOk8K9mLk2J0J5
6964A9jkj9OJ0kqj8J8pPRk5J8j1k%pRJ1j1j6J0OK0qk2LORjlJQK0k4lJ3kJ1j6K
$$ plain form
7006 8 4 13 12 13 -2 -3 8 15 -3 -4 4 9 11 -10 -14 -10 6 -7 -7 -17 1 4 -1 -12 -6 -9 5 -1 -9 -7 6 4 -6 3 7 10 19 14 -1 7 18 16 10 -1 17
7051 17 18 19 0 -1 10 18 4 -8 -8 1 10 -2 -13 -22 -11 0 -16 -7 -15 -11 5 -5 -19 -7 6 -7 4 -3 -1 10 19 0 4 12 21 23 7 4 12 19 16
7092 16 4 4 9 10 7 -8 -19 6 6 -6 -15 -12 -9 2 -15 -12 -13 -7 -2 4 -8 -23 -2 -1 -17 -20 -4 16 12 -9 -12 11 16 9 -3 -1 16 22 11 -4 7
7133 7 11 30 17 -11 1 -6 12 -9 -17 -16 6 1 -16 -5 -17 6 1 -4 -13 -13 -1 -6 -24 -12 -10 0 0 -9 -8 0 9 8 4 -3 12 18 16 0 4 9 19 6
7175 6 -1 5 6 -2 10 3 -4 14 7 -1 -18 -7 2 4 -18 -23 -15 -2 -3 -22 -18 -16 2 -10 -14 -14 0 10 -2 -12 -10 5 10 9 -1 -5 2 20 11 -11 8 13 13
7218 13 11 -2 2 16 9 9 -2 1 12 9 -10 -28 -14 -7 -3 -16 -22 -18 -5 -2 -14 -25 -9 3 8 2 -6 8 14 -3 -6 5 19 19 7 12 7 19 11 8 4
7259 4 6 11 13 7 0 5 22 10 -12 -16 -2 8 6 -12 -16 -2 -11 -9 -27 -13 -6 -16 -3 -10 -11 7 9 -6 -11 -1 11 12 10 -3 8 26 14 5 7 16 13 14
7301 14 0 0 17 12 7 -2 0 6 8 -6 -6 -5 -10 -10 -10 -15 -14 1 -2 -10 -10 -29 -2 -5 3 -24 -8 -2 3 -6 -11 2 15 9 -7 1 11 15 13 3 5 20 2 9 -3
$$ packed form
7006HmRjJj5jJ1Pj8jQNKk1mMJ6j3%j0J8Lnj1OlJ4oqKJ3kj0RMLRnj5QJ1koj1J8
7051A7JJj9jJ1Qj4j2%RRj2j1rJ1J1j6RqMJ6j0j4J2J3j3J1pKJ1Rj9MQRKj6lQPl
7092A6j2%NJlj5j1K5%j2rLLJ1j7LjONOj2j5K1Jj6lJ6K0mk1lK3Npj2KJ7Oj1j5J1
7133GMJ9j3k8J2pJ8k1qJK2nj7J1j2K3nnr%J2nj8J2KJ0%rJQRjmpJ5Okj6MNJ0j3
7175FpOJqJ2ppJ8pqj7J1RKk2nQJ3jj9MKJ8j2m%J4J0j2j0KJ5Njj0mPJ8rk2J9N%
7218A3kj3MJ4p%j1LJ1lj9j8J4PMj3oMJ3Lj2j1J6J2NoqJ4Oj7lJ1J4%j2NnJ2qlm
7259DKNKopNJ7j2k2mJ4J0kj8mJ4rKj8J4Pj0J3pjJ8Kj5nJ0J2Jkj3J1J8j2rKRlJ
7301A4j4%J7nnrKOKj4%Jn%%nJJ5lq%j9K7lQk7J6ONrnJ3J3oj6QJ0Mkj0KJ5j8Pj2
$$ plain form
7346 -3 6 1 -3 -5 -17 -2 5 2 -2 -19 -10 -6 -4 -10 -16 -7 2 -3 -12 -9 -9 -2 7 -16 -6 7 8 11 4 -7 6 19 11 -6 3 20 9 13 3 5 13 19 17 1 9 12 10
7393 10 0 -1 1 0 17 -18 -16 -13 -11 -4 -13 -18 -7 -8 -3 -13 -14 -7 12 0 3 -1 13 21 12 2 -6 7 19 12 8 21 19 23 15 6 -2 10 16 -10 -9 -3 6 4 -13
7438 -13 -10 -14 3 -2 -20 -21 -11 -4 -1 -25 -20 -8 2 -6 -15 -7 -5 1 6 -1 -3 12 24 8 5 17 12 18 8 9 -3 16 19 7 1 2 15 0 -10 -17 -7 3
7480 3 -2 -24 -11 -3 -4 -9 -27 -16 -7 -12 -7 -21 -21 8 3 3 -7 -5 12 6 2 -6 9 18 16 0 6 8 21 17 9 19 -5 20 7 -7 0 -1 6 -8 -6 -15 -4
7523 -4 2 -15 -17 -13 -12 -6 -12 -15 -17 -5 -10 -2 -5 -10 -3 0 -5 -3 3 4 6 -2 12 8 10 15 -2 1 8 29 12 7 2 9 8 1 -3 -6 9 16 -8 -1 -18 -4 -3 -10 -18 -21 -5 -13
7573 -13 -24 -17 -8 4 3 -14 -8 1 12 8 6 1 2 10 7 7 11 13 10 4 0 6 15 11 7 -11 -1 -3 3 0 -12 3 -19 4 -10 -18 -11 -5 -10 -6 -11 -13 -6 -7 -9 -10 0 0
7621 0 1 -6 -4 5 19 5 0 -10 20 26 17 11 4 19 22 11 1 5 25 16 9 5 2 -5 -6 1 -6 -21 -5 -2 -22 -12 -11 -5 -7 -17 -23 -18 0 1 -9 -9 -5 7 9
7666 9 -1 0 8 9 1 6 4 15 16 5 6 7 16 1 6 -2 5 0 -2 -3 -8 -14 2 -5 -17 -9 -12 -6 -21 -24 -25 -18 -14 -11 -19 -12 -17 1 4 -5 9 9 8 0 -5 7 18 14 9 8
$$ packed form
7346cRnmkj2J5Plmj7RMKooRRnrL%PRk3J0J3JLpj1J3J3qj7RJ7j1Mj0KQOkj6QLk
7393A0j0jKjJ7l5KLKPrnJ1jNj0jPJ9j2LmJ4Qrj0qJ3J2pmJ3kMqrqJ2Ok6JORkj7
7438a3LmJ7nj8jJ0PLk4NJ2J0qrQKONpkJ5J2j6lJ2nOj0Jj2J9Lj2oJJ3j5j0pJ0J0
7480Cnk2J3Qjnj8J1RnNj4%K9n%j0KJ7omqJ5Rkj6OKJ3mqJ0k4K5j3j4PjPj4KrJ1
7523dOj7kMJOolkJ2nQlnPLnKOJKqJ4mKNj7LPK1j7nnPjpmlJ5Pk4Pj7J4JpqlJ6q
7573a3j1PRJ2jj7ORJ1mknJQl%MKlomORmmj8J0kOlj2J5k2K3j4qPOnMnkPjkjJ0%
7621@JpKRJ4j4nj0L0OropJ5Lj1j0MK0rpmlpjPpj5J6Lk0J0JOkj0oNJ8Jj0%MJ2K
7666Ij0JQJqNkJ1Jj1JJRj5NqPnkjnoJ6pj2QlOj5ljPMLqPnJ8LrJ4%jqnJ2J1mnj
$$ plain form
7716 8 9 11 11 8 11 6 14 7 1 -5 2 2 4 -25 -19 -8 5 -7 -17 -23 -22 2 -14 -16 -24 -11 4 -8 -8 -1 -7 0 0 -4 2 9 17 -1 -5 11 15 8 4 5 8 15 3 -5
7764 -5 -2 -1 1 -8 -11 -8 -5 -2 0 -6 -5 -8 -7 -7 -26 -21 -13 -7 -15 -5 -2 -3 -12 -6 -10 6 15 0 -4 3 12 6 8 5 0 11 22 10 -2 4 7 14 9 6 -10 12 -3 -6 -18
7813 -18 -15 -7 -12 -9 -21 -16 -7 -20 -9 -16 -9 -2 1 -10 -12 0 3 -5 0 3 -3 8 10 0 -4 6 12 9 -2 -2 21 9 6 4 6 12 12 -6 7 6 3 -2 -2 -7 -9 6
7859 6 -3 -13 -19 -11 -2 -9 -8 -23 -7 -12 -8 -6 -5 5 2 -7 -2 -8 7 11 2 0 -2 11 14 17 -3 1 12 12 7 -4 4 6 5 4 -4 -11 0 -8 -12 -19 -4 -8 -1 -16 -26 -17
7907 -17 -8 -22 -10 -21 -13 -3 -3 -11 -8 6 12 10 1 -3 16 15 12 8 9 17 20 7 3 -6 8 10 -6 -11 -4 9 -10 -5 -11 5 -7 -6 -8 -7 -18 -11 -10 -19 -9 3
7951 3 -4 -11 -14 -15 3 0 6 -13 -4 8 18 2 3 9 12 13 7 4 -2 15 12 8 0 6 1 1 -3 -6 -18 -5 -13 -15 -4 -9 -8 -17 -17 -11 1 -4 -10 -17 -4 9 2 5 -2 5 12
8000 12 7 3 1 5 27 15 5 3 15 12 13 2 -1 3 4 11 -3 -6 9 6 -3 -12 -8 -9 -3 -25 -16 -15 -22 -2 -12 -14 -11 8 -3 -11 -10 -5 -8 -5 -13 -4 6 1 7 -4
8046 -4 5 5 19 10 13 14 11 12 10 7 3 8 2 2 -6 2 8 2 -9 -9 -15 -10 -10 -23 -19 -16 2 -14 -8 -23 -13 4 7 -6 -1 -3 0 -3 -1 0 15 13 17 8 5 19 17 19 2
$$ packed form
7716HJK%lLnQpooP%Kk9OJ1J3j2j0oJK4j6kqJ3J5j2%PoP%mOPQj8mJ6MpmJLPj2q
7764eLJKrlLLLKoJlJ%j9NQOqJ0LjrOmJ6Rj5mPRoKlnJ1J1j2j2OLPnlj6K2j5lj2
7813a8LQnLj2NRj3J1pPPLj1kJ2LqNLoJ1Kj0mJ0Olj1%K3j2lkKO%j8J3jln%nkJ5
7859Frj0oQRpJj5J6nMKJJ0lrNoJ5MrkkJ3LLk0MJ1%nj1QKjjqpJ1qmpJ5mPj5j0R
7907a7Rj4J2j1QJ0%qLJ4OkrmJ9jlmJQLj3mrJ4Kj6nPJ3j9NoJ6j2JkJj1PJrJ0J2
7951CppljJ8lOj9RJ2J0j6JOLJoloJ7lmqOn%mlj2J3qkJ1nJr%OJ2nopJ3J3pLpPP
8000A2nmkMK2j2j0kJ2lJj1lMJPj4lJ5lrrMjOk2RJpK0j0kLJ9j1qJNlLqRJ0nOj1
8046dR%J4rLJlJklmNo%qQOoj1%oN%j3MLJ8j6Oj5J0J7Lj3NkLlKJJ5kMrlJ4kKj7
$$ plain form
8095 2 4 11 3 8 8 -1 -4 1 -12 -10 5 -11 4 -11 -16 -11 -5 -7 -14 -18 -12 -11 -23 -10 -20 -10 -3 0 -14 -6 1 3 8 -2 -6 11 4 10 9 9 16 8 11 2 7 17 9 -6
8143 -6 2 -8 12 -9 -9 -6 -10 -4 -6 0 -15 -2 -9 -3 -18 -15 -5 -15 -7 -13 5 -8 4 2 -7 7 -1 8 4 -1 9 17 9 15 7 6 10 11 14 -9 12 11 9 4 -12
8188 -12 3 1 -9
$$ packed form
8095BKPqN%rlNj3KJ5j6J5j5nNOkpmOJj2J3j0J0PLj4QPKNj0mJ7pOj%PqLrNJ0qj5
8143fQj0K0k1%LmOkOj5J3pOj5LJ0j0QoJ8j3J2krJ4qRmnJ0QqOqjMJLk3K1jknj6
8188a2J5kj0
8191i
$$ Imaginary data points
##PAGE= N=2
##DATA TABLE= (X++(I..I)), XYDATA
$$ plain form
0 0 0 0 0 0 0 0 0 0 0 0 0 -8 8 -8 8 -8 16 -16 24 -25 32 -40 48 -56 64 -80 88 -104 120 -136 160 -178 200
33 200 -232 261 -293 328 -368 412 -458 511 -568 630 -698 772 -852 940 -1037 1144 -1258 1386
51 1386 -1528 1684 -1860 2053 -2275 2523 -2813 3148 -3543 4017 -4600 5334 -6295 7611 -9527
66 -9527 12598 -18322 32649 -146898 -151505 215103 191125 -26364 -146983 43007 195733
77 195733 79810 -194322 -225393 8890 201384 86487 -126636 -124837 102389 207066 30811
88 30811 -201752 -169953 61082 172395 23752 -137810 -70483 129307 157617 -35642 -186987
99 -186987 -87061 111531 130429 -43565 -141412 -16668 149106 108852 -84390 -159690 -15898
110 -15898 133315 76398 -93904 -119749 40191 152809 50667 -122436 -121206 47309 136252
$$ packed form
0@%%%%%%%%%%%qJ6j6J6j6K4l2M0m9N7p2Q8j04J20j44J68j92K24k56K96l38L78
33B00m32M93n54O21o96P80q70R69j079J198j328J470j624J792j977K181k402K644
51A386k914L212l544L913m328M798n336N961o691P560q617R934j1629J3906j7138
66i527K2125l0920N0971j79547m607L66608k3978k17489j20619J89990J52726
77A95733j15923k74132l1071K34283J92494j14897k13123J799K27226J04677j76255
88C0811k32563L1799K31035J11313j48643j61562O7327J99790K8310j93259j51345
99a86987R9926J98592J8898j73994r7847J24744J65774m0254j93242p5300J43792
110a5898J49213n6917j70302k5845J59940J12618j02142j73103J230J68515Q8943
$$ plain form
121 136252 19930 -126343 -84611 86934 139384 -5119 -140222 -74511 92946 118716 -31741
132 -31741 -136562 -41053 118021 111026 -52642 -138865 -26639 119453 88819 -71973 -128771
143 -128771 1462 131664 74960 -86791 -122252 16663 128090 52355 -99516 -107717 39606
154 39606 130666 35661 -107952 -95066 52859 121628 13727 -113408 -76473 70069 115182
165 115182 -3985 -114465 -58992 79278 100341 -23716 -111908 -38065 89111 86585 -39095
176 -39095 -105264 -18871 92133 67564 -54114 -95591 1245 94326 50075 -64752 -83416
187 -83416 18666 91472 30273 -74010 -69691 35420 87844 12525 -79682 -54909 49427
198 49427 80823 -5868 -83791 -39534 62137 73173 -22238 -84955 -23709 72169 62918 -38217
$$ packed form
121A36252j16322j46273M1732J71545N2450j44503j35103O5711J67457K5770j50457
132c1741j04821R5509J59074o995j63668q6223J12226J46092l0634j60792n6798
143a28771J30233J30202n6704j61751l5461J38915J11427p5735j51871q201J47323
154C9606R1060r5005j43613J2886J47925O8769j07901j27135L6935J46542M5113
165A15182j19167j10480N5473J38270K1063j24057q8192P3843J27176k526j25680
176c9095o6169Q6393J11004k4569j21678m1477R6836R3081m4251j14827j8664
187h3416J02082P2806o1199j04283M319J05111N2424p5319r2207K4773J04336
198D9427L1396q6691p7923M4257J01671J1036r5411o2717O1246R5878r251j01135
$$ plain form
210 -38217 -84156 -7802 80136 51844 -51768 -80284 7808 84768 38867 -63605 -74154 22531
222 22531 86563 25458 -72178 -65290 35758 84840 11430 -78063 -54761 47016 80417 -1915
234 -1915 -80638 -42833 56039 73458 -14676 -80775 -30344 62891 64807 -26116 -78391 -17590
246 -17590 67653 54773 -36515 -74254 -4983 70499 43765 -45485 -68196 7480 71456 31786
258 31786 -53151 -60504 19376 70318 19226 -58983 -51086 30491 67026 6288 -62799 -40278
270 -40278 40193 61523 -6416 -64223 -28366 48101 53997 -18338 -63264 -16067 53854 44982
282 44982 -28944 -60113 -3866 57428 34949 -37950 -55217 7678 58953 24425 -45286 -48970
294 -48970 18348 58793 13841 -51063 -41757 28078 57110 3300 -55305 -33737 36765 54024
$$ packed form
210c8217m5939P6354Q7938k8292j03612k8516Q8092P6960m5901j02472j0549R6685
222B2531O4032o1105r7636O888J01048M9082p3410q9493K3302J01777L3401q2332
234a915p8723L7805R8872J7419q8134o6099N0431R3235J916r0923n2275O0801
246a7590Q5243j2880r1288l7739O9271P5482k6734q9250k2711P5676O3976l9670
258C1786q4937p353P9880N0942n1092p8209P897Q1577L6535o0738o9087K2521
270d0278Q0471K1330o7939n7807L5857P6467N896p2335m4926M7197O9921q872
282D4982p3926l1169N6247O1294k2479p2899j7267O2895N1275l4528o9711l684
294d8970O7318M0445m4952o4904R306O9835K9032n3810n8605K1568P0502J7259
$$ plain form
306 54024 -7023 -57986 -24998 44245 49514 -16915 -58914 -15670 50254 43509 -26112 -57879
318 -57879 -6013 54375 36106 -34144 -54807 3593 56400 27647 -40626 -49814 12673 56254
330 56254 18519 -45316 -43261 20840 54079 9254 -48166 -35599 27832 50298 241 -49351
342 -49351 -27289 33621 45285 -8310 -49158 -18667 38232 39292 -16304 -47708 -9897 41786
354 41786 32560 -23674 -45150 -1071 44227 25109 -30291 -41417 7642 45353 17031 -35902
366 -35902 -36461 15950 44982 8565 -40157 -30355 23495 43006 22 -42811 -23342 29876 39485
379 39485 -8184 -43707 -15750 34815 34659 -15620 -42977 -8023 38260 28928 -22125 -40873 -472
392 -472 40337 22631 -27638 -37692 6727 41189 15997 -32184 -33673 13500 41009 9179 -35833
$$ packed form
306E4024o1047n0963L2988O9243N269o6429m1999M3244O5924o745o9621l1767
318e7879N1866O0388j8269p0250k0663N8400N2807k8753o8273r188O2487M3581
330E6254l7735o3835K055O4101L3239m4825n7420J2567O3431K2466n0057m9592
342d9351K2062O0910J1664n3595m0848L0491N6899J060n5596l1404L7811N1683
354D1786r226n6234k1476M4079M5298j9118n5400j1126M9059L7711k8322n2933
366c5902n59N2411K9032l6417m8722R802N3850J9511m2984m2833J9469N3218R609
379C9485m7669l5523K7957N0565j56n0279k7357L4954M6283r332n1053j8748M0401
392d72M0809j7706n0269j0054M4419L4462k5192m8181j489M7173K7509l1830m5012
$$ plain form
405 -35833 -28944 19773 39814 2228 -38525 -23488 25497 37522 -4746 -40068 -17367 30391
417 30391 34077 -11508 -40298 -10724 34187 29471 -17784 -39043 -3823 36615 23880 -23163
429 -23163 -36341 2967 37540 17628 -27428 -32440 9309 37092 11103 -30511 -27624 14981
441 14981 35424 4562 -32460 -22234 19927 32844 -1788 -33478 -16486 24182 29541 -7889
453 -7889 -33652 -10478 27763 25581 -13718 -32995 -4302 30597 20985 -19145 -31448 1972 32536
466 32536 15799 -23932 -28902 8138 33366 10114 -27820 -25340 13900 32905 4166 -30531
478 -30531 -20909 18933 31200 -1717 -31964 -15851 23009 28384 -7229 -32126 -10485 26063
490 26063 24727 -12197 -31223 -5097 28134 20553 -16575 -29485 193 29367 15968 -20352
$$ packed form
405c5833O889M8717K0041l7586m0753J5037M8985J2025m2268l5322K2701M7758
417C0391L686m5585k8790K9574M4911m716m7255k1259L5220M0438j2735m7043
429b3163j3178L9308L4573j9912m5056n012M1749K7783k5989m1614K887M2605
441A4981K0443l0862l7022J0226M2161J2917l4632l1690J6992M0668N359l7430
453g889k5763K3174L8241k182l9299j9277K8693L4899r612m0130j2303L3420L0564
466C2536j6737l9731m970L7040K5228k3252l7934K480L9240J9005k8739l4697
478c0531R622L9842J2267l2917l0247J6113L8860N375l5613k4897K1641L6548
490B6063j336l6924j9026K6126L3231p581l7128j2910K9678K9174j3399l6320
$$ plain form
502 -20352 -27083 5316 29860 11127 -23597 -24050 10253 29597 6041 -26215 -20435 14927 28550
515 28550 771 -28062 -16158 19106 26580 -4495 -28951 -11368 22585 23652 -9514 -28709
527 -28709 -6257 25086 19921 -13991 -27376 -1084 26488 15547 -17688 -25038 3810 26811
539 26811 10877 -20549 -21968 8288 26233 6140 -22596 -18418 12306 24945 1434 -23950
551 -23950 -14512 15841 23097 -3152 -24718 -10383 18979 20737 -7620 -24886 -6007 21618 17839
564 17839 -11889 -24366 -1442 23603 14384 -15758 -23059 3136 24790 10456 -19036 -20899 7512
577 7512 24984 6227 -21478 -17991 11459 24169 1911 -22936 -14519 14738 22503 -2210 -23497
590 -23497 -10735 17308 20122 -6022 -23219 -6833 19196 17299 -9471 -22322 -2918 20487
$$ packed form
502b0352o731L2399K4544j8733l4724m53L4303J9344k3556l2256N780L5362J3623
515B8550k7779k8833J1904L5264P474l1075k4456J7583L3953J067l3166j9195
527b8709K2452L1343n165l3912j3385K6292K7572j0941l3235p350K8848K3001
539B6811j5934l1426j419L0256J7945k0093k8736M178L0724J2639k3511k5384
551b3950R438L0353P256k6249k1566J4335K9362J758k8357j7266J8879K7625l779
564A7839k9728j2477K2924K5045r219l0142p301K6195K1654j4334k9492j863K8411
577G512J7472j8757k7705L487K9450J2710k2258k4847Q417K9257P765k4713k1287
590b3497J2762K8043K814k6144j7197J6386K6029j897k6770j2851J9404K3405
$$ plain form
602 20487 14158 -12542 -20935 972 21315 10716 -15316 -19054 4807 21627 7037 -17729 -16706
615 -16706 8554 21347 3114 -19626 -13837 12047 20384 -917 -20848 -10464 15075 18643 -4839
628 -4839 -21221 -6768 17413 16239 -8428 -20727 -2971 18933 13302 -11492 -19472 729 19670
641 19670 10048 -13963 -17608 4163 19720 6697 -15869 -15341 7315 19231 3315 -17283 -12787
654 -12787 10164 18312 -64 -18287 -9984 12757 16994 -3413 -18854 -6953 15057 15220 -6715
667 -6715 -18913 -3680 16900 12962 -9789 -18331 -285 18145 10227 -12480 -17038 3070 18654
680 18654 7182 -14598 -15144 6160 18363 3979 -15993 -12715 8831 17386 828 -16692 -9970
693 -9970 10992 15850 -2147 -16807 -7086 12691 13937 -4912 -16448 -4139 14014 11750 -7460
$$ packed form
602B0487o329k6700q393K1907K0343j0599k6032l738K3861J6820j4590k4766J023
615a6706K5260J2793j8233k2740N789K5884Q337k1301j9931J0384K5539L568k3482
628d839j6382J4453K4181j174k4667j2299J7756K1904n631k4794p980K0201J8941
641A9670r622k4011l645K1771J5557j3023k2566N28K2656J1916j5916k0598M496
654a2787K2951Q148j8376j8223Q303K2741M237k0407j5441J1901K2010J63k1935
667f715j2198J5233K0580l938k2751q542J8046J8430p918k2707m558K0108J5584
680A8654j1472k1780n46K1304J2203j4384j9972L278K1546Q555j6558j7520O722
693i970K0962M858j7997j4660R721J9777J246j8849j1536J2309J8153k264j9210
$$ plain form
706 -7460 -15724 -1169 14999 9335 -9853 -14679 1834 15655 6690 -12025 -13252 4822 15884
719 15884 3819 -13849 -11393 7675 15599 834 -15181 -9127 10185 14710 -2132 -15868 -6565
732 -6565 12235 13239 -4899 -15867 -3849 13635 11338 -7273 -15245 -1179 14442 9151 -9235
745 -9235 -14136 1338 14712 6802 -10779 -12672 3668 14543 4405 -11980 -10977 5822 14080
758 14080 1965 -12909 -9028 7866 13294 -544 -13528 -6852 9738 12126 -3090 -13783 -4453
771 -4453 11312 10597 -5530 -13572 -1870 12518 8653 -7745 -12827 735 13146 6426 -9571
784 -9571 -11579 3195 13218 4042 -10870 -9934 5360 12746 1644 -11697 -8012 7180 11860 -611
798 -611 -12074 -5998 8675 10695 -2750 -12133 -3922 9927 9343 -4768 -11941 -1802 10939 7800
$$ packed form
706g460q264J4555J6168n664j9188m826J6513J3821q965j8715j227J8074J1062
719A5884j2065j7668K456J9068P924j4765j6015O054J9312M525j6842j3736R303
732f565J8800J004j8138j0968J2018J7484k297j8611p972J4066J5621n291j8386
745i235m901J5474J3374p910j7581j893J6340J0875j0138j6385J003J6799Q258
758A4080j2115j4874L881J6894N428j3838j2984O676J6590K388j5216j0693R330
771d453J5765p15j6127q042J1702J4388l865j6398n082J3562J2411o720j5997
784i571k008J4774J0023r176j4912R36J5294P386j1102j3341L685J5192M680j2471
798f11j1463O076J4673K020j3445r383Q211J3849n84j4111p173J0139J2741l139
$$ plain form
812 7800 -6682 -11502 368 11725 6069 -8458 -10753 2584 12219 4125 -10018 -9643 4741 12293
826 12293 2000 -11199 -8178 6692 11850 -146 -11906 -6411 8309 10951 -2202 -12063 -4457
839 -4457 9444 9621 -4032 -11728 -2490 10167 8041 -5566 -10987 -578 10488 6326 -6846 -9986
853 -9986 1265 10519 4502 -7913 -8768 3051 10323 2600 -8821 -7384 4778 9928 617 -9576
867 -9576 -5790 6440 9270 -1452 -10065 -3985 7949 8298 -3506 -10205 -2007 9170 7010 -5387
881 -5387 -9964 -23 9969 5444 -7000 -9288 1911 10306 3747 -8223 -8255 3615 10210 2035 -9033
896 -9033 -7028 5082 9782 373 -9510 -5655 6300 9109 -1201 -9708 -4193 7316 8240 -2700
910 -2700 -9698 -2682 8183 7201 -4186 -9496 -1057 8894 5951 -5609 -9014 638 9362 4484 -6895
$$ packed form
812G800j4482m820J1870J1357n656j4527k295J3337R635q094j4143L75J4384P552
826A2293j0293j3199L021J4870N158j1996j1760N495J4720K642j3153r861P606
839d457J3901J77j3653p696R238J2657k126j3607n421J0409J1066m162j3172l140
853i986J1251R254o017j2415q55J1819P272p723j1421J437J2162N150r311j0193
867i576L786J2230K830j0722q613O080J1934L49j1804o699Q198J1177k160j2397
881e387m577R941R992m525j2444k288J1199Q395o559j1970l2J1870O595q175j1068
896i033K005J2110M700r409r883L855J1955K809j0310q507N515J1509R24j0940
910b700o998P016J0865r82j1387n310Q439R951k943j1560l405R652Q724m878j1379
$$ plain form
925 -6895 -8251 2359 9504 2832 -7924 -7149 3983 9254 1087 -8590 -5764 5363 8612 -613
939 -613 -8851 -4227 6429 7655 -2168 -8727 -2629 7149 6469 -3506 -8272 -1051 7595 5175 -4675
954 -4675 -7664 451 7834 3795 -5702 -6876 1944 7922 2367 -6624 -5970 3405 7856 849 -7450
969 -7450 -4916 4821 7585 -734 -8064 -3663 6138 7057 -2322 -8391 -2273 7220 6242 -3834 -8384
984 -8384 -797 7964 5194 -5096 -8001 644 8331 3979 -6065 -7318 1951 8348 2721 -6734 -6426
999 -6426 3072 8056 1454 -7129 -5394 4024 7561 224 -7321 -4273 4868 6907 -1004 -7393 -3067
1014 -3067 5627 6105 -2242 -7294 -1739 6304 5158 -3472 -7024 -330 6832 4005 -4667 -6509 1140
1029 1140 7114 2690 -5669 -5725 2579 7110 1283 -6394 -4728 3819 6800 -119 -6808 -3589 4827
$$ packed form
925f895j356J0610P145o672j0756P75J1132N271q167r677K826J1127L249r225
939f13q238M624J0656J226r823o559O098R778o80r975m766P221Q646k420r850
954d675k989Q115P383m039r497j174Q820N978n555q991O54R375M451p007q299
969g450K534R737K764q319p330M401R801R19r379o069O118R493r78j0076m550
984h384P587Q761k770j0290k905Q645P687m352j0044j253R269O397n627r455L08
999f426R498M984o602q583J735R418L537p337p545L048R141K039p911o389M326
1014c067Q694M78q347n052N555Q043j146q630l552O694P162k827q672j842P649
1029A140N974m424q359n6Q304M531n827p677J666Q547K981o919o689L219Q416
$$ plain form
1044 4827 6196 -1406 -6916 -2395 5556 5431 -2543 -6768 -1198 6069 4535 -3537 -6474 -54 6419
1059 6419 3592 -4420 -6034 1088 6638 2578 -5218 -5467 2228 6723 1470 -5951 -4758 3376 6646
1074 6646 274 -6528 -3861 4455 6326 -983 -6906 -2801 5364 5752 -2203 -6955 -1639 6030 4946
1089 4946 -3263 -6707 -467 6382 3991 -4101 -6194 626 6449 2946 -4730 -5499 1607 6282 1881
1104 1881 -5135 -4679 2479 5964 833 -5423 -3781 3278 5519 -234 -5606 -2799 4052 4977 -1327
1119 -1327 -5666 -1737 4765 4297 -2447 -5622 -556 5369 3439 -3529 -5365 655 5764 2446 -4478
1134 -4478 -4886 1848 5920 1361 -5194 -4204 2911 5792 276 -5633 -3367 3766 5430 -744 -5805
1149 -5805 -2486 4399 4899 -1630 -5766 -1581 4847 4277 -2414 -5590 -703 5154 3567 -3131 -5278
$$ packed form
1044D827J369p602n510M521P951j25p974m225N570P267j534q072k937O420O473
1059F419k827q012j614P122N550m060p796k49P695M495n253p421J193Q134L270
1074F646o372o802K667Q316J871p309n923M105Q165L88p955m752N316P669j084
1089D946q209l444O240O849k391q092k093O820N823l503p676p69P106M675m401
1104A881p016M56P158L485n131o256J642P059K241n753n372K807O851R25o304
1119a327m339L929O502m68o744l175N066N925j930o968j836O020N109l318o924
1134d478m08O734M072m559o555R90P115K881n516n909K266P133J664o174n061
1149e805L319O885N00o529m136M185O428n70o691l176M887N857j587o698k147
$$ plain form
1164 -5278 192 5363 2789 -3806 -4878 1107 5485 1903 -4427 -4336 2053 5446 917 -4956 -3621
1179 -3621 2980 5238 -122 -5301 -2765 3785 4809 -1161 -5419 -1805 4410 4196 -2092 -5313 -818
1194 -818 4802 3429 -2858 -4952 106 4945 2599 -3450 -4465 962 4920 1758 -3895 -3881 1719 4768
1210 4768 907 -4211 -3211 2420 4523 62 -4481 -2519 3103 4192 -836 -4665 -1700 3761 3744
1225 3744 -1762 -4729 -802 4338 3158 -2657 -4629 149 4754 2430 -3456 -4347 1098 4947 1616
1240 1616 -4067 -3862 1945 4933 779 -4465 -3253 2634 4691 -3 -4660 -2582 3174 4325 -722
1255 -722 -4670 -1896 3557 3844 -1363 -4556 -1198 3851 3307 -1958 -4375 -469 4090 2707 -2573 -4107
1271 -4107 301 4253 2002 -3152 -3728 1132 4324 1217 -3662 -3202 1945 4256 349 -4065 -2547
$$ packed form
1164e278N470N171k574o595j072N985M378l582o330R1O389L393m529n873J335
1179c621O601K258n360n179K536O550J024n970m258L614O215k14o288l221M495
1194h18N620j373o287k094N058M839k346o049j015N427L958l162n653J4N600L049
1210D768l861n118J000N631K103m461m543J962N622J089n028l829K965N461j7
1225C744n506k967L927N140j180n815j972M778M605k324n886q91N445L849l331
1240A616n683K05N807K988m154n244J212N887K057m694m657K078N756J151n047
1255g22l948K774N453K87n207l193L358N049n44n265k417L906M559j383n280j534
1271d107M408L952k251n154n76M860L192l107m879M60N147K311l907m414J518
$$ plain form
1286 -2547 2697 3995 -523 -4274 -1793 3288 3577 -1325 -4286 -1008 3692 3037 -2001 -4105 -264
1301 -264 3929 2407 -2543 -3812 402 3985 1813 -2956 -3419 1045 3965 1171 -3293 -2980 1633 3868
1317 3868 506 -3578 -2466 2224 3693 -205 -3810 -1870 2805 3426 -961 -3958 -1172 3339 3008
1332 3008 -1710 -3957 -425 3743 2477 -2394 -3783 344 3988 1860 -2964 -3466 1033 4029 1178
1347 1178 -3342 -3019 1637 3889 538 -3544 -2509 2099 3644 -47 -3624 -1966 2476 3316 -600
1362 -600 -3590 -1403 2766 2931 -1114 -3514 -813 3042 2476 -1661 -3369 -181 3251 1947 -2209 -3136
1378 -3136 512 3406 1324 -2699 -2785 1221 3441 636 -3113 -2318 1876 3328 -85 -3382 -1760 2415
1394 2415 3073 -742 -3469 -1159 2809 2694 -1298 -3391 -604 3044 2273 -1762 -3231 -57 3174 1816
$$ packed form
1286b547N244J298m518l751K481N081K89m902k961L278M700o55n038k104L841
1301b64M193j522m950j269M214L583k172m769m63M464K920k794m464L13M613K235
1317C868l362m084J112M690J469l898l605J940M675O21m387k997K786M511l31
1332C008m718k247L532M168j266m871j389M127L644k128m824n02M499K996k851
1347A178m520L23M656K252l351m082J035M608J545l691l577J658M442Q40l916
1362f00k990K187M169J65m045k400K701L855n66m137j708L188L432j304m156r27
1378c136L648K894k082m023q6M006K220k805l749P95M194J452l413l297J622M175
1394B415O58l815k727K310L968j15l992k093K787L648p71m035j469L174L231j358
$$ plain form
1410 1816 -2117 -2976 452 3203 1341 -2433 -2690 924 3180 831 -2715 -2338 1423 3109 276 -2958
1426 -2958 -1899 1921 2950 -333 -3149 -1390 2383 2685 -964 -3214 -797 2781 2300 -1541 -3138
1441 -3138 -172 3055 1825 -2034 -2940 409 3149 1315 -2387 -2632 921 3111 819 -2609 -2254 1335
1457 1335 2976 337 -2730 -1851 1667 2756 -110 -2779 -1429 1965 2507 -558 -2792 -978 2248
1472 2248 2195 -1033 -2759 -475 2492 1815 -1528 -2648 98 2708 1348 -1990 -2434 691 2821 821
1488 821 -2404 -2119 1267 2809 248 -2676 -1716 1751 2676 -286 -2824 -1255 2130 2429 -766 -2838
1504 -2838 -822 2358 2122 -1152 -2744 -391 2495 1794 -1467 -2595 -2 2571 1442 -1749 -2414 382
1520 382 2606 1048 -2011 -2148 811 2600 610 -2258 -1838 1273 2521 91 -2474 -1437 1711 2347
$$ packed form
1410A816l933q59L428K751j862l774k57L614K256k349l546L77L761J686k833l234
1426b958J059L820J029l283k816J759L773L02l649k250K417L578m81l841j597
1441c138K966L227j230l859r06L349K740j834l702k45L553K190k292l428L55L589
1457A335J641k639l067Q79L518J089k866k669J350L394N42l065k234J814L226
1472B248n3l228j726K284K967o77l343j120K746K610j360l338m44L125K130k000
1488H21l225K85L386J542k561k924R60L467R25k962k538J569L385K99l195k072
1504b838K016L180k36l274j592K353K886p01l261j128K593K573j129l191o65K796
1520C82K224j558l059j37K959J789j990k868M20L111J248k430k565J037L148O36
$$ plain form
1536 2347 -440 -2601 -955 2090 2087 -961 -2588 -433 2365 1712 -1414 -2477 62 2513 1313 -1755
1552 -1755 -2274 490 2519 904 -1986 -1990 855 2444 523 -2128 -1699 1161 2329 153 -2233 -1379
1568 -1379 1441 2174 -230 -2275 -1032 1724 1966 -638 -2315 -618 1968 1692 -1042 -2261 -153 2196
1584 2196 1342 -1477 -2149 339 2346 931 -1849 -1925 817 2372 479 -2115 -1639 1235 2298 45
1600 45 -2275 -1288 1538 2129 -356 -2311 -943 1747 1911 -677 -2279 -615 1889 1652 -942 -2165
1616 -2165 -275 1979 1389 -1196 -2033 41 2040 1086 -1436 -1864 406 2084 724 -1671 -1627 797
1632 797 2067 307 -1895 -1330 1195 1964 -141 -2047 -949 1533 1785 -587 -2105 -533 1800 1503
1648 1503 -985 -2050 -147 1958 1207 -1290 -1922 218 2024 907 -1501 -1734 524 2021 598 -1653
$$ packed form
1536B347k787k161J646L045ll048j627K155K798o53l126j063K539K451j200l068
1552a755n19K764K029j615k890mK845J589j921k651M29K860J168k176k386Q54
1568a379K820P33k404k045J243K756K42k604j677J697K586k76k734j219K108K349
1584B196q54k819o72K488K007j415k780p6K742J555j893k594M76K874J063k253
1600D5k320R87K826N91k485j955J368K690J64k588j602J664K504k37k594j223
1616b165J890K254n90k585q37K074J999r54k522m28K270J678j360k395M4K424
1632G97J270j760k202N65K525P69k105j906J098K482K52k372j518J572K333k97
1648A503k488j065J903K105p51k497o32K140J806j117k408k33K258J497j423k251
$$ plain form
1664 -1653 -1527 773 1947 323 -1755 -1288 1020 1849 21 -1821 -1037 1253 1723 -317 -1886 -735
1680 -735 1488 1534 -669 -1899 -354 1702 1272 -1021 -1825 52 1866 946 -1368 -1691 448 1929 581
1697 581 -1608 -1459 805 1899 236 -1760 -1196 1086 1792 -100 -1828 -926 1297 1641 -369 -1825
1713 -1825 -673 1435 1457 -608 -1782 -391 1540 1250 -844 -1705 -120 1628 1018 -1074 -1601 186
1729 186 1711 742 -1307 -1441 513 1731 393 -1515 -1229 869 1686 33 -1676 -934 1203 1581 -340
1746 -340 -1766 -603 1432 1398 -685 -1754 -285 1586 1165 -947 -1676 24 1677 933 -1135 -1557 265
1763 265 1679 690 -1275 -1399 467 1642 464 -1377 -1229 675 1600 220 -1468 -1028 898 1511 -53
1780 -53 -1533 -779 1113 1375 -375 -1581 -473 1317 1180 -680 -1543 -132 1470 929 -982 -1462 206
$$ packed form
1664a653J26K300J174j624k078M67K308Q29j828j842P84K290M70k040j569J151
1680g35K223M6k203j230J545K056m30k293q04J877J814r20k314l23K139J481j348
1697E81k189J49K264J094j663j996N64K282P06j892j728R02K223L44k010j456
1713a825J152K108K2k065j174J391J931k90k094q61J585J748o10k092n27J787
1729A86J525r69k049j34J954J218j338j908K86K098Q17j653j709P42K137L78j921
1746c40j426J163K035l4k083j069J469J871m21k112p29J700J653p44k068m22J822
1763B65J414r89j965j24J866J175j178j841J48J904R25j380j688M40J926O13j564
1780e3j480P54J892K62j750j206J108J790j37j860q63J411J602n41j911m80J668
$$ plain form
1797 206 1569 646 -1216 -1290 515 1577 340 -1384 -1101 780 1522 81 -1456 -893 940 1418 -152
1814 -152 -1487 -697 1091 1293 -345 -1482 -499 1193 1154 -532 -1442 -283 1277 999 -725 -1380 -32
1831 -32 1373 790 -934 -1280 249 1429 525 -1133 -1129 527 1423 228 -1298 -918 811 1352 -84 -1387
1849 -1387 -663 1038 1231 -356 -1421 -416 1180 1063 -584 -1374 -192 1250 885 -752 -1296 12
1865 12 1298 709 -869 -1192 198 1287 540 -973 -1077 375 1278 348 -1062 -938 562 1247 129
1882 129 -1170 -760 761 1169 -134 -1235 -522 961 1041 -413 -1254 -261 1121 862 -669 -1226 22
1899 22 1235 640 -885 -1116 278 1278 423 -1034 -996 485 1258 221 -1123 -850 640 1195 52
1916 52 -1153 -701 763 1120 -98 -1170 -565 842 1031 -254 -1184 -399 941 926 -435 -1157 -203 1033
$$ packed form
1797B06J363r23j862p4J805J062j237j724K83J881P42j441j537N63J833M78j570
1814a52j335P90J788K02j638j137R83J692l9j686r10J159J560k78j724o55J348
1831c2J405n83j724l46J529J180r04j658MJ656Q96j195j526L80J729N41j436j303
1849a387P24J701J93j587j065J005J596j17j647p90J182J442l65j637n44J308
1865A2J286n89j578l23J390J089p47j513j04J452R03r30j410J24J500O85j118
1882A29j299M10J521M08j303j101P13J483Q0j454q41R93J382k59j531n57J248
1899B2J213n95j525k31J394J000q55j457L8J481P73j037j344K73J490N55j143
1916E2j205M52J464L57j218j072O05J407J89j285r30P85J340j5j361p22R54J236
$$ plain form
1934 1033 759 -606 -1087 22 1103 563 -801 -987 277 1128 323 -952 -823 524 1116 72 -1062
1951 -1062 -622 724 1030 -167 -1110 -430 871 910 -359 -1093 -231 960 778 -511 -1050 -86 999 660
1969 660 -641 -1006 50 1032 528 -725 -928 201 1039 379 -816 -840 356 1033 202 -916 -711 530
1987 530 1002 0 -995 -532 713 909 -228 -1039 -319 868 793 -440 -1021 -106 969 629 -627 -959
2005 -959 110 1021 457 -773 -852 280 1015 290 -850 -773 417 991 158 -883 -653 522 936 24
2023 24 -920 -536 595 870 -106 -924 -425 687 805 -252 -917 -249 786 676 -415 -891 -52 856 517
2042 517 -599 -821 164 905 326 -738 -715 377 908 119 -844 -578 544 861 -82 -915 -422 676 785
2061 785 -235 -918 -270 757 696 -354 -904 -145 799 613 -462 -878 -35 838 526 -547 -824 74 871
$$ packed form
1934A033k74j365m81J109J081n40j364j86J264Q51q05j275J29J347N92j044j134
1951a062M40J346L06j197r43O80J301L9j269p34Q62J191j82j289n39R64J085l39
1969F60j301l65J056R82n04j253k03J129Q38o60j195k4J196O77q31j118K05J241
1987E30M72j002r95M63J245J96j137q11P20J187p5j233n81R15J075l40j256l32
2005i59J069R11n64j230p9J132P35p25j140P7J190N74q33j041K30J175M14r12
2023B4r44L84J131K75r76q18M99J112J18j057o65O68J035j10j091m76Q39R08l39
2042E17j116k22R85P41n79j064K3J092N31p89r63K66J122L17r43q33M93J098J09
2061G85j020o83O48J027o1j050n50P59R44j86j075m16Q43Q73l12j073k77Q98P97
$$ plain form
2080 871 423 -629 -759 208 875 276 -712 -651 364 858 100 -788 -522 522 815 -91 -830 -351 647
2099 647 706 -287 -853 -165 756 571 -445 -794 16 823 441 -559 -748 160 821 290 -655 -668 277 818
2119 818 190 -690 -575 378 794 79 -746 -492 450 753 -20 -758 -400 538 693 -150 -773 -280 643 620
2139 620 -293 -770 -115 714 488 -453 -732 66 769 331 -594 -652 243 785 167 -705 -541 392 744 6
2159 6 -758 -414 513 702 -123 -769 -299 601 643 -219 -766 -209 647 574 -312 -749 -110 674 497 -384 -708
2180 -708 -5 697 408 -456 -670 91 722 312 -555 -587 235 722 147 -634 -483 370 675 -16 -689 -348
2200 -348 504 607 -186 -699 -186 598 502 -319 -675 -37 668 388 -445 -631 85 679 293 -507 -567 186 678
2221 678 198 -559 -511 267 654 114 -597 -450 330 640 16 -622 -379 411 596 -76 -651 -275 494 536 -200
$$ packed form
2080H71m48j052j30R67O67n99r88O1J015M94p58q88K66J044K93r06p39M79R98
2099F47N9r93n66O88R21j85j016l49Q10Q07l82j000j89R08O61n31r45j3R45N41
2119H18o28q80J15R53M16p15q25K54R42L03p73p38L58R38J55q43o23M93R23k3
2139F20r13m77O55Q29k26r41k79P98P03m38r25n8Q95N42o18q72J64R33L52p38
2159Fp64L44R27J89q25o46M70R00M2q62n47N57Q56p3q86m37O39P84j77q81l24
2180g08P03P02k89q64k14P61O31m10q67l2Q22M87n75p81J51Q53L05o91o73L41
2200c48Q52J03p93n13N13P84r6q21l56O38P05k80q33j86P16N94l86q00o0P53M92
2221F78m80p57M8P78L87n40p11J47P80L10o24o38K43P90J85o72n75L76P69M2p36
$$ plain form
2242 -200 -638 -139 551 447 -321 -615 5 617 326 -439 -554 152 640 193 -543 -471 287 623 66 -589
2262 -589 -374 391 588 -59 -610 -281 448 527 -147 -615 -220 486 478 -215 -604 -130 515 427 -274 -572 -52
2283 -52 537 358 -335 -543 36 563 269 -414 -503 143 573 167 -487 -409 264 548 23 -545 -300 384 495
2304 495 -112 -561 -184 466 426 -236 -555 -55 519 344 -335 -526 32 536 257 -402 -487 129 535 200 -433
2325 -433 -444 186 547 142 -451 -399 231 532 78 -484 -348 300 507 -9 -520 -269 363 471 -115 -520 -169
2346 -169 438 399 -210 -508 -45 486 310 -323 -460 83 506 184 -408 -401 195 505 79 -465 -323 273 480
2367 480 -1 -482 -267 324 440 -73 -488 -208 365 411 -117 -481 -144 391 382 -173 -474 -90 426 325 -246
2388 -246 -468 -25 447 259 -316 -423 75 459 166 -368 -368 173 451 55 -430 -278 275 416 -53 -448 -173
$$ packed form
2242b00m38M99O90j04p68k94O20O12k91p65j15P06M88m47p36P2P58L36n57o55
2262e89K15P65J97o47n51L29P29P9o74m68L95P06qo93l89M74O45q8p01k98N20
2283e2N89j79o93k08N79N27k94o83q9O46M30m06o54P8O73K84n25n68K45O84J11
2304D95o07m49L77O50m0o62l19N00N74j75o79j91N58N04k79o59q5O16M06l35o33
2325d33j1O30L61m05n93N2O30L01m54n62J36O48K07n16n11K51O32J08n86m05L51
2346a69O07l9o09k98M63N31j76o33j37N43M23l22n92PN96L10m26n44J42N96K07
2367D80m81m81K15N91J16n13m15K80N73M6n28l64L37N35rn55l01L84N16j01n71
2388b46k22M43M72j88n75j07M98L84k93n34%N41K78l96m85J52N53J41m69l95K75
$$ plain form
2409 -173 360 366 -158 -437 -84 402 310 -232 -428 -6 420 245 -280 -407 57 446 191 -310 -379 109 430
2430 430 149 -348 -355 143 432 98 -378 -308 201 419 34 -406 -259 253 388 -48 -416 -179 323 334 -136
2451 -136 -411 -71 366 273 -225 -382 22 391 172 -316 -337 132 407 95 -347 -273 203 388 25 -370 -229
2472 -229 237 358 -35 -375 -183 268 330 -73 -379 -141 294 312 -112 -388 -105 316 280 -169 -368 -47 341
2493 341 230 -221 -353 42 371 175 -291 -311 111 360 80 -316 -242 205 346 -24 -354 -171 272 299 -110
2514 -110 -359 -92 304 258 -178 -356 -20 324 216 -210 -328 14 327 176 -240 -319 47 346 150 -268 -301
2535 -301 88 350 117 -285 -266 139 359 59 -318 -222 187 313 -12 -337 -168 255 293 -89 -333 -80 299
2556 299 232 -174 -320 3 321 152 -224 -285 85 326 79 -276 -241 147 323 25 -312 -207 185 312 -16
$$ packed form
2409a73N33On24k79L53M86r2n42j96M22M26j75n25j27M64L89k55n01o9M88L21
2430D30k81m97pM98K89l34m76P0N09K18l85m40J47N12J35m36l68K37N02J1m70
2451a36k75L40M37r3m98j57M04L69k19m88k1M69K75l12m42P4M76J85l63l95J41
2472b29M66J21l93l40J92M51O2m03l06K38M35J8m24k76K83M21l6m49j99L21L88
2493C41j11m51j32L95L29j96m66k0M22K49k80l96P4M47J41l70l30J83M43K7m09
2514a10k49K67L96m6m36j78L36L44j08m26j18L42L13j51m16p9L66K99j96m18l3
2535c01L89K62k33m02J9M05K20l00l77R6M09J26l25l25J69M23L8l82k44K53L79
2556B99o7m06j46L23L18j69l76o1L70K41k47l55L5L88J76k98l37J05L92J27l28
$$ plain form
2577 -16 -319 -177 220 301 -49 -329 -134 248 286 -83 -320 -101 273 259 -129 -320 -59 300 216 -171 -314 2
2599 2 320 169 -230 -281 81 323 81 -273 -241 152 309 6 -299 -163 219 279 -69 -318 -92 265 233 -132
2621 -132 -306 -30 283 199 -166 -297 -4 290 155 -195 -277 25 296 139 -219 -271 64 301 100 -249 -251 104
2643 104 297 57 -277 -220 150 291 0 -290 -145 205 250 -71 -295 -82 248 209 -146 -284 -4 277 156
2664 156 -215 -246 69 275 82 -241 -219 116 286 34 -265 -180 155 272 3 -271 -153 182 265 -21 -279
2685 -279 -134 202 249 -60 -281 -105 229 221 -92 -283 -73 253 200 -141 -271 -13 258 137 -184 -241 60 262
2707 262 86 -223 -200 133 254 14 -243 -137 177 240 -56 -250 -84 204 200 -105 -252 -42 238 165 -129 -237
2729 -237 0 238 136 -160 -241 29 244 122 -188 -228 51 252 91 -200 -217 90 253 53 -232 -183 128
$$ packed form
2577a6l03J42L97Q1l50k80J95L82L8l69k37K19L74j4l88j91K61L59q4l87j43L16
2599BL18j51l99n1L62K42k42l54L2L93J57l03l05J36L82O0l48k49K26L57l2l65
2621a32j74K76L13q4l65j31K93K94j35l50q2L02K71j57l58n2L35K37k01l49kL55
2643A04J93k40l34N7L70J41k91k90J45L50M5l21k24K13L30l9l55j38K80K81j21
2664A56l71l1L15K06j93l23K2L35J70k52k99Q5L35J17k69k74J18L35Q3k86k58
2685b79J45L36M7l09k21J76L34ql13j91K10L26n3l41j30K58K71j21l21n7L01K02
2707B62j76l09K3L33J21k40k57J06L14O3k96j94J66K88ml05j47K10K80p3k94j08
2729b37K37K38j02k96q1K70K15j22l10m0K79K01j61k91j7L07J63k00k85M9L11
$$ plain form
2750 128 248 6 -244 -131 173 230 -53 -256 -74 213 182 -116 -246 -15 228 137 -164 -215 47 239 86
2771 86 -197 -191 97 245 39 -223 -157 120 227 8 -221 -140 151 213 -13 -222 -117 165 211 -42 -232 -84
2793 -84 184 194 -68 -230 -47 207 172 -101 -211 3 226 119 -154 -203 60 233 69 -183 -159 110 226 4
2815 4 -210 -105 149 190 -45 -229 -59 184 163 -88 -218 -23 200 144 -110 -194 -1 200 128 -134 -196 27 217
2838 217 96 -150 -187 50 227 88 -176 -165 85 223 53 -191 -158 102 205 9 -197 -111 135 188 -40 -199
2860 -199 -63 172 157 -95 -196 -15 192 108 -133 -178 43 201 69 -158 -149 70 194 32 -183 -122 112 188
2882 188 0 -176 -94 123 171 -24 -182 -92 132 166 -38 -185 -67 148 152 -69 -200 -44 177 134 -98 -180 -12
2905 -12 190 102 -121 -167 33 180 52 -159 -137 87 181 12 -165 -92 125 163 -40 -177 -54 162 141 -70 -178
$$ packed form
2750A28J20k42k50J13L04N7k83k03J82K87l1k98j30K31K43r1l01n1K62J92j53
2771H6k83OK88J48k06k62O6K77J07k19k29Q1K91O2k26k09J05K82M6k53j90J48
2793h4K68J0k62j62J83K54l5k73j10K14K23j07k73m9K63J73j64k52K4K69J16k22
2815Dk14J05K54M1k35j84J70K43k1k51j30J95K23n6k54q4J93K01p2k62o2K23J90
2838B17j21k46l7K37J77j39k64J1K50J38j70k44L3K60J03j96k06Q6K46N3k28j59
2860a99J36K35j5k52j01J81K07q4k41m5K21J58j32k27RK19J24j62k15O1K34P6
2882A88j88j76Q2K17M8j95j58R0K24L4k04j47J18K15Mk21j31J56K21m3k32q2J68
2905a2K02q8k23m6K00J47j28k11K2K24R4j69j77P3K17L8k03j37J23K16k1k11j08
$$ plain form
2928 -178 -30 165 135 -92 -168 -3 181 118 -107 -172 4 174 99 -125 -160 34 180 80 -124 -154 32 175
2950 175 56 -151 -128 71 170 20 -151 -99 109 146 -27 -165 -62 138 129 -63 -176 -23 154 98 -109 -145 33
2973 33 169 61 -134 -128 71 157 25 -139 -109 79 158 18 -141 -94 101 146 -1 -153 -88 107 148 -18 -164
2996 -164 -81 122 152 -34 -167 -41 148 138 -50 -157 -3 156 113 -100 -144 21 157 63 -112 -116 61 162 30
3019 30 -138 -108 96 136 -14 -155 -65 108 123 -51 -139 -37 130 112 -68 -150 -15 128 93 -77 -145 -5 139
3042 139 81 -87 -138 12 147 75 -101 -127 41 145 53 -118 -103 60 141 22 -116 -89 85 135 -18 -140 -50
3065 -50 117 103 -50 -135 -13 135 85 -83 -120 19 135 51 -116 -112 41 139 27 -110 -96 57 127 18 -119 -85
3089 -85 74 143 18 -130 -81 89 132 -20 -130 -61 108 132 -22 -140 -39 106 112 -54 -127 -16 119 90 -78
$$ packed form
2928a78J48J95l0k27p6J65J84o3k25o5J76J70p5k24l5J94J46j00k04l0J86J43
2950A75j19k07K3J99R9j50j71N2K08L7j73j38J03K00rj92j13J53J77n6k07l6J78
2973C3J36j08j95OJ99Q6j32j64L0J88P9j40j59M7J95M5j47j52O5J95M1j66j46
2996a64Q3K03L0j86j33J26J89j0j88j07J54J59m3k13m4J65J36r4j75mJ77J01j32
3019C0j68L0K04M0j50j41R0J73J5j74q8J02J67j8j80q2J35J43l5j70o8J40J44
3042A39n8j68n1J50J35p2j76k6J68J04r2j71J5J63Q1j19j38K7J74N0j53j22R0
3065e0J67j4j53q5J22J48n0j68l7J39J16q4j67MJ53R8j12j37J4J53P0j09j37L4
3089h5J59O9j25j48M9J70M3j52j10O9J69K4j54j18J01J45Oj66p3J11J35k9j68
$$ plain form
3112 -78 -118 11 131 62 -93 -109 46 126 14 -114 -82 71 108 -15 -128 -51 101 108 -50 -129 -35 97 91 -67 -116
3137 -116 -21 120 80 -62 -124 -3 116 66 -79 -125 15 137 62 -87 -113 30 120 40 -101 -102 53 122 14 -123
3161 -123 -85 78 119 -18 -124 -56 96 85 -52 -124 -11 123 77 -81 -116 23 127 52 -92 -104 37 123 22
3184 22 -112 -94 61 124 20 -105 -77 64 110 -6 -116 -86 69 114 -6 -121 -84 82 111 -35 -123 -49 95 99
3208 99 -56 -117 -22 105 76 -72 -120 9 127 51 -113 -97 47 116 6 -110 -69 78 99 -20 -122 -49 95 92
3232 92 -50 -121 -27 103 91 -64 -120 -9 122 73 -68 -109 -10 120 59 -71 -105 9 118 63 -93 -110 22 115
3256 115 40 -101 -92 50 126 15 -112 -71 69 110 -16 -126 -56 95 87 -32 -116 -16 114 74 -76 -110 18 114
3280 114 46 -99 -101 35 106 27 -101 -89 46 107 7 -101 -63 54 115 -1 -108 -61 66 97 -11 -117 -53 86
$$ packed form
3112g8m0J29J20o9j55j6J55Q0j12j28L2J53L7j23j13P7J52Pj58p9R4J32oj58m9
3137a16R5J41m0j42o2J21J19n0j45m6J40J22p5j49k6J43R0q0j41jJ55O9j08j37
3161a23L8J63M1j37j06O8J52j1j37p2J13J34m6j58l5J39J04p5j44j2J41Q6j01
3184B2j34J8J55O3j04j25K8J41M6j16j10L0J55M5j20j15L7J66K9j46q8P4J44M
3208I9j55o1R5J27k9j48m8J29J18p6j64J6J44O9j10j16M1J47K1j19j02P3J44l
3232I2j42p1R4J30j2j55n6J11J31m9j41m1R9J30o1j30l4J14J09n5j56j7J32R3
3256A15p5j41RJ42P6j11j27M1J40M1j26j10P0J51qj19q4J00J30m0j50l4J28R6
3280A14o8j45kJ36P1p9j28J2J35O1j00j08L8J17O1j16j07M7J27L1j08j06O4J39
$$ plain form
3304 86 101 -31 -117 -32 88 94 -57 -119 -9 106 67 -78 -102 17 114 31 -98 -91 49 116 10 -112 -60 69 97
3329 97 -24 -103 -47 79 94 -36 -109 -19 89 80 -55 -107 2 105 63 -67 -96 17 109 57 -73 -109 15 110 48
3354 48 -97 -91 35 108 21 -100 -86 47 110 16 -103 -64 69 95 -19 -111 -37 79 77 -54 -101 -9 95 54 -69 -104
3380 -104 21 100 36 -86 -89 45 98 22 -99 -78 59 105 -3 -101 -56 63 95 -13 -101 -48 64 84 -21 -105 -40
3405 -40 84 86 -23 -98 -26 88 83 -53 -105 -8 103 61 -71 -93 19 103 35 -86 -78 46 102 10 -93 -52 59 98
3431 98 -15 -98 -28 89 76 -46 -97 -13 85 75 -60 -114 -3 89 67 -58 -104 3 100 40 -73 -90 9 100 32 -83
3457 -83 -84 27 97 18 -87 -82 53 102 1 -92 -60 60 83 -29 -104 -38 78 71 -45 -97 -18 82 52 -69 -95 18
3483 18 91 26 -79 -79 35 98 15 -95 -74 34 89 11 -88 -57 51 83 -16 -103 -57 54 72 -29 -90 -40 72 76 -26
$$ packed form
3304H6J5j32q6Q5J20Oj51o2J10J15l9j45k4J19R7q3j29PJ40O7j06j22N2J29K8
3329I7j21p9N6J26J5j30p3R0J08rj35n2J09J03m2j30k9J13R2n2j30l6J24R5o2
3354D8j45OJ26P3q7j21J4J33O3r4j19L9J33K6j14r2P4J16kj31m7R2J04m1j23l5
3380a04J25P9o4j22lJ34N3p6j21K1J37M6j08r8M5J19L2j08q8N3J12K0j05q4O5
3405d0J24Kj09p5P2J14nj36n2R7J11m2j32k2J12Q4o8j21QJ24N6r2j03M1J11L9
3431I8j13q3P0J17j3j22n1Q4R8j0j35n4J11R2k2j25m6J07R7o0j13j7R9R1o8j15
3457h3jJ11P0p9j05NJ35M9j01r3L2J20K3j12p5O6J16pj16n2P9J00l0j21k6J13
3483A8P3o5j05%J14O3q3j10K1J08N5p8r9L1J08L2r9q7M6J11J8j01o1N0J12Mj02
$$ plain form
3510 -26 -98 -30 73 69 -48 -95 -19 91 53 -73 -84 8 89 42 -80 -70 28 89 2 -94 -50 56 81 -17 -99 -42 75
3537 75 65 -34 -94 -33 78 51 -43 -92 -8 85 61 -53 -78 13 95 57 -65 -80 5 91 42 -70 -86 13 95 29 -79 -66
3565 -66 37 92 5 -85 -63 54 79 -11 -86 -46 56 52 -36 -93 -14 80 53 -53 -81 6 88 37 -71 -73 29 83 9 -75
3593 -75 -60 45 88 20 -84 -59 53 92 -4 -78 -64 50 80 -10 -89 -43 52 79 -29 -92 -30 62 75 -48 -87 -18 75
3620 75 57 -53 -82 11 87 35 -66 -69 30 76 14 -75 -48 45 81 -11 -91 -31 70 74 -15 -83 -22 74 70 -36 -93 -13 81 66
3650 66 -49 -80 -10 90 52 -54 -89 3 87 28 -64 -80 8 80 34 -63 -74 33 88 11 -82 -64 44 77 -11 -91 -40 64
3678 64 69 -35 -92 -6 79 54 -38 -81 8 81 35 -65 -77 5 90 29 -66 -70 37 93 14 -80 -75 30 84 -2 -91 -55 44 77
3708 77 -20 -91 -53 48 78 -21 -104 -42 74 70 -42 -91 -21 77 58 -49 -87 12 91 44 -67 -67 28 86 15 -75 -45 57
$$ packed form
3510b6p2O8J03mj17m7P6J10l8j26j1R2Q1m7j22J0R8O1q7r6M4J06K5r8q2N7J17
3537G5j0r9o0O1J11k7r4m9Q4R3k4j14k5R1Q2l8j22j5Q5Q6m9j12j6R9Q2o6j08J3
3565f6J03N5q7r0K2J17K5r0p5M0J02mq8n7P9R4k7j06k8Q7Q2n1j08kJ02N4p4q4
3593g5J5J05M3o8j04K5J12L9r6p4J4J14L0r0p9M6R5K7j08o3O2R2J3j23l9O9R3
3620G5j8j10k9R3P6n2j01lR9M6o2q9K7R3L6r2q0O0J01Mq9o8O1R6mj06n7Q0R4j5
3650F6j15l1P0J00l8j06l5R2Q4n9r2j6Q8P2m6r7j1J07N5p7r3J8J08L3q8q0N1J04
3678F4Nj04n7Q6Q5k5r2m3Q9P3m6j00j2Q2Q5o1r5mJ07N6p9r4NJ05N4q6q9L6R9L3
3708G7r7p1L8J01L0r9q3O2J16mj12m9P0R8j9j07l8R9P9m7j11%R5N8p1r0L0J02
$$ plain form
3736 57 86 -5 -87 -42 67 74 -18 -87 -30 76 58 -39 -88 -18 66 53 -47 -93 -9 82 62 -68 -92 2 82 36 -64 -81
3764 -81 20 77 32 -64 -58 31 93 13 -74 -60 48 81 -11 -88 -40 58 72 -24 -82 -15 79 56 -45 -89 -1 95 29 -73 -87
3793 -87 14 83 26 -68 -68 32 94 13 -77 -60 33 79 6 -75 -55 52 78 -7 -78 -43 65 78 -19 -91 -34 69 73 -24 -84
3822 -84 -14 82 56 -45 -82 -1 85 36 -74 -77 22 80 18 -71 -66 37 74 -1 -79 -44 52 74 -16 -76 -22 74 69 -27 -86 -21
3852 -21 79 58 -46 -81 -6 88 51 -50 -84 -1 88 42 -64 -74 22 82 30 -71 -81 40 88 12 -78 -67 31 90 -2
3879 -2 -78 -43 60 76 -28 -100 -28 76 57 -51 -81 -3 83 40 -59 -74 19 72 35 -63 -64 20 80 25 -87 -61 32 72 7
3908 7 -84 -62 55 77 -2 -97 -54 48 75 -15 -96 -41 67 54 -39 -84 -21 70 65 -44 -77 0 71 54 -64 -83 16 81 15
3937 15 -79 -66 36 81 -1 -80 -47 53 78 -11 -85 -40 49 56 -28 -84 -25 70 60 -37 -71 -17 63 42 -57 -83 -6 75 39 -53
$$ packed form
3736E7K9r1q2M5J09Pr2o9N7J06j8r7m9P0Q4j3j00m6Q4R1k0j30k4R4Q0m6j00j7
3764h1J01N7m5r6OQ9O2q0q7J4J08L3r2p7M8R8J4r6n8O7R4k3j01m4Q8R6o6j02j4
3793h7J01O9n7r4%J00O2q1r0J7R3M6p3q1K0J07K6q5p1L5J08J3r7p2N7J03Mr7o0
3822h4P0R6k6j01l7Q1Q6m9j10lR9N8o2q9NJ03L7p5p8L5R6K2r0o0N4R6nr6n9O5
3852b1J00k1j04l5P5R4l7j01l4Q3Q9m6j06j0R6O0n2j01j0J21M8p6r0J1R8N9r2
3879bp6L5J03J6j04p2P2J04j9j08l0P8Q6m3r9j5R3N3l7r8jQ4O0n5j12K6R3M0o5
3908Gr1K2J17K2p9r5M3J02K7r0q1N5J08j3r3m5O3R1nj09l3P7P1j7j18j9R9O5o6
3937A5r4J3J02M5q2p9L3J00K5q9p4M5Q9Pq4n6N9R5j0r7l4N4Q0k1r9k6P7Q1l6r2
$$ plain form
3967 -53 -78 10 81 47 -65 -71 27 86 12 -75 -73 38 65 2 -71 -41 60 74 -13 -73 -18 57 66 -24 -67 -15 64 39 -50 -78
3997 -78 12 69 38 -60 -66 24 69 20 -62 -60 27 62 5 -73 -57 43 74 4 -72 -44 54 78 -11 -74 -42 51 71 -19 -78 -27 69
4028 69 55 -42 -76 3 68 38 -57 -77 18 71 26 -65 -53 37 77 14 -70 -48 43 68 -12 -82 -41 52 58 -16 -84 -26 64 63 -22
4059 -22 -82 -8 74 56 -43 -76 -17 71 50 -36 -81 4 84 37 -60 -73 27 73 16 -64 -58 32 61 8 -64 -41 46 70 -10 -78
4089 -78 -27 56 55 -32 -77 -17 69 46 -51 -75 2 74 33 -44 -58 21 79 30 -58 -65 28 74 16 -65 -57 31 67 4 -77 -44 38 72
4121 72 -2 -72 -45 48 56 -18 -75 -33 61 57 -34 -81 -12 70 38 -50 -75 3 74 21 -54 -56 24 66 16 -64 -38 41 84 -7 -79 -35
4153 -35 46 70 -17 -70 -35 59 63 -18 -59 -20 57 60 -26 -69 -11 56 46 -48 -70 -2 69 41 -57 -78 5 71 21 -60 -65 29 69 18
4185 18 -70 -50 35 52 -9 -80 -31 46 55 -21 -63 -25 56 48 -39 -68 -3 72 38 -46 -64 -5 65 26 -56 -56 5 59 13 -61 -61 18
$$ packed form
3967e3k5Q8P1l4j12oR8N9p4q7KJ11K7o3p3L0J01J4q7o0N5P5Rr0m3N2P9k5q9k8
3997g8R0N7l1r8oR0M5m9q2KQ7L5n7p8J6J00L1p0p6K8R8K4q9o3L2R3K0r0n9N1R6
4028F9j4r7l4P9O5l0r5k0R5N3m5r1J2R0M0o3q4K2R1K5q0p0M1R3Op4o8N8R0jq5
4059b2o0P4Q2j8r9l3N9Q8k1q6m5Q5Q0m7r7j3J00M6n7q0OR0K9n3p2K3Q7K4q0o8
4089g8N1Q3jq7m5O0Q6k3r7k4P7P2m1p7j4P9N8m9q8pR3M6n8q1QQ8L6o3q1L3Q2L4
4121G2p4p0K7R3Qp4n7M2R4mr1m7O9Q2l2q8k5P8P1n3p5kQ0M2n0q0K6P9M3r1p2M4
4153c5Q1K4q7n3L5R4Mq1m1L9P7Lq6m3N8O7j0r4k2O8P1k8r8k1Q3O6n0q1nR4M0n1
4185A8q8K0Q5J7o1p1M9P7Rp6m2L8Q1qq7k9O5P5l4q4j8N9P0l9q2%O1N4m6p4%P9
$$ plain form
4217 18 77 9 -61 -60 29 72 4 -70 -45 44 63 -24 -79 -34 44 52 -28 -60 -15 65 45 -37 -73 2 71 29 -48 -51 9 74 22 -49
4249 -49 -48 16 64 4 -63 -51 33 60 -4 -80 -34 53 60 -12 -61 -21 61 51 -21 -84 -24 57 46 -25 -77 -12 72 47 -38 -63 13
4280 13 71 35 -65 -74 18 65 15 -67 -59 29 64 0 -72 -41 41 55 -24 -77 -18 46 54 -25 -71 -8 67 39 -32 -57 0 67 33
4311 33 -44 -54 17 70 28 -55 -49 23 71 18 -62 -45 29 67 7 -64 -42 36 69 -6 -68 -18 48 62 -23 -66 -28 61 46 -36 -73
4342 -73 -6 63 30 -28 -51 8 59 24 -59 -48 20 53 7 -62 -31 33 66 -7 -50 -37 53 65 -10 -62 -20 47 65 -17 -73 -24
4372 -24 55 42 -32 -66 -16 69 41 -35 -65 -16 62 26 -53 -62 10 62 13 -60 -47 37 59 4 -66 -35 39 56 -8 -64 -21 46 51
4403 51 -21 -53 -22 55 42 -34 -56 -6 62 36 -45 -66 -10 52 26 -38 -58 19 61 28 -59 -52 25 56 0 -71 -35 43 66 6 -59
4434 -59 -42 51 71 -8 -66 -19 59 54 -32 -63 -3 61 45 -33 -48 10 60 32 -48 -58 22 62 23 -48 -51 29 49 6 -53 -49 31 58
$$ packed form
4217A8N9o8p0JQ9M3o8p4K5Q9J9q7n5M5P8Qq0l2M5Q0k0q2l6P5O9m2p7lO0O5n2p1
4249d9JO4M8o0o7J2Q4K7o4p6M6Q7Pp2m9M0Q2j0p2o3O0Q1j1p1n2O5Q4k5q5k5P6
4280A3N8l6j00rR2M7n0q2QQ8L5o4p2L1Q2J4p9n3N9O4Qp9m6O3P5k8p1k5N7O7l4
4311C3p7j0P1N3m2q3OP2M8n3q0J7P4L8o0p1K2P8L3p5o2N0O6J4q5m3L8Q9j5q2l7
4342g3O7O9l3n8k3N9N1l5q3J1O8L3m6o9L1O4L3p3m3J3R0J2p5n2M2O7J8q2n6M9
4372b4P9j3p4l4N0Q5k8p6l0M9P8l6p9rP2N2m9p3J3Q4K2n5p0L1P4J7o4n6M3O7N
4403E1p2l2L1P7j3p6k2N0O8k6q1k1N6O2k6o4k0P7M2l3q7PP7L1n6p1L6P8K3o0o5
4434e9J7R3K0p9n8M7P8nq6l1O0O4j6p8j5N8N0k8q0j0Q0M0l9p1lQ0K0m3n9MQ0K7
$$ plain form
4466 58 5 -59 -33 36 51 -5 -46 -23 48 61 -14 -48 -9 65 56 -24 -71 -1 58 41 -39 -65 8 62 39 -46 -50 25 66 12 -61
4497 -61 -51 32 53 -4 -68 -36 40 54 -13 -53 -35 37 48 -23 -59 -7 49 48 -30 -57 -2 61 36 -40 -55 8 51 34 -42 -54 22
4528 22 58 25 -54 -54 30 68 0 -55 -40 29 48 -7 -67 -31 47 37 -21 -49 -12 46 42 -21 -61 4 57 38 -31 -47 16 55 27
4559 27 -47 -37 20 62 17 -37 -35 38 56 14 -47 -32 26 53 -12 -62 -23 41 57 -12 -58 -18 43 41 -21 -68 -15 39 39 -29 -56 2
4591 2 62 29 -36 -51 10 52 7 -45 -47 28 50 0 -45 -30 32 49 0 -48 -24 36 49 -3 -51 -25 48 44 -18 -50 -2 53 39 -26
4623 -26 -48 0 50 32 -44 -55 13 59 16 -53 -47 18 65 10 -50 -38 22 53 8 -46 -30 38 57 -4 -50 -21 52 53 -14 -42 -8
4654 -8 56 44 -27 -57 5 46 9 -21 -35 12 46 23 -37 -39 18 55 11 -50 -45 26 57 2 -52 -28 33 56 3 -55 -12 46 52 -13
4686 -13 -50 -17 44 41 -11 -44 -1 54 35 -28 -46 5 55 31 -35 -39 21 63 22 -30 -37 28 45 3 -43 -23 34 50 2 -57 -19 31
$$ packed form
4466E8n3o4K6O9J5n6m1K3P1J3p5l4L9P4rq0m7P0N9j7q0k6P3N4k3q5mP5M1n4p3
4497f1J0Q3K1n7o4L2P6J4o7m0J8P2J1p1l6N2N6jp8k7N5O3k5p6j5O3M3j7p6j2P6
4528B2L6l3p9%Q4L8o8n5J5O9J9n5o0L6P8j0n8k8L7N8mo3m0O5N3j9o9j6O3L9k8
4559B7p4J0N7M2m5n4KP3J8m2o1J5N8K7o5n0L9O4J6o9m6M0O1ko2m7N3N4%o8k7N8
4591BO0l3o5j5O1M2m5n2kP5K2n0m5J5O2J7m9m8K4O0J3n2m8K6P3mo2l2M8N5j4o5
4623b6k2M8N0j8p6j1O8M6m3o9OO5M7n5o0J2O0L1m5n4J6O8J9o1m6K9P3Jo7k8L4
4654hO4j2p1l0O2M1l7l0j4M7L4k3o0kN7L7m4o1NP1L1n5n4K4O1K3n3n8M3N8Oo5
4686a3l7L3O1ln2l3M3N5j9o3j8N1N0k4o6mO0M2m1n2pO5J7m2m6K0N7J6m8n9L8N0
$$ plain form
4718 31 42 -13 -48 -15 48 46 -18 -32 -12 52 44 -30 -52 3 59 35 -38 -43 20 58 25 -43 -37 21 66 17 -52 -37 28 49 3 -50
4750 -50 -19 47 45 -6 -51 -15 48 39 -18 -55 -7 54 33 -21 -46 -2 51 27 -31 -43 22 50 32 -45 -46 24 58 13 -47 -41 33 53
4782 53 -5 -49 -21 41 46 -7 -60 -25 39 44 -10 -48 -10 49 39 -28 -47 3 40 25 -31 -46 7 47 15 -44 -35 22 39 13 -36 -28
4814 -28 28 54 -3 -50 -16 47 48 -9 -45 -13 56 42 -5 -57 -12 35 31 -27 -62 -6 43 26 -39 -49 -4 53 17 -44 -45 10 50 12
4846 12 -44 -27 31 40 10 -41 -24 39 56 5 -45 -9 42 36 -18 -44 -9 54 39 -19 -45 4 50 47 -27 -44 8 42 22 -32 -45 1
4878 1 44 12 -39 -38 30 48 11 -46 -30 25 52 -7 -52 -31 36 51 -12 -46 -4 37 47 -16 -46 -2 52 30 -26 -33 13 48 26 -36
4910 -36 -42 32 51 15 -45 -32 23 47 -5 -46 -28 32 37 -2 -48 -19 36 32 -7 -48 -26 38 22 -11 -60 -8 35 26 -28 -55 1 61
4942 61 26 -39 -42 15 55 17 -40 -38 28 42 3 -41 -20 30 43 2 -52 -17 32 38 -18 -46 -11 35 30 -27 -39 -10 39 31 -39 -41 -1
$$ packed form
4718C1J1n5l5L3O3ko4j4K0O4qp4k2N5N6k4p3nO3L8l3o8ON8M5m9o9J5O5K1m6n3
4750e0L1O6kn1m5L6O3rn7l7M8O1k1n4k5M4N3k4n8j2O5K8j8p7jP0L4m5o0OP4K0
4782E3n8m4K8O2Nn3n3L5O4Nn4l8L8N9j0o7j9N0L7j5n6j5N3M0l2n9RN7J7k6m9Q
4814b8N6K6n7m7L4O3Jn7l6L2O9j4m7n2M5M7mn8l5N6M9j7o5j0M5N7l6o1jN5M0l8
4846A2n6J7N8Rl0n1J7O3J7n1n0L6N1on4k6L5O3j5n8k6M9M6lp4j7N2L4k0n4j3M6
4878AM3l2n1JO8J8l7n7J6N5K7n9m5K1O7J5o3l4M2M1J0o3l0M4N4k2n6pM6L5k2o2
4910c6oP4J9l6o0J3N5K4n2m1J8O0Nl9m6K9N5ml9m1K2O4j6l3m9N2M3rn4k7N6O0
4942F1l5o5lN7M0l8n7KO6J4l9m4K1N0J3m1n4L5M9On6k8L5M6nn7j2K9M9qp0kM0
$$ plain form
4975 -1 39 21 -35 -37 16 47 15 -34 -36 17 50 17 -50 -27 28 39 -9 -52 -39 30 41 1 -48 -14 33 35 -12 -48 -21 45 27 -33
5007 -33 -48 9 38 16 -38 -47 15 38 12 -41 -31 10 37 0 -38 -25 19 49 4 -30 -22 32 51 -4 -45 -20 38 27 -18 -49 -16
5038 -16 36 21 -29 -46 -9 35 13 -50 -43 7 46 7 -42 -52 22 46 3 -42 -26 26 40 -1 -42 -19 22 39 -10 -42 -10 29 30
5069 30 -12 -34 -13 48 39 -20 -40 0 31 12 -24 -43 10 31 14 -36 -42 13 41 1 -38 -31 20 41 -4 -48 -28 22 48 -7 -40 -15
5101 -15 29 31 -12 -54 0 37 25 -15 -33 -4 40 22 -17 -31 6 36 23 -25 -24 13 35 10 -28 -30 7 34 -2 -40 -28 30 38 -3
5133 -3 -49 -28 17 29 -12 -50 -19 38 33 -26 -44 -5 29 30 -23 -33 2 34 15 -26 -26 13 45 19 -21 -26 8 37 4 -38 -24 17 25
5166 25 -12 -33 -22 21 32 -11 -39 -11 27 18 -15 -41 -13 21 26 -27 -28 -13 34 20 -26 -50 17 41 14 -30 -30 11 36 12 -39 -18
5198 -18 22 49 1 -32 -10 31 33 -3 -41 -21 30 19 -16 -28 -12 29 17 -16 -36 -6 30 19 -19 -40 2 19 9 -31 -31 5 32
$$ packed form
4975aM0j8n6kN3L1l2m9kN3L3l3o7K3N5J1m8m3J3O9J1m0m9L4M7Km7l6K7O6j8o0
5007c3j5N7K9k2n4rO2K3k6n3J0M1K7l7l8J3M4L0m5l4QN4J9n5m1K5N8j1m5l1L3
5038a6N2j5n0j7L7M4k2o3PN0L9l9m9j0P4K4m3m5J6N2J4m1m1K3M1J7m9l2L2L9J
5069C0m2k2K1O1rn9k0M0L1j9l6j9N3K1j7n0oN5K8m0l9PN1K1m5m4K0N0K6n5l3K5
5101a5M4Km3m2N4L7j2m0j8K9M4j8l9j4L7L0j3m8JL7K2k5l8kL7K7l6l8J2N8Qm1
5133cm6K1M5J2m1l8L1N7nn9j8L9L4Jn3j0L5L2j9m1%L9L2k6m0nL4K9l3m2J4M1Q
5166B5l7k1J1M3J1m3k8K8L8rl3k6K8L4Nn3jJ5M7j4m6k4O7K4k7m4%M1K5k4n1K1
5198a8M0K7m8l3K2M1Kl6l8K0N1j1l5j2J6M1j2l3k0L0L6j1l8k1M2J7j0m0%L6K7
$$ plain form
5229 32 9 -35 -30 15 31 6 -27 -16 21 46 -1 -35 -8 37 34 -1 -30 -12 35 22 -15 -46 4 38 17 -18 -27 8 32 7 -26 -33
5261 -33 -3 20 10 -27 -24 10 23 -6 -26 -5 20 37 -1 -27 -11 24 26 -14 -39 -9 27 22 -10 -21 -10 38 20 -17 -32 3 19 16
5293 16 -38 -33 -2 31 16 -45 -32 14 27 10 -35 -22 19 26 -5 -35 -18 35 28 -8 -29 -6 37 33 6 -16 9 34 21 -10 -24 1
5325 1 32 12 -15 -23 12 33 10 -28 -28 9 29 9 -38 -23 19 32 -4 -29 -19 24 25 -9 -30 -6 40 39 -8 -41 -2 38 7 -15 -30
5358 -30 8 38 14 -15 -21 14 36 6 -12 -18 4 30 -4 -17 -16 32 27 3 -32 -16 27 25 -6 -36 -4 14 26 -15 -24 5 29 33 -26 -28
5392 -28 10 39 19 -29 -28 8 33 17 -27 -27 19 36 14 -21 -20 22 33 16 -28 -13 22 30 -3 -25 -6 28 26 -12 -35 -7 24 15 -15
5425 -15 -29 0 19 17 -21 -23 4 21 1 -15 -24 11 32 14 -10 -11 20 40 13 -22 -9 30 40 3 -26 -6 36 28 -10 -17 -8 30 21 -12
5459 -12 -16 6 28 24 -17 -24 4 26 8 -20 -18 -6 28 -3 -19 -6 16 19 -10 -30 -15 24 21 -8 -20 -6 27 29 -8 -22 -1 25 30 -13
$$ packed form
5229C2k3m4NM5J6k5l3J1L7K5m7l4K7M5ll5k9J8M7j3l7l1N0L4k1l5rL5K4k5l3p
5261c3L0K3j0l7LL4J3k9k0K1K5J7l8k6J6L5Km0k5L0L6nl2j1J1M8j8l7j5L5J6l
5293A6n4NL1L3j5o1J3M6J3j7m5J3M1Pl1l0J7N3pl6k1K3M3mk7k2K5K5j3l1j4K5
5325AL1k0k7qL5K1k3l8%L7K0k0m7J5M2J3l6k5J0M3Jl4k1K4M6jm7l3L9M0l1k2j5
5358c0L8L0k4k9oL5K2l0j8oK2K6l4j3JM8nk4l5J6M3kl1l0L2J8J2m1rK9K4Mn9k
5392b8L8K9k0m8JL6K5j6m4%M6J7k2l5JM2J1j7m4J5L5Ql3k2J9L4kl8k3K8L1rl0
5425a5j4K9J9kl8kK7J7k0j6rL5K1j8k4jL1K0k7l5J3L9J0l7k9K0M2ql8pRL8rl3
5459a2mK2K2mm1pK8K2j8k8KJ2L4l1j6J3K2Lk9k0J5L9lk9j2J4L3Kl7j4K1K6Nm3
$$ plain form
5493 -13 -28 3 39 19 -11 -22 0 33 9 -11 -29 10 22 8 -37 -27 3 24 -7 -32 -18 25 27 -2 -25 -9 22 32 -7 -20 -7
5524 -7 14 27 -12 -20 2 34 21 -10 -22 5 34 22 -18 -17 13 36 8 -17 -23 4 22 -2 -26 -17 22 25 -4 -31 -20 23 16 -16 -27 -14
5558 -14 22 19 -12 -33 -4 26 19 -10 -14 7 21 15 -9 -23 7 37 4 -17 -13 19 30 -6 -25 -22 2 16 1 -30 -10 14 9 -10 -27 -16
5592 -16 15 15 -29 -35 -22 15 11 -19 -27 5 24 2 -17 -8 17 25 7 -22 -20 12 27 0 -11 -16 3 29 11 -6 -5 26 23 -11 -24 -5 14
5627 14 18 -17 -36 -5 19 14 -16 -30 1 9 0 -35 -26 -3 25 -4 -21 -24 10 22 10 -21 -8 12 26 -8 -29 -4 22 22 -9 -27 -1 18
5661 18 23 -20 -25 -3 16 7 -18 -25 -2 15 7 -16 -36 4 16 1 -17 -23 15 31 2 -31 -14 13 21 7 -25 -18 16 16 -6 -20 5 16 13
5696 13 -13 -29 -8 28 15 -16 -27 5 18 17 -23 -16 17 26 2 -24 -27 7 22 1 -33 -19 10 21 -9 -26 -13 17 10 -1 -29 -11 6
5729 6 6 -4 -23 -4 23 20 -6 -9 -4 24 10 -15 -15 7 19 11 -14 -8 9 24 9 -9 -20 11 26 -4 -22 -21 22 8 -8 -25 -19 12 27
$$ packed form
5493a3j5L1L6k0l0j1K2L3k4k0j8L9J2j4m5J0L0K1l1k5J4M3Kk9k3J6L1J0l9j3J3
5524gK1J3l9qK2L2j3l1j2K7K9j2m0JL0K3k8k5oK7J8k4k4RL9Lk9k7J1M3pl2j1J3
5558a4L6ll1k1K9L0pk9mK1J4ok4j4L0L0l3k1ML2J1l6j9LK4J4j5l1K0K4nj9j7J1
5592a6L1%m4oJ3L7ml0qL2J9k2j9RK5Qj8k9KL2J5k7j1nJ9K6j8j7JL1ll4j3J9J9
5627A4Ml5j9L1K4nl0j4L1Qrl5RK3K8k9j7lL4J2j2l1J3K0J4l4k1K5K6%l1j8K6J9
5661A8Nm3nK2J9rk5pK3J7qk3k0M0J2j5j8oL8J6k9l3J7K7Qj4l2PL4%k2j4K5J1l
5696A3k6j6K1L6j3l1j1L2J3jm0PL3Rk4k6lL4J5k1l4J4K9J1l0j7J3L0pj1k8J8J7
5729F%j0j9J9K7lk6lNK8j4k5%K2J2qk5OJ7J5j5j8j1L1J5l0j8JM3j4j6j7OL1J5
$$ plain form
5764 27 -8 -23 -2 28 8 -14 -19 0 19 16 -16 -20 7 17 18 -17 -16 1 19 13 -15 -10 16 25 7 -22 -8 11 15 2 -19 -12 16 25 -18 -35
$$ packed form
5764B7l5j5K1L0k0k2nJ9J9ll2mK7J0Jl5JJ7J8ok8NK6Rj8k9J4J9Mj3k1PK8Rm3j7
$$ [...]
8191a1
##END NTUPLES=NMR FID
##END=
