##TITLE=1H_ES-AC-MeCel-st
 
 8 sc, 
 18.1.2022
##JCAMPDX= 6.0         $$ Bruker NMR JCAMP-DX V2.0
##DATA TYPE= NMR FID
##DATA CLASS= NTUPLES
##ORIGIN= UXNMR, Bruker Analytische Messtechnik GmbH
##OWNER= root
$$ XWIN-NMR		Version 3.5
$$ Tue Jan 18 10:38:55 2022 Russian Standard Time (UT+4h)  she@DPX200
##.OBSERVE FREQUENCY= 200.131346
##.OBSERVE NUCLEUS= ^1H
##.DELAY= (6, 6)
##.ACQUISITION MODE= SIMULTANEOUS
##.ACQUISITION SCHEME= undefined
##.AVERAGES= 8
##.DIGITISER RES= 18
##SPECTROMETER/DATA SYSTEM= spect
##.PULSE SEQUENCE= zg30
##.SOLVENT NAME= CDCl3
##.SHIFT REFERENCE= (INTERNAL, CDCl3, 0, 15.7039)
##AUDIT TRAIL= $$ (NUMBER, WHEN, WHO, WHERE, WHAT)
$$ ##TITLE= Audit trail, XWIN-NMR		Version 3.5
$$ ##JCAMPDX= 5.01
$$ ##ORIGIN= Bruker BioSpin GmbH
$$ ##OWNER= she
$$ F:/spectra/data/she/nmr/H-F/1/audita.txt
$$ ##AUDIT TRAIL=  $$ (NUMBER, WHEN, WHO, WHERE, WHAT)
(   1,<2022-01-18 10:37:49.17 +0400>,<she>,<DPX200>,
      <created by zg, POWCHK disabled, PULCHK disabled
       configuration hash MD5:
       00 E9 B6 7A A2 85 ED C7 34 08 36 98 17 FE 4E 26
       data hash MD5: 16K
       56 E9 D8 F7 D0 9F 82 63 29 96 F9 E1 B6 CE 00 6A>)
$$ ##END=
$$ 
$$ hash MD5
$$ 8B 5A 3F 8F 8D 0A D0 CE 2E 88 69 DD CD E9 B4 90
##$RELAX= 
##$RELAX= 
##$RELAX= 
##$RELAX= 
##$RELAX= 
##$RELAX= 
$$ Bruker specific parameters
$$ --------------------------
##$DU= <F:/spectra>
##$EXPNO= 1
##$NAME= <H-F>
##$PROCNO= 1
##$TYPE= <nmr>
##$USER= <she>
##$AMP= (0..31)
100 100 100 100 100 100 100 100 100 100 100 100 100 100 100 100 100 100 
100 100 100 100 100 100 100 100 100 100 100 100 100 100 
##$AQSEQ= 0
##$AQ_mod= 1
##$AUNM= <au_zg>
##$AUTOPOS= <>
##$BF1= 200.13
##$BF2= 200.13
##$BF3= 200.13
##$BF4= 200.13
##$BF5= 200.13
##$BF6= 200.13
##$BF7= 200.13
##$BF8= 200.13
##$BYTORDA= 1
##$CFDGTYP= 0
##$CFRGTYP= 5
##$CHEMSTR= <none>
##$CNST= (0..31)
1 1 145 1 1 1 1 1 1 1 1 1 1 1 1 1 1 1 1 1 1 1 1 1 1 1 1 1 1 1 1 1 
##$CPDPRG= <>
##$CPDPRG1= <>
##$CPDPRG2= <>
##$CPDPRG3= <>
##$CPDPRG4= <mlev>
##$CPDPRG5= <mlev>
##$CPDPRG6= <mlev>
##$CPDPRG7= <mlev>
##$CPDPRG8= <mlev>
##$CPDPRGB= <>
##$CPDPRGT= <>
##$D= (0..31)
0 1.2 0 0 0 0 0 0 0 0.06 0 0.03 0 0 0 0 0.0002 0 0 0 0 0 0 0 0 0 0 0 0 
0 0 0 
##$DATE= 1642487869
##$DBL= (0..7)
120 120 120 120 120 120 120 120 
##$DBP= (0..7)
150 150 150 150 150 150 150 150 
##$DBP07= 0
##$DBPNAM0= <>
##$DBPNAM1= <>
##$DBPNAM2= <>
##$DBPNAM3= <>
##$DBPNAM4= <>
##$DBPNAM5= <>
##$DBPNAM6= <>
##$DBPNAM7= <>
##$DBPOAL= (0..7)
0.5 0.5 0.5 0.5 0.5 0.5 0.5 0.5 
##$DBPOFFS= (0..7)
0 0 0 0 0 0 0 0 
##$DE= 6
##$DECBNUC= <off>
##$DECIM= 32
##$DECNUC= <off>
##$DECSTAT= 4
##$DIGMOD= 1
##$DIGTYP= 9
##$DL= (0..7)
0 120 120 120 120 120 120 120 
##$DP= (0..7)
150 150 150 150 150 150 150 150 
##$DP07= 0
##$DPNAME0= <>
##$DPNAME1= <>
##$DPNAME2= <>
##$DPNAME3= <>
##$DPNAME4= <>
##$DPNAME5= <>
##$DPNAME6= <>
##$DPNAME7= <>
##$DPOAL= (0..7)
0.5 0.5 0.5 0.5 0.5 0.5 0.5 0.5 
##$DPOFFS= (0..7)
0 0 0 0 0 0 0 0 
##$DQDMODE= 0
##$DR= 18
##$DS= 0
##$DSLIST= <SSSSSSSSSSSSSSS>
$$ [...]
##$SUBNAM2= <"">
##$SUBNAM3= <"">
##$SUBNAM4= <"">
##$SUBNAM5= <"">
##$SUBNAM6= <"">
##$SUBNAM7= <"">
##$SUBNAM8= <"">
##$SUBNAM9= <"">
##$SW= 18.0517287032376
##$SWIBOX= (0..15)
0 0 2 0 0 0 0 0 0 0 0 0 0 0 0 0 
##$SW_h= 3612.71676300578
##$TD= 16384
##$TD0= 1
##$TE= 0
##$TE2= 300
##$TE3= 300
##$TEG= 300
##$TL= (0..7)
0 120 120 120 120 120 120 120 
##$TP= (0..7)
150 150 150 150 150 150 150 150 
##$TP07= 0
##$TPNAME0= <>
##$TPNAME1= <>
##$TPNAME2= <>
##$TPNAME3= <>
##$TPNAME4= <>
##$TPNAME5= <>
##$TPNAME6= <>
##$TPNAME7= <>
##$TPOAL= (0..7)
0.5 0.5 0.5 0.5 0.5 0.5 0.5 0.5 
##$TPOFFS= (0..7)
0 0 0 0 0 0 0 0 
##$TUNHIN= 0
##$TUNHOUT= 0
##$TUNXOUT= 0
##$USERA1= <user>
##$USERA2= <user>
##$USERA3= <user>
##$USERA4= <user>
##$USERA5= <user>
##$V9= 5
##$VALIST= <valist>
##$VCLIST= <CCCCCCCCCCCCCCC>
##$VD= 0
##$VDLIST= <DDDDDDDDDDDDDDD>
##$VPLIST= <PPPPPPPPPPPPPPP>
##$VTLIST= <TTTTTTTTTTTTTTT>
##$WBST= 1024
##$WBSW= 4
##$XGAIN= (0..3)
0 0 0 0 
##$XL= 0
##$YL= 0
##$YMAX_a= 269951
##$YMIN_a= -335185
##$ZGOPTNS= <>
##$ZL1= 120
##$ZL2= 120
##$ZL3= 120
##$ZL4= 120
##$ABSF1= 10
##$ABSF2= 0
##$ABSG= 5
##$ABSL= 3
##$ALPHA= 0
##$AQORDER= 0
##$ASSFAC= 0
##$ASSFACI= 0
##$ASSFACX= 0
##$ASSWID= 0
##$AUNMP= <proc_1d>
##$AZFE= 0.1
##$AZFW= 0.1
##$BCFW= 1
##$BC_mod= 2
##$BYTORDP= 1
##$COROFFS= 0
##$CY= 11.3945322036743
##$DATMOD= 1
##$DC= 2
##$DFILT= <>
##$DTYPP= 0
##$F1P= 2.36226072786647
##$F2P= -0.459571619588291
##$FCOR= 0.5
##$FTSIZE= 0
##$FT_mod= 4
##$GAMMA= 1
##$GB= 0.15
##$INTBC= 1
##$INTSCL= 1
##$ISEN= 128
##$LB= 0.24
##$LEV0= 0
##$LPBIN= 0
##$MAXI= 10000
##$MC2= 0
##$MEAN= 0
##$ME_mod= 0
##$MI= 1.114404
##$NCOEF= 0
##$NC_proc= 0
##$NLEV= 6
##$NOISF1= 3.799351
##$NOISF2= 2.8
##$NSP= 1
##$NTH_PI= 0
##$NZP= 0
##$OFFSET= 15.70392
##$PC= 1
##$PHC0= -15952.85
##$PHC1= 16.00078
##$PH_mod= 1
##$PKNL= yes
##$PPARMOD= 0
##$PSCAL= 0
##$PSIGN= 0
##$REVERSE= no
##$SF= 200.130013532006
##$SI= 16384
##$SIGF1= 3
##$SIGF2= 2
##$SINO= 400
##$SIOLD= 16384
##$SREGLST= <1H.CDCl3>
##$SSB= 0
##$STSI= 0
##$STSR= 0
##$SW_p= 3612.71676300578
##$SYMM= 0
##$S_DEV= 0
##$TDeff= 0
##$TDoff= 0
##$TI= <>
##$TILT= no
##$TM1= 0
##$TM2= 0
##$TOPLEV= 0
##$USERP1= <user>
##$USERP2= <user>
##$USERP3= <user>
##$USERP4= <user>
##$USERP5= <user>
##$WDW= 1
##$XDIM= 8192
##$YMAX_p= 0
##$YMIN_p= 0
$$ End of Bruker specific parameters
$$ ---------------------------------
##NTUPLES= NMR FID
##VAR_NAME=  TIME,          FID/REAL,        FID/IMAG
##SYMBOL=    X,             R,               I
##VAR_TYPE=  INDEPENDENT,   DEPENDENT,       DEPENDENT
##VAR_FORM=  AFFN,          ASDF,            ASDF
##VAR_DIM=   8192,          8192,            8192
##UNITS=     SECONDS,       ARBITRARY UNITS, ARBITRARY UNITS
##FACTOR=    0.0002768,     1,               1
##FIRST=     0,             0,               0
##LAST=      2.2672688,     0,               0
##MIN=       0,             -335185,         0
##MAX=       2.2672688,     269951,          0
$$ Real data points
##PAGE= N=1
##DATA TABLE= (X++(R..R)), XYDATA
$$ [...]
$$ plain form
583 -16674 -17979 -17352 -14861 -10751 -5417 515 6510 11963 16300 19047 19922 18782 15771 11138 5339
598 5339 -1077 -7526 -13385 -18075 -21155 -22305 -21407 -18566 -13989 -8140 -1555 5153 11426 16652 20385
613 20385 22263 22157 20087 16296 11128 5130 -1135 -7090 -12219 -16051 -18264 -18728 -17431 -14600 -10600
628 -10600 -5852 -899 3799 7760 10645 12182 12295 11046 8676 5471 1911 -1672 -4799 -7113 -8419
643 -8419 -8544 -7487 -5405 -2588 711 4037 7010 9305 10619 10741 9657 7437 4292 514 -3530 -7382
659 -7382 -10736 -13145 -14397 -14318 -12879 -10187 -6498 -2184 2363 6711 10457 13222 14726 14838 13536 11015
675 11015 7472 3367 -934 -4969 -8338 -10711 -11837 -11627 -10133 -7552 -4218 -504 3224 6435 8849
690 8849 10146 10137 8837 6334 2968 -997 -5083 -8873 -11933 -13859 -14431 -13492 -11115 -7429 -2756 2488
$$ packed form
583a6674j305O27K491M110N334N932N995N453M337K747Q75j140l011m633n799
598E339o416o449n859m690l080j150Q98K841M577N849O585O708O273N226L733
613B0385J878j06k070l791n168n998o265n955n129l832k213m64J297K831M000
628a0600M748M953M698L961K885J537J13j249k370l205l560l583l127k314j306
643h419j25J057K082K817L299L326K973K295J314J22j084k220l145l778m044l852
659g382l354k409j252P9J439K692L689M314M547M348L746K765J504J12j302k521
675A1015l543m105m301m035l369k373j126K10J494K581L334L714L728L211K414
690H849J297rj300k503l366l965m086l790l060j926n72R39K377L686M673N244
$$ plain form
706 2488 7834 12776 16833 19580 20707 20072 17650 13613 8269 2092 -4402 -10702 -16229 -20505 -23134
721 -23134 -23852 -22654 -19591 -14953 -9128 -2683 3828 9907 15027 18754 20806 21083 19600 16574 12346
736 12346 7340 2068 -3015 -7437 -10852 -13031 -13829 -13281 -11533 -8849 -5554 -2091 1244 4063 6079
751 6079 7182 7274 6399 4695 2462 -99 -2654 -4798 -6389 -7198 -7090 -6081 -4261 -1845 993 3880
767 3880 6515 8691 10086 10558 10040 8549 6238 3368 134 -3152 -6083 -8514 -10148 -10846 -10579 -9403
783 -9403 -7451 -4957 -2237 530 2995 4931 6195 6716 6470 5541 4085 2375 580 -1066 -2294 -2998
799 -2998 -3059 -2474 -1324 252 2071 3824 5294 6326 6674 6232 4998 3028 432 -2581 -5648 -8569
815 -8569 -10984 -12612 -13266 -12766 -11124 -8416 -4808 -631 3826 8152 11991 14946 16767 17230 16278 13999
$$ packed form
706B488N346M942M057K747J127o35k422m037n344o177o494o300n527m276k629
721b3134p18J198L063M638N825O445O511O079N120L727K052K77j483l026m228
736A2346n006n272n083m422l415k179p98N48J748K684L295L463L335K819K016
751F079J103R2q75j704k233k561k555k144j591q09J08J009J820K416K838K887
767C880K635K176J395M72n18j491k311k870l234l286k931k431j634o98K67J176
783i403J952K494K720K767K465J936J264N21k46r29j456j710j795j646j228p04
799b998o1N85J150J576J819J753J470J032L48m42j234j970k596l013l067k921
815h569k415j628o54N00J642K708L608M177M457M326L839K955J821M63r52k279
$$ plain form
831 13999 10540 6214 1420 -3491 -8040 -11908 -14711 -16232 -16362 -15128 -12667 -9238 -5172 -891 3287
846 3287 6907 9757 11549 12185 11647 10059 7592 4562 1297 -1927 -4704 -6836 -8116 -8456 -7796 -6275
862 -6275 -4075 -1473 1344 3958 6123 7656 8342 8100 6956 5001 2492 -410 -3354 -5999 -8202 -9652
878 -9652 -10211 -9785 -8455 -6306 -3602 -543 2582 5411 7766 9424 10193 10069 9067 7312 4997 2407
894 2407 -301 -2845 -4898 -6422 -7252 -7345 -6738 -5569 -3966 -2167 -326 1344 2672 3514 3811 3587 2862
911 2862 1769 467 -886 -2072 -2963 -3414 -3357 -2775 -1725 -290 1374 3055 4527 5666 6310 6325 5698
928 5698 4401 2603 403 -2020 -4332 -6371 -7924 -8821 -8927 -8218 -6761 -4655 -2125 640 3364 5764
944 5764 7677 8899 9307 8849 7619 5707 3353 739 -1920 -4281 -6195 -7483 -8016 -7777 -6785 -5147
$$ packed form
831A3999l459m326m794m911m549l868k803j521j30J234K461L429M066M281M178
846C287L620K850J792O36n38j588k467l030l265l224k777k132j280l40O60J521
862f275K200K602K817K614K165J533O86k42j144j955k509k902k944k645k203j450
878i652n59M26J330K149K704L059L125K829K355J658P69j24j002j755k315k590
894B407k708k544k053j524q30r3O07J169J603J799J841J670J328Q42K97k24p25
911B862j093j302j353j186q91m51N7N82J050J435J664J681J472J139O44J5o27
928E698j297j798k200k423k312k039j553q97j06P09J457K106K530K765K724K400
944E764J913J222M08m58j230j912k354k614k659k361j914j288n33K39R92J638
$$ plain form
960 -5147 -3093 -760 1621 3746 5419 6538 6958 6636 5622 4033 2053 -191 -2408 -4328 -5814 -6710
976 -6710 -6906 -6370 -5156 -3417 -1319 989 3184 5041 6436 7189 7232 6548 5196 3350 1188 -1126 -3291
993 -3291 -5094 -6407 -7085 -7067 -6346 -5014 -3251 -1199 969 2994 4640 5823 6401 6332 5629 4382 2735
1010 2735 828 -1159 -2971 -4425 -5414 -5852 -5667 -4906 -3622 -2002 -135 1740 3413 4691 5522 5764
1026 5764 5404 4469 3098 1387 -514 -2358 -3942 -5091 -5766 -5821 -5286 -4185 -2701 -907 992 2769
1042 2769 4232 5255 5756 5645 4969 3786 2249 430 -1409 -3101 -4426 -5316 -5691 -5458 -4680 -3453 -1870
1059 -1870 -63 1760 3406 4668 5539 5833 5568 4728 3463 1854 -4 -1846 -3508 -4811 -5682 -5993
1075 -5993 -5731 -4915 -3647 -2072 -248 1565 3185 4445 5275 5581 5352 4584 3418 1984 356 -1243
$$ packed form
960e147K054K333K381K125J673J119M20l22j014j589j980k244k217j920j486q96
976f710j96N36J214J739K098K308K195J857J395P53M3o84j352j846k162k314k165
993c291j803j313o78J8P21J332J763K052K168K025J646J183N78o9p03j247j647
1010B735j907j987j812j454r89m38J85P61J284J620J867J875J673J278Q31K42
1026E764l60r35j371j711j901j844j584j149o75n5N35J101J484J794J899J777
1042B769J463J023N01j11o76j183j537j819j839j692j325q90l75K33P78J227J583
1059a870J807J823J646J262Q71K94k65q40j265j609j858j842j662j303q71l11
1075e993K62Q16J268J575J824J813J620J260Q30L06k29p68j166j434j628j599
$$ plain form
1091 -1243 -2637 -3709 -4320 -4491 -4167 -3432 -2390 -1094 248 1522 2571 3272 3571 3439 2916 2035 915
1108 915 -329 -1542 -2588 -3371 -3760 -3731 -3282 -2454 -1308 38 1447 2761 3836 4516 4822 4635 3981 2943
1126 2943 1541 -69 -1714 -3244 -4457 -5280 -5642 -5448 -4756 -3601 -2137 -429 1335 2950 4217 5097
1142 5097 5504 5356 4700 3612 2223 612 -1028 -2510 -3696 -4470 -4776 -4585 -3928 -2919 -1599 -109 1366
1159 1366 2673 3681 4263 4400 4072 3341 2245 872 -638 -2104 -3358 -4281 -4780 -4840 -4391 -3508 -2290
1176 -2290 -761 872 2451 3799 4783 5372 5434 5000 4098 2831 1292 -397 -2022 -3439 -4495 -5162 -5323
1193 -5323 -5002 -4235 -3115 -1763 -259 1193 2467 3442 4043 4198 3975 3379 2529 1427 262 -868 -1824
1210 -1824 -2518 -2907 -2942 -2637 -2055 -1237 -316 635 1478 2124 2515 2583 2340 1797 1025 85 -919 -1847 -2613 -3116
$$ packed form
1091a243j394j072o11j71L24P35J042J296J342J274J049P01K99j32n23q81j120
1108I15j244j213j046p83l89K9M49Q28J146J346J409J314J075O80L06j87o54j038
1126B943j402j610j645j530j213q23l62J94O92J155J464J708J764J615J267Q80
1142E097M07j48o56j088j389j611j640j482j186p74l06J91O57J009J320J490J475
1159A366J307J008N82J37l28p31j096j373j510j466j254r23m99o0M49Q83J218
1176b290J529J633J579J348R84N89O2m34r02j267j539j689j625j417j056o67j61
1193e323L21P67J120J352J504J452J274R75O01J55k23n96q50j102j165j130r56
1210a824o94l89l5L05N82Q18R21R51Q43O46L91O8k43n43p72r40j004r28p66n03
$$ plain form
1230 -3116 -3296 -3127 -2605 -1790 -744 418 1582 2628 3442 3940 4048 3759 3115 2156 982 -325 -1607
1247 -1607 -2719 -3577 -4075 -4176 -3901 -3270 -2347 -1182 82 1322 2408 3229 3729 3856 3598 2988 2108 1017
1265 1017 -164 -1307 -2303 -3039 -3464 -3516 -3221 -2584 -1683 -606 558 1653 2571 3233 3567 3531 3120 2386 1395
1284 1395 219 -989 -2096 -3020 -3633 -3896 -3775 -3273 -2448 -1390 -164 1081 2208 3114 3737 3982 3843
1301 3843 3348 2555 1493 326 -873 -1952 -2842 -3411 -3671 -3581 -3135 -2428 -1503 -456 618 1573 2363 2885
1319 2885 3109 2996 2609 1976 1140 210 -710 -1534 -2152 -2521 -2620 -2416 -1956 -1281 -463 410 1223 1882 2334 2503
1339 2503 2383 1986 1358 556 -351 -1230 -1994 -2552 -2848 -2840 -2524 -1925 -1120 -167 847 1793 2583 3127 3390 3323
1359 3323 2909 2221 1317 253 -856 -1895 -2768 -3383 -3698 -3693 -3339 -2681 -1787 -718 416 1510 2458 3160
$$ packed form
1230c116j80J69N22Q15J046J162J164J046Q14M98J08k89o44r59j174j307j282
1247a607j112q58m98j01K75O31R23J165J264J240J086Q21N00J27k58o10q80j091
1265A017j181j143r96p36m25n2K95O37R01J077J164J095R18O62L34l6m11p34r91
1284A395j176j208j107r24o13k63J21N02Q25J058J226J245J127R06O23K45j39
1301C843m95p93j062j167j199j079q90n69k60R0M46P07R25J047J074R55P90N22
1319B885K24j13l87o33q36r30r20q24o18l69r9K04M60O75Q18Q73Q13O59M52J69
1339B503j20l97o28q02r07q79p64n58k96QL16N99Q05R53J014R46P90N44K63o7
1359C323m14o88r04j064j109j039q73o15l15NL54O58Q94J069J134J094R48P02
$$ plain form
1377 3160 3565 3648 3381 2818 1999 1007 -92 -1132 -2027 -2727 -3128 -3216 -2982 -2480 -1725 -823 146 1063 1819 2386
1397 2386 2662 2653 2370 1827 1105 252 -602 -1377 -2000 -2395 -2536 -2406 -2017 -1423 -669 164 996 1723 2280 2614
1417 2614 2693 2506 2070 1446 677 -182 -1023 -1749 -2309 -2669 -2767 -2585 -2191 -1592 -844 -26 757 1446 1982 2293
1437 2293 2366 2206 1829 1288 622 -71 -723 -1256 -1609 -1764 -1707 -1433 -1005 -455 154 724 1194 1508 1650 1566 1279
1458 1279 818 222 -435 -1089 -1668 -2079 -2303 -2310 -2055 -1590 -940 -150 703 1519 2241 2785 3096 3135 2889 2392 1646
1479 1646 757 -245 -1236 -2126 -2855 -3328 -3508 -3369 -2955 -2272 -1407 -416 608 1553 2327 2873 3142 3123 2795
1498 2795 2231 1472 609 -289 -1122 -1805 -2281 -2516 -2471 -2176 -1668 -1010 -271 502 1175 1720 2066 2172 2046 1703
1518 1703 1174 523 -211 -940 -1562 -2042 -2315 -2362 -2188 -1795 -1204 -489 287 1038 1706 2211 2511 2597 2420 2041
$$ packed form
1377C160M05Q3k67n63q19r92j099j040q95p00m01q8K34N02P55R02R69R17P56N67
1397B386K76rk83n43p22q53q54p75o23l95j41J30L89N94P54Q33Q32P27N57L34
1417B614P9j87m36o24p69q59q41p26n60l60r8J82L94N99P48Q18P83O89N36L11
1437B293P3j60l77n41o66o93o52n33l53j55N7K74M28N50O09N70M70L14J42q4k87
1458A279m61n96o57o54n79m11k24pK55M65O50P90Q53Q16P22N44L11L9k46m97p46
1479A646q89j002r91q90p29m73j80J39M14O83Q65R91J024R45P74N46K69j9l28
1498B795n64p59q63q98q33o83m76k35M5K95N08O58P39P73O73N45L46J06j26l43
1518A703n29o51p34p29o22m80k73m7J74L93N91P15P76P51O68N05L00Q6j77l79
$$ plain form
1538 2041 1465 770 13 -738 -1403 -1913 -2241 -2339 -2221 -1919 -1446 -857 -219 390 920 1316 1551 1594 1486 1212
1558 1212 833 390 -71 -475 -810 -992 -1045 -937 -721 -375 14 437 821 1105 1270 1284 1157 862 452 -49
1578 -49 -595 -1097 -1551 -1864 -2015 -1968 -1750 -1336 -789 -136 565 1234 1792 2219 2441 2440 2229 1800 1201 503 -266
1599 -266 -993 -1606 -2095 -2364 -2411 -2231 -1856 -1310 -646 61 739 1326 1756 2012 2054 1885 1536 1037 444 -180 -794
1620 -794 -1289 -1651 -1858 -1842 -1646 -1280 -760 -186 443 1018 1506 1838 1981 1937 1687 1281 720 81 -577 -1190 -1690
1641 -1690 -2028 -2191 -2119 -1852 -1424 -846 -196 472 1081 1591 1935 2082 2048 1807 1411 891 298 -309 -861 -1315
1661 -1315 -1606 -1751 -1706 -1498 -1150 -714 -222 278 730 1092 1306 1379 1292 1083 752 338 -108 -551 -900 -1162 -1289
1682 -1289 -1284 -1121 -831 -447 3 463 873 1203 1402 1459 1368 1123 753 303 -201 -701 -1126 -1457 -1619 -1630 -1475
$$ packed form
1538B041n76o95p57p51o65n10l28r8J18L02M73N89O38O09N30L96K35M3j08k74
1558A212l79m43m61m04l35j82n3J08K16L46L89M23L84K84J65J4j27k95m10n01
1578d9n46n02m54l13j51M7K18M14N47O53P01O69N58M27K22jk11m29n99o98p69
1599b66p27o13m89k69m7J80L75N46O64P07O78N87M30K56M2j69l49m99n93o24o14
1620g94m95l62k07J6J96L66N20N74O29N75M88L32J43m4k50m06n61o39o58o13n00
1641a690l38j63P2K67M28N78O50O68O09N10L44J47l4k41l96n20n93o07n52m54
1661a315k91j45M5K08L48M36M92N00M52L62K14P3q7k09l31m14m46m43l49k62j27
1682a289NJ63K90L84M50M60M10L30J99N7r1k45l70m50n04n00m25l31j62j1J55
$$ plain form
1703 -1475 -1176 -767 -270 258 757 1170 1482 1640 1636 1466 1152 740 248 -255 -733 -1146 -1441 -1581 -1552 -1397 -1099
1724 -1099 -691 -226 280 734 1100 1372 1501 1487 1314 1001 600 129 -344 -782 -1149 -1383 -1504 -1445 -1241 -922
1744 -922 -500 -38 436 843 1177 1375 1424 1326 1091 742 326 -134 -582 -950 -1225 -1376 -1361 -1218 -948 -579 -156
1765 -156 277 692 1033 1256 1355 1315 1154 858 484 33 -391 -798 -1133 -1339 -1426 -1374 -1180 -868 -482 -32 420
1786 420 820 1162 1368 1446 1379 1171 839 440 -14 -473 -871 -1169 -1365 -1405 -1317 -1098 -749 -335 107 542 901
1807 901 1167 1310 1312 1174 920 583 177 -247 -670 -987 -1213 -1321 -1290 -1133 -856 -488 -82 349 747 1074 1297
1828 1297 1386 1335 1174 887 507 82 -366 -776 -1110 -1339 -1453 -1415 -1256 -975 -605 -172 261 670 1003 1235 1345
1849 1345 1324 1175 914 575 186 -201 -554 -838 -1023 -1085 -1042 -905 -669 -386 -56 260 532 726 837 851 759
$$ packed form
1703a475K99M09M97N28M99M13L12J58mj70l14m12m92n03m78m13k95j40K9J55K98
1724a099M08M65N06M54L66K72J29j4j73l13m01m71m73m38l67k34j21N9K04L19
1744i22M22M62M74M07L34J98M9r8k35l49m16m60m48l68k75j51J5J43K70L69M23
1765a56M33M15L41K23R9m0j61k96l74m51m24m07l35k06q7N2J94L12L86M50M52
1786D20M00L42K06P8o7k08l32l99m54m59l98k98j96m0Q8K19L49M14M42M35L59
1807I01K66J43Kj38k54l37m06m24m23l17k26j08L1J57K77L68M06M31L98L27K23
1828A297Q9n1j61k87l80m25m48m10l34k29j14L8J59K81L70M33M33M09L33K32J10
1849A345k1j49k61l39l89l87l53k84j85o2M3J37K36K83L30L16K72J94J11J4r2
$$ plain form
1870 759 572 342 50 -219 -488 -715 -833 -884 -821 -663 -445 -156 150 477 734 925 1032 1041 947 752 484 137
1892 137 -227 -565 -872 -1076 -1189 -1190 -1069 -851 -545 -178 200 552 855 1062 1159 1144 1016 791 477 128 -228
1913 -228 -551 -820 -1003 -1063 -1037 -885 -648 -355 -13 308 599 846 982 1020 952 789 542 227 -131 -462 -760
1934 -760 -994 -1130 -1142 -1059 -864 -575 -240 162 522 851 1102 1249 1272 1184 982 692 317 -72 -478 -815 -1070
1955 -1070 -1248 -1284 -1229 -1050 -767 -432 -79 285 606 858 1013 1069 1030 885 665 393 91 -201 -468 -654 -772
1976 -772 -803 -753 -617 -433 -189 43 272 464 589 647 638 538 369 159 -80 -319 -517 -676 -756 -763 -681 -500 -286
1999 -286 -23 250 508 715 863 905 873 746 530 282 -25 -320 -586 -802 -935 -983 -937 -794 -581 -318 -18
2020 -18 281 539 748 868 913 863 729 525 269 0 -280 -524 -711 -824 -854 -797 -663 -446 -187 87 354 588
$$ packed form
1870G59j87k30k92k69k69k27j18n1O3J58K18K89L06L27K57J91J07Rr4j95k68l47
1892A37l64l38l07k04j13jJ21K18L06L67L78L52L03K07R7j5j28k25l14l49l56
1913b28l23k69j83o0K6J52K37K93L42L21K91K47J36L8o8j63k47l15l58l31k98
1934g60k34j36j2Q3J95K89L35M02L60L29K51J47K3q8k02k90l75l89m06l37k55
1955a070j78l6N5J79K83L35L53L64L21K52J55N6l9j45k20k72l02k92k67j86j18
1976g72l1N0J36J84K44K32K29J92J25N8rj00j69k10k39k39j98j59q0pQ2J81K14
1999b86K63K73K58K07J48M2l2j27k16k48l07k95k66k16j33m8M6J43K13K63L00
2020a8K99K58K09J20M5n0j34k04k56k69k80k44j87j13l0N7J34K17K59K74K67K34
$$ plain form
2042 588 747 851 847 759 587 355 71 -228 -504 -742 -910 -981 -956 -843 -632 -368 -60 262 556 798 974 1046
2064 1046 1027 905 698 449 135 -186 -469 -725 -893 -983 -992 -907 -738 -503 -248 18 299 517 699 793 810 745
2086 745 607 421 201 -31 -246 -428 -571 -624 -617 -540 -410 -227 -23 166 345 466 537 536 479 356 178 -28 -224
2109 -224 -410 -555 -629 -670 -607 -493 -314 -90 119 345 540 670 751 761 674 538 344 108 -135 -358 -564 -705
2131 -705 -794 -797 -741 -599 -407 -183 64 294 488 645 720 744 682 540 361 140 -98 -321 -503 -642 -709 -702 -608 -453
2155 -453 -247 -24 223 432 597 698 732 686 568 372 147 -108 -353 -571 -749 -840 -861 -802 -660 -474 -221 53
2177 53 321 550 732 845 887 846 732 563 326 73 -180 -430 -623 -762 -826 -805 -724 -574 -385 -168 63 268
2199 268 437 563 624 600 526 408 244 49 -124 -290 -413 -476 -483 -440 -342 -203 -48 123 273 388 452 472 433 342
$$ packed form
2042E88J59J04mq8j72k32k84k99k76k38j68p1K5J13K11K64L08L22K94K42J76P2
2064A046j9j22k07k49l14l21k83k56j68r0rQ5J69K35K55K66K81K18J82R4J7o5
2086G45j38j86k20k32k15j82j43n3PP7J30J83K04J89J79J21P1jn7j23j78k06j96
2109b24j86j45p4m1O3J14J79K24K09K26J95J30Q1J0q7j36j94k36k43k23k06j41
2131g05q9lN6J42J92K24K47K30J94J57P5K4o2j42j79k21k38k23j82j39o7PR4J55
2155d53K06K23K47K09J65J01L4m6j18j96k25k55k45k18j78r1k1N9J42J86K53K74
2177E3K68K29J82J13M2m1j14j69k37k53k53k50j93j39o4K1Q1J50J89K17K31K05
2199B68J69J26O1k4p4j18j64j95j73j66j23o3pM3R8J39J55J71J50J15O4K0l9r1
$$ plain form
2223 342 197 36 -116 -283 -428 -522 -575 -572 -494 -378 -226 -54 141 328 472 572 624 608 549 415 265 66 -123
2246 -123 -308 -466 -571 -619 -614 -540 -411 -239 -52 142 303 429 523 547 516 409 267 87 -90 -270 -423 -533
2268 -533 -575 -568 -500 -372 -198 -6 193 373 536 632 678 643 559 417 219 11 -211 -421 -587 -720 -775 -759 -679 -543
2292 -543 -357 -128 108 327 514 660 731 742 680 567 389 186 -32 -246 -414 -556 -626 -634 -586 -478 -326 -146
2314 -146 41 221 360 459 506 501 444 326 169 16 -145 -290 -401 -469 -483 -456 -375 -253 -95 57 213 352 451
2337 451 501 512 464 363 239 83 -91 -255 -379 -481 -540 -537 -478 -375 -250 -95 67 223 349 442 480 484 413 310
2361 310 176 33 -117 -256 -354 -422 -426 -393 -310 -199 -67 77 206 326 387 425 407 353 252 103 -36 -189 -327
2384 -327 -425 -492 -505 -474 -388 -270 -119 40 211 351 474 554 555 537 459 321 162 -5 -186 -347 -478 -551 -574 -544
$$ packed form
2223C42j45j61j52j67j45r4n3LP8J16J52J72J95J87J44J00N2j6n9j34j50j99j89
2246a23j85j58j05m8NP4J29J72J87J94J61J26R4K4l1j07j42j80j77j80j53j10
2268e33m2PO8J28J74J92J99J80J63R6M6l5q4j42j98k08k22k10j66j33n5J6Q0J36
2292e43J86K29K36K19J87J46P1J1o2j13j78k03k18k14j68j42p0qM8J08J52J80
2314a46J87J80J39R9M7nn7j18j57j53j61j45j11o8j4K7Q1J22J58J52J56J39R9
2337D51N0J1m8j01j24j56j74j64j24j02n9LN9J03J25J55J62J56J26R3L8Mp1j03
2361C10j34j43j50j39r8o8mL3Q3J11J32J44J29J20O1L8j8n4j01j49j39j53j38
2384c27r8o7j3L1Q6J18J51J59J71J40J23Q0Jj8p8j38j59j67j81j61j31p3k3L0
$$ plain form
2408 -544 -457 -337 -173 6 165 319 424 493 522 478 395 258 100 -59 -206 -347 -444 -490 -488 -428 -334 -195 -40 108
2432 108 268 395 485 513 509 443 327 193 22 -139 -288 -427 -516 -554 -548 -489 -382 -239 -75 106 258 398 472 521
2456 521 518 466 369 222 64 -88 -247 -360 -436 -470 -448 -389 -304 -170 -34 111 234 323 381 398 370 303 197 69 -51
2481 -51 -175 -278 -347 -394 -379 -330 -244 -145 -19 110 228 331 387 409 391 335 249 127 -7 -144 -268 -369 -427 -453 -436
2506 -436 -378 -286 -149 -13 108 243 330 391 399 366 299 201 89 -43 -149 -249 -321 -348 -350 -300 -224 -119 -10 118 220
2531 220 287 348 353 308 243 153 29 -83 -215 -317 -391 -441 -442 -405 -308 -194 -59 75 224 353 428 482 493 452 374 243
2557 243 102 -49 -205 -336 -439 -482 -493 -464 -384 -265 -120 26 158 288 386 430 428 385 329 208 81 -54 -194
2580 -194 -289 -370 -406 -395 -358 -272 -158 -42 77 205 290 359 387 377 323 230 122 -4 -132 -258 -341 -406 -431 -415 -359 -273
$$ packed form
2408e44Q7J20J64J79J59J54J05O9K9m4q3j37j58j59j47j41r7m6KO0R4J39J55J48
2432A08J60J27R0K8mo6j16j34j71j61j49j39q9l8ON9J07J43J64J81J52J40P4M9
2456E21ln2r7j47j58j52j59j13p6l4K2N9Q5J34J36J45J23Q9N8J7k8o7j06j28j20
2481e1j24j03o9m7J5M9Q6R9J26J29J18J03N6K2j8n6q6j22j34j37j24j01n8k6J7
2506d36N8R2J37J36J21J35Q7O1Ql3o7r8j12j32j06j00p2k7kN0P6J05J09J28J02
2531B20O7O1Nm5o5r0j24j12j32j02p4n0jL7R7J14J35J34J49J29P5N4J1m1p8j31
2557B43j41j51j56j31j03m3j1K9Q0J19J45J46J32J30R8M4km3n6j21j27j35j40
2580a94r5q1l6J1L7Q6J14J16J19J28Q5O9K8j0n4r3j08j26j28j26q3o5k5J6N6Q6
$$ plain form
2606 -273 -148 -18 127 243 352 408 428 422 370 270 153 26 -98 -212 -307 -355 -378 -353 -307 -236 -122 -26 79 164
2630 164 226 266 263 240 186 114 33 -51 -134 -198 -242 -238 -225 -176 -105 -22 69 141 234 283 313 293 257 181 96 -5 -137 -230 -327 -393
2660 -393 -399 -394 -339 -262 -140 -14 108 232 323 394 411 403 351 260 143 12 -101 -220 -322 -366 -400 -383 -324 -247 -136 -22
2686 -22 91 193 284 333 358 328 282 190 89 -21 -137 -227 -311 -343 -355 -334 -267 -174 -74 45 161 268 345 396 395 362
2712 362 288 185 58 -58 -176 -301 -377 -423 -428 -390 -323 -222 -102 20 142 242 325 375 384 351 304 214 119 8 -96
2737 -96 -174 -251 -284 -298 -271 -224 -159 -86 -4 84 143 196 219 200 173 127 56 -30 -103 -168 -223 -243 -240 -204 -152 -72 15 93 176 234 282
2768 282 300 285 231 143 59 -38 -141 -238 -297 -335 -347 -311 -265 -177 -75 29 126 203 274 320 317 293 242 152 75 -31 -126 -207
2796 -207 -265 -305 -305 -279 -223 -138 -47 46 137 212 277 300 289 254 200 104 2 -88 -188 -273 -317 -343 -335 -275 -182 -91 15 125 218
$$ packed form
2606b73J25J30J45J16J09N6K0on2j00j17j27j24j14r5m8k3K5M6P1J14R6J05Q5
2630A64O2M0lk3n4p2q1q4q3o4m4MJ3M9P1Q3R1P2R3M9L0k0l6p6q5j01j32r3r7o6
2660c93oNN5P7J22J26J22J24R1P1J7qn2r1j17j31j13j19j02m4l4J7N9P7J11J14
2686b2J13J02R1M9K5l0m6r2j01j10j16r0q4l2j2K1O7R3J00J19J16J07P7N1jl3
2712C62p4j03j27j16j18j25p6m6nL8O7J01J20J22J22J00Q3N0Rl3m7r0r5j11j04
2737i6p8p7l3j4K7M7O5P3Q2Q8N9N3K3j9k7m6p1q6p3o5n5k0LL6N2Q0Q7P8Q3N8M8
2768B82J8j5n4q8q4r7j03r7n9l8j2L6M6Q8J02J04R7P7P1M6lk4n1r0p7j06r5q1
2796b07n8m0%K6N6Q5R1R3R1P5O5K3j1l5n4r6j02r0j00q5m4k6QO0R3R1J06J10R3
$$ plain form
2825 218 311 365 383 366 303 225 119 1 -110 -208 -310 -364 -389 -372 -329 -256 -161 -59 47 139 236 277 310 314 284 226 148
2852 148 65 -21 -108 -177 -220 -248 -242 -215 -157 -90 -19 54 126 169 196 206 184 136 71 9 -68 -145 -199 -233 -233 -225 -171 -114 -42 29 107
2883 107 179 234 257 259 231 182 116 35 -43 -128 -198 -238 -275 -275 -248 -204 -126 -50 35 110 177 227 243 246 217 168 99 26 -53 -128 -180
2914 -180 -232 -254 -227 -196 -143 -68 13 107 155 215 248 256 230 177 105 23 -71 -144 -226 -269 -298 -303 -272 -215 -126 -38 55 149 223 286 326
2945 326 320 290 244 169 65 -29 -114 -194 -264 -304 -315 -296 -253 -191 -98 -36 56 138 199 240 255 240 192 132 62 -10 -86 -153 -205 -211
2975 -211 -217 -186 -131 -77 -11 50 116 164 202 207 193 149 103 32 -32 -95 -152 -209 -226 -220 -204 -160 -102 -37 33 95 153 192 217 223 192 146
3007 146 99 35 -38 -97 -165 -208 -218 -215 -185 -142 -86 -23 39 109 159 184 200 188 149 108 34 -20 -80 -135 -177 -203 -202 -169 -137 -81 -6
3038 -6 58 121 160 197 216 216 183 125 67 -10 -86 -141 -193 -240 -257 -254 -216 -163 -96 -24 43 121 183 219 254 244 219 161 106 21 -41 -105
$$ packed form
2825B18R3N4J8j7o3p8j06j18j11r8j02n4k5J7M3P3R5J02J06R2R7M1L3Ml0n8p8
2852A48q3q6q7o9m3k8OK7N8O7P1P3P2M3K7J0k2m8o5o2p7p7n4l4%QN4N7P2P1P8
2883A07P2N5K3Kk8m9o6q1p8q5p0m0l7%K7M4P8P6Q5P5O7N0J6Lk9m9o9p3p9p5n2
2914a80n2k2K7L1N3P5Q1R4M8O0L3Qk6n3p2q2r4p3q2m3k9nL1N7Q9Q8R3R4P4O3M0
2945C26ol0m6p5j04r4q5q0p0m0j1J9M3O2R3O2R2Q2O1M1J5j5m8o0p0p2p6o7n2o
2975b11oL1N5N4O6O1O6M8L8Nj4m4m6p1o4o3n7n7j7OJ6M4N8O5P0O2N8L9K5Ol1m6
3007A46m7o4p3n9o8m3j0LL0M3N6O3O2P0N0K5J6j2l9m1p4n4o0n5m2k6JL3L2N6P5
3038fO4O3L9L7J9%l3n8n8p7p6n5n2m7j7LL8N3O7P2O7P8O2L6L5j0k5n8n5q5o2o4
$$ plain form
3070 -105 -178 -214 -230 -231 -203 -151 -96 -32 40 100 153 187 196 183 146 93 48 -19 -75 -136 -177 -194 -195 -182 -138 -91 -34 38 69 140 177
3101 177 192 201 182 133 87 31 -33 -96 -156 -195 -203 -211 -184 -135 -80 -24 40 100 135 170 192 184 158 116 63 1 -59 -116 -142 -170 -181 -166
3133 -166 -139 -97 -36 15 57 117 146 168 170 144 105 59 10 -55 -86 -136 -156 -181 -176 -147 -109 -60 -4 54 107 154 178 192 191 151 104
3164 104 49 -10 -61 -121 -163 -197 -209 -199 -168 -119 -64 -1 53 109 155 178 175 167 132 88 35 -27 -71 -120 -152 -173 -164 -147 -114 -71 -22
3195 -22 33 90 120 157 168 167 145 115 57 21 -48 -99 -137 -172 -170 -175 -146 -121 -69 -15 50 87 130 163 178 166 134 105 49 -5 -66 -116
3227 -116 -138 -170 -169 -157 -124 -86 -37 27 64 109 157 157 161 148 105 64 11 -38 -90 -125 -145 -160 -157 -140 -113 -60 -9 32 75 106 132 155
3259 155 155 135 100 51 0 -45 -90 -128 -157 -162 -162 -131 -88 -50 9 52 108 136 155 153 151 118 84 28 -14 -66 -101 -134 -151 -148 -143 -104 -62
3292 -62 -13 28 73 104 132 137 136 119 84 44 -3 -46 -96 -118 -149 -155 -143 -124 -94 -41 10 50 101 126 149 153 145 120 80 39 -8 -65 -103
$$ packed form
3070a05p3l6j6jK8N2N5O4P2O0N3L4Rj3l7n3m5o7n6o1m1j7jJ3M4M7N7P2L1P1L7
3101A77J5Rj9m9m6n6o4o3o0l9qqK7M9N5N6O4O0L5L5K2qk6m2n3o2o0n7k6k8j1J5
3133a66K7M2O1N1M2O0K9K2Kk6l9m6m9o5l1n0k0k5NK9L8M9N6N8N3M7K4J4jm0m7
3164A04n5n9n1o0m2l4j2J0L1M9N5O3N4N6M6K3lql5m4n3o2m4m9l2k1RJ7L3M3M9
3195b2N5N7L0L7J1jk2l0n8l6o9n1l8l5KnK9K5N2N4O5L7M3L3J5j2l2k9n6n4o1n0
3227a16k2l2JJ2L3L8M9O4L7M5M8%Mj3m3m1n3m9n2l5k0j5LJ7K7N3N1M1M3L1K6K3
3259A55%k0l5m9n1m5m5l8k9n%L1M3L8N9M3N6K8J9kkl3l4n6m2n2l5l3j7LNL9M2
3292f2M9M1M5L1K8Njj7l5m0m7m3n0k2l1oJ2J9L0N3N1M0N1K5K3Mqk5m0m1m7n7l8
$$ plain form
3325 -103 -118 -146 -151 -142 -112 -78 -20 17 67 95 122 142 135 120 86 46 -4 -40 -92 -116 -140 -141 -129 -123 -85 -53 -7 47 90 119 134 144
3357 144 136 112 80 47 -9 -46 -100 -138 -146 -142 -133 -112 -79 -39 8 59 97 133 137 147 137 108 78 25 -23 -69 -102 -133 -147 -131 -135 -92 -63
3390 -63 -17 28 65 104 109 118 114 107 82 45 8 -38 -62 -109 -104 -113 -111 -96 -69 -30 11 40 85 101 119 114 111 87 46 11 -24 -61 -92 -121 -141
3425 -141 -139 -117 -101 -67 -22 22 59 87 115 123 133 111 86 48 -1 -38 -71 -103 -109 -126 -117 -104 -71 -33 4 33 73 107 120 116 112 79 60
3458 60 16 -28 -59 -92 -110 -128 -130 -111 -96 -70 -26 7 50 90 103 116 129 104 76 49 20 -31 -74 -90 -119 -126 -122 -104 -78 -45 -9 34
3490 34 62 83 114 107 106 93 62 35 4 -38 -86 -96 -116 -112 -103 -100 -69 -45 4 44 61 78 93 103 101 74 48 19 -18 -50 -81 -97 -112
3523 -112 -110 -102 -81 -48 -19 21 68 85 108 108 105 97 67 40 -2 -46 -73 -95 -107 -107 -108 -91 -68 -38 9 32 67 88 99 113 90 77 52
3556 52 15 -21 -50 -71 -93 -102 -105 -96 -74 -31 -5 13 45 85 106 97 110 85 74 25 7 -33 -71 -90 -103 -113 -107 -92 -62 -50 -16 25 56
$$ packed form
3325a03j5k8nRL0L4N8L7N0K8K7K0pj5l4m0n0l6n2k4k4jJ2OL8L2M6N4M3K9J5J0
3357A44qk4l2l3n6l7n4l8qMRK1L3M0M7N1L8L6MJ0j0k9l0n3m8m6l3l1j4J6mM3K9
3390f3M6M5L7L9NRmpk5l7l7m6k4m7NrKJ5K7L9M1K9M5J6J8nlk4m1l5l5l7l1k9k0
3425a41KK2J6L4M5M4L7K8K8QJ0k2k5l8m9l7l3l2oj7RJ3L3L8L7K9M0L4J3mml3j9
3458F0m4m4l1l3j8j8kJ9J5K6M4L3M3M0J3J3J3k5k8k7k9n1m3j6k9pMJ8K6L3L6M3
3490C4K8K1L1pjj3l1k7l1m2m8j0k0MRLL1K4M9M0J7J7J5J0kk7k6k9l7l2l1j6j5
3523a12KQK1L3K9M0M7J7K3%lql0k7m2m4k7k2j2%jJ7K3L0M7K3L5K1J1J4k3j3k5
3556E2l7l6k9k1k2rlRK2M3K6J8L2M0K1rJ3k5j1m9j8m0l8j9j3j0OJ5L0J2L4M1L1
$$ plain form
3589 56 90 100 99 93 79 55 20 -12 -44 -76 -94 -107 -109 -92 -74 -52 -23 21 47 81 99 113 103 100 69 56 26 -13 -53 -79 -96 -98 -94
3622 -94 -80 -70 -54 -21 12 35 72 80 94 85 78 58 36 2 -36 -55 -83 -96 -101 -78 -76 -47 -17 11 25 65 99 105 108 79 74 37 26 -17
3656 -17 -38 -64 -91 -89 -91 -76 -66 -35 -15 16 41 65 80 95 85 81 57 32 9 -35 -62 -79 -103 -97 -94 -85 -57 -41 -1 26 58 83 86 102
3690 102 84 59 45 23 -7 -33 -64 -84 -87 -91 -85 -63 -41 -17 15 48 67 79 85 75 84 60 25 -3 -34 -54 -70 -94 -108 -99 -95 -66 -40
3723 -40 -5 24 48 66 78 84 85 70 50 34 6 -29 -47 -63 -78 -88 -75 -67 -51 -26 18 37 59 76 89 82 72 64 36 14 -9 -51 -74
3756 -74 -90 -87 -88 -76 -54 -52 -17 12 46 77 73 84 70 64 61 27 10 -24 -44 -57 -84 -88 -77 -68 -54 -25 9 32 51 80 84 85 73 57 36
3791 36 16 -6 -37 -56 -76 -76 -86 -75 -51 -40 -6 14 51 52 63 72 73 70 52 23 -1 -25 -56 -74 -81 -84 -76 -67 -40 -28 7 34 49 67 82
3826 82 86 75 73 45 24 -10 -34 -55 -75 -98 -91 -84 -75 -50 -19 -3 37 45 66 65 63 60 45 25 -3 -20 -40 -61 -76 -67 -76 -63 -53 -25 0 21
$$ packed form
3589E6L4J0joj4k4l5l2l2l2j8j3kJ7J8K2K9M4K6L4J8J4j0ll1j3l0l9m0k6j7kM
3622i4J4J0J6L3L3K3L7QJ4rpk0k2l4l8j9k8j3nK3KK9L0K8J4M0L4OLk9nl7j1m3
3656a7k1k6k7KkJ5J0L1K0L1K5K4J5J5j0mk4k5k3m4k7j7k4OLRK8J6M0K7L2K5LJ6
3690A02j8k5j4k2l0k6l1k0lmOK2K2K4L2L3J9J2Oj0Rk4l5k8l1k0j6k4j4RMK9K6
3723d0L5K9K4J8J2OJj5k0j6k8l5j8j6j5j0J3QJ6K5M4J9K2J7J3pj0qk8k2k3m2k3
3756g4j6LjJ2K2KL5K9L4L1mJ1j4oll4j7l4k0j3k7mJ1RJ4K9L4K3J9K9MJj2j6k1
3791C6k0k2l1j9k0%j0J1K4J1L4K0L7JJ1RJlj8k9k4k4l1j8plQRK7J2L5K7J5J8J5
3826H2Mj1kk8k1l4k4k1k0k3PPRK5L1J6M0QK1jklj5k0k8j7k0k1j5RrJ3J0K8K5K1
$$ plain form
3862 21 53 64 86 83 76 59 41 18 -3 -26 -55 -67 -79 -85 -78 -64 -49 -23 1 35 52 66 73 80 66 47 26 1 -20 -38 -62 -72 -82
3895 -82 -78 -72 -51 -28 5 13 40 63 72 79 74 66 41 17 1 -22 -43 -59 -72 -76 -72 -59 -44 -24 1 19 47 64 65 74 73 48 33 3 -23 -22 -63
3932 -63 -62 -86 -79 -72 -58 -22 -14 6 43 52 75 83 75 69 44 32 3 -13 -35 -51 -71 -73 -67 -49 -47 -18 4 18 37 53 66 80 56 44 22 11
3968 11 -14 -37 -53 -58 -71 -79 -70 -55 -42 -13 -4 20 46 63 75 74 69 51 39 20 -15 -36 -37 -62 -63 -75 -58 -33 -14 6 17 45 69 63 65
4003 65 63 51 36 7 -10 -28 -46 -60 -74 -63 -70 -54 -31 -15 5 33 43 47 54 63 50 46 45 11 -25 -32 -46 -54 -66 -67 -58 -46 -28 -1 16 42
4039 42 58 62 67 73 52 35 10 -11 -32 -44 -67 -91 -72 -69 -56 -43 -23 -11 23 43 55 52 64 58 45 20 10 -17 -39 -51 -60 -62 -56 -62 -48
4074 -48 -14 -11 17 21 52 59 71 75 54 39 17 2 -15 -48 -61 -60 -82 -77 -69 -49 -30 -2 2 29 48 56 70 50 43 27 9 -8 -22 -29 -63 -57
4110 -57 -59 -59 -39 -21 -6 9 32 44 63 61 70 59 45 16 9 -12 -26 -41 -57 -78 -68 -70 -53 -26 -6 17 21 41 48 64 53 47 40 17 -13
$$ packed form
3862B1L2J1K2lpj7j8k3k1k3k9j2j2oPJ4J5K6K4L4J7J4PPj4j9k1k5k1j8k4j0j0
3895h2MOK1K3L3QK7K3RPnqk5k4j6k3k1j6j3mMJ3J5K0K5J8K8J7JRjk5j5l0k6Jm1
3932f3Jk4PPJ4L6QK0L7RK3Qqok5j2k9j6k2j6k0kOJ8KK9K2J4J9J6J3J4k4j2k2j1
3968A1k5k3j6nj3qRJ5J3K9RK4K6J7J2jnj8j2j9l5k1jk5jj2J7K5J9K0J1K8K4oK
4003F5kj2j5k9j7j8j8j4j4J1pJ6K3J6K0K8J0MPRj3mjl4l6pj4qj2jRJ2J8K7J7K6
4039D2J6MNOk1j7k5k1k1j2k3k4J9LJ3J3K0J2L4K0J2lJ2oj3k5j0k7k2j2rkOoJ4
4074d8L4LK8ML1PJ2Mk1j5k2j5j7l3j3Jk2NQK0J9K8MK7J9QJ4k0pj6j8j7j4pl4O
4110e7k%K0J8J5J5K3J2J9kRj1j4k9pk1j4j5j6k1J0kJ7K7K0K3MK0PJ6j1opk3l0
$$ plain form
4145 -13 -29 -43 -52 -62 -71 -52 -53 -27 -14 14 29 33 58 65 64 66 44 29 16 -8 -26 -35 -56 -56 -61 -56 -39 -31 -13 20 26 28 45 53 53 43 42 19 -7
4184 -7 -24 -32 -61 -63 -66 -64 -47 -43 -18 -4 19 43 57 50 72 66 49 40 24 6 -21 -39 -55 -67 -53 -63 -46 -33 -12 2 14 27 40 56 39
4219 39 48 31 10 -2 -25 -35 -50 -56 -60 -54 -44 -35 -12 -1 18 28 39 48 51 57 47 44 20 -2 -20 -40 -51 -60 -54 -58 -52 -20 -9 22 37 36 45 51
4257 51 59 55 39 23 14 -18 -26 -39 -57 -62 -61 -56 -46 -26 -16 6 30 42 49 58 52 48 38 28 -3 -16 -21 -33 -52 -42 -50 -45 -32 -21 15 21 40 49
4295 49 50 57 55 35 27 20 -17 -23 -34 -57 -69 -62 -56 -42 -36 -9 0 16 37 40 51 54 52 34 26 16 -7 -34 -31 -44 -45 -44 -32 -23 -10 2 25 23 43 47
4335 47 54 55 39 17 7 -9 -26 -30 -49 -52 -47 -57 -46 -33 -26 9 8 29 35 48 46 38 41 11 10 -4 -22 -38 -45 -44 -45 -39 -38 -17 -2 27 28 46 56
4374 56 58 57 46 29 9 5 -13 -37 -43 -52 -53 -57 -45 -43 -27 -1 17 28 34 48 38 36 38 10 10 -17 -23 -38 -45 -57 -63 -51 -33 -33 -10 6 19 39
4412 39 40 45 55 39 32 19 4 -12 -31 -43 -51 -40 -49 -43 -40 -17 -7 9 10 32 37 30 28 28 18 -1 -12 -20 -36 -44 -50 -53 -41 -34 -20 -4 13 28 38
$$ packed form
4145a3j6j4rj0rJ9jK6J3K8J5MK5PjKk2j5j3k4j8rk1%nNJ7QJ8L3OKJ7Q%j0jk3k6
4184gj7qk9klKJ7MK5J4K3K4J4pK2oj7rj6j8k7j8j6j2J4j0J7J3K1J4J2J3J3J6j7
4219C9Rj7k1j2k3j0j5omOJ0RK3J1J9J0J1RLOj0lk4k2j8k0j1rOmOL2J1L1J5jRO
4257E1Qmj6j6rl2qj3j8nJNJ0K0J0K2K4J2PRomj0j0l1j3nj2j9J0qNJ3J1L6OJ9R
4295D9JPkk0qpl7oj1k3j2POJ4OK7RJ6K1LJ1Lkj8qj0k3k7Lj3jJJ2RJ3J2K3kK0M
4335D7PJj6k2j0j6j7mj9lNj0J1J3PL5jK1OJ3kqLl0jj4j8j6pJjOJK1J5K9JJ8J0
4374E6Kjj1j7k0mj8k4orjmJ2KJ6K6J8J1OJ4j0kKk8%k7oj5pj2oJ2J8%K3J6J3K0
4412C9JNJ0j6pj3j5j6j9j2qJ1rOLK3J0J6JK2Npk%j0j9j1qj6qolJ2PJ4J6J7J5J0
$$ plain form
4451 38 54 54 46 51 28 15 4 -6 -30 -38 -44 -51 -52 -45 -33 -24 -9 12 20 31 43 36 42 39 28 9 -3 -25 -37 -50 -41 -56 -33 -37 -26 0 2 32
4489 32 31 49 50 47 50 35 33 4 -13 -16 -31 -45 -45 -46 -41 -33 -13 -4 10 16 17 38 39 38 30 23 13 -7 -23 -30 -38 -39 -43 -40 -41 -39 -16 -7 9 24 29 50 46 40
4533 40 35 34 14 -1 -13 -24 -44 -34 -42 -46 -34 -24 -3 10 20 22 45 46 31 33 26 12 -8 -21 -29 -38 -45 -36 -48 -48 -39 -31 -4 12 20 37 37 45 49 46
4573 46 34 12 7 -16 -23 -21 -31 -43 -32 -33 -21 -13 2 19 30 30 49 37 41 27 18 7 -15 -19 -32 -55 -48 -50 -41 -34 -28 -8 6 20 25 33 37 23 35
4612 35 27 13 3 -12 -18 -33 -30 -29 -27 -24 -24 -8 -3 19 28 35 40 41 31 30 18 3 2 -15 -29 -34 -36 -33 -42 -34 -21 -19 3 11 18 30 39 32 27 30 15 3 -10
4655 -10 -19 -37 -26 -31 -31 -21 -20 -15 6 23 32 33 50 48 35 28 23 12 -6 -16 -33 -28 -42 -38 -36 -40 -26 -4 -3 14 28 34 36 40 33 24 24 6 -8 -13 -25
4696 -25 -28 -30 -37 -32 -27 -2 -5 19 24 38 41 41 49 35 25 14 1 -5 -23 -26 -28 -39 -25 -27 -28 -21 -12 14 27 22 33 38 21 34 27 8 0 -11 -8 -19 -33
4737 -33 -37 -31 -18 -15 8 8 14 25 27 41 33 20 32 16 4 -11 -24 -28 -33 -27 -32 -26 -23 -11 -5 -5 24 29 20 19 28 15 14 -2 -10 -15 -19 -41 -33 -24 -32 -17 -11 5
$$ packed form
4451C8J6%qNk3j3j1j0k4qopjPJ2RJ5K1QJ1J2pOlj1j9j2k2j2j3Rj5K3mJ1K6KL0
4489C2jJ8JlLj5kk9j7lj5j4%jNQK0RJ4OJK1Jjqpj0k0j6pqjmLjKK3RJ6J5NK1mo
4533D0njk0j5j2j1k0J0qmJ2J0K1J3J0KK3Jj5Kpj4k0j3qrpRj2%RQK7J6QJ7%QMl
4573D6j2k2nk3pKj0j2J1jJ2QJ5J7J1%J9j2Mj4rj1k2mj3k3PkRPOK0J4J4NQMj4J2
4612C5qj4j0j5oj5LJKL%J6NK2RPNJj0jj2j5jj7j4nkLrQJ3KK2QPJ2RpnLj5j2j3
4655a0rj8J1n%J0JNK1J7RJJ7kj3pnj1j8j0j7Nj4MKmJ4K2JJ7J4OKMpr%j8j4nj2
4696b5lkpNNK5lK4NJ4L%Qj4j0j1j3oj8lkj1J4kjPRK6J3nJ1Nj7J3pj9qj1Lj1j4
4737c3mOJ3LK3%OJ1KJ4qj3J2j6j2j5j3mnOnOLJ2O%K9NrjRj3jj6qnmk2QRqJ5OJ6
$$ plain form
4781 5 8 17 42 37 39 37 35 28 21 5 4 -6 -15 -23 -35 -34 -22 -19 -12 8 5 23 26 29 24 29 17 24 5 -9 -24 -19 -34 -51 -43 -35 -33 -18 -12 -9 11 21 29 25 44
4826 44 23 28 23 13 1 -14 -17 -22 -30 -26 -32 -15 -14 -10 3 9 18 20 24 26 23 18 9 10 -5 -20 -29 -30 -45 -30 -25 -15 -20 -5 -4 12 25 19 20 23 17 15 4 0 -1
4871 -1 -19 -28 -29 -13 -22 -14 -16 -4 7 15 22 24 34 24 20 21 7 0 -10 -23 -24 -39 -36 -38 -38 -20 -14 -11 2 15 29 26 31 22 31 19 14 6 -7 -17 -18 -30 -33
4914 -33 -14 -15 -9 -5 5 17 11 27 27 30 28 14 12 -1 -9 -21 -22 -35 -39 -41 -26 -25 -19 -20 0 8 12 19 29 24 25 20 14 9 -8 -17 -22 -22 -23 -22 -27 -14 -7 1 17 17
4960 17 23 29 43 34 25 5 20 2 -11 -24 -25 -29 -28 -25 -22 -13 -13 1 7 8 19 16 23 18 20 1 -15 -4 -20 -15 -15 -20 -20 -9 -1 6 7 24 20 21 29 34 28 26 13
5005 13 7 10 -7 -14 -20 -16 -33 -20 -29 -14 -11 -9 7 17 20 16 27 10 4 -1 -1 -13 -16 -14 -32 -32 -24 -19 -20 -10 -4 5 16 18 31 37 42 36 15 9 7 -11 -15 -21 -19
5050 -19 -27 -31 -25 -14 -9 -6 7 12 16 10 17 13 8 -1 1 -8 -16 -14 -25 -17 -20 -21 -4 -8 -9 14 10 23 17 32 26 24 13 10 -2 3 -1 -17 -15 -15 -26 -22 -2 -1 4 3 19
5097 19 24 24 20 18 14 0 2 -13 -19 -21 -23 -27 -33 -22 -19 -1 7 10 10 24 20 45 37 22 17 18 15 6 8 -2 -15 -19 -14 -18 -9 1 2 7 16 18 16 18 13 12 15 7 -7 -6 -17
$$ packed form
4781ELRK5nKkkppj6jj0rqj2JJ2LPK0lJ8LLnNj2Pj9j4j5Nj5j7QQKJ5OLK0J0QmJ9
4826D4k1Nnj0j2j5lnqMoJ7JMJ3ORKMKlnrJj5j5rjj5J5NJ0nJ5JJ6J3oJLokj1mj
4871aj8rjJ6rQkJ2J1QPKJ0j0mJj4pj0j3jj5Lk%J8OLJ3J3J4lNrRj2nqj3j0jj2l
4914c3J9jOMJ0J2oJ6%Lkj4kj3qj2jj3mkJ5JOjK0QMPJ0nJnonj7rn%jJnJ3PQJ6%
4960A7OOJ4rrk0J5j8j3j3jmJLLR%J4OJJ1lPnKj9j6J1j6N%n%J1QPJJ7mJQNokj3
5005A3oLj7poMj7J3rJ5LKJ6J0LmJ1j7on%j2lKj8%QNjJ0ORJ1KJ3ONok1okj8moK
5050a9qmOJ1NLJ3NMoPmnrKrqKj1QljJ7mjK3mJ3oJ5okj1lj2Nmj6K%j1MK0JNjJ6
5097A9N%mkmj4Kj5okkmoJ1LJ8QL%J4mK5qj5nJlrKj0j3mNmRJ0JNRKkKnjLqj4Jj1
$$ plain form
5146 -17 -22 -19 -28 -22 -11 -6 3 8 10 13 11 35 20 17 18 8 5 2 -8 -13 -9 -16 -21 -12 -2 3 12 6 12 22 17 23 15 1 14 9 -4 -5 -14 -11 -23 -15 -20 -18 -20 0 6 4
5194 4 14 7 23 24 5 17 9 1 -1 -6 -15 -19 -14 -17 -11 -12 4 7 15 22 24 20 21 16 22 9 4 -2 4 -15 -17 -22 -27 -25 -19 -9 -3 -12 0 16 21 11 7 22 8 13 3
5241 3 -1 1 -3 -11 -11 -7 -13 -14 -2 11 2 14 27 20 26 27 23 14 6 4 -3 -7 -12 -11 -12 -15 -26 -14 -14 -5 7 13 12 12 6 8 7 -2 -4 -9 0 -10 -18 -16 -9 -18 -1 6 11 9 14 13
5293 13 29 28 27 17 27 10 -8 1 -6 -6 -19 -13 -12 -26 -15 5 8 5 7 12 11 20 0 4 4 -1 -6 -14 -26 -5 -14 -8 -13 -12 -1 -3 7 17 8 7 16 18 15 16 15
5338 15 -4 0 -7 -11 -11 -22 -10 -14 -16 -7 7 15 2 -1 11 6 4 7 10 1 -8 -13 -21 -21 -26 -22 -20 -13 -13 -5 5 1 12 13 13 12 10 17 21 -1 -1 -6 -20 -22 -12 -5 -24 -7
5386 -7 0 3 16 11 7 11 12 13 4 -1 -3 -4 -10 -18 -22 -17 -23 -14 -14 -3 -10 0 13 9 23 16 13 17 22 9 -4 -9 -4 -10 -17 -9 -10 -8 -13 -2 -3 17 13 12 19 11 21 9 4 3
5436 3 -18 -12 -10 -21 -24 -14 -22 -28 -8 -9 -8 -3 18 20 10 11 19 14 13 0 -2 3 -22 -14 -11 -13 -12 -8 -9 10 6 15 16 21 13 17 17 0 8 -4 -11 -14 -18 -25 -19 -21 -6 -19
5484 -19 -8 -2 6 5 10 11 7 9 5 8 -1 -6 -6 -7 6 -6 -11 -3 -13 -4 9 11 13 12 16 2 10 8 8 8 0 -18 -16 -21 -27 -25 -20 -16 -10 -16 -1 11 -3 4 1 10 11 1 -2
$$ packed form
5146a7nLrOJ1NRNKLkK4j5lJj0llj0nMpnRJ0NRoOJ0nOqj4J3nj3jrLj2QnKkK0Ok
5194DJ0pJ6Jj9J2qqknrmNlOjJ6LQPKmJnOj3noOj9knnKOJ0OrJ2J6Nj0mJ5j4Nj0
5241CmKmq%MojJ2J3rJ2J3pOJmrqkpmnJjlj1J2%RJ2Oj%oKjrknRj0qKPrJ7PNkNj
5293A3J6jjj0J0j7j8Rp%j3OJj4J1K0LlKNjRk0M%nnqj2K1rOnJJ1kJ0J0rjRKlJj
5338A5j9Mpm%j1J2mkRJ4Qj3lJ2nkLLrrnq%nMKP%QJ0mJ1J%jkPMk2%nj4kJ0Pj9J7
5386gPLJ3nmMJJrnkjoqmNoR%J1pJ0J3mJ4plMNj3j3nNopQjKnJ1jK0mjPqJ0j2nj
5436Ck1OKj1lJ0qoK0jJNK1Kj0JQnjj3kNk5QLkJMjJ9mRJNqM%j7Qj2plmpOkJ5j3
5484a9J1OQjNJmKmLrn%jJ3j2nQj0RJ3KKjMj4Qk%%qj8KnoKNMOoJ5J2j4PlRJj0l
$$ plain form
5533 -2 -2 -5 -7 -5 -19 -24 -17 -17 -6 -3 1 12 12 21 11 16 15 18 11 11 5 -1 -8 -21 -19 -14 -12 -13 -6 -3 -7 2 6 10 8 14 14 4 -2 -2 -14 -19 -8 -17 -9 -8 -6 -2 6 12 4 29
5585 29 20 22 14 24 16 9 13 2 -10 -8 -10 -22 -7 -11 -13 -5 -4 -5 1 8 10 13 12 10 15 3 1 -8 -10 -16 -16 -28 -11 -14 0 -4 -6 8 12 21 21 24 11 23 16 15 5
5632 5 2 -3 -8 -9 -8 -11 -13 -6 0 2 -1 16 20 7 21 16 17 17 6 4 -17 -19 -23 -23 -6 -17 -11 -11 2 3 9 11 9 22 18 22 26 13 20 13 5 -11 -14 -5 -9 0 -3 0 6 5
5682 5 13 13 8 13 9 7 4 -13 -3 -2 -22 -14 -27 -13 -11 -18 -2 -4 8 8 11 10 21 22 19 22 10 0 7 11 -7 -1 -7 -9 5 3 -4 5 11 10 12 18 12 20 0 10 -1
5729 -1 -6 -9 -13 -15 -20 -19 -11 -24 -10 -3 -5 -2 10 10 18 17 13 14 5 11 -1 2 -7 -13 -5 -8 -4 -2 1 3 6 10 13 20 21 12 4 8 8 8 3 0 -15 -12 -17 -15 -12 -20 -7 2 -15 -1 17
5782 17 5 22 11 22 12 12 7 5 -7 -6 -9 -9 -4 8 0 3 20 11 23 26 17 24 9 8 0 3 -6 -11 -12 -17 -23 -20 -14 -20 -10 -3 -1 7 6 6 11 17 10 12 4 -5 -5 -16
5830 -16 -9 -10 0 -14 -10 -4 -7 6 9 15 19 25 22 30 15 11 4 1 -7 -3 -21 -17 -19 -16 -6 -9 -20 -3 4 9 5 4 17 7 0 0 -2 -11 -14 -18 -8 -12 -13 -6 6 -1 8 6
5878 6 11 16 16 22 23 13 17 4 11 3 3 -3 -7 -5 -4 -16 0 1 -7 0 0 9 12 9 2 6 -1 0 -13 -8 -2 -11 -18 -21 -11 -3 -1 5 4 12 13 26 25 21 23 13 11 5 -1 4 -7 -18
$$ packed form
5533b%lkKj4nP%J1LMJ1%Rj0NjLp%oopj3KNKjPLmRMMkO%j0o%j2nJ1rQJKMQOqK5
5585B9rKqJ0qpMj1j2Kkj2J5mkQJjOPKLjkNj2krko%j2J7lJ4mkJ4MR%Lj3J2pjj0
5632ElnnjJlkPOKlJ7Mj3J4nJ%j1kk1km%J7j1O%J3JOKkJ3mMMj3Ppqj6lRmRlLOj
5682EQ%nNmklj7J0Jk0Qj3J4KpJ6kJ2%LjJ1JlLj2j0PMj8OokJ4kpROjKOoQk0J0j1
5729anlmknJQj3J4PkLJ2%QjmJrOj2LroQlMKLKLMLPJrqM%%nlj5LnKLqJ3Rj7J4J8
5782A7j2J7j1J1j0%nkj2Jl%NJ2qLJ7rJ2LrPj5jqLrnjnoLOoJ0PKQj%NOpKqr%j1
5830a6PjJ0j4MOlJ3LOMOlQj5mplqMj8MkLJ0lj1J7PNmjJ3j0p%krlmJ0mjPJ2pRk
5878FNN%OJj0Mj3Pq%omKJj2J6JqP%RLlpMpJj3NOrplJ0QKOjQJJ3jmKj0kooNj1j1
$$ plain form
5930 -18 -9 -7 -10 1 1 8 16 17 27 18 18 5 2 -2 -8 -12 -12 -15 -4 -14 -16 -22 -16 -3 -1 15 18 14 17 16 20 27 16 12 9 3 0 -8 -15 -21 -15 -14 0 1 -2 4 19 10 15 26
5980 26 8 4 4 -1 -9 -14 -20 -18 -22 -20 -15 -3 -4 3 11 6 5 12 13 18 13 2 4 8 12 0 -3 -9 -6 -6 -2 -1 6 -1 -4 12 20 14 10 19 4 2 1 -1 -13 -20 -11 -10 -19 -26 -16 -9
6032 -9 -3 -2 3 10 17 23 13 15 7 11 15 -5 -5 -17 -17 -12 -4 -10 -2 8 8 9 8 18 14 19 16 14 13 4 -4 -8 -11 -12 -16 -27 -26 -19 -9 -9 -4 -7 7 11 3 12 14 5 -1 7 -6 -7
6084 -7 -8 -11 -12 -13 -4 -14 0 -4 1 16 14 8 20 14 5 3 1 -7 -11 -14 -9 -6 -15 -26 -5 -24 -6 8 -10 -4 -5 -2 13 9 9 -2 4 3 -12 -12 -6 -24 -13 -18 -7
6129 -7 1 2 1 7 19 12 18 17 20 11 9 -3 -9 -5 -8 -24 -19 -20 -11 -15 -11 2 -7 0 3 3 8 6 7 2 -3 -7 -8 -17 -16 -13 -16 -17 -9 -8 -9 -7 1 5 17 8 14 18 9 10 -2 3 -5 -2 -7
6184 -7 -15 -21 -31 -14 -13 -11 -3 -4 5 -1 13 3 -7 -1 -3 -10 -8 -23 -25 -11 -22 -22 -17 -13 -10 -8 -5 2 0 3 4 14 14 1 5 -4 -1 -13 -14 -15 -14 -11 -13 0 -17 0 -3
6231 -3 2 -1 17 7 11 3 -2 -9 -14 -14 -4 -21 -27 -15 -5 -7 -11 -1 4 10 10 12 9 3 13 6 3 3 1 -3 -9 -7 -11 -17 -8 -9 -3 1 2 0 8 4 6 7 2 -2 -4 -15 -20 -16 -17 -26
6283 -26 -24 -21 -21 -22 -4 -10 -6 4 11 7 16 13 10 6 -1 -4 -8 -18 -6 -9 -8 -17 -6 -3 -5 2 6 9 15 5 11 11 -1 3 -17 -14 -10 -17 -19 -9 -21 -7 -15 -7 -9 -8 4 8
$$ packed form
5930a8RKlJ1%PQJJ0r%j3lmom%lJ1j0koOJ3KJ6LmLjMPj1mlolqpoOJJ4JlOJ5rNJ1
5980B6j8m%nqnoKmKNJ2jPQnjPJNnj1KMMj2loL%MJPplJ6QomRj5kjkj2pRJrpJ0P
6032iOJNPPOj0KqMMk0%j2%NQoQJ0%JjJ0mNlkjrqmljmj1JPJ0%NlJ4MqRKroQj3j
6084gjljjRj0J4mNJ5koJ2orkkqmlNLrj1K1j9J8J4j8OjLJ5m%j1Ojj5%Oj8J1nJ1
6129gQJjOJ2pOjLrkj2oMlj6NjRmMJ3rPL%NkJnnmjrJLljQJjKQMJ2rOMrJj2NqLn
6184gqoj0J7JKQjRoJ4j0j0OkpKj5kJ4j1%NMLKLPkLJJ0%j3MrLj2jjJLkJ3j7J7l
6231cNlJ8j0Mqnpn%J0j7oJ2J0kmJ0NO%KloJ0pl%kmoKmoRjOMJkQmKJnmkj1nMjr
6283b6KL%jJ8oMJ0PmRllmplmj0J2lJrJ1LkPMLOj0O%j2Mk0LMpkJ0j2J4qQkJJ2M
$$ plain form
6331 8 1 3 7 6 7 7 -8 -13 -7 -8 -8 -4 -15 -7 -3 3 20 17 24 12 13 21 13 -4 2 -3 -6 -5 -11 -19 -21 -28 -16 -18 -10 -8 4 0 0 6 15 15 -1 7 5 -7 -6 -10 -17 -18 -11 -14
6383 -14 1 -10 0 5 7 10 10 16 12 14 6 11 9 -1 -4 -6 -12 -12 -12 -16 -15 -14 -9 -2 6 -3 -2 10 10 12 7 12 -3 -2 0 -10 1 -12 -1 -3 -1 5 6 10 24 22 23 24 9
6432 9 16 10 1 -9 -5 -13 -6 -3 -10 -5 -14 0 4 2 6 6 5 -3 1 1 0 -2 -5 -21 -11 -9 -6 -15 -13 -9 -16 -3 8 19 5 15 14 12 18 17 9 -1 -5 -9 -3 -19 -9 -17 -6
6481 -6 -13 -11 -18 4 11 4 1 0 13 7 5 -7 10 -8 -13 -22 -13 -10 -12 -12 -10 -16 -3 -3 11 2 8 18 6 15 17 13 4 2 2 -3 -4 -4 -13 1 -8 6 2 6 1 9 13 12 12 3
6531 3 2 -4 -12 -8 -9 -15 -10 -12 -12 -18 -18 -12 0 11 2 8 4 -1 14 12 14 4 -9 -1 -6 -5 -10 -2 11 0 -7 -5 11 7 16 13 15 21 9 5 -8 -12 -23 -14 -13 -18 -17 -26 -7
6580 -7 -9 -12 -3 0 12 10 2 6 20 13 5 -4 -10 -6 -7 -10 -7 -6 -2 -6 -7 2 6 10 8 5 0 10 5 0 9 -6 -8 -18 -14 -20 -22 -13 -16 -25 -18 -12 -2 -6 -4 1 9 7 5 15 1 1 2
6633 2 -16 -10 -12 -16 -10 7 -2 8 5 3 28 16 8 17 17 9 11 0 1 -16 -9 -6 -11 -14 -6 -13 -15 0 -12 10 7 6 3 10 5 6 -10 -6 -5 -8 -1 -7 -8 -6 -6 -4 3 3 7 21
6683 21 19 14 16 9 13 8 -2 2 -8 -8 -2 -11 -13 -13 -11 -19 -9 -2 3 7 12 4 6 4 1 -3 1 -12 -23 -17 -20 -10 -10 -9 1 0 15 7 13 21 16 20 18 6 16 21 -5 -9 -13
$$ packed form
6331HpKMjJ%j5nOj%Mj1QMOJ7lPj2JQqj7OnlJoqkpJ2kQKJ2m%OR%j6Qkj2JmpjPl
6383a4J5j1J0NKL%OmKqNkj0lko%%mJJNPQrJJ2%KnNj5JKj0J1j3J1kKOJMJ4kJJj5
6432IPorj0MqPLpNrJ4MkM%jqM%jklj6J0KLrKMpJ3J1J1j4J0jkOjqj0mmOj6J0qJ1
6481fpKpK2PpljJ3okj2J7j8nrRLk%KoJ3%J4rOJ0j2RKmrk%nj%rJ4rJ4mMnQMj%r
6531CjoqMjoNk%o%OJ2J1rOmnJ5kKj0j3QnJnQJ3j1pKJ6mRlKOj2mj3mj1RJnJrJ9
6580gklRLJ2kqMJ4pqroMjlLJMmjRMMklnJ0nnRj5kj0MokRlrPOJ0mKNQkkJ0j4%J
6633Bj8OkmOJ7rJ0lkK5j2qR%qKj1Jj7PLnlQpkJ5j2K2ljlPnJj6MJlPojK%KP%MJ4
6683B1knKpMnj0Mj0%Ork%KqJ0PNMNqKklmMj3j1OlJ0%JJ0jJ5qOQnMkj2J0Nk6mm
$$ plain form
6732 -13 -17 -8 -6 -13 -19 -14 -2 -4 -6 -1 -2 -5 3 2 -3 -6 1 -7 -19 -14 -21 -16 -10 -11 -8 -12 2 -3 1 5 11 19 11 11 4 7 9 -2 -7 -2 -24 -6 -10 1 -9 -13 -1 -3 8 6
6782 6 -1 9 2 -2 -5 0 -12 -14 -16 -15 -23 -16 -23 1 0 -9 11 -2 9 15 15 19 11 17 5 13 13 -4 7 -3 -9 -7 3 -1 5 7 0 -3 7 12 11 -5 2 3 -7 -15 -3
6829 -3 -3 -5 -18 -10 -15 -19 -3 -7 8 1 6 6 10 10 8 4 10 0 8 11 2 0 3 0 2 -4 3 -5 14 3 27 17 -1 -2 0 3 -5 -9 -14 -16 -12 -14 -8 -12 -13 -2 -7 -2 0 -1 4
6880 4 7 15 7 18 8 3 -2 1 0 -2 0 -9 -7 -5 -3 -9 1 4 14 22 19 7 14 5 3 1 -12 -8 -20 -15 -19 -22 -25 -17 -10 -8 -6 -2 6 9 4 3 7 4 7 -2 -4 -1 -7 0 3 2 -1 -3
6934 -3 -2 -4 11 12 12 22 11 0 7 8 -3 -2 -10 -11 -14 -13 -12 -9 -12 -9 -7 -8 -6 5 -5 7 8 -4 0 -7 3 -11 -10 -13 -12 -11 -4 -6 1 -1 -3 10 18 8 8 7 6 4
6982 4 3 -4 -4 -11 -6 -25 -3 -8 -4 -4 -9 2 -7 -4 8 2 3 -4 -6 -3 -2 1 -2 -10 -8 -7 -6 0 -1 3 -2 -4 2 13 6 21 14 7 11 3 7 8 3 -17 3 -7 -16 -13 0 -7 -1
7033 -1 2 -10 -2 -2 -5 -9 2 -6 -5 -5 -16 -5 -6 0 -1 -11 -9 -11 -11 -7 2 -1 7 9 17 10 11 10 -2 10 2 -11 0 -8 -6 -9 0 -7 12 -6 0 3 -1 6 7 2 -2 -3 -2 -11
7083 -11 -15 -14 -3 -12 0 -7 -5 -7 -6 16 7 18 9 11 18 5 14 1 18 0 -3 -7 -4 -4 -7 -6 2 -6 -7 -8 2 -4 6 6 -1 -6 -6 -16 -5 -10 -15 -14 -15 -13 -15 -17 -7
$$ packed form
6732a3mRKpoNJ2kkNjlQjnlPqj2NpNOjLmJ4nMMOQq%pLKj1nNk2J8mJ1j0mJ2kJ1k
6782FpJ0pmlNj2kkJqPpK4jrK0j3J1O%MqOj2Q%j7J1j0oKJ0mOKplJ0Njj6PJj0qJ2
6829c%kj3QnmJ6mJ5pN%M%kmOj0QLrkLlKoPqJ9j1K4j0j8jKLqmnkMkOmjJ1nNKjN
6880DLQqJ1j0nnLjkKrKKKoJ0LJ0Qlj2Prkkj3Mj2NmllQPKKMQLnjMlLrkLoPLjlk
6934cJkJ5J%J0j1j1PJj1JqjlJJLlLKjKJ1j0J2Jj2MpJ0j4JlJJPkPkkJ3Qj0%jjk
6982Djp%pNj9K2nM%nJ1rLJ2oJpkLJLlqKJJOjMnkOJ1pJ5ppMqMJnk0K0j0rLJ3pO
7033aLj2Q%lmJ1qJ%j1J1jOjj0Kk%MRlQKQpJjj2J2qj3J1qKlRpJ9j8OLmPJnmjJr
7083a1mJJ1rJ2pKkJK2rJ1rKPj3Rj3J7j8lmL%lJQqjjJ0oJ0%pn%j0J1nnJjKkkJ0
$$ plain form
7130 -7 0 -7 2 7 1 9 13 8 9 6 3 -13 5 1 -2 -6 -7 -10 -9 0 1 -11 8 4 5 7 4 3 -15 -2 -13 -3 -9 -10 -10 -17 -8 -19 -15 -15 -11 -2 -7 4 14 8 -5 9
7178 9 11 -4 3 -7 -1 -1 -5 -1 1 -3 1 4 5 16 6 15 12 3 2 -1 -13 -2 -4 -15 -6 -11 -22 -25 -5 -9 -19 -10 -13 -2 3 1 1 6 1 0 -3 -1 4 -1 -6 -20 -9 -10
7226 -10 2 -7 5 5 1 3 -2 11 16 3 3 -4 2 2 -20 -9 -16 -18 -11 -17 -20 -12 -24 -6 -2 -2 -6 5 -6 -7 0 -1 -14 -3 -3 -13 -16 -3 -11 -2 4 7 5 6 9 7
7272 7 7 17 14 5 8 1 -4 -3 -5 -22 -9 -6 -13 -20 -2 -2 -3 -6 -6 -8 -1 -4 0 -7 -7 -3 -9 -8 -10 -10 -14 -6 -3 -8 -7 6 10 3 10 15 16 7 8 3 4 6 -6 1 -1 -10 -13 -15 -5 -17
7326 -17 -13 -2 6 -6 4 -1 -6 3 -12 -4 0 -3 -8 -9 -7 -10 -24 -8 -10 -6 -3 0 10 3 11 11 5 15 14 6 8 -3 9 13 4 -13 -8 3 -9 -1 -4 2 -7 4 -5 -6
7372 -6 -8 -7 -13 -13 -12 -4 -8 -7 -1 -6 -7 6 -10 -4 -1 3 9 6 1 -1 13 7 3 11 2 -1 6 -4 -9 -3 -3 6 8 11 7 -2 1 6 10 3 -5 -10 -10 -11 -10 -19 -20 -17 -8 -12 -11 -13 -10 -17 -7 0
7428 0 13 7 4 6 5 5 9 4 7 -7 -18 9 -2 -3 -4 -8 6 -3 6 -1 -1 9 3 11 -2 -5 -6 -8 -11 -14 -12 -12 -18 -6 -12 4 4 -1 -1 -2 -3 9 12 5 5 -2 -9 -13 -4 -7
7478 -7 2 -4 1 -1 -9 0 7 2 9 -2 -1 -1 6 -8 -8 -2 2 -7 -12 -2 -7 -9 -12 -12 -11 7 -5 -3 7 5 11 2 9 2 -5 -4 -4 -4 -6 0 -2 -6 -1 6 9 6 9 14 5 8 13 9 4 7 -10
$$ packed form
7130gPpRNoQMnJllj6J8mlmjlJRJj2J9mJKljj8J3j1J0oj%pRj1M%MRnJ1J0oj3J4
7178IKj5Pj0O%mMKmMLJJ1j0Rlrjlj2J1kj1Rnj1lK0mj0RlJ1Nk%NnjlKNnnj4J1j
7226a0J2rJ2%mKnJ3Nj3%pO%k2J1pkPolQj2J8M%mJ1j1jPjj3J1%j0lJ3qROLkJLk
7272G%J0lrLpnJkj7J3LppJ8%jl%kPlMp%MoJk%mQLnJJ3MpPNJrJnJKj2PkrlkJ0j2
7326a7MJ1Qj2J0nnRj5QMlnjKlj4J6kMLLJ0pQ%oJ0jqKj1J2Mrj7NJ1j2QlOrJ1rj
7372fkJo%JQmJOnjJ3j6OLMOlnkJ4omQrlPj0nO%RKLmrLNMpqn%jJrjLRmJkLpJ0P
7428@J3olKj%MnLj4j1K7j1jjmJ4rRp%J0oQj3ljkllK%oJ2oJ6%n%jjJ2Lp%ppmRl
7478gRoNkqRPnPj1J%Pj4%OMrnJ0nkl%JJ8j2KJ0kOrPppJ%%kOkmNPLlLNrLNmnLj7
$$ plain form
7533 -10 -3 -1 -16 -13 -12 -16 -14 -8 -4 0 -18 -4 -1 -9 -7 0 -3 -6 -3 -7 0 1 -10 12 -8 1 -6 3 -1 -6 6 3 12 17 1 6 17 2 1 1 2 -9 -6 -4 -2 -5 -22 -6
7581 -6 -14 -7 -2 -7 -11 -10 -7 -9 8 -2 -14 -5 -11 0 0 -10 -8 -14 -2 2 1 10 -3 -3 11 9 2 14 -1 -7 -8 -3 -4 -10 -5 -18 -15 -12 -12 -6 6 0 -6 0 -9 -7 -8 7
7629 7 -5 -10 -14 -16 -9 -13 -13 -15 -11 -8 -9 -9 -4 -11 -1 3 -1 9 12 8 -2 2 -4 0 0 7 -2 -11 -3 -5 -3 -10 -3 -12 -9 1 3 1 -2 5 5 -9 -2 -8 -7 -4 -14 -1 -10 -3 -2 -7 0
7682 0 5 -6 5 -4 16 4 0 2 5 0 3 -16 4 1 0 6 3 -6 3 1 0 -8 0 -9 5 -4 -5 -5 -10 7 -15 3 -14 -12 -15 -5 -13 0 -4 5 2 9 -3 2 0 -2 4
7729 4 -2 0 1 2 -3 1 -14 3 3 -1 5 3 10 10 9 13 6 -10 1 -5 -5 -1 -9 -2 -19 -7 -11 -17 -9 -17 3 2 -2 2 2 4 0 7 4 9 5 4 6 9 4 -2 -6 1 -2 0 -6 -5 -2 1
7783 1 -2 1 7 3 -15 -4 3 0 -7 -5 -7 -5 -15 -4 -7 -1 -2 0 -11 -5 -7 4 3 5 -7 1 -1 0 1 6 -8 5 5 -3 0 -1 1 3 11 5 12 3 1 -6 -1 -6 -8 -14 -7 -7 -17
7834 -17 -9 -14 -14 -5 -10 -6 -2 -3 2 -12 3 8 -4 -9 -8 5 -11 -8 -3 1 -1 -2 14 10 11 12 14 18 -8 18 3 -3 11 1 1 1 3 -1 -2 -12 -16 -9 2 -3 -9 -4 -11
7881 -11 -6 -9 1 0 -5 -3 -1 -3 -14 4 -8 -12 5 -6 -1 -1 11 5 15 12 7 12 7 9 -2 7 -2 -2 -9 -5 0 -3 -10 -3 2 -6 2 -5 0 -8 -2 -12 -4 -8 -11 -7 -10 -8 -6 -3
$$ packed form
7533a0PKj5LJmKOMMj8J4LqKPllLmPJj1K2k0RpRmnJ2lRNj6NJ1j5j%Jj1LKKlj7J6
7581fqPNnmJLkJ7j0j2RoJ1%j0KoJ2MjRj3%J4kpJ2j5ojNjoNj3LL%OJ2ooOrKjJ5
7629Gj2nmkPm%kMLj%NpJ0MmJ0Lmj0MoM%PrrQkKpPrLJ0KklP%j4PoJLj0J3rPJnP
7682@Nj1J1rK0j2mKLnLj9K0ljOlrRkjqQrJ4rj%nJ7k2J8j7KlJ0qJ3mRlPj2NkkO
7729DoKJJnMj5J7%mOkP%jMpj6J1o%MqPj7J2moQqK0jmM%KmPlNmjKLnomPlKoJLL
7783AlLOmj8J1PlpKkKj0J1lOjKj1OkJ1jKj2QkJJNj4J3%qLjKKQoPrkpNnkoP%j0
7834a7Qn%RnMMjNj4J5Nj2nJJ3j6LNMkjJ6mJJKMk6K6j5oJ4j0%%Kmjj0mPJ1noNp
7881a1NlJ0jnKKkj1J8j2mJ7j1N%J2oJ0lnNnKj1Rr%pMNlpPNqQpNqOj0QmlMlKKL
$$ plain form
7931 -3 -14 1 7 6 -1 2 10 5 4 5 5 11 4 8 0 7 -4 2 2 1 -9 -5 -6 1 -4 0 4 4 1 2 2 -4 -2 -2 -3 -10 -12 -2 -13 -6 1 -4 4 0 -10 8 1 9 11 -3 2 -1
7983 -1 3 2 3 -3 4 3 5 2 4 -5 4 2 4 -3 -3 4 -6 5 -13 -7 -5 -4 -3 -13 -5 -5 -8 -10 -4 -11 7 11 8 -8 11 2 5 1 1 6 0 10 -3 0 2 3 1 5 6 7 -2 13
8035 13 8 3 -7 -2 6 -4 2 -4 -11 -6 -12 -10 -11 -13 -25 -11 -15 -19 -15 -6 -8 1 -2 -4 1 3 3 10 0 -3 -4 -13 7 -2 -3 8 2 -1 8 0 -4 4 4 4 2 -7 -4 1 -10 1 -18
8086 -18 -13 -3 -16 -6 -14 -11 -24 -9 -4 -6 -3 -10 -13 -2 -1 -1 -7 -9 0 -10 4 5 7 -9 0 -9 6 12 -3 8 2 9 8 6 6 -1 -1 2 -12 1 -9 -9 -5 -8 -7
8131 -7 -5 -2 -6 -5 0 -8 5 -5 3 5 -13 -5 3 2 0 -2 8 8 0 4 1 17 9 3 8 0 4 3 8 17 -2 3 5 -8 -3 3 0 -8 -8 -2 -1 -10 8 0 -1 -11 0 -1 -13 1
8181 1 -5 -2 -5 -8 -3 -1 1 -1 9 1
$$ packed form
7931cj1J5OjpLQnjJ%OpMqPj1O%jj0MjPnMM%lJ%oK%jpkJ0j1PPnQmj0J8pQKj4Nl
7983aMjJoPjKlKrRkKp%Pj0J1j8OKJJj0Q%lkOpJ8Mlj6J9rLm%NoJ0j3LKJkMJJrJ5
8035A3nnj0NQj0OopNoKjkj2J4mmMRkRlkNK%Pj0ljrK0rjJ1olRqmQ%%krLNj1J1j9
8086a8NJ0j3J0qLj3J5NkLplJ1J%okRj0J4JKj6RrJ5Oj5J1oPjk%p%Lj4J3j0%MlJ
8131gKLmJNqJ3j0QKj8QQjkkJ0%qMlJ6qoNqMjNRj9NKj3NOlq%OJrJ8qjj0J1jj2J4
8181AoLllNKKkJ0q
8191A
$$ Imaginary data points
##PAGE= N=2
##DATA TABLE= (X++(I..I)), XYDATA
$$ plain form
0 0 0 0 0 0 0 0 0 0 0 0 0 -8 8 -8 8 -16 16 -16 24 -24 32 -40 46 -48 64 -72 80 -96 112 -128 144 -166 184 -210
34 -210 240 -270 302 -338 377 -422 470 -522 578 -639 709 -782 864 -952 1048 -1155 1272 -1402
52 -1402 1547 -1708 1885 -2090 2319 -2586 2893 -3257 3697 -4236 4917 -5809 7038 -8842 11765
67 11765 -17300 31660 -154083 -335185 -210699 -203058 -111057 -4860 88675 124170 211988 267759
79 267759 269951 250953 259718 210917 134575 78935 35535 -48153 -107378 -128044 -149554 -179516
91 -179516 -161270 -125763 -105505 -77118 -18692 20289 37681 64575 91068 81803 64167 57145
103 57145 35962 -5287 -30338 -43285 -66509 -83801 -73744 -59604 -50850 -25791 12860 38695
115 38695 58644 87313 106860 104584 99581 94612 71725 37882 12270 -13731 -48543 -74489 -84829
$$ packed form
0@%%%%%%%%%%%qJ6j6J6k4L2l2M0m8N6p2Q6r4J12j36J52j76K08k40K72l10L50l94
34b10M50n10N72o40P15p99Q92r92J100j217J348j491J646j816K000k203K427k674
52a402K949l255L593l975M409m905N479o150O954p933R153j0726J2847j5880K0607
67A1765k9065M8960j85743j81102J24486P641R2001J06197R3535L5495Q7818N5771
79B67759K192j8998Q765m8801p6342n5640m3400q3688n9225k0666k1510k9962
91a79516J8246L5507K0258K8387N8426L8981J7392K6894K6493r265j7636p022
103E7145k1183m1249k5051j2947k3224j7292J0057J4140Q754K5059L8651K5835
115C8695J9949K8669J9547k276n003m969k2887l3843k5612k6001l4812k5946j0340
$$ plain form
128 -84829 -94765 -101785 -91524 -72974 -58849 -39357 -11054 10164 22563 37705 49620 47869 42120
141 42120 39554 30437 15096 6417 2651 -4488 -7574 -489 7283 12559 23332 36236 41303 42116
155 42116 43403 37467 21685 4574 -13158 -37025 -61317 -78384 -91582 -102048 -102153 -91136 -75342
168 -75342 -53539 -22524 11182 42025 72236 99948 117703 125138 125705 116390 95089 67516 37066
181 37066 2260 -33381 -63284 -86976 -105294 -113874 -110944 -100415 -83432 -58596 -29630 -1751
193 -1751 24824 49328 66911 76032 78886 74789 62283 44597 25133 3884 -17470 -34613 -46249
206 -46249 -53335 -54154 -47388 -35624 -20946 -3182 15626 31724 44114 52769 55449 51099 41651 28126
220 28126 10414 -9148 -27472 -43641 -56818 -64457 -65546 -61295 -51782 -36853 -18638 312 19258
$$ packed form
128h4829r936p020J0261J8550J4125J9492K8303K1218J2399J5142J1915j751n749
141D2120k566r117j5341q679l766p139l086P085P772N276J0773J2904N067Q13
155D2116J287n936j5782j7111j7732k3867k4292j7067j3198j0466j05J1017J5794
168g5342K1803L1015L3706L0843L0211K7712J7755P435N67r315k1301k7573l0450
181C7066l4806l5641k9903k3692j8318q580K930J0529J6983K4836K8966K7879
193a751K6575K4504J7583R121K854m097j2506j7686j9464k1249k1354j7143j1636
206d6249p086q19O766J1764J4678J7764J8808J6098J2390Q655K680m350r448j3525
220B8126j7712j9562j8324j6169j3177p639j089M251R513J4929J8215J8950J8946
$$ plain form
233 19258 36875 50430 58930 62703 61102 53746 42245 28272 12311 -4039 -18488 -30126 -38627
246 -38627 -42859 -42275 -37987 -30796 -20956 -9872 522 9560 16777 20860 21376 19038 14235 7164 -821
261 -821 -8283 -14642 -19172 -20647 -18817 -14217 -7075 2188 12285 21821 30029 35946 38298 36797 31658
276 31658 22978 11235 -2116 -15818 -28906 -39934 -47520 -51011 -50190 -44779 -35143 -22373 -7618
289 -7618 7995 23008 35788 45345 50944 51806 47907 39863 28408 14435 -537 -15002 -27849
302 -27849 -37847 -43943 -45621 -42997 -36255 -26041 -13526 -99 13083 24747 33528 38692 39858 36848
316 36848 29957 20059 8214 -4410 -16542 -26798 -34210 -38088 -37955 -33805 -26211 -15946 -4014 8292
330 8292 19741 29175 35720 38597 37580 32878 24934 14498 2740 -9094 -20030 -28895 -34793 -37174
$$ packed form
233A9258J7617J3555Q500L773j601p356j1501j3973j5961j6350j4449j1638q501
246c8627m232N84M288P191R840J1084J0394R038P217M083N16k338m803p071p985
261h21p462o359m530j475J830M600P142R263J0097R536Q208N917K352j501n139
276C1658q680j1743j3351j3702j3088j1028p586l491Q21N411R636J2770J4755
289g618J5613J5013J2780R557N599Q62l899q044j1455j3973j4972j4465j2847
302b7849r998o096j678K624O742J0214J2515J3427J3182J1664Q781N164J166l010
316C6848o891r898j1845j2624j2132j0256p412l878J33M150P594J0265J1932J2306
330H292J1449R434O545K877j017m702p944j0436j1758j1834j0936q865n898k381
$$ plain form
344 -37174 -35922 -31148 -23332 -13345 -2206 8985 19203 27311 32578 34555 32999 28129 20514 10928
358 10928 346 -10132 -19469 -26712 -31167 -32349 -30169 -24914 -17119 -7576 2629 12494 21029 27336
372 27336 30736 30917 27903 22012 13835 4282 -5616 -14913 -22645 -27983 -30361 -29623 -25818 -19348 -10921
387 -10921 -1457 8114 16878 23838 28352 29951 28471 24069 17229 8624 -831 -10214 -18617 -25157 -29167
402 -29167 -30256 -28301 -23505 -16338 -7474 2127 11580 19959 26416 30266 31129 28971 23934 16543 7537
417 7537 -2152 -11638 -19986 -26331 -30088 -30886 -28695 -23709 -16493 -7776 1534 10506 18321 24190 27550
432 27550 28100 25870 21131 14432 6471 -1875 -9795 -16537 -21388 -23871 -23825 -21301 -16608 -10285 -3027 4365
448 4365 11194 16712 20326 21710 20713 17469 12306 5798 -1333 -8378 -14604 -19296 -21980 -22324 -20303 -16075
$$ packed form
344c7174J252M774P816R987J1139J1191J0218Q108N267J977j556m870p615r586
358A0928j0582j0478r337p243m455j182K180N255P795R543J0205R865Q535O307
372B7336L400J81l014n891q177r553r898r297p732n338k378P38L805O470Q427
387a0921R464R571Q764O960M514J599j480m402o840q605r455r383q403o540m010
402b9167j089J955M796P167Q864R601R453Q379O457L850Q63k158n037p391r006
417G537r689r486q348o345l757p98K191M986P216Q717R310Q972P815N869L360
432B7550N50k230m739o699p961q346p920o742m851k483M6K524M693O323P258P392
448D365O829N518L614J384r97l244n163o508p131p045o226m692k684l44K021M228
$$ plain form
464 -16075 -10064 -2909 4667 11939 18110 22508 24688 24379 21585 16590 9849 2077 -5950 -13474 -19731
479 -19731 -24062 -26029 -25454 -22379 -17105 -10188 -2332 5682 13119 19222 23370 25209 24566 21521 16424
494 16424 9786 2294 -5285 -12272 -17967 -21791 -23403 -22665 -19683 -14791 -8490 -1438 5648 12119 17301
509 17301 20665 21889 20886 17771 12851 6666 -120 -6833 -12821 -17452 -20228 -20891 -19401 -15905 -10768
524 -10768 -4576 2053 8422 13897 17901 20009 20014 17946 14006 8648 2410 -4014 -10015 -14973 -18373 -19869
540 -19869 -19306 -16777 -12524 -7011 -827 5426 11148 15735 18713 19804 18915 16128 11736 6193 83
555 83 -6029 -11531 -15864 -18607 -19466 -18367 -15438 -10961 -5445 565 6466 11688 15680 18024 18495 17031
571 17031 13815 9186 3635 -2241 -7854 -12610 -16010 -17680 -17447 -15325 -11561 -6528 -760 5120 10539
$$ packed form
464a6075O011P155P576P272O171M398K180l09k794m995o741p772q027p524o257
479a9731m331j967N75L075N274O917P856Q014P437O103M148J839o43l045n097
494A6424o638p492p579o987n695l824j612P38K982M892O301P052P086O471N182
509A7301L364J224j003l115m920o185o786o713n988m631k776o63J490L496N137
524a0768O192O629O369N475M004K108Nk068l940n358o238o424o001m958l400j496
540a9869N63K529M253N513O184O253N722M587K978J091q89k787m392n543o110
555H3o112n502m333k743q59J099K929M477N516O010N901N222L992K344M71j464
571A7031l216m629n551n876n613m756l400j670K33K122L764N033N768N880N419
$$ plain form
586 10539 14911 17760 18780 17837 15027 10600 5012 -1194 -7374 -13005 -17455 -20320 -21231 -20150 -17111
601 -17111 -12409 -6505 79 6718 12824 17843 21254 22755 22237 19719 15468 9873 3480 -3135 -9382
616 -9382 -14695 -18599 -20743 -21004 -19387 -16088 -11495 -6070 -367 5062 9726 13209 15227 15649 14504 12044
632 12044 8507 4414 201 -3672 -6794 -8917 -9796 -9397 -7815 -5308 -2219 1119 4246 6794 8527
647 8527 9138 8577 6877 4240 934 -2709 -6228 -9326 -11606 -12774 -12678 -11311 -8750 -5246 -1133 3272
663 3272 7448 11069 13701 15103 15113 13745 11121 7454 3161 -1366 -5659 -9322 -12025 -13439 -13514 -12228
679 -12228 -9757 -6368 -2490 1498 5116 8002 9875 10503 9812 7927 5025 1524 -2294 -5872 -8871
694 -8871 -10921 -11733 -11171 -9234 -6095 -2079 2501 7137 11399 14820 17012 17701 16730 14151 10128 4976
$$ packed form
586A0539M372K849J020r43k810m427n588o206o180n631m450k865r11J081L039
601a7111M702N904O584O639O106N019L411J501n18k518m251n595o393o615o247
616i382n313l904k144k61J617L299M593N425N703N429M664L483K018M22j145k460
632A2044l537m093m213l873l122k123q79L99J582K507L089L338L127K548J733
647H527O11n61j700k637l306l643l519l098k280j168R6J367K561L504M113M405
663C272M176L621K632J402J0j368k624l667m293m527m293l663k703j414p5J286
679a2228K471L389L878L988L618K886J873O28o91j885k902l501l818l578k999
694h871k050q12N62J937L139M016M580M636M262L421K192O89r71k579m023n152
$$ plain form
710 4976 -850 -6857 -12554 -17377 -20870 -22693 -22662 -20732 -17038 -11879 -5714 970 7567 13570 18435 21720
726 21720 23215 22790 20529 16662 11550 5692 -360 -6093 -11063 -14837 -17140 -17847 -16966 -14693 -11349 -7256
742 -7256 -2914 1287 4935 7725 9480 10035 9473 7910 5593 2865 18 -2631 -4667 -6008 -6442 -5949
758 -5949 -4618 -2608 -129 2542 5011 7062 8463 8971 8542 7176 5011 2258 -882 -4020 -6875 -9219
774 -9219 -10739 -11317 -10885 -9497 -7274 -4498 -1409 1748 4574 6872 8444 9172 9006 8009 6362 4292
790 4292 2049 -155 -2054 -3436 -4159 -4196 -3631 -2541 -1069 551 2081 3271 3944 3961 3307 2023 123
807 123 -2114 -4461 -6673 -8510 -9698 -10034 -9420 -7829 -5332 -2140 1559 5388 9053 12193 14472 15632
823 15632 15550 14158 11524 7852 3437 -1356 -6114 -10468 -13982 -16381 -17438 -17036 -15256 -12268 -8294 -3772
$$ packed form
710D976n826o007n697m823l493j823L1J930L694N159O165O684O597O003M865L285
726B1720J495m25k261l867n112n858o052n733m970l774k303p07Q81K273L344M093
742g256M342M201L648K790J755N55n62j563k317k728k847k649k036j341m34M93
758e949J331K010K479K671K469K051J401N08m29j366k165k753l140l138k855k344
774i219j520n78M32J388K223K776L089L157K826K298J572P28j66r97j647k070
790D292k243k204j899j382p23l7N65J090J472J620J530J190O73J7o54j284j900
807A23k237k347k212j837j188l36O14J591K497L192L699L829L665L140K279J160
823A5632q2j392k634l672m415m793m758m354l514k399j057M02J780K988L974M522
$$ plain form
839 -3772 964 5449 9322 12293 14058 14557 13739 11810 8917 5402 1651 -2045 -5273 -7794 -9420 -9985
855 -9985 -9481 -8015 -5800 -3073 -153 2698 5089 6863 7809 7827 6940 5233 2909 197 -2643 -5214
871 -5214 -7345 -8762 -9302 -8902 -7579 -5478 -2801 230 3319 6108 8407 9956 10604 10302 9089 7071
887 7071 4477 1570 -1441 -4188 -6471 -8131 -9001 -9041 -8265 -6826 -4875 -2688 -403 1737 3499 4708
903 4708 5334 5349 4771 3738 2402 911 -566 -1792 -2651 -3039 -2916 -2299 -1275 45 1470 2822 3921
920 3921 4563 4731 4310 3351 1898 41 -2022 -4016 -5764 -7095 -7817 -7832 -7100 -5647 -3627 -1201 1478
937 1478 4054 6315 8084 9142 9407 8808 7429 5384 2892 163 -2598 -4998 -6962 -8249 -8765 -8439
953 -8439 -7345 -5593 -3387 -934 1590 3837 5643 6878 7374 7133 6152 4578 2590 347 -1927 -3931
$$ packed form
839c772M736M485L873K971J765M99q18j929k893l515l751l696l228k521j626n65
855i985N04J466K215K727K920K851K391J774R46J8q87j707k324k712k840k571
871e214k131j417n40M00J323K101K677L031L089K789K299J549O48l02j213k018
887G071k594k907l011k747k283j660q70m0P76J439J951K187K285K140J762J209
903D708O26J5n78j033j336j491j477j226q59l88J23O17J024J320J425J352J099
920C921O42J68m21r59j453j857k063j994j748j331p22j5P32J453K020K426K679
937A478K576K261J769J058K65n99j379k045k492k729k761k400j964j287n16L26
953h439J094J752K206K453K524K247J806J235M96k41r81j574j988k243k274k004
$$ plain form
969 -3931 -5498 -6508 -6807 -6394 -5289 -3641 -1611 661 2874 4757 6172 6995 7087 6449 5154 3346 1200
986 1200 -1142 -3337 -5184 -6547 -7250 -7247 -6528 -5183 -3355 -1225 1045 3154 4886 6133 6781 6734 6047
1003 6047 4754 3051 1076 -997 -2907 -4449 -5549 -6058 -5941 -5211 -3966 -2368 -493 1414 3161 4516
1019 4516 5422 5762 5496 4649 3329 1675 -205 -2076 -3692 -4919 -5671 -5818 -5368 -4343 -2908 -1154 757
1036 757 2585 4120 5208 5781 5762 5148 4000 2468 680 -1198 -2935 -4327 -5271 -5699 -5530 -4794 -3572
1053 -3572 -2012 -198 1617 3271 4552 5414 5739 5481 4665 3390 1799 -25 -1865 -3509 -4785 -5649
1069 -5649 -5952 -5692 -4860 -3571 -1972 -127 1728 3397 4687 5548 5877 5645 4865 3630 2107 358 -1358
1086 -1358 -2895 -4099 -4837 -5079 -4833 -4085 -2998 -1638 -142 1290 2517 3405 3886 3936 3519 2734 1648
$$ packed form
969c931j567j010k99M13J105J648K030K272K213J883J415Q23R2o38j295j808k146
986A200k342k195j847j363p03LP19J345J828K130K270K109J732J247O48m7o87
1003F047j293j703j975k073j910j542j100n09J17P30J245J598J875J907J747J355
1019D516R06L40k66q47j320j654j880j871j616j227p52j47M50J025J435J754J911
1036G57J828J535J088N73j9o14j148j532j788j878j737j392r44m28J69P36J222
1053c572J560J814J815J654J281Q62L25k58q16j275j591j824j840j644j276q64
1069e649l03K60Q32J289J599J845J855J669J290Q61L29k32p80j235j523j749j716
1086a358j537j204p38k42K46P48J087J360J496J432J227Q88M81N0m17p85j086
$$ plain form
1103 1648 415 -859 -1981 -2860 -3392 -3526 -3240 -2563 -1560 -333 968 2193 3235 3951 4230 4099 3544
1120 3544 2589 1310 -178 -1703 -3114 -4240 -5020 -5324 -5125 -4427 -3307 -1843 -152 1576 3162 4436
1136 4436 5311 5689 5537 4855 3723 2286 602 -1114 -2681 -3936 -4773 -5137 -5011 -4360 -3326 -1978 -443
1153 -443 1105 2495 3590 4261 4478 4235 3536 2493 1161 -304 -1741 -2988 -3935 -4441 -4533 -4150 -3331 -2151
1171 -2151 -696 854 2358 3669 4607 5140 5194 4742 3818 2546 1002 -692 -2329 -3716 -4752 -5389 -5507
1188 -5507 -5125 -4280 -3069 -1600 18 1591 2972 4018 4640 4842 4580 3906 2923 1703 357 -927 -2057
1205 -2057 -2905 -3415 -3553 -3319 -2743 -1917 -929 102 1078 1860 2399 2613 2532 2117 1458 613 -331 -1238 -2008 -2572
1225 -2572 -2837 -2786 -2384 -1703 -801 264 1342 2324 3097 3588 3716 3475 2869 1960 816 -430 -1665 -2767
$$ packed form
1103A648j233j274j122q79n32j34K86O77J003J227J301J225J042P16K79j31n55
1120C544r55j279j488j525j411j126p80l04J99O98J120J464J691J728J586J274
1136D436Q75L78j52o82j132j437j684j716j567j255q37l64J26O51J034J348J535
1153d43J548J390J095O71K17k43o99j043j332j465j437j247r47n06r2L83Q19J180
1171b151J455J550J504J311R38N33N4m52r24j272j544j694j637j387j036o37j18
1188e507L82Q45J211J469J618J573J381J046O22K02k62o74r83j220j346j284j130
1205b057q48n10j38K34N76Q26R88J031R76P82N39K14q1m15o59q45r44r07p70n64
1225b572k65N1M02O81R02J065J078R82P73M91J28k41o06r09j144j246j235j102
$$ plain form
1243 -2767 -3629 -4105 -4198 -3912 -3270 -2325 -1124 178 1461 2565 3428 3935 4070 3801 3196 2277 1144 -69
1261 -69 -1268 -2294 -3073 -3547 -3636 -3377 -2772 -1884 -817 335 1444 2396 3079 3467 3480 3118 2438 1494 364
1280 364 -797 -1896 -2813 -3455 -3739 -3663 -3202 -2405 -1363 -165 1080 2206 3117 3729 3984 3857 3344 2517
1298 2517 1451 241 -995 -2099 -3001 -3619 -3866 -3756 -3296 -2519 -1532 -402 727 1751 2589 3159 3397
1315 3397 3314 2904 2239 1368 386 -608 -1496 -2217 -2684 -2845 -2712 -2300 -1652 -851 41 903 1634 2187 2470 2466 2172
1336 2172 1629 904 44 -813 -1586 -2192 -2551 -2615 -2398 -1911 -1177 -287 670 1577 2324 2861 3130 3068 2702 2041
1356 2041 1167 152 -924 -1914 -2751 -3324 -3602 -3550 -3156 -2463 -1551 -473 655 1734 2650 3313 3694 3729 3428
1375 3428 2815 1942 901 -218 -1300 -2220 -2938 -3366 -3466 -3231 -2692 -1911 -957 64 1048 1900 2524 2872
$$ packed form
1243b767q62m76r3K86O42R45J201J302J283J104Q63N07J35k69o05r19j133j213
1261f9j199j026p79m74q9K59O05Q88J067J152J109R52O83L88J3l62o80r44j130
1280C64j161j099r17o42k84P6M61P97J042J198J245J126R11O12K55j27n13q27
1298B517j066j210j236j104r02o18k47J10M60P77R87J130J129J024Q38N70K38
1315C397q3m10o65q71r82r94q88p21m67j61J33M12O48Q01Q92Q62P31N53K83mk94
1336B172n43p25q60q57p73o06l59o4K17M87P34Q90R57R07P47N37K69o2l66o61
1356B041q74j015j076r90q37n73k78N2L94O93R12J078J128J079R16O63L81L5l01
1375C428o13q73j041j119j082r20p18m28j00K35N39P81R54J021R84Q52O24L48
$$ plain form
1393 2872 2935 2674 2154 1417 566 -340 -1189 -1880 -2344 -2555 -2494 -2153 -1578 -843 -12 828 1558 2137 2493 2576 2423
1414 2423 2006 1385 620 -236 -1072 -1776 -2347 -2679 -2756 -2582 -2154 -1531 -753 77 913 1625 2199 2539 2629 2485
1434 2485 2076 1521 815 54 -675 -1307 -1758 -2019 -2038 -1841 -1445 -911 -303 324 881 1301 1540 1580 1415 1061
1454 1061 555 -37 -639 -1192 -1618 -1869 -1908 -1728 -1341 -777 -75 678 1400 2041 2514 2754 2757 2491 1987 1276 403
1475 403 -528 -1456 -2260 -2897 -3294 -3395 -3215 -2750 -2016 -1114 -96 930 1866 2625 3163 3400 3332 2975 2339 1513
1495 1513 577 -396 -1300 -2040 -2565 -2813 -2796 -2496 -1975 -1281 -481 348 1097 1710 2110 2280 2204 1892 1389 744
1515 744 18 -705 -1339 -1837 -2133 -2209 -2059 -1682 -1121 -436 321 1053 1691 2178 2471 2519 2329 1925 1330 616 -166
1536 -166 -950 -1614 -2132 -2452 -2544 -2407 -2054 -1513 -879 -166 543 1151 1613 1925 2006 1901 1634 1215 708 158 -344
$$ packed form
1393B872O3k61n20p37q51r06q49o91m64k11O1L41N75P35Q31Q40P30N79L56Q3j53
1414B423m17o21p65q56q36p04n71l32p7J74M28O23P78Q30Q36P12N74L40R0j44
1434B485m09n55p06p61p29o32m51k61j9J97L96N34O08O27N57M20K39M0j65l54
1454A061n06n92o02n53m26k51l9J80L87N64P02P53P22O41M73K40Lk66n04p11q73
1475D03r31r28q04o37l97j01J80M65P34R02J018J026R36P59N38K37o8l57o36q26
1495A513r36r73r04p40n25k48J7L00N21O94Q00Q29P49O13M00J70p6l12n03o45
1515G44p26p23o34m98k96p6J50L77N61O85P57P32O38M87K93M8j90m04n95p14p82
1536a66p84o64n18l20r2J37L53N41O34P13P09O08M62L12Q1j05k67m19n07n50n02
$$ plain form
1557 -344 -783 -1062 -1226 -1205 -1039 -771 -408 15 417 742 966 1062 1018 819 490 88 -384 -828 -1219 -1511 -1645
1578 -1645 -1630 -1429 -1076 -578 8 638 1231 1738 2110 2300 2274 2041 1611 1022 322 -414 -1134 -1751 -2197 -2448
1598 -2448 -2473 -2278 -1869 -1293 -600 137 854 1451 1924 2193 2236 2079 1720 1207 573 -90 -726 -1267 -1667 -1899
1618 -1899 -1914 -1731 -1378 -892 -305 310 895 1384 1727 1890 1859 1646 1251 719 109 -538 -1125 -1618 -1952 -2086
1638 -2086 -2030 -1778 -1340 -777 -116 559 1169 1677 2039 2182 2132 1876 1444 894 269 -379 -977 -1444 -1786 -1930
1658 -1930 -1897 -1677 -1323 -844 -280 274 762 1162 1426 1531 1482 1281 959 542 79 -384 -786 -1078 -1254 -1276 -1164
1679 -1164 -915 -560 -141 308 720 1063 1290 1378 1324 1118 783 355 -121 -590 -1024 -1339 -1526 -1555 -1439 -1163 -758
1700 -758 -281 241 749 1164 1476 1635 1641 1483 1183 765 265 -270 -758 -1155 -1447 -1605 -1581 -1418 -1119 -704 -232
$$ packed form
1557c44m39k79j64K1J66K68L63M23M02L25K24R6m4j99l29m02m72m44l91k92j34
1578a645J5K01L53M98N86O30N93N07L72J90k6k33m30n89p00p36p20o17m46k51
1598b448k5J95M09N76O93P37P17N97M73K69M3j57l59n13o34o63o36n41m00k32
1618a899j5J83L53M86N87O15N85M89L43J63l1k13l95n32o10o47n87m93l34j34
1638b086N6K52M38N63O61O75O10N08L62J43n0k56m32n50o25o48n98m67l42j44
1658a930L3K20L54M79N64N54M88M00K64J05m9k01l22m17m63m63m02k92j76k2J12
1679a164K49L55M19M49M12L43K27Q8n4k06l35m28m76m69m34l15j87k9J16K76M05
1700g58M77N22N08M15L12J59Oj58l00m18n00n35m88l97k92j58K4J63K99M15M72
$$ plain form
1721 -232 270 733 1136 1401 1543 1533 1362 1070 655 196 -287 -745 -1109 -1365 -1495 -1454 -1277 -967 -556 -98 381
1742 381 808 1157 1375 1451 1386 1165 837 409 -57 -513 -908 -1195 -1365 -1394 -1282 -1021 -657 -233 217 642 1001
1763 1001 1249 1361 1349 1185 902 530 102 -333 -745 -1059 -1281 -1380 -1336 -1153 -849 -475 -32 411 812 1142 1355
1784 1355 1432 1371 1172 859 462 15 -455 -857 -1167 -1379 -1443 -1352 -1145 -810 -397 50 505 881 1180 1347 1375
1805 1375 1254 1033 675 256 -185 -582 -932 -1177 -1295 -1289 -1130 -866 -517 -106 323 713 1019 1255 1343 1302 1132
1826 1132 850 476 41 -388 -781 -1111 -1341 -1436 -1396 -1236 -952 -569 -140 309 720 1075 1306 1412 1395 1240 981
1847 981 624 215 -210 -594 -918 -1117 -1228 -1188 -1044 -807 -486 -137 210 528 766 908 954 881 731 492 209
1868 209 -87 -366 -606 -768 -835 -813 -687 -489 -223 75 353 612 809 927 949 871 684 446 132 -202 -526
$$ packed form
1721b32N02M63M03K65J42j0j71k92m15m59m83m58l64k56j30M1J77L10M11M58M79
1742C81M27L49K18P6o5k21l28m28m66m56l95k87j70k9J12K61L64M24M50M25L59
1763A001K48J12j2j64k83l72m28m35m12l14k22r9M4J83L04L74M43M43M01L30K13
1784A355P7o1j99l13l97m47m70m02l10k12o4R1K07L35M13M47M55L76K99J67K8
1805A375j21k21l58m19m41l97l50k45j18OJ59K64L49M11M29L90L06K36Q8m1j70
1826A132k82l74m35m29l93l30k30r5M0J60K84L83M29M49M11L55K31J06j7j55k59
1847I81l57m09m25l84l24j99j11M0J44K37L21L49L47L18K38J42M6p3j50k39k83
1868B09k96k79k40j62o7K2J26J98K66K98K78K59J97J18K2p8j87k38l14l34l24
$$ plain form
1889 -526 -806 -1010 -1116 -1120 -1015 -803 -489 -140 236 590 873 1091 1204 1199 1076 841 529 167 -201 -552 -836
1910 -836 -1039 -1123 -1095 -970 -738 -442 -87 253 564 816 975 1035 971 826 584 279 -65 -380 -678 -903 -1029
1931 -1029 -1066 -993 -805 -529 -194 166 520 825 1065 1208 1235 1132 934 632 266 -121 -507 -849 -1126 -1284 -1318
1952 -1318 -1238 -1049 -760 -400 -11 366 715 975 1137 1197 1132 987 740 431 108 -221 -511 -728 -879 -924 -876
1973 -876 -744 -535 -292 -25 216 460 609 699 704 634 486 291 59 -172 -377 -558 -656 -680 -620 -504 -305 -71
1995 -71 180 428 628 755 831 802 691 507 266 -22 -304 -577 -784 -917 -969 -911 -779 -568 -283 3 309 587
2017 587 796 927 964 932 787 574 306 22 -264 -521 -710 -837 -877 -825 -696 -493 -238 37 304 533 711
2038 711 815 824 756 602 384 114 -166 -443 -671 -839 -922 -896 -798 -609 -351 -49 269 554 796 952 1028 1001 893
$$ packed form
1889e26k80k04j06mJ05K12L14L49L76L54K83K18J13nj23k35l12l62l68l51k84
1910h36k03q4K8J25K32K96L55L40L11K52J59O0o4j45k42l05l44l15k98k25j26
1931a029l7P3J88K76L35L60L54L05K40J43K7j03j98l02l66l87l86l42k77j58l4
1952a318Q0J89K89L60L89L77L49K60J62O0o5j45k47l09l23l29k90k17j51m5M8
1973h76J32K09K43K67K41K44J49R0Np0j48j95k32k31k05j81r8k4O0J16J99K34
1995g1K51K48K00J27P6k9j11j84k41k88k82k73k07j33n2N8J32K11K85K86L06K78
2017E87K09J31L7l2j45k13k68k84k86k57j89j27m0N2J29K03K55K75K67K29J78
2038G11J04Ro8j54k18k70k80k77k28j68q3K6R8J89K58L02L18K85K42J56P6k7j08
$$ plain form
2061 893 689 411 98 -227 -523 -761 -942 -1044 -1026 -924 -734 -492 -198 110 380 622 794 889 902 831 678
2082 678 481 239 -20 -261 -468 -618 -705 -709 -639 -519 -327 -124 85 280 441 542 565 535 435 291 96 -93
2104 -93 -284 -431 -547 -573 -554 -445 -309 -108 101 301 503 628 701 710 644 505 321 92 -147 -370 -576 -721
2126 -721 -791 -793 -726 -593 -402 -158 87 320 529 672 770 791 714 584 403 187 -53 -285 -482 -624 -702 -705 -630 -484
2150 -484 -298 -69 156 371 544 667 710 680 577 397 193 -65 -312 -522 -677 -783 -805 -743 -610 -405 -175
2171 -175 78 343 572 753 866 892 839 710 510 283 14 -248 -491 -677 -808 -855 -832 -739 -584 -364 -132 117
2193 117 359 538 679 728 721 644 514 333 123 -70 -267 -410 -509 -558 -526 -437 -306 -145 31 174 309 410 449
2216 449 427 363 247 104 -53 -206 -350 -454 -510 -504 -454 -350 -195 -14 161 345 472 569 621 612 526 421 253 61
$$ packed form
2061H93k04k78l13l25k96k38j81j02J8J02J90K42K94L08K70K42J72R5J3p1j53
2082F78j97k42k59k41k07j50q7mP0J20J92K03K09J95J61J01K3l0j00j44j95j89
2104i3j91j47j16k6J9J09J36K01K09K00K02J25P3Ro6j39j84k29k39k23k06j45
2126g21p0kO7J33J91K44K45K33K09J43R8K1p7j30j81k16k40k32j97j42p8lP5J46
2150d84J86K29K25K15J73J23M3l0j03j80k04k58k47k10j55j06k2O2J33K05K30
2171a75K53K65K29J81J13K6n3j29k00k27k69k62k43j86j31m7K3R3J55K20K32K49
2193A17K42J79J41M9pp7j30j81k10j93j97j43r9m9L2Q9J31J61J76J43J35J01L9
2216D49k2o4j16j43j57j53j44j04n6ON0J04J55J81J75J84J27R7N2rq6j05j68j92
$$ plain form
2240 61 -125 -322 -466 -585 -631 -627 -568 -434 -281 -85 106 290 430 530 567 547 467 337 173 -10 -198 -354 -471
2263 -471 -544 -549 -491 -374 -224 -30 160 347 493 595 640 613 522 389 208 -1 -205 -420 -573 -685 -736 -708 -627
2286 -627 -480 -286 -70 150 367 558 685 750 767 686 560 382 156 -51 -282 -468 -615 -688 -697 -644 -523 -367
2308 -367 -167 29 227 390 510 570 562 518 407 254 80 -82 -256 -370 -453 -492 -471 -389 -279 -145 41 180 311
2331 311 433 487 492 445 353 230 82 -84 -257 -384 -493 -533 -535 -484 -379 -258 -72 72 240 379 471 534 530 472 366
2356 366 226 86 -75 -217 -346 -414 -463 -426 -365 -259 -130 20 158 275 373 404 399 350 262 139 3 -147 -280
2379 -280 -376 -440 -473 -432 -353 -247 -111 54 203 343 468 520 541 517 437 320 153 -12 -181 -345 -465 -538 -564 -546
2403 -546 -449 -341 -173 -4 177 328 455 524 538 505 417 292 136 -25 -188 -332 -444 -503 -493 -446 -356 -221 -69
$$ packed form
2240F1j86j97j44j19m6MN9J34J53J96J91J84J40J00L7k0q0j30j64j83j88j56j17
2263d71p3nN8J17J50J94J90J87J46J02M5k7r1j33j81k09k04k15j53j12n1K8Q1
2286f27J47J94K16K20K17J91J27O5J7q1j26j78k26k07k31j86j47p3rN3J21J56
2308c67K00J96J98J63J20O0qm4j11j53j74j62j74j14q3l9K1Q2J10J34J86J39J31
2331C11J22N4Nm7r2j23j48j66j73j27j09m0kN1J05J21J86J44J68J39R2O3mn8j06
2356C66j40j40j61j42j29o8m9L7O1J06J29J50J38J17R8L1nm9q8j23j36j50j33
2379b80r6o4l3M1P9J06J36J65J49J40J25N2K1k4q0j17j67j65j69j64j20p3k6J8
2403e46R7J08J68J69J81J51J27O9J4l3q8j25j56j61j63j44j12n9J0M7R0J35J52
$$ plain form
2426 -69 96 248 375 462 502 492 433 326 188 36 -121 -276 -399 -487 -540 -520 -449 -356 -200 -34 132 290 426
2449 426 518 551 543 494 378 240 80 -75 -244 -387 -478 -523 -516 -458 -350 -213 -69 75 223 337 402 436 407 344 247
2474 247 137 -4 -124 -233 -317 -383 -368 -328 -247 -148 -25 99 205 307 369 399 387 339 256 133 0 -133 -244 -349
2498 -349 -423 -448 -427 -371 -276 -150 -23 114 235 340 405 433 403 341 252 122 -4 -122 -238 -322 -351 -365 -335 -243 -147
2523 -147 -30 85 184 287 337 349 322 272 176 73 -46 -159 -277 -355 -394 -391 -353 -274 -173 -49 90 206 332 411
2547 411 458 458 433 333 217 66 -77 -220 -343 -433 -506 -497 -460 -379 -252 -119 40 198 316 414 471 470 453 374 247
2572 247 112 -14 -164 -269 -360 -406 -403 -371 -281 -190 -58 64 165 288 353 374 376 322 238 128 2 -110 -240 -327 -384
2597 -384 -410 -408 -344 -230 -129 13 128 262 350 419 445 426 371 288 162 38 -101 -222 -302 -380 -400 -390 -346 -256 -150
$$ packed form
2426f9J65J52J27Q7M0j0n9j07j38j52j57j55j23q8n3K0P1R3J56J66J66J58J36
2449D26R2L3qm9j16j38j60j55j69j43r1m5PN8J08J37J44J44J48J14O5L4k9o3r7
2474B47j10j41j20j09q4o6J5M0Q1R9J23J24J06J02O2L0j2m8q3j23j33j33j11j05
2498c49p4k5K1N6R5J26J27J37J21J05O5K8l0o2q9j30j26j18j16q4k9j4L0R2R6
2523a47J17J15R9J03N0J2k7n0r6j03j19j13j18p8l9LL8P9J01J24J39J16J26P9
2547D11M7%k5j00j16j51j43j43j23r0p3RL7Q1J27J33J59J58J18R8N7jj7p9j27
2572B47j35j26j50j05r1m6LL2R0R1J32J22J01J23O5K1Kn4q4j10j26j12j30q7n7
2597c84k6KO4J14J01J42J15J34Q8O9K6j9n5q3j26j24j39j21q0p8k0J0M4R0J06
$$ plain form
2622 -150 -33 67 164 254 307 310 289 242 156 72 -19 -108 -177 -225 -248 -239 -190 -150 -67 21 116 196 249 290 276 245 188 100 11 -95
2652 -95 -195 -276 -329 -351 -339 -294 -213 -114 2 128 246 331 395 416 397 337 258 138 19 -107 -239 -331 -395 -418 -410 -355 -275
2679 -275 -161 -31 80 200 288 345 360 354 312 238 130 12 -99 -196 -276 -326 -337 -324 -258 -165 -67 41 149 246 330 373
2705 373 381 346 266 177 61 -67 -192 -286 -386 -407 -430 -395 -308 -220 -87 45 162 268 352 403 411 383 324 224 124 4
2731 4 -109 -204 -274 -314 -331 -317 -260 -176 -92 -5 89 158 218 250 243 232 175 96 21 -59 -122 -187 -214 -223 -210 -171 -107 -30 59 135 199
2762 199 244 258 253 202 146 70 -20 -123 -208 -262 -307 -313 -301 -236 -153 -54 48 145 233 304 329 345 308 255 180 83 -18 -118 -201
2791 -201 -270 -310 -326 -297 -245 -175 -78 13 109 190 248 276 281 253 202 117 13 -73 -152 -234 -294 -317 -299 -251 -178 -77 13 126 217
2820 217 300 357 370 351 298 207 100 -15 -136 -233 -310 -368 -394 -376 -335 -249 -164 -47 64 164 254 321 341 354 307 249 159
$$ packed form
2622a50J17J00R7R0N3Lk1m7q6q4r1q9o9m8k3RM9M0Q3Q8R5Q0N3M1j4l1n7q8q9j06
2652i5j00q1n3k2J2M5Q1R9J16J26J18Q5O4K1j9o0p9j20j19j26j32r2o4k3QN5Q0
2679b75J14J30J11J20Q8N7J5om2p4j08j18j11r7q0n0j1J3O6R3R8J08J08R7Q4M3
2705C73Ql5q0q9j16j28j25r4j00k1k3L5Q7Q8J33J32J17J06Q4N1Qk8n9j00j00j20
2731Dj13r5p0m0j7J4N7Q4Q4Q7R4O9O0L2pj1n7p9p5q0o3o5k7rJ3L9O4P7Q9P6O4
2762A99M5J4nn1n6p6r0j03q5n4m5oJ2O5Q3R9J02R7Q8P1K5J6l7n3p5r7j01j00q3
2791b01o9m0j6K9N2P0R7R1R6Q1N8K8Nk8n1q5j04q6p9q2o0k3J8M8P3J01R0J13R1
2820B17Q3N7J3j9n3r1j07j15j21r7p7n8k6J8M1Q6Q5J17J11J00R0O7K0J3m7n8r0
$$ plain form
2847 159 64 -23 -125 -188 -251 -283 -285 -239 -191 -117 -48 38 125 176 214 220 211 178 110 45 -19 -105 -151 -197 -224 -215 -172 -122 -51 19 94
2878 94 154 209 242 240 217 163 109 20 -51 -124 -196 -250 -266 -277 -245 -196 -122 -48 43 112 182 244 263 273 241 206 127 49 -36 -115 -166
2909 -166 -214 -233 -244 -214 -157 -84 -7 66 136 195 226 231 215 184 97 30 -67 -139 -208 -264 -293 -280 -254 -185 -114 -28 57 163 235 289
2939 289 324 312 294 238 153 55 -29 -119 -212 -262 -305 -310 -293 -244 -175 -94 4 87 172 234 264 287 272 243 156 84 0 -83 -156 -203
2969 -203 -227 -234 -221 -170 -113 -43 27 91 159 187 213 198 178 124 57 -11 -66 -126 -179 -198 -204 -192 -150 -98 -27 30 95 158 196 226 223
3000 223 209 145 101 28 -34 -113 -168 -207 -235 -241 -212 -179 -107 -47 26 97 157 192 209 205 170 132 74 6 -56 -109 -156 -179 -181 -175 -123 -83
3032 -83 -5 58 101 161 188 202 198 172 115 65 -8 -84 -147 -196 -236 -256 -242 -205 -157 -95 -16 56 132 181 227 254 243 219 170 99 40
3063 40 -50 -116 -181 -216 -241 -232 -214 -160 -102 -23 49 122 172 202 217 210 176 131 79 -2 -72 -124 -176 -199 -208 -196 -161 -105 -46 22 70 125
$$ packed form
2847A59r5q7j02o3o3l2kM6M8P4O9Q6Q7N1L8Orl3o8o5o4q6m6m6k7RM3N0P1P0P5
2878I4O0N5L3kk3n4n4q9p1p3p2n4j6j1L2M9P4P4R1O9P0O2J9J0l2l5p9p8q5p9n1
2909a66m8j9j1L0N7P3P7P3P0N9L1Nj6l1q7o7r7p2o9n6k9J3K6O9P1Q6Q5J06P2N4
2939B89L5j2j8n6q5r8q4r0r3n0m3nJ7M9O9Q1R8Q3Q5O2L0K3j5k9q7p2q4q3p3m7
2969b03k4pJ3N1N7P0P0O4O8K8K6j5k0n4o7o8n5o0n3j9oJ2M2N2P1N7O5O3L8L0l
3000B23j4o4m4p3o2p9n5l9k8oK9L3P2O0P3P1O0L5J7ml5l8n8o8o2n3m7k3kON2M0
3032h3P8O3M3O0K7J4mk6n7n0p3p6o3m9m0k0J4L7M8O2P9P2P6M9M6K7j1k4m9p1n9
3063D0r0o6o5l5k5RJ8N4N8P9P2P3N0L0J5pl4m5n2q1p0n2n2k3rJ2L5N6N9O8M8N5
$$ plain form
3095 125 167 176 185 162 130 84 28 -36 -103 -140 -174 -189 -194 -177 -127 -91 -23 47 104 160 189 210 204 168 133 81 15 -41 -95 -147 -184 -197
3127 -197 -177 -158 -123 -52 -1 60 104 139 156 146 142 117 74 18 -36 -80 -133 -161 -171 -155 -144 -97 -44 -2 55 113 158 176 186 192 152
3158 152 118 70 8 -51 -114 -147 -180 -191 -177 -156 -122 -60 2 56 112 152 179 184 172 147 101 48 -7 -69 -122 -164 -188 -174 -159 -128
3188 -128 -84 -19 30 86 135 167 186 171 151 124 81 13 -36 -91 -126 -154 -165 -164 -144 -108 -57 -10 37 93 141 157 161 164 130 94 49
3219 49 5 -56 -109 -145 -169 -183 -162 -140 -99 -49 9 59 111 154 172 167 151 123 84 39 -29 -67 -116 -147 -145 -145 -128 -97 -60 -9 31 89
3251 89 115 140 159 149 119 81 45 -9 -49 -99 -134 -162 -176 -162 -139 -99 -55 -4 49 94 137 156 162 155 123 90 38 -14 -61 -102 -126
3282 -126 -153 -137 -132 -103 -63 -18 24 64 102 125 141 134 126 90 54 0 -44 -96 -117 -145 -159 -146 -123 -104 -49 -5 42 80 117 135 145
3313 145 148 118 92 45 -9 -53 -82 -124 -146 -137 -127 -100 -68 -22 23 69 102 138 146 151 140 100 64 11 -27 -86 -109 -135 -154 -153 -131 -95
$$ packed form
3095A25M2RRk3l2m6n6o4o7l7l4j5nJ7N0L6O8P0N7N6K9K1ol6l5n2o6n6n4n2l7j3
3127a97K0J9L5P1N1O1M4L5J7j0mk5m3n6n4m4n3k8j0J6J1M7N3M2N7N8M5J8J0Om0
3158A52l4m8o2n9o3l3l3j1J4K1L4O2O2N4N6M0K7Nj2k5m6n3n5o2n3m2k4J4J5L1
3188a28M4O5M9N6M9L2J9j5k0k7m3o8m9n5l5k8j1JK0L6N1M7M7N6M8J6MLl4l6m5
3219D9m4o1n3l6k4j4K1K2M1N0N8N0N2M3J8nj6k8l9m5o8l8m9l1K%J7L1L7N1M0N8
3251H9K6K5J9j0l0l8l6n4m0n0l5k8j4J4K3M0M4N1N3M5M3J9Opl2l3n2n2m7m1k4
3282a26k7J6NK9M0M5M2M0L8K3J6pql6l6n4m4n2k1k8j4J3K3J9N5M4M7L8L7J8J0
3313A45Ll0k6m7n4m4k9m2k2RJ0K7L2M6M5M6L3L6QNj1m0l6n3l8n9k3k6j9JK2L6
$$ plain form
3345 -95 -48 -12 29 73 101 129 136 124 114 82 41 -7 -35 -89 -112 -149 -129 -143 -100 -69 -28 15 60 95 129 144 138 136 102 72 30 -10
3377 -10 -60 -101 -117 -133 -138 -130 -112 -69 -33 6 57 86 106 116 108 104 77 50 9 -35 -61 -99 -127 -125 -116 -95 -63 -26 17 43 83 114 132
3410 132 143 122 106 64 32 -20 -51 -89 -124 -126 -130 -128 -97 -63 -30 7 54 84 113 136 115 110 80 47 5 -20 -71 -107 -118 -126 -119 -94 -70
3443 -70 -33 -3 45 73 110 127 126 114 103 70 31 -4 -41 -72 -105 -109 -120 -107 -87 -50 -31 15 53 90 104 103 118 102 72 42 19 -23
3475 -23 -64 -81 -111 -128 -117 -111 -91 -57 -5 25 67 96 108 130 124 102 77 38 5 -19 -60 -92 -107 -120 -116 -93 -64 -40 5 38 53 89
3507 89 104 111 95 84 57 19 -9 -52 -70 -104 -117 -109 -115 -91 -46 -17 20 46 75 110 114 109 99 64 36 10 -23 -54 -88 -96 -98 -99 -86 -55
3541 -55 -32 3 42 54 91 104 106 97 76 42 15 -26 -51 -82 -103 -111 -114 -97 -86 -54 -21 17 43 73 95 98 108 96 75 47 13 -8 -53
3574 -53 -79 -93 -101 -94 -83 -61 -41 0 43 57 89 107 106 95 75 45 16 -20 -53 -86 -101 -113 -125 -110 -86 -55 -25 7 38 64 84 112
$$ packed form
3345i5M7L6M1M4K8K8Pj2j0l2m1m8k8n4k3l7K0j4M3L1M1M3M5L5L4J5okl4l0m2m0
3377a0n0m1j6j6nQJ8M3L6L9N1K9K0J0qmk7k7m1m4k6l8k8KRK1L2L7M3K6M0L1J8
3410A32J1k1j6m2l2n2l1l8l5kmKL1L4L3L7M7L0K9K3k1nl0l3m2k5n1l6j1qPK5K4
3443g0L7L0M8K8L7J7jj2j1l3l9l5l7l1l3mj1J3K0L7J9M6L8L7J4jJ5j6l0l0k3m2
3475b3m1j7l0j7J1OK0L4N2L0M2K9J2K2ok2k5l9l3k4m1l2j5j3MK3K9K4M5L3J5L6
3507H9J5Pj6j1k7l8k8m3j8l4j3QoK4M5K9L7K6K9L5Mnj0l5k8k6l3l1l4qkjJ3L1
3541e5K3L5L9J2L7J3Krk1l4k7m1k5l1k1qlJ7J1L2L3L8K6L0K2LJ0j2k1k8l4k1m5
3574e3k6j4qPJ1K2K0M1M3J4L2J8jj1k0l0k9l6l3l3j5j2j2J5K4L1L0L2L1K6K0K8
$$ plain form
3606 112 100 102 85 59 23 -8 -39 -61 -91 -97 -96 -102 -70 -47 -12 11 50 77 90 97 101 90 65 29 4 -24 -62 -84 -98 -111 -104 -83 -69
3639 -69 -30 0 24 50 68 86 99 72 65 53 18 -11 -36 -62 -80 -100 -79 -79 -60 -45 -5 13 41 76 90 92 101 74 73 39 19 -30 -58
3672 -58 -80 -107 -97 -94 -85 -57 -29 -9 23 44 72 88 82 82 64 47 26 -18 -41 -52 -80 -79 -81 -89 -49 -32 1 31 46 67 94 95 95 79 58
3707 58 44 12 -19 -52 -72 -79 -91 -91 -83 -66 -46 -10 21 41 65 73 90 87 76 53 20 -4 -42 -67 -75 -98 -97 -90 -79 -52 -12 9 44 65
3741 65 80 99 87 94 59 44 24 -12 -35 -63 -75 -77 -87 -73 -59 -29 -12 13 34 62 59 73 66 56 48 17 -1 -39 -71 -74 -89 -95 -83 -76
3775 -76 -53 -29 13 23 48 77 94 93 93 80 53 24 5 -23 -53 -68 -75 -75 -73 -61 -25 3 17 32 56 81 83 68 70 52 23 -9 -35 -48
3809 -48 -67 -94 -84 -89 -61 -49 -35 -1 19 43 77 89 86 64 70 48 37 10 -27 -50 -70 -81 -85 -73 -65 -51 -26 3 31 48 70 71 75 70
3843 70 51 39 3 -19 -44 -68 -93 -90 -89 -77 -61 -33 2 27 36 61 71 80 62 63 49 14 2 -22 -42 -60 -65 -67 -67 -55 -37 -15 9 34
$$ packed form
3606A12j2Kj7k6l6l1l1k2l0oJoL2K3L5K3L9K7J3PMj1k5l6k5k8l8k2j4j3PK1J4
3639f9L9L0K4K6J8J8J3k7pj2l5k9k5k6j8k0K1%J9J5M0J8K8L5J4KRk7jl4k0m9k8
3672e8k2k7J0LRK8K8K0L2K1K8J6o%j8j7k1m4k3j1k8JkqM0J7L3L0J5K1K7J%j6k1
3707E8j4l2l1l3k0pj2%QJ7K0L6L1K0K4QJ7lj1k3l3k4l8k5qk3JPJ1K7M0K1L5K1
3741F5J5J9j2Pl5j5k0l6k3k8j2kj0J4J4L0J7K5K1K8lJ4pj0ql1j8l8l2lj5oJ2P
3775g6K3K4M2J0K5K9J7j%j3k7k9j9k8l0j5p%KJ2L6K8J4J5K4K5Kj5Kj8k9l2k6j3
3809d8j9k7J0nK8J2J4L4K0K4L4J2lk2Ok2j1k7l7k3k0j1mJ2QJ4K5K9K8J7K2JMn
3843G0j9j2l6k2k5k4k5LJJ2J6K8L5K5RK5J0Rj8Jj4l5j2k4k0j8nk%J2J8K2K4K5
$$ plain form
3877 34 48 56 75 78 66 56 33 -1 -28 -39 -71 -80 -92 -93 -76 -66 -49 -12 3 45 44 62 76 66 58 49 22 -4 -28 -43 -64 -71 -66 -68 -57
3912 -57 -31 -14 14 25 55 55 74 75 69 53 30 9 -11 -32 -56 -74 -76 -86 -71 -63 -36 -21 -3 27 46 61 64 71 68 52 29 11 -18 -44
3946 -44 -60 -71 -80 -73 -67 -47 -33 -3 20 48 56 70 82 75 60 48 19 -14 -32 -50 -54 -62 -79 -74 -57 -51 -14 -1 29 48 52 61 64 50 41 24 16
3983 16 -10 -45 -43 -56 -72 -76 -67 -46 -27 -5 21 33 65 68 79 64 58 42 28 -1 -24 -44 -61 -69 -85 -80 -57 -40 -15 -8 25 37 52 63
4017 63 64 55 38 18 1 -13 -44 -57 -73 -72 -68 -66 -48 -20 -10 30 40 48 67 69 64 67 46 28 7 -26 -35 -44 -61 -67 -53 -51 -40 -15 -1 24 36
4054 36 51 60 63 57 44 34 11 -9 -43 -45 -64 -64 -74 -64 -57 -34 -11 4 34 53 52 67 63 55 52 29 9 -15 -32 -46 -59 -78 -60 -55 -44 -27
4090 -27 -7 23 34 44 57 58 47 37 27 6 -1 -26 -37 -50 -63 -71 -68 -56 -34 -8 4 16 40 51 61 63 58 47 33 13 -11 -40 -43 -52
4124 -52 -60 -52 -47 -42 -17 8 21 34 46 63 64 51 56 35 13 -10 -15 -45 -56 -72 -66 -63 -59 -38 -21 -9 17 35 54 60 55 58 46 27 15 1 -20
$$ packed form
3877C4J4QJ9Lj2j0k3l4k7j1l2rj2jJ7J0J7L7J5M2jJ8J4j0qrk7k6k4j5k1pNkJ1
3912e7K6J7K8J1L0%J9Joj6k3k1k0k1k4j8kj0J5QK7J5J8L0J9J5LPlj6k3j8k9k6
3946d4j6j1rPOK0J4L0K3K8QJ4J2pj5j2k9l3j8j8mqj7NJ7OL7J3L0J9MRLj4rj7q
3983A6k6l5Kj3j6mRK1J9K2K6J2L2LJ1j5oj6j4k9k3k0j7qj6NK3J7K5PL3J2J5J1
4017F3Jrj7k0j7j4l1j3j6JMKJ8K8J0M0J0QJ9KnLk1j8k1l3rrj7oJ4KJ1K5J4K5J2
4054C6J5RLoj3j0k3k0l4kj9%j0J0PK3K3J5L0J9jJ5mqlk3k0k4j7j4j3j9J8NJ1J7
4090b7K0L0J1J0J3Jj1j0j0k1pk5j1j3j3qLJ2K2K6J2J2K4J1J0Knj1j4k0k4k9lr
4124e2qQNNK5K5J3J3J2J7Jj3Nk1k2k3nl0j1j6OLMK1J7J2K6J8J9OnLj2j9j2j4k1
$$ plain form
4161 -20 -39 -54 -50 -57 -45 -40 -18 -1 20 31 46 53 65 59 48 34 23 -5 -28 -35 -51 -63 -71 -62 -60 -36 -22 -9 11 40 40 52 54 47 46 36 15
4198 15 -5 -19 -31 -37 -52 -54 -53 -45 -24 -6 10 25 43 55 57 59 50 44 18 6 -11 -42 -46 -61 -65 -60 -65 -41 -24 -8 11 28 41 47 48 44 48 28
4236 28 23 -8 -21 -40 -55 -53 -66 -53 -42 -23 -4 12 23 43 54 67 65 63 45 34 15 -8 -26 -46 -57 -58 -66 -61 -42 -38 -13 3 24 32 49
4271 49 55 40 40 32 8 2 -13 -38 -49 -59 -57 -52 -47 -30 -20 0 14 41 49 60 53 58 56 29 18 -4 -17 -28 -54 -58 -58 -45 -41 -34 -20 -1 18 31
4309 31 38 39 44 43 26 9 -3 -15 -36 -47 -56 -53 -55 -43 -22 -21 -15 15 41 52 47 54 63 56 39 20 5 -20 -26 -34 -53 -53 -55 -47 -33 -13 1 26 40
4348 40 44 50 51 51 35 22 -1 -14 -21 -30 -58 -52 -59 -54 -45 -18 -11 9 30 42 53 56 49 49 40 19 22 -13 -33 -38 -44 -51 -50 -37 -31 -24 -2 15 23 45 53 54 44
4391 44 32 27 14 0 -27 -38 -44 -52 -62 -50 -32 -21 -9 8 35 42 39 52 52 46 31 15 7 -2 -13 -36 -41 -42 -39 -36 -21 -5 3 29 25 30 43 42 40
4430 40 33 27 16 6 -24 -31 -47 -50 -43 -49 -46 -35 -28 -1 8 35 38 44 49 47 29 14 8 -15 -30 -38 -39 -49 -52 -49 -26 -11 8 13 30 46 51 44 45 46 26 13
$$ packed form
4161b0j9j5MpJ2NK2J7K1J1J5PJ2oj1j4j1k8k3pj6j2qRKK4J4J3K0K9%J2Kpjj0k1
4198A5k0j4j2oj5kJQK1J8J6J5J8J2KKrok6j2j7l1mj5mNnK4J7J6J9J7J3OJmMk0
4236B8nl1j3j9j5Kj3J3J1J9J9J6J1K0J1J3kkj8j1j9k3j8k0j1jqNJ9MK5J6K1QJ7
4271D9Oj5%qk4oj5k5j1j0KNNJ7J0K0J4K7QJ1pNkk7j1k2j3j1k6m%J3MPJ4J9J9J3
4309C1PJNjj7j7j2j2k1j1rLkJ2K1JOL0K6J1nPRpj7j9j5k5oqj9%kQJ4K0J4K5J4
4348D0MOJ%j6j3k3j3prk8OpNRK7PK0K1J2J1Lp%rk1Ll5k0nopJJ3OPK2J7QK2QJj0
4391D4j2nj3j4k7j1oqj0J2J8J1J2J7K7PlJ3%oj5j6qrj1k3njLLJ5J6QK6mNJ3jk
4430D0poj1j0l0pj6lPoLJ1PK7RK7LONkj8j5ok3j5qjj0lLK3J5J9NJ7J6NpJJk0j3
$$ plain form
4472 13 -11 -22 -30 -35 -44 -52 -49 -43 -33 -23 -6 3 28 44 33 36 43 38 30 11 2 -17 -31 -37 -45 -41 -42 -34 -20 -2 15 26 35 48 41 44 42 30 28 9 -17
4513 -17 -29 -39 -47 -50 -43 -32 -25 -14 -7 3 17 24 31 42 27 21 17 3 -7 -23 -14 -36 -38 -48 -44 -33 -24 -8 10 33 32 52 57 52 45 42 30 4 -4 -25
4553 -25 -37 -40 -43 -65 -49 -36 -24 -6 4 9 32 26 43 29 19 20 5 -11 -16 -33 -49 -51 -40 -46 -33 -15 0 2 10 31 32 50 45 46 30 20 19
4590 19 -3 -19 -30 -37 -33 -42 -42 -37 -25 -18 -3 21 22 30 32 38 28 22 11 -11 -19 -31 -40 -50 -50 -52 -42 -35 -21 -3 3 25 26 46 38 50 26 18 5 -1 -10
4631 -10 -27 -30 -41 -37 -39 -27 -25 -3 9 6 19 28 26 35 28 15 9 0 -17 -22 -45 -28 -40 -45 -40 -36 -17 2 9 22 32 49 44 42 28 28 23 1 -14 -22 -31
4672 -31 -24 -38 -38 -23 -13 -9 7 13 18 36 29 43 28 28 18 -7 -8 -13 -26 -39 -44 -47 -39 -24 -30 -6 0 16 23 32 22 31 38 18 11 9 0 -17 -25 -34 -39 -35 -24
4715 -24 -23 -10 3 12 20 28 24 39 32 21 15 0 -4 -13 -26 -29 -44 -48 -38 -38 -24 -2 -3 8 9 24 34 43 23 12 -1 -6 -13 -13 -29 -26 -32 -30 -32 -23 1 2
4757 2 7 21 26 36 32 28 30 22 7 3 -17 -31 -33 -35 -41 -38 -34 -22 -10 4 11 20 24 27 26 31 22 8 6 -9 -22 -23 -30 -35 -34 -33 -22 -16 -2 6 24 27 27 36 29 24 28
$$ packed form
4472A3k4j1qnrqLOJ0J0J7RK5J6j1LPnqj9rj9j4oqMjQJ4J8J7J1RJ3pLkj2kj9k6
4513a7j2j0qlPJ1PJ1PJ0J4PPJ1j5omj4j0j6Rk2kj0MJ1RJ6J8K3jK0Nnplj2k6qk1
4553b5j2llk2J6J3J2J8J0NK3oJ7j4j0Jj5j6nj7j6kJ1oJ3J8J5KQK1JJ8nJj6j0j
4590A9k2j6j1pMr%NJ2PJ5K4JQKOj0oj1k2qj2rj0%kJ0PJ4J8OK2JK0qJ2k4qj3or
4631a0j7lj1MkJ2KK2J2lJ3RkRpj3orj7nk3J7j2nNMJ9J9PJ3J0J7nkj4%nk2j5qr
4672c1Pj4%J5J0MJ6ONJ8pJ4j5%j0k5jnj3j3nlQJ5oK4OJ6PRj0RPk0pkrj7qrnMJ1
4715b4JJ3J3RQQmJ5pj1oj5mrj3lj5mJ0%J4K2jJ1JJ5J0Rk0j1j3np%j6LoKkRK4J
4757BNJ4NJ0mmKqj5mk0j4kkoLMJ2J2J4PRMLjNrj4kj5j3jpnJJJ1OJ4QJ8L%RpnM
$$ plain form
4804 28 7 -6 -9 -21 -27 -36 -44 -45 -41 -26 -9 -8 11 8 16 20 24 24 16 4 -10 -16 -7 -27 -33 -32 -41 -24 -22 -6 -8 8 14 29 25 36 30 38 15 4 -7 -6 -28
4847 -28 -26 -33 -38 -31 -36 -32 -27 -11 -7 9 15 20 14 17 16 10 1 -7 -17 -18 -29 -40 -33 -35 -25 -13 -6 3 4 20 22 19 28 31 20 12 -9 -3 -25 -26 -37 -39 -34 -33 -9 -13 -8
4894 -8 7 21 21 23 23 19 14 11 -3 -7 -18 -19 -25 -43 -40 -30 -20 -18 -9 3 7 19 19 20 24 22 11 30 12 -10 -7 -13 -23 -26 -26 -30 -18 -16 0 15 9 10 16 25
4938 25 25 29 18 3 1 -29 -34 -38 -33 -35 -35 -33 -30 -14 -3 9 4 28 18 28 20 12 14 1 -5 -7 -18 -25 -26 -23 -16 -21 -5 -4 3 3 12 16 24 33 20 10 -9 6
4982 6 -5 -17 -30 -31 -36 -32 -24 -15 -8 -7 2 18 13 22 26 28 14 17 4 -4 -7 -22 -17 -19 -24 -31 -24 -15 -3 3 10 14 15 22 29 26 12 5 2 -18 -23 -31 -24 -30 -26 -20 -22 -18 -11 -11 -1
5033 -1 18 14 18 17 11 11 0 -3 -9 -12 -19 -23 -31 -19 -15 -9 3 5 12 13 33 37 23 21 19 9 0 -19 -32 -29 -38 -25 -35 -24 -24 -15 -7 -4 5 14 18 16 18 10 10 -3 -6 -8
5081 -8 -9 -25 -18 -14 -19 -13 -7 5 11 6 20 20 25 25 19 28 12 14 -10 -8 -15 -27 -32 -17 -24 -24 -23 -12 -5 6 13 13 13 21 19 21 5 -6 -17 -13 -18 -20 -16 -23 -16 -15 -11 6
5129 6 16 27 27 12 11 14 19 11 6 2 -5 -12 -20 -19 -26 -21 -18 -15 -11 0 8 15 10 16 19 17 13 10 3 -11 -26 -14 -21 -21 -7 -10 -19 -10 7 14 30 24 22 24 29 22 21 2 -3 -5
$$ packed form
4804B8k1j3lj2orqjMJ5J7JJ9lQMM%qj2j4oRk0oJrJ7KJ6kJ6OJ5mJ1oQk3j1j1Jk2
4847b8KpnPnMNJ6MJ6ONoLjorqj0jj1j1PkJ0J2PRJJ6KlRLj1qk1Ok2jj1kNJK4mN
4894hJ5J4%K%mnlj4mj1joj8LJ0J0KRJ2MJ2%JMkj1J9j8k2Loj0l%mJ2KJ6J5oJOR
4938B5%Mj1j5kl0nmNk%KLJ6J1J2nK4j0J0qqKj3okj1pjLPnJ6JP%RMQRj3j0j9J5
4982Fj1j2j3jnMQRPJRJ6nRMKj4Lj3qlj5NknpPRJ2OPMJPPlj4plk0nqPoMOkMP%J0
5033aJ9mMjo%j1lolpmqJ2MOJ2KPJK0Mj4kkj0rj9j3LrJ3j0J1%RQLRRMkKq%j3lk
5081hjj6PMnOOJ2OnJ4%N%oRj6Kk4Kpj2nJ5p%JJ1PJ1P%%QkKj6j1j1MnkMpPJMJ7
5129FJ0J1%j5jLNqnmppqJpNLLMJ1QPnOLkmlpj4j5J2p%J4lrRJ7PJ6okKNpjj9nk
$$ plain form
5179 -5 -4 -15 -22 -28 -15 -12 -16 -7 7 10 16 19 4 15 14 6 -4 0 -5 -14 -23 -11 -26 -11 -18 -8 -14 -3 5 6 16 28 13 24 23 15 15 11 7 -15 -15 -17 -18 -13 -29
5224 -29 -16 0 3 4 10 15 1 6 16 10 7 -6 -3 -16 -7 -23 -22 -21 -14 -17 -10 -6 -9 2 3 17 17 13 11 13 10 6 -12 -13 -13 -20 -24 -20 -16 -5 -7 1 5 4 13 19 14 23 11
5273 11 13 5 -3 -16 -20 -25 -32 -28 -25 -20 -6 -5 5 1 8 16 6 17 9 14 4 8 -14 -8 -22 -15 -20 -21 -10 -18 5 8 3 14 12 20 28 9 16 16 0 -3 -11 -20 -21 -14 -24
5320 -24 -22 -23 -20 -8 -4 6 6 10 16 17 20 6 10 -2 5 -3 -12 -13 -17 -14 -20 7 0 9 10 16 13 27 11 17 12 11 -4 -7 -7 -8 -7 -15 -21 -17 -10 -9 -4 -2 7 10 6 15 19 15 11 -5
5372 -5 -12 -9 -18 -9 -22 -22 -11 -21 -13 -8 -3 2 14 13 20 23 12 18 5 1 -12 -13 -23 -10 -13 -23 -16 -28 -12 -10 6 8 6 12 10 17 19 10 14 -2 -12 -12 -17 -24 -14
5417 -14 -2 -10 -9 -2 2 10 12 19 18 27 25 22 31 8 17 4 -9 -12 -14 -15 -18 -16 -8 -3 4 4 1 14 16 14 19 9 4 7 -8 -19 -7 -16 -24 -18 -13 -6 6 7 8 19 8 21
5465 21 22 23 12 7 3 8 0 -5 -13 -6 -11 -20 -14 -1 -3 -1 -1 9 10 9 18 12 10 3 2 -2 -19 -18 -20 -20 -22 -23 -14 -3 1 6 2 12 14 23 10 19 16 4 5 -5 -2 -12 -13 -26
5515 -26 -14 -2 -17 -10 1 13 15 18 12 10 10 12 2 -3 -6 -11 -16 -20 -15 -20 -16 -18 -11 -4 -6 3 12 17 5 17 13 14 6 -3 8 -8 -14 1 -9 -16 -19 -11 13 -5 5
$$ packed form
5179eJj1poJ3LmRJ4LOLj5J1jqj0MnrrJ2j5J5pJ0oJ1QJJ0J2j5J1jq%mmk2%kjNj6
5224b9J3J6LJONj4NJ0olj3Lj3Rj6JJPlPMlJ1JJ4%mkKlmj8j%pmMMJ1kQMjROnRj2
5273A1Kqqj3mnpMLNJ4JJ0mPQj0J1qNj0Mk2Oj4PnjJ1qK3LnJ1kQQj9P%j6lqrjPj0
5320b4KjLJ2MJ0%MOJLj4Mj2PqrjmLoK7pRJOlJ4j6Onjj5l%jJqoMPJNKRLmRMmmj6
5372epLrRj3%J1j0QNNNJ2jPLj1Oj3mj3jj0J3lj0Pj2J6KJ6KkOkPKrMj6j0%npJ0
5417a4J2qJPMQKPjRklRk3Rj3j3lkjlKQNP%lJ3KkNj0nLj5j1J2rqONPJ2JJJ1j1J3
5465B1JJj1nmNqnqPnrOJ3kK%J0JjRokpjmj7Jk%kjRJ1MNmJ0KRj3Rlj2Jj0Lj0jj3
5515b6J2J2j5PJ1J2KLok%Kj0nlnnmNnMkPPkRRNj2J2mJqrJ1j6oJ5j0plQK4j8J0
$$ plain form
5560 5 17 26 17 21 16 7 0 -5 4 -15 -12 -25 -18 -15 -15 -16 -13 -5 5 4 14 19 14 7 15 6 5 7 1 0 -3 -12 -8 -8 -13 -1 5 0 7 13 11 24 20 18 9 3 8 -8 -8 -16 -21 -19 -10
5613 -10 -21 -1 -11 -17 -6 1 -2 8 9 11 12 -6 -6 -3 -10 -11 -3 -7 -14 -15 -2 -10 -10 13 -1 13 21 17 21 17 13 10 13 4 -6 -4 -9 -17 -21 -12 -12 -14 -5 3 1 -3 2 10 3
5662 3 1 -5 2 -5 -11 -5 -11 -11 -23 -17 -13 -4 -7 6 13 11 3 3 9 19 10 17 5 -5 -1 -6 -6 -9 -21 -24 -9 -14 0 -8 0 5 2 7 15 7 10 15 0 -8 -3 -15 -18 -12 -19 -16 -8
5713 -8 -2 1 -3 11 18 19 31 16 20 11 12 -4 -7 -4 -4 -8 -8 -9 -3 -6 -12 11 4 3 7 12 7 10 1 7 -2 -9 -7 -2 -6 -18 -15 -19 -12 -11 3 -5 2 16 15 18 21 12 10 7 -1 4 -5
5766 -5 -2 -11 -8 -17 -6 -1 -5 -5 4 9 11 17 17 15 13 2 -8 -18 -16 -9 -25 -16 -12 -21 -20 -4 -2 -6 1 10 5 21 7 4 6 4 -1 7 -7 -3 -13 -8 4 -12 -13 0 1 7
5814 7 9 4 24 16 15 17 12 13 -2 -12 -28 -11 -18 -16 -22 -9 -12 -12 5 9 1 13 11 22 21 18 4 10 0 -1 -1 -12 0 -9 -3 7 1 -2 9 14 11 18 14 19 6
5859 6 9 4 -2 -3 0 -11 -28 -13 -8 -11 -11 -16 -7 -9 1 2 14 14 16 9 6 3 12 3 -14 -13 -15 -15 -14 -13 -4 -2 2 8 11 24 11 23 12 6 0 1 -3 -12 -16 -18 -24 -27 -12 -13
5909 -13 -1 -7 4 9 9 8 19 4 7 8 2 3 -11 -5 -14 -17 -15 -4 -11 -8 1 -7 8 10 19 17 13 25 18 3 16 -1 0 -13 -17 -15 -16 -20 -15 -4 -10 10 6 16 14
$$ packed form
5560EJ2RrMnrpnRj9Lj3PL%jLQJ0jJ0NnpQrjKojlrM%nJ2OnPOkJ3mkroNj6%qnKR
5613a0j1K0j0oJ1PlJ0JKJj8%LpjQmpjJ3q%K3j4J4QmMmmlLrj0KnqmR%kRQkmNQp
5662CkoPpoOo%j2OMRlJ3Pkq%OJ0rPj2j0Mn%lj2lJ5nJ4qQNlNQqLNj5qNj2lOpLQ
5713hOLmJ4PJJ2j5MrJj6lL%m%jOloK3pjMNnLrOrpKNmj2LmPJJ4qPJ4jLLrklqNr
5766eLrLrJ1Nm%RNKO%kkj1j0j0KPj6RMrJJ6KmPRnJ6j4lKknQj4Mj0NJ2j6jJ3JO
5814GKnK0qjKnJj5j0j6J7pKoJ3l%J7MqJ2kJ1jlj4Oj0j%j1J2rOJ0olJ1NlPmNj3
5859FLnojLj1j7J5Nl%nRkJ0JJ2%KpllRrj7Jk%JJRKMOLJ3j3J2j1ooJmrmkolJ5j
5909a3J2oJ1N%jJ1j5LJoJj4OrlKJ1pLRqJ5KRkmJ2pj5J3j7Jj3mKjmNJ1oK0mJ0k
$$ plain form
5954 14 5 19 9 3 -1 -1 -8 -4 -16 -3 -4 -13 -15 3 -4 2 1 9 10 11 18 14 10 1 4 1 2 -10 -10 -9 -18 -10 -10 -2 -2 -1 0 8 11 11 6 4 7 0 2 -10 -7 -25 -15 -16 -3
6005 -3 -15 -11 2 2 1 16 14 21 23 9 11 10 10 -1 -6 -19 -8 -13 -7 -10 -5 -10 4 1 12 15 14 11 6 11 6 8 -3 -6 -9 -13 -20 -18 -15 -19 -20 -18 -8 4 6 11 21 23
6053 23 11 11 17 16 0 1 -3 -14 -16 1 -9 -15 0 2 -1 6 25 15 22 17 10 8 8 -3 4 -11 -12 -18 -17 -10 -12 -8 -10 4 4 11 4 4 2 24 14 14 5 6 1 -2 -11
6100 -11 -5 -13 -5 -10 -10 -11 -1 8 19 11 20 16 19 13 9 3 6 -1 -6 -17 -18 -12 -11 -5 -4 -13 14 12 8 16 16 18 11 15 7 6 12 -3 -6 -16 -1 -19 -3 0 -2 1 -1 8 11 25
6150 25 17 25 18 18 10 -2 0 -9 -25 -14 -20 -17 -5 -2 -7 -2 12 9 12 12 7 16 6 13 8 3 2 0 -15 -15 -6 2 -10 5 3 7 8 18 26 17 14 9 15 6 5 5 -3 -8 -7 -6
6200 -6 -6 -7 -3 -7 -6 10 5 8 9 8 7 6 10 -3 0 -7 -8 -11 -17 -16 -8 -7 4 -1 4 2 12 13 23 16 19 4 3 1 7 -9 -5 -11 -16 -12 -18 -11 -10 2 1 9 2 11 -3 12 6
6251 6 9 1 1 -2 -8 -8 -12 -11 -9 -13 -1 -1 -1 2 15 15 18 19 9 24 11 9 2 -1 0 -8 -13 -20 -9 -9 -7 1 2 3 9 8 9 0 3 -2 -2 5 -6 -5 1 -1 -14 -10 -13 -12 -5 0 2
6304 2 5 17 17 16 18 15 11 13 0 0 -4 0 -18 -14 -14 -8 -10 3 7 -2 1 13 19 13 13 7 5 -2 -16 -14 -16 -13 -16 -22 -15 -12 -5 3 5 5 12 15 10 7 16 -2 8 8 0 -7 -12 -3 -2
$$ packed form
5954A4rJ4j0om%pMj2J3jrkJ8pOjQJJPmmrLlJj2%JrQ%Q%JJQL%nkLpKj2Lj8J0jJ3
6005cj2MJ3%jJ5kPKj4Kj%j1nj3J1nOlNnJ4lJ1LjlnNnKj1llmpKLmjKJ0J2KNJ0K
6053B3j2%Ojj6Jmj1kJ7j0oJ5KlPJ9j0Pnpk%j1Pj5joJPkMkJ4%Pp%kK2j0%rJnlr
6100a1OqQn%jJ0RJ1qRmLomoLpnj1jOJOJrK7kmQ%KpMqjOj5lj0J5j8J6LkLkRLJ4
6150B5qQp%qj2Krj6J1oLJ2LnNJ4lL%nRj0Pnnjkj5%RQj2J5kMJJ0QrlnOrj%qnJJ
6200f%jMmJJ6nLJjjjMj3LpjloJQJJ1nNkJ0JJ0pLj5jkOj6MonMoPJJ2jQpRj4J5o
6251FLq%lo%mJKmJ2%%LJ3%LJj0J5j3kplJqnpJ1%KQJJOjJrLn%Pj1JOkj3MlJPNK
6304BLJ2%jKlmKj3%mMj8M%OkJ3MrLJ2Oo%okpj4KkLloPLPQK%PLnlRj8J0%qpnRJ
$$ plain form
6357 -2 -8 -7 -11 -2 11 2 2 -8 14 13 12 18 11 5 -3 -1 -15 -11 -12 -12 -12 -6 -6 1 1 1 3 7 0 17 19 18 11 11 -1 -5 -10 -17 -9 5 7 -2 1 7 3 -3 10 12 5 9 7 10 -5
6410 -5 -2 -5 -11 -19 -10 -12 -3 -2 -5 -5 -9 -2 11 8 14 10 9 16 12 -1 0 7 -13 -10 -19 -8 -1 -10 -8 -2 -2 10 20 11 17 8 11 -4 1 -7 0 -15 -10 -28 -11 -15 -9 -13 -1 -1
6460 -1 -8 0 2 5 5 10 17 5 8 4 -5 -5 -12 -10 -7 -12 -6 -12 -2 1 9 9 13 11 16 16 15 7 3 0 -2 -7 -12 -11 -13 -13 1 -4 -2 3 13 13 -2 0 8 10 9 -8 -5 -7 -9 -1 -5 -3 -4
6515 -4 -7 7 2 -1 7 5 14 12 4 19 0 1 3 1 -2 0 -12 -14 -11 -14 -4 -10 0 -6 9 4 -4 15 12 17 1 5 8 -4 -10 -7 -17 -18 -8 -13 -8 0 11 3 20 18 16
6562 16 25 9 15 11 15 11 7 1 -7 -14 -14 -1 -7 -3 -3 -4 2 3 8 11 7 10 14 1 2 -6 -10 -9 -16 -16 -10 -10 -10 -4 -5 -2 8 21 22 11 15 18 8 6 1 5 -9 -13 -17 -15 -13 -13
6614 -13 6 5 3 5 12 4 5 13 6 2 -1 9 -9 -1 -14 -9 -9 -7 -4 -9 -7 -4 11 6 6 11 10 7 21 15 10 4 3 4 -3 4 -10 -15 -8 -7 -3 5 4 9 0 13 11 -1 2 8 3
6665 3 1 1 -8 -7 -15 -14 -10 -3 4 -9 -9 -3 8 7 10 13 13 9 13 7 3 3 -5 5 -11 -5 1 -5 6 -6 11 5 8 12 11 12 11 4 5 -8 -5 0 -12 -11 -15 -12 -19 -8 2 -1
6715 -1 2 5 16 17 11 19 8 7 2 3 4 -5 6 -4 -8 9 -2 7 3 11 16 15 11 16 13 16 13 -3 12 3 1 -6 -6 -3 -13 -7 4 -5 -10 5 10 4 18 13 6 8 7 2 -6
$$ packed form
6357boJmRJ3r%j0K2jjOpoqKj4Mj%%O%P%%KMpJ7Kjp%j2mnpQJ4KrLOmoJ3KpMkLj5
6410eLloqRkRJl%mPJ3lOmjPmj3JPk0LrJ1PrKO%J2J0rOrLj5NqPj5Nj8J7mOmJ2%
6460apQKL%NPj2Lmr%pKLnOoJ0LQ%MkN%jqmlknnJk%J4nKNJ0%j5KQKjj7LkkQmKj
6515dlJ4nlQkRkqJ5j9JKklKj2kLlJ0oJ0oJ5nqJ9lNj6MLj2oLj0jJ0nNQJ1qJ7kk
6562A6Rj6OmMmmoqp%J3oM%jOJNLmLMj3JqmJp%O%%OjLJ0J3Jj1MLj0knMj4mmKK%
6614a3J9jkKPqJQpmlJ0j8Qj3N%KLnKLJ5n%NjlJ4onojJpPj4nPJMQjNrJ3kj2LOn
6665Ck%rJqJMPPj3%OJ1jLL%mMom%qJ0j6OOoJ1j2J7oLMjJjpJj3LNj2JmLpJ1J0l
6715aLLJ1JoQj1jnJJrJ1j0mJ7j1RmQNjmNlLlj6J5rkp%Lj0OJ1rnJ5NoJ4npKjnq
$$ plain form
6764 -6 1 7 1 -3 9 -7 -7 6 2 2 5 10 17 27 18 10 23 8 -3 2 -2 -1 -2 -4 -10 -10 -10 -6 -4 -5 1 -6 6 -6 11 15 2 7 -7 -10 -14 -10 -5 -3 1 -5 -8 5
6812 5 -6 7 11 7 7 23 18 6 8 7 1 0 -3 -2 -13 -6 2 -7 0 0 8 11 9 9 2 2 7 5 11 3 3 -4 -13 -8 -18 3 -4 -4 8 7 12 0 1 16 17 17 14 10 2 3 -2
6863 -2 6 -7 -8 -16 -9 -11 -9 8 -1 10 -3 15 -7 3 10 10 -12 7 -7 -3 -7 -13 -16 -12 -15 -3 -1 -3 -5 4 -2 -4 19 15 -1 10 1 -3 4 -6 -4 -7 -8 -18 -5
$$ packed form
6764fPOomJ2j6%J3m%LNPJ0rqJ3j5j1NmJjko%%MKjOpJ2j2J7Mj3Nj4lmMNKMolJ3
6812Ej1J3Mm%J6nj2KjojlJj1PQrP%QLk%p%NkOq%prNj0K1p%J2jNj2JJ5J%lmqJn
6863bQj3jqPkKJ7rJ1j3J8k2J0P%k2J9j4MmolMlJ2KkkRokK3mj6J1rmPj0Kljj0J3
$$ [...]
8191E
##END NTUPLES=NMR FID
##END=
