##TITLE=1H_ES-AC-HMPTA
 
 8 sc, 
 13.04.2022
##JCAMPDX= 6.0         $$ Bruker NMR JCAMP-DX V2.0
##DATA TYPE= NMR FID
##DATA CLASS= NTUPLES
##ORIGIN= UXNMR, Bruker Analytische Messtechnik GmbH
##OWNER= root
$$ XWIN-NMR		Version 3.5
$$ Wed Apr 13 10:22:47 2022 Russian Standard Time (UT+4h)  she@DPX200
##.OBSERVE FREQUENCY= 200.13135
##.OBSERVE NUCLEUS= ^1H
##.DELAY= (6, 6)
##.ACQUISITION MODE= SIMULTANEOUS
##.ACQUISITION SCHEME= undefined
##.AVERAGES= 8
##.DIGITISER RES= 18
##SPECTROMETER/DATA SYSTEM= spect
##.PULSE SEQUENCE= zg30
##.SOLVENT NAME= CDCl3
##.SHIFT REFERENCE= (INTERNAL, CDCl3, 0, 15.7039)
##AUDIT TRAIL= $$ (NUMBER, WHEN, WHO, WHERE, WHAT)
$$ ##TITLE= Audit trail, XWIN-NMR		Version 3.5
$$ ##JCAMPDX= 5.01
$$ ##ORIGIN= Bruker BioSpin GmbH
$$ ##OWNER= she
$$ F:/spectra/data/she/nmr/H-F/1/audita.txt
$$ ##AUDIT TRAIL=  $$ (NUMBER, WHEN, WHO, WHERE, WHAT)
(   1,<2022-04-13 10:21:45.12 +0400>,<she>,<DPX200>,
      <created by zg, POWCHK disabled, PULCHK disabled
       configuration hash MD5:
       00 E9 B6 7A A2 85 ED C7 34 08 36 98 17 FE 4E 26
       data hash MD5: 16K
       0F 6B A9 90 5A 2D 5E ED 79 13 44 9D 50 6D A3 AF>)
$$ ##END=
$$ 
$$ hash MD5
$$ 52 D2 A6 EE F8 F1 36 FB 54 49 D1 1E 8A 07 9F C1
##$RELAX= 
##$RELAX= 
##$RELAX= 
##$RELAX= 
##$RELAX= 
##$RELAX= 
$$ Bruker specific parameters
$$ --------------------------
##$DU= <F:/spectra>
##$EXPNO= 1
##$NAME= <H-F>
##$PROCNO= 1
##$TYPE= <nmr>
##$USER= <she>
##$AMP= (0..31)
100 100 100 100 100 100 100 100 100 100 100 100 100 100 100 100 100 100 
100 100 100 100 100 100 100 100 100 100 100 100 100 100 
##$AQSEQ= 0
##$AQ_mod= 1
##$AUNM= <au_zg>
##$AUTOPOS= <>
##$BF1= 200.13
##$BF2= 200.13
##$BF3= 200.13
##$BF4= 200.13
##$BF5= 200.13
##$BF6= 200.13
##$BF7= 200.13
##$BF8= 200.13
##$BYTORDA= 1
##$CFDGTYP= 0
##$CFRGTYP= 5
##$CHEMSTR= <none>
##$CNST= (0..31)
1 1 145 1 1 1 1 1 1 1 1 1 1 1 1 1 1 1 1 1 1 1 1 1 1 1 1 1 1 1 1 1 
##$CPDPRG= <>
##$CPDPRG1= <>
##$CPDPRG2= <>
##$CPDPRG3= <>
##$CPDPRG4= <mlev>
##$CPDPRG5= <mlev>
##$CPDPRG6= <mlev>
##$CPDPRG7= <mlev>
##$CPDPRG8= <mlev>
##$CPDPRGB= <>
##$CPDPRGT= <>
##$D= (0..31)
0 1.2 0 0 0 0 0 0 0 0.06 0 0.03 0 0 0 0 0.0002 0 0 0 0 0 0 0 0 0 0 0 0 
0 0 0 
##$DATE= 1649830904
##$DBL= (0..7)
120 120 120 120 120 120 120 120 
##$DBP= (0..7)
150 150 150 150 150 150 150 150 
##$DBP07= 0
##$DBPNAM0= <>
##$DBPNAM1= <>
##$DBPNAM2= <>
##$DBPNAM3= <>
##$DBPNAM4= <>
##$DBPNAM5= <>
##$DBPNAM6= <>
##$DBPNAM7= <>
##$DBPOAL= (0..7)
0.5 0.5 0.5 0.5 0.5 0.5 0.5 0.5 
##$DBPOFFS= (0..7)
0 0 0 0 0 0 0 0 
##$DE= 6
##$DECBNUC= <off>
##$DECIM= 32
##$DECNUC= <off>
##$DECSTAT= 4
##$DIGMOD= 1
##$DIGTYP= 9
##$DL= (0..7)
0 120 120 120 120 120 120 120 
##$DP= (0..7)
150 150 150 150 150 150 150 150 
##$DP07= 0
##$DPNAME0= <>
##$DPNAME1= <>
##$DPNAME2= <>
##$DPNAME3= <>
##$DPNAME4= <>
##$DPNAME5= <>
##$DPNAME6= <>
##$DPNAME7= <>
##$DPOAL= (0..7)
0.5 0.5 0.5 0.5 0.5 0.5 0.5 0.5 
##$DPOFFS= (0..7)
0 0 0 0 0 0 0 0 
##$DQDMODE= 0
##$DR= 18
##$DS= 0
##$DSLIST= <SSSSSSSSSSSSSSS>
$$ [...]
##$SUBNAM2= <"">
##$SUBNAM3= <"">
##$SUBNAM4= <"">
##$SUBNAM5= <"">
##$SUBNAM6= <"">
##$SUBNAM7= <"">
##$SUBNAM8= <"">
##$SUBNAM9= <"">
##$SW= 18.05172834244
##$SWIBOX= (0..15)
0 0 2 0 0 0 0 0 0 0 0 0 0 0 0 0 
##$SW_h= 3612.71676300578
##$TD= 16384
##$TD0= 1
##$TE= 0
##$TE2= 300
##$TE3= 300
##$TEG= 300
##$TL= (0..7)
0 120 120 120 120 120 120 120 
##$TP= (0..7)
150 150 150 150 150 150 150 150 
##$TP07= 0
##$TPNAME0= <>
##$TPNAME1= <>
##$TPNAME2= <>
##$TPNAME3= <>
##$TPNAME4= <>
##$TPNAME5= <>
##$TPNAME6= <>
##$TPNAME7= <>
##$TPOAL= (0..7)
0.5 0.5 0.5 0.5 0.5 0.5 0.5 0.5 
##$TPOFFS= (0..7)
0 0 0 0 0 0 0 0 
##$TUNHIN= 0
##$TUNHOUT= 0
##$TUNXOUT= 0
##$USERA1= <user>
##$USERA2= <user>
##$USERA3= <user>
##$USERA4= <user>
##$USERA5= <user>
##$V9= 5
##$VALIST= <valist>
##$VCLIST= <CCCCCCCCCCCCCCC>
##$VD= 0
##$VDLIST= <DDDDDDDDDDDDDDD>
##$VPLIST= <PPPPPPPPPPPPPPP>
##$VTLIST= <TTTTTTTTTTTTTTT>
##$WBST= 1024
##$WBSW= 4
##$XGAIN= (0..3)
0 0 0 0 
##$XL= 0
##$YL= 0
##$YMAX_a= 326206
##$YMIN_a= -320231
##$ZGOPTNS= <>
##$ZL1= 120
##$ZL2= 120
##$ZL3= 120
##$ZL4= 120
##$ABSF1= 10
##$ABSF2= 0
##$ABSG= 5
##$ABSL= 3
##$ALPHA= 0
##$AQORDER= 0
##$ASSFAC= 0
##$ASSFACI= 0
##$ASSFACX= 0
##$ASSWID= 0
##$AUNMP= <proc_1d>
##$AZFE= 0.1
##$AZFW= 0.1
##$BCFW= 1
##$BC_mod= 2
##$BYTORDP= 1
##$COROFFS= 0
##$CY= 11.3945322036743
##$DATMOD= 1
##$DC= 2
##$DFILT= <>
##$DTYPP= 0
##$F1P= 2.36226072786647
##$F2P= -0.459571619588291
##$FCOR= 0.5
##$FTSIZE= 0
##$FT_mod= 4
##$GAMMA= 1
##$GB= 0.15
##$INTBC= 1
##$INTSCL= 1
##$ISEN= 128
##$LB= 0.24
##$LEV0= 0
##$LPBIN= 0
##$MAXI= 10000
##$MC2= 0
##$MEAN= 0
##$ME_mod= 0
##$MI= 1.114404
##$NCOEF= 0
##$NC_proc= 0
##$NLEV= 6
##$NOISF1= 3.799351
##$NOISF2= 2.8
##$NSP= 1
##$NTH_PI= 0
##$NZP= 0
##$OFFSET= 15.70392
##$PC= 1
##$PHC0= -18484.82
##$PHC1= 30.80078
##$PH_mod= 1
##$PKNL= yes
##$PPARMOD= 0
##$PSCAL= 0
##$PSIGN= 0
##$REVERSE= no
##$SF= 200.130013532006
##$SI= 16384
##$SIGF1= 3
##$SIGF2= 2
##$SINO= 400
##$SIOLD= 16384
##$SREGLST= <1H.CDCl3>
##$SSB= 0
##$STSI= 0
##$STSR= 0
##$SW_p= 3612.71676300578
##$SYMM= 0
##$S_DEV= 0
##$TDeff= 0
##$TDoff= 0
##$TI= <>
##$TILT= no
##$TM1= 0
##$TM2= 0
##$TOPLEV= 0
##$USERP1= <user>
##$USERP2= <user>
##$USERP3= <user>
##$USERP4= <user>
##$USERP5= <user>
##$WDW= 1
##$XDIM= 8192
##$YMAX_p= 0
##$YMIN_p= 0
$$ End of Bruker specific parameters
$$ ---------------------------------
##NTUPLES= NMR FID
##VAR_NAME=  TIME,          FID/REAL,        FID/IMAG
##SYMBOL=    X,             R,               I
##VAR_TYPE=  INDEPENDENT,   DEPENDENT,       DEPENDENT
##VAR_FORM=  AFFN,          ASDF,            ASDF
##VAR_DIM=   8192,          8192,            8192
##UNITS=     SECONDS,       ARBITRARY UNITS, ARBITRARY UNITS
##FACTOR=    0.0002768,     1,               1
##FIRST=     0,             0,               0
##LAST=      2.2672688,     0,               0
##MIN=       0,             -320231,         0
##MAX=       2.2672688,     326206,          0
$$ Real data points
##PAGE= N=1
##DATA TABLE= (X++(R..R)), XYDATA
0@%%%%%%%%%%%%%%%qJ6j6J6j6J6j6K0k8L2l2M0m8N5o3O8p6Q8j01J13j28J44j60
$$ 0 0 0 0 0 0 0 0 0 0 0 0 0 0 0 0 -8 8 -8 8 -8 8 -8 12 -16 16 -16 24 -24 31 -32 36 -40 48 -53 60 -68 76 -84
38h4J76j92K13k38K63k91L21l53L88m27M69n16N71o28O90p64Q49r44J053j182
$$ -84 92 -100 113 -125 138 -153 168 -185 203 -224 245 -271 300 -328 362 -402 447 -497 556 -626
58f26J336j521J750k041K425k950L705m876O888j0934K1818r9030k36175M50730
$$ -626 710 -811 939 -1102 1323 -1627 2078 -2798 4090 -6844 14974 -84056 -320231 130499
72A30499J47441m89395P339M81174j56566m32189K77463L44374l69483k20274
$$ 130499 277940 -211455 -204116 277058 120492 -311697 -34234 310140 -59343 -279617
82b79617M27996Q4804m50904M8424M27144j68977l63410K74062K69740l51406
$$ -279617 148379 233183 -217721 -169297 257847 88870 -274540 -478 269262 -82144
92h2144j60030L93902M2230l95795P4255L60437j83239k96063K72183K12438l29278
$$ -82144 -242174 151728 193958 -201837 -127582 232855 49616 -246447 25736 238174 -91104
103i1104j12248L51027K000l42889J04936L07314j94666k44727K61103J59815
$$ -91104 -203352 147675 149675 -193214 -88278 219036 24370 -220357 40746 200561
113B00561l02058o3154L15343l4281k99959J22430K57037j94205j90210K46503
$$ 200561 -101497 -164651 150692 116411 -183548 -61118 195919 1714 -188496 58007
123E8007J09139k75722k4834K76721n6442k49979J30250K02360j89261j40870
$$ 58007 167146 -108576 -133410 143311 86869 -163110 -32860 169500 -19761 -160631
133a60631K26349P0244k39462L671K30249p3397k01292J32415J56592j75165j00445
$$ -160631 65718 135962 -103500 -99829 130420 57023 -144269 -11854 144738 -30427 -130872
144a30872J98409L7069k03044K6531J90791q2483j61679J26814J17925j58345
$$ -130872 67537 104606 -98438 -71907 118884 36401 -125278 1536 119461 -38884
154c8884o5813J74913J1864j74238L9661J57044q5211j26381J20906Q6017j44096
$$ -38884 -104697 70216 82080 -92158 -52497 104547 19336 -107045 13861 99878 -44218
165d4218m0760J52544m961j45362M8302J25323q5408r6317J11635O0696j24841
$$ -44218 -84978 67566 62605 -82757 -34455 90868 5460 -90857 20778 81474 -43367
176d3367k1083J25897j7999j16028N1883R6252p7973o9063R4779L7756j01395
$$ -43367 -64450 61447 43448 -72580 -20697 75555 -2418 -71481 23298 61054 -40341
187d0341n470R8538k4057q7200M7936O8295o5355m4762P5757K0198p7993L279
$$ -40341 -45811 52727 28670 -58530 -10594 57701 -7654 -52416 23341 43539 -34454 -31175
199c1175P2264k4359o0583M1227M5117n2195k7314N6963Q963n5912P970M9628
$$ -31175 41089 16730 -43853 -2626 42491 -9704 -37018 19945 28908 -27004 -19034 30594
211C0594k2374l9791L2774K7891l8059j4586L8983J495l6438R338L0743j7024
$$ 30594 8220 -31571 1203 29094 -8965 -23551 15432 16927 -19511 -10173 20570 3546
223C546k2563K1583J3491k3080n123K1529j780j7741O500J2690q624p110Q674
$$ 3546 -19017 2566 16057 -7023 -12146 9383 7603 -10138 -3638 9052 428 -6682 1992
236A992K444o933L12L513j379L20P89l236J741M657n570m470R668K356j3069J790
$$ 1992 4436 -2497 -2185 1328 -51 269 1058 -2178 -437 4220 -1350 -5820 3848 6204 -6865 -5075
252e075J5148p349j5164J3581J2623j9695p911K4398R95k6816P814K6787j7168
$$ -5075 10073 2724 -12440 1141 13764 -5931 -13842 10556 11551 -15265 -7451 19336 2168
265B168k3675K5811J7182l2922p774L7587l611l8791J5931L5933k8079k9056L8514
$$ 2168 -21507 4304 21486 -11436 -19210 18377 14766 -24025 -8094 27839 -240 -29296 9218
278I218J8408m6030m733M9734j0441m8573K5798M2194l9976l1328N1222J6658
$$ 9218 27626 -18404 -23137 26597 16156 -32417 -6619 35575 -4401 -35729 15493 32151
290C2151n7936P05N9395j9159n5185L6720M5365n1614l0558O2314J2160o7426
$$ 32151 -25785 -25080 34315 15156 -40029 -3309 42056 -9558 -40116 22198 34358 -33068
302c3068Q272O6263k8964n8910M7612M5573o2424k7176P2087N550p5291J7340
$$ -33068 -24796 41467 12503 -46407 1205 46778 -15646 -42822 29265 34815 -40476 -23136
314b3136P1430l9567o0594N8957M3664p3442k1967Q1486k685q2165K7850P4994
$$ -23136 48294 8727 -51867 7090 50754 -22688 -44655 36831 34146 -48019 -20169 54825
326E4825n1241o0404P0658L9759q3841j4737Q9362j2460q6658L9084P5704o2499
$$ 54825 3584 -56820 13838 53597 -30244 -44981 44381 31921 -54737 -15653 60051 -2448
338b448n7360Q0488L3269r1223n764R3515k2586q7094M9190P2574p1337n1185
$$ -2448 -59808 20680 53949 -37274 -43038 50477 27891 -59203 -10013 62561 -8776 -59961
350e9961Q7019K4858r4896L792R3988l2214q4400N7938O7064p8472m3479R1937
$$ -59961 27058 51916 -42980 -39188 54800 22586 -61814 -3876 63188 -15284 -58763 33174
362C3174J5718r7032J3764R3292m2216q0883O7039O0836q6037l4975R7164N511
$$ 33174 48892 -48140 -34376 58916 16700 -64183 2856 63692 -22345 -57320 39844 45355
374D5355r9343K4899R2347n3253p6546P6865N3373r3543k5004J01512n910r9973
$$ 45355 -53988 -29089 63258 10005 -66541 10324 63697 -29846 -54850 46662 40752 -59221
386e9221L6443Q8982o3635o9630Q4839M3752r7993j3850J02039j7130r6483M6287
$$ -59221 -22778 66204 2569 -67061 17778 61530 -36463 -50313 51726 34596 -61887 -15600
398a5600Q2012p1006o0199Q8868L3012r8369l044R8788k6833r0162N3977P3414
$$ -15600 66412 -4594 -64793 24075 57087 -41282 -44326 54462 27629 -62533 -8556 64858
410F4858p5936n0110R0836K2424r7308P106R4883l5953q3850O1346O5083q1040
$$ 64858 -11078 -61188 29648 52072 -45236 -38130 56753 20800 -63050 -1704 63379 -17661
422a7661m0348R3333J1977r6970J7536R1618m5454p7793O9130N6723q6342l0416
$$ -17661 -58009 35324 47301 -49669 -32133 59485 14031 -63762 5368 62091 -24251 -54667
434e4667R5476J339r5702K7689Q7035n3931p0326P5000M7326q8823k0240R4276
$$ -54667 40809 42148 -53554 -25865 61170 7239 -63087 11913 59239 -29584 -49824 44452
446D4452q371r1037L5638P9494n9160o0919P6814L7248q7117j0720Q9340j6162
$$ 44452 36081 -54956 -19318 60176 1016 -59903 16911 54159 -32958 -43678 45662 29500
458B9500q3431M0959P0207o1506n0972P6084K7547q3561k186Q3321k2864p5619
$$ 29500 -53931 -12972 57235 -4271 -55243 20841 48388 -35173 -37359 45962 23098 -52521
470e2521M5438O1254o3462m1597P5485J8473q0499O012P8062k9575o8528N0084
$$ -52521 -7083 54171 -9291 -50888 24597 43070 -37429 -31417 46645 17070 -51458 -1374
482a374N2824o5677l2547P4985R595p7207J3882P2282l5574o0704N3479M3793
$$ -1374 51450 -14227 -46774 28211 37806 -39401 -25519 46763 11189 -49515 3964 47757
494D7757o6035k3329P2105J274p1366K0215O4085l9124n1160N3743L4059o2889
$$ 47757 -18278 -41607 30498 31772 -39594 -19379 44706 5582 -45578 8165 42224 -20665
506b0665j4511O5958n518o2909K4248N4284m0018m1147N1479K4807n7824o931
$$ -20665 -35176 30782 25264 -37645 -13397 40887 869 -40278 11201 36008 -21816 -28747
518b8747N8727j0815n4318K6964M5156m0066l2246M9099J6840n3340m32N2571
$$ -28747 29980 19165 -35153 -8189 36967 -3099 -35345 13754 30594 -22746 -23178 29393
530B9393j5522m7034K9513L7347m0365k4487M7174R798m9335N349M6831j9453
$$ 29393 13871 -33163 -3650 33697 -6668 -31155 16019 25817 -23518 -18169 28662 9209
542I209m0086L1177K9849l9543j7292M3858L669m3895R615L9854k1279l2334L0347
$$ 9209 -30877 300 30149 -9394 -26686 17172 20841 -23054 -13439 26415 5136 -27198 3149
555C149K2332l6059j0873L8107q31l6606J1644L1839k0681k4542K7182J5613l0789
$$ 3149 25481 -10578 -21451 16656 15825 -20781 -9137 22702 2021 -22521 4661 20274 -10515
568a0515n900L1402l605k9157J2128K4464j8948j7916K3535J0250k5732k215K5435
$$ -10515 -16415 14987 11382 -17775 -5647 18817 -131 -18047 5488 15738 -9994 -12209 13226
581A3226n462k2843J2128J8365j7154j2481K0221N908k1183O86K0034o671j7158
$$ 13226 7764 -15079 -2951 15414 -1740 -14221 6000 11908 -9275 -8589 11445 4774 -12384
594a2384J1496J2866j4768p758J6269K480j6026K455J4291o484j1390R372P762
$$ -12384 -888 11978 -2790 -10548 5721 8201 -7825 -5370 8921 2437 -8953 419 8181
607H181j0929l935J1098L52j0160K620Q376m736o062N913L633o176j389N705m34
$$ 8181 -2748 -6683 4415 4767 -5393 -2773 5603 867 -5195 718 4351 -1825 -3214 2491 2057
622B057m658J654L285k245j898K166P35j635O4Q06l17J29Q3r24O33J356j694j279
$$ 2057 -2601 -947 2338 93 -1805 361 1096 -539 -475 331 14 143 226 -698 -65 1291 -403 -1682
640a682K814O06l795N74M425k225m446M104L718n855k250P315J13q127K505Q088
$$ -1682 1132 1738 -2057 -1483 2942 717 -3729 375 4093 -1762 -4012 3303 3416 -4711 -2206 5882
656E882n322p096Q006N088j0207k201J1568j279j1862N058J0944q719q785J1864
$$ 5882 560 -6536 1470 6558 -3649 -5850 5718 4439 -7423 -2365 8579 -140 -8925 2939
670B939N527j4124j412J5130l204j4749P856J2893j2107r632J5532N192j7654
$$ 2939 8466 -5658 -7070 8060 4856 -9893 -2037 10856 -1251 -10883 4649 9841 -7813
683g813P3J8236n720j7055J1155J4142j5898r691J9395L956k1199K510K1042r124
$$ -7813 -7740 10496 4776 -12279 -1124 13018 -2880 -12571 6824 10780 -10419 -7909 13133 4009
697D009j8762J5212J4571k0102q709K3277J716k4360N758K3067j2984j9519J9220
$$ 4009 -14753 459 15030 -5072 -13781 9496 11212 -13148 -7390 15677 2693 -16826 2394
710B394J3961k3801o893K6274j011k6309R019K3901j6395j9213K2415J2602k6475
$$ 2394 16355 -7446 -14339 11935 10924 -15385 -6366 17535 1140 -18073 4342 16944 -9531
723i531m722K8129l749k7259J2072K3890j9422j8224K5149J0774k8685k148K9644
$$ -9531 -14253 13876 10127 -17132 -5060 18830 -592 -18816 6333 17107 -11578 -13726 15918
736A5918o903k7873J5486K3453k2863j6714K8270Q255l1154J245L1153j0835k8177
$$ 15918 9015 -18858 -3372 20081 -2782 -19496 8774 17029 -14125 -12880 18273 7438 -20739
749b0739J9631K2452k6757j4477L1467M953l3298N209L1973j5023k7591K3547
$$ -20739 -1108 21344 -5413 -19890 11577 16530 -16768 -11559 20414 5391 -22200 1347
761A347K0561k9901j1565L3534J426l4054Q873L1403j8388k5867K6170J7955l1543
$$ 1347 21908 -7993 -19558 13976 15402 -18652 -9779 21624 3236 -22631 3539 21494 -10049
774a0049q400L4037j858l3405J1920K9757k0855k3405K7897J4922l2394n129L3914
$$ -10049 -18449 15588 13730 -19675 -7755 22002 1147 -22258 5639 20561 -11833 -16962 16952
787A6952n151l2381J5018K7816k3481k0708K9876J1652l3522j407L4043r018l1417
$$ 16952 11801 -20580 -5562 22254 -1227 -21935 7941 19593 -13929 -15336 18707 9689 -21728
800b1728J8690K5781k6676j7691L2178P873l4667K743L3878j3087k9900K2212
$$ -21728 -3038 22743 -3933 -21624 10554 18427 -16240 -13497 20381 7294 -22606 -394
812c94K3108k9215j4182L3435L976l4521O488L2373j6221k7257K4318J9735l0045
$$ -394 22714 -6501 -20683 12752 16728 -17793 -11305 21068 4847 -22410 1908 21643 -8402
825h402j0520L2931N66l2782R255K9672j8054k3977K5054J6219k9681p176L1587
$$ -8402 -18922 14009 14575 -18207 -8952 20720 2666 -21311 3743 19962 -9719 -16895 14692
838A4692k382l0600J1589K6886j9620k0780K5812J2845k9593l790L0622n586k8809
$$ 14692 12310 -18290 -6701 20185 565 -20215 5597 18442 -11151 -14941 15681 10095 -18714
851a8714J4358K4312k1739j7600K7059R272k9793j08K9702q973k6789J7093K1395
$$ -18714 -4356 19956 -1783 -19383 7676 16948 -12845 -12953 16749 7776 -19013 -1920 19475
864A9475k3499j4095K7570N611k8991L224K7678j1520k3852J8552J7936k3638
$$ 19475 -4024 -18119 9451 15062 -13929 -10705 16973 5453 -18399 153 18089 -5549
876e549j0563K6414K514k6719N492K4593j2734k0389J8578J4486k2555p501K4400
$$ -5549 -16112 10302 12816 -13903 -8411 16182 3448 -16941 1637 16123 -6432 -13933 10467
889A0467R7k4023P113K1520j3468j7141J8441J1325k1639m625K2765k369k1775
$$ 10467 10564 -13459 -6346 15174 1706 -15435 3006 14331 -7308 -11933 10832 8463 -13312
902a3312Q982J8797j4626j4105J8800Q198k1094j632K1345m944j9577J0851J5990
$$ -13312 -4330 14467 -159 -14264 4536 12734 -8360 -9992 11353 6409 -13168 -2317 13673
915A3673j5578j1006J8701N151j9946R93J9277o778j6833J1693J2959j5306q093
$$ 13673 -1905 -12911 5790 10941 -9005 -8012 11265 4487 -12346 -653 12306 -3000 -11093
928a1093J7336K720j7729K600J6494p428j3838J1318J0127j3990n705J5303J009
$$ -11093 6243 8963 -8766 -6166 10328 2900 -10938 380 10507 -3483 -9188 6115 7124
941G124j5174L510J3727p503j1123J0610P650j2621l676J3410m38j2936M334J1300
$$ 7124 -8050 -4540 9187 1684 -9439 1171 8821 -3800 -7476 5934 5496 -7440 -3106 8194
955H194p632q704J0084N433j1479j814J1704j786j0847N019R009p571o451R283
$$ 8194 562 -8142 1942 7375 -4104 -5918 5786 4000 -6847 -1828 7181 -390 -6841 2442
969B442L450r995l25R710k562q575N007O723o790m422P762J922p937M91P370k612
$$ 2442 5892 -4103 -4428 5282 2720 -5855 -848 5875 -915 -5337 2425 4347 -3590 -3099 4271 1659
985A659o191M270M579n334k747N805R12n705Q00N070k225m046L228K795l779j463
$$ 1659 -4532 -262 4317 -1017 -3764 2041 2953 -2752 -1952 3118 893 -3153 75 2870 -909 -2372
1001b372L892K04l592Q60L000j650k208K118J323k251n10K096j70j721O50J210
$$ -2372 1520 1724 -1868 -1008 1992 342 -1866 252 1575 -676 -1186 910 740 -981 -331 879
1017H79q57o87Q22K65o10K2K84j15O7ql80L19M96p41m13J186J12j538L98J729
$$ 879 22 -665 157 422 -188 -166 118 3 70 62 -318 1 497 -244 -657 529 641 -897 -499 1230
1037A230j054j664J781J310k442o91K941j87l183J223L085k296k597L309J738
$$ 1230 176 -1488 293 1603 -839 -1530 1411 1224 -1959 -736 2349 53 -2544 765 2503
1052B503m093n73M554q35m567K312M095l736l142M914J769n713m4N986j822n678
$$ 2503 -1590 -2163 2391 1556 -3011 -699 3396 -340 -3482 1432 3201 -2512 -2556 3430 1608 -4070
1068d070L691M764n336l300O568J361p241Q31P254l115o534N242N114o976l104
$$ -4070 -379 4385 -951 -4251 2317 3678 -3563 -2732 4522 1407 -5127 115 5229 -1747 -4851
1083d851Q137O87q562J935Q167m474o986O710N079q395k617R348j81r460L082
$$ -4851 3286 3973 -4589 -2654 5513 1039 -5947 763 5842 -2553 -5170 4178 3997 -5463 -2381
1098b381Q670n753p077Q015M744r596j887J0300j246j0089M358Q920p168o877
$$ -2381 6289 536 -6541 1474 6218 -3378 -5265 5035 3789 -6300 -1942 6978 -190 -7067
1112g067R438M075j0849p88J1288k694j0663O045Q977q937o367J1073L045j2217
$$ -7067 2371 6446 -4403 -5191 6097 3403 -7260 -1215 7762 -1175 -7542 3531 6576 -5641
1126e641O82J2207m476j0996P932Q705j0705n511J2523J736j3177K265J2601o127
$$ -5641 -4959 7248 2772 -8224 -292 8413 -2292 -7803 4720 6456 -6721 -4456 8145 2018
1140B018j0809R417Q012j1879m484J3286N06j3474L562J2425p294j0267J0392
$$ 2018 -8791 626 8638 -3241 -7725 5561 6067 -7407 -3845 8580 1286 -8981 1411
1153A411P173j2579l408J3627o89j3479M762J2109q458r588J1432O160j3376k113
$$ 1411 8584 -3995 -7403 6224 5535 -7944 -3182 8927 469 -9119 2313 8473 -4903 -7016
1167g016J4122k193j3556O374J1679j0034q675J2791M790j4356m01J4570m087
$$ -7016 7106 4913 -8643 -2269 9410 -624 -9299 3492 8282 -6074 -6475 8095 4008
1180D008j3377Q219J0920j1598p401J3893L169j4876J347J4445n727j2688R557
$$ 4008 -9369 -1150 9770 -1828 -9229 4664 7833 -7043 -5696 8749 3022 -9666 -109
1193a09R761j2431n998J4174J725j4620K653J3734o743j1642J0177Q519j2640
$$ -109 9652 -2779 -8777 5397 7122 -7498 -4845 8889 2146 -9496 681 9200 -3440
1206c440m704J3990M95j4055L733J2880p604j0533J0778P236j2955l288J3923
$$ -3440 -8144 5846 6341 -7714 -3981 8899 1295 -9238 1540 8776 -4179 -7467 6456
1219F456r83j3606N154J2017q857r268J1703N662j3428j524J3888k758j3007O759
$$ 6456 5473 -8133 -2979 9038 181 -9087 2616 8278 -5150 -6674 7214 4456 -8551 -1792
1233a792J0873j0078p759J2409L924j3545K31J3404m299j1985P879R500j0670
$$ -1792 9081 -997 -8756 3653 7577 -5968 -5737 7667 3368 -8617 -738 8762 -1908
1246a908o183J2395K411j2980J485J2377n167j0666Q282Q065j0572m803J1879
$$ -1908 -8091 4304 6715 -6265 -4780 7597 2430 -8236 46 8111 -2461 -7264 4615
1259D615J198j2089K454J1188n759r343Q512O652j0436l416J1351o9j1236L497
$$ 4615 5813 -6276 -3822 7366 1607 -7736 776 7428 -3008 -6424 4927 4858 -6378 -2881
1273b881J0073o550p960Q927N151j0438j896J0952j499j0401M668Q873p347o533
$$ -2881 7192 642 -7318 1609 6760 -3678 -5574 5378 3879 -6522 -1854 7019 -328 -6861
1287f861R283L628j0292m42J0286k677r335N474P544p657n125R050K332r604N97
$$ -6861 2422 6050 -4242 -4684 5602 2925 -6410 -936 6608 -1049 -6174 2876 5208 -4396 -3799
1302c799R223l310q063N645O222p370l889Q350J336q548J222P988l580o742N501
$$ -3799 5424 2114 -5949 -304 5918 -1452 -5341 3009 4345 -4203 -2981 5007 1427 -5315 186
1317A86M959o866k797P541M82p525J779O848l819n548N425L805o488j753O890
$$ 186 5145 -1721 -4518 3023 3505 -4020 -2241 4607 788 -4760 665 4470 -2018 -3771 3119
1332C119l72o650K393N786m110m411N373K685o065p92O167j092n668K769M688
$$ 3119 2747 -3903 -1510 4276 166 -4245 1128 3813 -2252 -3044 3123 2031 -3637 -868 3820
1347C820m111l343M980J765n335j21N173j397m565K689L597l613k398M148J076
$$ 3820 -291 -3634 1346 3111 -2224 -2345 2828 1431 -3134 -445 3152 -461 -2859 1289 2365
1362B365m270J89M009j330l434K255K619k897j652L239O22l257L56K988j209k469
$$ 2365 -1905 -1716 2293 963 -2471 -216 2403 -494 -2146 1093 1715 -1542 -1186 1802 593 -1876
1378a876J870J772k283r99K444K23k349M86K052j062j586J456J026j634m60J624
$$ -1876 -6 1766 -517 -1516 928 1151 -1198 -712 1340 278 -1308 148 1174 -460 -920 704
1394G04n7j448M62J135p27p84Q45M43q16j50O95n1n15J49L38j70j78Q4O3N2o2
$$ 704 647 -801 -339 796 69 -715 130 573 -243 -393 302 251 -264 -115 223 53 -125 -41 22 74 12
1415A2j86J45K83k92l03M75K47o63r3Q28j43r12M42R10q00p58J124M90j399r8
$$ 12 -174 -29 254 -38 -341 134 381 -282 -375 453 310 -602 -160 750 -50 -808 316 806 -593 -691
1435f91J568l81j600R35J423j452j070J890N43k197J04K303q45k161J572J797
$$ -691 877 496 -1104 -169 1254 -198 -1268 622 1165 -1032 -928 1375 530 -1631 -59 1738
1451A738k226j184K705M02k947N03K912j432k586K277J977k963j133L402J24l536
$$ 1738 -488 -1672 1033 1435 -1512 -1009 1903 471 -2115 162 2139 -824 -1957 1445 1569 -1967
1467a967R47L363j991k851K909K048l603j002L995j75m064J421L726k588l036
$$ -1967 -1020 2343 352 -2499 410 2458 -1145 -2147 1848 1673 -2391 -970 2756 168 -2868
1482b868L603J995m317o99M633p04m529K124L973l426l003M442J676n055j35N204
$$ -2868 735 2730 -1587 -2286 2347 1643 -2886 -762 3211 -215 -3218 1224 2900 -2155 -2290 2914
1498B914j474m858L015M016m325k733N238J162n669N49N577k265m949L793L850
$$ 2914 1440 -3418 -403 3613 -712 -3445 1793 2955 -2714 -2165 3412 1147 -3802 -9 3841
1513C841n001k370N772O60o025J154N731k879m916M373L654n532k008O160J86
$$ 3841 -1160 -3530 2242 2902 -3123 -1969 3762 883 -4033 340 3994 -1538 -3546 2614 2800
1528B800o272J715N816l498m820M995L346o066j515O589m94o510K494N807m311
$$ 2800 -3472 -1757 4059 561 -4259 736 4082 -1984 -3499 3090 2596 -3914 -1420 4387 76
1543G6m528N749K794o674p57O973j383o597L429N603n172m053O435K123p133L5
$$ 76 -4452 1297 4091 -2583 -3340 3633 2250 -4347 -918 4685 -487 -4540 1895 4018 -3115 -3080
1559c080P153k209o491M167N252n770l521O835J479p277O98P065k798o231M656
$$ -3080 4073 1864 -4627 -460 4792 -978 -4499 2336 3815 -3462 -2764 4301 1503 -4728 -72
1574g2M819o088k997O959R25p225J242O838l301n829N055M284o338k366P057K07
$$ -72 4747 -1341 -4338 2621 3546 -3679 -2437 4401 1100 -4729 326 4610 -1728 -4094 2963 3170
1590C170p107J954O507l943n293N575L589o669j535P143o64o935K817O066m681
$$ 3170 -3937 -1983 4524 581 -4712 863 4452 -2217 -3752 3391 2727 -4208 -1391 4675 -6
1605fm642O113K740o929o18P098j553o593L549N495n212l889O366J937o912J61
$$ -6 -4648 1465 4205 -2724 -3342 3756 2203 -4390 -841 4654 -558 -4447 1919 3856 -3056 -2895
1621b895O801k183o102L983M857n398l193O297J287o628P02O360k592n526M222
$$ -2895 3906 1723 -4379 -396 4461 -937 -4130 2167 3454 -3174 -2472 3888 1296 -4230 -8
1636hM205n451k534O166O56o315J284N874l054m904M528L494n574j759O091j36
$$ -8 4197 -1254 -3788 2378 3034 -3281 -1997 3877 823 -4081 447 3941 -1633 -3392 2699 2563
1652B563o013J989N360l631m206M906K647n677r05N918r14n591K617M735m025
$$ 2563 -3450 -1461 3899 268 -3938 968 3615 -2062 -2967 2951 2037 -3554 -937 3798 -227
1667b27l455N019J898n534k23N529j423n022K904M090m083k799M840J321n148
$$ -227 -3682 1337 3235 -2299 -2522 3007 1584 -3438 -534 3556 -527 -3326 1514 2835 -2313
1682b313K13N004j691m422K971L474l970k218M552Q29m728N97M495j955l824L070
$$ -2313 -2100 2904 1213 -3209 -238 3236 -734 -2952 1600 2429 -2299 -1702 2793 838 -2986 84
1698H4K854l905j611M334K53m341J055L968k272l195L211K146l802r58M036k97
$$ 84 2938 -967 -2578 1756 2009 -2332 -1277 2691 419 -2776 435 2581 -1221 -2179 1857 1560
1714A560l852J461L322k423k526L131J529l511m28L526o11l266J562K716k312
$$ 1560 -2292 -831 2491 68 -2458 673 2202 -1309 -1737 1789 1178 -2088 -526 2190 -122
1729a22j950K810J069l031j56K984p20k681J485K156k065j488K440P11k554O7
$$ -122 -2072 738 1807 -1224 -1380 1604 884 -1797 -312 1844 -221 -1709 731 1442 -1112 -1045
1745a045K447p83k125J383J606j806j014K043L55k067K81J896q42j558J269J112
$$ -1045 1402 619 -1506 -123 1483 -323 -1337 706 1061 -1006 -725 1171 329 -1229 40 1152
1761A152j546n89J642O7j559L98J352p79j031J032O78j164k96J165o6j043L45
$$ 1152 -394 -983 659 726 -833 -435 917 138 -893 139 817 -347 -643 522 456 -587 -242
1778b42Q70n76o19O83L73p26j32O89o9n82K15M34k87k93L09J50k68n8J96Lj24
$$ -242 628 52 -567 116 489 -237 -369 320 251 -331 -116 318 31 -262 47 197 -71 -129 67 70 -54
1799e4J7L4L0J0j02kJ70m2k40J48K55k51k42L82J76n10k7N84j47o10L80N43n86
$$ -54 -37 -3 27 37 -65 -67 103 61 -179 -31 224 -27 -269 113 289 -221 -248 336 189 -421 -41 502 -84
1822h4m19P59K33r01L9R53l46r13O67P49r39n14J146J84j257J98J259o00j142
$$ -84 -503 256 489 -412 -373 580 234 -679 -12 737 -202 -716 430 614 -643 -445 814 214 -928
1841i28R77R00j295n38J517R5j617M05J540q90j318J337R58j694m48J891j31j910
$$ -928 49 949 -346 -884 633 728 -889 -484 1056 166 -1152 185 1143 -551 -999 892 761 -1149
1859a149P37J738j300j373J762Q68k089k41K214m36k147J124J851j728j355K178
$$ -1149 -412 1326 26 -1347 415 1283 -806 -1047 1167 731 -1416 -292 1559 -169 -1524 654
1875F54P20k465K5K517p97k330J523J905k137j280K567N39k798L12K739j136k436
$$ 654 1374 -1091 -1066 1451 654 -1676 -153 1752 -385 -1665 902 1441 -1357 -1045 1694 558 -1878
1892a878J880J903k474j185K861L44l000N60K878j449k465K206J839k796r99L125
$$ -1878 2 1905 -569 -1754 1107 1451 -1549 -989 1889 440 -2025 181 2020 -776 -1775 1350
1908A350O2l193R09K953j827k427K593J671l148p22L407l32l348J371K956k291
$$ 1350 1412 -1781 -872 2081 254 -2173 420 2091 -1057 -1779 1628 1296 -2052 -681 2275 -16
1924a6k274L013J364l458l21L589p78l372J813K851k700k046L350J045l676N3
$$ -16 -2290 723 2087 -1371 -1692 1897 1119 -2253 -440 2411 -289 -2335 1015 2060 -1616 -1563
1940a563L671j159l332K165K694k976j801L509P63l742L45L651j445l228K424
$$ -1563 2108 949 -2383 -218 2476 -500 -2301 1208 1971 -1771 -1426 2225 780 -2448 -24
1955b4K498l178j549L644M56l799O89L599j773l082K728K240l422j195L799L6
$$ -24 2474 -704 -2253 1391 1847 -1952 -1263 2336 563 -2519 209 2449 -973 -2168 1631 1667
1971A667l821J147L468k213k791L087J826l638p25L869m57l709J605L211k580
$$ 1667 -2154 -1007 2461 248 -2543 544 2370 -1268 -1993 1876 1419 -2290 -685 2526 -54
1986e4k430L301J418l701k98L787q48l513J900K921k770k087L379J066l669K6
$$ -54 -2484 817 2235 -1466 -1764 2023 1175 -2338 -438 2483 -287 -2374 1005 2071 -1598 -1572
2002a572L647j124l286K092K646k886j770L407P26l598L64L483j432l026K350
$$ -1572 2075 951 -2335 -243 2403 -483 -2253 1154 1880 -1718 -1354 2129 697 -2329 21
2017B1K300l050j350L449K74l514Q11L243j798k664K618J838l161q54L404j96
$$ 21 2321 -729 -2079 1370 1644 -1870 -1059 2184 386 -2278 340 2178 -983 -1837 1567 1371
2033A371l322J218K928k098k274K776J394l152m48L260n43l072J456K608k216
$$ 1371 -1951 -733 2195 97 -2177 599 1993 -1159 -1607 1653 1110 -1962 -506 2102 -114
2048a14j932K759J097l060j62L061p48k798J571K310k252j598K690P78k904J07
$$ -114 -2046 713 1810 -1250 -1412 1649 901 -1897 -326 1984 -268 -1866 824 1602 -1302 -1195
2064a195K827r53k497J706J950k268j243K611M34k692L82K542j165k141J799J567
$$ -1195 1632 679 -1818 -112 1838 -430 -1673 938 1372 -1320 -938 1604 439 -1702 97 1664
2080A664k243q60K474P7k453O61K223j331j782J834J204k170n30K297j74k190
$$ 1664 -579 -1439 1035 1112 -1341 -680 1543 212 -1570 264 1468 -702 -1232 1065 891 -1299
2096a299Q28J896j382j446J769R00k010k75K040l31j890Q74J590j319j160J625
$$ -1299 -471 1425 43 -1403 366 1266 -744 -1019 1021 690 -1200 -326 1264 -55 -1215 410
2112D10O61j787r0J752m24j584Q81J272j233q62J449M11j539O4J472m90j272Q56
$$ 410 1071 -716 -806 946 522 -1062 -181 1091 -142 -1004 445 856 -683 -619 853 363 -909 -53
2130e3R69j126o09J273K04j287J84J185n38r75Q16O72r65l69J035M5j002K59Q81
$$ -53 916 -210 -819 454 658 -629 -445 740 202 -773 43 715 -250 -619 416 461 -541 -282 599
2149E99n04o74O73M47p66k07P83m5p03K37N87l79m44M79K63n11r4N03n2m55J80
$$ 599 95 -579 94 541 -225 -432 351 306 -397 -160 427 48 -396 83 346 -165 -259 244 192 -263 -83
2170h3L46k54k48L08J29k94m2K71m2k16R6J48j22r0J15L0p2qM8onj6k7O7K6j11
$$ -83 263 9 -239 69 198 -96 -138 133 91 -125 -29 119 -3 -93 22 52 -20 -28 20 14 9 -7 -34 33 59 -52
2196e2qJ60m3j81J06J91j99j42K66R1l49K0L80j45l72K70L21m00k18M91Q6n58
$$ -52 -60 100 57 -124 -18 173 -26 -168 98 189 -160 -140 240 95 -277 -7 314 -86 -304 187 273 -285
2218b85J02N48k72n06M40L96n94k22O87L5p50K07P04m36o05O52M37q19j80R05
$$ -285 -183 365 93 -413 27 423 -171 -393 294 329 -421 -214 490 54 -551 101 538 -281 -461 444
2238D44q2r18L65Q53o51o77Q82M19j046j02J120k46j085N91R42q95o78J116L51
$$ 444 362 -556 -191 662 11 -666 216 635 -411 -513 607 361 -724 -133 809 -86 -764 352 703
2257G03j256K1J285m30j198Q04R82j113o65J335K67j440J69J409n84j266R79R90
$$ 703 -553 -532 753 323 -875 -71 911 -202 -867 468 735 -705 -536 873 289 -977 2 992
2275I92j293o17J511J68j592L11J530p91j306J204R73j525n20J708Oj741N41J600
$$ 992 -301 -918 593 761 -831 -520 1010 219 -1087 117 1090 -435 -955 753 759 -982 -441 1159
2293A159j056j286J460Q44j735l28J866k46j806P96J582j281j202J648P13j886
$$ 1159 103 -1183 277 1121 -614 -942 924 678 -1128 -332 1250 -31 -1233 415 1128 -758
2309g58j50J940m32j835R91J540j455j115J802O00j997MJ999n90j847J163J505
$$ -758 -908 1032 600 -1235 -244 1296 -159 -1274 528 1128 -869 -865 1134 544 -1303 -140 1365
2326A365j614j028J927M45k081J93K031q06j800J357J400j797q38K045K25k125
$$ 1365 -249 -1277 650 1095 -986 -793 1238 432 -1368 -11 1389 -408 -1246 799 1024 -1101
2342a101M36J987j047j671J554J210j937o14K126m4k108O81J896j259j513J726
$$ -1101 -665 1322 275 -1396 158 1368 -569 -1183 943 899 -1209 -528 1368 109 -1404 322
2358C22R81k022l86K145k57k063Q75J814j423j391J855Q27k097j91K145m45k009
$$ 322 1303 -719 -1105 1040 783 -1280 -405 1409 -14 -1405 450 1277 -820 -1011 1134 689 -1320
2375a320J049J692j556j205J898O33k105OK094o34j892J210J528j687j006J977
$$ -1320 -271 1421 -135 -1340 558 1191 -914 -908 1186 552 -1340 -130 1398 -289 -1295 682
2391F82L99k094K44K010q55j740J380J318j781p71K002J45k023M70J870j029j548
$$ 682 1081 -1013 -769 1241 386 -1354 26 1344 -437 -1208 794 939 -1084 -614 1256 227 -1321
2408a321J497J091j830n24J987p6j938O51J738j190j358J576Q80j832l24J923
$$ -1321 176 1267 -563 -1087 900 824 -1114 -463 1275 85 -1273 303 1183 -649 -973 950
2424I50k63j832Q08J571j264j182J603O91j797j45J820m03j674Q88J398j301r97
$$ 950 687 -1145 -337 1234 -30 -1212 391 1082 -715 -860 960 557 -1117 -229 1169 -132 -1129
2441a129J599N01j735L2J702n43j517J009J200j353p73J573K83j649K25J545o75
$$ -1129 470 971 -764 -732 970 427 -1090 -81 1119 -234 -1007 566 849 -800 -575 970 295
2458B95j334J082R88j372n55J514Q2j511L79J365p71j116J098P75j314l78J394
$$ 295 -1039 43 1031 -341 -896 618 700 -811 -432 933 162 -954 144 919 -395 -773 621
2475F21m3j358M44J195p97r30J049O17j209k38J254j44j198M87J033p79p68R91
$$ 621 578 -780 -336 859 62 -868 181 798 -411 -649 605 461 -737 -250 783 4 -764 227
2493B27M52j090j24J105k10j025N33Q34p62n77R05K82r69L2R20k89q16N33O14
$$ 227 679 -411 -535 570 360 -665 -132 702 -60 -637 268 550 -419 -387 533 244 -572 -39 575
2512E75o98l91P93J45q05R9P48l21o44N03M49o09k41O52O1o70J62N77l09m65M26
$$ 575 -123 -514 279 424 -381 -282 466 145 -499 4 453 -156 -397 255 316 -354 -192 385 76 -389 37
2533C7L17m96j56N27km99J50M30k62l34L55K06l93q8M01n3l41J48K69k25j81K54
$$ 37 354 -142 -298 229 227 -272 -122 308 46 -288 67 273 -120 -208 193 140 -201 -53 216 -9 -190 64
2555F4J08k66j9K47q0j84J16J33j43o9J37J1j08NR5m6l1L2L0m1pK0j5J7Jk0J1
$$ 64 172 -94 -113 134 54 -130 -14 119 -24 -93 44 55 -53 -48 47 1 -30 2 32 -9 -16 4 -11 6 7 -13 -2
2582bM7l6o0P6M5j01k0J27k2j54Q2J56j43j31K05Q1k55OK55r6k56J83K19k79j36
$$ -2 45 9 -51 25 70 -31 -51 76 54 -100 -18 138 -5 -136 69 150 -105 -99 156 60 -196 -13 206 -73 -209
2607b09L38L5l59O7L65j91l15L05K36l99j28M61om78J53M50k99l64M24K62n35
$$ -209 129 164 -195 -128 237 46 -269 36 272 -127 -255 206 200 -278 -125 325 26 -338 86 348 -187
2628a87r4N66q1n68K55N23m22m10N72K37o60n6P12j65o79L76N84n78m17P10K08
$$ -187 -281 285 204 -364 -109 414 -8 -418 154 391 -269 -325 387 222 -457 -81 503 -75 -492 218 426
2649D26p91J7Q15k78p47N17N95p05l96Q36J61q95J28Q64l89p73O42N93q34l38
$$ 426 -365 -348 467 189 -558 -41 554 -151 -547 289 450 -445 -317 547 158 -615 27 620 -214 -552
2669e52R41P1r89K39R26n31p76P70N57r54k71J042l0j049L55R60o45p83Q92N16
$$ -552 389 460 -529 -290 636 105 -671 99 656 -298 -569 473 443 -606 -251 709 64 -719 173 689
2689F89j071j96J140j52j108M71R71p63p43J001M49j145j03J187k53j123N92R52
$$ 689 -382 -578 562 410 -698 -227 744 -19 -762 239 688 -457 -560 627 374 -749 -157 795
2707G95q89o75J096L45j202QJ220l71j114P22Q83r75o07J178K41j269J58J220
$$ 795 -94 -769 327 672 -530 -522 698 327 -787 -65 818 -157 -764 414 655 -614 -456 764
2725G64n22j071Q42Q15j099m74J246J00j287K82J194o49j000R72O92j166l50J280
$$ 764 242 -829 13 828 -271 -745 501 601 -686 -404 790 141 -859 113 805 -361 -711 569
2743E69l3j279M24J146p67r04J023O09j208k38J284j48j244N37J081q46q38J109
$$ 569 536 -743 -319 827 60 -844 179 788 -420 -658 626 478 -766 -229 852 6 -832 277
2761B77M74j251r4J283k88j197O53R94r57o97J170L32j271N1J244m32j107P75
$$ 277 751 -500 -594 689 401 -796 -143 851 -106 -803 367 699 -572 -521 723 291 -816 -41
2779d1Q41j015n39J184J83j227J75J181n44j012Q49P51j064m22J181O6j202K89
$$ -41 800 -215 -754 430 613 -614 -439 742 198 -814 35 786 -278 -700 481 547 -655 -366
2797c66J105o12r11Q97O46j089l18J176l6j150L83J026p00q04R35N26j092j97
$$ -366 739 127 -784 113 759 -330 -648 528 492 -658 -275 751 51 -753 182 708 -384 -581
2815e81J140j57j082M86R10p54o85R64L78j063n3J069k67r74N50Q04p92n40R37
$$ -581 559 402 -680 -194 716 -38 -723 241 619 -444 -497 572 305 -669 -119 685 -107 -647 290
2834B90K56j009N8R79l41q69N98O71p85m42R21J64r48J33R00m03p76O28N72p80
$$ 290 546 -463 -405 574 233 -636 -38 633 -152 -594 327 491 -457 -324 576 173 -603 25 597 -183
2854a83l31Q62O9q80J91Q10m39o59O19M60p45k29P95j9p73K61O71m49n23N94L40
$$ -183 -514 348 417 -463 -272 538 99 -560 59 519 -226 -455 340 321 -452 -191 480 31 -492 102 442
2875D42o77j29P00q7o60K84N63m41m17N55K45o13m3O02j35n42K80M62m32l08N07
$$ 442 -235 -364 336 249 -411 -127 436 -5 -422 133 378 -235 -278 324 189 -353 -73 389 -43 -351 156
2896A56J42n32J2N17j70m39K95L39m01k05M35Q1m50O2M09j79l55K84K51l47j27
$$ 156 298 -234 -222 295 125 -314 -19 320 -81 -286 149 230 -220 -158 251 72 -283 1 252 -95 -222
2917b22L68J8l60R7L12j86k38K44J62k73o8K82j6k64R3K22j50j64J91Q9k15j7
$$ -222 146 164 -196 -99 213 27 -211 33 195 -78 -146 136 120 -144 -51 171 21 -143 48 137 -78 -95
2939i5K11n1j78J02J27j21q9J40L5j44J2J09k9r3O4M9p3j8O1jm7K0L4j8k7K7j6
$$ -95 116 65 -113 -11 116 -5 -94 46 81 -63 -51 58 29 -64 0 49 -24 -42 19 18 -29 -9 25 7 -20 7 -9
2966imL1k0rL1kk8PM9l6n1O7K8q0j7R4j1j07N2R9r5q6J43L1j61PJ81o3j81J20
$$ -9 -13 18 -2 -11 20 18 -10 -3 46 10 -41 26 54 -26 -43 51 40 -67 -15 84 -11 -97 46 77 -84 -77 104 41 -140 -20
2996b0J61j90j01K42K9k51L8K49j27k18K06J69k72q6L16jl16R3L02j89k54K87
$$ -20 141 -49 -150 92 121 -130 -92 157 30 -188 18 187 -85 -171 145 144 -172 -79 223 34 -220 67
3018F7J62l32q3L73l4l91J66L36k59k79L62J65m23m9M55q7m32K20L75l48k85M56
$$ 67 229 -103 -186 187 153 -238 -72 264 5 -274 88 253 -170 -219 236 149 -283 -63 312 -36 -321 135
3040A35J40m95j2N37j81m75L22L95m46k53N12J17n70O3N57k31n00L90L90n16k36
$$ 135 275 -220 -232 305 124 -351 -29 366 -80 -333 179 296 -274 -211 346 115 -385 5 395 -121 -357
3061c57N95O4o15J35N70k91n06M47L82n79k10O40J8o51J77O17l76n07N19L54o47
$$ -357 238 302 -313 -178 392 101 -405 42 424 -155 -365 275 293 -358 -181 436 60 -447 72 426 -221
3082b21j54O91m8o82K64O09m52m81N97L13o92q9P21j24o87L30O01n22m35O52K37
$$ -221 -375 316 268 -414 -150 459 7 -474 123 436 -256 -345 376 252 -435 -105 496 -26 -461 191 428
3103D28p33j5P48k23o82M24N53n80l81O96J62p48O1P39k81o70M90N17o57l20P44
$$ 428 -305 -320 428 205 -477 -53 500 -80 -461 235 397 -351 -290 449 168 -502 -12 505 -152 -472 272
3124B72J14p78J35P28l62o37N67M62p01k35P63Rp61K13P10m44n65O17L81p26j56
$$ 272 386 -392 -257 471 109 -528 39 501 -200 -435 328 337 -424 -211 499 55 -510 107 488 -238 -394
3145c94P69q2p47L06O61n09m91O50L05p59p2P57j45p17L67O00n48m38O87K25p57
$$ -394 375 293 -454 -148 513 4 -487 163 468 -291 -363 394 249 -468 -101 499 -49 -487 200 425 -332
3166c32J3P38k28o78M24N69o10l59P07J65p74P5P38k95o40M87M92o33k99P27P5
$$ -332 -319 419 191 -487 -63 506 -104 -463 244 409 -365 -290 448 153 -487 0 492 -141 -440 287 362
3187C62p34J45O84l44n86N31M13o43k22P11lp04K08O31l97n18N53L34o40j39O78
$$ 362 -372 -227 457 113 -473 58 471 -172 -394 317 314 -390 -182 449 52 -466 87 421 -219 -358 320
3208C20o3o68K70N65m18m61N69K76o37o9O54j24o07L10M99m36l71N47J91n97j2
$$ 320 257 -411 -141 424 6 -455 114 390 -247 -316 338 214 -393 -83 416 -20 -391 156 347 -250 -262
3229b62N99j66n39L36M15m43k93N30J34n57L4N33j94m64L16L68m31k32N02N9n04
$$ -262 337 171 -368 -32 383 -60 -353 177 311 -246 -212 321 127 -337 -21 347 -84 -316 186 245 -259
3250b59Q5M72k17m12L49K77m19j38M49J3m48J23M07k39l27L41K09l88q7L92k8
$$ -259 -174 298 81 -331 18 295 -124 -262 187 200 -248 -125 282 43 -284 57 266 -122 -209 183 155
3271A55l78J52L22k34k52L11J55l47n1L48n5l26J56K54k22k00K85J00k92j6K90
$$ 155 -223 -71 251 17 -235 76 231 -116 -167 181 126 -200 -44 210 -12 -212 73 173 -119 -135 155
3292A55p9k61J64J90k11j28K46M7k46K2K36j00j88J54J37j82p8K10pj84M6J86
$$ 155 76 -185 -21 169 -42 -170 76 123 -123 -101 135 35 -153 1 138 -44 -122 88 81 -103 -57 129
3314A29j18j25J34Q9j65rJ39k1j31N3J13q7q6J13L4j21PJ11l6q6N3O3o6l3O6M
$$ 129 11 -114 20 109 -56 -65 74 53 -78 -25 88 1 -85 28 62 -59 -52 59 23 -63 -10 53 -13 -46 20 24
3340B4n4mO6l1l6K1L6m5QL1j5rJ1Jj1J1K0k0kK6j3k5L2Pn4J7N1l2m8N0L1o7k4
$$ 24 -30 -34 32 1 -35 -14 22 -23 -15 16 1 -8 3 4 -7 4 24 4 2 28 15 -10 22 29 -25 -8 43 11 -37 13 44 -23 -47
3373d7Q7pr0L6P9o9n5Q1N0j19j7J37k4j24O8J08j14p9J56L2j72J1J81o7j74J28
$$ -47 40 33 -57 -21 58 -11 -66 15 65 -54 -71 66 42 -82 -14 94 -20 -99 57 89 -83 -72 109 42 -132 -4
3399dJ38j70p3K00J1k17N9K04j13j76J71J28k14p0K33J1k59P7K36j69j87K17J36
$$ -4 134 -36 -109 91 102 -115 -56 148 35 -141 30 158 -56 -126 107 118 -141 -64 172 3 -184 33 169
3422A69k64o0K83j9k92J20K56j96j97K47J47l15k1L18n2l26J64K62k32k02K99
$$ 169 -95 -155 128 109 -183 -63 193 -3 -200 47 194 -121 -142 176 124 -202 -38 224 -8 -210 89
3443H9J26l60lL63j11l36K13K73k89j93L41R4l90M3L68j41l38K48K62l37j56L76
$$ 89 215 -145 -148 215 104 -232 -19 254 -35 -228 113 207 -183 -140 228 87 -251 -3 259 -78 -234 142
3465A42N9m06P1L75j68l50K87K62l69j42M03J9m27J20L97k24l16L26K12m03r4
$$ 142 201 -205 -134 241 73 -277 10 272 -97 -239 164 183 -244 -124 273 49 -267 59 271 -132 -226
3486b26M34l0m29J67L80k77k97L68J84m28n8M41q0m21K08L58l07k71L92J40m27
$$ -226 208 178 -251 -84 296 19 -278 90 274 -154 -212 229 149 -272 -64 294 -13 -284 108 248 -179
3507a79j9M40j14m06K38L43l58k27M12J19m64L5M56j71m05K97K98l66j93M49M8
$$ -179 -198 242 128 -278 -40 303 -55 -282 130 249 -215 -180 276 105 -300 -3 295 -71 -264 185 233
3528B33m63Q3M29j98l81L37K64m08j44M54Pm70J42M09k57l35L51K27m25r9M62
$$ 233 -230 -147 282 84 -297 40 304 -104 -248 206 213 -257 -115 294 37 -298 53 280 -145 -244 218
3549B18n2m38J73L87k81l07L78J99m40o2M67q6m26K05L70l27k65M00J48m38nM36
$$ 218 166 -272 -99 288 7 -300 78 277 -163 -225 242 156 -270 -65 305 -22 -287 113 261 -177 -182 254
3571B54j22m02K51L17l36k26M10Q6m27M6M10j61l55K62K74l60j65L86N1m08P5
$$ 254 132 -270 -19 298 -38 -264 146 232 -195 -149 261 100 -255 7 281 -79 -244 142 193 -215 -140
3592a40L82j81l18K58K48l39j34L80K5m02J04L55j90l04K98J94l42q7L64j4l49
$$ -140 242 61 -257 1 249 -90 -224 156 181 -221 -117 238 48 -256 42 236 -106 -193 171 157 -192
3613a92J18L16k19k51L00J48l38m4L42o1l21J59K63k18j91K65J05l14j0L08p6
$$ -192 -74 242 23 -228 72 220 -118 -162 180 119 -202 -43 220 2 -189 76 181 -133 -143 165 89
3634H9k84J56K30k17j67K75Q0k87J1K67q8k45J68J88k23j09K54M1k66N7K20j12
$$ 89 -195 -39 191 -26 -193 82 162 -125 -114 153 65 -180 -12 176 -47 -156 98 139 -127 -70 150 38
3656C8j84J71J37k01p7K17%k15N9J88j01j56J59Q7j76m3J95k4j82O7J49j02j28
$$ 38 -146 25 162 -39 -116 101 101 -114 -55 133 32 -124 35 122 -54 -97 98 74 -108 -41 108 6 -122
3679a22J53N5j58j5J58k0j43N9J18j00p4J13L5j19LJ24m1r9O7R9j05m2J01J0r4
$$ -122 31 86 -72 -87 71 51 -92 -33 85 -15 -89 24 59 -60 -57 67 26 -73 -6 93 -12 -54 47 57 -37
3704c7J8Q2m4q4P5M9p4k8P8pq1L1N8l3m8M9J2m5pN2j9l7K7K7k5j4K9Pl7RL3k5
$$ -37 -19 63 19 -65 10 59 -15 -43 35 28 -53 -22 36 3 -45 4 16 -29 -36 16 -3 -40 -13 14 -11 -25 4 11 -26 -17 16 -9
3736ij0L4oj7LJ5pLOj0j4J8J2k4NJ9qk1J7J6m3KL8j7m1L9L3n0k5O1pn1J9M9l5
$$ -9 -19 15 9 -8 -5 10 3 6 12 2 -12 6 18 -6 -1 18 10 -11 6 22 -21 -19 19 2 -39 0 33 -17 -42 19 12 -39 -20 29 -6
3771fn1O2L3n4l2R2j7q4M7N9l7p2P8M7r7k4J20j5j06M1R7p7p5J07M0j27oJ31l8
$$ -6 -57 5 38 -16 -48 44 27 -57 -10 49 12 -60 18 65 -32 -56 64 49 -57 -16 81 4 -71 36 76 -51 -57 74 36
3800C6j23P9J01j27n7J33J9j40J8J52o2j40R9J07j29p2J76J1j83M5J58q3j35J31
$$ 36 -87 -8 93 -34 -91 42 61 -79 -61 91 29 -111 -12 95 -34 -106 70 81 -102 -57 101 18 -117 14
3824A4J16j78n1J92J1k00N8J75j11j58J75R0j94l5J95k1j99Q7J70j35j42J79Q3
$$ 14 130 -48 -99 93 104 -96 -38 137 26 -132 43 133 -61 -96 99 78 -121 -34 136 1 -141 38 121
3847A21k06k4K27m6k14J09J84j71j29K06P0k21qK30p2j96J16J73j69j16K23M8
$$ 121 -85 -109 118 72 -142 -33 151 -20 -149 57 127 -94 -102 128 56 -140 -24 149 -20 -136 87 135
3869A35k37K1K26q9j92J50J46k02r3K30K6k35M6K20j11k05J95J21k14o1K39rk55
$$ 135 -102 -81 145 56 -136 14 160 -42 -135 95 121 -114 -68 152 41 -164 31 152 -62 -123 116 107 -148
3892a48P9K25j46j82K05J10k27m2K51n2k25J08K06j65j67K24Q8k38j2K44n7k34
$$ -148 -69 156 10 -172 33 143 -84 -126 125 73 -152 -44 162 -3 -170 54 142 -96 -108 136 79 -155
3914a55J23K04j88j38K29P3k57PK48q4k20J38J88k05j17K39L8k50L2K43j08k08
$$ -155 -32 172 -16 -154 75 148 -109 -102 146 62 -158 -20 168 -37 -154 85 123 -127 -95 148 40 -168
3936a68J70J62k17r1K36J4k36M9K29j19j92J86J43k32q2K50Pk38P1K12j31j67
$$ -168 2 164 -53 -144 92 106 -130 -81 148 29 -163 23 166 -66 -148 102 109 -129 -58 154 23 -144
3958a44J79J24k23m5K31k9k24R2K01j64j48J95R5k31k4K33m4k10J03J75j52j32
$$ -144 35 159 -64 -109 122 93 -131 -39 162 -2 -150 45 140 -91 -115 118 74 -136 -33 142 -10 -142
3980a42J95O5k13lK02n5j91J25J48j54j17J90N5j92PJ99o5j83J20J33j54p8J76
$$ -142 53 118 -95 -98 104 49 -142 -17 131 -23 -140 50 105 -87 -80 119 54 -129 -9 124 -30 -108 68
4003F8M0j91K9J67q2j44J15J15j47o5J71mj61L7J57r1j14J07Q8j52l7J56j4j34
$$ 68 108 -83 -54 113 31 -113 2 117 -30 -95 76 72 -89 -52 105 14 -100 7 95 -57 -94 62 48 -86
4027h6O1J18q7j09J23O9j41k3J45k7j26N8J20q7q6J17M1j26nJ29l8j04N6R1q8
$$ -86 -25 93 6 -103 20 89 -52 -75 70 43 -83 -25 95 8 -78 39 80 -46 -51 78 40 -64 -8 83 -5
4052eo1J10Qj07K1R2m1q1O8N0p7k6P1J0r5L0P3m3o5P1L5o1k2P9j0p1M3M1m4l4
$$ -5 -66 44 52 -55 -34 58 17 -64 4 54 -23 -49 22 32 -63 -33 40 -3 -68 3 38 -23 -45 34 24 -47 -4 37 -7 -41
4082d1O1K7o2oO1l5l3L6M2n5k9N2Nm9NM9k7l0L3J7l5j4M1mm6K8L1k8j9K6Qk2M
$$ -41 20 47 -15 -21 40 5 -28 8 50 -5 -34 18 23 -26 -21 28 1 -29 4 21 -14 -28 13 9 -37 -9 22 -6 -25 1 9 -13 -9
4115iK0j3k2K3J4k1j0K7lrQRj7mK7qknJ7k1KJ7j4j3PJ4j7qK8j0k4J8J4k8j1K6
$$ -9 11 -2 -24 -1 13 -8 -18 9 6 -3 5 14 -3 -7 20 12 10 5 22 1 3 20 6 -7 0 14 -3 -11 17 7 -17 1 15 -13 -24 2
4151Bjl5J3L2j5j5J7K3l7NL1j8j7K1K2l9j6M0K7n9J1N7l2m2L4M3o3j5O9lp5J4
$$ 2 1 -34 -21 11 -4 -19 -2 21 -16 -11 20 2 -15 6 28 -11 -27 13 40 -19 -8 49 17 -25 9 52 -11 -26 43 40 -35 -21
4183b1N7l0l5L4M1o7j5P2j1p6L8N3n5n1P5K6p6oQ6j2p8M1P7o1o0P9L2q8lR3k5
$$ -21 36 6 -29 5 46 -21 -36 36 25 -51 -13 40 -15 -66 9 35 -41 -47 39 27 -51 -10 67 6 -54 25 57 -31 -34 59 34
4214C4r3O6P4q6m8Q8K9j06J1R2k4j02O0P5p9m7J01J0j12J6J07m7q9P6O3r3m0J06
$$ 34 -59 7 81 -5 -53 35 64 -42 -31 61 37 -65 -5 70 -9 -56 45 55 -57 -41 66 19 -70 6 69 -24 -64 42
4242D2Lj01K7J06p8p9Q8P2j07k6J05kj06L3J16q6q1R9N8j28pJ18j8j09N9R3j01
$$ 42 45 -56 -29 77 -1 -80 8 80 -27 -53 52 50 -56 -23 93 7 -74 25 83 -45 -52 66 48 -61 -2 91 -10
4269a0o5J01M2j11nJ26m7j08N9Q7r3n9J08L4j22QJ26m6j11Q4Q8j12n2J22K1j20
$$ -10 -75 26 68 -43 -48 78 31 -77 -18 69 -24 -83 25 59 -63 -55 71 25 -86 -2 86 -26 -78 44 65 -55
4295e5K5J14o6j02J03O7j17l3J28j7j16M7J20q6r3J02N5j13l5J32j6j24N9J04
$$ -55 -30 84 18 -84 19 86 -31 -64 64 47 -69 -22 98 12 -81 21 76 -37 -72 60 44 -80 -21 83
4319H3q8p8J09L8j22kJ21k3j25O3R8j01o3J20L5j06lJ29n6j06P5Q7j13l8J14K4
$$ 83 -5 -83 26 64 -58 -60 61 38 -87 -24 74 -27 -90 30 65 -41 -44 85 29 -77 -2 85 -28 -66 48 72
4345G2j16QJ17m1j11Q3O9r8n6J26K5j51L1J16n9j06R1P8j15m5J31Jj21L4J03o1
$$ 72 -44 -36 81 40 -71 12 81 -17 -73 53 78 -73 -42 74 15 -91 0 78 -37 -82 49 50 -71 -37 66 5
4371Eq1Q5P0j12l2J25j9j03M8R3n4q1Q2M9j11nR8qj00M7P1o3n9P5L8q5j7J07m1
$$ 5 -76 9 79 -33 -65 60 41 -62 -14 79 25 -56 26 75 -36 -41 57 49 -51 -4 67 4 -55 20 58 -27 -44 63 22
4400B2q9N8O5o5n4Q7K0q7jQ2l3o2M9O1p0l3Q4j0o5K1P6m1o4O4L1o5j1O2jo2K0
$$ 22 -67 -9 56 -9 -63 24 44 -43 -44 38 5 -57 -8 53 -17 -50 34 24 -41 -20 56 15 -49 15 46 -19 -30 32 31 -31 -11
4431a1N9l8m8N2L5o4j0N7j0n2L0M1n2k4M0K5n5KM7j8l7K8K5l5j4L3Rm1MN1k2k5
$$ -11 48 10 -38 14 49 -15 -25 32 22 -30 0 41 -11 -35 5 30 -25 -23 24 6 -31 -3 22 -13 -27 6 15 -26 -22 29 7 -18
4463a8K4K3l1j6M2Jl7ML0rl3K9K0k6nK2Rm4J3K3k1j0J5J0k8QJ3qk0J7J2j8pJ5
$$ -18 6 29 -2 -18 24 25 -12 -8 22 13 -20 9 29 3 -2 20 29 -15 -2 21 0 -10 5 15 -13 -5 8 0 -20 -3 9 -9 -16 -1
4497arj3J5K2k0j3J9MqJ7NprOJ0j9nQQj7K8j5JQnqrJ8pj1oK0jk0QJ3nk2K0jqJ2
$$ -1 -10 -23 -8 14 -6 -19 0 4 -4 13 18 11 2 8 18 -1 -6 2 10 -7 21 6 7 15 10 2 -7 11 4 -7 -13 7 6 -14 -6 7 2 -20 0 -1 -9 3
4539CRk3qJ3J4k6J5J3jj9J7Qj5pK4Ll1J3K3j2j6POj4mL3ml2J0K3k5j7J9K6m2j6
$$ 3 12 -11 -19 -6 8 -18 -3 10 9 -10 7 15 0 -7 17 20 -11 2 25 13 -3 4 10 -4 -8 25 21 -11 -1 22 -3 -20 -1 25 -17 -33
4575c3N5j0l6L0J7k9k5M8ll2rN0j4m0L1L5l9j9M2Rm8J9L8k9l2L1M4m5l4P1j0n3
$$ -33 22 12 -24 6 23 -6 -31 17 14 -18 -27 23 9 -31 0 35 -4 -23 19 28 -20 -1 37 8 -24 7 51 6 -28 43 33 -20
4607b0J4M3l5k7L8K2n9kO2j7n9K4N5m8l6M8L3o2KN6j0p3M0N8n4l2N7J9o4J2N6
$$ -20 -6 37 2 -25 13 35 -24 -26 36 19 -40 -16 39 -9 -45 3 36 -26 -24 32 22 -51 -11 47 -7 -39 18 37 -27 -15 41
4638D1j1o5M3L7m8k9P4lo9J3O6k8n4N0L4o3j6N9Mo6J7N5m3m0M1M4o8k5O7nn0K2
$$ 41 30 -35 8 45 -3 -32 42 39 -30 -17 49 21 -33 17 51 -12 -28 31 35 -31 -14 41 -2 -42 -1 43 -25 -50 17 12 -38 -16
4670a6O3n8m0O7J9o2lO9op1M0O5o5l6P0mn7QO8l1p5P0L7o2l6P9Rp3NO4k7n3N1
$$ -16 47 -11 -51 16 35 -27 -30 39 33 -38 2 67 2 -34 36 32 -25 -17 51 20 -55 15 52 -10 -46 33 42 -31 -26 38 11 -42 9
4703IM1n9l8P5Op5J4O9m1m8O5K6o6j4P5pq1L3P3n0m2N6L4o9j3P8j1p2L0N9n3l6
$$ 9 50 -9 -47 28 34 -41 -27 42 1 -47 18 44 -22 -36 39 32 -49 -16 57 7 -35 21 55 -14 -27 51 40 -32 -2 57 4 -32
4735c2O1J4o1kO6k3p1M2N6n5m8O1K8o3nP0l3n2L6N8o2m4P8J2o6J8M5j4m8L6M5
$$ -32 29 43 -18 -20 46 23 -48 -6 50 -5 -53 8 36 -27 -32 38 5 -47 -11 47 -15 -59 19 31 -35 -17 28 14 -34 2 47
4766D7n5j4M6J7o4J2N3k6l5L3L3n2j8M9Qo3K2M2k8m2L9J3m0pN3mn5K6L9l8l1L6
$$ 47 -8 -22 24 41 -23 -11 42 16 -19 14 47 -5 -23 26 34 -29 -7 35 7 -35 4 17 -23 -30 23 19 -36 -10 29 -9 -40 -4
4798dM1o1LM5j1l7J6M4k8l2N3mm3J4L2j5k7K7J1k4oK7Kl5K5J5k5k0L0J7l1j0K5
$$ -4 37 -24 -21 24 13 -24 -8 36 8 -24 29 25 -18 -4 28 13 -14 13 24 0 -6 21 23 -12 13 28 3 -17 13 30 -1 -11 14
4831A4Jl8K1J8k4pJ3K1k7lK1Jk4OK9l2jK3Ql5RK6nk8L1J3l2lJ7J2j6NJ1j7j7J5
$$ 14 15 -23 -2 16 -8 -15 -2 19 -8 -11 10 11 -13 -7 22 -10 -11 12 20 -15 -6 20 15 -13 18 31 -1 -4 13 25 9 14 25 8 -9 6
4867FK2k6mJ1pJLPl1QNNmkPpKQo%mRLj2J4Rqj1J1rLlPLj0J0mpJ2Nj3kLNlrQj2
$$ 6 28 2 -2 9 2 3 6 13 -18 -10 -5 0 -4 -6 1 -6 -4 4 -2 -2 -6 3 6 -6 8 17 9 -2 9 0 3 0 7 10 0 10 6 -1 11 16 3 1 4 9 6 -3 5 -7
4915gnRjj2PJ1j2Pj1J9pJJ0%k1J5Rj2qJ0MlmRJ7k1qK6k0JJ2Kj8mL3ql1K3Qj5j4
$$ -7 -12 -3 -4 -16 -9 2 -10 -3 -14 5 -2 -1 9 9 -12 3 12 0 -8 2 6 3 -1 8 25 4 -4 22 2 3 15 17 -1 -5 28 20 -11 12 20 5 -9
4956iQJ6k1J3J5j7l0J8J9j7j6L4j5j4J8J5k4j1J4K0k7J0J3Jl4K7K3l2oK5Mk8O
$$ -9 -1 15 -6 7 22 5 -25 -7 12 -5 -21 13 -2 -16 2 17 -7 -18 -4 16 -11 -1 12 13 -21 6 29 -3 -9 16 20 -8 -2
4989bL3k0k4J9K1l7qM1Km4KL7j8l4L5K3m7nM1%l4jL5rl4M2J9m5j1M6ll8J7K8k4
$$ -2 31 11 -13 6 27 -10 -18 23 25 -19 -17 20 2 -32 3 26 -21 -26 15 15 -19 -20 15 6 -28 14 33 -12 -23 23 20 -18 -1 27 3
5024Ck4L2L1n5MM3om7K5K8m0nK6J0l4kL4nm5L2L1n2j1L5qk5PM3l4l0L4K0m0qM4
$$ 3 -21 11 42 -13 -9 34 28 -19 6 34 -6 -11 15 25 -9 -11 23 18 -27 5 36 -16 -27 8 0 -25 -18 25 -9 -39 -5 15 -25 -33 11
5059A1Lm3J8M5m1j5L2J8l6j1N1on1M1K8l5l6N2J4n1lM8k7l4K8L1l3k3M1Nm3lM6
$$ 11 14 -29 -11 34 -7 -22 10 28 -8 -19 32 26 -25 16 44 9 -27 25 39 -12 -15 33 6 -28 0 31 -2 -25 16 21 -22 -25 21
5092B1k5l0J9M1m0k8N3J2m6J0M1j1n4M2L1n2k6O7On2J8L5k0l5L9K3m6k3N2ol2
$$ 21 -4 -34 -15 26 -14 -42 11 23 -23 -13 28 17 -37 5 36 -16 -42 25 31 -21 -3 32 12 -23 16 39 -7 -30 22 16 -16
5123a6RL6k8m1M0M4o3qM6j2l5PL6k5l5N4Om2PL9j0m1K2L5l4j8L8J2l6jL5pl2J4
$$ -16 -7 29 1 -40 0 44 -19 -27 19 7 -28 -21 15 -10 -45 9 15 -27 -20 19 9 -32 -10 25 -9 -27 11 23 -13 -14 21 14 -18 -4
5157dL4l3k0M2Ll9QK5pm1L5K9m0j9L7J7m5LK8k4j5J6K2k8j1L7Kl4PL0k1j5K6R
$$ -4 30 -3 -23 19 22 -17 -9 16 9 -32 3 32 -8 -27 10 27 -18 -15 13 -11 -26 -10 12 -16 -27 10 12 -22 -15 15 -6 -21 5 14
5191A4k7mK8mk8K4J4j1k1L5J7m8LL5k1k0K2Pk1j1L3Ml5J2Qmj8NJ8j8j2K8mj5O
$$ 14 -13 -17 11 7 -21 3 17 6 -15 20 37 -11 -8 27 6 -14 8 15 -6 -17 16 20 -15 -3 5 1 -17 -12 6 -12 -24 4 0 -15 -9
5226iK1j5j5J8K5k3j2J9Kk2MK1mj0J9Jk4MJ8pj3J1J2j2j1J4lj4%J7Jk0PPj9NQ
$$ -9 12 -3 -18 0 25 2 -10 9 11 -11 -7 14 10 0 19 20 -4 0 18 11 -2 9 21 9 -2 12 9 -5 -5 12 13 -7 0 7 -12 -7 1
5263ANj5jOJpkQrJ1NPj5%J8j7NMLJnLNPkrlkJ0kj3PJmLlJj0J6j2lkJ2k0J1K%j5
$$ 1 6 -9 -10 -4 -3 -10 -12 -4 -13 -2 3 10 -5 -5 13 -4 1 5 8 9 4 7 12 19 17 8 5 3 13 11 -2 5 6 2 5 2 3 -7 9 -3 -6 -8 4 -16 -5 -3 -3 -18
5311a8KJ1oPRNj2mOkpJ3J1j4j3K4J3k7%J9Jj9PKpoJ6Nk7NJ6lj9RQmj7J2Rk9J6
$$ -18 -16 -5 -11 -4 5 10 -2 -6 0 -2 -9 4 15 1 -12 12 25 -2 -2 17 18 -1 6 8 1 -5 11 16 -11 -6 10 7 -12 -3 5 1 -16 -4 5 -24 -8
5352hJ2qj9PK6k0jK2%k4QK3k3j5K8J6l1pL3j0j6QL0l2j5J9K4l6RJ8pl3J9J6k7
$$ -8 4 -4 -23 -16 10 -10 -11 11 11 -13 -5 18 -5 -20 8 24 -7 -14 19 9 -7 1 31 -1 -16 3 27 -9 0 18 11 -22 -3 13 -14
5387a4oL0Ol8J1K6j6l2L1Ok1j1M0nl4J5K9j9j3K4Oj7rL2pk8J8K6j9k6K9Ql1NK8
$$ -14 -20 10 16 -22 -11 15 -1 -33 -2 4 -17 -28 12 7 -27 -12 17 -2 -15 9 15 -2 -11 21 14 -14 4 30 11 -15 14 22 -9 -4 24
5422B4j0l6K1K4l2j8K9J1l0jL3j5k5J9K5l0k1M6rl2J5K9k9j7K8J3j8k5M1Nl5O
$$ 24 14 -22 -1 23 -9 -27 2 13 -17 -18 15 0 -25 -6 19 -11 -32 14 5 -27 -12 17 -12 -29 -1 12 -6 -31 10 15 -20 -14
5454a4M2k3l0L7J9l5j1L7j0l0J2L3l3k1M2Ll7ML4ql6K4Qj7k6L9Kl3JK8Lm6L6K9
$$ -14 28 5 -25 12 31 -4 -15 22 12 -18 -6 27 -6 -27 15 18 -19 -15 19 11 -25 -1 7 -10 -36 3 5 -28 -27 1 4 -42 -6 23
5488B3l5j2L9Jk8jM0k3k5L7J6l7j2M2Ml1QL3l0j8K1K0m1PK2ql5J1L5k5k8L1K0
$$ 23 -12 -24 15 16 -12 -13 27 4 -21 16 32 -5 -17 25 29 -2 6 39 9 -9 12 32 -9 -2 20 12 -23 -12 23 -2 -30 1 21
5521B1m4lM3jm2J4K3j9j6L5Ql1JL3nl6K2J7j9j6K4J3l5KK8ll5J8K3j1j4K0Ll5
$$ 21 -23 -26 17 16 -26 -12 11 -8 -24 11 19 -12 -11 22 17 -19 3 20 1 -15 9 22 -13 -11 17 14 -21 -3 20 9 -5 15 18 -17
5555a7QL5j9l6J2K6j9j0K3%k4JK9k1j6K2J3k7lL0Kj7kL4j8k1K5J2k5rL3Lk8%K4
$$ -17 -9 26 7 -29 -17 9 -10 -20 3 3 -21 -20 9 -12 -28 -6 7 -20 -23 7 9 -8 -10 24 6 -15 10 22 -3 -12 21 24 -4 -4 20
5590B0j0j9K2J1k6nJ8mk5J5Rk1mJ8oj7JJ9qpJ6Jj7oJ4J9j6J3J1j3j9K0Qj6jJ9
$$ 20 10 -9 13 24 -2 -7 11 7 -18 -3 6 -15 -19 -1 -7 -24 -23 -4 -12 -19 -3 -2 -19 -25 -11 8 -8 5 16 3 -16 4 12 -4 -5 14
5626A4ok1J6J0kk4K0JqLMOj5jMrmQOj3%PpjQOj1nJ1r%KMLlJNRmKkKMmjLkNj3J6
$$ 14 8 -13 3 13 11 -13 7 8 0 3 7 13 -2 -3 1 -8 -12 -4 2 -11 -11 -4 -11 -12 -4 2 -9 -14 -3 -12 -12 -10 -6 -3 -6 -5 0 9 5 7 5 7 11 7 6 9 7 12 -1 15
5676A5pnLjnkKJ0j4RLj7lQQj4MOPk6K0Nj1nNNrJ0J3j1MLLj5jJ8mj0J0Jj8J1KJ2
$$ 15 8 3 6 5 0 -2 0 10 -4 5 8 -9 -12 -4 4 -10 -6 0 7 -19 1 6 -5 -10 -5 0 -9 1 14 3 7 10 13 -2 -3 15 11 1 11 12 -6 5 7 19
5720A9j0rJ0Lj7LJ6ppKLk3PJ9rj7J0%nJJ7j0j0RJ8jk3K1J6k1mJ7mj0J8ljk7J3
$$ 19 9 0 10 13 -4 -1 15 8 1 3 6 -17 -10 9 0 -17 -7 -7 -12 -11 6 -4 -14 -5 13 12 -11 10 26 5 1 18 14 4 22 19 18 -9 4
5759DJ5j6nK4j2j8J9Pj2j5J5Jk0QJ6j8j2K2Kk1NJ8Kk6J4J6j7j7J7K2l1J3K4rk7
$$ 4 19 3 -2 22 10 -8 11 18 6 -9 6 7 -13 -5 11 -7 -19 3 5 -16 -11 7 9 -17 -3 13 -4 -21 -4 18 -13 0 24 15 -12
5794a2K5J5j9k4L1Qk3oJ1jmOJ1k4nJ3J4k2oL5k2k6K2K3l1j5K3J2l0PL3k7j4RK3
$$ -12 13 28 9 -15 16 24 1 -5 6 5 1 7 18 -6 -11 2 16 -6 -12 23 1 -25 -3 20 -11 -26 -3 9 -21 -14 19 -8 -22 -13 10
5829A0k4%K3nk5J6K4j9j1K1J5k4LK4j3k6RL3k5k8M1%l0MJ9nl2J9K9l6j5K3J3k8
$$ 10 -14 -14 9 4 -21 -5 19 0 -11 10 25 1 4 28 15 -11 -2 31 6 -22 19 19 -11 -7 12 7 -25 -6 23 -13 -28 -5 8 -20
5863b0kL9j3k8K4J8l0j7K8K2l4PJ0Nl1K9J5k1j5M0Nl7J4J8j6j6J9J7k8j2K6J1
$$ -20 -22 17 4 -24 0 18 -12 -29 -1 21 -13 -6 4 9 -22 7 22 1 -14 26 31 -6 8 26 10 -6 13 30 2 -10 16 27
5895B7m2J7Qkl3K7J1k2j3L8j4k0NK4k3j1K3K0l0PJ5pk0J2K4k9jK0J2j8oK6j3k0
$$ 27 -15 2 10 8 -25 2 13 -9 -22 16 2 -18 -13 11 -12 -23 0 20 -10 -3 12 5 -15 -3 21 -8 -9 11 23 5 -1 25 12 -8
5929hJ7Pj1j6L7kl6J0K1j0k3J0K3l1oK0jj4MJ3j2j8J2J1j1%J5Jk5PK3j2jJ0Ko
$$ -8 9 16 5 -11 26 24 -12 -2 19 9 -14 -4 19 -12 -18 2 1 -13 -9 4 -8 -26 -14 -3 -14 -14 1 2 -23 -16 7 -5 -6 4 6 0
5965@%J6mj5kK5mk4K3Jk3RRLj8J1%kk0K5Mk4lJ3%k8OK0qj3K9pj5jJ8mj9J8J1q
$$ 0 0 16 12 -3 -5 20 16 -8 15 16 -7 2 11 14 -4 7 7 5 -15 10 14 -10 -13 0 0 -28 -22 -2 -10 -23 6 -1 -16 -17 1 -3 -22 -4 7 -1
6005akJ4j1jRMkrjJ4kj1JJlLMkj5K2mj3pJ5Pj8oJ1q%OjPj6J5Mk5J6KmJJkJ1Pq
$$ -1 -3 11 0 -1 8 12 10 1 0 14 12 1 2 3 0 3 7 5 -10 12 8 -5 -12 3 10 -8 -14 -3 -11 -11 -5 -6 1 -15 0 4 -21 -5 -3 -7 -6 -5 -7 4 11 3
6051CJ1j2MoMJ0oJ2qMrKLj1J2pJ0j1kPpmrK2j1nJ0j3kQJjnPJ3j4kMNj2MRnpJ2
$$ 3 14 2 6 0 4 14 8 20 12 16 7 9 12 1 13 6 16 5 3 10 3 -1 -10 12 1 -4 6 -7 -9 -1 0 -1 -6 1 14 0 -2 2 7 -5 -1 8 3 -4 8
6096HLlNOqokJ9j4KJRj8rRRj3RnMj4J0Mj3LJ1nj5J6jklOK%oJ2Mj4NJ5k0mOK2k3
$$ 8 11 8 13 19 11 5 3 22 8 10 11 20 2 -7 2 11 -2 7 2 6 -8 2 6 -7 -4 7 2 -13 3 2 0 -3 3 5 5 -1 11 15 1 6 21 1 -3 3 25 2
6142BJJ9k1QJK0k0nJ3pk4K4J1j0qMQk1j1K4J0k7NJLj3NJ6j3kJ5mj5OK5j8mJ7R
$$ 2 3 22 1 9 10 30 10 5 18 11 -13 11 22 12 4 8 16 -5 -16 8 18 -9 -4 -3 0 -13 -8 8 -5 -7 8 4 -11 -5 20 2 -2 15 24
6181B4k5mL3mk5KK3j3qJ3Mk3LK3j0k1J3Mqj6J8J2l1pK6lk9K8K0k9pJ9Nk1PK9j8
$$ 24 -1 -5 28 24 -1 1 24 11 3 16 20 -3 0 23 13 -8 5 9 1 -15 3 15 -16 -23 3 0 -29 -1 19 -10 -17 2 7 -14 -7 22 4
6218Dk6K3J5k7KK9j0k0J2K1qk0J2MpjJ8j1j7RJ3rk4K0J6l5%K7j8j3J5J6j5j2K8
$$ 4 -22 1 16 -11 -9 20 10 -10 2 23 15 -5 7 11 4 3 21 10 -7 2 15 6 -18 2 18 -17 -17 10 -8 -21 -6 10 -5 -17 11
6253A1ok3OK3ml1K4J6k4MJ6Qk4OJ3mnRLj9jL1j0k6J1J6j5j4J2Qj7KJ8nk7LK5j4
$$ 11 5 -18 -12 11 7 -24 0 16 -8 -4 12 20 -4 2 15 11 6 15 18 -1 -2 29 19 -7 4 20 5 -9 3 11 -6 -4 14 9 -18 -15 10 -4
6291dj2J8Kk4oL0kj6J6J9j6k6L1mj7OK6qk1J0K1k5%J9Lk4LK6j2j9PPqrJ7Nk4O
$$ -4 -16 2 4 -20 -26 4 2 -14 2 21 5 -21 10 6 -11 -5 21 13 -8 2 23 -2 -2 17 20 -4 -1 25 13 -6 1 8 0 -9 8 13 -11 -5
6329eJ7j0j6J2mj7OKJ1j4QJ9j3mJ0J2j9LK5j0j6KK0qj3OJ5j2JRmj2J1Lj3j8K6
$$ -5 12 2 -14 -2 -6 -23 -17 -15 -4 -18 -10 9 -4 -8 2 14 -5 -2 23 13 -3 -1 19 11 -2 4 19 7 8 17 13 1 12 15 2 -16 10
6366A0Rk8MK5j6rlJ6kj9KJ6qnLKj2RMpJJ4Mj8LJ2Ok3K4Mj4%OJ0j4J0Lk1J3knk
$$ 10 19 -9 -5 20 4 -5 -8 8 6 -13 -11 5 -3 -8 -5 -3 -15 -6 -2 -9 -8 6 10 -8 -5 7 13 -10 14 18 4 4 10 20 6 16 19 -2 11 9 4 2
6408BPMpKj0QpJQj2oKN%nKqJ0oQJ3nnKNmKOPolJmjkJRljljqRkm%NnJkj1RnoRJ
$$ 2 9 13 6 8 -2 6 -1 0 8 -4 -10 -8 -3 -3 -8 -6 -14 -4 -10 -2 11 6 1 3 8 4 6 12 19 13 10 11 7 6 4 5 14 11 10 7 6 -2 7 5 1 1 6 1 2 0 -11 -2 -7 -13 -4 -3
6464cjnJ3%j1J2lqL%nJ0MqKPlPKjOrj1J0Qnl%J8k7JJ7j8jLoloJ2J8l0LJ1nj2J0
$$ -3 -4 -9 4 4 -7 5 2 -6 -3 -3 -8 2 6 -2 0 7 4 11 13 12 18 9 -2 8 16 11 8 8 26 -1 0 17 -1 -2 1 -5 -8 -14 -2 16 -14 -11 0 -5 -17 -7
6510gPj2KJ6mpJ1jRrO%jj3K2j4j1J3ojj0K0Kk0PJ5pj1RNj1nJ5Mj7j0K0rj6J5K
$$ -7 0 -12 -10 6 2 -5 6 5 14 5 11 11 10 -3 19 5 -6 7 1 0 -10 10 12 -8 -1 14 7 -4 5 10 -1 -6 9 13 -4 -14 6 -3 -19 -4 -2
6551bj4KK2j3j0PK5j7rOJ2JlJ1Rl3QJ8%k9L1%j9JK1lk0J5Lj8%RNl0J0PnpKJ4j6
$$ -2 -16 -14 8 -5 -15 -8 17 0 -9 -3 9 10 7 18 27 -6 2 20 20 -9 22 22 3 4 25 22 2 17 20 2 2 11 16 -14 -4 3 -2 -9 -7 7 -9
6592ioJ1J6k4J0Qlk1QK7j9pK6j0k4K9Okk3J7J3j8jK5rj4QJ6j8j3QPk4kK2rj5J2
$$ -9 -15 -4 12 -12 -2 6 3 -18 -10 17 -2 -9 17 7 -17 12 18 16 -7 10 23 5 4 29 20 6 14 30 12 -1 7 14 -10 -12 10 1 -14 -2
6630bRnj2J5Ok4LJ6pk4K6J4k5qK2J2k5JJ7jk3K1K2j9j6K5%j4qK5qk0K0Qk0j1J4
$$ -2 7 2 -10 5 11 -13 -10 6 -1 -25 1 15 -10 -18 4 16 -9 -8 9 8 -15 6 28 9 -7 18 18 4 -4 21 13 -7 13 21 1 -10 4
6667DJ4l1J4J5j8oNJ0rj6K5j3j7J8J8j0k1K1J0k3J1Pjj9J4OLnRjj8LJ8Pk9J4J1
$$ 4 18 -13 1 16 -2 -8 -3 7 -2 -18 7 -6 -23 -5 13 3 -18 3 13 -10 1 8 7 -12 2 8 11 6 15 14 -4 -1 17 24 -5 9 20
6704B0k2NJ5Jl0J4J2j8j6K0Pj5j3J9%j9J4%%rJK0j3j1K2npJ0J3j2JQJj1%J3Nj3
$$ 20 -2 3 18 19 -11 3 15 -3 -19 1 8 -7 -20 -1 -1 -20 -6 -6 -6 -15 -14 6 -7 -18 4 -1 -8 2 15 3 4 12 13 2 2 15 20 7
6742GkJ1mj3K6j1j0j1J5lj7J9Oj0KlMk4OJ8j2oJ3jKmkOpMkMqRJ3lpQPj8JJ6j0
$$ 7 5 16 12 -1 25 14 4 -7 8 5 -12 7 13 3 5 2 6 -18 -12 6 -6 -12 1 0 2 -2 -4 2 -5 -1 -3 1 -7 2 15 12 5 13 20 2 3 19 9
6785IkNKnkO%rMklqJ5j4%lJ0qj1J3JPlpnMkNkjNKj0K1ppNkJ1j2RnLknPjNj2KJ0
$$ 9 7 12 14 9 7 13 13 4 8 6 3 -5 10 -4 -4 -7 3 -5 -16 -3 -2 5 2 -5 -10 -6 -8 -3 -5 -6 -1 1 -9 12 5 -2 3 1 12 0 9 4 7 5 0 7 6 11 -1 1 11
6836A1j3J0j4LJ0j9Pk%MJKnkMkjoQpkJ9p%kJ1qQK%J3j1rJ8mnJ4j6j0OK0pmmKk6
$$ 11 -2 8 -6 -3 7 -12 -5 -7 -7 -3 -2 0 -5 -7 -3 -5 -6 -12 -4 -11 -13 6 -1 -1 -3 8 0 8 10 10 23 12 3 21 17 12 26 10 0 6 26 19 15 11 13 -13
6882a3QJ3%moljNmJ2j8JJ4j4j2K9lqnOJ4j3RJQj1kK4j8pJJ5j1lJ0jj5%J6pj5K0
$$ -13 -5 8 8 4 -2 -5 -6 -1 -5 7 -11 -10 4 -10 -22 7 4 -4 -9 -3 11 -2 7 8 16 5 3 27 9 2 3 18 7 4 14 13 -2 -2 14 7 -8 12
6924A2mj5P%lqlJ4ooJ3j2jNNrnJ2J3j7OJ0jk1J1J7%qJ1Kj2nJ8lolJ3rj4J3jj2
$$ 12 8 -7 0 0 -3 -11 -14 0 -6 -12 1 -11 -12 -7 -2 -11 -16 -4 9 -8 -2 8 7 -14 -3 14 14 6 17 19 7 2 20 17 11 8 21 12 -2 11 10 -2
6966bmK5j5j1PKk2MRJ0j5JJ5mj1J4Qj8JJ3jj1MRmrRRmqJ1knQLmkOJk3%L2j3j8
$$ -2 -6 19 4 -7 0 2 -20 -16 -7 3 -12 -11 4 0 -11 3 11 -7 -6 7 6 -5 -1 8 4 -5 4 13 9 1 12 10 5 13 16 12 10 16 17 -6 -6 26 13 -5
7010eNQk3RNQj6lJ8ok0J1J2j0j1J8j2j1J6J2rj0J4QNj1QJ1j9PPNk3J6Jkk1K4n
$$ -5 0 8 -15 -6 -1 7 -9 -12 6 0 -20 -9 3 -7 -18 0 -12 -23 -7 5 -4 -14 0 8 13 2 10 21 2 9 16 21 -2 14 15 13 -8 16 11
7049A1j7%J1pj2J1J2k2JJ1j4nPJ7oj1J0Ok2J3LPl1J4K0j4JJ9Nk8PJ4Qj4j2L4k1
$$ 11 -6 -6 5 -2 -14 -3 9 -13 -12 -1 -15 -20 -13 4 -2 -13 -3 3 -19 -6 -3 4 -27 -13 7 -7 -6 13 18 -10 -3 11 19 5 -7 27 6
7086Fj0J3Nk4J7PPk5J1LrqLJ3j3%Pqj4K4oq%NMk0J2J4j7QjK0j9RJkpRJ4j8N%m
$$ 6 -4 9 14 -10 7 14 21 -4 7 10 1 -7 -4 9 -4 -4 3 -5 -19 5 -1 -9 -9 -4 0 -20 -8 6 -11 -3 -4 16 -3 6 7 5 -2 7 21 3 8 8 4
7129DLj3K0qOpJ6j7j1PRj5oK0j0mpJ2jj2J6mn%J0q%kJ2j2RRKKj4NJ3j0OJ0j3j4
$$ 4 7 -6 14 6 12 5 21 4 -7 0 9 -6 -12 8 -2 -6 -13 -1 -2 -14 2 -2 -7 -7 3 -5 -5 -7 5 -7 2 11 13 15 1 6 19 9 15 25 12 -2
7171b%J4lNJj0jPkqKPpj1QPnljOj1lNJmJ1j1J0Lj0LoJ0qJ0OmJ1qLOKMrljlj1R
$$ -2 -2 12 9 14 15 5 4 11 9 1 3 10 3 -8 0 7 2 -1 -2 4 -7 -10 -5 -4 -8 3 -8 2 5 -5 -2 -8 2 -6 4 10 6 17 9 12 18 20 24 15 12 11 8 -3 6
7220FPpkjpJ0Nj9Qj0LJ0jj4LQj2J2mLlnMNKLPqkL%M%rJ2nlQl%pJ3mpJ3nj1J1n
$$ 6 13 6 4 3 -4 6 11 -8 0 -10 -7 3 2 -12 -9 -1 -13 -1 -5 -2 -5 -10 -6 -1 1 4 11 3 1 4 4 8 8 -1 11 6 3 11 8 8 1 14 10 3 16 11 0 11 6
7269FrnMoKl%Oj0J2jj1J0jOj0%OmJ%J3pKLLqJ2lLmO%j6OnJ0nmK0j8Oj1J3Kk4J
$$ 6 -3 -8 -4 -10 -8 -11 -11 -5 -15 -3 -4 -15 -5 -6 0 -10 -10 -4 -8 -7 -7 6 -1 1 4 7 -1 11 8 11 7 13 13 -3 3 -2 8 3 -1 19 1 7 -4 9 11 -13 -12
7316a2Nj6J8J1j7LQn%LjPm%J1j2jQJ1j1j3K6Ok1%R%j4J6kk0MJ1Kk1J4OqkLjjl
$$ -12 -7 -23 -5 6 -11 -8 0 -5 -5 -2 -3 4 0 0 11 -1 -2 6 17 6 -7 19 25 4 4 13 13 -1 15 13 -7 -3 8 10 -11 3 9 1 -1 2 1 0 -3
7359cLOj8PJ0j4lQ%kKJ4qmJ1lkjN%orK3pmPJ4j7mK1j9qJ3Qk2mK2j3qkRj1nLJ4
$$ -3 0 6 -12 -5 5 -9 -12 -4 -4 -6 -4 10 2 -2 9 6 4 3 8 8 2 -7 16 9 5 12 26 9 5 26 7 -1 12 20 -2 -6 16 3 -5 -7 2 -9 -14 -11 3
7404Cj3j5K2oqJ1Qnj3K5JrmRj2oOK3Kk4J3J1k5LJ6Mj7JJ1j2jlJ7pk4K0qjmQJk0
$$ 3 -10 -25 -3 -9 -17 -6 2 -3 -16 9 10 1 -3 6 -6 -12 -6 17 19 -5 8 19 -6 -3 13 17 0 1 12 0 -1 -4 13 6 -18 2 -6 -7 -11 -3 -2 -22
7446b2J0J1jqOnj1J9QpjNpJnQRrPLJj4NOj1LJ2Oj7%J2j4mNJ7j8Jjjj0JRj1OOr
$$ -22 -12 -1 -2 -10 -4 -9 -20 -1 7 0 -1 4 -3 -2 -7 1 10 1 8 11 12 -2 3 9 -2 1 13 19 2 2 14 0 -4 1 18 0 1 0 -1 -11 -10 -1 -12 -6 0 -9
7492ij4QJ0KMmJj3J8jl%jJ3rj6J4J1n%jLknJ0rrJ2LmRj7Kj1J4Oj7MNj1J1pnJ3
$$ -9 -23 -15 -5 -3 1 -3 -2 -15 3 2 -1 -1 -2 11 2 -14 0 11 6 6 5 8 6 1 11 2 -7 5 8 4 13 -4 -2 -13 1 7 -10 -6 -1 -12 -1 -8 -13 0
7536@j0%NJj0J1J0oj6K4j1kJRNPppMPnpmJ1Jj9J5loKj1J0orMJJPlPj6QlO%Jq%
$$ 0 -10 -10 -5 -4 -14 -3 7 1 -15 9 -2 -4 -3 6 11 18 11 4 8 15 10 3 -1 10 11 -8 7 4 -2 0 -11 -1 -7 -16 -12 -11 -10 -3 -6 1 -15 -7 -10 -4 -4 -3 -11 -11
7584a1RJ0l%JnjmJ4KmLnKMqNpP%KmrKmnnQpJ2j3PPj0j%J2j5jNkKRmMJ0rpK1j1
$$ -11 -2 8 5 5 6 1 0 -4 10 12 8 11 6 8 12 4 9 2 9 9 11 7 -2 0 -4 -9 -14 -6 -13 -1 -14 -7 0 -10 -11 -11 1 -14 -15 -10 -12 -10 -1 -5 -1 9 0 -7 14 3
7634ClLkjNPkj1J5plPqMknPj1%JpK%QmmNj4ONj5J4nNkj1OK8j9mJ3LnP%oKkKLj
$$ 3 0 3 1 0 5 12 10 -1 14 7 4 11 3 7 5 0 7 -4 -4 -3 -10 -8 -8 0 -4 -8 -3 -17 -11 -6 -21 -7 -12 -7 -9 -20 -14 14 -5 -9 4 7 2 9 9 3 5 3 5 8 7
7685GnOJpRrnKMKj1Oj3KJ2pk%oJ0lmkRj8OJ4rjJ5j1nJ1kJ5j2PPnkLJ0j2j2K6q
$$ 7 2 8 9 2 11 2 -3 -1 3 5 -6 0 -13 -11 1 -6 -8 -8 -14 -4 -7 -11 -13 -4 -22 -16 -2 -11 -12 3 -8 -13 -2 -4 11 -1 6 13 8 6 9 19 7 -5 21 13
7731A3rJNj3JNomOolpJ4Pj1nJNj2kK4j3%%J3j3MJ3mJj6K6j7J1O%rLLo%%OpJ0j3
$$ 13 4 5 10 -3 -2 3 -3 -7 -1 -7 -10 -17 -3 4 -7 -12 -11 -6 -18 -20 4 -9 -9 -9 4 -9 -5 8 4 5 -11 15 -2 9 15 15 6 9 12 6 6 6 12 5 15 2
7777BJ3oj6OKj6J7pmMKnpRMpqJ6pk%%N%j2K3omJ2Jkj0J0NqkJ0j4RNQlj6OnM%J
$$ 2 15 9 -7 -1 1 -15 2 -5 -9 -5 -3 -8 -15 -6 -2 -9 -17 -1 -8 -10 -10 -10 -5 -5 -17 6 0 -4 8 9 7 -3 7 12 4 2 12 -2 7 12 20 17 1 7 2 6 6 7
7825Gj2j7K1LnrJ1nmMmQnjMKpJ3nRkMjlPlorJ8koOPj1MmQkj%j2%OJj6J2lqj2J1
$$ 7 -5 -22 -1 2 -3 -12 -1 -6 -10 -6 -10 -2 -7 -8 -4 -2 -9 4 -1 8 6 10 9 6 13 10 4 -5 13 11 5 11 18 7 11 7 15 13 12 12 0 0 6 7 -9 3 0 -8 -20 -9
7875ikKJ%OljR%j1NOl%OMj5RkJKkJ0JpPkokPJrR%j3OJnj0J2JnMj5Qr%J8j0JNj
$$ -9 -11 -9 -8 -8 -2 -5 -6 3 3 -8 -3 3 0 0 6 10 -5 4 2 3 5 3 13 14 7 14 12 6 4 11 12 3 12 12 -1 5 6 1 -9 3 4 -1 3 -12 -4 -13 -13 5 -5 -4 1 0
7927@LNj3J4jJqJ5qQ%l%JNkkj2J0%mJomJ1mnrOMqpJ7j0LNkj1lMJ0jj5J0mKJ1k
$$ 0 3 8 -5 9 8 9 1 16 8 16 16 13 13 14 19 17 15 3 13 13 9 10 4 0 11 7 2 -7 -1 3 -5 -12 5 -5 -2 3 1 -10 -13 -9 1 0 -15 -5 -9 -7 4 2
7975BJ3Kj7JJ1jpRp%RqjmJJ4j7NnJ1qjJpMlmLOj7JPJkMmNoJJ3kJpJ3K%%JojjJ1
$$ 2 15 17 0 1 12 11 4 13 6 6 15 7 6 2 3 17 0 5 0 11 3 2 3 -4 0 -3 -7 -4 2 -15 -14 -7 -6 -8 -4 -8 -3 -9 -8 5 3 4 -3 10 12 12 12 13 7 6 5 16
8027A6KnqJMkPmpP%j3nJ6jj0j1MlN%MqoJ3PrKRnQjljOnPNKjjj1%J0j0JRrjpJ4
$$ 16 18 13 5 6 10 8 15 11 4 11 11 -2 -7 9 8 -2 -13 -9 -12 -7 -7 -3 -11 -17 -4 3 -6 -4 5 0 8 7 4 3 9 4 11 16 18 17 16 5 5 15 5 6 15 6 5 -2 12
8078A2%j2kRjj1LNj7P%Kn%J4oj1jJ2%kPPqnNRj1J0NrMjrJ1kQj1ljPoMqjKm%JQ
$$ 12 12 0 -2 7 6 -5 -2 3 -14 -7 -7 -5 -10 -10 4 -2 -13 -14 -2 -2 -4 3 10 2 -3 2 11 0 10 15 6 10 9 0 11 9 17 6 3 2 9 3 7 -1 -2 0 -4 -4 -3 5
8128EqJmoOjmN%moJ1nKkJ7qnJJ4nj1K1j0pJ0QoLj4J0pM%KoQooj0J4%j1KNrkPN
$$ 5 -3 -2 -6 -12 -6 -7 -11 -6 -6 -10 -16 -5 -10 -8 -10 7 -1 -6 -5 9 4 -7 14 4 -3 7 15 9 12 -2 8 1 5 5 7 1 9 3 -3 -13 1 1 -10 -8 -3 -12 -14 -7 -2
8177bj3pJ1J0j1NNqkkJ1mRJ
$$ -2 -15 -22 -11 -1 -12 -7 -2 -10 -12 -14 -3 -7 2 3
8191C
$$ Imaginary data points
##PAGE= N=2
##DATA TABLE= (X++(I..I)), XYDATA
0@%%%%%%%%%%%qJ6j6J6k4L2m0M8n6P2q8J04j20J44j76K00k25K65l10L54m03M56
$$ 0 0 0 0 0 0 0 0 0 0 0 0 -8 8 -8 8 -16 16 -24 24 -32 40 -48 56 -64 80 -96 104 -121 144 -166 188 -215 241
33B41n16N87o63P43q32R34j044J161j291J434j590J760j944K146k369K611k876
$$ 241 -275 312 -351 392 -440 494 -550 611 -680 754 -836 924 -1020 1126 -1243 1368 -1508
50a508L168l489L847m242M682n180N742o382P122p988R019j0269J1819j3803J6449
$$ -1508 1660 -1829 2018 -2224 2458 -2722 3020 -3362 3760 -4228 4791 -5478 6341 -7462 8987
65H987k0166K5807l5466N6305j75366J86911K79194n13568m1971M69107o7954
$$ 8987 -11179 14628 -20838 35467 -139899 47012 326206 -187362 -229333 239774 171820
76A71820m76726K32195L82327l18744k93687M10630J47797m37616k1767M48617
$$ 171820 -304906 -72711 309616 -9128 -302815 107815 255612 -182004 -203771 244846
86B44846j16259l97388K20236L23277l18351k12741L75575J03645m02038J7893
$$ 244846 128587 -268801 -48565 274712 -43639 -256380 119195 222840 -179198 -161305
96a61305L80109j29809l33190K32238K56295l02928j64042L45024N6120l50979
$$ -161305 218804 88995 -244195 -11957 244338 -58590 -222632 122392 178512 -172467
106a72467N1671L28984j52452k78363K31079K05082k84841j11965L11717J3148
$$ -172467 -120796 208188 55736 -222627 8452 213534 -71307 -183272 128445 141593
116A41593l12297P9708K82123j59500k25149K23476J50426k64972o7528K79572
$$ 141593 -170704 -90996 191127 31627 -193522 29954 180380 -84592 -152120 127452
126A27452j6520k66424R4841K28659j61597j72597K10835J05869k36700l3897
$$ 127452 110932 -155492 -60651 168008 6411 -166186 44649 150518 -86182 -120079
136a20079K37430l8994k17251J05216J80816j56314j30053J88897O8958k03191
$$ -120079 117351 78357 -138894 -33678 147138 -9176 -139229 49668 118626 -84565
146h4565m891J99189n5335j77704J06529J41155j44800r3083J68346L8837j76373
$$ -84565 -89456 109733 54398 -123306 -16777 124378 -20422 -113505 54841 93678 -82695
157h2695J4857J67843o3297j43199J04301J06810j34633o4038J50204J8056j50290
$$ -82695 -67838 100005 36708 -106491 -2190 104620 -30013 -94051 56153 74209 -76081
168g6081K7600J36862o8114j12176R9726P9029j19796m0948J27060J380j22098
$$ -76081 -48481 88381 20267 -91909 7817 86846 -32950 -73898 53162 54542 -67556
179f7556L5841J07102o6356q3781Q7380N3771r8994k1088J01403r787r4055L6521
$$ -67556 -31715 75387 9031 -74750 12630 66401 -32593 -53681 47722 37935 -56120 -19599
191a9599P8301n7641n6935P1566L2610p7687q047P6074j4377o7307L3170N3127
$$ -19599 58702 1061 -55874 15692 48302 -29385 -37432 38642 24265 -43042 -9872 43255
203D3255m7398l6123N5631J8271n7113l56N3131j5840m5246K8073L4122l5834
$$ 43255 -4143 -40266 15365 33636 -23477 -23833 29298 13458 -31788 -3715 30407 -5427
215e427k1087L9197P920l8232M097L3771j3649k6804J9838J8216k2602r116K2553
$$ -5427 -26514 12683 20603 -17629 -13532 20239 6590 -20214 -376 17840 -4762 -13878 8675
228H675J268k0079M293J5272p759r648R102M727q000r43N191j230j660J328j864
$$ 8675 9943 -10136 -5843 9429 1670 -7978 1124 5851 -2149 -3092 2099 869 -791 537 -1327
243a327M03M262l503m837P524L539j1594n25J4446m271j5274J0499J4162j6832
$$ -1327 -924 3338 -165 -5002 2522 6061 -5533 -6058 8388 4117 -11157 -658 13504 -3328
257c328j0705K2124M625k5908L339K7280j2386k5563K1619K0767k9724j2876L5608
$$ -3328 -14033 8091 12716 -13192 -9853 17427 5041 -20522 1097 21864 -7860 -20736 14872
270A4872K344l8576R835L7925k2136l3080L3449K4041m2766j1821M8521k629m9673
$$ 14872 17216 -21360 -11525 26400 4264 -28816 4633 28674 -14092 -25913 22608 19979 -29694
283b9694J8233M5991l3226l7417M5989K4377n5164q158N9440r870n8001K8117
$$ -29694 -11461 34530 1304 -36113 9876 34253 -20911 -29069 30371 20501 -37500 -9383
295i383N0856m4670l8542N7608K1809o5492k014O7672j8770o3451L8563N2872
$$ -9383 41473 -3197 -41739 15869 37678 -27814 -29828 37844 19074 -44377 -5814 47058
307D7058n5621l6889O8056J6739p4499N863P4212k8726o6884M9708N2840o6852
$$ 47058 -8563 -45452 22604 39343 -35156 -29293 44919 16193 -50691 -983 51857 -14995
319a4995l3231P8395R884q2836J5268P9464l9984o8574O1631N0806p8056k7616
$$ -14995 -48226 30169 40053 -42783 -27515 51949 11965 -56609 5022 55828 -22228 -49844
331d9844Q7639J219q9126K5962Q2147n1338o7326P2341M5935q6826j9825R3401
$$ -49844 37795 39014 -50112 -24150 57997 6659 -60667 11674 57609 -29217 -49042 44359
343D4359q527r1405L6285Q0831o0893o2551Q0137L8493r2056j0714R5486j8230
$$ 44359 35832 -55573 -19288 61543 650 -61901 18236 56729 -35327 -46041 49445 31215
355C1215r0243M5587P6648o8961n5916Q6177K9947r5611j045R6293k8237q8069
$$ 31215 -59028 -13441 63207 -5754 -61670 24507 54454 -41157 -42202 54091 25854 -62215
367f2215N5274P1739p7422m8550R2600K0486r9448R753R7007l9451q5440O5829
$$ -62215 -6941 64798 -12624 -61174 31426 51912 -47536 -37783 59224 19773 -65667 162
379A62O5775q6205l9705R8662R678j01948K1440R5621n0616q0268P5085N7329
$$ 162 65937 -20268 -59973 38689 48367 -53581 -32141 63480 12864 -67404 7681 65010
391F5010r2531k9147J01235j633j00388L2164R0319n9377p1951Q0860M7070r4737
$$ 65010 -27521 -56668 44567 42934 -57454 -25290 65029 5652 -66299 14561 61631 -33106
403c3106j8213R9739j2060r5566M0906Q2719o5747o2468Q4372L6679r5137p684
$$ -33106 -51319 48420 36360 -59206 -18300 64419 -1328 -63796 20576 57255 -37882 -45566
415d5566R7223k1790r0413M9179P5288p2061n3349Q8230K6486r6257K855R5421
$$ -45566 51657 29867 -60546 -11367 63921 -8140 -61489 26741 53227 -43030 -40175 55246
427E5246l1867q5703N7972O8033p8670m4072R2013J6050r6721J3332R2414m1353
$$ 55246 23379 -62324 -4352 63681 -14989 -59061 32952 49002 -47719 -34387 58027 16674
439A6674p9598O5272N9513q2876l4096R2660N962r3745K2301Q6191m8025p0990
$$ 16674 -62924 2348 61861 -21015 -55111 37549 43511 -50234 -27933 58258 10233 -60757
451f0757O8813M9589q2938k4177Q9254k837q7387K8951P7698n1883o1196O9656
$$ -60757 8056 57645 -25293 -49470 39784 36947 -50440 -21489 56209 4326 -56870 12786
463A2786L9634q0735j4997Q4371j0533q0384L4588O9199n5103n1966P0329L0329
$$ 12786 52420 -28315 -43312 41059 30526 -49858 -15270 53929 -1174 -53140 17189 47518
475D7518p8902o251Q0184j8040p4128M0343O1374n8598m3167P1176K1241p7024
$$ 47518 -31384 -37635 42549 24509 -49619 -9276 52098 -6500 -49667 21509 42750 -34274
487c4274K225P5623k5071o7223M5136N2825o0498l3904O9911J2344p2597R667
$$ -34274 -32049 43574 18503 -48720 -3584 49241 -11257 -45161 24750 37094 -35503 -25836
499b5836O8494l0109n8257M7061M3010n9045k4492O5206M466o5160J5175N9262
$$ -25836 42658 12549 -45708 1353 44363 -14682 -39174 26032 30498 -34662 -19487 39775
511C9775l2582m8225M6348L3262n5341j5993N8973k045n7162J9201N0285l3965
$$ 39775 7193 -41032 5316 38578 -16763 -32756 26217 24172 -32990 -13789 36496 2531
523B531l9101M5152K4783n1848q664N3582p682n0377K2812M2634l5418l1242M4307
$$ 2531 -36570 8582 33365 -18483 -27147 26435 18753 -31624 -8812 33822 -1596 -32838 11469
536A1469J7295m8829k172M8682j2617m3940K5678L5334l5843k3780M2219J0520
$$ 11469 28764 -20065 -22237 26445 13828 -30112 -4434 30900 -4943 -28723 13496 24016
548B4016m4423L079M2357j5738l6483K6194K7600l3622j6693L7562N004l7773
$$ 24016 -20407 -17328 25029 9291 -27192 -998 26602 -7020 -23713 13849 18853 -18920
560a8920O400L4578j6468k8462K4273K0207k9347j0794L1460J077l0602Q046K7085
$$ -18920 -12520 22058 5590 -22872 1401 21608 -7739 -18533 12927 14004 -16598 -8552 18533
573A8533j5763k1388K1540J4190k4966o235K5861j719k4433Q955K0820j4859j5543
$$ 18533 2770 -18618 2922 17112 -7854 -14089 11772 10053 -14380 -5425 15395 536 -15007
586a5007J8957R258k0959k571K0857l790j8808R255J5141j3356j0375J5732N095
$$ -15007 3950 13208 -7751 -10322 10535 6745 -12063 -2808 12333 -1023 -11398 4334 9429
599I429j6350N3J5347m591j2947Q111R631j0310n824J1162K069j0763J217R352
$$ 9429 -6921 -6868 8479 3888 -9059 -948 8683 -1627 -7451 3711 5780 -4983 -3766 5586
613E586l801p260N439M855o156k472O037M21n244J126L989k019k576K250J269
$$ 5586 1785 -5475 -36 4819 -1337 -3809 2228 2649 -2595 -1469 2520 501 -2075 175 1444
628A444j966k71J222k55l18K75n52K25J208j126j384K253J015l346o7M158j365
$$ 1444 -522 -793 429 174 -144 131 -421 -196 1012 -114 -1498 755 1770 -1576 -1643 2515 1150
645A150m526L141M175n010l064O657J263p810J165Q232l908p712O701O201r198
$$ 1150 -3376 -235 3940 -1070 -4134 2523 3786 -4024 -2859 5373 1465 -6247 454 6655 -2543
660b543l753J1019N08j1871L159J1561o932j0009J0372P305j3134l545J4798q60
$$ -2543 -6296 4723 5231 -6640 -3481 8080 1148 -8861 1511 8816 -4318 -7863 6935 6075
674F075j5147N554J3987j0071j1426J3947P548j6767k631J8170k874j7866Q509
$$ 6075 -9072 -3518 10469 398 -11028 2919 10467 -6300 -8931 9239 6365 -11501 -2992
687b992J5830j3660j2097J7833O935k0544p88K1383n856k0170J2273J6913j7830
$$ -2992 12838 -822 -12919 4914 11849 -8695 -9483 11900 6044 -14126 -1853 15060 -2770
700b770j1807K1932N325k4086K006K3989r457k1570J6257J6957k1749j0581K5325
$$ -2770 -14577 7355 12680 -11406 -9400 14589 5132 -16438 -181 16776 -4973 -15554 9771
713I771L000k6604N055K5435j2843k1816J9622J6100k4716q787K7618M96k8040
$$ 9771 12771 -13833 -8778 16657 3814 -18002 1620 17720 -6996 -15783 11835 12331 -15709
726a5709P988K5880j5898k1305K2528J4696k7214o535K9493k376k9089J1294K5956
$$ -15709 -7721 18159 2261 -19044 3484 18180 -9034 -15569 13924 11548 -17541 -6247 19709
739A9709j9377k0344K5834J2659l0064l567L1511o077l0025J5401K5646k3451
$$ 19709 332 -20012 5822 18481 -11583 -15150 16361 10284 -19741 -4340 21306 -2145
751b145j8709K9450R857l2791J11L3017j0223l0146J9497K4371k7035j6263L2113
$$ -2145 -20854 8596 18453 -14338 -14227 18790 8567 -21579 -2082 22289 -4746 -21009 11104
764A1104O577l4179L773L3104j3780k8969K2541K2145k9204j3315L3161L311l4103
$$ 11104 17681 -16498 -12725 20379 6599 -22370 171 22316 -6888 -20203 12958 16269 -17834
777a7834O968L1955j6590k6873K4668J9386l0460j0161L3520Kl3546J0189L0445
$$ -17834 -10866 21089 4499 -22374 2294 21680 -8780 -18941 14579 14581 -18965 -8776 21669
790B1669j9489k4552K6991J6373l2058o611L4185l840l3134J4030K8935k2945
$$ 21669 2180 -22372 4619 20992 -11066 -17677 16508 12668 -20466 -6436 22499 -446
802d46k2001K9757J2939l3815k602L4677q011l2280J7877K6816k6009j8857L1707
$$ -446 -22447 7310 20249 -13566 -16168 18509 10498 -21782 -3905 22911 -3098 -21955 9752
815I752R193l4388J280L3827j1508l0160K0528K3744k7507j5286L1864N591l3239
$$ 9752 18945 -15443 -14163 19664 8156 -22004 -1476 22268 -5239 -20525 11339 16930 -16309
828a6309M437L1582j3827k7120K1815K0324k7714j1817L0989K384l1451P079K9057
$$ -16309 -11872 19710 5883 -21237 578 20902 -6812 -18629 12360 14744 -16707 -9628 19429
841A9429j5801k4099K2998J7009k8030q389L0452r06l0046J0070K6878j8279k1201
$$ 19429 3628 -20471 2527 19536 -8494 -16883 13569 12663 -17383 -7313 19565 1286 -19915
854a9915K4694J3587k8774m727L0108m487k8584J3211K4393k0558j7943K5853
$$ -19915 4779 18366 -10408 -15135 14973 10486 -18098 -4887 19506 -1052 -18995 6858
866F858R935k8640j163K8658p493k6069J5251K1118k1363j4386K5341O581k6872
$$ 6858 16793 -11847 -13010 15648 8155 -17914 -2663 18455 -2908 -17294 8047 14628 -12244
879a2244J542K5944r249k2738J5853J7595k0814j1091K3740L822k4497L587K3016
$$ -12244 -10702 15242 5993 -16745 -892 16703 -4111 -15202 8538 12360 -12137 -8550 14466
892A4466j0419j9536J6163J4387k0273q056K2463J129k2544N760K0515j1963j6635
$$ 14466 4047 -15489 674 15061 -5212 -13268 9195 10324 -12220 -6460 14055 2092 -14543
905a4543J6925J1262k0184m944K1494j693k0704Q024J7977j3406j3643J7351Q139
$$ -14543 2382 13644 -6540 -11484 10010 8317 -12387 -4363 13614 208 -13435 3916 12055
918A2055j9563k086J9849l965j8253R380J5045j3673j0616J6540N427j7741k6
$$ 12055 -7508 -9594 10255 6290 -11963 -2583 12462 -1211 -11827 4713 10140 -7601 -7627
931g627J7294n116j5325R491J2107j2819p967J4817L363j5402J302J4604n583
$$ -7627 9667 4551 -10774 -1283 10824 -1995 -9962 4855 8218 -7184 -5882 8722 3139
944C139j2543R178R475j1775n699J3172J610j3332K440J2258o081j0106Q981P145
$$ 3139 -9404 -226 9249 -2526 -8225 4947 6557 -6775 -4335 7923 1842 -8264 717 7862
958G862j0918l637J1736j6j1412L449J0031o396p807Q544M981r760j880R967j161
$$ 7862 -3056 -6693 5043 5027 -6385 -2936 7095 699 -7108 1436 6417 -3343 -5223 4744 3583
973C583r234L861P719n976n617P371L174p939p07P733j602o827L499N428m865
$$ 3583 -5651 -1790 5929 -47 -5664 1707 4881 -3058 -3765 3968 2366 -4461 -962 4466 -399
988c99l688N653J822n806k8N446j567m598K779L446l572k137L896Q12l782L53
$$ -399 -4087 1566 3388 -2418 -2446 3000 1433 -3165 -386 3060 -512 -2649 1247 2059 -1723 -1370
1004a370L344j303k621J939J766k233r06K198J39j932M39J466p83r38Q55M65p28
$$ -1370 1974 671 -1950 -11 1755 -478 -1384 814 953 -979 -540 926 143 -795 60 525 -203
1021b03r4M65r2r8P6k34J43M55n20m92R76K84j371J27J659p16j727J411J534k110
$$ -203 -297 168 76 -22 54 -180 -37 418 -102 -594 382 666 -705 -578 1081 365 -1362 49 1583 -527
1041e27j047K726K74l111O86L186j779k892K832K205l736j197M383r9m639J575
$$ -527 -1574 1152 1426 -1685 -999 2187 408 -2484 348 2553 -1183 -2380 2003 1904 -2735 -1160
1057a160M400l054l672M363K479n353r41N916q78n905K784N283m529m091O015
$$ -1160 3240 186 -3486 877 3356 -1997 -2938 2978 2100 -3805 -1021 4262 -267 -4358 1657
1072A657K381o976k94P332j978o985M219N893o179m174P647J923q437O22Q472
$$ 1657 4038 -2938 -3232 4100 2122 -4863 -644 5249 -930 -5104 2543 4466 -3971 -3349 5123
1087E123l234p678N656O111p643l903Q966J237r513J633R159m449p951O952N971
$$ 5123 1889 -5789 -133 5978 -1665 -5568 3398 4635 -4878 -3245 5914 1465 -6486 466 6437
1102F437q894l339J0049L21j0297K816R620n823p998Q382N549j0242k480J1216
$$ 6437 -2457 -5796 4253 4574 -5723 -2907 6713 890 -7108 1274 6823 -3419 -5899 5317
1116E317r55j1111M411R958p570p778J0119M774j1778j215J2355k601j1754O277
$$ 5317 4362 -6749 -2338 7620 50 -7728 2391 7165 -4613 -5828 6527 3926 -7828 -1551
1130a551R975r426p210J1755L682j3004K65J3036m236j1849P857R528j0779o324
$$ -1551 8424 -1002 -8212 3543 7225 -5779 -5514 7522 3286 -8563 -706 8822 -1957 -8281
1144h281J2720K515j3513J538J3095n474j1481Q953Q815j1630n337J3256J364
$$ -8281 4439 6954 -6559 -5021 8074 2600 -8881 72 8887 -2743 -8080 5176 6540
1157F540j3706K757J2935o681j0973J0064P972j2545m187J3916m3j3987M335J2764
$$ 6540 -7166 -4409 8526 1845 -9128 936 8908 -3637 -7824 6092 6049 -7938 -3603 9161
1171I161q303j0319J1550O820j3739k632J4629j863j4142O224J2298j0045r258
$$ 9161 858 -9461 2089 8909 -4830 -7462 7167 5304 -8838 -2614 9684 -361 -9619
1184i619J2903N347j4555r18J4842l597j3723P728J1351j1118p956J3449L899
$$ -9619 3284 8631 -5924 -6842 8000 4403 -9320 -1592 9759 -1359 -9315 4134 8033
1197H033j4562M99J4336m755j2833Q554J0203j1552o688J3474K621j4188J639
$$ 8033 -6529 -6030 8306 3551 -9282 -728 9475 -2077 -8765 4709 7330 -6858 -5219
1210e219J3638n743j1851R306Q986j1992n309J3591J155j3931L098J2959p085
$$ -5219 8419 2676 -9175 131 9117 -2875 -8184 5407 6562 -7369 -4271 8688 1603
1223A603j0774J0394P555j2725l627J3816o25j3612M835J2088q523r435J1387
$$ 1603 -9171 1223 8778 -3947 -7574 6242 5617 -7995 -3160 8928 405 -9030 2357
1236B357N909j3148j864J3636k290j2840O163J0876r386p926J1673M347j2843
$$ 2357 8266 -4882 -6746 6890 4600 -8240 -2077 8799 -587 -8513 3160 7507 -5336
1249e336m52J2824l378j1657O821R455r543o501J1353L030j2124O39J1770m154
$$ -5336 -5788 7036 3658 -7999 -1178 8277 -1266 -7767 3586 6616 -5508 -4869 6901 2747
1263B747j0379P240Q065r580n081J1013J682j1436J810J0772n087r125P842O634
$$ 2747 -7632 -392 7673 -1907 -6988 4025 5707 -5729 -3919 6853 1766 -7359 483 7117
1277G117r801l563J0827K10j0791L105R757o086p796Q424N134r909k046J0416
$$ 7117 -2684 -6247 4580 4790 -6001 -2896 6861 775 -7021 1403 6537 -3372 -5418 4998
1291D998j134r941M136Q544o646o411Q466L770r458q59R515j982q763M561P193
$$ 4998 3864 -6077 -1941 6603 -43 -6454 2012 5782 -3676 -4535 4980 2998 -5765 -1204 5989
1306E989o590n086P952K619q542l7Q370k447p450M595N918o256l922P279J655
$$ 5989 -601 -5687 2265 4884 -3658 -3695 4675 2228 -5222 -627 5291 -965 -4887 2392 4047
1321D047p626O76P266k840o276M697M734o035k812O772P04o855J408O296l300
$$ 4047 -3579 -2903 4363 1523 -4753 -56 4678 -1357 -4169 2603 3307 -3548 -2140 4156 856
1336H56n158M806L584n793j747O194j53n998J961N246l495m056M590K561n206
$$ 856 -4302 504 4088 -1705 -3452 2742 2589 -3409 -1448 3798 303 -3753 837 3398 -1808
1351a808r45N313o71m912K071M116l193l013L937J738m244m40M190p87l769J837
$$ -1808 -2753 2560 1889 -3023 -952 3164 -29 -3042 895 2633 -1611 -2051 2139 1352 -2417 -580
1367e80L043k609k159L118J144l289j41L180p98k748J551K157k114j400K396O15
$$ -580 2463 -146 -2305 813 1957 -1332 -1473 1707 909 -1839 -288 1869 -245 -1645 751 1366
1383A366k432J30K246q05j836J271J330j569p48J649J98j560K79J297o19r72Q23
$$ 1366 -1066 -936 1310 505 -1331 -60 1270 -299 -1047 602 800 -760 -481 816 197 -775 48
1400D8N92q54k81P61M0o16J36M18j72k28J16J28k4n0j22Q6K37k00k99L71K84n67
$$ 48 640 -214 -495 266 306 -310 -174 244 72 -156 -40 88 64 14 -108 -22 215 15 -284 87 371 -196
1422a96j80P64nr11L10R27o30q51R65O41j283l18J497j22j599O45J520j178j260
$$ -196 -376 388 383 -528 -218 709 79 -772 193 834 -449 -767 730 608 -991 -346 1174 -4 -1264
1441a264J666Q25k070k35K291m75k266J209K012j904j525K492Q17k857M3K984
$$ -1264 402 1227 -843 -1078 1213 738 -1528 -319 1693 -211 -1736 756 1573 -1284 -1241 1743
1457A743r72k780J860K315k656j565L215O55l526M08L501j489l152K470K487l284
$$ 1743 771 -2009 -149 2166 -490 -2055 1160 1815 -1711 -1303 2198 709 -2443 27 2514 -770
1473g70j554L847M25m072P89L932k020l420L124K545l990j378M524Pm643J435
$$ -770 -2324 1523 1948 -2124 -1335 2597 577 -2843 281 2826 -1164 -2542 1982 1989 -2654 -1219
1489a219M309k804l542L971K382m806r33N207o69n097K264M500l716l412M824
$$ -1219 3090 286 -3256 715 3097 -1709 -2642 2565 1896 -3201 -937 3563 -153 -3565 1259
1504A259J987n503l20N688j414n329L066M454m462l152N453J531n956K39N930
$$ 1259 3246 -2257 -2577 3111 1697 -3632 -566 3888 -574 -3726 1727 3258 -2698 -2459 3471
1519C471k012n400L670M332n003k858N899J106o298P74O129k636n381M279M144
$$ 3471 1459 -3941 -271 4061 -942 -3800 2099 3205 -3093 -2319 3810 1174 -4207 72 4216
1534D216n593k469O403N38o635J514O227l430n243N093L704o281j804O903k97
$$ 4216 -1377 -3846 2557 3095 -3540 -2026 4201 771 -4472 621 4325 -1956 -3760 3143 2846
1549B846o878K434O179m343m890N880L130o871j057P229j155o902L240N946n041
$$ 2846 -4032 -1598 4581 238 -4652 1228 4358 -2513 -3570 3659 2504 -4398 -1158 4788 -253
1564b53m449O367K540p124m07P253j767o723L768N582n426l964O601J971p160
$$ -253 -4702 1665 4205 -2919 -3326 3927 2160 -4563 -795 4787 -639 -4603 1998 3969 -3191
1579c191J68P103k294o401M220N135n768l370O774J309p161Q74O892k983n972
$$ -3191 -3023 4080 1786 -4615 -395 4740 -1028 -4398 2376 3685 -3476 -2602 4290 1307 -4665
1594d665M810M499o197k584O984M43p133J772O577l797n415N453L727o584j690
$$ -4665 145 4644 -1553 -4137 2847 3290 -3843 -2071 4506 709 -4706 747 4474 -2110 -3800
1609c800P090m83o932K577O127m445m751N862K949o701r01O912j173o526L130
$$ -3800 3290 2807 -4125 -1548 4579 134 -4617 1245 4194 -2507 -3408 3504 2331 -4195 -1065
1624a065N530m739m073N914K274o543k75O558j666o008L454M914m891l405N878
$$ -1065 4465 -274 -4347 1567 3841 -2702 -2977 3581 1915 -4093 -639 4275 -616 -4021 1857
1639A857J603o314L17O170k188n468L843M242n120k647N908Q21o138J079N753
$$ 1857 3460 -2854 -2537 3633 1445 -4023 -180 4062 -1058 -3705 2203 3024 -3114 -2035 3718
1654C718k829m865M323L483n356j817N869Jn830J790N226l363m139M588K697n333
$$ 3718 889 -3976 347 3830 -1526 -3343 2526 2527 -3303 -1513 3713 350 -3789 799 3496 -1837
1670a837j070N603o24n338K219M590l534l480M527K082n054n58N139r81m760K373
$$ -1837 -2907 2696 2072 -3266 -1047 3543 9 -3471 1056 3138 -1916 -2474 2665 1684 -3076 -703
1686g03L973l510k881M304J545m706j18M681j303m210K553L371l540k244M161
$$ -703 3270 -240 -3121 1183 2728 -1978 -2096 2585 1282 -2928 -375 2996 -544 -2788 1373
1701A373R42m393M09M201j687l614K767K697l539j564L962L30l994R08L623j961
$$ 1373 2315 -2078 -1669 2532 845 -2769 -2 2695 -844 -2408 1554 1884 -2110 -1202 2421 460
1717D60k942K796K043l356r85L555p7l440J110L012j960k351K585J533k968o16
$$ 460 -2482 314 2357 -999 -1984 1571 1494 -1946 -836 2176 216 -2135 450 1983 -985 -1601
1733a601L047l01k871J124K441j805j829K275J099k523l21K523m39k290J091J900
$$ -1601 1446 1145 -1726 -602 1839 34 -1795 480 1579 -944 -1265 1258 819 -1471 -380 1520
1749A520j642j319J960O90k080l5K006n71j752J088J342j426q44J604L24j617
$$ 1520 -122 -1441 519 1209 -871 -906 1100 529 -1223 -135 1207 -219 -1063 541 865 -752
1765g52J84J471o00j213R23Q58j109m79J167J10j123K19R59m69p42O34M95p22
$$ -752 -568 903 303 -910 13 871 -238 -717 450 560 -563 -344 615 146 -596 38 533 -189
1783a89k49P00L0o27J43N01k52l66L14K13l02r0K48J6j59K7P4Rk0n3j0J35j1k11
$$ -189 -438 262 292 -335 -192 309 57 -309 5 218 -84 -174 74 90 -69 -42 32 41 21 -32 -42 93 82 -129
1807a29Q9K56j92k72L28K13m50j02N52o8n99K55N91m80m97O76L34q55q3R31j97
$$ -129 -40 216 24 -248 80 293 -157 -259 293 225 -374 -119 472 -8 -505 171 505 -350 -433 498 301
1828C01r41N06Q35p99o47J049L65j223pJ296l96j225P95J048j149p29J424L24
$$ 301 -640 -134 701 -98 -745 304 669 -554 -561 735 339 -886 -91 957 -192 -921 503 827
1846H27j574J50J607o68j452J131J163j538p18J803J80j926M21J857j019j586
$$ 827 -747 -597 1010 342 -1110 21 1184 -354 -1072 731 911 -1015 -594 1263 244 -1342
1862a342J537J147j958n66K181r8k209P75K031j446j619J967J071k362l58K525
$$ -1342 195 1342 -616 -1182 999 901 -1308 -533 1498 52 -1567 400 1471 -891 -1249 1276
1878A276m17k443J177K140j850j626K385R35k715j14K798p16k621J524K203k216
$$ 1276 859 -1584 -407 1733 -117 -1743 642 1577 -1138 -1252 1546 830 -1791 -267 1936 -280
1894b80j564K699P76k981J26K989j021k705J840K185k548j440L009N39l209M26
$$ -280 -1844 855 1631 -1350 -1224 1765 744 -1961 -121 2064 -484 -1924 1085 1624 -1585 -1159
1910a159L117j400k726K245K070k910j194L317J93l419Q50L193j846k639K683
$$ -1159 1958 558 -2168 77 2147 -763 -1957 1360 1553 -1866 -1016 2177 331 -2308 375
1925C75J841l266q62L578k29l535J312L155k286k482L074J560l554m88L712o21
$$ 375 2216 -1050 -1912 1666 1437 -2098 -786 2369 83 -2399 675 2235 -1319 -1807 1905 1284
1941A284l538J677L051k604k276L289J281l663k18L745r11l487J960K895k830
$$ 1284 -2254 -577 2474 -130 -2406 883 2164 -1499 -1717 2028 1117 -2370 -410 2485 -345
1956c45k052L443J022l766J19L743j248l384K287K688l114j737L660O28l854N60
$$ -345 -2397 1046 2068 -1698 -1579 2164 916 -2468 -181 2507 -607 -2344 1316 1944 -1910 -1350
1972a350L696j700l166K680K336l399j285L783J38l843J059L503k116k861K973
$$ -1350 2346 646 -2520 160 2496 -903 -2188 1595 1733 -2110 -1051 2452 336 -2525 448
1987D48J940l545q64L805l03l689J400L233k356k519L098J588l568n07L690n81
$$ 448 2388 -1157 -2021 1784 1481 -2208 -808 2425 69 -2450 648 2236 -1332 -1839 1851 1270
2003A270l507J624L001k513k241L179J279l555j80L596r20l291J923K691k719
$$ 1270 -2237 -613 2388 -125 -2366 813 2092 -1463 -1643 1953 1033 -2258 -335 2356 -363
2018c63j847L287Q15l512K67L422j324k990K228K283k931j358L327L25l400P11
$$ -363 -2210 1077 1892 -1620 -1353 2069 745 -2245 -17 2266 -665 -2023 1304 1629 -1771 -1060
2034a060L151j675k612K442J861k998r37L251m4l212J001K878j857k295K523J525
$$ -1060 2091 416 -2196 246 2107 -891 -1828 1423 1379 -1833 -832 2046 189 -2106 417 1942
2050A942k950o15L087k91k976J184K572j934j961K502J213k834l38K885n24k696
$$ 1942 -1008 -1623 1464 1173 -1803 -619 1953 19 -1942 560 1773 -1061 -1399 1486 962 -1734
2066a734J338K259k003j627K470Q47k687k8K649p78k376J502J873k060j224K406
$$ -1734 -396 1863 -140 -1767 703 1550 -1137 -1165 1484 706 -1670 -168 1705 -355 -1579 827
2082H27M62k493K94K368j021k018J599J519k036q74K266J66k257N07K065j109
$$ 827 1289 -1204 -910 1458 437 -1581 18 1537 -499 -1373 893 1059 -1198 -691 1374 265
2098B65j689J601J176j913n80K043k8j990O17J762j122j377J495R05j720l79J787
$$ 265 -1424 177 1353 -560 -1140 903 875 -1115 -498 1264 142 -1235 260 1165 -555 -934 853
2115H53j69j685O63J441j074j083J340O58j508j86J519k73j398O83J140j007q06
$$ 853 684 -1001 -338 1103 29 -1054 286 944 -564 -750 769 496 -902 -219 921 -86 -892
2132h92J211M23j294LJ243l75j087O93Q28q94n37J028K00j033J13R56l88p81N92
$$ -892 319 742 -552 -549 694 319 -768 -75 753 -141 -678 350 550 -483 -370 586 198 -583 9
2151IN74p43l10P68P4p41J43O61l34n17M46L52n16j79N12L6m88J08M04k16l08
$$ 9 583 -160 -470 298 372 -369 -226 435 101 -416 30 382 -134 -313 199 235 -253 -145 259 43 -265
2172b65K74J99l06r3L02j0k46P6J86j05j19J13N8q9j7O0kjj0k0L0N2q6l2J32j5
$$ -265 9 208 -98 -191 111 101 -145 -69 117 12 -107 6 64 -25 -42 18 16 15 5 -15 15 67 -19 -51 81 66
2198F6j68P5J78j48j74K38J14l08l8L58p5l85K09L46l30k75M43J51n33J4N53j76
$$ 66 -102 -27 151 3 -171 67 181 -127 -165 193 118 -267 -58 288 -42 -317 126 277 -256 -242 311 135
2220A35n41L73M53n26l18O57J26p27R4P35l10o73N42N34p18l39Q72O8r26K10R06
$$ 135 -406 -33 420 -106 -424 233 359 -368 -274 461 151 -522 20 554 -164 -503 369 437 -489 -279 627
2241F27n21p59P61N50r70k71J096p1j119M30J006p39q22J019N21j216j68J297
$$ 627 106 -653 108 658 -312 -583 513 442 -677 -247 759 20 -802 217 738 -478 -646 651
2259F51k17j266O19J094r49q25J225M79j407n4J444l68j359P84J149j139q25J427
$$ 651 434 -832 -213 881 -68 -893 332 811 -596 -650 794 426 -933 -149 1000 -139 -964 463
2277D63L95j563O4J577n56j429R96J164j383p57J648K49j745K79J679q00j464
$$ 463 858 -705 -641 936 380 -1049 -53 1111 -272 -1029 619 868 -877 -598 1081 281 -1183
2294a183J267J083j622n97J816M1j846N23J711j052j405J477R79j803m38J951
$$ -1183 84 1167 -455 -1052 764 805 -1041 -518 1193 141 -1264 213 1192 -611 -1049 902
2310I02j48j897P11J716j228j357J634Q78j914k98K004k77j943Q86J693j399j287
$$ 902 754 -1143 -432 1284 56 -1301 333 1211 -703 -1001 1003 726 -1217 -331 1362 -37 -1324
2327a324J786P55k031j42K083m99j940J089J603j576j144J944N37k113J19K067
$$ -1324 462 1217 -814 -956 1127 628 -1312 -223 1380 -196 -1340 604 1141 -972 -853 1214
2343A214p40j861J313J461j771r11K050K89k135L64K030r75j730J512J275j898
$$ 1214 474 -1387 -74 1387 -384 -1295 755 1044 -1091 -727 1303 328 -1402 110 1385 -513
2359e13o95K103P6k126N72J959j174j603J646J116j977n39K144j27k102P61J872
$$ -513 -1208 895 971 -1155 -583 1376 202 -1401 245 1361 -616 -1155 989 862 -1240 -479 1393
2376A393j317j482J752R51k046l15K124l35k013R24J744j466j280J843P15k055
$$ 1393 76 -1406 346 1297 -749 -1064 1060 725 -1288 -364 1380 -86 -1366 477 1192 -863
2392h63p6K071n49j889J122J539j588j043J895M69k028J65J971p47j749J299J323
$$ -863 -939 1132 583 -1306 -184 1355 -233 -1276 619 1088 -940 -775 1196 449 -1300 -1 1322
2409A322j692q09J930K29j990L82J845r37j565J402J128j724o13J905K6j896N35
$$ 1322 -370 -1179 751 980 -1010 -628 1217 280 -1285 117 1245 -479 -1092 813 839 -1057 -522
2426e22J719j045j400J445R63j731m17J823j28j763O51J564j124j194J480P37
$$ -522 1197 152 -1248 197 1160 -571 -988 835 707 -1056 -405 1159 35 -1159 321 1058
2442A058j682k25J739k93j632P86J370j193r91J486N42j641k7J621m72j458Q98
$$ 1058 -624 -849 890 597 -1035 -249 1121 -72 -1063 423 965 -676 -703 918 446 -1012 -114
2459a14J168j241p84J464L16j532J38J467n87j263R44R59j211n85J366J72j400
$$ -114 1054 -187 -971 493 809 -723 -585 882 295 -968 -24 935 -276 -861 505 677 -723
2476g23K51J290o22j072R26P91j147m28J250O0j236L08J117o45q81Q88O11j041
$$ -723 -472 818 196 -876 50 841 -306 -734 516 576 -660 -352 765 120 -761 127 738 -303
2494c03k84J111n9j081L84R25o49p07Q51M17r51j34R65j68q77M15P18o22n17P78
$$ -303 -587 524 465 -616 -232 693 44 -663 188 605 -346 -480 485 317 -560 -145 573 -49 -566 212
2514B12K49q18jP89k22o95M19N42n56l53O28J74o74O1O18k25n37L78L97m72k32
$$ 212 461 -357 -358 431 209 -486 -67 475 -81 -434 194 368 -306 -245 373 148 -389 -11 386 -86 -318
2535c18N24P7n20P5M75k22l84L22K65l87j35M02kl79J09L19j96k30K32J31k53
$$ -318 206 283 -237 -162 313 91 -293 29 294 -93 -228 174 172 -207 -98 221 25 -205 27 158 -95
2556i5n0K46k4k10Q6J55j18j03J51L4j22oJ04k5p2L9N3m4j5K7Nplj6J6K9po6N0
$$ -95 -145 101 77 -133 -47 108 -10 -113 38 72 -50 -56 48 23 -49 -10 43 -1 -16 11 16 9 6 -10 6 35 28 -38 12
2585A2N6r4m0J26oj43M9J54j14j41J74R4k30l0K53m7k64J45K32k24j87L09J00
$$ 12 68 -26 -66 60 54 -89 -40 114 0 -141 33 127 -103 -133 120 73 -191 -46 186 -38 -225 84 184
2608A84l54RL79j35l50K63K87l68j85M43N6m59Q8M65k35m10L68L15m91j75N53
$$ 184 -170 -161 218 83 -267 -4 283 -85 -270 173 229 -230 -142 323 88 -322 46 361 -130 -305 248
2629B48K2n86J62N46l44m65M93L35o17j60O91n0o99K60O28m62n14O43L33p65r9
$$ 248 270 -316 -154 392 48 -417 76 411 -206 -366 325 275 -424 -164 464 2 -512 131 464 -301 -400
2650d00Q20j50p82L87O83o12n01P78K74q67j9Q97k54q34N23O86p43m72R09K10
$$ -400 420 270 -512 -125 558 -54 -555 223 497 -370 -389 508 254 -580 -57 629 -114 -586 323 533
2670E33r81Q3R64l85q81O64O84q81m22J007J24j077K01J020n05q79P72O68j010
$$ 533 -448 -365 599 214 -667 -3 681 -200 -622 385 509 -568 -367 653 148 -731 41 709 -301
2689c01l43J097M3j139L25J049o36q69R05N99j083k83J183p2j170M31J058p47
$$ -301 -644 453 496 -643 -318 731 95 -774 131 730 -353 -636 547 475 -695 -264 794 47
2707D7q37J008N25j160j79J221j92j184N63J014q72p37J078M27j242m2J246l43
$$ 47 -790 218 743 -417 -596 625 433 -751 -188 826 -46 -783 295 722 -520 -562 684 341
2725C41j146O93R43r89o49J185K82j259Q9J244m60j107Q07Q60j064n35J232J66
$$ 341 -805 -112 831 -158 -807 378 660 -599 -510 734 274 -833 -26 834 -230 -765 467 633
2743F33j288K30J223n94j039R04P68j138m11J271K8j274L35J184p04r72R86O73
$$ 633 -655 -425 798 204 -835 69 837 -301 -712 559 587 -687 -352 832 128 -844 142 815
2761H15j202k98J285j00j250M74J108q18q68J091N18j230j48J269k45j181O14
$$ 815 -387 -685 600 500 -750 -276 832 14 -854 237 755 -475 -623 646 401 -780 -166
2778a66R94r12p19J129L77j238J1J226l76j104P05Q82r50n96J134K46j200J23
$$ -166 828 -84 -803 326 703 -535 -524 702 326 -778 -73 809 -141 -737 397 643 -557 -434
2796d34J156m67j016P55P91j003m81J134J29j163K07J112n56r37Q35O79j036l62
$$ -434 722 255 -761 -6 785 -218 -699 435 564 -599 -392 720 164 -773 62 741 -295 -657
2814f57J125K3j130L21J021o39q09Q87N33j021k23J086j06j033M16R00o80o69
$$ -657 468 491 -639 -318 703 64 -745 142 675 -346 -569 517 411 -622 -206 694 14 -655
2832f55Q61M07r77j15J017j94r30M70P84o99n65Q39K97r35k6R41k61q47N09O84
$$ -655 206 613 -364 -479 538 344 -586 -116 668 -31 -596 243 540 -395 -421 520 259 -588 -79 605
2852F05p08m69Q44K00q82N1Q52l22p30N29N68o91l45P80J17p93J38P30l48o15
$$ 605 -103 -572 272 472 -410 -359 493 171 -559 -30 538 -153 -498 282 399 -394 -256 474 126 -489
2872d89N27M52o55k37O98J9o72J79O18l67m89N06L24n90j38O18n2o03K28N02l71
$$ -489 38 490 -165 -402 296 315 -357 -178 440 73 -416 90 414 -176 -314 304 252 -351 -123 379 8
2893Hl80M74K26n43n2N24j00m76K33M06l52k81M21J45m40qM45j31l82K44K94l21
$$ 8 -372 102 328 -215 -267 257 157 -319 -86 320 -32 -313 108 253 -187 -195 250 119 -263 -19 275 -46
2915d6j82L56P8l60L2L39j36k83K23K01k66j23K95K0k71M9K41j41j83J83J25k23
$$ -46 -228 128 206 -154 -122 217 81 -202 21 222 -44 -167 128 148 -123 -74 167 26 -157 26 151 -72
2937g2n1K18k3k00Q9J39j12j02J39M8j41OJ16k6r7P1O4p3m0P4J0m8J1L6j7k5L3
$$ -72 -123 95 72 -128 -39 100 -12 -114 25 73 -68 -62 54 28 -69 2 66 -7 -47 27 37 -11 0 36 19 -6 27
2964B7nj8J8nk0K6Rm1QL8j7n7L8M9q0l6J04lj05L8J11q8r1J26O2j56j1J64k5j86
$$ 27 22 4 22 17 -3 23 32 -9 -1 37 20 -37 1 50 -30 -66 38 35 -70 -32 79 -9 -100 26 88 -68 -79 85 60 -126
2994a26J04J55j48j14K04P0k50RK57q7k41J67K04k28j49K99M4l12M5L16j57k83
$$ -126 -22 133 -15 -129 75 145 -105 -96 161 74 -167 0 204 -24 -173 126 170 -142 -97 219 62 -221
3016b21K42K13l06j36L61J7l80Q8L58k03l14L24K16l90j22M51k2m52J66M09k85
$$ -221 21 234 -72 -208 153 170 -210 -122 236 33 -281 43 259 -131 -253 198 176 -276 -110 299 14
3037A4l41M02K27m76p8N17p6m97K34M38l68l35M72J96n46k5N73j65n20L12M51
$$ 14 -327 75 302 -174 -252 265 189 -308 -74 364 -4 -339 133 329 -217 -242 331 166 -354 -42 409
3058D09m54l20N51J40o06L0O00j94n62L67M54n21k87O03J24o63Q4O39k77n70M59
$$ 409 -45 -365 186 326 -280 -250 350 156 -406 -39 415 -106 -393 210 334 -329 -245 394 117 -453 6
3079FM41n96k60O80O5o96J55O59l55n53N27M02o52k10P29k5p24K44O52m44n24
$$ 6 447 -149 -409 271 336 -360 -205 454 99 -454 73 475 -177 -387 342 317 -407 -163 489 45 -479
3100d79N99L39o85j39P34q7p31L11O17m94m84O45K92p38o1P59j77p07L94N95n70
$$ -479 120 459 -226 -365 369 282 -449 -138 479 -15 -499 146 438 -300 -361 398 221 -486 -92 503 -67
3121f7m27P04K18p64J4P64k50o87M75N54o28l55P31J24p70J03P47l38o45N33M75
$$ -67 -494 210 428 -336 -322 442 192 -495 -20 534 -94 -449 282 406 -364 -261 486 148 -497 36 511
3142E11o80k67P49M7p81K10P01m10n90N81M05p11j82P64m7p52K63O82m79n27O26
$$ 511 -169 -436 313 360 -421 -211 490 80 -510 71 476 -235 -417 347 300 -452 -189 493 14 -513 113
3163A13L45p34j12P67j19p26L38O45n35m70O70K70p51l5P66j99p00M05N76n70
$$ 113 458 -276 -388 379 260 -466 -128 517 -18 -488 182 452 -299 -334 432 233 -467 -62 514 -56
3183e6m08O84J94p46L2P28k56o36M34N05n84l41O89J18p13R0O94l13n80M75M30
$$ -56 -464 220 414 -332 -300 428 172 -464 -30 475 -109 -450 239 357 -356 -266 428 115 -465 10 440
3204D40n97k56O63M5o59J55O37l56n11M99L66o03j73O48k1o44K25N59l66m51N14
$$ 440 -157 -413 250 295 -364 -209 428 72 -439 60 426 -177 -350 298 277 -367 -142 417 51 -400 114
3225A14K70n76j12O04o5n78K36N01l91l83M93K24n53m8N48j28m98K67M14l81l00
$$ 114 384 -192 -304 300 235 -343 -107 394 3 -380 113 337 -216 -264 284 156 -342 -75 339 -42 -342
3246c42M69J50n06RN01j59m40K88L43l71k27M55P9m67P5M31j99l56K86K75l72
$$ -342 127 277 -229 -220 281 122 -318 -30 313 -58 -285 170 249 -218 -143 288 89 -267 19 294 -78
3267g8j37L90K2l94Q6L70k01k94K66J95l27q5L42j8l39J18K95k00k34K60J35k89
$$ -78 -215 175 197 -197 -111 259 58 -236 30 225 -102 -187 155 137 -202 -84 211 11 -223 37 172 -117
3289a17l9K92l7k66J22K25j86j68K34R9k55pK43n3k22J27J56j61j03J86N4k05
$$ -117 -156 136 99 -167 -45 180 -6 -174 60 159 -96 -103 140 87 -135 -8 148 -13 -116 70 124 -81
3311h1J5J76n9j57J15R5j27o6J46J2j47L5J16o7r8R0O8j06l4J09jr4K7Q0n5n0
$$ -81 -66 110 51 -106 9 104 -23 -89 57 69 -78 -43 73 6 -92 -2 66 -40 -74 35 34 -60 -33 47 -8 -58
3337e8P1K7n9rN5qn0M9J8m0JL6rk8K0Mj1rK0k0nK7rk5K5J6m6mM4j6m8M1L8o4l3
$$ -58 13 40 -19 -28 27 19 -31 18 36 -4 -3 33 24 -4 16 20 9 0 20 0 -5 22 13 -12 13 29 -17 -21 23 7 -41 0 38 -26 -59
3372e9Q1%q6K5R3m4q0P5O7j01m0J29rj24M8J26r3r5J39O4j67j6J74l2j80R5J46
$$ -59 22 22 -64 -39 54 10 -70 5 72 -29 -69 60 51 -73 -25 101 8 -87 52 116 -51 -67 107 75 -105 -10 136
3399A36j42j03J75O0k15RK15q2k04J46J65k02j09K25L8k45M4K45j21k16J85J65
$$ 136 -6 -109 66 126 -89 -80 135 53 -151 -5 160 -42 -151 74 112 -133 -89 156 35 -181 4 169
3421A69k42p9K69J5k84Q0K66j64k16K37J62k90q2L27k0l18J11K87k02k39K91J48
$$ 169 -73 -152 117 132 -152 -72 194 30 -186 51 213 -77 -159 168 148 -170 -59 228 26 -213 78 226
3443B26l32o6L69n8l58J71L00k69k21L20J25l75pL71r3l58K04L02k92k10L51J20
$$ 226 -106 -172 197 139 -219 -48 252 -17 -238 82 207 -168 -175 196 103 -255 -51 251 -41 -251 100 220
3465B20l99J6L81j22l56K32K99l06k04L92P2m04K9M12j59l55K67K75l58j63M09
$$ 220 -179 -163 218 96 -260 -28 271 -35 -239 153 225 -179 -150 262 103 -252 15 290 -68 -231 178
3486A78L8m32R2M03k18l47L21K53m16j24M35pm31J36M03k69l11L62J96m16q7M59
$$ 178 216 -216 -124 279 61 -286 35 288 -128 -252 183 176 -255 -119 284 15 -296 66 262 -154 -241 218
3508B18n6m31J92L79k94k84L87J64m38l6M56j02m30K40L58l49k53M19J26m60K3
$$ 218 162 -269 -77 302 8 -276 111 275 -163 -199 257 155 -275 -35 323 -26 -279 140 266 -194 -171
3529a71M50j57m14K83L15l78k11M28R1m63O0M40k00l75L08K80l98j62M34L5m47
$$ -171 279 122 -292 -9 306 -72 -283 145 236 -227 -167 273 73 -302 6 286 -112 -274 160 195 -252
3550b52J18M24k38l55L41K49l95j38M54j0m44J51L99k65l16L69J91m27o6M37o2
$$ -252 -134 290 52 -303 38 287 -108 -246 208 198 -246 -95 304 39 -277 92 283 -144 -210 227 165
3571A65m22J86L63k93k72L68J57m17m2M28r3m04K24L24l23k23L74J31m19J2L99
$$ 165 -257 -71 292 -1 -273 95 252 -165 -207 221 128 -276 -52 272 -51 -274 100 231 -188 -176 223
3592B23j22l57K26K96l19j91L77Q0l91L8L90j58l34K59K40l12j57L73L5l72O6
$$ 223 101 -256 -30 266 -53 -244 133 213 -178 -140 250 92 -242 17 257 -55 -212 161 196 -176 -110
$$ [...]
8191A5
##END NTUPLES=NMR FID
##END=
