##TITLE=1H_ES-AC-EG-St
 
 8 sc, 
 18.1.2022
##JCAMPDX= 6.0         $$ Bruker NMR JCAMP-DX V2.0
##DATA TYPE= NMR FID
##DATA CLASS= NTUPLES
##ORIGIN= UXNMR, Bruker Analytische Messtechnik GmbH
##OWNER= root
$$ XWIN-NMR		Version 3.5
$$ Tue Jan 18 10:34:28 2022 Russian Standard Time (UT+4h)  she@DPX200
##.OBSERVE FREQUENCY= 200.131346
##.OBSERVE NUCLEUS= ^1H
##.DELAY= (6, 6)
##.ACQUISITION MODE= SIMULTANEOUS
##.ACQUISITION SCHEME= undefined
##.AVERAGES= 8
##.DIGITISER RES= 18
##SPECTROMETER/DATA SYSTEM= spect
##.PULSE SEQUENCE= zg30
##.SOLVENT NAME= CDCl3
##.SHIFT REFERENCE= (INTERNAL, CDCl3, 0, 15.7039)
##AUDIT TRAIL= $$ (NUMBER, WHEN, WHO, WHERE, WHAT)
$$ ##TITLE= Audit trail, XWIN-NMR		Version 3.5
$$ ##JCAMPDX= 5.01
$$ ##ORIGIN= Bruker BioSpin GmbH
$$ ##OWNER= she
$$ F:/spectra/data/she/nmr/H-F/1/audita.txt
$$ ##AUDIT TRAIL=  $$ (NUMBER, WHEN, WHO, WHERE, WHAT)
(   1,<2022-01-18 10:32:19.35 +0400>,<she>,<DPX200>,
      <created by zg, POWCHK disabled, PULCHK disabled
       configuration hash MD5:
       00 E9 B6 7A A2 85 ED C7 34 08 36 98 17 FE 4E 26
       data hash MD5: 16K
       B5 EB 06 89 96 49 62 24 33 21 67 99 62 73 BC F6>)
$$ ##END=
$$ 
$$ hash MD5
$$ B2 F8 88 38 D4 21 84 73 73 81 79 4F D7 06 A1 5C
##$RELAX= 
##$RELAX= 
##$RELAX= 
##$RELAX= 
##$RELAX= 
##$RELAX= 
$$ Bruker specific parameters
$$ --------------------------
##$DU= <F:/spectra>
##$EXPNO= 1
##$NAME= <H-F>
##$PROCNO= 1
##$TYPE= <nmr>
##$USER= <she>
##$AMP= (0..31)
100 100 100 100 100 100 100 100 100 100 100 100 100 100 100 100 100 100 
100 100 100 100 100 100 100 100 100 100 100 100 100 100 
##$AQSEQ= 0
##$AQ_mod= 1
##$AUNM= <au_zg>
##$AUTOPOS= <>
##$BF1= 200.13
##$BF2= 200.13
##$BF3= 200.13
##$BF4= 200.13
##$BF5= 200.13
##$BF6= 200.13
##$BF7= 200.13
##$BF8= 200.13
##$BYTORDA= 1
##$CFDGTYP= 0
##$CFRGTYP= 5
##$CHEMSTR= <none>
##$CNST= (0..31)
1 1 145 1 1 1 1 1 1 1 1 1 1 1 1 1 1 1 1 1 1 1 1 1 1 1 1 1 1 1 1 1 
##$CPDPRG= <>
##$CPDPRG1= <>
##$CPDPRG2= <>
##$CPDPRG3= <>
##$CPDPRG4= <mlev>
##$CPDPRG5= <mlev>
##$CPDPRG6= <mlev>
##$CPDPRG7= <mlev>
##$CPDPRG8= <mlev>
##$CPDPRGB= <>
##$CPDPRGT= <>
##$D= (0..31)
0 1.2 0 0 0 0 0 0 0 0.06 0 0.03 0 0 0 0 0.0002 0 0 0 0 0 0 0 0 0 0 0 0 
0 0 0 
##$DATE= 1642487539
##$DBL= (0..7)
120 120 120 120 120 120 120 120 
##$DBP= (0..7)
150 150 150 150 150 150 150 150 
##$DBP07= 0
##$DBPNAM0= <>
##$DBPNAM1= <>
##$DBPNAM2= <>
##$DBPNAM3= <>
##$DBPNAM4= <>
##$DBPNAM5= <>
##$DBPNAM6= <>
##$DBPNAM7= <>
##$DBPOAL= (0..7)
0.5 0.5 0.5 0.5 0.5 0.5 0.5 0.5 
##$DBPOFFS= (0..7)
0 0 0 0 0 0 0 0 
##$DE= 6
##$DECBNUC= <off>
##$DECIM= 32
##$DECNUC= <off>
##$DECSTAT= 4
##$DIGMOD= 1
##$DIGTYP= 9
##$DL= (0..7)
0 120 120 120 120 120 120 120 
##$DP= (0..7)
150 150 150 150 150 150 150 150 
##$DP07= 0
##$DPNAME0= <>
##$DPNAME1= <>
##$DPNAME2= <>
##$DPNAME3= <>
##$DPNAME4= <>
##$DPNAME5= <>
##$DPNAME6= <>
##$DPNAME7= <>
##$DPOAL= (0..7)
0.5 0.5 0.5 0.5 0.5 0.5 0.5 0.5 
##$DPOFFS= (0..7)
0 0 0 0 0 0 0 0 
##$DQDMODE= 0
##$DR= 18
##$DS= 0
##$DSLIST= <SSSSSSSSSSSSSSS>
$$ [...]
##$SUBNAM2= <"">
##$SUBNAM3= <"">
##$SUBNAM4= <"">
##$SUBNAM5= <"">
##$SUBNAM6= <"">
##$SUBNAM7= <"">
##$SUBNAM8= <"">
##$SUBNAM9= <"">
##$SW= 18.0517287032376
##$SWIBOX= (0..15)
0 0 2 0 0 0 0 0 0 0 0 0 0 0 0 0 
##$SW_h= 3612.71676300578
##$TD= 16384
##$TD0= 1
##$TE= 0
##$TE2= 300
##$TE3= 300
##$TEG= 300
##$TL= (0..7)
0 120 120 120 120 120 120 120 
##$TP= (0..7)
150 150 150 150 150 150 150 150 
##$TP07= 0
##$TPNAME0= <>
##$TPNAME1= <>
##$TPNAME2= <>
##$TPNAME3= <>
##$TPNAME4= <>
##$TPNAME5= <>
##$TPNAME6= <>
##$TPNAME7= <>
##$TPOAL= (0..7)
0.5 0.5 0.5 0.5 0.5 0.5 0.5 0.5 
##$TPOFFS= (0..7)
0 0 0 0 0 0 0 0 
##$TUNHIN= 0
##$TUNHOUT= 0
##$TUNXOUT= 0
##$USERA1= <user>
##$USERA2= <user>
##$USERA3= <user>
##$USERA4= <user>
##$USERA5= <user>
##$V9= 5
##$VALIST= <valist>
##$VCLIST= <CCCCCCCCCCCCCCC>
##$VD= 0
##$VDLIST= <DDDDDDDDDDDDDDD>
##$VPLIST= <PPPPPPPPPPPPPPP>
##$VTLIST= <TTTTTTTTTTTTTTT>
##$WBST= 1024
##$WBSW= 4
##$XGAIN= (0..3)
0 0 0 0 
##$XL= 0
##$YL= 0
##$YMAX_a= 306077
##$YMIN_a= -361605
##$ZGOPTNS= <>
##$ZL1= 120
##$ZL2= 120
##$ZL3= 120
##$ZL4= 120
##$ABSF1= 10
##$ABSF2= 0
##$ABSG= 5
##$ABSL= 3
##$ALPHA= 0
##$AQORDER= 0
##$ASSFAC= 0
##$ASSFACI= 0
##$ASSFACX= 0
##$ASSWID= 0
##$AUNMP= <proc_1d>
##$AZFE= 0.1
##$AZFW= 0.1
##$BCFW= 1
##$BC_mod= 2
##$BYTORDP= 1
##$COROFFS= 0
##$CY= 11.3945322036743
##$DATMOD= 1
##$DC= 2
##$DFILT= <>
##$DTYPP= 0
##$F1P= 2.36226072786647
##$F2P= -0.459571619588291
##$FCOR= 0.5
##$FTSIZE= 0
##$FT_mod= 4
##$GAMMA= 1
##$GB= 0.15
##$INTBC= 1
##$INTSCL= 1
##$ISEN= 128
##$LB= 0.24
##$LEV0= 0
##$LPBIN= 0
##$MAXI= 10000
##$MC2= 0
##$MEAN= 0
##$ME_mod= 0
##$MI= 1.114404
##$NCOEF= 0
##$NC_proc= 0
##$NLEV= 6
##$NOISF1= 3.799351
##$NOISF2= 2.8
##$NSP= 1
##$NTH_PI= 0
##$NZP= 0
##$OFFSET= 15.70392
##$PC= 1
##$PHC0= -15957.58
##$PHC1= 23.60078
##$PH_mod= 1
##$PKNL= yes
##$PPARMOD= 0
##$PSCAL= 0
##$PSIGN= 0
##$REVERSE= no
##$SF= 200.130013532006
##$SI= 16384
##$SIGF1= 3
##$SIGF2= 2
##$SINO= 400
##$SIOLD= 16384
##$SREGLST= <1H.CDCl3>
##$SSB= 0
##$STSI= 0
##$STSR= 0
##$SW_p= 3612.71676300578
##$SYMM= 0
##$S_DEV= 0
##$TDeff= 0
##$TDoff= 0
##$TI= <>
##$TILT= no
##$TM1= 0
##$TM2= 0
##$TOPLEV= 0
##$USERP1= <user>
##$USERP2= <user>
##$USERP3= <user>
##$USERP4= <user>
##$USERP5= <user>
##$WDW= 1
##$XDIM= 8192
##$YMAX_p= 0
##$YMIN_p= 0
$$ End of Bruker specific parameters
$$ ---------------------------------
##NTUPLES= NMR FID
##VAR_NAME=  TIME,          FID/REAL,        FID/IMAG
##SYMBOL=    X,             R,               I
##VAR_TYPE=  INDEPENDENT,   DEPENDENT,       DEPENDENT
##VAR_FORM=  AFFN,          ASDF,            ASDF
##VAR_DIM=   8192,          8192,            8192
##UNITS=     SECONDS,       ARBITRARY UNITS, ARBITRARY UNITS
##FACTOR=    0.0002768,     1,               1
##FIRST=     0,             0,               0
##LAST=      2.2672688,     0,               0
##MIN=       0,             -361605,         0
##MAX=       2.2672688,     306077,          0
$$ Real data points
##PAGE= N=1
##DATA TABLE= (X++(R..R)), XYDATA
0@%%%%%%%%%%%%%%%%%qJ6j6J6j6J6k4L2l2L4m2M8n6O6p4Q4r2J04j20J36j52J70
$$ 0 0 0 0 0 0 0 0 0 0 0 0 0 0 0 0 0 0 -8 8 -8 8 -8 8 -16 16 -16 18 -24 24 -32 34 -40 44 -48 56 -64 72 -80 90
39I0j90K09k33K61k89L19l53L92m31M75n24N76o34P00p73Q52r43J047j164J298
$$ 90 -100 109 -124 137 -152 167 -186 206 -225 250 -274 302 -332 368 -405 447 -496 551 -613 685
59F85j458J646j875K162k529L025l730M820o771J1370m3871n3900j6878k4162
$$ 685 -773 873 -1002 1160 -1369 1656 -2074 2746 -4025 7345 -36526 -90426 -107304 -131466
73a31466J8027k814j858J8900L2103J6599L0656M3187L7159K5281L3076K4208
$$ -131466 -113439 -116253 -118111 -99211 -67108 -50509 -19853 23334 60493 85774 118850 143058
85A43058M576p623j1634l0674m4716m6694m6430n0969m2431k7048j3458o08J9462
$$ 143058 147634 140011 128377 97703 52987 6293 -40137 -91106 -133537 -160585 -174043 -174651 -155189
98a55189L6401M6520N2955N8403N5345M4661L1671J7798j301k0876l5460m6140
$$ -155189 -118788 -72268 -19313 39090 94435 139096 170767 188565 187264 166388 130928 84788
110H4788n5783n8653n3131m4223l3626j7019K116J7499L0732M4098N1716N1366
$$ 84788 29005 -29648 -82779 -127002 -160628 -177647 -175531 -158032 -127300 -83202 -31486 19880
122A9880M8518M2920L0378J4812J340j2558k7594l7883m2505m5441m4993l7851
$$ 19880 68398 111318 141696 156508 157848 145290 117696 79813 37308 -8133 -53126 -90977
134i0977k7710j7804n402Q818K0016K8187L5668L9824L8377L4429K9062K0104
$$ -90977 -118687 -136491 -141893 -133075 -113059 -84872 -49204 -9380 28997 63426 92488 112592
146A12592Q708j608j1221k1114k8639l2247l3651l3156k8772k1476j3575m666
$$ 112592 121300 119692 108471 87357 58718 26471 -7180 -40336 -69108 -90584 -104159 -108825
158a08825N498J4742K1690K7282L0997L1181K8407K4008J7549Q798k80q604j6638
$$ -108825 -103327 -88585 -66895 -39613 -8616 22565 50972 74980 92529 101327 101047 92443 75805
171G5805k3510k7586k9019k8610k5591j9749j2562m823L735J2100J8669K3562
$$ 75805 52295 24709 -4310 -32920 -58511 -78260 -90822 -95645 -91910 -79810 -61141 -37579
183c7579K6772K7364K5157K1047J5404Q039l2p529j4373k0206k3964k5173k4504
$$ -37579 -10807 16557 41714 62761 78165 86204 86172 78643 64270 44064 20100 -5073 -29577
196b9577k1815j6827j0376l415L930J1106J6988K1147K3603K3968K2000J8081
$$ -29577 -51392 -68219 -78595 -82010 -78080 -66974 -49986 -28839 -5236 18732 40732 58813
208E8813J2815O316q34p652j3625j8541k1719k2663k1735j8976j4435q538k098
$$ 58813 71628 77944 77110 69458 55833 37292 15573 -7090 -28825 -47801 -62236 -70774 -72872
221g2872M354J0541J5627J9156K0901K0864J8938J5211J0308M554j638p560j2627
$$ -72872 -68518 -57977 -42350 -23194 -2293 18571 37509 52720 63028 67582 65944 58384 45757
234D5757j6554j9008j9624j8510j5855j1809o664j046M500R680J3931J6871J8187
$$ 45757 29203 10195 -9429 -27939 -43794 -55603 -62267 -63313 -58813 -49133 -35202 -18331 -144
247a44J8001J6288J2993Q671L659j677o814j1231j4633j6722j7264j6267j3847
$$ -144 17857 34145 47138 55809 59468 57791 50977 39746 25113 8391 -8873 -25140 -38987
260c8987j0237n732o94M259Q838J2587J5183J6285J6014J4378J1354P366K776
$$ -38987 -49224 -54956 -55650 -51391 -42553 -29966 -14783 1502 17516 31894 43248 50614 53390
273E3390k020o615j0528j3468j5157j5481j4455j2127q748m640j42M320Q297J1532
$$ 53390 51370 44755 34227 20759 5602 -9879 -24334 -36461 -45209 -49849 -49991 -45671 -37374 -25842
287b5842J3693J4534J4140J2542R762O185K077k132o144r536j2034j3413j3587
$$ -25842 -12149 2385 16525 29067 38829 45014 47091 44959 38815 29279 17245 3832 -9755
300i755j2621j0483p414l763K27M167P648J0449J2292J2955J2522J0989Q466N178
$$ -9755 -22376 -32859 -40273 -44036 -43809 -39642 -31994 -21545 -9253 3702 16224 27213 35679 40857
314D0857J485k302n854q849j1045j2146j2205j1223r204o382l032N59M070P166
$$ 40857 42342 40040 34186 25337 14292 2146 -10059 -21282 -30486 -36868 -39900 -39341 -35271 -28105
328b8105R591J1139J1633J1127R647P300M330R96k380n507q081r948j0843j0801
$$ -28105 -18514 -7375 4258 15385 25032 32332 36662 37658 35278 29771 21690 11742 899 -9902
342i902r845p962n406k385P98L894O599Q689R977J0318R820Q455O286L621O43
$$ -9902 -19747 -27709 -33115 -35500 -34702 -30808 -24209 -15520 -5543 4775 14595 23050 29336 32957 33600
357C3600k360n122p406r001r748r631q712o982m617j909R57L723O103P942R021
$$ 33600 31240 26118 18712 9711 -37 -9668 -18380 -25362 -29979 -31888 -30931 -27208 -21105 -13163 -4142
372d142R259Q747P430N439K996K85k382m842o832q190q765q601p678o069l928
$$ -4142 5117 13864 21294 26733 29729 30014 27632 22790 15958 7768 -997 -9598 -17276 -23345 -27273
387b7273j423J137L602N698P272Q172Q302P773O536M689K462K3k388m548o309
$$ -27273 -28696 -27559 -23957 -18259 -10987 -2815 5487 13260 19796 24485 26947 26970 24582 20034 13725
402A3725p442p921p680o799n302l332j067J249L446N287O670P392P471O914N733
$$ 13725 6283 -1638 -9318 -16117 -21419 -24751 -25818 -24569 -21123 -15836 -9166 -1774 5697 12611 18344
417A8344M023J974k05k392m305n839o794p166o888o031m600k783p36J354L326
$$ 18344 22367 24341 24136 21744 17439 11600 4806 -2360 -9248 -15279 -19879 -22662 -23398 -22044 -18718
432a8718M970O165O747O749O179N065L470J586m02k338m086n407o242o509o176
$$ -18718 -13748 -7583 -836 5913 12092 17157 20627 22213 21811 19473 15387 9980 3738 -2771 -8947
447h947n362m010k336m56J436L204M652N673O136O091N502M432K958J224n82k342
$$ -8947 -14309 -18319 -20655 -21111 -19675 -16471 -11819 -6146 -10 6081 11583 16015 18973 20197 19615 17273
463A7273l883n030n721n883n564m746l500j932k21J492L083M338N223N603N501
$$ 17273 13390 8360 2639 -3244 -8808 -13554 -17054 -18986 -19207 -17715 -14632 -10294 -5071 532 6033
478F033M920L893K549R54p20k286l644m644n223n352m985m192l019j581j2J565
$$ 6033 10953 14846 17395 18349 17629 15343 11699 7055 1832 -3520 -8505 -12697 -15716 -17297 -17309 -15744
494a5744K934M099M804N116M968M395L431K126O88q52k255l468m338m823m885
$$ -15744 -12810 -8711 -3907 1209 6177 10572 14003 16129 16817 15965 13710 10242 5904 1081 -3804
509c804m469l724k622j276J58J560K806L825M435M680M469L900K992J788M71r30
$$ -3804 -8273 -11997 -14619 -15895 -15737 -14177 -11371 -7546 -3111 1569 6038 9938 12930 14718 15189 14259
525A4259k181l268m004m415m411l992l283k229r93L06J570K696L582M072M274
$$ 14259 12078 8810 4806 391 -4020 -8012 -11295 -13524 -14517 -14211 -12641 -9945 -6363 -2291 1983
540A983M026L487K612J501K72r75k103l084l703m032l994l578k907j921p91M06
$$ 1983 6009 9496 12108 13609 13881 12906 10803 7719 4016 -16 -4010 -7588 -10495 -12416 -13207 -12801
556a2801J547K559L301L729L885L613L090K277J225J28j021k039k893l423l698
$$ -12801 -11254 -8695 -5394 -1665 2220 5833 8923 11200 12425 12553 11532 9493 6600 3177 -521
571e21l620l204k560j634o12N05J537K441L083L444L549L259K750J979J025j9
$$ -521 -4141 -7345 -9905 -11539 -12151 -11646 -10109 -7668 -4585 -1141 2408 5667 8417 10396 11421 11402
587A1402j029j957k691l141l388l262k850k239j377m33N74J477K309K844L132
$$ 11402 10373 8416 5725 2584 -804 -4066 -6916 -9155 -10532 -10965 -10391 -8914 -6605 -3761 -629
602f29L215K914K430J698Q20j22j049j892k518k909l097k948k546j987j169k88
$$ -629 2586 5500 7930 9628 10448 10326 9277 7385 4867 1958 -1139 -4087 -6633 -8620 -9789 -10077
618a0077O30J469K177K656K924K945K623K143J481O40k31j076j815k381k695k859
$$ -10077 -9447 -7978 -5801 -3145 -221 2724 5347 7490 8971 9611 9380 8304 6489 4108 1413 -1446
634a446k651k273j702r60j46P03J433K062K456K689K654K342J882J247M93l21
$$ -1446 -4097 -6370 -8072 -9032 -9178 -8475 -7042 -4980 -2524 165 2819 5161 7043 8290 8783 8462
650H462j052j718k181k485k597k381j997j487q03n0P03J368J923K261K482K398
$$ 8462 7410 5692 3511 1026 -1571 -3952 -5949 -7436 -8239 -8289 -7586 -6218 -4295 -2034 448 2846
666B846K098J672J059L68l73j062j643k059k321k393k161j798j286o34N3P47J351
$$ 2846 4944 6616 7675 8043 7670 6608 4965 2906 585 -1808 -3969 -5767 -7053 -7687 -7634 -6887 -5536
683e536J830K116K285K210J856J463Q86K36m18j041j553j894k127k154j927j564
$$ -5536 -3706 -1590 695 2905 4761 6224 7110 7346 6928 5887 4334 2440 313 -1841 -3768 -5332
699e332j082n15J35P14J285J667J943K067J954J655J246P53J53m48r97j458j777
$$ -5332 -6414 -6929 -6794 -6080 -4795 -3128 -1185 882 2836 4491 5737 6490 6643 6195 5198 3740 1963
716A963j947j963j744j389r25m22J97P34J231J580J830J915J794J480J107O04
$$ 1963 16 -1947 -3691 -5080 -6005 -6427 -6230 -5496 -4265 -2685 -855 1060 2854 4334 5441 6045
732F045N0m86r98j375j659j810j774j561j200p91k85K50P32J169J447J685J708
$$ 6045 6095 5609 4611 3236 1577 -233 -2007 -3568 -4768 -5559 -5844 -5594 -4862 -3693 -2246 -561 1147
749A147J598J295R41M97jm96r24j256j513j637j585j400j061o66k25K59P05J082
$$ 1147 2745 4040 4981 5478 5477 4981 4057 2801 1288 -349 -1934 -3334 -4395 -5061 -5286 -5027 -4322 -3240
767c240J346J556J559J453J175Q01M04n2n06r04j208j416j547j443j276r15n55
$$ -3240 -1894 -338 1221 2674 3849 4650 5054 5002 4496 3592 2384 968 -579 -2022 -3298 -4213 -4768
784d768j29L10P07J041J286J432J438J292J043O81K90r7n04q46j115j305j382
$$ -4768 -4897 -4587 -3880 -2839 -1553 -121 1317 2609 3652 4333 4623 4526 4022 3176 2061 756 -626
801f26j299j104q24m44p2L03O70R34J187J288J298J141R41O06K05j33m86p92j073
$$ -626 -1925 -3029 -3853 -4297 -4369 -4066 -3396 -2462 -1275 13 1311 2452 3393 3999 4204 4071 3585 2793 1720
820A720j215j274j183r83p37l94jL40O61R22J150J204J194J043Q14N33J53j76
$$ 1720 505 -769 -1952 -2935 -3672 -4066 -4067 -3727 -3066 -2144 -994 210 1404 2447 3261 3794 3947 3771
838C771m92q16j009j130j163j071q84o28l00J2L40O49Q83J053J087J066R29P18
$$ 3771 3279 2463 1454 324 -839 -1910 -2794 -3422 -3722 -3710 -3370 -2721 -1838 -785 302 1368 2297 3015
856C015M41J37k01m90p45r31j051j057r57p99n48k62M9L47O38Q27R75J036R84
$$ 3015 3456 3593 3392 2902 2157 1226 175 -882 -1839 -2638 -3186 -3448 -3399 -3052 -2414 -1587 -612 424 1408
875A408Q56O32L70Q6k20n06p41q87r84r82q79p13m72j95Q4L71O09Q06R09R65Q92
$$ 1408 2264 2896 3266 3352 3132 2626 1885 998 14 -968 -1847 -2560 -3032 -3227 -3143 -2772 -2163 -1357 -448 517 1409
896A409P48N51L10L3k21m88o91q29r02q78p91o25m19j51J01L65N77P41Q42Q75
$$ 1409 2157 2708 3018 3051 2830 2342 1651 822 -80 -958 -1749 -2374 -2793 -2944 -2843 -2478 -1901 -1160 -318 557
916E57Q12O69N04K64Nk41m68o61p79q38q26p18n73l40j20J33L74N59P13Q05Q09
$$ 557 1369 2038 2542 2806 2811 2570 2102 1441 662 -176 -1002 -1720 -2293 -2633 -2753 -2620 -2246 -1687 -974 -169 640
937F40P27O10M35K17l9k54m66o34p28p78p47o40m88k86r2J54L62N39O63P30P30
$$ 640 1367 1977 2412 2629 2590 2336 1870 1236 508 -270 -1017 -1657 -2145 -2431 -2523 -2369 -2007 -1468 -805 -75 655
958F55O72N46L72J60m1k60m47n97o80p07o89n84m42k37l8J49L60N32O06O82O97
$$ 655 1327 1873 2245 2405 2364 2104 1657 1060 380 -327 -1016 -1600 -2042 -2279 -2317 -2168 -1808 -1276 -670 12 709
979G09O03M87L25J15q0k57m30n64o47o64o18n26l79k02j8J77L51N02N84O40O23
$$ 709 1312 1799 2124 2239 2159 1902 1472 908 261 -403 -1021 -1547 -1926 -2128 -2146 -1969 -1618 -1116 -532 108 731
1000G31N62M15K86Q9r7k53m17n40o01o20n63m73l29j64lJ83L44M72N53N88N81
$$ 731 1293 1708 1994 2083 1986 1733 1316 776 175 -445 -1008 -1481 -1810 -1974 -1977 -1794 -1450 -978 -425 163 744
1021G44M89L84K38O4r9k63m09n08n61n59n24m14k88j43K7J88L38M43N38N42N34
$$ 744 1233 1617 1855 1919 1820 1557 1148 640 79 -480 -1004 -1418 -1706 -1849 -1822 -1634 -1296 -853 -315 227 761
1042G61M42L36K11L5j12k66l91m74n25n26m72l84k49j02M3K01L14M36M92N18M84
$$ 761 1203 1539 1750 1785 1673 1407 1016 542 17 -509 -981 -1365 -1614 -1716 -1673 -1472 -1158 -722 -230 288 772
1063G72M03K87J82Kj33k52l77m52m93m83m29l37k17p5O0J92L38M06M55M80M27
$$ 772 1175 1462 1644 1646 1513 1261 884 432 -61 -544 -973 -1310 -1527 -1602 -1542 -1350 -1012 -606 -151 329 756
1084G56L82K47J47jj31k53l78m14m50m55l88k98j85o1O3K04L18L81M31M36L99
$$ 756 1138 1385 1532 1531 1400 1147 769 355 -95 -550 -938 -1236 -1421 -1482 -1419 -1215 -897 -516 -85 351 750
1105G50L36K28J10j1j45k61l50m01m25m05l49k69j58k4Q0K01K97L68M13L93L67
$$ 750 1086 1314 1424 1413 1268 1007 657 256 -169 -574 -923 -1192 -1350 -1374 -1294 -1093 -796 -428 -15 378 745
1126G45K99J94P9k7j39k41l25l80l90l77k99k48j27k7R7K05K66L41L79L66L33
$$ 745 1044 1238 1317 1290 1151 910 585 205 -185 -562 -861 -1109 -1236 -1263 -1166 -961 -695 -354 25 391 724
1147G24K59J72N7m3j32k47l14l41l65l45k84k02j05jJ00J92K76L30L51L42L07
$$ 724 983 1155 1212 1169 1037 790 476 135 -230 -575 -859 -1061 -1166 -1167 -1067 -875 -599 -269 82 424 731
1168G31K19J29O4m7j65k30k97l21l38l07k49j73r5JJ04J88K70L10L07L11K69J96
$$ 731 950 1079 1143 1096 931 701 404 83 -255 -562 -811 -984 -1079 -1078 -974 -786 -516 -206 101 412 681 877
1190H77J18L2m6j51k14k93k90l08k82k17j57p2J7J17J73K59K89K96K83K54J71
$$ 877 995 1027 981 830 616 323 33 -275 -557 -774 -931 -1003 -986 -869 -696 -437 -148 148 431 685 856
1211H56J09Ln2j59k26k59k91k81k55k11j19n0L5J10J83K41K59K85K45K30J58P6
$$ 856 965 968 916 757 531 272 -19 -300 -555 -766 -885 -935 -900 -790 -607 -366 -107 178 423 653 811 887
1233H87Pp8j53k05k53k63k46k36j69j11m6L6J10J78K28K59K52K39J93J43O5j1
$$ 887 894 816 663 458 205 -58 -304 -540 -709 -820 -866 -830 -720 -542 -314 -55 197 436 629 772 837 826
1255H26q1j45j96k44k45k36k10j67p7k3L3J20J68K34K30K37K11J87J04N5k5q9
$$ 826 745 600 404 160 -85 -321 -531 -698 -775 -798 -765 -645 -477 -243 -13 224 435 622 726 781 756 667
1277F67j36j93k25k26k15j99j31p7j0N1J18J73J99K30J99K02J51J11K4qr6j34
$$ 667 531 338 113 -113 -328 -527 -658 -735 -745 -694 -576 -403 -204 26 225 427 578 689 713 705 609 475
1299D75j81k07k02k24j62j30n5JN8J21J48J99J99J95J94J29Q7K8k8r5j33j70k02
$$ 475 294 87 -115 -339 -501 -631 -686 -685 -627 -506 -358 -159 40 235 429 558 645 673 645 550 417 247 45
1322D5k09j81j51j00m9RN8J09J63J73K10J67J65J24P4K1k8r4j39j53j90j75j61
$$ 45 -164 -345 -496 -596 -645 -636 -578 -469 -306 -133 77 244 409 533 607 628 600 506 367 214 24 -151 -312
1345c12j38r9l1mO4J13J40J67J72J66J42J17O3J2l7q0j28j63j77j61j56j15p6
$$ -312 -450 -549 -580 -584 -520 -407 -267 -100 72 238 380 497 560 572 535 455 327 164 -13 -174 -330 -445 -521
1368e21l9L0N0J17J42J63J58J54J37R7N0lm4p3j21j53j60j54j36j08p2k0K5N2
$$ -521 -560 -530 -480 -363 -221 -58 100 254 391 488 538 535 491 418 297 144 -16 -170 -306 -414 -486 -506 -481 -429
1392d29J11J22J52J55J27J23Q8M0ll4q8j24j36j42j42j18j03m9k4K4O7J00J22
$$ -429 -318 -196 -44 111 238 361 449 489 486 452 364 240 104 -38 -180 -298 -401 -450 -474 -450 -383 -283 -161
1415a61J48J28J28J11Q1L2k1k9r1j15j30j26j29j09j08l3j5K5P1R5J30J15J24
$$ -161 -13 115 243 354 435 467 446 417 326 211 81 -45 -174 -283 -391 -424 -439 -414 -343 -248 -118 -3 121
1438A21J16J00O0L0j4m7p8j03j20j31j17j13n6m8j4M6N4R5J14J21J19R3R2N5K4
$$ 121 237 337 397 427 413 366 288 185 65 -66 -183 -296 -352 -400 -414 -368 -314 -219 -105 16 135 228 320 375 399
1463C99lo1p6j04j18j05j01j08o8m2RL2P2R1J02J10J07R6P6M7K4j8n4r2r5j00
$$ 399 396 335 259 155 37 -68 -169 -277 -345 -387 -378 -346 -274 -183 -81 29 136 232 308 355 379 361 307 215 120 20
1489B0j18j09p5n2l5RM3O5Q0J12J02J01Q5P4L5J7j5n7p0j01j01j10q7o9n6k5J7
$$ 20 -98 -207 -282 -334 -369 -360 -317 -252 -172 -60 42 143 228 302 337 354 339 282 212 111 10 -100 -187 -256 -312 -337 -320
1516c20M2O0Q0Q5J05J04P8O6J9lj7n5p3r3j01r1p8o8n6qJ5M3O8Q5Q8R4Q8O1O6
$$ -320 -278 -218 -138 -53 52 156 234 300 319 316 299 244 171 78 -23 -114 -192 -260 -316 -324 -309 -266 -198 -113 -25 69 157 218 284
1545B84L1j7j5m7q3q8r8o6p9n3n2qJ7L6O4P6Q1Q7Q4O1N1J7ll6n7n6r2q2p3o8n8
$$ 284 315 298 283 236 153 65 -33 -99 -178 -231 -283 -291 -274 -238 -174 -98 -17 70 154 215 266 283 280 244 187 131 39 -43 -116 -184 -242
1576b42k9QOM1N7R1N7Q6P4N5N6J4j9j9n9p0o7q6o8n8n0l0j1K5M0O1O9P8P1O3M3
$$ -242 -271 -263 -257 -216 -159 -68 -11 75 149 204 260 274 255 236 177 107 40 -46 -114 -172 -222 -252 -263 -238 -198 -137 -68 10 81 144 187
1607A87N0J0j6l5m0p0p5o9o6n4m6k3RK5L7N8N9P9O6N6N5L0Qj9l4m4o6n9p4o5m4
$$ 187 237 247 231 196 156 86 11 -58 -124 -178 -224 -247 -238 -213 -176 -118 -59 20 86 142 197 227 235 216 182 138 72 13 -61 -126 -170
1638a70l5k4J2K2M1N5O1P1O2N4N0K1jk9k2o5m8o2o3n3l7n5M%K8L6N6O6O3O0M6
$$ -170 -205 -229 -217 -195 -154 -99 -38 33 95 149 199 220 219 190 168 103 55 -7 -70 -123 -160 -215 -211 -211 -183 -147 -91 -25 38 98 144
1669A44M0K4jl1k8m0n5o1o4m4m5k4j1lL3M4N6M7O9M6N3K5K4j0k6k8n3n6m8n3n5
$$ 144 184 208 207 176 148 108 53 -8 -72 -116 -161 -185 -196 -199 -166 -122 -66 -19 50 96 149 174 198 188 162 134 81 25 -23 -76 -131
1700a31l3j9j2J1L3M2N1M9M8O1L7K3J9j2rl3m5m9n6m8l0m8j8QJ0K1L6M6N1O2M2
$$ -131 -164 -183 -195 -184 -151 -109 -58 -9 39 100 137 160 179 167 158 125 80 31 -25 -73 -103 -151 -169 -161 -151 -130 -94 -48 3 65 107
1731A07L1K1Pkk1k7m9o1m3l8l8l5k0%J9K0L2O0M2N5M8J8K3J7j8k0k2l8n2m0m5
$$ 107 138 159 166 164 143 116 67 6 -37 -75 -113 -148 -168 -168 -149 -129 -97 -37 5 60 108 126 149 166 148 128 106 68 16 -24 -69
1762f9l8j7j8lOL1M0M5L7M2M0L1J2J6k0k2k3m9m2l7m4l4k4j0JK8K5L6L8M2M6L0
$$ -69 -107 -124 -142 -145 -139 -108 -68 -23 14 56 96 127 139 155 135 113 90 41 -1 -38 -82 -116 -140 -150 -149 -121 -96 -60 -22 20 66 96
1794I6K6J0Lpk1k0m5m5l0l2l0l1%NRK8K9L6M0L9K8K3K1Jk0j7l4l7k5m0l7k8k1
$$ 96 122 132 135 128 107 87 42 -3 -33 -65 -95 -126 -126 -121 -112 -84 -55 -19 21 60 88 111 132 133 113 96 62 25 0 -40 -77 -105 -126
1827a26LMJ1L0L3L1M3L8L1J0QLj6j5k2l8m1l7j8k7k1jJ3LL8K9K5L8L2K9J8jJ0
$$ -126 -123 -119 -108 -78 -45 -14 29 67 98 108 116 119 103 88 66 28 -13 -50 -68 -95 -116 -117 -104 -101 -63 -34 -9 29 61 90 108 107 117
1860A17j4k6l0k9k5m3l5pk0QrL2J9K5L8L8K1K6LJ0kk2pk6k4l1l8k4j8mqOK7K2
$$ 117 103 77 47 18 -7 -50 -85 -92 -112 -104 -113 -81 -62 -37 1 39 60 86 89 99 97 75 68 42 18 -13 -51 -75 -93 -97 -105 -99 -72 -50
1894e0K2L8K7J2K6MK5j3rk9k3k7l1l2k1j5j2J2jL2J6J8L2K6L5J1J5Nlrk9k9j3
$$ -50 -28 10 37 49 75 79 104 91 82 53 30 3 -28 -60 -81 -96 -108 -96 -97 -65 -49 -31 1 27 62 73 88 93 90 81 52 23 10
1927A0m1j5k1j5rrJ8J0L0K5K4L4J4J9J9jok8pk7l2k3k5k1mj4nRK9K2L3K5J5K6
$$ 10 -31 -46 -67 -82 -91 -100 -82 -72 -42 -17 7 41 55 74 93 92 86 58 51 24 -8 -31 -56 -77 -81 -95 -100 -91 -62 -40 -7 18 33 59
1961E9J8Oj6J0j2j5k7l1k2j7j7j2Qj0J9K2J4J4K9K0K5NOpjj3k2k6k0j8k6j3qJ1
$$ 59 77 83 67 77 65 50 23 -8 -30 -47 -64 -76 -68 -78 -59 -37 -23 -9 20 40 65 70 76 69 68 55 33 7 -13 -31 -57 -70 -78 -67
1995f7j2QL1NK9J9K6K2NJ3oj1kk6j4j6m1qj4oj6QJ9J1J6K6J9K3J2Rk%Kj5j8l0
$$ -67 -79 -71 -40 -35 -6 13 39 61 66 79 73 62 60 34 20 4 -37 -45 -59 -65 -81 -73 -54 -43 -27 -1 18 41 53 62 60 60 62 47 29 -1
2031aqj9k3j2j0LPQK2J2K5K4NK4oK9j2k1Mk3j9k2j3j8j3pNQJ3RL0J4J9%J6PJ0
$$ -1 -9 -28 -51 -63 -73 -70 -63 -55 -33 -21 4 28 33 57 51 80 68 47 51 28 9 -13 -26 -44 -57 -64 -59 -51 -38 -29 1 15 34 34 50 57 67
2068F7oj8rj5k5qj3k4j0qNPJ1K0J6J3K3J8jJ5JqKj2j3k2j6j9qj9OJjJ4PL2J6J2
$$ 67 61 43 34 19 -6 -14 -27 -51 -61 -69 -64 -57 -46 -26 -10 3 26 44 43 58 59 51 53 41 28 6 -10 -29 -37 -56 -50 -49 -50 -36 -29 3 19 31
2106C1J0JJ6kj2kj7j2j3k1j9j0qQkqK6J5J5QK3J3mJ4okj2j6omk0j6j1jj2J5OP
$$ 31 41 42 58 56 44 42 25 13 0 -21 -40 -50 -58 -50 -52 -60 -34 -19 -4 4 27 40 36 50 44 42 30 14 8 4 -16 -32 -43 -44 -56 -41 -35 -28
2144b8J3J2J5J7J5mJRloj0j7j9k1rj0mj7J6JK2OJ6K3J3NNPr%Jj8ok2j5pqmkJ0
$$ -28 -15 -3 12 29 44 40 41 50 47 41 31 14 -5 -26 -35 -45 -49 -66 -50 -49 -27 -21 -5 18 31 36 41 48 39 39 40 22 16 -6 -21 -28 -36 -40 -42 -32
2184c2jJ5LK4J0J2QJ0m%lrj0k5nk1Jj1jlPPOJ6QJ5QPKK0j5j2jj8%j8j1npJoJ5
$$ -32 -33 -18 -15 9 19 31 39 49 45 45 42 33 23 -2 -7 -28 -27 -38 -39 -42 -35 -28 -22 -6 2 17 25 32 34 54 39 27 26 8 8 -10 -21 -26 -33 -32 -38 -23
2226b3lQJ1J3J9NjJ1njj3qrj0j7kpKj3JjK1J0MJ4PJ0NLJQj3rpj4pojnomOOJ7O
$$ -23 -26 -18 -7 6 25 30 29 40 35 34 21 13 4 -6 -23 -25 -32 -30 -43 -42 -43 -22 -12 -8 6 13 23 28 31 32 40 27 18 11 -3 -10 -16 -17 -22 -28 -32 -26 -20 -3 3
2271CJ0RJ2pQJlj0%k2qoj0j0%KLNJJ0J4PJ0Rm%KOj7Rk1mrpoj3J0kK%J3J9JQJ0
$$ 3 13 22 34 27 35 36 33 23 23 1 -7 -13 -23 -33 -33 -31 -28 -23 -22 -12 2 9 19 28 24 24 26 32 15 24 3 -1 -10 -17 -23 -36 -26 -28 -26 -26 -13 6 7 15 25
2316B5jJ2npmpkj8j0lj5PpRjJ2PQnL2oOjKKj1Kj8j0mmplKORKK1j4RJ8JnpPNoj9
$$ 25 24 36 31 24 20 13 11 -7 -17 -20 -35 -28 -35 -26 -27 -15 -8 0 -5 27 21 27 26 28 30 19 21 3 -7 -11 -15 -22 -25 -23 -17 -8 -6 15 1 10 28 29 24 17 24 29 23 4
2364Doj3kjjj0KpJ1J2kJ3LQJ1PpnRrj2lKj3j6kMOlQJ6LNjOJ1lmLj6J6j6j3mrj2
$$ 4 -2 -15 -17 -18 -19 -29 -27 -34 -23 -11 -13 0 3 11 22 29 22 17 26 17 5 2 4 -9 -25 -27 -23 -17 -20 -12 4 7 12 11 17 28 25 21 24 8 24 8 -5 -9 -18 -30
2410c0RMrJ0nJ4mJ2QJ2mlJ2j0nKj1lOj2j0NkLmJ2MLJ3PmkJ4j5Qkpk2kjo%%pJJ3
$$ -30 -21 -17 -26 -16 -21 -7 -11 1 9 21 17 14 26 16 11 13 2 -1 5 -7 -17 -12 -14 -11 -15 -3 1 4 17 24 20 18 32 17 25 23 16 -6 -8 -9 -15 -15 -15 -22 -21 -8
2456hnQNj1J4J0MJl%jlpqpnJJqQOKJ0mPKJ5lLmllpKj2KrmKj1%J2jjJ4pJ6OljJ3
$$ -8 -13 -5 0 -11 3 13 17 18 15 15 14 11 4 -4 -11 -16 -15 -14 -22 -14 -8 -6 4 0 7 9 24 21 24 20 17 14 7 9 -3 -1 -10 -14 -12 -23 -23 -11 -12 -13 1 -6 10 16 13 12 25
2507B5j0k%nrkqLj1LjJ5NpJ8LKN%rNjoj1llpmoNj1NQNQJRJJ3rLokjj0NKj3mnj
$$ 25 15 13 13 8 -1 -3 -11 -8 -19 -16 -17 -2 3 -4 14 17 19 24 24 15 20 19 13 2 -1 -4 -11 -15 -21 -16 -27 -22 -14 -9 -1 0 9 10 23 14 17 11 9 8 -2 3 5 -8 -12 -17 -18
2558a8lJ4J2nJJ1LjJLmQmnnlqqkj0NKONLqJ7mJ2qOkklLlj0KkpOlrJ8j3J1J3LJ
$$ -18 -21 -7 5 0 1 12 15 14 15 18 14 22 18 13 8 5 -3 -11 -13 -23 -18 -16 -10 -5 -2 -10 7 3 15 7 13 11 9 6 9 6 -4 -2 -4 -11 -5 -8 -17 1 -12 -1 12 15 16
2607A6Nj2NlMjjpj1jj0NjJr%PJ0JMrJ7JPj6RllmqqPkmpRJJJ3kJ4j0OJ2lqKLj6
$$ 16 21 9 14 11 15 14 13 6 -5 -6 -16 -11 -12 -11 -20 -20 -13 -3 -2 2 -7 10 11 18 2 11 8 5 1 -7 -15 -8 -10 -14 -21 -12 -11 -10 3 1 15 5 11 23 20 12 14 17 1
2656Amo%NljmjJ2Jj4MmJ9LqPKmj%roJNj7J5kPrRKoJ1PpJ2jNj2LrQj7oqQkKOkP
$$ 1 -3 -9 -9 -4 -7 -8 -12 -13 -1 0 -14 -10 -14 5 8 0 7 9 5 4 4 -5 -11 -10 -5 -22 -7 -9 -2 -11 -2 0 -6 5 12 5 17 16 21 9 12 3 11 -6 -12 -20 -12 -14 -12 -6 -8 -1
2708aMJ1j0oK3mj2nNljMk1J7Jj3mPKkRkKJlJ6nKpqRjmk%j1JORj1KlJ6jj2J5Lk
$$ -1 3 14 4 -2 21 17 5 0 5 2 1 5 -16 1 2 -11 -15 -8 -6 -8 1 -1 1 2 -1 15 10 12 5 -3 6 5 1 -1 -1 -12 -11 -5 4 -7 -5 -8 8 7 -5 10 13 11
2756A1MpKnjJj4J2j1NpjJ0JMj0J0J0j2J8j2OmJ6j9nJ0j2rJlNkL%j%J7jolJ2Mo
$$ 11 15 8 10 5 4 5 -9 3 -8 -3 -10 -11 -1 0 4 -6 4 14 2 20 8 14 10 26 7 2 12 0 -9 -8 -11 -6 -8 -5 -5 -6 -6 11 10 4 1 13 17 11
2800A1Jj6KMnnOqJ0kOn%NjK2j0oM%rOlj0MokklKNJ%KM%oKM%jKknJ1j3LmMklPN
$$ 11 12 -4 -2 2 -3 -8 -2 -10 0 -2 4 -1 -1 4 3 25 15 9 13 13 4 10 7 -3 1 -5 -7 -9 -12 -10 -5 -4 -4 -2 2 2 -4 -2 2 2 1 3 1 -4 7 -6 -3 -7 -3 -5 -8 -1 4
2853Dj3K4rj1J5NnMqKnLkqMj8J3KjnJ1%qM%MKnMOlqJ0lr%OklmLJ0MknJ1pL%qL
$$ 4 -9 15 6 -5 10 15 10 14 6 8 3 6 4 -4 0 -18 -5 -3 -4 -9 2 2 -6 -2 -2 2 4 -1 3 9 6 -2 8 5 -4 -4 2 0 -3 -7 -4 6 10 8 3 14 7 10 10 2 5
2904ERj7LknKJ0j4jO%NkLmRnn%Po%KqLJ5oj1mkJ3pJ0mJ0qRj%LPj0JkmqJ1k0J2
$$ 5 14 -3 0 -2 -7 -5 5 -9 -10 -4 -4 1 -1 2 -2 7 2 -3 -3 4 -2 -2 0 -8 -5 10 4 -7 -11 -13 0 -7 3 -1 9 1 10 9 9 12 19 9 10 8 4 -4 7 -13 -1
2953aj1kJ5lQj3QnQLp%QkJ%qljrJ0kR%qLOlPlmOK%Lj2jKkKpJ6j3m%QopJ6LKj0
$$ -1 -12 -14 1 -2 6 -7 1 -4 4 7 0 0 8 6 7 7 -1 -4 -5 -14 -4 -6 3 3 -5 -2 4 1 8 5 1 7 9 9 12 0 -1 1 -1 1 -6 10 -3 -7 -7 1 -5 -12 4 7 9 -1
3005aRrMkMrJlRmoMLomJ6joJ0oPqJLQrmj2J2j0nKMlPlnJMRKplMJ7oq%qJ2j9Q%
$$ -1 8 -1 3 1 5 -4 -3 -6 3 -1 -7 -3 0 -6 -10 6 5 -1 9 3 10 2 3 6 14 5 1 -11 1 -9 -14 -12 -8 -11 -4 -7 -12 -11 -7 2 4 -3 -6 -2 15 9 1 1 -7 5 -14 -6 -6
3058fQmlLRjjKmRnMljrLLjJj8J2pNpMoK2j3OpJ0lnMNj5KNoLjNllNkkjJ3qJ4lr
$$ -6 2 -2 -5 -2 7 6 5 7 3 12 7 11 8 7 -2 1 4 3 4 -14 -2 -9 -4 -11 -7 -13 9 -4 2 -5 5 2 -3 1 6 -9 -7 -2 -8 -5 -6 -1 -4 -7 -2 -4 -6 -7 6 -2 12 9 0
3111@NOj3J4j3kNJpJPnMlj3J3jP%mjoPmqLJ0j5QPNk1J3M%OJqLkQnkrKJRoknnJ0
$$ 0 5 11 -2 12 -1 -3 2 3 -4 -3 4 -1 3 0 -13 0 -1 6 6 2 1 -5 2 -2 -10 -7 3 -12 -4 3 8 -13 0 4 4 10 11 3 6 4 12 7 5 -4 -2 -1 8 2 0 -5 -10 0
3163@j5MJ6rNJLKj0QJmkm%Lj0J9j3Lk%jkJ1JqJ3mPqJ0qkjnQK%oklqJ6kkLkpL%
$$ 0 -15 -11 5 -4 1 2 5 7 -3 5 6 2 0 -4 -4 -1 -11 8 -5 -2 -4 -4 -5 -7 4 5 -3 10 6 13 5 15 7 5 4 -1 7 9 9 3 1 -2 -10 6 4 2 5 3 -4 -1 -1
3214a%MljjnKMlPj5LJ2qJ1rRj0%J4qLpMPj6NQ%Jj9J4mnO%Oj0%NOj0JKoPpQojJ
$$ -1 -1 3 0 -1 -2 -7 -5 -1 -4 3 -12 -9 3 -5 6 -3 6 -4 -4 10 2 5 -2 2 9 -7 -2 6 6 7 -12 2 -2 -7 -1 -1 5 -5 -5 0 6 -4 -3 -1 -7 0 -7 1 -5 -6 -5
3265eJ0mjOMj0MpPnKMj%MqJ1qrORomJmOkjMj2J1mkJllMkNj4J3mOJ0pOjj2JnQN
$$ -5 5 1 0 6 10 0 4 -3 4 -1 1 5 4 4 8 0 11 3 -6 0 9 3 -1 0 -4 2 0 -1 3 -9 2 -2 -4 -3 -6 -9 -5 -7 -2 -16 -3 -7 -1 9 2 8 7 -5 -4 -9 -1 4
3317DkJMmmRqjOJj0LQj0J0pK%oj0J6qpOLmKk%rkK1oNjPj1jPMj1mP%J9j6Qj1kp
$$ 4 2 3 7 3 -1 8 0 -1 5 6 -4 -1 7 -3 7 0 2 2 -4 -14 2 -6 -13 -7 -4 -8 -6 -8 -8 -17 -19 2 -4 1 0 7 -4 -5 2 6 -5 -9 -2 -2 17 1 9 -2 -4 -11
3367a1J2pNkqJ4j3PJl%Mj2NJPmmMpMrkJ4joN%nQmRklkKJ4rpJ0j1POJjj4lkNjQ
$$ -11 1 -6 -1 -3 -11 3 -10 -3 -2 -5 -5 -1 -13 -8 -7 0 -4 -8 -4 -11 -7 -16 -18 -4 -5 -11 -6 -6 -11 -3 -7 2 0 -3 -5 -3 11 2 -5 5 -6 1 7 8 7 -7 -10 -12 -7 -8 0
3418@j2N%JlMJ%jmJLoN%qJ2Jp%L%LjJJJ%NLkmkqJ3rKNMj3OrMnMKJkOj0%J3nj0
$$ 0 -12 -7 -7 -6 -9 -5 -4 -4 -5 -9 -8 -5 -11 -6 -6 -14 -2 -1 -8 -8 -5 -5 -2 -3 -2 -1 0 0 5 8 6 2 0 -8 5 -4 -2 3 7 -6 0 -9 -5 -10 -6 -4 -3 -5 1 -9 -9 4 -1 -11
3472a1KjJ9j0j6QJ2ojRl%lOmNrMKj1MOjoJ0pQj4kJ1qJ1pmQjlJj3J7j2J2LnqKM
$$ -11 -9 -10 9 -1 -17 -9 3 -3 -4 5 2 2 -1 5 1 6 -3 1 3 -8 -4 2 1 -5 5 -2 6 -8 -10 1 -7 4 -3 -7 1 0 -3 -2 -15 2 -10 2 5 0 -8 -6 -2
3519bPnrJ2njQkNjN%j3mLkJJ4qoMrQNmomQ%Lj4P%nMOqKmQpKLJ2j5lQjjJ3pPj3
$$ -2 5 0 -9 3 -2 -3 5 3 8 7 12 12 -1 -5 -2 -4 -3 11 3 -3 1 -8 0 5 1 -5 -9 -1 -1 2 -12 -5 -5 -10 -6 0 -8 -6 -10 -2 -9 -7 -4 8 -7 -10 -2 -3 -4 9 2 9 -4
3572dQlqJ2pjJ0j2Rlj0J1pkNQrJOlmmK%jklNLlMrJ4kj0MJj%OLpmJ0mqJ3llj0R
$$ -4 4 1 -7 5 -2 -3 7 -5 4 1 -9 2 -5 -7 -2 6 -3 -2 4 1 -3 -7 -5 -5 -6 -8 -11 -6 -3 -6 -2 -11 3 1 -9 -5 -4 -5 -5 1 4 -3 -7 3 -1 -9 4 1 -2 -12 -3
3623clKJ3j0lKj0ONqNjkpJ8j7NNljlKNkOnNplQJKj0llOPMoj5J6mN%oLKlLkkQj1
$$ -3 -6 -4 9 -1 -4 -2 -12 -6 -1 -9 -4 -5 -7 -14 4 -13 -8 -3 -6 -7 -10 -8 -3 -5 1 -4 1 -6 -9 -1 0 2 -8 -11 -14 -8 -1 3 -3 -18 -2 -6 -1 -1 -7 -4 -2 -5 -2 -4 -6 2 -9
3676ipML%qJ6Lj2QlJ0koNMj1PlQj3J2kj1PnPm%lMLKpPnm%OLrKOrj0NMPkJlqjN
$$ -9 -16 -12 -9 -9 -17 -1 2 -10 -2 -5 5 3 -3 2 6 -5 2 -1 7 -6 6 4 -7 0 -5 2 -2 -2 -5 -1 2 4 -3 4 -1 -5 -5 1 4 -5 -3 3 -6 -16 -11 -7 0 -2 -1 -4 -12 -13 -8
3729hQ%mlNlRMj0PqMjOrJ0j0OnMlprJ5J0%r%lJ6j4J3nrMj0J5pnJ2j3QmMOpNrO
$$ -8 0 0 -4 -7 -2 -5 4 8 -2 5 -3 1 0 6 -3 7 -3 3 -2 2 -1 -8 -17 -2 8 8 -1 -1 -4 12 -2 11 6 -3 1 -9 6 -1 -6 6 -7 1 -3 1 7 0 5 -4 2
3778BKqONj0kJ5kj5l%MLJ1nrPljmmQpKjNrJ1mJ2j7J6j2%J4rLlLnPkoMMJL%pKl
$$ 2 4 -4 2 7 -3 -5 10 8 -7 -10 -10 -6 -3 8 3 -6 1 -2 -3 -7 -11 -3 -10 -8 -9 -4 -13 -2 -6 6 -11 5 -7 -7 7 -2 1 -2 1 -4 3 1 -5 -1 3 4 7 7 0 2 -1
3829aQpJ1poMLmj1J9j8J2llloJ0Nj5J5rmJ7j3NqJ0NnnJ5qLrJRJ1j4KLll%Nj4P
$$ -1 7 0 11 4 -2 2 5 1 -10 9 -9 3 0 -3 -6 -12 -2 3 -12 3 -6 -10 7 -6 -1 -9 1 6 1 -4 11 3 6 -3 -2 7 18 4 6 9 6 3 3 8 -6 1
3875ANnKnkJ0Kjj1kmJ4k1PjRoMJ1j1jNkjOrLQpJQj3J2pJ9j0Mj2NLljj2MKJJ3j6
$$ 1 6 1 3 -2 -4 6 8 7 -4 -6 -10 4 -17 -10 -11 -2 -8 -4 7 -4 -5 0 -2 -3 3 -6 -3 5 -2 -1 7 -6 6 -1 18 8 12 0 5 8 5 4 -8 -4 -2 -1 12 -4
3923djPqJkJ6j6O%jLpJ2j0kOrOLPkNoNrMJkOJmmJq%jJ1jLjLMj3lK%Q%oj2Q%Kq
$$ -4 -5 2 -6 -5 -7 9 -7 -1 -1 -2 1 -6 6 -4 -6 0 -9 -3 0 7 5 10 4 9 0 4 5 3 9 10 6 2 3 -5 -5 -6 5 4 7 6 9 13 0 -3 -1 -1 7 7 1 -11 -3 -3 -1 -9
3977iMMkLpJ2rjKNpLNQnqKJNQj9J3mJ0rKKpjknjNjJoJ3qjkLkJ2j0J1%j6J4mjQ
$$ -9 -5 -1 -3 0 -7 5 -4 -5 -3 2 -5 -2 3 11 6 -2 0 1 6 14 -5 8 4 14 5 7 9 2 1 -1 -6 -7 -2 -3 -2 -8 5 -3 -4 -6 -3 -5 7 -3 8 8 -8 6 2 1 9
4028In%Kj2MRKqLjlJ0nmJ2orOJj3J1jmPmmJ%lRoMKnQkmQj2OkrJ1oO%l%LLmNrM
$$ 9 4 4 6 -6 -2 7 9 1 4 3 0 10 5 1 13 7 -2 4 5 -8 3 2 -2 5 1 -3 -2 -2 -5 4 -2 2 4 -1 7 5 1 9 -3 3 1 -8 3 -3 3 3 0 0 3 6 2 7 -2 2
4082BJ4j4LmPnqjJoLJ1o%J%%KQj6MMj3J3mMKrKM%J1kj3J6nj3K1j2mmJ1rMQqMo
$$ 2 16 2 5 1 8 3 -5 -6 -5 -11 -8 3 -3 -3 -2 -2 -2 0 8 -8 -4 0 -13 0 -4 0 2 -7 -5 -1 -1 10 8 -5 11 6 -7 14 2 -2 -6 5 -4 0 8 0 4 -2
4130bjQlqKQpJ1onkKKKpnKQk%QpJnQ%Pj4QjQj4J6rMqJkPjmJnpMMknJ0mRqnmJ2
$$ -2 -3 5 2 -6 -4 4 -3 8 2 -3 -5 -3 -1 1 -6 -11 -9 -1 -3 -3 5 -2 -1 -6 2 2 9 -5 3 2 10 -4 12 3 7 -1 0 -2 5 4 0 1 -4 -11 -7 -3 -5 -10 0 -4 5 -3 -8 -12 0
4185@LrLLJpJ6k0J6l%Jj2K3j3KLmrJ9nj1QlJLQj3MQj5J6lPnoj4QOKpLmJnmJ0l
$$ 0 3 -6 -3 0 1 -6 10 -10 6 3 3 4 -8 15 2 4 7 3 -6 13 8 -3 5 2 3 6 14 1 5 13 -2 14 11 18 13 7 -7 1 7 9 2 5 1 2 -3 -7 3 0
4233@jNK%kPpkJ2lJ%qKJ1j7J6pJMj0PLj5QrpQlJlJ7nqPj0lOmKkRrNMNqoJ4oj0
$$ 0 -1 4 6 6 4 11 4 2 14 11 12 12 4 6 17 0 16 9 10 14 4 11 14 -1 7 -2 -9 -1 -4 -3 -6 11 6 -2 5 -5 -8 -2 -6 -4 -6 3 -6 -1 3 8 0 -6 8 2 -8
4284hK3j4KqJ5op%mJ3j3J3klJNj4jQmOjLloMjj2KLlOjJ0pOj3J1O%j3MLrJ4mjK
$$ -8 15 1 3 -5 10 4 -3 -3 -7 6 -7 6 4 1 2 7 -7 -8 0 -4 2 1 4 1 -5 -1 -2 -14 -12 -9 -12 -6 -7 3 -4 2 -11 0 6 6 -7 -3 0 -9 5 1 0 2
4332BLNJj8MjjLKqJOLlnRrk%j4J1k%RKloPrLJJ0mlJjmRLlLnkJJpLJ0lm%mKNjk
$$ 2 5 10 11 -7 -3 -4 -5 -2 0 -8 -7 -1 2 -1 -6 3 -6 -8 -8 -22 -11 -13 -13 -4 -2 -5 -11 -4 -13 -10 -9 1 -3 -6 -5 -6 -10 -1 2 -1 2 -3 -5 -4 -3 -10 -7 3 0 -4 -4 -8 -6 -1 -2 -4
4388dJk%LmjKKK%lMrjJ3j3J4rjNPj3QJ2j6JKMpJ0kj1%Rj1J6nNj2Lj2J0J0j0jr
$$ -4 -3 -5 -5 -2 -6 -7 -5 -3 -1 -1 -4 0 -9 -10 3 -10 4 -5 -6 -1 6 -7 1 13 -3 -2 0 4 -3 7 5 -6 -6 3 -8 8 3 8 -4 -1 -13 -3 7 -3 -4 -13
4434a3J0LmnRlJPl%pljkOlJ1mlmJ4jlkLNmj2%PMj0J1mLoMOpjkJ2j6jjKMJnJ1p
$$ -13 -3 0 -4 -9 0 -3 -2 5 2 2 -5 -8 -9 -11 -5 -8 3 -1 -4 -8 6 5 2 0 3 8 4 -8 -8 -1 3 -7 4 0 3 -3 1 7 0 -1 -3 9 -7 -8 -9 -7 -3 -2 -7 4 -3
4485cnJ1opJ3jJjnOpNKNj5P%JmRooJ7qqNmmPMOj2l%LMqLPpNKmjKnJ3j3NmLoLJ0
$$ -3 -8 3 -3 -10 3 2 3 2 -3 3 -4 1 3 8 -7 0 0 1 -3 6 0 -6 11 3 -5 0 -4 -8 -1 3 9 -3 -6 -6 -3 1 -7 -4 3 -4 1 3 -1 -2 0 -5 8 -5 0 -4 -1 -7 -4 6
4539Fkn%LKKMjmnO%rkoOMJlNrJ1qMmlOj1J2noKkOKOrOkRjj4MJJ1ok%QKj5NPJL
$$ 6 4 -1 -1 2 4 6 10 9 5 0 6 6 -3 -5 -11 -5 -1 0 -3 2 -7 4 -4 0 -4 -7 -1 -12 0 -5 -11 -9 -11 -5 -3 3 -6 0 -2 7 6 -8 -4 -3 8 2 0 0 8 10 -5 0 7 8 11
4594A1j5Ppj0J3krJ0jKnj0J0J0plnNKjkMkPlkPrNRj3%J1qMJrPQj0LmJ3qj7O%K
$$ 11 -4 3 -4 -14 -1 -3 -12 -2 -3 -1 -6 -16 -6 4 -3 -6 -11 -6 -4 -5 -7 -3 -5 2 -1 -3 4 -5 0 9 -4 -4 7 -1 3 4 -5 2 10 0 3 -1 12 4 -13 -7 -7 -5
4642ekKRnloJR%%q%jO%RpPq%jLoKQrJLlRPqpLJNj0NjJ0rpNMkj0J1Mj1pJ1nJ2j1
$$ -5 -7 -5 4 -1 -4 -10 -9 0 0 0 -8 -8 -9 -3 -3 6 -1 6 -2 -2 -3 0 -6 -4 4 -5 -4 -1 -4 5 12 4 -3 0 1 6 -4 1 0 10 1 -6 -1 3 1 -9 2 6 -5 -12 -1 -6 6 -5
4696ejQJNMj1kmOKLlOllmjK%LJoKlK%mJ0n%kJmMJnJ%%mnkJ0J3j0Mj1J1jLNjko
$$ -5 -6 2 3 8 12 1 -1 -5 1 3 6 3 9 6 3 -1 -2 0 0 3 4 -2 0 -3 -1 -1 -5 5 0 0 -2 -1 -5 -1 0 -5 -4 -4 -4 -8 -13 -15 -5 8 -2 2 -9 2 1 4 9 8 6 0
4750@kjjJNjNoOpKNm%oMjNo%J0j2oJ0j4RJ0qkNpP%JNpKnQMp%%NmkoJ3jnJJ0j7
$$ 0 -2 -3 -4 -3 2 1 6 0 6 -1 1 6 2 2 -4 0 -1 4 -2 -2 8 -4 -10 0 -14 -5 5 -3 -5 0 -7 0 0 1 6 -1 1 -4 4 8 1 1 1 6 2 0 -6 7 6 1 2 12 -5
4803eRJj1JPlK%kOrjKRnJnMj1LRLmKj%j3J0J4qqNLjMqLJ3rnLPj1kO%%m%lmK%j
$$ -5 4 5 -6 -5 2 -1 1 1 -1 5 -4 -5 -3 6 1 2 -3 1 -10 -7 2 5 1 3 2 2 -11 -1 13 5 -3 2 5 4 8 0 3 16 7 2 5 12 1 -1 5 5 5 1 1 -2 -6 -4 -4 -5
4857eJ0qOj0Rj3PjJ0qNQkj3J2rL%OnKPoPkj1J0MmLJm%mLnj2PjMnJkMpJ5j0nPN
$$ -5 5 -3 3 -7 2 -11 -4 -5 5 -3 2 10 8 -5 7 -2 1 1 7 2 4 11 5 12 10 -1 9 13 9 12 13 9 9 5 8 3 -9 -2 -3 1 -4 -3 -5 -1 -8 7 -3 -8 -1 4
4907Dj3J3%omjJ0rJ1oJ3j6J1j2LJ3j5LNjNJj0LJ%nmKjj1J2lKM%o%KRnPj1J0om
$$ 4 -9 4 4 -2 -6 -7 3 -6 5 -1 12 -4 7 -5 -2 11 -4 -1 4 3 8 9 -1 2 3 3 -2 -6 -4 -5 -16 -4 -7 -5 -1 -1 -7 -7 -5 4 -1 6 -5 5 -1 -5
4953eJ4j0mMNL%j3PRl%j0OKnjmP%%lJoKNnkRPj2kJlJ3pLoKQj1JNlRqpRPojLJK
$$ -5 9 -1 -5 -1 4 7 7 -6 1 10 7 7 -3 3 5 0 -1 -5 2 2 2 -1 0 -6 -4 1 -4 -6 3 10 -2 -4 -3 -6 7 0 3 -3 -1 7 -4 -3 2 -1 8 0 -7 2 9 3 2 5 6 8
5007HKOj0j2J5rQKj3nOOpMpKoOj4RNPj6LJ3k3J7mLJ3j1NMpmJ1%lmJJ2j0kKqMN
$$ 8 10 16 6 -6 9 0 8 10 -3 -8 -2 4 -3 1 -6 -4 -10 -4 -18 -9 -4 3 -13 -10 3 -20 -3 -7 -4 9 -2 3 7 0 -4 7 7 4 0 1 13 3 1 3 -5 -1 4
5054Dk%No%Pnj%rMNpPKnko%KLpJ2pMnNkR%j3QRj8QKRJj7J0jqjPJ0qkr%MkJ1rm
$$ 4 2 2 7 1 1 8 3 2 2 -7 -3 2 -5 2 4 -1 -3 -9 -9 -7 -4 -11 1 -6 -2 -7 -2 -4 5 5 -8 0 9 -9 -1 1 10 11 -6 4 3 -5 -6 1 11 3 1 -8 -8 -4 -6 5 -4 -8
5108h%JPqlRKnkNpR%l%qJ8mlpKNmJ6loLNj1K%JklJPpllJ0mRj2lRqnMmJ7j4JLk
$$ -8 -8 -7 0 -8 -11 -2 0 -5 -7 -2 -9 0 0 -3 -3 -11 7 3 0 -7 -5 0 -4 12 9 3 6 11 0 2 2 3 1 -2 -1 6 -1 -4 -7 3 -1 8 -4 -7 2 -6 -11 -7 -11 6 -8 -7 -4 -6
5162fJ2j3J3Jpj0J6kkQlmKLqJ8j2lMoJ2j3kKJ1%mrjj%KNJj7J0pJ5j4LnJ5KrJ3
$$ -6 6 -7 6 7 0 -10 6 4 2 10 7 3 5 8 0 18 6 3 7 1 13 0 -2 0 11 11 7 -2 -3 -4 -4 -2 3 4 -13 -3 -10 5 -9 -6 -11 4 6 -3 10
5207A0jj3jNOj5NNmQJj4LNpJ0mJnJKmLPj2Lj1QJ1pLpJmP%%nLJ0rqJ3NrPjkKJ4
$$ 10 9 -4 -5 0 6 -9 -4 1 -3 5 6 -8 -5 0 -7 3 -1 0 -5 -4 -2 -6 -3 4 -8 -5 -16 -8 3 -4 -1 -8 -7 -11 -4 -4 -4 -9 -6 4 -5 -13 0 5 -4 3 2 0 2 16
5257A6j4LLqJ2klkm%jLoJ1%j8JJ5lkmrQj2Q%JjlJJ0qJ3j4%OjMnJ1j3%jJPMlLp
$$ 16 2 5 8 0 12 10 7 5 1 1 0 3 -3 8 8 -10 -9 6 3 1 -3 -12 -4 -16 -8 -8 -7 -8 -11 -10 0 -8 5 -9 -9 -3 -4 0 -5 6 -7 -7 -8 -7 0 4 1 4 -3
5306cKPnMj0pPLQj4J0opRjlJkmJ4JnMnpPooJ0kMPLqP%rJ6j2J1Lmj1KpOKj6K0m
$$ -3 -1 6 1 5 -5 -12 -5 -2 6 -8 2 -4 -11 -2 -3 -6 -5 -7 -11 3 4 -1 3 -2 -9 -2 -8 -14 -4 -6 -2 5 8 0 7 7 -2 14 2 13 16 12 1 3 -4 2 4 -12 8 4
5356DnjlJLnJjM%ojJ2pl%Lq%RJjJ1j6J6j2ML%pRJj4J7pn%LkpmNMKlJjkPp%JjK
$$ 4 -1 -2 -5 -4 -1 -6 -5 -6 -2 -2 -8 -9 3 -4 -7 -7 -4 -12 -12 -3 -2 -3 8 -8 8 -4 0 3 3 -4 5 6 -8 9 2 -3 -3 0 -2 -9 -13 -8 -4 -2 -5 -4 -5 -7 0 -7 -7 -6 -7 -5
5410ej2J3pJROok%rJ5nOpJOMmrOmPoJ7j3pPl%mPkj1NP%ml%J9k0JmKLjrJ6j2PJ2
$$ -5 -17 -4 -11 -10 -1 5 -1 -3 -3 -12 3 -2 4 -3 -2 4 8 4 -5 1 -3 4 -2 15 2 -5 2 -1 -1 -5 2 0 -11 -6 1 1 -3 -6 -6 13 -7 -6 -10 -8 -5 -6 -15 1 -11 -4 8
5461Hj6Pk%MmNjO%mJKpPKnkpMkJPKoLj2jPOllJ3%j3jJ%MjnJ5nOpRmLrj5J0J5r
$$ 8 -8 -1 -3 -3 1 -3 2 1 7 7 3 4 6 -1 6 8 3 1 -6 -2 -4 -3 4 6 0 3 -9 -10 -3 3 0 -3 10 10 -3 -4 -3 -3 1 0 -5 10 5 11 4 13 9 12 3 -12 -2 13 4
5514D%j5J1KJkLqmPnJ1qrOjMqOlmJJ2lljRjlJpO%nkJ5Oj3%JPqqNjJ1koj2J0m%
$$ 4 4 -11 0 2 3 1 4 -4 -8 -1 -6 5 -3 -12 -6 -7 -3 -11 -5 -8 -12 -11 1 -2 -5 -6 3 2 -1 0 -7 -1 -1 -6 -8 7 13 0 0 1 8 0 -8 -3 -4 7 5 -1 -13 -3 -7 -7
5566gOJlj%lJ1j3NOmnJn%Rj0J3Nj1JPkNlj%LmMjLPj7KqRPpj0J0NmojJ3j2nJ0O
$$ -7 -1 0 -3 -4 -4 -7 4 -9 -4 2 -2 -7 -6 -11 -11 -2 -12 1 6 -5 -4 3 1 6 3 2 2 5 1 5 4 7 14 -3 -1 -9 0 7 0 -10 0 5 1 -5 -6 7 -5 -10 0 6
5616Fj1kJoLJ2qj1J9jqLN%jjLJLmkJ0Mpj1MJ0KlrJNolJ5j5MnmlKNl%%MJnN%np
$$ 6 -5 -7 -6 -12 -9 3 -5 -16 3 2 -6 -3 2 2 1 0 3 4 7 3 1 11 15 8 -3 1 11 13 10 1 2 7 1 -2 13 -2 2 -3 -7 -10 -8 -3 -6 -6 -6 -2 -1 -6 -1 -1 -6 -13
5668a3J1Rj0oJ2Lp%J1j0Pj2%QMnMnonRKnkRn%Rj2J%Lo%NnKK6l0Qj2J0KKpOLj%
$$ -13 -2 7 -3 -9 3 6 -1 -1 10 0 7 -5 -5 3 7 2 6 1 -5 -10 -1 1 -4 -6 3 -2 -2 7 -5 -4 -4 -1 -7 -7 -2 -7 -5 21 -9 -1 -13 -3 -1 1 -6 0 3 2 2
5717BKQrJLNKqkJ5j2km%MOpm%lJ1j7%J5j9RoRjj1J2q%PKmNqJ1nK0j4nj1K6rnR
$$ 2 4 12 3 4 7 12 14 6 4 19 7 5 1 1 5 11 4 0 0 -3 8 -9 -9 6 -13 -4 -10 -1 -2 -13 -1 -9 -9 -2 0 -4 1 -7 4 -1 19 5 0 -11 15 6 1 10
5765A0MkrMkL%Kj1PkKnrRjjNlj0MKj%m%kPMjoMOMJJj5QLmQnrPpNLkNoJ2j1%%n
$$ 10 14 12 3 7 5 8 8 10 -1 6 4 6 1 -8 1 0 -1 4 1 -9 -5 -3 -4 -4 -8 -8 -10 -3 1 0 -6 -2 4 8 9 10 -5 3 6 2 10 5 -4 3 -4 1 4 2 7 1 13 2 2 2 -3
5820cPrNppPNmqKJ1lrJ%RmPj3J9nnORqJJ0olPjj2jJ4omQj3KK%LJ0j8MmjJRj7K1
$$ -3 4 -5 0 -7 -14 -7 -2 -6 -14 -12 -1 -4 -13 -12 -12 -3 -7 0 -13 6 1 -4 2 11 3 4 14 8 5 12 11 -1 -2 12 6 2 10 -3 -1 1 1 4 14 -4 0 -4 -5 -4 5 -12 9
5871Ij5moJ7jlNj6J2J0lmJ4Rj1rLNolOoMJ4j3m%lO%kj4J0Oj0QjqjP%lJqljQJO
$$ 9 -6 -10 -16 1 0 -3 2 -14 -2 8 5 1 15 24 13 4 7 12 6 3 9 3 7 21 8 4 4 1 7 7 5 -9 1 7 -3 5 4 -4 -5 2 2 -1 0 -8 -11 -12 -4 -3 3
5920CoOojljPNLnJ2j7QmJNNpP%roOj0jJ6j1JlQonnJ8JqNrKkkKOpJ3oNmMqJ3kL
$$ 3 -3 3 -3 -4 -7 -8 -1 4 7 2 14 -3 5 1 2 7 12 5 12 12 3 -3 3 -7 -8 8 -3 -2 -5 3 -3 -8 -13 5 6 -2 3 -6 -4 -6 -8 -6 0 -7 6 0 5 1 5 -3 10 8 11
5973A1j0NrOKk%lKjNKoNroJ1LrnRqQqQqLJrOJ4LrOjmPpJOqK4k3MjmOKpKjpJ1p
$$ 11 1 6 -3 3 5 3 3 0 2 1 6 8 2 7 -2 -8 3 6 -3 -8 1 -7 1 -7 1 -7 -4 -3 -12 -6 8 11 2 8 7 3 10 3 4 10 2 26 3 7 6 2 8 10 3 5 4 -3 8 1
6027ANnmMmnNMnkj2J9JlpnJ0noJ7LqLK%krKRRJpJmQmoLkJ2pqJqMKljjOrJ1nlq
$$ 1 6 1 -3 1 -3 -8 -3 1 -4 -6 -18 1 2 -1 -8 -13 -3 -8 -14 3 6 -2 1 3 3 1 -8 -6 3 12 13 6 7 3 11 7 1 4 2 14 7 -1 0 -8 -4 -2 -5 -6 -7 -1 -10 1 -4 -7 -15
6082a5J7okLMj0MpJJ4N%oQj5RQqKJ3k2J0%JrNl%Oj3PL%okRolkLmjmLoJ5mPqLM
$$ -15 2 -4 -6 -3 1 -9 -5 -12 -11 3 8 8 2 10 -5 4 12 4 6 19 -3 7 7 8 -1 4 1 1 7 -6 1 4 4 -2 -4 5 -1 -4 -6 -3 -7 -8 -12 -9 -15 0 -4 3 -5 -2 2
6133Bo%pK0kj0oJ2LlRnpJ2pOMj1JjJnJMKlmjPj6%Ok%JNrJ0kNnkPmoJ0JrJ6qKl
$$ 2 -4 -4 -11 9 7 -3 -9 3 6 3 12 7 0 12 5 11 15 4 5 4 5 0 1 5 7 4 0 -1 6 -10 -10 -4 -6 -6 -5 0 -9 1 -1 4 -1 -3 4 0 -6 4 5 -4 12 4 6 3
6185CNllJ%KmmJ1KpLKmnmQJKqMmOj0NLj4LjQmjJ2jj6J2OMjlrJ9j5OnJ1qNlknj
$$ 3 8 5 2 3 3 5 1 -3 8 10 3 6 8 4 -1 -5 3 4 6 -2 2 -2 4 -6 -1 2 -12 -9 -10 -2 -6 -7 5 4 -12 0 6 10 9 6 -3 16 1 7 2 13 5 10 7 5 0 -1
6237aLQnJpoJ4qJ4pqJ2komKLkjlQj1NOjj2NJ0mJ6j3jmRLpmQLojJ3k1R%q%%mQP
$$ -1 2 10 5 6 -1 -7 7 -1 13 6 -2 10 8 2 -2 0 3 1 0 -3 5 -6 -1 5 4 -8 -3 7 3 19 6 5 1 10 13 6 2 10 13 7 6 19 -2 7 7 -1 -1 -1 -5 3 10
6288A0j2PJo%Pj1J0kNpkM%JjNj1J3rLJ4j4NqJ%JjKmOmoPK%LpKkMj2lPqJnMRmQ
$$ 10 -2 5 6 0 0 7 -4 6 4 9 2 0 4 4 5 4 9 -2 11 2 5 19 5 10 2 3 3 4 3 5 1 7 3 -3 4 6 6 9 2 4 2 6 -6 -9 -2 -10 -9 -14 -10 -1 -5 3
6340CJj1J0Qj3j2K1j2RrQJ2j4QjKkj5J7lj7J5lNKjqJ0j0J2kj9LJ5j2MJq%Rj0J2
$$ 3 4 -7 3 11 -2 -14 7 -5 4 -5 3 15 1 9 8 10 8 -7 10 7 -10 5 2 7 9 8 0 10 0 12 10 -9 -6 9 -3 1 2 -6 -6 3 -7 5
6382EjNj3J1Lj0RmJmMnJ7qLnMj4NKJ2opjKJNlQj5lJJmKmQMj8J6j1NJMnjLjJ0n
$$ 5 4 9 -4 7 10 0 9 5 6 2 6 1 18 10 13 8 12 -2 3 5 17 11 4 3 5 6 11 8 16 1 -2 -1 0 -4 -2 -6 2 6 -12 4 -7 -2 -1 3 -2 -3 0 -1 9 4
6432Dk%mJ1oJjMJ0okmlPpJ2j3pKlNJkrJ2oJ6j7QkllLqJ2rJ4rNKLn%PrKmPjNQj1
$$ 4 2 2 -2 9 3 4 3 7 17 11 9 5 2 9 2 14 1 -6 -4 -7 -2 -1 -3 -12 0 -6 10 -7 1 -1 -4 -7 -4 -12 0 -9 5 -4 1 3 6 1 1 8 -1 1 -3 4 3 8 16 5
6484EnOoMpJ0LNj9QnmQrOoOMpj5K1j2PkJLJOrkQnMNoO%ljrJ3nPpLqRrOJj3LPj0
$$ 5 0 6 0 4 -3 7 10 15 -4 4 -1 -5 3 -6 0 -6 0 4 -3 -18 3 -9 -2 -4 -3 0 1 7 -2 -4 4 -1 3 8 2 8 8 5 4 -5 8 3 10 3 6 -2 7 -2 4 5 -8 -5 2 -8
6538hJJKJj3NJ5Mj3PrPj6J8mnJ3KrMnQ%jJj8J5jP%j6kJ1lpJ1jnjkpJ7pKKj2LR
$$ -8 -7 -6 -4 -3 -16 -11 4 8 -5 2 -7 0 -16 2 -2 -7 6 8 -1 3 -2 6 6 5 6 -12 3 2 9 9 -7 -9 2 -1 -8 3 2 -3 -4 -6 -13 4 -3 -1 1 -11 -8 1
6586ArjPkmKOjnKnJ0mJ5j4OLoPkjo%LKnqNJpJ3KlqJPj1OmQqkN%nRmJ0qQlqMlP
$$ 1 -8 -9 -2 -4 -8 -6 0 -1 -6 -4 -9 1 -3 12 -2 4 7 1 8 6 5 -1 -1 2 4 -1 -9 -4 -3 -10 3 5 2 -6 -5 2 -9 -3 -7 1 -7 -9 -4 -4 -9 0 -4 6 -2 6 3 -5 -1 -4 3
6641CkMoJ0qjJ0knMLNKj7ljLPMLonQj3mPLmqJ1nlMlk%%Rj0J1lOojMLkpPo%QJ1
$$ 3 1 5 -1 9 1 0 10 8 3 7 10 15 17 0 -3 -4 -1 6 10 13 7 2 10 -3 -7 0 3 -1 -9 2 -3 -6 -2 -5 -7 -7 -7 2 -8 3 0 6 0 -1 3 6 4 -3 4 -2 -2 6 17
6694A7j5%MPloooJ4j4%JQjqLOoMmnQlpMPpJ5loOPj6J0%OpkJ3j3jLjMnMmOj0%P
$$ 17 2 2 6 13 10 4 -2 -8 6 -8 -8 -7 1 0 -8 -5 1 -5 -1 -5 -10 -2 -5 -12 -8 -1 -8 7 4 -2 4 11 -5 5 5 11 4 2 15 2 1 4 3 7 2 6 2 8 -2 -2 5
6745EoNqPnRj1J6j6oPMkKoJJJ1kj2KPlRj9MK0j0lkQj2J5jlqJ0lJj2JLOnjJMrm
$$ 5 -1 4 -4 3 -2 7 -4 12 -4 -10 -3 1 -1 1 -5 -4 -3 8 6 -6 -4 3 0 9 -10 -6 14 4 1 -1 7 -5 10 9 6 -2 8 5 6 -6 -5 -2 4 -1 -2 -1 3 -6 -10
6794a0J1j6OQrPk%JNkNjlklnJ6nMoMP%Nj7OkJjRj7QlOMj2MJlkNqJ2nkooNJ6j2
$$ -10 1 -15 -9 -1 -10 -3 -5 -5 -4 1 -1 4 3 0 -2 -5 -10 6 1 5 -1 3 10 10 15 -2 4 2 3 2 11 -6 2 -1 5 9 -3 1 2 -1 -3 2 -6 6 1 -1 -7 -13 -8 8 -4
6845dLlOpLlj%J0p%OJkJJ2k2J6rJOJj1%OqOrlJ1%q%pjKRJknKK%Ml%NjMJm%KJ4
$$ -4 -1 -4 2 -5 -2 -5 -6 -6 4 -3 -3 3 4 2 3 15 -7 9 0 1 7 8 -3 -3 3 -5 1 -8 -11 0 0 -8 -8 -15 -16 -14 -5 -4 -6 -11 -9 -7 -7 -3 -6 -6 -1 -2 2 3 -1 -1 1 15
6899A5j5Oj0Rj8J9l%oLlPlLkrRoKmj1J2kQokJnNJqmJ1Rn%RoLNqMlQ%knKJkMq%
$$ 15 0 6 -4 5 -13 6 3 3 -3 0 -3 4 1 4 2 -7 2 -4 -2 -6 -17 -5 -7 1 -5 -7 -6 -11 -6 -5 -13 -17 -6 3 -2 -2 7 1 4 9 1 5 2 10 10 8 3 5 6 4 8 0 0
6952@J4j0%qOJojMkoOlLlNj4J5llnQL%rJ1mPj1MQkJ3oqMjPlrQjj2JNmOlmOrjm
$$ 0 14 4 4 -4 2 3 -3 -4 0 -2 -8 -2 -5 -2 -5 0 -14 1 -2 -5 -10 -2 1 1 -8 3 -1 6 -5 -1 7 5 18 12 4 8 7 14 11 2 10 9 -3 -2 3 -1 5 2 -2 4 -5 -6 -10
7005a0NmMJOoKlJJpJ6j0JLRj6RNj0J4pKoNKKnJLlK%rJQkj0NmLJj4J4qMlMnJ1m
$$ -10 -5 -9 -5 -4 2 -4 -2 -5 -4 -3 -10 6 -4 -3 0 9 -7 2 7 -3 11 4 6 0 5 7 9 4 5 8 5 7 7 -2 -1 7 5 -5 0 -4 -1 0 -14 0 -8 -4 -7 -3 -8 3 -1
7056amjJ5j8J7%JKkj1OJmRn%lOkKoMJ0oj8J0OKoKpLjp%OLj1PlKkRpnRPpnLlJ0
$$ -1 -5 -6 9 -9 8 8 9 11 9 -2 4 5 1 10 5 5 2 8 6 8 2 6 16 10 -8 2 8 10 4 6 -1 2 1 -6 -6 0 3 -8 -1 -4 -2 -4 5 -2 -7 2 9 2 -3 0 -3 7
7108GJMj0oNRr%jMNrJ1pmOljMkkmjnrJ4j1RKj%%nLQlNj4J7mkOoNnNKkJ0j7J2j0
$$ 7 8 12 2 -4 1 10 1 1 0 4 9 0 11 4 0 6 3 2 6 4 2 -2 -3 -8 -17 -3 -14 -5 -3 -4 -4 -4 -9 -6 2 -1 4 -10 7 3 1 7 1 6 1 6 8 6 16 -1 11 1
7160AkKjmJ1pJ2j4mkoOO%JklpQjJpJ4JqkJMJJ0qPjlmnJ5jJLj0%orJ5ljJ1moMJ0
$$ 1 -1 1 0 -4 7 0 12 -2 -6 -8 -14 -8 -2 -2 -1 -3 -6 -13 -5 -6 -5 -12 2 3 -5 -7 -6 -2 -1 9 1 8 7 4 0 -5 10 9 10 13 3 3 -3 -12 3 0 -1 10 6 0 4 14
7212A4k2J1k0K2oqOOpjpNj1J3Oj9J5OjpJJ4q%RqkJ6j9J0KnmJ0jj4RqNJ0j7PoJ
$$ 14 -8 3 -17 5 -1 -9 -3 3 -4 -5 -12 -7 -18 -5 1 -18 -3 3 2 -5 -4 10 2 2 11 3 1 17 -2 8 10 5 1 11 10 -4 5 -3 2 12 -5 2 -4 -3
7256cJ6mJmrnQjrMMjoJ0oj1J7KrNMOlqQmJj0J4K%rlJ3plj1JRmJ0nj1QJlk%qJ6
$$ -3 13 9 10 6 -3 -8 0 -1 -10 -6 -2 -3 -9 1 -5 -16 1 3 -6 -1 3 9 6 -2 6 2 3 -7 7 9 9 0 -3 10 3 0 -11 -10 -1 -5 5 0 -11 -3 -2 -5 -7 -7 -15 1
7306AnpJ6qoRj1RJ3j7jMkNkJ2nOrKmnJ9j0LlOkmQrkj1J3JprJlPnNkNnJJLJpJ1
$$ 1 -4 -11 5 -3 -9 0 -11 -2 11 -6 -7 -3 -5 0 -2 10 5 11 2 4 0 -5 14 4 7 4 10 8 4 12 3 1 -10 3 4 -3 -12 -11 -14 -7 -12 -7 -9 -4 -9 -8 -7 -4 -3 -10 1
7357AoOLppLJ3kNKj0NKloNpJ3qj1J0jNKomnjkPqPkJJ0j3lNPKpmJ6j6RLj3J7mN
$$ 1 -5 1 4 -3 -10 -7 6 4 9 11 1 6 8 5 -1 4 -3 10 2 -9 1 0 5 7 1 -3 -8 -9 -11 -4 -12 -5 -7 -6 4 -9 -12 -7 0 2 -5 -9 7 -9 0 3 -10 7 3 8
7407H%k%%Lj2RpLJKJrOlmRrmjNrPNknNj0O%J0jrJ2j1J5j1kJ0j%qkJ2oOJKoklJ2
$$ 8 8 6 6 6 9 -3 6 -1 2 3 5 6 -3 3 0 -4 5 -4 -8 -9 -4 -13 -6 -1 -3 -8 -3 -13 -7 -7 3 2 -7 5 -6 9 -2 -4 6 5 5 -3 -5 7 1 7 8 10 4 2 -1 11
7459A1j3qJQoJJ0prMNjpLj2J0LjNnj%%J1%JmJQpjkPPkkKj1J0j0J0oJLp%noJMN
$$ 11 -2 -10 -9 -1 -7 -6 4 -3 -12 -8 -3 -4 -11 -8 -20 -10 -7 -8 -3 -8 -9 -9 -9 2 2 3 -1 0 8 1 0 -2 5 12 10 8 10 -1 9 -1 9 3 4 7 0 0 -5 -11 -10 -6 -1
7510ankNoKj2J8lj5ONpJ0jLoRRj6J2nJ0pJoJQJ0j7%kOoLoJ0j3MK0k3J0m%%qQK
$$ -1 -6 -8 -3 -9 -7 -19 -1 -4 -19 -13 -8 -15 -5 -6 -3 -9 0 9 -7 5 0 10 3 4 -2 -1 7 17 0 0 -2 4 -2 1 -5 5 -8 -4 16 -7 3 -1 -1 -1 -9 -1 1
7557AprOPKlJl%JNoJLkkKPPnmNJpOMrnOlJ1j7OqPNrKLpLnqJ4mJ1j5Q%mMlRqmJ3
$$ 1 -6 -15 -9 -2 0 -3 -2 -5 -5 -4 1 -5 -4 -1 -3 -5 -3 4 11 6 2 7 8 1 7 11 2 -3 3 0 11 -6 0 -8 -1 4 -5 -3 0 -7 -4 -9 -17 -3 -7 4 -11 -3 -3 -7 -3 -6 3 -5 -9 4
7613Dj0J8nqrJ7jKJj7KL%lRLrJ0mJj4MlQNlolOJJjj4J3pLOPpjJ3j0MJmRrpK2j7
$$ 4 -6 12 7 -1 -10 7 6 8 9 -8 -6 -3 -3 -6 3 6 -3 7 3 4 -10 -6 -9 -1 4 1 -5 -8 -2 -1 0 -1 -15 -2 -9 -6 0 7 0 -1 12 2 6 7 3 12 3 -4 18 1
7663AJ3j0lRPlj8%JQpJ3j2pJ1j1LklJ1nJpL%ORmnMLkjKl%LjjlKJLnNjnPpkOmL
$$ 1 14 4 1 10 17 14 -4 -4 -3 5 -2 11 -1 -8 3 -8 -5 -7 -10 1 -4 -3 -10 -7 -7 -1 8 4 -1 3 6 4 3 5 2 2 5 4 3 0 2 3 6 1 6 5 0 7 0 -2 4 0 3
7716CkjM%j3J0JlnnPLppJ3QrMkMnNm%kJ2nKjJ0m%Lj0kPkkjmNJLj8J2Klj0J0mm
$$ 3 1 0 4 4 -9 1 2 -1 -6 -11 -4 -1 -8 -15 -2 6 -3 1 -1 3 -2 3 -1 -1 -3 9 4 6 5 15 11 11 14 4 2 9 7 5 4 0 5 6 9 -9 3 5 2 -8 2 -2 -6
7767fkKkJJ%J0j3jKLQmLlkKOmPnpRMKjqJ4j0kRmj5J3j3RmpJ5j0%oJ0j7K5j1pJ
$$ -6 -8 -6 -8 -7 -6 -6 4 -9 -10 -8 -5 3 -1 2 -1 -3 -1 5 1 8 3 -4 5 9 11 10 2 16 6 4 13 9 -6 7 -6 3 -1 -8 7 -3 -3 -9 1 -16 9 -2 -9 -8
7815hJ0k2QORj3J0PPoKmMj2KQJmpJ0knJKqNQj0Kq%Rj2PMj5RkQonOMpMmJOmPj1
$$ -8 2 -20 -12 -6 3 -10 0 7 14 8 10 6 10 -2 0 8 9 5 -2 8 6 1 2 4 -4 1 9 -1 1 -7 -7 2 -10 -3 1 -14 -5 -7 1 -5 -10 -4 0 -7 -3 -7 -6 0 -4 3 -8
7866hK3k5J6nKPjnnMqlJ9j9PjJ2j1qLj0J2nllNnJ2rJJ4j2kQplQM%KjLOmjnlLJ0
$$ -8 15 -10 6 1 3 10 9 4 -1 3 -5 -8 11 -8 -1 -2 10 -1 -9 -6 -16 -4 -9 -12 -15 -10 -15 -3 -12 -11 3 -9 -11 -3 -10 -13 -5 -1 -1 1 0 3 9 5 4 -1 -4 -1 9
7915IqQlJkqKKRpKJnJo%kkoJ4LrjKMrOM%pMKpLJ2jj2jMOmlJJoJ4rLLJpL%lMj0
$$ 9 1 9 6 7 5 -3 -1 1 10 3 5 6 1 2 -4 -4 -6 -8 -14 0 3 -6 -7 -5 -1 -10 -4 0 0 -7 -3 -1 -8 -5 7 6 -6 -7 -3 3 -1 -4 -3 -2 -8 6 -3 0 3 4 -3 0 0 -3 1 -9
7971i%%l%JJ0pjNmlNoKkNKmOOnkMj2J2JnMJnMjJ0j4NkJkrJ4j3JJ2j0oQMorQ%k
$$ -9 -9 -9 -12 -12 -11 -1 -8 -9 -4 -8 -11 -6 -12 -10 -12 -7 -5 -9 -3 3 -2 -4 0 -12 0 1 -4 0 1 -4 0 -1 9 -5 0 -2 -1 -3 -12 2 -11 -10 2 -8 -14 -6 -2 -8 -17 -9 -9 -11
8023a1KJ%lK1j7JPMJoJ%j2J4oJ0Rj2ljK%Rjoj0OlLRjj2nkQj1J5ojknJJ0qMjoJ2
$$ -11 -9 -8 -8 -11 10 -7 -6 1 5 6 0 1 1 -11 3 -3 7 16 4 1 0 2 2 11 10 4 -6 0 -3 0 9 8 -4 -9 -11 -3 -14 1 -5 -6 -8 -13 -12 -2 -10 -6 -7 -13 -1
8072aj3QLKNnKMklNj0J3j3J8moMlj2P%MojRj7MOnnjlJ3j1kKRJjlOmO%NolJ4j2
$$ -1 -14 -6 -3 -1 4 -1 1 5 3 0 5 -5 8 -5 13 9 3 7 4 -8 -1 -1 3 -3 -4 5 -12 -8 -2 -7 -12 -13 -16 -3 -14 -16 -14 -5 -4 -5 -8 -2 -6 0 0 5 -1 -4 10 -2
8122bJ4mlLLKkqMkj3J3JjklknRj2NlJ5j7L%J%rJ3qPKqJ0oNKoJOkRj8OJ2JoLJ%
$$ -2 12 8 5 8 11 13 11 3 7 5 -8 5 6 5 3 0 -2 -7 2 -10 -5 -8 7 -10 -7 -7 -6 -6 -15 -2 -10 -3 -1 -9 1 -5 0 2 -4 -3 3 1 10 -8 -2 10 11 5 8 9 9
8173IoMj2J5Jj4JOlJknjkOjPn
$$ 9 3 7 -5 10 11 -3 -2 4 1 2 0 -5 -6 -8 -2 -3 4 -1
8191a
$$ Imaginary data points
##PAGE= N=2
##DATA TABLE= (X++(I..I)), XYDATA
0@%%%%%%%%%%%qJ6j6J6k4L2l2M0m8N6p2Q8j04J20j36J60j84K08k40K80l20L60
$$ 0 0 0 0 0 0 0 0 0 0 0 0 -8 8 -8 8 -16 16 -16 24 -24 32 -40 48 -56 64 -72 88 -96 112 -128 152 -168 192
33A92m11M67n28N92o64P44q30R24j027J140j261J396j545J707j883K075k288K521
$$ 192 -219 248 -280 312 -352 392 -438 486 -541 599 -662 734 -811 896 -987 1088 -1200 1321
51A321k775L058l374L726m122M570n085N680o379P214q227R492j1124J3324j6471
$$ 1321 -1454 1604 -1770 1956 -2166 2404 -2681 2999 -3380 3834 -4393 5099 -6025 7299 -9172
66i172K1376l0165N0898j94137k00405J26482M1107J21891J06601J09566O1110
$$ -9172 12204 -17961 32937 -161200 -361605 -235123 -194016 -72125 34476 144042 205152
77B05152P5494K5431n953m1274m4220q3404q7378q5432o9860p0851m0006j6052
$$ 205152 280646 306077 300124 258850 214630 131226 43848 -41584 -111444 -182295 -222301 -238353
89b38353P196K0930M9416N8721O3664O1970O3351M7867L3431J7570L995j6551
$$ -238353 -231157 -210227 -160811 -102090 -38426 23544 86895 134762 168193 185763 189758 173207
101A73207k9572l9173m4875n1028m8039m1657l3728k5389j1084K200J2602K2256
$$ 173207 143635 104462 59587 8559 -39480 -81137 -114865 -140254 -151338 -149138 -136536 -114280
113a14280L3323L8421L9000L9122L7271K8670J8838J0442l14j3502k2586k8665
$$ -114280 -80957 -42536 -3536 35586 72857 101527 120365 130807 130493 116991 94405 65740
125F5740l5389l8978l6296l1879k7018j7682n396M656J4114K4899L2716L5484
$$ 65740 30351 -8627 -44923 -76802 -103820 -121502 -126898 -122242 -108128 -83229 -50513 -15029
137a5029L6747L6199L0347K1330J2553K280r954k0206k7296l3358l6954l5694
$$ -15029 21718 57917 88264 109594 122147 124427 114473 94267 66971 33613 -3341 -39035
149c9035l1217k5326j6687n433N281J4755K3859L0995L4069L4120L2120K6669
$$ -39035 -70252 -95578 -112265 -117698 -112417 -97662 -73803 -42808 -8739 25381 57501 84170
161H4170J8077Q661j033j1327k0577k6979l1053l2893l1408k6499j9878j1835
$$ 84170 102247 110908 109875 98548 77971 50992 19939 -12954 -44362 -70861 -90739 -102574
173a02574k205P446J5612K2448K7682K9858K8980K6143K1095J3765N407k737j0758
$$ -102574 -104779 -97333 -81721 -59273 -31591 -1733 27247 53390 74485 88250 93657 90920 80162
186H0162j7965k3070k5762k6580k5096k0947j5173q527r51O801J3471J8757K2691
$$ 80162 62197 39127 13365 -13215 -38311 -59258 -74431 -82958 -83909 -77108 -63637 -44880 -22189
199b2189K4439K3742K1188J6945J1026M110k816r435j5364j9831k2243k2809k1575
$$ -22189 2250 25992 47180 64125 75151 79261 76445 67010 51646 31815 9572 -13237 -34812
212c4812j8210j3184p276p49N969J1955J6689K0018K1561K1029J8670J4756R550
$$ -34812 -53022 -66206 -73482 -74231 -68262 -56307 -39618 -19600 1961 22990 41660 56416 65966
225F5966L432k852q698j3808j7667j9738k0022j8712j5630j1126n733L8N799J1033
$$ 65966 69398 66546 57848 44040 26373 6635 -13387 -32099 -47729 -58855 -64588 -64550 -58751 -47718
239d7718J5093J7816J8949J8377J6156J2550P932K551k959q122j2467j5766j7531
$$ -47718 -32625 -14809 4140 22517 38673 51223 59155 61706 58747 50625 38158 22392 4861
252D861j7703j6408j3635r641m817L61N438J0044J3656J5998J6863J6281J4234
$$ 4861 -12842 -29250 -42885 -52526 -57343 -56982 -51544 -41500 -27844 -11846 5017 21298 35532
265C5532J0852O627J784l166p772j1616j4425j5854j5828j4484j1812q105l691
$$ 35532 46384 53011 54795 51629 43857 32241 17816 1962 -13866 -28350 -40162 -48267 -51958
278e1958R75N477R483J2581J4482J5047J4383J2385R262N425J111l216p245j0527
$$ -51958 -50983 -45506 -36023 -23442 -8960 6087 20470 32855 42117 47542 48653 45437 38192 27665
292B7665j2868j3999j3859j2576j0125o820k922J178N129Q577J1235J2841J3273
$$ 27665 14797 798 -13061 -25637 -35762 -42582 -45504 -44326 -39197 -30620 -19385 -6544 6729
305F729J2575J0738P948M471O66l229o747r650j1668j2582j2391j1137q853n814
$$ 6729 19304 30042 37990 42461 43127 39898 33151 23501 11833 -749 -13140 -24277 -33130 -38944
319c8944k284J408M943P989J0324J1664J1927J1215R485O888L713K38l196o320
$$ -38944 -41228 -39820 -34877 -26888 -16564 -4900 7027 18242 27727 34615 38328 38566 35370 29050
333B9050q830j0563j1246j0986r764p654m904j720J570M694P315R335J0429J0574
$$ 29050 20220 9657 -1589 -12575 -22339 -29993 -34897 -36617 -35047 -30353 -23038 -13703 -3274 7300
347G300R874Q216N875L031o7l105n856q046r512j0043r765q613o669m146j299
$$ 7300 17174 25390 31265 34296 34229 31124 25268 17222 7710 -2333 -12098 -20711 -27380 -31526 -32825
362c2825J644M421O745Q481R402R460Q769P224N068K469l06l049n478p376q619
$$ -32825 -31181 -26760 -20015 -11534 -2132 7328 16097 23321 28389 30858 30552 27503 22025 14649 6030
377F030r035q693p576n783l467q64J740M220O276P730Q492Q467P749O307M322
$$ 6030 -3005 -11698 -19274 -25057 -28524 -29388 -27648 -23428 -17152 -9422 -930 7537 15286 21593 25915
392B5915J962n50k986n119o795p820q117p742o709n002k929n60J795L992N802
$$ 25915 27877 27327 24341 19222 12427 4607 -3510 -11252 -17961 -22963 -25892 -26452 -24657 -20665 -14863
407a4863P073P665P581O891N520L700J551p30k908m802o256p104p334o906n893
$$ -14863 -7790 -125 7456 14347 19867 23567 25118 24388 21480 16678 10422 3318 -4016 -10922 -16815
422a6815m324k396k71J863L813N405O498O955O835O129M848L152J178q75k843
$$ -16815 -21139 -23535 -23806 -21943 -18130 -12725 -6227 728 7563 13692 18540 21692 22870 21995 19152
437A9152m510n792o503o645o202n227l757j981l3J868L643N040N959O325O145
$$ 19152 14642 8850 2347 -4298 -10500 -15727 -19484 -21465 -21498 -19630 -15987 -10947 -4988 1337 7482
452G482N435M246K659Q57j012k767m273n349n938o011n549m597l235j587J74J904
$$ 7482 12917 17163 19822 20679 19667 16900 12627 7278 1340 -4671 -10220 -14817 -18052 -19639 -19465 -17561
468a7561L467M705N474N757N552M858L705K266N98j108k670l990m939n413n438
$$ -17561 -14094 -9389 -3915 1842 7394 12252 15957 18223 18821 17713 15043 11053 6114 701 -4737
483d737m966m055k790j280L39J915L289M387N030N232M984M301L233J862L56j196
$$ -4737 -9703 -13758 -16548 -17828 -17489 -15574 -12285 -7898 -2868 2364 7348 11649 14882 16744 17100 15904
499A5904k612l772m590m974m941m468l573k384r98M90J905L151M088M623M778
$$ 15904 13292 9520 4930 -44 -4985 -9453 -13026 -15410 -16408 -15918 -14013 -10862 -6774 -2151 2627
514B627M496L829K818J546J62j244k490l556m212m542m449l956l152k020p27O17
$$ 2627 7123 10952 13770 15316 15478 14234 11744 8188 3976 -566 -5015 -8971 -12123 -14143 -14870 -14253
530a4253J869K998L808M241M349M027L383K426J260Mj288k405l344l872m164m028
$$ -14253 -12384 -9386 -5578 -1337 3012 7039 10422 12848 14108 14112 12824 10419 7075 3203 -961 -4989
546d989l541k786j709n39O76J815K821L502L895L938L601K999K124J000j30j279
$$ -4989 -8530 -11316 -13025 -13564 -12888 -11073 -8252 -4750 -855 3083 6684 9683 11807 12807 12677 11398
562A1398k286l117l581l795l621l153k436j431l59P61J776K667L259L574L605
$$ 11398 9112 5995 2414 -1381 -5002 -8155 -10591 -12022 -12381 -11620 -9844 -7177 -3918 -344 3261
577C261L244K682J804Q33k45j283k204k910l281l477l264k809k112j214k33Q06
$$ 3261 6505 9187 10991 11824 11579 10296 8092 5182 1901 -1576 -4840 -7649 -9761 -10975 -11208 -10402
593a0402J721K505K991L258L254K875K348J540O26l44j279k084k675l031l168
$$ -10402 -8681 -6176 -3185 73 3327 6202 8550 10090 10716 10372 9093 7009 4334 1303 -1865
608a865k946k487j856r96q2Q37J659K372K779L016K954K598K082J318M77m29j262
$$ -1865 -4811 -7298 -9154 -10150 -10232 -9395 -7736 -5364 -2585 431 3385 5983 8065 9383 9860 9431 8169
625H169k015k504k796k931k649k211j599q12M1R08J627K215K584K769K670K295
$$ 8169 6154 3650 854 -2077 -4726 -6937 -8536 -9348 -9307 -8399 -6772 -4557 -1973 796 3466 5761
641E761J812J106L23n00j259j887k329k572k640k360j953j373o60J40Q66J543
$$ 5761 7573 8679 9002 8502 7243 5356 3027 455 -2185 -4545 -6498 -7871 -8531 -8391 -7525 -5982
657e982K059K363K542K405K054J592R21K09n31j208j795k159k386k424k143j723
$$ -5982 -3923 -1560 982 3387 5441 7033 7954 8163 7632 6424 4629 2470 84 -2340 -4483 -6206
673f206j169n16K15R07J497J958K217K352K181J846J377P62J05n89j195j696k002
$$ -6206 -7375 -7891 -7676 -6769 -5272 -3314 -1097 1255 3436 5282 6659 7421 7526 6937 5742 4046 2044
690B044k229k183j898j504j001l84K77Q78J418J789K026K108J952J602J189O31
$$ 2044 -185 -2368 -4266 -5770 -6771 -7155 -6878 -6000 -4582 -2793 -767 1341 3293 4895 6084 6715
706F715Pn78j141j569j845k022j953j721j309q52k78L16Q63J348J672J911J927
$$ 6715 6722 6144 5003 3434 1589 -433 -2386 -4107 -5416 -6268 -6546 -6230 -5367 -4019 -2347 -436 1491
723A491J784J443J028M96n5o12j111j488j753j873j790j527j138p10j77L69Q68
$$ 1491 3275 4718 5746 6242 6187 5575 4464 2976 1223 -650 -2440 -3967 -5105 -5815 -5992 -5623 -4755
740d755J290J542J744J763J577J247Q56M10j26o20j034j357j595j683j585j361
$$ -4755 -3465 -1923 -179 1584 3161 4408 5264 5674 5548 4928 3894 2537 942 -741 -2326 -3687
756c687r93n97j15L65Q29J160J428J604J568J436J113P47L19j60n99r99j271j494
$$ -3687 -4680 -5277 -5392 -5027 -4198 -3038 -1610 -6 1562 2998 4111 4858 5177 5017 4418 3419 2148 654
774F54j559j458j217q72m73m1M11Q12J123J363J485J451J281R87O02K28k01o15
$$ 654 -905 -2363 -3580 -4452 -4925 -4966 -4555 -3743 -2620 -1257 228 1679 2960 3947 4549 4777 4576 3961
792C961r31j201j387j415j292j070p62l55lM21P39J021J254J336J286J136Q75
$$ 3961 3030 1829 442 -973 -2265 -3335 -4097 -4452 -4455 -4034 -3295 -2274 -1020 316 1602 2738 3613
809C613N29J36k10n78q57j134j254j279j167r67o79l03P9M08P28R96J174J245
$$ 3613 4142 4278 4068 3490 2633 1499 245 -1034 -2201 -3168 -3847 -4150 -4071 -3663 -2935 -1939 -765 480
827D80J189J040P63M70R1k59n89q69j071j192j175j059q59n76k46R5M47P16R48
$$ 480 1669 2709 3472 3942 4033 3774 3185 2316 1245 53 -1122 -2181 -3040 -3616 -3862 -3767 -3320 -2604 -1656
846a656J086J137J069R16O63L85N9k79n69q10r81j074j078r42p47n03j95J13M32
$$ -1656 -570 567 1636 2552 3215 3600 3659 3380 2811 2001 1020 -54 -1132 -2074 -2821 -3324 -3519 -3406 -2974
865b974O80Q86J009J055R65Q27O06L12J7k74n72p89r31j015r85q71o79m15j43
$$ -2974 -2294 -1408 -399 656 1621 2448 3054 3366 3383 3109 2537 1748 817 -198 -1183 -2054 -2733 -3148 -3291
884c291J44M32O75Q62R47R77Q74P44N12K63k8l09n51p49q60r48q74p81n92l60
$$ -3291 -3147 -2715 -2040 -1178 -231 746 1620 2364 2876 3139 3111 2802 2251 1502 642 -306 -1180 -1961 -2553 -2913
904b913r2J57M14O41P91Q76Q89P95O59M59K01n1k97n26o92q21q57q12p06n34l09
$$ -2913 -3005 -2848 -2434 -1793 -1002 -126 763 1558 2217 2676 2877 2826 2529 2003 1311 490 -367 -1179 -1885 -2419 -2728
925b728o5K03M11O21P32Q25Q24P28N89L88J64q8l16n13o57p70q05p35o33m67k51
$$ -2728 -2793 -2590 -2179 -1558 -826 -1 823 1551 2140 2528 2692 2604 2288 1775 1118 348 -457 -1192 -1825 -2292 -2543
946b543j8K05M07N83P06P45P48O55N17L49J13j02l09m87o18p22p29o72n53m07
$$ -2543 -2561 -2356 -1949 -1366 -660 85 833 1488 2005 2354 2467 2365 2056 1569 951 229 -500 -1172 -1725 -2132
966b132k13QK03L84N60O62P02O79O06M58K85Q1j23k97m81n94o63o93o04m99l59
$$ -2132 -2345 -2337 -2134 -1750 -1190 -528 174 853 1459 1917 2202 2283 2160 1863 1382 788 125 -568 -1172 -1671 -2030
987b030j70L7K23L86N26O18O65O29N34L97K43N8j34l01m58n67o10o24n65m43l06
$$ -2030 -2200 -2163 -1940 -1554 -1028 -410 255 884 1418 1815 2058 2116 1982 1681 1223 656 46 -578 -1143 -1586 -1892
1008a892j56N6K18L99M97N73O12N64M96L53K06K7j34l14m31n45n72n71n14m00
$$ -1892 -2048 -1992 -1774 -1375 -878 -305 307 871 1367 1720 1926 1953 1819 1505 1074 529 -43 -614 -1128 -1528
1028a528k71q9O7K26L70M79N40N58N20M41L27J69J4j62k98m22m98n37n38m59l64
$$ -1528 -1799 -1888 -1821 -1595 -1225 -746 -206 352 872 1313 1640 1809 1823 1661 1363 941 443 -94 -632 -1091 -1455
1049a455k19q4P8K35L59M52N15N27M73L92K83J38k0j78k93l94m76n13m78m12l28
$$ -1455 -1674 -1758 -1680 -1445 -1086 -634 -119 408 881 1273 1556 1694 1674 1496 1203 809 333 -180 -658 -1070 -1398
1070a398j95l4R2K27L50M31M86M66M41L67K26J20m1j60k81l83m50m69m40l89k72
$$ -1398 -1593 -1627 -1535 -1308 -958 -527 -41 425 866 1233 1459 1579 1538 1378 1097 714 264 -205 -645 -1034 -1306
1091a306j70k3J03K20L37M03M47M47L88L11K23Q0m6j69k88l63m23m20m16l48k52
$$ -1306 -1476 -1499 -1396 -1176 -839 -436 11 458 846 1157 1380 1460 1414 1245 957 594 171 -249 -665 -1013 -1265
1112a265j37MJ16K23L24L94M09M15L42K88J81O9p5j66k68l49l85l97l74l03k08
$$ -1265 -1402 -1398 -1282 -1059 -735 -341 68 483 825 1113 1294 1363 1288 1122 854 505 120 -277 -651 -954 -1162
1133a162j18mJ27K15L00L57L81L68L25K53J40N5o7j72k59l17l68l65l38k75j87
$$ -1162 -1280 -1284 -1157 -942 -642 -285 96 464 789 1042 1182 1237 1170 998 739 422 54 -311 -649 -924 -1111
1154a111r2K0J28K21K87L42L63L32L00K21J20K7p4j71k66l04l39l41l15k27j73
$$ -1111 -1203 -1183 -1055 -834 -547 -205 158 490 790 1011 1131 1158 1084 913 647 343 4 -337 -652 -879 -1052
1175a052n6L3J27K16K64L25L29L00K63J82J11J3q6j63k40k84l14l14k69k20j45
$$ -1052 -1108 -1075 -948 -732 -468 -143 186 486 749 931 1042 1055 969 806 566 282 -32 -346 -615 -835 -980
1196i80m3L1J38K05K56K88L07K93K31J64R8j2q6j63k31k71l12k80k58j75j24m7
$$ -980 -1023 -992 -854 -649 -393 -105 202 495 726 890 988 976 890 727 496 225 -87 -367 -625 -800 -924 -971
1218i71P1J20K14K38K84K82K63J95J52P2k8q4j67k11k72k65k77k19j66q7k7O3
$$ -971 -900 -780 -566 -328 -44 238 501 696 848 920 892 808 641 430 158 -107 -384 -603 -769 -856 -883 -820
1240h20J29J78K49K56K51K39J86J27N6j5j00j59k08k54k55k36k01j55p6kN5J21
$$ -820 -691 -513 -264 -8 243 482 668 795 851 836 736 577 369 115 -140 -376 -577 -732 -808 -810 -755 -634
1262f34K03K26K39K35K15J72J05K5k8j08j55k02k26k37k27j67j31o4%P0J24K02
$$ -634 -431 -205 34 269 484 656 761 786 758 650 495 293 67 -170 -397 -564 -695 -759 -759 -689 -565 -363
1284c63K06K22K15J88J53R5K3l3j03j47j99k18j99k17j57j12n4J0P2J27J58K09
$$ -363 -157 65 280 468 621 716 739 706 603 456 257 39 -160 -377 -534 -646 -700 -690 -618 -491 -333 -124
1306a24K05J99J80J24Q2K2m0j09j53j87j99j99j70j63r6l8J3Q1J29J57J99J98
$$ -124 81 280 460 584 666 688 648 539 386 199 0 -199 -369 -532 -628 -666 -653 -572 -443 -286 -87 111
1328A11J76J61J19O0Pm2j03j45j71j91j77j61j37p3m1K1P0J23J52J81J80J61J47
$$ 111 287 448 567 627 634 592 489 344 173 -18 -195 -356 -493 -566 -607 -586 -516 -393 -241 -60 120 281 428
1351D28J01N2nm2r8j37j65j73j75j51j10p0j6J6P2J23J55J57J71J49J33J00L1
$$ 428 529 581 576 534 436 299 134 -39 -214 -365 -475 -545 -561 -545 -473 -350 -195 -38 133 282 415 515 546
1374E46qo7q2j31j45j63j57j32r9n8k8L8P5J10J51J20J61J41J18P8K7Jo2r1j23
$$ 546 538 471 389 258 113 -50 -207 -339 -438 -496 -524 -486 -411 -301 -150 -30 131 272 390 468 495 496 434 343 220
1399B20j47j43j44j25q3o3lL7P0J04J41J36J42J32Q9P0M1j4n5j11j02j29j33j39
$$ 220 73 -70 -214 -339 -422 -485 -488 -451 -381 -277 -136 0 142 274 363 433 474 460 405 294 192 63 -70 -209
1423b09j20o8l8kJ7Q7J02J30J36J11J26Q8O1K2k8o2q1j25j12j22j21j11o9l7J0
$$ -209 -329 -397 -435 -437 -420 -333 -231 -101 35 146 272 360 421 443 415 353 272 147 35 -87 -208 -319 -388 -425 -415
1448d15M9O7R4J21J27J10J10P9M5J5k2n3q8j02j28j07j06q7p4k2QM4P9Q8J10J02
$$ -415 -366 -299 -205 -84 43 153 263 342 387 402 380 327 239 137 9 -98 -204 -291 -365 -387 -379 -335 -256 -168 -58 44
1474D4J20R5O5M2K3l8n9r7j02j04j04j01p7o4j2J0M3Q1R1J10R3J07Q7N9L8J0l3
$$ 44 164 259 324 366 389 351 292 195 93 -11 -115 -216 -293 -357 -369 -359 -316 -235 -144 -34 59 166 253 312 350 360 327
1501C27o2q9r0j08j06p7q8l2j1J7L9Q0Q3R7J04Q8P7N0L3%m2n4q8r3r1j04p1p1
$$ 327 265 176 86 -22 -128 -205 -293 -325 -336 -319 -280 -200 -117 -20 84 172 249 299 332 332 290 236 148 55 -36 -140 -211 -282
1529b82l0j6K6M6P0Q7J06P9P6Q5L7K5ol5n3q1q6q2r6p9m5m1JL1L5P1Q1Q0Q5Q4
$$ -282 -312 -328 -302 -256 -186 -99 7 86 162 247 284 309 303 268 215 134 48 -34 -130 -209 -254 -295 -294 -263 -228 -157 -76 4 89 173
1559A73O7L2K4Lm4o1p9q6q7p9n8n5k8mK8N4P0N4R0Q8P1M8M7Nmm8o3o5o8q0q0o2
$$ 173 240 272 296 299 255 194 115 29 -58 -137 -195 -250 -278 -282 -254 -200 -130 -76 14 102 173 221 268 273 269 221 158 93 25 -55 -135 -197
1591a97m3j5nK7M3O7P3Q5P5O1M3K9J6j1l4o2p4o8q0n6o7l8k7J4M3L3N1Q0P8O4
$$ -197 -240 -255 -260 -233 -190 -123 -50 35 110 171 214 243 259 248 214 152 78 10 -70 -126 -193 -231 -258 -244 -201 -168 -117 -37 41 105
1621A05N0N0K8Qmn0m7p1p6o7n9m9k2k8J8K9N6M4P1O3O0N7L8L2j5k6l1n5p0o0n5
$$ 105 155 205 233 241 237 187 140 69 -7 -74 -133 -182 -204 -232 -214 -185 -129 -85 -14 49 109 166 204 236 221 195 164 109 39 -21 -76
1652g6n8n2k8j0PM4M9N2N9O9M7N3M0J5Kl7l2n5m4o8n7m5n1j7jJ5K7N2M0N5O5M9
$$ -76 -134 -186 -214 -224 -217 -173 -124 -72 -13 56 103 156 196 211 213 176 144 89 45 -23 -80 -125 -176 -193 -194 -179 -152 -100 -60 -5 60 109
1684A09M3K7Qoj5m8m0n8o3m9m7l3k8J1J0K9M5N8N5M3N5L7L4Mlk6m3m4m5n7n3l8
$$ 109 152 179 187 181 166 118 78 20 -43 -92 -139 -172 -200 -189 -179 -150 -105 -47 8 51 106 143 177 181 178 152 109 65 20 -37 -90 -128
1716a28l1j0LNL1O1L6N6M1M0L9L2Lk0j8m6n1k6o2m8l9k2j7JK5L0M4L8M7O1L7K8
$$ -128 -159 -169 -166 -161 -130 -69 -33 23 64 104 143 175 178 158 140 94 43 17 -45 -93 -132 -154 -171 -170 -145 -115 -71 -33 14 75 112 140
1748A40J2Qnj8l7n3l9m5n7k5j0k0J0K6K6L2M0M6M3L2L8J2mk0j2l4m2n3m0m0k5
$$ 140 152 160 155 137 100 47 8 -37 -94 -119 -129 -149 -139 -113 -87 -55 -15 31 74 106 144 156 152 132 120 86 44 -9 -49 -89 -114
1779a14l2jOJ8L2L2M0N1L3L9K7OMj4k3l1k9m6l7l9l2nj2%K2K9L0L3N2K8L8J8J0
$$ -114 -146 -147 -141 -123 -91 -59 -19 32 65 104 131 137 141 127 104 73 44 -2 -39 -78 -110 -115 -127 -127 -105 -76 -46 -13 39 67 105 123 133
1812A33Mk7k0k9l2l6m5l6k8ojlK1K6M1L0M4K9K8J2J8kj4k8l0k0m5l6k6pl1QNQ
$$ 133 137 110 90 61 29 -7 -52 -88 -116 -122 -123 -126 -105 -79 -38 -8 36 65 93 105 123 121 107 79 49 29 -16 -52 -78 -85 -116 -108 -103 -95
1846i5L0K6M9M1K0K4RJ3j0j2j8l5l0l1l0l3j1j4JLK4K3K8L9L1K4K2J4%rok2k3
$$ -95 -65 -39 10 51 71 95 104 117 107 95 77 42 12 -19 -49 -82 -93 -107 -106 -103 -79 -56 -28 11 42 66 88 102 102 93 87 65 42
1879D2k9m5k7j9j6j5NQK2L4J5L8L0L9J4lPJj4j8k9m1k6k9l3pj2RJ9J1K8K3K7K5
$$ 42 13 -32 -59 -78 -94 -109 -104 -96 -74 -40 -25 13 43 82 96 93 100 101 87 69 40 -1 -27 -56 -89 -96 -108 -99 -80 -69 -41 -18 9 34
1913C4K9J4J5lKk0j8k3l2k4k6k6j1pPJ1J8K0K7M5J1L1J5j%pJl3k9k1l2j6k7nj5
$$ 34 63 77 92 89 91 71 53 30 -2 -26 -52 -78 -89 -96 -89 -78 -60 -40 -13 32 43 74 89 88 88 81 82 49 20 -1 -33 -49 -76 -81 -96
1948i6J0J7K1J3K8L4J2K3J2MJ0rk5j6k2k5j5l1k0knJ2QK1K4J3L4J5J9MJ0lnok2
$$ -96 -86 -69 -48 -35 -7 27 39 62 74 78 88 79 54 38 16 -9 -24 -55 -75 -77 -82 -70 -62 -41 -17 -4 30 45 64 68 78 75 70 64 42
1983D2k8k7k3k0j4oKjJ3J7J6L4J7J5K0J4Kj1Qk0j4k4k5l1pmj7QjK1J6K0J5K6J4
$$ 42 14 -13 -36 -56 -70 -76 -74 -75 -62 -45 -29 5 22 37 57 71 73 62 70 50 36 12 -13 -44 -51 -55 -72 -64 -65 -44 -28 -8 7 33 47
2018D7NJ6Kkjk1k0l0j2l5%j2lrJ2QK3K3K7J2%K7J3oj2nmk7k0j4j9j5ooQJ0QJ6
$$ 47 52 68 70 68 67 46 26 -4 -16 -51 -51 -63 -66 -75 -63 -55 -32 -9 18 30 30 57 70 64 52 47 43 16 -4 -18 -37 -52 -58 -64 -56 -46 -38 -22
2056b2K9KL0PNJ7%nj4qj8j6l3mk8Lj2OKJ7K6J9RJ1K0J0Rnkj0nl2j6j5j7mj1lN
$$ -22 7 9 39 46 51 68 68 63 49 41 23 7 -26 -30 -58 -55 -67 -61 -59 -42 -16 3 12 23 43 53 62 57 55 45 40 8 -8 -23 -40 -44 -55 -58 -53
2095e3J6RJ5J7J9PJ1K2pkrj9lj1k0l6Mj6nNPJ0NRL1PJ2J8PNnok1Lk7mk0j1lqn
$$ -53 -37 -28 -13 4 23 30 41 63 56 54 45 26 23 12 -8 -44 -40 -56 -61 -56 -49 -39 -34 -25 6 13 25 43 50 55 50 44 23 26 -1 -5 -25 -36 -39 -47 -52
2136e2RlK0J1K0J2PJ1J8Mpq%k3j5j2k3j3JrJ1mRPJ3K1J8NKJ2LKj3Jk1ll3Pj9o
$$ -52 -43 -46 -26 -15 5 17 24 35 53 57 50 42 42 19 4 -8 -31 -44 -43 -52 -41 -45 -36 -29 -16 5 23 28 30 42 45 47 34 35 14 11 -22 -15 -34 -40
2176d0j0PLJ3J6J5KJ3J0J0J4Mkj0j8pj7k2%j8rMllJ8K1%J7J3OJ6qJ5j4Nk1qj4
$$ -40 -50 -43 -40 -27 -11 4 6 19 29 39 53 57 55 45 27 20 3 -19 -19 -37 -46 -42 -45 -48 -30 -9 -9 8 21 27 43 35 50 36 41 20 12 -2
2214bj7mj0%nPJLJ1J8OJ5J1OnJ0oj3j2Lk0j4rqpOmNK3PJJ1J2QONjNj2j2Kl6Kj
$$ -2 -19 -23 -33 -33 -38 -31 -30 -27 -16 2 8 23 34 40 35 45 39 26 14 17 -3 -17 -26 -34 -41 -35 -39 -34 -11 -4 -3 8 20 28 34 39 38 43 31 19 21 -15 -13 -14
2258a4j3MpnJ0JK0MK2PlRk%opkj1j3j5Lkj8LJ0mK0LjK5j3K0mJ1kOpj0j0j6pnL
$$ -14 -27 -23 -30 -35 -25 -24 -4 0 22 29 26 35 33 33 27 20 18 7 -6 -21 -18 -20 -38 -35 -25 -29 -9 -6 -7 18 5 25 21 32 30 36 29 19 9 -7 -14 -19 -16
2301a6j3MpK0j1K1NK0JJ2mPollrj8%j5rrOkKlJ8LQK2nJ1OqMmrpoj5Lrkj0LLlK9
$$ -16 -29 -25 -32 -12 -23 -2 3 23 24 36 32 39 33 30 27 18 0 0 -15 -24 -33 -27 -29 -27 -30 -12 -9 -1 21 16 27 33 25 29 25 16 9 3 -12 -9 -18 -20 -30 -27 -24 -27 2
2348BMK0kRMpMKoJj6j4lj9MJqj2K1OQrK1OkQj9J5LlqMk1qmQoj1KNkJ6J1KJ2Jj
$$ 2 6 26 24 33 37 30 34 36 30 31 15 1 -2 -21 -17 -16 -24 -36 -15 -9 -1 -10 11 17 15 23 4 19 22 19 11 15 -6 -14 -18 -10 -16 -27 -25 -20 -22 -6 5 7 19 20 19
2395A9KJ8j2rkj0j0Qj1prmJJJ3%J1MJJ7j1MJ8k1Nmonqj3QlmQqPJ8LOj1J6lPlJ
$$ 19 21 39 27 18 16 6 -4 4 -7 -14 -23 -27 -26 -25 -12 -12 -1 3 4 21 10 14 32 11 16 12 6 1 -7 -20 -12 -15 -19 -11 -19 -12 6 9 15 4 20 17 24 21 22
2440B2oo%j4nJoOj5J4j1J9LOl%J6oRJpj2mOj5m%qlLQqNLJ3J1%KJ5kplJj1mkj5
$$ 22 16 10 10 -4 -9 -8 -14 -8 -23 -9 -20 -1 2 8 5 5 21 15 24 25 18 6 2 8 -7 -11 -11 -19 -22 -19 -11 -19 -14 -11 2 13 13 15 30 28 21 18 19 8 4 2 -13
2487a3MpnqJ3L%J2MKlQLRMk6J7jk1Mj4Qj3kR%%%J1LKOJ1rJ6j0jJroj1QJk1MKl
$$ -13 -9 -16 -21 -29 -16 -13 -13 -1 3 5 2 10 13 22 26 0 17 16 -5 -1 -15 -7 -20 -22 -13 -13 -13 -13 -2 1 3 9 20 11 27 17 16 17 8 2 -9 -1 0 -21 -17 -15 -18
2534a8MJ2NNrJ5LjmjJ3pj4j2K%nQLjqNNMLJ1%jNPnj3pJMmj8PMoJj%NPLMMLPKo
$$ -18 -14 -2 3 8 -1 14 17 16 12 11 24 17 3 -9 -7 -7 -12 -4 -1 -2 -10 -5 0 4 7 18 18 17 22 29 24 11 4 5 9 5 -13 -6 -2 -8 -7 -8 -8 -3 4 7 11 15 18 25 27 21
2586B1qj5nJ2j5KjjmL%QKLlJ9Pj5OPppK%j1Mj2jNm%KJKJ6l%KMLj0kn%nMnj%j0
$$ 21 13 -2 -7 5 -10 -8 -9 -10 -14 -11 -11 -3 -1 2 -1 18 25 10 16 23 16 9 11 11 0 4 -8 -9 -4 -8 -8 -6 -5 -3 13 10 10 12 16 19 9 7 2 2 -3 1 -4 -5 -5 -15
2636a5J4rKJ1kOMnlLOJ0j6NJj3jKlJmPj2J5mLKMKj1Q%QroOrJ3j8pjNKP%JMoJ3
$$ -15 -1 -10 -8 3 1 7 11 6 3 6 12 22 6 11 12 -1 -2 0 -3 -2 -6 1 -11 4 0 3 5 9 11 0 8 8 16 7 1 7 -2 11 -7 -14 -15 -10 -8 -1 -1 0 4 -2 11
2685A1mJ2j1J2j0lJ5k0K%%j6pJ1LnRjLL%PoJ1lj6JOojlrJlRj2K1j3J5O%NJkLp
$$ 11 7 19 8 20 10 7 22 2 4 4 4 -12 -19 -8 -5 -10 -1 -2 1 4 4 11 5 16 13 -3 -2 4 -2 -3 -6 -15 -14 -17 -8 -20 1 -12 3 9 9 14 15 13 16 9
2731InMpRj6RlrJ0j4OpOJ3j0J1KpRpOlJolm%oPmOj3MkJ9LlNpJ0j0Qnk%kmoLJj
$$ 9 4 8 1 10 -6 3 0 -9 1 -13 -7 -14 -8 5 -5 6 8 1 10 3 9 6 7 1 -2 -6 -6 -12 -5 -9 -3 -16 -12 -14 5 8 5 10 3 13 3 11 6 4 4 2 -2 -8 -5 -4 -5
2782eLj4PJ4rOoJ7j0OljlLj1NQj5LjmjkJ0JM%OlRJ0rlLj2OlmkqJlKJJ4j3J1Nn
$$ -5 -2 -16 -9 5 -4 2 -4 13 3 9 6 5 2 5 -6 -1 7 -8 -5 -6 -10 -11 -13 -3 -2 2 2 8 5 14 24 15 12 15 3 9 6 2 0 -8 -7 -10 -8 -7 7 -6 5 10 5
2831EOj0jMpOnKkmOj7ROKlnN%PmJ5Qj1Pj4Nklj0JOj0KPj5J2Lm%N%kMlPn%nkJo
$$ 5 11 1 0 4 -3 3 -2 0 -2 -6 0 -17 -8 -2 0 -3 -8 -3 -3 4 0 15 23 12 19 5 10 8 5 -5 -4 2 -8 -6 1 -14 -2 1 -3 -3 2 2 0 4 1 8 3 3 -2 -4 -3 -9
2883iMKJmnkJ6JmQlJKkJ2rrPjnkLLj4PlN%K%j1RJ3kqnoPLpJ0j4lRloRm%OkjOL
$$ -9 -5 -3 -2 -6 -11 -13 3 4 0 8 5 6 8 6 18 9 0 7 6 1 -1 2 5 -9 -2 -5 0 0 2 2 -9 0 13 11 3 -2 -8 -1 2 -5 5 -9 -12 -3 -6 -12 -3 -7 -7 -1 -3 -4 2 5
2937EQkqKjonLMkkjnJ3rJ2j4RjkjPJoQj1PopKRj3KlO%kNMnR%%OJlOj3jrKPmLr
$$ 5 13 11 3 5 4 -2 -7 -4 0 -2 -4 -5 -10 3 -6 6 -8 1 0 -2 -3 4 5 -1 7 -4 3 -3 -10 -8 1 -12 -10 -13 -7 -7 -9 -4 0 -5 4 4 4 10 11 8 14 1 0 -9 -7 0 -4 -1 -10
2992a0J4rOoJ1j3J7mlrNJ1j2%jomqJ0PjRrLMQoJj1NJQNj1KQj5NNrjKjJ8j6%Ml
$$ -10 4 -5 1 -5 6 -7 10 6 3 -6 -1 10 -2 -2 -3 -9 -13 -21 -11 -4 -5 4 -5 -2 2 10 4 5 -6 -1 0 8 13 2 4 12 -3 2 7 -2 -3 -1 -2 16 0 0 4 1
3040A%nJ0%j8J0rPqJ2MrMmlnJ0mJ2NrJKPJjppLpJ1j1%lKOJ0rJmOQj3NNPk2%J1
$$ 1 1 -4 6 6 -12 -2 -11 -4 -12 0 4 -5 -1 -5 -8 -13 -3 -7 5 10 1 2 4 11 12 11 4 -3 0 -7 4 -7 -7 -10 -8 -2 8 -1 0 -4 2 10 -3 2 7 14 -8 -8 3
3089Cn%PMk6J0kKONkJj4J4%jqJ5Oj1jlmOmPj7RLjkNOnljpLOplOpQKlJJj1pK0L
$$ 3 -2 -2 5 9 -17 -7 -9 -7 -1 4 2 3 -11 3 3 2 -6 9 15 4 3 0 -4 2 -2 5 -12 -3 0 -1 -3 2 8 3 0 -1 -8 -5 1 -6 -9 -3 -10 -2 0 -3 -2 -1 -12 -19 1 4
3141DKoljJ0Mqj%QKj4J0j6NRlOlmJ0nKokJ0jJk0LJ0Ooj0%Nj2QMlNJlNJ5j5Kkk
$$ 4 6 0 -3 -4 6 10 2 1 1 9 11 -3 7 -9 -4 5 2 8 5 1 11 6 8 2 0 10 9 10 -10 -7 3 9 3 -7 -7 -2 -14 -6 -2 -5 0 1 -2 3 18 3 5 3 1
3190ARKlrLj3JJ0Qj1JOj5J1lLJKjPj1J7j8kRrnLjJ3j4RmmlKJ0lKlQj4LJ0mklJ7
$$ 1 10 12 9 0 3 -10 -9 1 9 -2 -1 5 -10 1 -2 1 2 4 3 10 -1 16 -2 -4 5 -4 -9 -6 -7 6 -8 1 -3 -7 -10 -8 2 -1 1 -2 6 -8 -5 5 1 -1 -4 13
3238A3oqLoJ2okMJ%RnOj3LOj8J7morjJ0j3QKOj2MjNJ1n%JoNqJJ1qJ0o%l%nJ1o
$$ 13 7 -1 2 -4 8 2 0 4 5 5 14 9 15 2 5 11 -7 10 6 0 -9 -10 0 -13 -5 -3 3 -9 -5 -6 -1 10 5 5 6 0 5 -3 -2 9 1 11 5 5 2 2 -3 8 2
3287BLKJ0j3j1J3oRl%j7NoRqJ2NlkjjklMJjpJ0kmMKqPOkq%Pj3NJN%JrOPoJkmQ
$$ 2 5 7 17 4 -7 6 0 9 6 6 -11 -6 -12 -3 -11 1 6 3 1 0 -1 -3 -6 -2 -1 -2 -9 1 -1 -5 -1 1 -7 0 6 4 -4 -4 3 -10 -5 -4 1 1 2 -7 -1 6 0 1 -1 -5 3
3340Cj0QKj1pmJ4qJ0J%JJnNj4J3pMJ2m%j0QqRlj4J3%kkKJ0j3RpPo%mOkmLjMrP
$$ 3 -7 1 3 -8 -15 -19 -5 -13 -3 -2 -2 -1 0 -5 0 -14 -1 -8 -4 8 4 4 -6 2 -6 3 0 -14 -1 -1 -3 -5 -3 7 -6 3 -4 3 -3 -3 -7 -1 -3 -7 -4 -5 -1 -10 -3
3389cOj2J2%P%lk1J5J0j4j1J7qQmJK%mlJ2oMoLlKJ5k0Rj0oOj0J9l%qRpKMKo%J
$$ -3 3 -9 3 3 10 10 7 -14 1 11 -3 -14 3 -5 3 -1 0 2 2 -2 -5 7 1 5 -1 2 -1 1 16 -4 5 -5 -11 -5 -15 4 1 1 -7 2 -5 -3 1 3 -3 -3 -2
3436bpQ%L%oMPqlJ3olmJ0jmKlQJpOj4OQ%j1OlkpJ1lpJ5j3J1oNoML%qLJKj0K2j1
$$ -2 -9 -1 -1 2 2 -4 0 7 -1 -4 9 3 0 -4 6 5 1 3 0 8 9 2 8 -6 0 8 8 -3 3 0 -2 -9 2 -1 -8 7 -6 5 -1 4 -2 2 5 5 -3 0 1 3 -7 15 4
3487DMmLomNmKK%QJlpLLJpjNmklkNKMj2%J3rlRpNOmJnMLj0J7pmM%%jpOJkkJ2j2
$$ 4 8 4 7 1 -3 2 -2 0 2 2 10 11 8 1 4 7 8 1 0 5 1 -1 -4 -6 -1 1 5 -7 -7 6 -3 -6 3 -4 1 7 3 4 -1 3 6 -4 13 6 2 6 6 6 5 -2 4 5 3 1 13 1
3543AKPj7JMk%lJLkmP%j2J0Q%mkOmrJ9j3RJpMqNPj4J5qQmJ0mkrJ0rj%J0rnMJ4
$$ 1 3 10 -7 -6 -2 -4 -4 -7 -6 -3 -5 -9 -2 -2 -14 -4 4 4 0 -2 4 0 -9 10 -3 6 7 0 4 -4 1 8 -6 9 1 9 5 15 11 9 0 10 1 0 0 10 1 -4 0 14
3593A4j2rLjOKNol%MoNQkloJ3lpOjj6NPJOnpNJ0pmPopJqK3j2%MKnKkRk2Q%KJ%
$$ 14 2 -7 -4 -5 1 3 8 2 -1 -1 3 -3 2 10 8 5 -1 12 9 2 8 7 -9 -4 3 4 10 5 -2 3 13 6 2 9 3 -4 -3 -11 12 0 0 4 6 1 3 1 10 -12 -4 -4 -2 -1 -1
3646akLKJ5j3lJ3qoMnJJ2j1MK%L%pmjOLQj7Rj4OQMj5QjLooQMnPlNlj0J2qLoJ3
$$ -1 -3 0 2 17 4 1 14 6 0 4 -1 0 12 1 5 7 7 10 10 3 -1 -2 4 7 15 -2 7 -7 -1 7 11 -4 4 3 6 0 -6 2 6 1 8 5 10 7 -3 9 1 4 -2 11
3696A1oNl%qO%%KnKJ1rnKKj0J6mlpN%lNlJLlNKrNkpMJ2j0RrmMqKJ1nJ2rKkKJk2
$$ 11 5 10 7 7 -1 5 5 5 7 2 4 15 6 1 3 5 -5 11 7 4 -3 2 2 -1 4 1 2 5 2 7 9 0 5 3 -4 0 12 2 11 2 -2 2 -6 -4 7 2 14 5 7 5 7 8 -14
3749a4J7%J1rJmOkKrPLkooQJmPnm%OLpJMQq%KmmjLjOMJ2k4QmKkjJ0npLmMJ4j2
$$ -14 3 3 14 5 6 2 8 6 8 -1 6 9 7 1 -5 3 4 0 7 2 -2 -2 4 7 0 1 5 13 5 5 7 3 -1 -2 1 0 6 10 22 -2 6 2 4 2 1 11 6 -1 2 -2 2 16 4
3802D%mMmPJmkrJ8j7PNl%pMkL%Pj2J2rJ0oJ1nj0RlJjnOOj3lK0j0l%KrJ6mMrjO
$$ 4 4 0 4 0 7 8 4 2 -7 11 -6 1 6 3 3 -4 0 -2 1 1 8 -4 8 -1 9 3 14 9 -1 8 5 6 5 0 6 12 -1 -4 16 6 3 3 5 -4 12 8 12 3 2 8
3852Hm%Pj3KJ7j6J0nN%LmJ0j3l%ljMmJOmRoj1K0j1LqMKoNkkKlj0J3kJKpJ3pLK
$$ 8 4 4 11 -2 0 17 1 11 6 11 11 14 10 20 7 4 4 1 0 4 0 1 7 3 12 6 -5 15 4 7 -1 3 5 -1 4 2 0 2 -1 -11 2 0 1 3 -4 9 2 5 7
3901GJoLjKj2J6j0Mlm%POqJpRNnJJ%klNloLjNk0J9jKLj1OoOj1NLKlkRJj7POPj
$$ 7 8 2 5 4 6 -6 10 0 4 1 -3 -3 4 10 2 3 -4 5 10 5 6 7 7 5 2 7 4 -2 1 0 5 -15 4 3 5 8 -3 3 -3 3 -8 -3 0 2 -1 -3 6 7 -10 -3 3 10 9
3954IkoPlmNLrNJLj6RplJ0jKj2JJ0%pk%%QjpMmJ8qpNlj2J7jlM%NmoQmL%m%Oj3
$$ 9 7 1 8 5 1 6 9 0 5 6 9 -7 2 -5 -8 2 1 3 -9 -8 2 2 -5 -7 -7 -7 1 0 -7 -3 -7 11 3 -4 1 -2 -14 3 2 -1 3 3 8 4 -2 6 2 5 5 1 1 7 -6
4007fQJ3%j5LJr%Pj3NP%l%LOppPjKjJPo%%mPjloKRLqKNPlqKmKOj0JjKnpKMJ0p
$$ -6 2 15 15 0 3 4 -5 -5 2 -11 -6 1 1 -2 -2 1 7 0 -7 0 -1 1 0 1 8 2 2 2 -2 5 4 1 -5 -3 6 9 1 3 8 15 12 4 6 2 4 10 0 1 0 2 -3 -10 -8 -4 6 -1
4063aNkkKkLjj4J2mQkpPJj0J2jNrj0K0knRjj5kMOJmJ1j6lJJ4koNj2MJ8j9OKLl
$$ -1 4 2 0 2 0 3 2 -12 0 -4 4 2 -5 2 3 -7 5 4 9 0 -10 10 8 3 12 11 -4 -6 -2 4 5 1 12 -4 -7 -6 8 6 0 5 -7 -3 15 -4 2 4 7 4
4111Dr%MJ4j5N%QjLj1RPj4mMPj5LKOklk%ojjJJRmJP%klk%OmKnOnPoKNpPKmMmQ
$$ 4 -5 -5 -1 13 -2 3 3 11 10 13 2 11 18 4 0 4 11 -4 -1 1 7 5 2 0 0 -6 -7 -8 -7 -6 3 -1 0 7 7 5 2 0 0 6 2 4 -1 5 0 7 1 3 8 1 8 10 6 10 6 14
4167A4Kj0KKj0J9j1oKjnPlJj2J5%jjqPmPJ2k2J0mOmjMqjJ0opJ6j4J1ljPjjmMp
$$ 14 16 6 8 10 0 19 8 2 4 3 -2 5 2 3 -9 6 6 5 4 -4 3 -1 6 18 -4 6 2 8 4 3 7 -1 -2 8 2 -5 11 -3 8 5 4 11 10 9 5 9 2
4214BnMOplNJqQKknLJpK%KOnJ0j1QnmMrORnqjJ6oPj2lPj1PJ0jnKjMnkoJlNkkJ1
$$ 2 -3 1 7 0 -3 2 3 -5 3 5 3 -2 1 2 -5 -3 -3 -1 5 0 10 -1 7 2 -2 2 -7 -1 8 3 -5 -6 10 4 11 -1 -4 3 -8 -1 9 8 3 5 4 8 3 1 -5 -4 -7 -2 -4 -6 5
4269Ej1OOj0LqJ0N%oPrmLKjRNrRj3jLRljJJ%mlNnjNNqK%lP%qjLLMrLpKQnrJ9o
$$ 5 -6 0 6 -4 -1 -9 1 6 6 0 7 -2 -6 -3 -1 -2 7 12 3 12 -1 -2 1 10 7 6 7 8 8 4 1 6 1 0 5 10 2 4 4 1 8 8 0 -1 2 5 9 0 3 -4 -2 6 1 -8 11 5
4325EjLj5J0lLKOnoNRqQrjmQMj1Q%oJKj%Lkjkj1J6Jj6mK3j6J4r%mRKJpLoJ1nK
$$ 5 4 7 -8 2 -1 2 4 10 5 -1 4 13 5 13 4 3 -1 7 11 0 8 8 2 3 5 4 4 7 5 4 2 -9 7 8 -8 -12 11 -5 9 0 0 -4 5 7 8 1 4 -2 9 4 6
4376FjQLj0OnJmJ0j6jQJkNk0J9JLNoknOmojkPk%JojoK5k0PJ0mj2J1lLkOMrKrQ
$$ 6 5 13 16 6 12 7 8 4 14 -2 -3 5 6 4 9 -11 8 9 12 17 11 9 4 10 6 0 -1 -3 4 2 2 3 -3 -4 -10 15 -5 2 12 8 -4 7 4 7 5 11 15 6 8 -1 7
4427GqNKLokKPj5lP%QMrqJ1j1MJ%KlKMj0QKLjj4J1K%MmPKj0%jLk%lMMpnOKqjN
$$ 7 -1 4 6 9 3 1 3 10 -5 -8 -1 -1 7 11 2 -6 5 -6 -2 -1 -1 1 -2 0 4 -6 2 4 7 6 -8 3 5 5 9 5 12 14 4 4 3 6 4 4 1 5 9 2 -3 3 5 -3 -4 1
4481AJQj2kMQlj3QlNPn%m%Rj1Rk%Ol%pmKJ6rQnjpLJrQljoRjmRnJJomO%kQj%Pj3
$$ 1 2 10 -2 -4 0 8 5 -8 0 -3 2 9 4 4 0 0 9 -2 7 5 5 11 8 8 1 -3 -1 15 6 14 9 8 1 4 5 -4 4 1 0 -6 3 2 -2 7 2 3 4 -2 -6 0 0 -2 6 5 5 12 -1
4538aJ0j3J2jrKRj8J2kMkJNKj2MMLnNkrJJ0j1J3j7J2Jj2KJkPLorLNmL%O%kj0J6
$$ -1 9 -4 8 7 -2 0 9 -9 3 1 5 3 4 9 11 -1 3 7 10 5 10 8 -1 0 10 -1 12 -5 7 8 -4 -2 -1 -3 4 7 1 -8 -5 0 -4 -1 -1 5 5 3 -7 9
4586Inj1QkLkNJ7qj1nJ4kolMqLJ2jJlqm%JKM%JJm%KMplJNPrjKKMLlLmrOKMjRj2
$$ 9 4 -7 1 -1 2 0 5 22 14 3 -2 12 10 4 1 5 -3 0 12 11 12 9 1 -3 -3 -2 0 4 4 5 6 2 2 4 8 1 -2 -1 4 11 2 1 3 5 9 12 9 12 8 -1 5 7 11 10 19 7
4642GmQqRj6QKOrOj0nJ3JmnjLKKkJnMjjNNj1PPj2J5j8ROk%mJ%o%KLoOljqJ1pL
$$ 7 3 11 3 12 -4 4 6 12 3 9 -1 -6 7 8 4 -1 -2 1 3 5 3 4 -1 3 2 1 6 11 0 7 14 2 17 -1 8 14 12 12 8 9 9 3 3 5 8 2 8 5 4 -4 7 0 3
4695CNllkrJ2pJ6p%qOjOjKjk%jkj2J9j0J1j5MPpJ0joMJk%qJ1jj4PmJ7j3okLJ3
$$ 3 8 5 2 0 -9 3 -4 12 5 5 -3 3 2 8 7 9 8 6 6 5 3 -9 10 0 11 -4 0 7 0 10 9 3 7 8 6 6 -2 9 8 -6 1 -3 14 1 -5 -7 -4 9
4743IoJpLQnjoLPrRmLqJ1Kj1oJ8j0pJ0kqQmRk3K1NqpO%KrMLkKqjPKmPOppqK1j6
$$ 9 3 4 -3 0 8 3 2 -4 -1 6 -3 6 2 5 -3 8 10 -1 -7 11 1 -6 4 2 -6 2 -2 7 -16 5 10 2 -5 1 1 3 -6 -2 1 -1 1 -7 -8 -1 1 -3 4 10 3 -4 -12 9 -7
4796gONjm%nQJJ0olLqJ0pmOjnRrNoN%pOj%RqMmKj%%kQj%j0Mjk%MmN%Oj0Oj3K1
$$ -7 -1 4 3 -1 -1 -6 2 3 13 7 4 7 -1 9 2 -2 4 3 -2 7 -2 3 -3 2 2 -5 1 0 0 9 1 5 1 3 2 2 2 0 8 7 7 -3 1 0 -2 -2 2 -2 3 3 9 -1 5 -8 13
4851A3j2kQ%j0J2nq%%NklQoKK%KJrNmQPj6J3j3J1lJ0j6NjlMNqpJ2kJ3j4j0J6j3
$$ 13 1 -1 7 7 -3 9 4 -4 -4 -4 1 -1 -4 4 -2 0 2 2 4 5 -4 1 -3 5 12 -4 9 -4 7 4 14 -2 3 2 -1 3 8 0 -7 5 3 16 2 -8 8 -5
4897eJ1%nONj0qJ1LnmOjmq%OoJ2j3QMnJ1j5J1NprOmJ1MlrPLklKlj0K1j0pJ0j6
$$ -5 6 6 1 7 12 2 -6 5 8 3 -1 5 4 0 -8 -8 -2 -8 4 -9 -1 3 -2 9 -6 5 10 3 -6 0 -4 7 11 8 -1 6 9 7 4 6 3 -7 14 4 -3 7 -9
4944iJ0lnMNKJj0JNmRNLOj9%J2qKloLlJ6j0Oj5NJ4j0jMJ7j7JqJQjkqNjPnlkQj2
$$ -9 1 -2 -7 -3 2 4 5 -5 -4 1 -3 6 11 14 20 1 1 13 5 7 4 -2 1 -2 14 4 10 -5 0 14 4 3 7 24 7 8 0 1 9 8 6 -2 3 2 9 4 1 -1 7 -5
4994eMjKJKoJPrJ0rjKoRJPj4NJOjj0LkJJ5j5LmNLlJjm%jOKjqJ3k0RlKjJK1k3Q
$$ -5 -1 -2 0 1 3 -3 -2 5 -4 6 -3 -4 -2 -8 1 2 9 -5 0 1 7 6 -4 -1 -3 -2 13 -2 1 -3 2 5 2 3 2 -2 -2 -3 3 5 4 -4 9 -11 -2 -5 -3 -4 -3 18 -5 3
5046CRolNmqJ2%j9K4j7PRlmk%Lj0O%KjlNrPplllJ6pMlMK%mpJ3pJ2mLKJnpOJMl
$$ 3 12 6 3 8 4 -4 8 8 -11 13 -4 3 12 9 5 3 3 6 -4 2 2 4 3 0 5 -4 3 -4 -7 -10 -13 3 -4 0 -3 1 3 3 -1 -8 5 -2 10 6 9 11 12 7 0 6 7 11 8
5099HnoPlkmOpMLjjjLJnRnoJ4rMkqMlPOmpKmKJ1j%oj3J2PPrJKp%jJQoMokJ0mm
$$ 8 3 -3 4 1 -1 -5 1 -6 -2 1 0 -1 -2 1 2 -3 6 1 -5 9 0 4 2 -6 -2 -5 2 8 4 -3 -1 -5 -3 8 7 7 1 -12 0 7 14 5 6 8 1 1 0 1 9 3 7 1 -1 9 5 1
5155AMkm%%J2j0mNLlpPj%LnJkMQj3lK1r%oKML%Kjj4MnJ2%rMLkmkPo%lOmJ1j2%
$$ 1 5 3 -1 -1 -1 11 1 -3 2 5 2 -5 2 1 1 4 -1 0 -2 2 10 -3 -6 15 6 6 0 2 6 9 9 11 10 -4 0 -5 7 7 -2 2 5 3 -1 -3 4 -2 -2 -5 1 -3 8 -4 -4
5208dJ4pOj2Jll%PQknJoLjKRlL%lpNjQj2JLoKJmJ3mj1jO%nQkNjjQj0lKOnJ1qN
$$ -4 10 3 9 -3 -2 -5 -8 -8 -1 7 5 0 1 -5 -2 -3 -1 8 5 8 8 5 -2 3 2 10 -2 -1 2 -4 -2 -1 -5 8 4 -7 -8 -2 -2 -7 1 -1 4 3 2 10 0 -3 -1 5 0 11 3 8
5262Hj2NmQnkJ%J0j3J1qNj0QnlOj0J1Mj2MNKjjqP%mJjlLnJ5JoJj1MJ5oj4J5jj
$$ 8 -4 1 -3 5 0 -2 -1 -1 9 -4 7 -1 4 -6 2 -3 -6 0 -10 1 5 -7 -3 2 4 3 2 -6 1 1 -3 -2 -3 -6 -3 -8 7 8 2 3 -8 -4 11 5 -9 6 5 4
5310DoMLjoQkJKjJj7jJ3NnkJQlnPqQrNnpJ8j0pMQj3J0qmJ4Oj2J2j2J3rRo%K%K
$$ 4 -2 2 5 4 -2 6 4 5 7 6 7 -10 -11 2 7 2 0 1 9 6 1 8 0 8 -1 4 -1 -8 10 0 -7 -3 5 -8 2 -6 -10 4 10 -2 10 -2 11 2 11 5 5 7 7 9
5360IqKkOj2RNOk7PJ2pRrKolJ3pJ0ln%PlPj1ljJ7qll%J2j1MjLPkj3jOrPO%%j5
$$ 9 1 3 1 7 -5 4 9 15 -12 -5 7 0 9 0 2 -4 -7 6 -1 9 6 1 1 8 5 12 1 -2 -3 14 6 3 0 0 12 1 5 4 7 14 12 -1 -2 4 -5 2 8 8 8 -7
5410gPMpOpQPpj2J3KpkkJqPlJJJJPpmMOr%J3rJ1%j2KJ0qNMlKmlpNpJ3oMrkJ%J0
$$ -7 0 4 -3 3 -4 4 11 4 -8 5 7 0 -2 -4 -3 -11 -4 -7 -6 -5 -4 -3 4 -3 -7 -3 3 -6 -6 7 -2 9 9 -3 -1 9 1 6 10 7 9 5 2 -5 0 -7 6 0 4 -5 -7 -6 -6 4
5464DpNj0J0k%jLpJ3Kj1LJ1qKnLJ0mMpmNj0nNjJ4j3LNlPj3kjLLj0jOP%Qlj0Qj0
$$ 4 -3 2 -8 2 0 0 -1 2 -5 8 10 -1 2 13 5 7 2 5 15 11 15 8 4 9 -1 -6 -1 -2 12 -1 2 7 4 11 -2 -4 -5 -2 1 -9 -10 -4 3 3 11 8 -2 6 -4
5513dJ1rLQpj4J7J1j4KKj2QJQjrk%J0mj1J0Ljl%%%mJ2lnJm%MpLNj0OjJNj1kK0
$$ -4 7 -2 1 9 2 -12 5 16 2 4 6 -6 2 3 11 10 1 -1 -1 9 5 -6 4 7 6 3 3 3 3 -1 11 8 3 4 0 0 4 -3 0 5 -5 1 0 1 6 -5 -7 13
5561A3onJ3j2JpQNj%qNloNNmMlJkJpJJ0pK%q%kKQmMkKkKKnJ0j0jlJ2j3J0pJ8j5
$$ 13 7 2 15 3 4 -3 5 10 9 9 1 6 3 -3 2 7 3 7 4 5 3 4 -3 -2 8 1 3 3 -5 -5 -7 -5 3 -1 3 1 3 1 3 5 0 10 0 -1 -4 8 -5 5 -2 16 1
5612AP%nLllpOJkjlJ5j0j2J7j0NKmjMOmljkPJ0npKJ1j0mK0k3OnONqJ1JlpJJ2j1
$$ 1 8 8 3 6 3 0 -7 -1 0 -2 -3 -6 9 -1 -13 4 -6 -1 1 -3 -4 0 6 2 -1 -2 -4 3 13 8 1 3 14 4 0 20 -3 3 -2 4 9 1 12 13 10 3 4 16 5
5661EqQqKOKnkJ1lo%J1lpPr%jQj5J2Pj0mmQmPlKNLj6J1rKJ2knNj0lRK%nJ0j1j
$$ 5 -3 5 -3 -1 5 7 2 0 11 8 2 2 13 10 3 10 1 1 0 8 -7 5 12 2 -2 -6 2 -2 5 2 4 9 12 -4 7 -2 0 12 10 5 10 0 -3 6 8 8 3 13 2 1
5711AnJ0Rj0JjmkRqjMkKMj5LQPmnQrMMomMnQoNJ1j4MnkpPJ4%Kj8J1m%kNjKk%P
$$ 1 -4 6 15 5 6 5 1 -1 8 0 -1 3 1 3 7 -8 -5 3 10 6 1 9 0 4 8 2 -2 2 -3 5 -1 4 15 1 5 0 -2 -9 -2 12 12 14 -4 7 3 3 1 6 5 7 5 5 12
5764A2jJqJmNKJKQj6OJrJ3j2QKJ%nnOkjknqJ5jlL%lmMKnMKkJj5J5LJpMkkPKrM
$$ 12 11 12 4 5 1 6 8 9 11 19 3 9 10 1 14 2 10 12 13 13 8 3 9 7 6 4 -1 -9 6 5 2 5 5 2 -2 2 4 -1 3 5 3 4 -11 4 7 8 1 5 3 1 8 10 1 5
5818EmM%KqOkjNj0PllJ0Mlj2J6qrmMNKkJ4j4klRmqQJ1m%mqQ%j0PkmMMj1J7pnR
$$ 5 1 5 5 7 -1 5 3 2 7 -3 4 1 -2 8 12 9 -3 13 5 -4 -8 -4 1 3 1 15 1 -1 -4 5 1 -7 1 12 8 8 4 -4 4 4 -6 1 -1 -5 -1 3 -8 9 2 -3 6
5869FjL%j7J3LkKKj3RJJopR%RpqLjKO%nnkQpPNl%m%lJ0LJpJK%j1LJ3Jj2M%Lnj
$$ 6 5 8 8 -9 4 7 5 7 9 -4 5 6 7 1 -6 3 3 12 5 -3 0 -1 1 7 7 2 -3 -5 3 -4 3 8 5 5 1 1 -2 8 11 12 5 6 8 8 -3 0 13 14 2 6 6 9 4 3
5923CkkkQlPmRj5Pkn%KPqnOkJ3lJpLJ4rJojjLkLnnJ3j5MKRj7MLRkj2PLmjJ2j9
$$ 3 1 -1 -3 5 2 9 5 14 -1 6 4 -1 -1 1 8 0 -5 1 -1 12 9 10 3 6 20 11 12 6 5 4 7 5 8 3 -2 11 -4 0 2 11 -6 -2 1 10 8 -4 3 6 2 1 13 -6
5975fJ2NqkJJ4jmo%Oj4J0mJ0j2lNJ0nmjRj1nOKqmNjRLlnRr%Qp%Nmkkl%OMLj0K
$$ -6 6 11 3 1 2 16 15 11 5 5 11 -3 7 3 13 1 -2 3 13 8 4 3 12 1 -4 2 4 -4 -8 -3 -4 5 8 5 0 9 0 0 8 1 1 6 2 0 -2 -5 -5 1 5 8 -2 0
6027@LLlJLJnrJ5rkJ2KoojQOqMRj8llPkkkJ1ojklJ4j0NNj3J8nj4PlJ6j7J1qlJ2
$$ 0 3 6 3 4 7 8 3 -6 9 0 -2 10 12 6 0 -1 7 13 5 9 18 0 -3 -6 1 -1 -3 -5 6 0 -1 -3 -6 8 -2 3 8 -5 13 8 -6 1 -2 14 -3 8 0 -3 9
6076ILk0J5%pQLj3lJ1nQLkpLj4J5%nkNmJjKmJMNrlNOmlJ2mnJjJ3j0JKoJ0j2Ll
$$ 9 12 -8 7 7 0 8 11 -2 -5 6 1 9 12 10 3 6 -8 7 7 2 0 5 1 2 1 3 -1 0 4 9 0 -3 2 8 4 1 13 9 4 5 4 17 7 8 10 4 14 2 5 2
6126BOkJKnkrNkLMqQqJKJRj7K1j1pPjK%Rjoj1J8j7jRMOOj2oJ0jPj4NJj1Qj2JP
$$ 2 8 6 7 9 4 2 -7 -2 -4 -1 3 -5 3 -5 -4 -2 -1 8 -9 12 1 -6 1 0 2 2 11 10 4 -7 11 -6 -7 2 6 12 18 6 0 10 9 16 2 7 8 -3 5 -7 -6 1
6176AkM%jNqmJlPKMln%j3K6rNpPmLLjkRj1%NnJj1J1mlMPoJj2J2NqrQlKKpLJ5j4
$$ 1 -1 3 3 2 7 -1 -5 -4 -7 0 2 6 3 -2 -2 -15 11 2 7 0 7 3 6 9 8 6 15 4 4 9 4 5 -6 5 1 -2 2 9 3 4 -8 4 9 1 -8 0 -3 -1 1 -6 -3 12 -2
6229bMPj1NqPJ2j2oJ1L%%nkjJ1plRj5J3j1RLkkj4OMrMkmOokJ7Ppj6J5oPj0JRl
$$ -2 2 9 -2 3 -5 2 14 2 -4 7 10 10 10 5 3 2 13 6 3 12 -3 10 -1 8 11 9 7 -7 -1 3 -6 -2 -4 -8 -2 -8 -10 7 14 7 -9 6 0 7 -3 -2 7 4
6277DmLMjlJ0Qk2QjoPKKj0rJ7%j3JJ4j3lJ0kkKlmJ2mQLj0jl%NmOj0J2qJ2nlRj2
$$ 4 0 3 7 6 3 13 21 -1 7 6 0 7 9 11 1 -8 9 9 -4 -3 11 -2 -5 5 3 1 3 0 -4 8 4 12 15 5 4 1 1 6 2 8 -2 10 2 14 9 6 15 3
6325CKnJOmj1J4%rR%jrMkJ1qLllJ4j5M%lOjj1PKlkJ2kNqOJlMj0OkmlQQkpLpjJ1
$$ 3 5 0 1 7 3 -8 6 6 -3 6 6 5 -4 0 -2 9 1 4 1 -2 12 -3 1 1 -2 4 3 -8 -1 1 -2 -4 8 6 11 3 9 10 7 11 1 7 5 1 -2 6 14 12 5 8 1 0 11
6378A1nLmJ%Oj5nJ5kklPoMrJ1qO%j1LnJ1kLnRlJqMLjmLKmK%jNj%omJ8plmKj0Q
$$ 11 6 9 5 6 6 12 -3 -8 7 5 3 0 7 1 5 -4 7 -1 5 5 -6 -3 -8 3 1 4 -1 8 5 6 -2 2 5 4 0 3 5 1 3 3 2 7 6 6 0 -4 14 7 4 0 2 -8 0
6431@NjpOj1JQKj0J4omJ5j8Pj%jRlJmMj7J4LJnOj6J0KqPMqoLOjQj1mjQ%KlNOj4
$$ 0 5 4 -3 3 -8 -7 1 3 -7 7 1 -3 12 -6 1 0 0 -1 8 5 6 2 6 -11 3 6 7 2 8 -8 2 4 -4 3 7 -1 -7 -4 2 1 9 -2 -6 -7 1 1 3 0 5 11 -3
6482cMj2J6LKj1K%%J4Kj8oQnORplJ0j0kJ6k5PPoJ3rm%JKPj3Qq%L%oRLKjKrNj7
$$ -3 1 -11 5 8 10 -1 1 1 1 15 17 -1 -7 1 -4 2 11 4 1 11 1 -1 15 -10 -3 4 -2 11 2 -2 -2 -1 1 8 -5 3 -5 -5 -2 -2 -8 1 4 6 5 7 -2 3 -14
6531a4J8mnNQ%o%pJ6pKkN%nnkNMrJ0ln%%jjJ0j3%OLllNqJ1OqpNJJLmK%OlqJ5n
$$ -14 4 0 -5 0 8 8 2 2 -5 11 4 6 4 9 9 4 -1 -3 2 6 -3 7 4 -1 -1 -1 -2 -3 7 -6 -6 0 3 0 -3 2 -6 5 11 3 -4 1 2 3 6 2 4 4 10 7 -1 14 9
6584I%jjoOmnJ2jpLj0MJ1oKj0J4njlj2MJ1mlJKLlPj5J9j2OOmJ%j1kJ1JJqjJ4j2
$$ 9 9 8 7 1 7 3 -2 10 9 2 5 -5 -1 10 4 6 -4 10 5 4 1 -11 -7 4 0 -3 -2 0 3 0 7 -8 11 -1 5 11 7 8 8 -3 -5 6 7 8 0 -1 13 1
6632AqJ2PqJLooNqJL%jnNJMpMk%%J7j1jPj1NmjNjRnlLLjjkm%MlJkNJomOrJK1k8
$$ 1 -7 5 12 4 5 8 2 -4 1 -7 -6 -3 -3 -4 -9 -4 -3 1 -6 -2 -4 -4 -4 13 2 1 8 -3 2 -2 -3 2 1 10 5 2 5 8 7 6 4 0 0 4 1 2 0 5 6 0 -4 2 -7 -6 15 -13
6688a3J1KkK%PqqKjJ1lLNpQKj3%KLklNNj4J5lqKlJ2nKj0OmJlK%lNNlj0J1MmM%
$$ -13 -2 0 -2 0 0 7 -1 -9 -7 -8 3 0 3 8 1 9 11 -2 -2 0 3 1 -2 3 8 -6 9 6 -2 0 -3 9 4 6 -4 2 -2 -1 -4 -2 -2 -5 0 5 2 -8 3 7 3 7 7
6739GnkjJ3j9QJ1mlJ%MnLOqQmJ1j8OM%mnRn%llKOmJrPMrj0J9rPj1J0mnQkMnJ0
$$ 7 2 0 -1 12 -7 1 12 8 5 6 6 10 5 8 14 6 14 10 21 3 9 13 13 9 4 13 8 8 5 2 4 10 6 7 -2 5 9 0 -10 9 0 7 -4 6 2 -3 5 3 7 2 12
6790A2j9J6%j3MjQooLJ7j1kLlMQokllLoNKj4J2KMkkj0J7qjMlOkKmnMPnNOmj2J5
$$ 12 -7 9 9 -4 0 -1 7 1 -5 -2 15 4 2 5 2 6 14 8 6 3 0 3 -3 2 4 -10 2 4 8 6 4 -6 11 3 2 6 3 9 7 9 5 0 4 11 6 11 17 13 1 16
6840A6qmJ1j1OmjOj2N%KlknMLlmJ4rLOMj0Mj0NmM%PmpJ0MRj5Rj0JOj2JPj1OQr
$$ 16 8 4 15 4 10 6 5 11 -1 4 4 6 3 1 -4 0 3 0 -4 10 1 4 10 14 4 8 -2 3 -1 3 3 10 6 -1 9 13 22 7 16 6 7 13 1 2 9 -2 4 12 3
6889CMm%JmJlkJ5%j1M%j6RjJ2j3J6j2NLmlJNJmNjJ7j2pJPoj%lKnM%jNlLj3K0j1
$$ 3 7 3 3 4 0 1 -2 -4 11 11 0 4 4 -12 -3 -4 8 -5 11 -1 4 7 3 0 1 6 7 3 8 7 24 12 5 6 13 7 6 6 3 5 0 4 4 3 8 5 8 -5 15 4
6939D%%joJ2p%KNjj4J2NqoOKMJOrPp%NoPKnj%KrMKlLlkjjjJLkknjLJO%r%QkOo
$$ 4 4 4 3 -3 9 2 2 4 9 8 -6 6 11 3 -3 3 5 9 10 16 7 14 7 7 12 6 13 15 10 9 9 11 2 6 8 5 8 5 3 2 1 0 1 4 2 0 -5 -6 -3 -2 4 4 -5 -5 3 1 7 1
6997AoJ9j0lQorJ2lRloJlkNJJOqlmMj1J2jlJRnnQJlnJ2j7NnJ5qJLlMmKKrRLKl
$$ 1 -5 14 4 1 9 3 -6 6 3 12 9 3 4 1 -1 4 5 6 12 4 1 -3 1 -10 2 1 -2 -1 8 3 -2 6 7 4 -1 11 -6 -1 -6 9 1 2 5 2 6 2 4 6 -3 6 9 11 8
7050HqJLNj0LPNrOpMj0J2mmpKMMpjN%LnOJ%qJ2mNj4lJ1lQlmQrJ3%Jj0rQKpnJ1
$$ 8 0 1 4 9 -1 2 9 14 5 11 4 8 -2 10 6 2 -5 -3 1 5 -2 -3 2 2 5 0 6 7 7 -1 11 7 12 -2 -5 6 3 11 8 4 12 3 16 16 17 7 -2 6 8 1 -4 7
7102GJkmRq%MlLnJ0rnQJrRqpRKpJ1j3PKLMkpJ2pOk%%lllJ1j7OMqQolJ0ppJJ6m
$$ 7 8 6 2 11 3 3 7 4 7 2 12 3 -2 6 7 -2 7 -1 -8 1 3 -4 7 -6 1 3 6 10 8 1 13 6 12 10 10 10 7 4 1 12 -5 1 5 -3 5 -1 -4 6 -1 -8 -7 9 5
7155EKmJj4RjmJ2n%jP%kkJjJ6j4kJ9nqkJ1pLnPoj0PKjjmkJMJKj2RJjjmRj1J7p
$$ 5 7 3 4 -10 -1 -2 -6 6 1 1 0 7 7 5 3 4 3 19 5 3 22 17 9 7 18 11 14 9 16 10 0 7 9 8 7 3 1 2 6 7 9 -3 6 7 6 5 1 10 -1 16 9
7206ImOnjj2J5J0lNj3J1nLKj3NoOKmj1J6%qMLpjlJRokKoJMnLPj1J0jOrNLqkjj
$$ 9 5 11 6 5 -7 8 18 15 20 7 18 13 16 18 5 10 4 10 12 8 -3 13 13 5 9 12 5 4 1 2 11 5 3 5 -1 0 4 -1 2 9 -2 8 7 13 4 9 12 4 2 1 0
7257@KJRmlLoJ4rLNj3%KqMK%K%k%oPKlpRqP%%MlPj5J4pJ1rlMQkmrRQKroLKOml
$$ 0 2 3 12 8 5 8 2 16 7 10 15 2 2 4 -4 0 2 2 4 4 2 2 -4 3 5 2 -5 4 -4 3 3 3 7 4 11 -4 10 3 14 5 2 6 14 12 8 -1 8 16 18 9 3 6 8 14 10 7
7313GloJ3j2OJj1J4qLJqLnJ0Pj8MjJ6j8P%MJNKj3J1%rKpQJKKqMj%mJ0k5J4nJK
$$ 7 4 -2 11 -1 5 6 -5 9 1 4 5 -3 0 -5 5 12 -6 -2 -3 13 -5 2 2 6 7 12 14 1 12 12 3 5 -2 6 7 9 11 3 7 6 6 2 12 -13 1 -4 -3 -1
7361aJLlJqJ6omOqJjmlOJKOoQlmJ1oQKj1LRj1Qj2lJ9qmoMjMk%mNljmOmmJ7j6L
$$ -1 0 3 0 1 -7 9 3 -1 5 -3 -2 -3 -7 -10 -4 -3 -1 5 -1 7 4 0 11 5 13 15 4 7 16 5 13 1 -2 17 9 5 -1 3 2 6 4 4 0 5 2 1 -3 3 -1 -5 12 -4 -1
7414aMmkKpJ0MjrQloJJ0rRnKN%j0PllQJj0Qj0OoOlJ%jNn%Rj9%OJ4plMJkLnRj2
$$ -1 3 -1 -3 -1 -8 2 6 5 -4 4 1 -5 -4 6 -3 6 1 3 8 8 -2 5 2 -1 7 8 -2 6 -4 2 -4 2 -1 0 0 -1 4 -1 -1 8 -11 -11 -5 9 2 -1 3 4 2 5 0 9 -3
7467cMKJ0j6kJ5%mlJJ9j9jmMK%Oj0Kjj1RjQopJMoJ0joOrRRj3%%Qj0MLRjjMkjl
$$ -3 1 3 13 -3 -5 10 10 6 3 4 23 4 3 -1 3 5 5 11 1 3 2 -9 0 -1 7 1 -6 -5 -1 -7 3 2 -4 2 -7 2 11 -2 -2 -2 6 -4 0 3 12 11 10 14 12 11 8
7518HOlqJ6rNomKnpQPk1QLnPmjkLJlPOkj0Rj0RLOjolPpjRmMj2%PKj8J6nmKJQj4
$$ 8 14 11 3 19 10 15 9 5 7 2 -5 3 10 -11 -3 0 -5 2 -2 -3 -5 -2 -1 -4 3 9 7 -3 6 -4 5 8 14 13 7 4 11 4 3 12 8 12 0 0 7 9 -9 7 2 -2 0 1 9 -5
7572eNNnJlLjPpJ3oJnM%NMj2mMRloJ2j4J0Oj1KJmlNnoJ5j1kNJjpRnNkj3PJ2nl
$$ -5 0 5 0 1 -2 1 0 7 0 13 7 8 3 7 7 12 16 4 0 4 13 10 4 16 2 12 18 7 9 10 6 3 8 3 -3 12 1 -1 4 5 4 -3 6 1 6 4 -9 -2 10 5 2
7623BqKJ1nM%%MmKkMoJ0j2PjLlJj6J1Jo%kJ2pOrJ5j4OnqKONlJj1MLKlK%oJ1Ln
$$ 2 -6 -4 7 2 6 6 6 10 6 8 6 10 4 14 2 9 8 11 8 9 -7 4 5 -1 -1 -3 9 2 8 -1 14 0 6 1 -7 -5 1 6 3 4 -7 -3 0 2 -1 1 1 -5 6 9 4
7674DOj3LjMOJ0j6MJ1j3llJ7j8J3kq%J%NLl%j2NLrKOMj0rJ4jnPlQj0RjJ0j0lL
$$ 4 10 -3 0 -1 3 9 19 3 7 18 5 2 -1 16 -2 11 9 1 1 2 2 7 10 7 7 -5 0 3 -6 -4 2 6 -4 -13 1 0 -5 2 -1 7 -3 6 5 15 5 2 5
7721EQkn%kRkkpQjLj4jNMMrOpLJkoRrjJRmKknOjOj1QmMKLrjJ3lrKqJ0jPljOJj2
$$ 5 13 11 6 6 4 13 11 9 2 10 9 12 -2 -3 2 6 10 1 7 0 3 4 2 -4 5 -4 -5 -4 5 1 3 1 -4 2 1 7 -4 4 0 4 6 9 0 -1 12 9 0 2 -6 4 3 10 7 6 12 13 1
7778Aj1J7rOjpKOj0kJ2mL%jLrJ0plMNMrMKj1J9mmMPj2qJ1%%J%j4NJkkKQnmnJ3
$$ 1 -10 7 -2 4 3 -4 -2 4 -6 -8 4 0 3 3 2 5 -4 6 -1 -4 0 5 9 0 4 6 -5 14 10 6 10 17 5 -3 8 8 8 9 9 -5 0 1 -1 -3 -1 7 2 -2 -7 6
7828Fj0J2rnRqJ0Qk4J0nQoMkOKmjPk%lJRMkk0J9j2kJ0mpMpJ9j2%JKolOMpJ0rP
$$ 6 -4 8 -1 -6 3 -5 5 13 -11 -1 -6 2 -4 0 -2 4 6 2 1 8 6 6 3 4 13 17 15 -5 14 2 0 10 6 -1 3 -4 15 3 3 4 6 0 -3 3 7 0 10 1 8
7877HnMj0KKlLkJ5j2LmOlLPpOnjJn%LjJ1rnoRk%j0J4JmkqPJ%mPrM%J0pJ8j4oP
$$ 8 3 7 -3 -1 1 -2 1 -1 14 2 5 1 7 4 7 14 7 13 8 7 8 3 3 6 5 16 7 2 -4 5 3 3 -7 7 8 4 2 -6 1 2 2 -2 5 -4 0 0 10 3 21 7 1 8
7929HknR%jrMjNJ6j5JOJolrOj2J3Lnj0QOjj7J8Oj2%PrMPnpROj4J0lKrJ1Kj1%J1
$$ 8 6 1 10 10 9 0 4 3 8 24 9 10 16 17 11 8 -1 5 -7 6 9 4 -6 2 8 7 -10 8 14 2 2 9 0 4 11 6 -1 8 14 0 10 7 9 0 11 13 2 2 13
7978A3j4lJ5ojPnP%%Lj0kQ%pqJnORNrj2%MQpjQKnQKoPMj4Rj0NOljLQoPpj1PQk5
$$ 13 -1 -4 11 5 4 11 6 13 13 13 16 6 4 12 12 5 -3 -2 -7 -1 8 13 4 -8 -8 -4 4 -3 -4 4 6 1 9 11 5 12 16 2 11 1 6 12 9 8 11 19 13 20 13 2 9 17 -8
8031hJ6JnKqQLqMjkknJOjjLlJ0OqqJ5qkPLllJKLpMMqQj2pJ7j1JLqNoJ1j0J3rM
$$ -8 8 9 4 6 -2 6 9 1 5 4 2 0 -5 -4 2 1 0 3 0 10 16 8 0 15 7 5 12 15 12 9 10 12 15 8 12 16 8 16 4 -3 14 3 4 7 -1 4 -2 9 -1 12 3 7
8083GoOj4J3j1PmNKj0J4Rj3MnlJ7rOqj1K0lLj0KRqLj0KMpJ4rjNq%mJNPj0J0q%
$$ 7 1 7 -7 6 -5 2 -2 3 5 -5 9 18 5 9 4 1 18 9 15 7 -4 16 13 16 6 8 17 9 12 2 4 8 1 15 6 5 10 2 2 -2 -1 4 11 1 11 3 3
8130CMlkjNKlLJkKLmqJ8j0pNKjPoj%%JoMjj0RqJ8j6jPpN%Ln%Jj1QMJJJj1JjRR
$$ 3 7 4 2 1 6 8 5 8 9 7 9 12 8 0 18 8 1 6 8 7 14 8 7 7 7 8 2 6 5 -5 4 -4 14 -2 -3 4 -3 2 2 5 0 0 1 -10 -2 2 3 4 5 -6 -5 -6 3 12
8184A2jnJ0qRlk0
$$ 12 11 6 16 8 17 14 -6
8191f
##END NTUPLES=NMR FID
##END=
