##TITLE=1H_ES-AC-DMSO
 
 8 sc, 
 13.04.2022
##JCAMPDX= 6.0         $$ Bruker NMR JCAMP-DX V2.0
##DATA TYPE= NMR FID
##DATA CLASS= NTUPLES
##ORIGIN= UXNMR, Bruker Analytische Messtechnik GmbH
##OWNER= root
$$ XWIN-NMR		Version 3.5
$$ Wed Apr 13 10:28:05 2022 Russian Standard Time (UT+4h)  she@DPX200
##.OBSERVE FREQUENCY= 200.13135
##.OBSERVE NUCLEUS= ^1H
##.DELAY= (6, 6)
##.ACQUISITION MODE= SIMULTANEOUS
##.ACQUISITION SCHEME= undefined
##.AVERAGES= 8
##.DIGITISER RES= 18
##SPECTROMETER/DATA SYSTEM= spect
##.PULSE SEQUENCE= zg30
##.SOLVENT NAME= CDCl3
##.SHIFT REFERENCE= (INTERNAL, CDCl3, 0, 15.7039)
##AUDIT TRAIL= $$ (NUMBER, WHEN, WHO, WHERE, WHAT)
$$ ##TITLE= Audit trail, XWIN-NMR		Version 3.5
$$ ##JCAMPDX= 5.01
$$ ##ORIGIN= Bruker BioSpin GmbH
$$ ##OWNER= she
$$ F:/spectra/data/she/nmr/H-F/1/audita.txt
$$ ##AUDIT TRAIL=  $$ (NUMBER, WHEN, WHO, WHERE, WHAT)
(   1,<2022-04-13 10:27:10.85 +0400>,<she>,<DPX200>,
      <created by zg, POWCHK disabled, PULCHK disabled
       configuration hash MD5:
       00 E9 B6 7A A2 85 ED C7 34 08 36 98 17 FE 4E 26
       data hash MD5: 16K
       C7 B0 37 E7 F5 4E C3 39 EE 7A 4E 38 62 6B 07 47>)
$$ ##END=
$$ 
$$ hash MD5
$$ CF 33 07 5A DC 52 66 BC D5 B4 F4 8C 38 B0 3A FA
##$RELAX= 
##$RELAX= 
##$RELAX= 
##$RELAX= 
##$RELAX= 
##$RELAX= 
$$ Bruker specific parameters
$$ --------------------------
##$DU= <F:/spectra>
##$EXPNO= 1
##$NAME= <H-F>
##$PROCNO= 1
##$TYPE= <nmr>
##$USER= <she>
##$AMP= (0..31)
100 100 100 100 100 100 100 100 100 100 100 100 100 100 100 100 100 100 
100 100 100 100 100 100 100 100 100 100 100 100 100 100 
##$AQSEQ= 0
##$AQ_mod= 1
##$AUNM= <au_zg>
##$AUTOPOS= <>
##$BF1= 200.13
##$BF2= 200.13
##$BF3= 200.13
##$BF4= 200.13
##$BF5= 200.13
##$BF6= 200.13
##$BF7= 200.13
##$BF8= 200.13
##$BYTORDA= 1
##$CFDGTYP= 0
##$CFRGTYP= 5
##$CHEMSTR= <none>
##$CNST= (0..31)
1 1 145 1 1 1 1 1 1 1 1 1 1 1 1 1 1 1 1 1 1 1 1 1 1 1 1 1 1 1 1 1 
##$CPDPRG= <>
##$CPDPRG1= <>
##$CPDPRG2= <>
##$CPDPRG3= <>
##$CPDPRG4= <mlev>
##$CPDPRG5= <mlev>
##$CPDPRG6= <mlev>
##$CPDPRG7= <mlev>
##$CPDPRG8= <mlev>
##$CPDPRGB= <>
##$CPDPRGT= <>
##$D= (0..31)
0 1.2 0 0 0 0 0 0 0 0.06 0 0.03 0 0 0 0 0.0002 0 0 0 0 0 0 0 0 0 0 0 0 
0 0 0 
##$DATE= 1649831230
##$DBL= (0..7)
120 120 120 120 120 120 120 120 
##$DBP= (0..7)
150 150 150 150 150 150 150 150 
##$DBP07= 0
##$DBPNAM0= <>
##$DBPNAM1= <>
##$DBPNAM2= <>
##$DBPNAM3= <>
##$DBPNAM4= <>
##$DBPNAM5= <>
##$DBPNAM6= <>
##$DBPNAM7= <>
##$DBPOAL= (0..7)
0.5 0.5 0.5 0.5 0.5 0.5 0.5 0.5 
##$DBPOFFS= (0..7)
0 0 0 0 0 0 0 0 
##$DE= 6
##$DECBNUC= <off>
##$DECIM= 32
##$DECNUC= <off>
##$DECSTAT= 4
##$DIGMOD= 1
##$DIGTYP= 9
##$DL= (0..7)
0 120 120 120 120 120 120 120 
##$DP= (0..7)
150 150 150 150 150 150 150 150 
##$DP07= 0
##$DPNAME0= <>
##$DPNAME1= <>
##$DPNAME2= <>
##$DPNAME3= <>
##$DPNAME4= <>
##$DPNAME5= <>
##$DPNAME6= <>
##$DPNAME7= <>
##$DPOAL= (0..7)
0.5 0.5 0.5 0.5 0.5 0.5 0.5 0.5 
##$DPOFFS= (0..7)
0 0 0 0 0 0 0 0 
##$DQDMODE= 0
##$DR= 18
##$DS= 0
##$DSLIST= <SSSSSSSSSSSSSSS>
$$ [...]
##$SUBNAM2= <"">
##$SUBNAM3= <"">
##$SUBNAM4= <"">
##$SUBNAM5= <"">
##$SUBNAM6= <"">
##$SUBNAM7= <"">
##$SUBNAM8= <"">
##$SUBNAM9= <"">
##$SW= 18.05172834244
##$SWIBOX= (0..15)
0 0 2 0 0 0 0 0 0 0 0 0 0 0 0 0 
##$SW_h= 3612.71676300578
##$TD= 16384
##$TD0= 1
##$TE= 0
##$TE2= 300
##$TE3= 300
##$TEG= 300
##$TL= (0..7)
0 120 120 120 120 120 120 120 
##$TP= (0..7)
150 150 150 150 150 150 150 150 
##$TP07= 0
##$TPNAME0= <>
##$TPNAME1= <>
##$TPNAME2= <>
##$TPNAME3= <>
##$TPNAME4= <>
##$TPNAME5= <>
##$TPNAME6= <>
##$TPNAME7= <>
##$TPOAL= (0..7)
0.5 0.5 0.5 0.5 0.5 0.5 0.5 0.5 
##$TPOFFS= (0..7)
0 0 0 0 0 0 0 0 
##$TUNHIN= 0
##$TUNHOUT= 0
##$TUNXOUT= 0
##$USERA1= <user>
##$USERA2= <user>
##$USERA3= <user>
##$USERA4= <user>
##$USERA5= <user>
##$V9= 5
##$VALIST= <valist>
##$VCLIST= <CCCCCCCCCCCCCCC>
##$VD= 0
##$VDLIST= <DDDDDDDDDDDDDDD>
##$VPLIST= <PPPPPPPPPPPPPPP>
##$VTLIST= <TTTTTTTTTTTTTTT>
##$WBST= 1024
##$WBSW= 4
##$XGAIN= (0..3)
0 0 0 0 
##$XL= 0
##$YL= 0
##$YMAX_a= 286296
##$YMIN_a= -275203
##$ZGOPTNS= <>
##$ZL1= 120
##$ZL2= 120
##$ZL3= 120
##$ZL4= 120
##$ABSF1= 10
##$ABSF2= 0
##$ABSG= 5
##$ABSL= 3
##$ALPHA= 0
##$AQORDER= 0
##$ASSFAC= 0
##$ASSFACI= 0
##$ASSFACX= 0
##$ASSWID= 0
##$AUNMP= <proc_1d>
##$AZFE= 0.1
##$AZFW= 0.1
##$BCFW= 1
##$BC_mod= 2
##$BYTORDP= 1
##$COROFFS= 0
##$CY= 11.3945322036743
##$DATMOD= 1
##$DC= 2
##$DFILT= <>
##$DTYPP= 0
##$F1P= 2.36226072786647
##$F2P= -0.459571619588291
##$FCOR= 0.5
##$FTSIZE= 0
##$FT_mod= 4
##$GAMMA= 1
##$GB= 0.15
##$INTBC= 1
##$INTSCL= 1
##$ISEN= 128
##$LB= 0.24
##$LEV0= 0
##$LPBIN= 0
##$MAXI= 10000
##$MC2= 0
##$MEAN= 0
##$ME_mod= 0
##$MI= 1.114404
##$NCOEF= 0
##$NC_proc= 0
##$NLEV= 6
##$NOISF1= 3.799351
##$NOISF2= 2.8
##$NSP= 1
##$NTH_PI= 0
##$NZP= 0
##$OFFSET= 15.70392
##$PC= 1
##$PHC0= -18482.4
##$PHC1= 26.60078
##$PH_mod= 1
##$PKNL= yes
##$PPARMOD= 0
##$PSCAL= 0
##$PSIGN= 0
##$REVERSE= no
##$SF= 200.130013532006
##$SI= 16384
##$SIGF1= 3
##$SIGF2= 2
##$SINO= 400
##$SIOLD= 16384
##$SREGLST= <1H.CDCl3>
##$SSB= 0
##$STSI= 0
##$STSR= 0
##$SW_p= 3612.71676300578
##$SYMM= 0
##$S_DEV= 0
##$TDeff= 0
##$TDoff= 0
##$TI= <>
##$TILT= no
##$TM1= 0
##$TM2= 0
##$TOPLEV= 0
##$USERP1= <user>
##$USERP2= <user>
##$USERP3= <user>
##$USERP4= <user>
##$USERP5= <user>
##$WDW= 1
##$XDIM= 8192
##$YMAX_p= 0
##$YMIN_p= 0
$$ End of Bruker specific parameters
$$ ---------------------------------
##NTUPLES= NMR FID
##VAR_NAME=  TIME,          FID/REAL,        FID/IMAG
##SYMBOL=    X,             R,               I
##VAR_TYPE=  INDEPENDENT,   DEPENDENT,       DEPENDENT
##VAR_FORM=  AFFN,          ASDF,            ASDF
##VAR_DIM=   8192,          8192,            8192
##UNITS=     SECONDS,       ARBITRARY UNITS, ARBITRARY UNITS
##FACTOR=    0.0002768,     1,               1
##FIRST=     0,             0,               0
##LAST=      2.2672688,     0,               0
##MIN=       0,             -275203,         0
##MAX=       2.2672688,     286296,          0
$$ Real data points
##PAGE= N=1
##DATA TABLE= (X++(R..R)), XYDATA
0 0 0 0 0 0 0 0 0 0 0 0 0 0 0 0 0 0 0 -3 8 -8 8 -8 8 -13 16 -16 16 -24 24 -27 32 -36 40 -44 51 -56 63 -68 76
39 76 -84 95 -107 116 -128 143 -156 173 -190 208 -229 250 -279 308 -342 376 -420 470 -528 598 -681
60 -681 787 -920 1097 -1343 1706 -2280 3309 -5492 11951 -68111 -275203 52798 254799 -71988
74 -71988 -217789 101904 174276 -139663 -136844 182318 108163 -218199 -90921 241502 78150
85 78150 -245906 -64018 234302 39954 -211867 -4354 188466 -41141 -170453 88667
95 88667 161469 -130294 -158848 158521 156811 -171329 -147382 171277 125541 -165353 -90332
106 -90332 160716 46105 -162603 -243 171604 -39125 -183826 66781 192362 -82035
116 -82035 -190540 88857 174690 -93703 -145705 102746 108805 -119175 -71549 141685 40667
127 40667 -165122 -19674 182600 7474 -188414 594 180285 -10850 -160524 28087
137 28087 134803 -53731 -110093 84852 91549 -115583 -80857 139280 75505 -151351 -70208
148 -70208 150929 59198 -141289 -39040 128168 9953 -117511 24082 112923 -56839
158 -56839 -114285 82342 117850 -97253 -118109 102014 110041 -100510 -91488 98225 63954
169 63954 -99992 -32242 107723 2419 -119783 20462 131574 -34360 -137654 40794
179 40794 133888 -44158 -119439 49397 96812 -60177 -71261 76922 48330 -96836 -31914
190 -31914 114915 22699 -126058 -18067 127198 13401 -118508 -4186 103368 -11993
200 -11993 -86878 34360 73762 -59250 -66554 81431 64491 -96394 -64145 101990 60801
211 60801 -99348 -50704 92151 32532 -85181 -8220 82140 -17893 -84217 40672 89523
222 89523 -56333 -94068 63701 93373 -64727 -84558 63371 67430 -63968 -44815 69210
233 69210 21341 -79098 -1713 90895 -11215 -100319 17443 103287 -19688 -97715 22105
244 22105 84398 -28396 -66662 40244 49033 -56563 -35493 73856 27716 -87711 -24654
255 -24654 94511 22955 -93019 -18623 84719 8677 -73335 7446 63047 -27676 -56936
266 -56936 47939 55530 -64009 -56949 72891 57457 -74293 -53382 70377 42566 -64979
277 -64979 -25439 61839 4839 -63030 15054 68122 -30354 -74386 39035 77987 -41612 -75652
289 -75652 40863 66054 -40559 -50465 43771 32188 -51578 -15314 62582 3080 -73504 3446
301 3446 80495 -5630 -80895 6631 74116 -9983 -62141 18030 48477 -30885 -36881 46304
313 46304 29695 -60698 -27094 70443 26893 -73471 -25785 69984 20565 -62425 -9754 54299
325 54299 -5853 -48785 23384 47379 -39089 -49294 49755 51873 -54038 -51738 52866 46311
337 46311 -49026 -34909 45885 19081 -46036 -2143 50075 -12368 -56515 21827 62278 -25776
349 -25776 -64206 25768 60218 -24914 -50395 26290 36815 -31753 -22857 41018 11683 -51909
361 -51909 -5091 61100 2773 -65607 -2531 63980 1278 -56889 3596 46806 -13100 -37017
373 -37017 26122 30184 -39909 -27357 51064 27483 -57048 -28027 57070 26044 -52455 -19509
385 -19509 45954 8198 -40674 6095 38672 -20371 -40225 31473 43625 -37482 -46098 38314
397 38314 44859 -35860 -38500 32998 27381 -32449 -13763 35544 737 -41728 8938 48765 -14046
410 -14046 -53691 15158 54029 -14541 -48934 14989 39408 -18660 -28035 26144 17754 -36160
422 -36160 -10858 46052 7884 -52935 -7653 54756 7642 -51319 -5263 44114 -1090 -35909
434 -35909 11250 29382 -23424 -26241 34708 26293 -42462 -27856 45149 28235 -43193 -25207
446 -25207 38484 17692 -33815 -6498 31472 -6126 -32457 17265 35976 -24663 -39882 27452
458 27452 41488 -26592 -38892 24311 31649 -23252 -21049 25199 9637 -30452 -87 37569
470 37569 -5827 -44081 7881 47417 -7556 -46055 7221 40106 -9219 -31355 14718 22340
482 22340 -23293 -15489 32986 11997 -41151 -11499 45475 12120 -44999 -11500 40421 7740
494 7740 -33813 -231 27753 -9979 -24254 20618 23873 -29133 -25697 33666 27579 -33842 -27161
507 -27161 30845 22975 -26962 -14958 24555 4567 -25059 5786 28414 -13795 -33109 18046
519 18046 36742 -18733 -37236 17387 33443 -16290 -25876 17375 16329 -21555 -7287 28063
531 28063 801 -35028 2295 40043 -2608 -41281 1967 38178 -2558 -31706 5944 23963
543 23963 -12411 -17308 20797 13376 -28944 -12460 34627 13432 -36415 -14251 34227 12868
555 12868 -29479 -8169 24299 340 -20822 9000 20145 -17660 -21967 23554 24685 -25730
567 -25730 -26205 24584 24721 -21796 -19558 19484 11425 -19358 -2213 21939 -5844 -26414 11055
580 11055 30926 -12923 -33364 12306 32289 -11043 -27477 11117 20061 -13766 -12111 19003
592 19003 5686 -25553 -2063 31375 1256 -34537 -2030 33947 2442 -29877 -800 23792
604 23792 -3737 -17799 10632 13683 -18336 -12294 24800 13102 -28311 -14616 28250 14873
616 14873 -25310 -12442 21164 6934 -17800 781 16676 -8853 -18065 15390 21016 -18967
628 -18967 -23705 19383 24338 -17664 -21740 15598 15977 -14927 -8323 16616 677 -20500 5098
641 5098 25176 -8023 -28817 8275 29733 -7194 -27252 6510 21835 -7770 -15081 11487
653 11487 8877 -17037 -4870 22819 3498 -27042 -4167 28310 5310 -26355 -5192 22040
665 22040 2588 -17039 2598 13136 -9367 -11498 15984 12157 -20727 -14048 22531 15478 -21472
678 -21472 -14850 18632 11346 -15743 -5287 14340 -1982 -15141 8625 17746 -13152 -20835 14841
691 14841 22680 -14118 -21961 12314 18243 -11098 -12280 11714 5551 -14514 146 18725 -3569
704 -3569 -22820 4458 25168 -3582 -24713 2435 21405 -2582 -16241 4904 10807 -9384
716 -9384 -6747 14870 4897 -19801 -5160 22612 6430 -22590 -7158 20026 5989 -16124 -2387
729 -2387 12500 -3224 -10507 9448 10586 -14714 -12288 17693 14243 -18007 -14968 16223 13316
742 13316 -13717 -9133 11969 3209 -12048 2949 13984 -7812 -17006 10380 19613 -10551 -20416
755 -20416 9214 18613 -7769 -14367 7559 8784 -9323 -3391 12780 -427 -16835 1985 20016
768 20016 -1582 -21098 336 19583 303 -15981 771 11459 -3985 -7568 8684 5388
780 5388 -13668 -5230 17420 6425 -18930 -7715 17993 7728 -15315 -5595 12201 1329 -9988
793 -9988 4183 9526 -9524 -10739 13329 12741 -14817 -14192 14076 13871 -12050 -11274 10074 6700
807 6700 -9378 -1299 10413 -3537 -12919 6617 15724 -7527 -17572 6629 17338 -5120 -14858
820 -14858 4296 10657 -5127 -6012 7772 2206 -11600 -188 15327 18 -17698 -1040 17809
833 17809 2010 -15771 -1733 12303 -442 -8729 4369 6230 -9088 -5447 13293 6192 -15818
846 -15818 -7554 16094 8293 -14409 -7396 11763 4489 -9421 -48 8385 -4840 -9036 8882
859 8882 10850 -11104 -12791 11232 13611 -9851 -12502 8006 9387 -6936 -4973 7366 424 -9378
873 -9378 3040 12215 -4697 -14715 4548 15736 -3407 -14710 2396 11795 -2563 -7862 4414
886 4414 4163 -7670 -1724 11436 974 -14470 -1608 15788 2700 -15044 -3123 12623 1982
899 1982 -9565 894 6963 -4998 -5758 9197 6027 -12377 -7293 13656 8455 -13025 -8518 11021
913 11021 6816 -8774 -3449 7336 -834 -7358 4887 8721 -7663 -10690 8586 12167 -7881
926 -7881 -12231 6303 10437 -5015 -7126 4871 3135 -6296 337 8869 -2490 -11700 3009 13665
940 13665 -2301 -13966 1289 12351 -1023 -9384 2149 5990 -4792 -3322 8263 1972 -11616
953 -11616 -2076 13693 2961 -13980 -3734 12464 3409 -9894 -1554 7269 -1656 -5595 5440
966 5440 5331 -8750 -6283 10660 7660 -10844 -8492 9526 7939 -7601 -5771 6048 2349 -5658
980 -5658 1379 6642 -4472 -8583 6130 10508 -6241 -11497 5258 10847 -4087 -8573 3619 5212
994 5212 -4506 -1797 6591 -782 -9328 1951 11689 -1782 -12803 888 12203 -234 -10087 610
1008 610 7157 -2355 -4458 5200 2756 -8383 -2410 10919 3098 -12027 -4098 11461 4453 -9626
1022 -9626 -3539 7298 1209 -5501 2056 4807 -5380 -5396 7825 6712 -8830 -7942 8303 8177 -6857
1037 -6857 -7006 5323 4423 -4592 -1142 5078 -2003 -6671 4144 8696 -4917 -10268 4444 10574
1051 10574 -3435 -9326 2749 6808 -3072 -3753 4629 1074 -7057 542 9593 -886 -11327 286
1065 286 11602 501 -10355 -660 8017 -360 -5445 2519 3462 -5343 -2668 7974 3002 -9649
1079 -9649 -4001 9853 4806 -8739 -4683 6856 3257 -5107 -704 4166 -2336 -4408 5018 5600
1093 5600 -6663 -7085 6953 7987 -6148 -7663 4934 5954 -4072 -3196 4191 162 -5384 2322
1107 2322 7240 -3699 -9037 3829 9947 -3107 -9503 2275 7708 -2075 -5112 2932 2470 -4786
1121 -4786 -606 7076 -115 -9061 -241 9993 1090 -9583 -1699 7982 1397 -5839 67 3914
1135 3914 -2459 -2847 5091 2870 -7214 -3704 8217 4686 -7938 -5076 6685 4324 -5121 -2417
1149 -2417 4047 -290 -3891 3025 4693 -5064 -6055 5970 7247 -5699 -7588 4698 6655 -3722
1163 -3722 -4617 3416 1956 -4091 539 5593 -2216 -7415 2791 8766 -2397 -9073 1591 8099
1177 8099 -1079 -6104 1411 3751 -2756 -1750 4767 645 -6843 -597 8284 1273 -8606 -2033 7699
1192 7699 2216 -6015 -1396 4199 -458 -2979 2851 2630 -5134 -3227 6640 4259 -7041 -5052 6371
1207 6371 4954 -5169 -3744 4056 1575 -3656 992 4094 -3272 -5244 4641 6548 -4922 -7318
1221 -7318 4306 7060 -3377 -5634 2779 3445 -2984 -1059 4043 -828 -5607 1741 7155 -1659 -7972
1236 -7972 949 7727 -219 -6425 66 4528 -872 -2694 2544 1420 -4585 -1082 6361 1528 -7353
1251 -7353 -2310 7215 2781 -6170 -2430 4672 1073 -3394 1052 2788 -3374 -2993 5233 3821 -6157
1266 -6157 -4706 6027 5055 -5112 -4444 3992 2889 -3291 -706 3334 -1500 -4131 3074 5375 -3717
1281 -3717 -6468 3428 6808 -2636 -6143 1895 4581 -1757 -2577 2483 675 -3874 530 5493 -842
1296 -842 -6751 430 7158 262 -6528 -604 5107 215 -3426 1070 2022 -2931 -1327 4804 1458
1311 1458 -6153 -2116 6591 2770 -6071 -2857 4906 2070 -3681 -452 2883 -1653 -2826 3606 3433
1326 3433 -4895 -4372 5248 5039 -4751 -4986 3799 3989 -2983 -2253 2718 196 -3238 1555 4271 -2575
1342 -2575 -5451 2679 6191 -2140 -6095 1388 5100 -1003 -3486 1337 1711 -2449 -351 4000 -269
1357 -269 -5478 112 6392 464 -6391 -968 5529 903 -4155 -18 2796 -1583 -1893 3457 1681
1372 1681 -5082 -2129 5957 2760 -5930 -3106 5108 2764 -3972 -1614 3015 -144 -2651 2048 2952
1387 2952 -3512 -3745 4198 4601 -4024 -4970 3307 4572 -2458 -3370 2021 1673 -2275 76 3183 -1332
1403 -1332 -4413 1823 5470 -1617 -5938 1052 5500 -635 -4311 722 2750 -1561 -1281 2934 341
1418 341 -4455 -132 5634 495 -6084 -1015 5633 1234 -4559 -798 3258 -346 -2224 1975 1791
1433 1791 -3612 -2004 4749 2636 -5156 -3229 4726 3322 -3830 -2686 2926 1375 -2406 350 2515
1448 2515 -1956 -3181 2973 4069 -3244 -4742 2842 4772 -2150 -4031 1610 2674 -1617 -1065 2266
1463 2266 -351 -3388 1148 4529 -1241 -5324 835 5383 -347 -4677 191 3455 -667 -2072 1770
1478 1770 1030 -3234 -594 4551 729 -5362 -1226 5397 1610 -4699 -1523 3614 758 -2549 589
1493 589 1917 -2139 -1885 3438 2359 -4126 -3025 4083 3413 -3460 -3224 2614 2349 -1998 -950 1892
1509 1892 -578 -2422 1782 3293 -2380 -4152 2316 4603 -1845 -4337 1349 3403 -1203 -2001 1637
1524 1637 589 -2594 447 3755 -860 -4718 710 5146 -286 -4825 -31 3866 -100 -2657 818
1539 818 1515 -2025 -879 3313 824 -4271 -1229 4631 1753 -4326 -1994 3495 1643 -2571 -706
1554 -706 1875 -681 -1710 2068 2080 -3060 -2720 3417 3321 -3169 -3434 2557 2932 -1961 -1822 1705 386
1571 386 -1987 947 2716 -1816 -3565 2064 4195 -1800 -4302 1296 3706 -977 -2638 1088 1322
1586 1322 -1767 -238 2792 -364 -3850 387 4518 -30 -4608 -398 4047 496 -3087 -95 2011
1601 2011 -875 -1245 2102 997 -3225 -1220 3884 1685 -3956 -2090 3442 2027 -2657 -1410 1916
1616 1916 287 -1557 1023 1714 -2163 -2292 2797 2936 -2850 -3341 2429 3186 -1881 -2474 1521 1268 -1605
1633 -1605 23 2155 -1059 -2990 1557 3745 -1541 -4123 1172 3910 -773 -3131 683 1995 -1069
1648 -1069 -871 1890 115 -2894 120 3727 118 -4072 -574 3854 884 -3155 -787 2246 146
1663 146 -1447 898 1071 -2059 -1186 2967 1618 -3393 -2111 3204 2283 -2689 -1976 2019 1100 -1589
1679 -1589 117 1578 -1344 -1985 2201 2588 -2553 -3091 2377 3227 -1890 -2795 1429 1876 -1276 -698 1575
1696 1575 -340 -2254 1003 3042 -1144 -3624 872 3759 -437 -3350 167 2501 -326 -1515 935
1711 935 703 -1874 -315 2829 375 -3503 -737 3621 1078 -3252 -1163 2504 732 -1731 127
1726 127 1199 -1235 -1116 2254 1397 -2890 -1873 3021 2225 -2676 -2187 2101 1641 -1598 -674 1430 -454
1743 -454 -1685 1405 2235 -1946 -2860 1984 3213 -1661 -3123 1207 2512 -959 -1542 1095 490 -1621
1759 -1621 293 2393 -658 -3117 559 3480 -213 -3369 -131 2787 161 -1937 232 1118 -1012
1774 -1012 -607 1980 514 -2790 -775 3207 1173 -3135 -1392 2650 1236 -2000 -582 1445 -404
1789 -404 -1220 1450 1381 -2292 -1809 2679 2224 -2580 -2382 2139 2075 -1645 -1365 1317 360 -1382 603 1787
1807 1787 -1291 -2385 1504 2877 -1319 -3051 908 2756 -581 -2049 547 1162 -911 -369 1615
1822 1615 -125 -2416 205 3032 37 -3234 -346 2960 488 -2326 -240 1563 -380 -953 1288
1837 1288 675 -2173 -774 2772 1086 -2953 -1387 2663 1410 -2096 -1041 1510 278 -1166 669
1852 669 1187 -1516 -1521 2045 2010 -2149 -2367 1871 2367 -1434 -1925 1083 1149 -1023 -241 1345 -534 -1917
1870 -1917 953 2513 -980 -2870 717 2850 -395 -2382 257 1627 -479 -814 1036 211 -1772
1885 -1772 30 2479 58 -2876 -381 2844 605 -2433 -577 1787 156 -1177 574 819 -1453
1900 -1453 -800 2177 1055 -2564 -1401 2538 1591 -2149 -1438 1629 908 -1223 -99 1113 -786 -1336
1916 -1336 1434 1754 -1740 -2177 1627 2369 -1278 -2186 894 1607 -722 -842 877 51 -1352 479 1968
1933 1968 -671 -2508 530 2710 -254 -2540 67 1986 -165 -1277 576 629 -1274 -232 2003
1948 2003 190 -2558 -385 2760 660 -2545 -744 2011 532 -1410 23 960 -787 -815 1523 977
1964 977 -2034 -1315 2166 1617 -1961 -1699 1525 1411 -1142 -788 939 6 -1079 719 1473 -1195 -1972
1981 -1972 1295 2305 -1122 -2342 824 1973 -621 -1317 673 551 -1032 96 1605 -443 -2160
1996 -2160 484 2523 -268 -2518 21 2163 39 -1561 183 923 -707 -482 1397 328 -2016
2011 -2016 -469 2381 751 -2382 -974 2063 930 -1574 -566 1123 -79 -877 843 949 -1464
2026 -1464 -1224 1816 1569 -1797 -1753 1516 1648 -1135 -1197 877 515 -891 218 1168 -773 -1602 1031
2043 1031 2030 -978 -2246 724 2100 -489 -1636 428 982 -676 -344 1157 -106 -1751 253 2205
2059 2205 -160 -2431 -77 2278 213 -1837 -123 1240 -243 -745 856 472 -1481 -492 1946 729
2075 729 -2118 -993 1951 1106 -1563 -922 1140 453 -846 202 820 -860 -1064 1330 1408 -1504 -1707
2092 -1707 1371 1779 -1100 -1533 843 973 -779 -288 950 -354 -1339 750 1776 -872 -2094 714
2108 714 2101 -488 -1811 331 1261 -418 -655 756 164 -1267 70 1772 -42 -2106 -177 2147
2124 2147 410 -1897 -469 1436 244 -977 236 664 -856 -610 1426 775 -1778 -1049 1818 1210
2140 1210 -1613 -1171 1227 816 -930 -254 783 -437 -914 968 1203 -1285 -1528 1283 1715 -1066 -1636
2157 -1636 797 1266 -636 -698 690 95 -1009 371 1445 -557 -1837 515 2046 -317 -1964 130
2173 130 1594 -120 -1063 352 566 -821 -241 1350 153 -1782 -297 1968 498 -1889 -647 1539
2189 1539 536 -1116 -194 757 -340 -617 928 700 -1372 -943 1566 1187 -1482 -1284 1236 1118 -942
2206 -942 -684 779 89 -820 497 1066 -906 -1404 1062 1681 -982 -1747 756 1523 -560 -1058 509
2223 509 496 -724 -1 1091 -310 -1509 344 1807 -200 -1876 -19 1671 127 -1274 -18 822
2239 822 -333 -480 821 333 -1333 -416 1672 606 -1762 -784 1599 783 -1271 -540 924 75 -705
2256 -705 501 694 -1022 -875 1342 1106 -1407 -1273 1224 1222 -949 -941 717 445 -672 83 822 -546
2274 -546 -1156 764 1476 -765 -1674 585 1641 -383 -1355 303 894 -419 -411 749 53 -1179 103
2291 103 1577 -58 -1792 -98 1740 248 -1453 -211 1054 -46 -659 472 422 -959 -406 1362
2307 1362 536 -1563 -732 1514 834 -1271 -740 943 411 -710 67 651 -596 -787 982 1029 -1171
2324 -1171 -1264 1126 1355 -937 -1216 708 845 -611 -351 705 -132 -961 472 1284 -559 -1557 482
2341 482 1626 -301 -1477 167 1108 -190 -683 392 297 -787 -83 1224 58 -1535 -202 1621
2357 1621 343 -1506 -405 1202 248 -840 95 581 -571 -491 1036 559 -1355 -738 1444 879 -1304
2374 -1304 -880 1032 659 -775 -265 628 -214 -671 645 890 -907 -1131 944 1311 -795 -1320 600
2391 600 1100 -453 -711 469 259 -695 112 1007 -311 -1344 324 1541 -209 -1538 62 1316 -66
2408 -66 -931 214 535 -546 -246 946 128 -1315 -183 1521 324 -1481 -437 1258 392 -942 -163
2425 -163 657 -219 -513 650 532 -1022 -692 1209 882 -1186 -990 1003 901 -792 -620 622 182 -635
2443 -635 255 800 -612 -1048 766 1273 -732 -1359 584 1237 -444 -931 397 527 -497 -128 779 -147
2461 -147 -1105 231 1362 -163 -1457 27 1342 63 -1077 0 728 -259 -431 619 261 -1019
2477 -1019 -268 1301 389 -1417 -517 1311 539 -1071 -389 788 71 -589 330 541 -735 -651 1002 809
2495 809 -1075 -967 988 989 -772 -807 607 477 -526 -60 642 -286 -865 534 1130 -569 -1307 497
2513 497 1314 -350 -1127 288 779 -357 -395 575 81 -899 100 1195 -120 -1385 11 1383 88
2530 88 -1182 -72 866 -63 -568 354 351 -706 -303 1033 390 -1206 -537 1211 645 -1043 -610 826
2548 826 403 -630 -56 555 -347 -609 678 797 -862 -987 873 1062 -759 -983 599 710 -504 -355
2566 -355 531 -37 -721 324 943 -470 -1172 425 1252 -316 -1162 211 914 -201 -586 332 266 -614
2584 -614 -74 929 21 -1174 -102 1275 211 -1217 -261 1014 188 -740 36 509 -395 -410 751 440
2602 440 -992 -568 1096 679 -1032 -704 844 564 -642 -300 502 -74 -542 397 650 -656 -865 716
2620 716 1013 -658 -1038 514 897 -414 -613 411 266 -540 37 769 -238 -1047 279 1205 -222 -1211
2638 -1211 128 1052 -101 -777 162 470 -400 -234 684 117 -976 -152 1123 235 -1164 -347 1018 338
2656 338 -803 -206 578 -78 -456 401 453 -718 -563 883 692 -932 -797 824 744 -685 -540 540
2674 540 218 -517 136 608 -437 -787 599 955 -611 -1042 510 966 -395 -767 321 449 -394 -158
2692 -158 567 -70 -832 154 1022 -131 -1146 21 1082 30 -924 -24 652 -155 -432 413 284 -737
2710 -737 -269 979 330 -1091 -437 1043 464 -895 -371 684 148 -523 153 470 -473 -518 715 649 -803
2729 -803 -765 770 797 -632 -692 494 443 -451 -148 506 -163 -668 351 856 -434 -1027 388 1057 -307
2748 -307 -947 239 701 -280 -415 415 154 -660 -18 902 -21 -1061 -54 1087 124 -969 -129 756
2766 756 39 -539 165 371 -446 -319 707 374 -894 -475 942 553 -866 -541 701 373 -557 -128
2784 -128 483 -192 -529 466 626 -647 -776 686 851 -618 -805 510 622 -417 -362 424 75 -541 158
2803 158 731 -272 -903 287 996 -188 -975 117 808 -110 -580 196 351 -410 -186 663 123 -881
2821 -881 -151 1003 215 -999 -264 856 191 -665 -22 494 -232 -393 513 386 -733 -470 846 565
2839 565 -822 -587 713 506 -549 -312 448 46 -440 226 549 -417 -697 515 823 -511 -868 413
2857 413 784 -342 -586 330 327 -426 -70 605 -98 -808 169 964 -144 -1004 73 911 -46 -713 92 484
2877 484 -254 -278 471 183 -712 -175 879 247 -914 -323 852 324 -690 -224 544 17 -428 250 427
2896 427 -497 -480 684 579 -729 -657 664 616 -559 -495 469 247 -442 12 499 -253 -637 382 757 -417
2916 -417 -848 367 828 -293 -704 239 478 -294 -257 418 60 -620 11 802 -10 -904 -41 915 91 -792
2936 -792 -54 600 -74 -422 263 285 -524 -247 722 288 -837 -351 821 367 -732 -328 570 161 -447
2955 -447 53 395 -305 -441 489 527 -583 -620 581 665 -499 -618 399 448 -354 -211 403 -5 -526 192
2975 192 690 -269 -813 267 856 -212 -786 176 608 -200 -397 303 206 -476 -65 654 27 -803 -60 844
2995 844 105 -785 -132 628 60 -475 73 344 -292 -296 508 316 -660 -396 711 472 -681 -453 586 361
3015 361 -480 -182 423 -69 -434 286 509 -445 -618 485 677 -461 -667 387 554 -326 -369 312 137
3034 137 -407 39 552 -152 -699 173 784 -139 -794 76 689 -73 -534 128 352 -289 -220 484 155 -669
3054 -669 -152 780 204 -778 -217 693 190 -550 -75 420 -116 -345 329 336 -522 -398 593 461 -624 -507
3074 -507 536 452 -442 -344 368 138 -376 60 436 -242 -573 319 664 -350 -729 282 667 -262 -528 252
3094 252 339 -330 -153 446 8 -601 62 712 -63 -772 5 716 14 -582 23 413 -142 -289 287 205 -484
3115 -484 -198 621 236 -690 -306 651 294 -557 -267 451 100 -393 82 366 -304 -424 441 500 -514 -563
3135 -563 488 547 -432 -466 360 297 -339 -103 367 -90 -473 202 580 -253 -672 225 671 -169 -589 141 450
3156 450 -174 -281 279 140 -431 -69 579 43 -695 -94 703 112 -656 -120 513 19 -385 126 286 -319
3176 -319 -266 485 286 -586 -343 596 370 -540 -348 446 226 -378 -88 322 -110 -360 254 437 -353 -548
3196 -548 356 574 -329 -556 268 438 -256 -277 289 96 -397 50 524 -124 -634 132 669 -103 -653 72
3216 72 522 -89 -390 158 240 -295 -155 441 114 -567 -139 612 194 -600 -209 530 158 -414 -54 332 -126
3237 -126 -308 275 317 -437 -389 480 432 -508 -453 428 370 -386 -252 333 47 -354 110 406 -251 -505 286 551
3259 551 -280 -578 223 484 -197 -380 198 217 -284 -86 389 -8 -515 13 601 -1 -633 -34 579 27
3279 27 -475 33 354 -143 -262 300 200 -455 -224 540 237 -580 -261 533 237 -452 -163 360 19 -312
3299 -312 144 309 -298 -360 380 413 -399 -452 362 449 -307 -364 258 227 -271 -59 344 -74 -441 162 524 -178
3321 -178 -601 148 558 -134 -473 137 339 -203 -206 298 87 -426 -40 523 36 -591 -85 560 92 -493 -68
3342 -68 391 -5 -302 133 221 -288 -242 412 284 -489 -318 467 322 -427 -286 360 167 -321 -16 297 -151
3363 -151 -347 262 409 -335 -468 316 468 -288 -422 239 301 -228 -157 259 29 -345 54 439 -106 -522 87
3384 87 540 -58 -510 39 399 -68 -297 152 194 -292 -141 418 136 -496 -147 540 171 -507 -161 416 95
3405 95 -344 23 267 -159 -237 305 252 -383 -304 419 331 -392 -336 325 260 -278 -153 259 9 -304 111 371
3427 371 -190 -446 210 490 -200 -488 157 412 -162 -290 197 161 -283 -58 382 -6 -469 27 515 -17
3447 -17 -524 -6 448 -2 -347 59 247 -170 -181 280 153 -392 -189 429 211 -450 -245 405 192 -347 -131
3468 -131 279 -8 -268 141 299 -259 -332 318 380 -332 -398 295 344 -263 -258 243 123 -261 -1 317 -91 -389
3490 -389 133 438 -139 -459 116 436 -79 -350 101 248 -160 -151 245 83 -368 -73 444 77 -480 -106 467
3511 467 90 -394 -48 323 -45 -254 154 208 -280 -217 374 242 -384 -262 367 256 -316 -201 264 106 -226
3532 -226 12 251 -126 -300 204 346 -224 -396 230 400 -187 -341 166 238 -196 -142 248 42 -345 30 401
3553 401 -52 -463 48 462 -31 -403 50 314 -76 -199 171 151 -261 -103 347 107 -410 -125 414 146
3573 146 -371 -130 305 76 -249 15 219 -127 -225 235 263 -301 -298 317 322 -294 -284 251 210 -238 -91 239 -19
3596 -19 -289 113 333 -153 -388 176 389 -141 -371 118 302 -116 -214 160 123 -224 -44 310 28 -379 -23
3617 -23 411 60 -403 -47 355 14 -284 45 211 -156 -182 244 168 -331 -194 376 212 -370 -203 318 165
3638 165 -271 -70 227 -40 -224 132 246 -207 -288 222 312 -231 -334 197 282 -171 -197 186 108 -227 -11 280
3660 280 -42 -352 68 394 -74 -402 72 364 -69 -300 99 195 -162 -132 243 74 -330 -78 368 75 -394
3681 -394 -96 339 78 -305 -36 235 -44 -196 134 188 -233 -211 281 243 -302 -255 291 243 -246 -183 233 82
3703 82 -223 26 257 -110 -291 169 333 -199 -342 187 337 -166 -265 156 169 -176 -95 225 8 -299 16
3724 16 355 -22 -368 5 374 3 -318 15 255 -70 -190 150 148 -246 -134 321 138 -363 -145 356 145
3745 145 -319 -107 276 16 -233 52 206 -155 -220 230 234 -260 -261 260 258 -245 -233 195 149 -200 -71 212 -21
3768 -21 -262 65 304 -117 -356 114 343 -111 -333 106 264 -133 -178 171 102 -254 -50 325 22 -362 -31
3789 -31 364 23 -343 -29 280 -13 -223 86 163 -175 -151 242 154 -298 -171 306 180 -292 -182 257 125
3810 125 -231 -60 220 -54 -227 128 265 -195 -283 220 294 -212 -282 183 213 -184 -150 185 35 -224 24 274
3832 274 -75 -319 73 324 -71 -342 62 275 -73 -230 95 157 -173 -111 228 83 -301 -91 335 93 -353
3853 -353 -75 310 61 -253 -8 209 -84 -195 168 170 -236 -201 273 205 -278 -201 260 178 -224 -119 188 36
3875 36 -205 44 235 -109 -257 135 282 -161 -303 131 264 -139 -220 144 141 -193 -79 227 20 -293 0
3896 0 329 -16 -349 14 316 -25 -261 47 212 -114 -147 165 108 -235 -110 268 112 -301 -121 280 106
3917 106 -245 -87 214 13 -201 64 195 -134 -224 188 244 -212 -253 218 230 -200 -204 187 108 -201 -47 206
3939 206 -40 -246 91 280 -100 -299 106 282 -91 -248 102 197 -113 -131 163 81 -220 -41 271 53 -299
3960 -299 -39 309 49 -282 -20 238 -16 -187 81 160 -174 -169 231 157 -258 -161 282 148 -261 -127 227 65
3982 65 -210 -6 190 -75 -218 125 221 -157 -237 167 248 -159 -224 138 173 -149 -113 168 45 -218 8 257
4004 257 -35 -299 49 315 -50 -293 58 248 -77 -196 125 128 -185 -97 230 81 -267 -78 281 68 -277
4025 -277 -65 239 48 -208 11 176 -86 -156 149 164 -190 -198 215 194 -225 -193 208 149 -194 -105 196 19 -204
4048 -204 41 241 -83 -271 111 272 -122 -267 118 226 -132 -170 133 103 -175 -52 216 12 -253 -10 285
4069 285 0 -276 -1 269 -1 -229 38 180 -90 -160 157 130 -222 -141 243 137 -266 -122 255 101 -234
4090 -234 -48 198 -9 -193 84 195 -135 -207 175 203 -197 -215 174 203 -160 -156 161 89 -177 -35 193 -2
4112 -2 -241 52 258 -64 -280 68 265 -78 -224 92 162 -125 -115 181 86 -236 -56 256 44 -291 -42 270
4134 270 23 -254 -10 210 -43 -179 100 156 -161 -155 206 151 -225 -156 221 153 -215 -120 193 62 -203 -7
4156 -7 194 -61 -218 102 241 -143 -243 151 240 -145 -199 153 152 -167 -83 198 37 -222 15 265 -28 -265
4178 -265 33 273 -43 -243 45 215 -69 -162 118 128 -178 -117 215 103 -258 -103 267 83 -263 -67 227
4199 227 15 -214 39 189 -107 -182 153 168 -194 -183 213 173 -216 -145 184 102 -191 -45 187 2 -204 60
4221 60 227 -76 -252 96 240 -118 -235 103 194 -121 -159 145 99 -199 -57 220 18 -269 -14 272 -8
4242 -8 -271 16 227 -59 -197 88 161 -130 -135 177 115 -224 -118 226 107 -237 -102 217 63 -200 -26 183
4264 183 -28 -189 69 184 -139 -207 152 205 -184 -206 161 158 -180 -126 175 45 -210 -16 212 -49 -252 64
4286 64 248 -80 -252 81 213 -99 -190 103 132 -149 -96 179 47 -228 -60 232 41 -261 -32 240 8
4307 8 -221 15 188 -77 -176 106 150 -177 -163 192 133 -229 -137 206 99 -206 -82 186 4 -190 42 180
4329 180 -92 -201 110 198 -145 -216 139 194 -139 -164 139 111 -163 -71 182 21 -226 1 226 -24 -263 27
4351 27 233 -65 -214 60 173 -115 -144 145 94 -187 -90 227 68 -246 -81 227 42 -227 -25 184 -27
4372 -27 -176 50 153 -121 -158 141 162 -171 -157 174 153 -178 -122 168 74 -178 -24 183 -35 -196 67 217
4394 217 -107 -225 98 207 -117 -194 108 146 -141 -111 154 55 -188 -30 203 10 -223 -3 223 -9 -207
4415 -207 10 179 -48 -161 90 134 -140 -118 177 105 -203 -105 217 93 -219 -77 192 33 -179 9 168
4436 168 -77 -162 102 169 -133 -170 148 161 -153 -157 139 112 -147 -69 160 20 -168 2 193 -37 -209 56 220
4459 220 -67 -207 74 185 -90 -154 123 105 -145 -80 177 48 -218 -45 220 17 -233 -6 193 -17 -175
4480 -175 49 154 -81 -135 126 111 -164 -134 172 118 -181 -117 173 85 -172 -62 168 5 -164 50 174 -89
4502 -89 -183 102 193 -118 -178 137 158 -133 -119 142 71 -160 -25 173 4 -200 25 211 -40 -210 31 185
4524 185 -61 -165 66 131 -99 -109 138 82 -168 -80 187 60 -207 -58 194 37 -190 -11 162 -34 -157
4545 -157 74 142 -122 -144 151 146 -165 -131 164 111 -161 -75 152 29 -161 -3 160 -42 -179 71 184 -91
4567 -91 -179 93 176 -101 -154 103 114 -127 -78 143 45 -190 -31 200 5 -209 5 207 -19 -183 45 157
4589 157 -80 -127 104 108 -149 -92 167 82 -188 -76 192 68 -186 -37 162 4 -148 23 143 -75 -156 90
4611 90 154 -135 -155 136 145 -146 -127 141 80 -161 -47 154 0 -172 39 194 -65 -195 76 194 -86 -176 88
4634 88 126 -120 -109 122 70 -154 -55 166 23 -196 -29 195 1 -191 12 174 -26 -155 65 139 -99 -117
4656 -117 138 105 -166 -106 176 88 -184 -67 168 37 -168 4 144 -43 -151 82 147 -103 -162 122 145 -125
4678 -125 -145 125 113 -132 -66 141 36 -156 -17 180 -18 -186 33 190 -48 -199 57 171 -82 -141 112
4699 112 101 -141 -85 160 55 -185 -38 185 26 -181 -17 172 -19 -155 29 135 -72 -120 114 109 -135 -112
4721 -112 142 110 -152 -91 169 65 -148 -49 153 6 -163 32 156 -74 -172 90 155 -113 -170 104 138 -120
4743 -120 -99 144 70 -156 -48 148 -5 -177 10 186 -32 -176 39 160 -54 -140 72 114 -91 -96 124 80
4765 80 -160 -69 167 55 -168 -41 166 20 -170 13 160 -41 -145 75 129 -108 -131 132 117 -148 -115 146
4787 146 83 -142 -72 125 19 -141 0 143 -26 -151 61 148 -73 -175 74 144 -102 -137 99 98 -126 -69 146
4810 146 36 -165 -23 171 -6 -174 14 172 -35 -159 43 134 -80 -108 100 89 -131 -77 147 43 -169
4831 -169 -66 155 40 -154 -24 145 -9 -139 31 133 -74 -127 105 129 -132 -126 129 111 -126 -97 131 52
4853 52 -136 -34 137 -10 -153 31 160 -64 -164 68 155 -79 -137 80 109 -102 -88 119 42 -123 -29 141
4875 141 15 -172 -21 153 -5 -153 14 143 -41 -146 62 103 -104 -92 116 87 -150 -76 157 65 -156 -45
4897 -45 155 20 -139 7 133 -53 -130 61 108 -87 -121 96 118 -109 -123 99 85 -115 -56 122 31 -125 -1
4920 -1 154 -19 -146 34 157 -39 -157 64 131 -83 -111 87 73 -111 -61 136 31 -142 -21 146 11 -148
4942 -148 -5 143 -19 -131 40 119 -62 -100 89 88 -111 -93 116 91 -143 -79 126 57 -131 -35 127 -13 -127
4965 -127 45 133 -57 -135 80 130 -78 -117 87 106 -99 -85 107 42 -124 -31 129 -8 -143 12 149 -26 -158
4988 -158 34 136 -38 -112 65 96 -80 -89 97 57 -136 -53 144 38 -147 -29 152 14 -147 13 133 -39
5010 -39 -113 70 113 -89 -103 113 101 -122 -94 137 70 -122 -57 115 31 -114 2 119 -29 -127 49 131 -61 -141
5034 -141 71 126 -87 -106 91 77 -105 -52 113 39 -140 -11 151 -8 -153 11 143 -28 -136 53 102 -66
5056 -66 -86 87 75 -107 -58 126 50 -130 -52 130 33 -152 -29 123 -8 -120 29 114 -54 -125 95 102 -95 -110
5080 -110 105 97 -110 -87 120 58 -113 -18 119 -9 -129 26 128 -57 -144 62 120 -60 -117 69 92 -91 -79
5103 -79 97 54 -119 -30 127 18 -151 -8 139 -2 -142 12 127 -36 -119 61 97 -90 -89 110 69 -137 -69
5126 -69 124 46 -148 -39 120 15 -117 5 112 -43 -110 58 113 -87 -108 90 96 -96 -95 96 66 -107 -52 115
5150 115 23 -126 -11 138 -26 -146 36 144 -64 -142 62 117 -77 -92 90 82 -119 -58 117 39 -136 -32 140
5173 140 4 -133 6 128 -13 -107 32 106 -66 -93 89 80 -109 -90 117 69 -128 -68 115 38 -125 -22 118
5196 118 -7 -119 30 117 -62 -124 70 117 -99 -112 78 79 -95 -62 90 31 -118 -23 114 -6 -130 16 140
5219 140 -34 -132 45 119 -46 -106 62 84 -79 -83 110 59 -119 -47 133 30 -144 -18 126 -3 -130 21 110
5242 110 -37 -106 65 84 -100 -83 107 84 -115 -65 103 56 -111 -26 99 9 -102 3 104 -37 -111 47 103
5265 103 -73 -111 83 104 -81 -84 86 62 -100 -41 103 16 -126 6 133 -17 -136 26 125 -45 -109 49 81
5288 81 -66 -91 78 62 -100 -51 106 35 -122 -37 125 21 -117 5 108 -8 -112 33 95 -65 -84 78 94
5311 94 -115 -92 106 73 -97 -54 100 37 -113 -3 109 -14 -112 40 109 -48 -114 60 97 -61 -85 67 67 -71
5335 -71 -52 100 37 -102 -22 106 7 -117 6 116 -15 -111 27 112 -41 -80 55 76 -80 -62 101 44 -106 -37
5359 -37 119 39 -108 -13 105 1 -93 11 83 -44 -90 57 81 -63 -85 73 82 -86 -81 79 59 -85 -40 85 4
5384 4 -97 7 103 -12 -107 33 113 -40 -103 62 96 -61 -66 84 54 -84 -29 104 22 -102 -8 113 -1 -101
5408 -101 8 92 -19 -94 38 82 -54 -69 60 59 -91 -66 101 56 -110 -45 95 11 -101 -13 97 -14 -101 45
5432 45 88 -56 -85 69 94 -67 -75 71 66 -77 -55 79 25 -87 4 87 -9 -91 22 104 -29 -105 19 92 -44 -91
5458 -91 41 70 -71 -55 74 34 -103 -28 100 15 -115 -12 105 -8 -95 11 88 -35 -70 55 69 -71 -59 74
5482 74 57 -86 -54 87 36 -92 -44 83 24 -81 3 80 -20 -77 29 81 -51 -90 49 72 -64 -80 70 49 -72
5507 -72 -25 85 -1 -104 -7 105 -19 -109 29 97 -33 -89 45 72 -44 -55 63 44 -81 -30 87 28 -85 -25
5531 -25 97 26 -86 -2 90 -6 -72 34 70 -45 -76 64 64 -80 -74 85 61 -92 -49 78 21 -90 -6 84 -21 -87
5557 -87 32 76 -43 -84 54 88 -59 -66 63 55 -58 -38 76 27 -81 -14 91 8 -104 6 102 -14 -95 30 87
5582 87 -32 -74 50 61 -74 -47 85 36 -88 -34 97 23 -93 -19 86 -6 -85 6 73 -31 -75 47 63 -65 -72
5607 -72 71 74 -72 -57 76 51 -76 -33 80 -3 -89 22 86 -33 -95 43 91 -41 -77 58 64 -56 -55 62 32 -83
5633 -83 -25 67 13 -95 2 95 -15 -88 11 91 -13 -70 25 71 -48 -65 61 49 -82 -51 93 48 -84 -30 87 17
5659 17 -88 0 86 -17 -65 29 82 -50 -55 69 69 -68 -63 73 41 -78 -27 79 17 -73 1 83 -2 -90 27 99 -38
5686 -38 -85 34 78 -44 -67 53 55 -59 -46 82 29 -82 -11 98 5 -90 0 82 -18 -86 24 71 -34 -50 55
5711 55 48 -74 -46 74 37 -71 -37 72 18 -79 -15 65 -14 -69 23 66 -40 -66 53 68 -55 -67 53 51 -63 -50 74
5738 74 32 -69 -9 83 -4 -82 19 85 -32 -85 31 81 -42 -67 33 55 -48 -43 54 22 -62 -31 70 7 -87 -11 78
5765 78 2 -80 6 70 -23 -74 32 54 -56 -52 77 46 -81 -39 67 36 -74 -17 73 11 -69 5 72 -25 -60 45 58
5792 58 -52 -72 46 56 -46 -45 51 41 -53 -30 63 3 -64 -3 75 -5 -81 16 66 -16 -65 31 59 -43 -53 36 31 -68 -23
5821 -23 76 22 -74 2 77 9 -75 9 60 -5 -53 35 67 -41 -49 45 48 -60 -47 66 40 -67 -26 61 23 -63 -16 60 -7
5850 -7 -70 24 67 -33 -67 47 68 -46 -61 42 48 -48 -39 53 8 -57 -2 67 -9 -64 16 70 -16 -74 20 64 -20 -55 37 36
5880 36 -38 -36 58 33 -72 -21 75 17 -82 -5 68 -3 -68 9 61 -20 -54 42 52 -54 -40 59 45 -55 -25 54 29 -40 -16
5909 -16 55 15 -59 11 57 -17 -60 22 56 -34 -60 43 54 -35 -47 38 28 -51 -14 58 5 -79 6 91 -6 -80 11 62 -20 -66
5939 -66 26 39 -42 -40 42 38 -58 -32 65 33 -58 -19 69 23 -59 -3 60 -9 -53 33 47 -38 -59 43 56 -53 -52 46 39 -62 -39
5970 -39 54 21 -57 -5 53 -19 -70 17 65 -40 -61 28 57 -35 -50 30 50 -36 -32 55 17 -64 2 65 -7 -73 9 76 -3 -61
6000 -61 12 44 -25 -52 45 42 -49 -44 57 26 -67 -32 67 22 -68 -20 53 -5 -67 4 50 -33 -45 34 53 -33 -50 39 41 -36 -47
6031 -47 45 30 -51 -17 54 -1 -59 15 75 -21 -73 30 74 -22 -62 31 58 -38 -45 43 32 -61 -23 59 13 -69 -20 68 4 -73
6061 -73 -1 45 -7 -60 12 41 -33 -36 42 39 -55 -43 54 31 -51 -22 67 12 -60 -7 62 -12 -50 20 60 -33 -55 37 54 -47 -56
6092 -56 43 34 -47 -37 58 15 -61 -11 63 -12 -62 10 58 -15 -69 9 51 -27 -54 22 33 -53 -36 48 31 -58 -22 67 21 -59 -8
6123 -8 64 -8 -59 18 55 -22 -43 44 39 -60 -45 50 30 -49 -37 54 26 -45 -16 66 7 -53 20 65 -34 -68 42 61 -32 -63 33
6154 33 47 -39 -37 39 29 -45 -17 51 0 -60 -1 76 -5 -69 10 69 -15 -57 28 36 -34 -30 46 27 -59 -30 58 23 -53 -11 63 3
6186 3 -53 1 53 -10 -57 29 48 -43 -43 44 42 -65 -49 61 32 -56 -29 52 1 -53 -2 56 -20 -62 16 51 -33 -61 27 59 -17
6217 -17 -46 38 31 -24 -22 47 11 -58 -7 48 3 -64 -1 70 -7 -69 7 45 -31 -44 31 23 -47 -31 51 24 -68 -16 63 18 -50 0
6249 0 42 -10 -54 9 37 -34 -47 27 32 -40 -46 36 42 -45 -29 42 21 -55 -25 46 2 -59 7 41 -21 -70 26 47 -31 -47 27 30 -39
6282 -39 -31 36 18 -40 -12 53 9 -69 -5 50 -10 -44 -1 54 -18 -50 19 29 -24 -29 39 24 -58 -28 53 14 -58 -28 59 3 -51
6313 -51 -4 41 -26 -38 13 34 -38 -43 37 35 -58 -49 41 27 -37 -30 37 -5 -50 2 47 -9 -40 15 50 -19 -55 20 40 -24 -51 19
6345 19 34 -45 -18 37 -2 -60 -10 61 -5 -65 -5 55 -11 -46 14 37 -32 -25 27 25 -43 -29 43 26 -49 -10 43 23 -35 -13 44
6376 44 3 -40 7 48 -21 -50 26 43 -23 -44 35 43 -33 -33 36 16 -45 -10 38 -9 -67 8 56 -21 -54 17 41 -26 -47 29 34 -40
6408 -40 -24 30 17 -38 -7 52 16 -50 -11 44 1 -52 -7 55 -9 -41 21 39 -25 -42 32 28 -44 -33 50 23 -47 -25 26 12 -42
6439 -42 -4 32 -11 -53 15 31 -32 -45 23 39 -26 -35 27 26 -39 -19 40 13 -40 -11 54 0 -54 2 51 -15 -45 17 35 -33 -43
6470 -43 29 32 -35 -21 39 21 -42 -16 51 18 -42 -10 36 6 -46 5 25 -14 -40 24 30 -24 -38 32 35 -34 -42 37 21 -41 -13 43
6502 43 -2 -39 15 39 -11 -46 16 41 -32 -36 21 32 -36 -23 33 24 -36 -5 44 -7 -54 9 50 -13 -47 17 41 -5 -35 -3 30
6533 30 -27 -36 28 30 -28 -39 42 17 -50 -19 50 16 -41 2 43 -14 -36 18 41 -28 -39 35 36 -39 -33 43 17 -37 -20 35 -3 -32
6565 -32 3 36 -17 -55 7 42 -18 -52 14 38 -27 -24 24 25 -36 -21 35 9 -49 -7 41 5 -43 -9 45 -12 -45 2 19 -17 -35
6596 -35 26 17 -33 -25 35 21 -45 -22 45 8 -47 -8 33 -5 -40 2 32 -24 -46 30 27 -31 -37 27 24 -37 -20 40 17 -49 -3 44 -7
6629 -7 -51 8 39 -16 -38 14 38 -28 -30 15 19 -38 -22 21 12 -43 -15 38 8 -56 -8 55 -7 -43 -13 26 -11 -38 12 28 -39 -36 34
6662 34 19 -51 -31 37 10 -43 -12 26 -3 -38 1 26 -30 -43 25 38 -34 -38 30 36 -29 -39 27 22 -37 -14 30 17 -40 -4 44 -9
6694 -9 -48 11 43 -12 -43 14 27 -28 -26 40 20 -29 -1 45 10 -47 3 36 2 -47 9 43 2 -47 11 33 -28 -28 31 19 -42 -15
6726 -15 34 23 -42 -21 42 13 -45 0 31 -12 -35 20 24 -18 -44 23 40 -28 -33 26 28 -30 -15 20 7 -38 -2 32 -14 -42 3 33
6758 33 -14 -48 12 29 -20 -28 22 28 -30 -14 44 15 -40 -15 46 4 -59 1 47 -9 -42 6 38 -17 -31 33 26 -40 -31 28 28 -36 -19
6791 -19 39 16 -24 -7 31 4 -37 11 36 -13 -27 20 26 -30 -19 23 25 -23 -20 30 12 -39 7 35 -14 -46 0 36 -12 -52 10 31
6823 31 -14 -40 21 16 -31 -17 29 11 -38 -21 47 21 -37 -7 36 9 -32 0 34 -13 -36 8 33 -19 -34 24 15 -33 -18 32 11
6854 11 -38 -24 17 3 -38 3 36 -14 -43 26 35 -30 -32 20 36 -34 -34 22 15 -47 -14 29 -7 -41 -7 35 -8 -51 2 37 -19 -35
6886 -35 15 26 -9 -20 21 14 -32 -26 42 17 -44 -9 30 5 -38 -6 25 -15 -31 -2 23 -34 -30 18 17 -31 -35 27 14 -30 -30 15 10 -30
6920 -30 1 24 -15 -37 18 34 -20 -39 15 25 -22 -29 29 22 -30 -15 26 11 -36 -2 36 -17 -33 3 34 -1 -46 0 27 -26 -46
6951 -46 13 15 -33 -28 25 14 -37 -23 33 13 -49 -21 20 3 -36 5 30 -9 -28 18 38 -35 -30 19 25 -33 -29 33 20 -34 -18 34 0
6984 0 -36 3 40 -14 -44 1 43 -24 -45 9 26 -25 -37 24 10 -41 -28 30 2 -44 -4 35 -5 -45 -3 34 -4 -36 4 30 -25
7015 -25 -23 24 23 -33 -27 38 9 -38 -20 37 5 -37 -14 31 -9 -38 7 25 -17 -36 21 35 -40 -45 17 19 -37 -29 25 -10 -49 -1 37
7048 37 -19 -39 -5 36 -17 -46 10 31 -19 -34 11 6 -33 -31 26 10 -34 -16 42 4 -46 -10 29 -1 -44 -5 27 -13 -40 18 17 -39
7080 -39 -34 28 10 -40 -14 45 8 -48 -5 36 0 -41 11 28 -30 -37 21 27 -35 -34 19 25 -34 -29 23 10 -33 -25 36 -2 -39 -4 35 -9
7114 -9 -41 0 25 -30 -53 4 25 -41 -40 11 4 -47 -23 49 7 -56 -9 34 -4 -53 -5 29 -24 -44 7 16 -39 -30 26 15 -45 -26 33
7147 33 7 -51 -20 34 -5 -48 -3 41 -11 -41 7 37 -25 -40 22 29 -32 -48 12 12 -43 -31 29 1 -34 -12 30 -10 -43 5 28
7178 28 -20 -43 12 20 -24 -28 13 21 -39 -22 36 0 -42 -18 44 7 -47 -10 43 -15 -42 11 34 -23 -42 31 13 -43 -37 33 19 -44
7210 -44 -21 33 7 -41 -4 31 2 -46 8 31 -22 -43 6 34 -14 -29 36 41 -29 -13 43 14 -33 -1 36 -7 -57 -1 43 -13 -48
7241 -48 13 37 -27 -39 17 30 -38 -23 33 8 -42 -13 37 9 -45 -7 35 2 -38 1 24 -25 -37 7 23 -27 -35 32 25 -37 -26
7272 -26 35 15 -30 -12 31 10 -39 0 36 -13 -41 14 34 -20 -35 12 17 -40 -28 18 9 -40 -21 30 3 -38 -7 40 -4 -40 10
7303 10 34 -25 -46 15 24 -24 -26 21 15 -36 -22 33 10 -35 -16 36 6 -40 1 34 -10 -27 6 25 -26 -36 21 20 -34 -34 24 8 -40
7336 -40 -28 20 5 -40 -14 21 -6 -43 9 36 -15 -41 8 31 -26 -40 10 19 -38 -10 28 6 -41 -11 38 -13 -47 -4 34 -13 -41
7367 -41 2 20 -13 -36 13 21 -30 -29 16 22 -47 -26 30 3 -36 -21 11 -4 -39 3 19 -12 -44 7 20 -37 -33 16 26 -40 -30 27
7399 27 18 -42 -10 29 -4 -39 6 21 -23 -41 7 25 -27 -42 3 15 -30 -36 16 0 -26 -19 24 8 -52 -15 20 -6 -43 -18 37 -19
7431 -19 -41 8 28 -25 -31 24 17 -34 -29 25 17 -38 -8 40 -1 -35 -5 26 -8 -39 8 23 -34 -34 22 26 -34 -35 22 20 -38 -19 20 3
7465 3 -30 -9 27 -12 -46 -3 38 -22 -44 11 25 -18 -23 22 8 -32 -23 22 10 -28 -6 27 2 -34 2 32 -2 -37 -2 27 -4 -23
7497 -23 14 24 -26 -28 33 7 -37 -19 21 8 -41 -17 26 -14 -47 3 22 -24 -46 12 31 -34 -46 9 16 -32 -18 16 0 -25 -15
7528 -15 26 0 -47 0 37 -7 -35 4 33 -21 -40 11 18 -28 -35 16 13 -48 -24 21 2 -42 -12 29 -6 -43 -5 20 -11 -39 2 16
7560 16 -25 -34 27 16 -28 -30 26 17 -39 -16 29 -2 -41 -9 19 -19 -42 2 24 -32 -37 19 20 -27 -32 22 16 -30 -18 25 4 -40 -13 22
7594 22 -8 -43 5 29 -17 -41 2 18 -19 -22 3 6 -34 -13 28 6 -42 -16 37 3 -44 -1 26 -15 -42 -2 29 -26 -29 21 14 -31
7626 -31 -32 36 0 -44 -28 22 -8 -38 -1 26 -14 -35 1 32 -21 -37 18 33 -23 -29 13 16 -28 -22 23 7 -42 -18 31 -1 -47 -2
7658 -2 42 -12 -39 13 19 -16 -35 8 18 -30 -25 20 6 -45 -10 25 -2 -48 0 27 -15 -45 -10 17 -15 -44 9 18 -36 -25 17 25 -33
7691 -33 -32 33 11 -25 -9 35 -3 -39 -9 28 -5 -41 7 25 -16 -27 20 24 -35 -26 26 9 -47 -16 37 0 -42 -3 27 -8 -42 5
7723 5 31 -27 -39 22 20 -25 -28 26 21 -29 -11 27 12 -34 -10 34 5 -32 -3 20 -4 -30 8 22 -26 -36 23 13 -28 -31 25 11 -36
7756 -36 -11 24 -1 -40 -3 28 -16 -44 1 19 -12 -39 13 13 -34 -35 30 23 -27 -15 13 10 -39 -3 23 -3 -36 0 27 -4 -35 2
7788 2 18 -25 -30 16 14 -27 -15 12 12 -31 -21 19 2 -38 -18 18 4 -33 -2 23 -18 -38 6 21 -23 -23 27 10 -39 -20 21 12 -31
7821 -31 -9 22 -10 -48 -4 22 -20 -28 3 31 -18 -34 19 18 -13 -18 20 1 -20 -6 19 4 -41 -2 28 -4 -33 -2 15 -16 -26 8
7853 8 14 -25 -29 11 9 -38 -28 24 15 -34 -11 27 7 -35 -2 22 -5 -36 16 21 -16 -29 19 23 -20 -19 17 10 -35 -20 12 -6 -38 -10 20
7888 20 -12 -35 -9 26 -26 -33 11 12 -28 -35 13 11 -18 -18 28 10 -40 -3 31 -9 -27 -4 21 -7 -26 0 15 -18 -25 14 11 -27 -22 26
7922 26 15 -31 -14 26 1 -37 -8 20 -16 -37 -2 22 -20 -26 14 19 -25 -28 16 5 -26 -18 12 5 -32 -4 23 -4 -26 -5 25 -11 -28
7955 -28 1 16 -3 -23 -2 13 -32 -24 16 6 -36 -12 25 0 -51 -18 24 -12 -35 2 21 -21 -27 6 14 -20 -17 27 17 -33 -25 22 0
7988 0 -33 -21 28 -5 -22 11 20 -6 -28 10 26 -17 -28 9 22 -23 -25 14 11 -26 -9 17 -2 -36 -11 27 -5 -45 1 30 -18 -32
8020 -32 3 28 -23 -22 18 5 -29 -21 21 4 -38 -17 21 -6 -25 1 25 -16 -30 13 25 -15 -35 28 14 -27 -24 23 14 -25 -9 18
8052 18 17 -25 -10 19 -8 -34 4 18 -19 -23 8 27 -27 -25 12 13 -25 -17 16 12 -25 -6 24 0 -26 -2 31 -5 -30 15 31 -11 -20 13
8086 13 18 -30 -29 23 6 -46 -9 30 1 -42 -23 21 -5 -40 -2 14 -19 -35 4 21 -24 -31 11 13 -27 -30 17 7 -33 -15 17 -6 -31
8119 -31 -1 17 -17 -36 -3 26 -18 -35 12 18 -36 -22 18 7 -32 -18 19 -5 -42 -4 27 -17 -38 0 24 -18 -33 -1 19 -14 -32
8150 -32 10 12 -23 -13 20 8 -37 -15 26 -2 -37 -5 16 -12 -28 12 26 -29 -21 14 14 -24 -22 26 1 -41 -17 22 1 -28 2 19
8182 19 -17 -36 12 29 -17 -42 13 18 -32
8191c2
$$ Imaginary data points
##PAGE= N=2
##DATA TABLE= (X++(I..I)), XYDATA
0 0 0 0 0 0 0 0 0 0 0 0 0 -8 8 -8 8 -16 16 -16 24 -24 32 -40 48 -56 64 -72 85 -96 112 -128 148 -168 192
33 192 -217 246 -277 312 -349 390 -434 484 -538 596 -661 733 -807 893 -982 1083 -1194 1315
51 1315 -1448 1596 -1764 1948 -2153 2390 -2663 2980 -3350 3795 -4343 5028 -5919 7133 -8887
66 -8887 11648 -16667 28624 -115916 15632 286296 -73766 -228189 78409 202121 -124984
77 -124984 -150232 157148 124373 -204516 -95709 229637 86555 -247939 -70137 240218
87 240218 54815 -225184 -22428 198794 -16527 -179276 65960 164102 -110176 -160313
97 -160313 146848 157791 -166343 -153753 172917 137865 -168355 -109738 162644 68729 -160518
108 -160518 -22969 166522 -20773 -177614 54493 189065 -75880 -193003 86099 184484
118 184484 -91114 -161550 97391 127811 -110035 -89753 129907 55001 -153715 -28887 175030
129 175030 12701 -187213 -3317 186046 -5100 -171578 18408 147968 -39958 -121945
139 -121945 68931 99830 -100701 -85292 128666 77810 -146925 -73221 152597 65706 -146947
150 -146947 -50360 134756 25435 -122219 6826 114383 -41016 -113024 70783 116097
160 116097 -91199 -118745 100743 115347 -101704 -102069 99119 78584 -98402 -48250 103126
171 103126 16728 -113444 10108 126052 -28528 -135649 38281 137139 -42547 -127918
181 -127918 46251 108863 -53982 -84051 67896 59146 -86777 -39181 106457 26512 -121617
192 -121617 -20080 127945 16039 -123930 -9590 111438 -2994 -94952 22595 79674
202 79674 -46804 -69387 71001 65033 -90027 -64402 100368 63125 -101508 -56746 96002
213 96002 42570 -88362 -20915 83030 -4942 -82605 29992 86677 -49550 -92183 60993
224 60993 94602 -64785 -90064 64049 76914 -63201 -56541 65932 32859 -73684 -10812
235 -10812 85015 -5654 -96184 15061 102787 -18829 -101577 20618 91867 -24590 -75788
246 -75788 33621 57553 -48015 -41604 65366 30886 -81476 -25757 92132 23875 -94755
257 -94755 -21343 89512 14453 -79142 -1306 67818 -17261 -59364 38075 55702 -56739 -56099
269 -56099 69419 57563 -74443 -56176 72778 48853 -67613 -34677 62942 15311 -61852
280 -61852 5471 65205 -23461 -71337 35548 76758 -40941 -77696 41431 71751 -40431
291 -40431 -58842 41590 41394 -47130 -23333 56857 8492 -68316 879 77695 -4911 -81624
303 -81624 6032 78312 -7828 -68572 13354 55255 -23946 -42221 38462 32662 -53880 -27913
315 -27913 66331 26886 -72840 -26672 72423 23831 -66490 -15849 58207 2406 -51073 14610
327 14610 47568 -31699 -48042 45214 50711 -52691 -52340 53978 49791 -51053 -41293 47169
339 47169 27359 -45470 -10524 47620 -5616 -53173 17800 59692 -24438 -63887 26073 62995
351 62995 -25240 -55932 25163 43866 -28474 -29677 35995 16759 -46455 -7787 56926 3495
363 3495 -64072 -2581 65567 2224 -61001 594 52013 -7799 -41670 19324 33120 -33134
375 -33134 -28297 45991 27164 -54805 -27888 57759 27501 -55190 -23411 49240 14378 -43004
387 -43004 -1268 39190 -13456 -39079 26485 41836 -35170 -45163 38442 46067 -37350 -42342 34278
400 34278 33405 -32306 -20689 33529 6984 -38363 4633 45322 -12080 -51655 14990 54519
412 54519 -14891 -52135 14468 44582 -16331 -33755 21968 22584 -30987 -13798 41307 8905
424 8905 -50037 -7561 54530 7772 -53646 -6868 48027 2620 -39956 5771 32294 -17260
436 -17260 -27366 29356 25920 -39167 -27038 44449 28350 -44666 -27255 40999 22004 -35990
448 -35990 -12450 32252 194 -31548 12047 34008 -21528 -38040 26632 41119 -27352 -40782
460 -40782 25467 35810 -23477 -26632 23781 15267 -27458 -4483 33908 -3384 -41072 7272
472 7272 46266 -7884 -47350 7224 43578 -7826 -35925 11526 26695 -18721 -18524 28155 13305
485 13305 -37420 -11466 43889 11809 -45835 -12116 43119 10097 -37206 -4416 30574 -4650
497 -4650 -25605 15402 23693 -25272 -24624 31963 26787 -34244 -27764 32614 25592 -28859 -19387 25462
511 25462 9925 -24399 781 26436 -10206 -30719 16419 35186 -18770 -37495 18161 35867
523 35867 -16671 -30050 16470 21185 -19093 -11593 24600 3637 -31634 1179 37904 -2714
535 -2714 -41205 2271 40244 -1982 -35254 3846 27841 -8829 -20372 16482 14942 -25039
547 -25039 -12591 32219 12822 -36050 -13996 35743 13941 -32050 -10967 26794 4564 -22255
559 -22255 4266 20124 -13566 -20831 21040 23339 -25118 -25739 25494 25910 -23276 -22590 20465 15763
573 15763 -19091 -6816 20327 -2083 -24048 8878 28807 -12385 -32521 12820 33311 -11629
585 -11629 -30304 10813 23976 -12080 -16007 16116 8596 -22237 -3490 28687 1369 -33376
597 -33376 -1562 34720 2393 -32279 -1959 26962 -1110 -20657 6954 15414 -14507 -12657
609 -12657 21849 12497 -26994 -13896 28714 15007 -27055 -14059 23260 10028 -19290 -3261
621 -3261 16911 -4901 -17085 12434 19442 -17591 -22511 19519 24386 -18672 -23466 16562 19205
634 19205 -14994 -12274 15449 4367 -18354 2534 22852 -6941 -27253 8418 29677 -7805
646 -7805 -28911 6691 24819 -6855 -18510 9332 11777 -14119 -6546 20009 3855 -25235 -3657
659 -3657 28084 4796 -27713 -5513 24402 4233 -19503 -285 14851 -5897 -12008 12812
671 12812 11579 -18681 -13038 22006 14930 -22306 -15488 20166 13456 -17095 -8576 14783 1696
684 1696 -14466 5494 16277 -11237 -19327 14354 22011 -14714 -22705 13233 20454 -11536 -15462
697 -15462 11122 8880 -12864 -2489 16522 -2183 -20894 4298 24306 -4155 -25312 2938
709 2938 23374 -2262 -18949 3451 13440 -6940 -8542 12089 5542 -17522 -4832 21533 5752
722 5752 -22972 -6948 21558 6855 -18151 -4487 14176 -250 -11244 6353 10286 -12299
734 -12299 -11315 16531 13318 -18173 -14857 17300 14471 -14976 -11513 12659 6306 -11753 -62
747 -62 12803 -5627 -15447 9411 18449 -10731 -20310 9984 19852 -8397 -16743 7452 11646 -8207
761 -8207 -5958 10889 1226 -14819 1491 18633 -1986 -20871 963 20656 133 -17973 -25
774 -25 13723 -2150 -9356 6212 6224 -11246 -5088 15775 5713 -18502 -7158 18741 7964 -16804
788 -16804 -6950 13727 3686 -10917 1358 9529 -6955 -9963 11692 11724 -14382 -13619 14678 14308
802 14308 -13141 -12853 10970 9171 -9509 -4026 9662 -1280 -11550 5338 14353 -7336 -16843
815 -16843 7232 17729 -5879 -16362 4542 12900 -4476 -8321 6230 3930 -9606 -965 13553
828 13553 -105 -16756 -459 18047 1612 -17032 -2085 14137 886 -10449 2229 7292
840 7292 -6695 -5613 11340 5672 -14820 -6868 16228 8063 -15442 -8088 13129 6179 -10480
853 -10480 -2409 8697 -2438 -8530 7046 9853 -10267 -11879 11413 13396 -10676 -13322 8892
866 8892 11162 -7324 -7285 6941 2623 -8209 1497 10763 -4108 -13588 4813 15459 -4041 -15489
880 -15489 2801 13449 -2288 -9878 3273 5914 -5917 -2739 9566 1135 -13111 -1171 15384
893 15384 2181 -15663 -3065 13972 2762 -11098 -745 8124 -2862 -6164 7152 5727 -10992
906 -10992 -6597 13266 7944 -13569 -8679 12114 7888 -9854 -5305 7890 1342 -7156 2957
919 2957 7901 -6483 -9698 8364 11554 -8399 -12412 7122 11561 -5549 -8927 4748 5143 -5400
933 -5400 -1274 7492 -1620 -10335 2940 12863 -2758 -14061 1763 13360 -1012 -10990 1381
946 1381 7659 -3312 -4519 6460 2460 -10028 -1870 12848 2470 -14095 -3438 13416 3739
959 3739 -11249 -2679 8521 76 -6278 3540 5281 -7206 -5691 9912 6965 -10975 -8216 10313
973 10313 8420 -8583 -7051 6711 4162 -5685 -461 5993 -3065 -7559 5506 9595 -6373 -11188
987 -11188 5830 11394 -4631 -9903 3720 6964 -3895 -3444 5415 352 -7944 1554 10601 -2005
1001 -2005 -12455 1359 12729 -475 -11297 258 8655 -1312 -5724 3679 3441 -6810 -2413
1014 -2413 9784 2655 -11677 -3620 11942 4398 -10661 -4181 8453 2519 -6298 354 4995 -3774
1028 -3774 -4973 6747 5995 -8536 -7406 8732 8217 -7648 -7787 6046 5864 -4829 -2821 4670
1042 4670 -517 -5773 3224 7684 -4707 -9594 4798 10609 -3949 -10143 3005 8204 -2756 -5297
1056 -5297 3706 2314 -5790 -99 8379 -868 -10608 654 11659 142 -11161 -706 9268 310
1070 310 -6700 1317 4326 -3899 -2910 6729 2708 -8972 -3477 9921 4482 -9436 -4894 7832
1084 7832 4129 -5907 -2076 4492 -803 -4148 3777 4930 -6005 -6359 6977 7657 -6656 -8002
1098 -8002 5540 6976 -4411 -4662 3992 1666 -4670 1195 6262 -3173 -8195 3905 9631 -3535
1112 -3535 -9902 2644 8740 -2060 -6465 2350 3744 -3765 -1415 5914 85 -8152 41 9693
1126 9693 652 -9959 -1472 8896 1677 -6931 -798 4794 -1193 -3245 3795 2725 -6249 -3208
1140 -3208 7889 4222 -8230 -4984 7391 4862 -5897 -3507 4485 1121 -3828 1697 4169 -4174
1154 -4174 -5346 5674 6720 -5953 -7568 5234 7279 -4175 -5753 3447 3317 -3636 -648 4758
1168 4758 -1518 -6500 2647 8196 -2685 -9078 1995 8745 -1247 -7198 1110 4939 -1955 -2669 3716
1183 3716 1060 -5845 -507 7686 870 -8599 -1676 8280 2229 -6925 -1936 5069 582 -3509 1621
1198 1621 2688 -4061 -2844 6015 3727 -6990 -4722 6823 5136 -5812 -4499 4554 2753 -3746
1212 -3746 -293 3756 -2223 -4615 4091 5927 -4917 -7042 4700 7333 -3836 -6477 3005 4611
1226 4611 -2755 -2233 3439 35 -4782 1425 6439 -1806 -7680 1349 8003 -535 -7191 41 5521
1241 5521 -365 -3583 1624 1939 -3559 -1122 5540 1215 -6992 -1921 7405 2613 -6783 -2724 5422
1256 5422 1869 -3971 -81 2981 -2230 -2775 4395 3355 -5820 -4292 6214 4984 -5631 -4875 4538
1271 4538 3777 -3544 -1835 3211 -436 -3660 2390 4731 -3523 -5992 3675 6757 -3060 -6615 2225
1286 2225 5452 -1736 -3597 2007 1565 -3125 31 4676 -807 -6208 696 7079 -80 -6969 -517
1301 -517 5878 513 -4257 337 2649 -1966 -1563 3897 1290 -5570 -1750 6504 2487 -6447 -2911
1316 -2911 5528 2582 -4259 -1345 3197 -582 -2760 2683 3048 -4350 -3901 5190 4772 -5077 -5130 4285
1332 4285 4594 -3346 -3194 2763 1234 -2896 751 3690 -2175 -4871 2725 5898 -2463 -6264 1737
1347 1737 5703 -1118 -4329 1067 2590 -1802 -956 3189 -54 -4774 272 6028 146 -6510 -760
1362 -760 6048 1018 -4874 -570 3448 -694 -2285 2526 1702 -4336 -1858 5631 2439 -6071 -3011
1377 -3011 5587 3026 -4556 -2274 3428 787 -2746 1122 2710 -2849 -3306 3953 4190 -4205 -4868 3702
1393 3702 4881 -2868 -4055 2173 2555 -2056 -759 2667 -788 -3766 1680 4997 -1784 -5801 1356
1408 1356 5826 -798 -4988 591 3548 -1042 -1973 2202 719 -3723 -153 5112 261 -5972 -770
1423 -770 5969 1182 -5155 -1109 3903 313 -2694 1127 1928 -2843 -1830 4257 2294 -5056 -2962
1438 -2962 5021 3366 -4321 -3109 3359 2101 -2590 -518 2381 -1200 -2792 2546 3619 -3207 -4467
1453 -4467 3119 4843 -2519 -4497 1843 3407 -1539 -1865 1859 294 -2797 842 3967 -1287 -5004
1468 -5004 1072 5455 -573 -5117 208 4100 -346 -2743 1157 1501 -2498 -718 3935 590 -5037
1483 -5037 -967 5482 1465 -5120 -1628 4169 1215 -3049 -142 2159 -1367 -1822 2860 2089 -3864
1498 -3864 -2702 4184 3276 -3834 -3393 3031 2872 -2260 -1703 1861 165 -2090 1236 2846 -2167 -3750
1514 -3750 2421 4460 -2116 -4567 1577 3950 -1211 -2734 1344 1276 -2046 19 3186 -733 -4279
1529 -4279 852 5034 -506 -5069 87 4402 33 -3284 387 2041 -1380 -1131 2673 772 -3849
1544 -3849 -989 4540 1504 -4565 -1923 3963 1894 -3038 -1246 2177 39 -1728 1395 1842 -2631
1559 -2631 -2399 3321 3055 -3366 -3456 2875 3275 -2228 -2454 1780 1120 -1780 319 2311 -1457 -3144 2023
1576 2023 3933 -1982 -4331 1549 4088 -1091 -3225 964 1974 -1366 -729 2251 -130 -3356 434
1591 434 4245 -246 -4655 -210 4395 497 -3612 -369 2539 -327 -1576 1470 1055 -2696 -1045
1606 -1045 3622 1446 -4000 -1927 3766 2123 -3069 -1801 2246 905 -1664 364 1576 -1641 -1959
1621 -1959 2565 2623 -2892 -3189 2682 3335 -2170 -2924 1662 1909 -1492 -619 1825 -593 -2565 1380 3410
1638 3410 -1610 -3996 1378 4093 -955 -3585 678 2584 -817 -1405 1439 425 -2391 71 3350
1653 3350 -41 -3951 -327 4040 765 -3553 -901 2707 532 -1820 341 1203 -1494 -1066 2560
1668 2560 1371 -3241 -1891 3357 2248 -2985 -2217 2337 1597 -1780 -527 1502 -753 -1743 1827 2286
1684 2286 -2459 -2891 2518 3214 -2162 -3094 1634 2389 -1314 -1309 1379 145 -1880 739 2648 -1134 -3391
1701 -3391 1042 3758 -658 -3631 260 2961 -185 -2025 575 1055 -1398 -461 2367 287 -3239
1716 -3239 -543 3627 923 -3500 -1185 2888 1000 -2112 -360 1418 -676 -1102 1767 1216 -2644
1731 -2644 -1642 3029 2093 -2901 -2277 2398 1965 -1824 -1195 1460 107 -1509 962 1934 -1742 -2564
1747 -2564 2012 3094 -1859 -3240 1425 2863 -1058 -2057 964 993 -1333 -63 1999 -541 -2772 650
1763 650 3341 -405 -3497 15 3122 186 -2381 -22 1506 -600 -813 1499 509 -2422 -622 3065
1779 3065 976 -3229 -1316 2929 1371 -2322 -952 1693 124 -1278 945 1264 -1914 -1579 2528
1794 2528 2029 -2685 -2352 2383 2295 -1880 -1775 1442 877 -1299 149 1538 -996 -2078 1460 2653
1810 2653 -1472 -3031 1119 2949 -731 -2439 518 1627 -675 -731 1239 62 -2023 214 2764
1825 2764 -120 -3184 -193 3159 456 -2670 -423 1940 -26 -1220 826 766 -1755 -684 2523
1840 2523 906 -2924 -1249 2842 1435 -2397 -1278 1797 701 -1305 179 1127 -1123 -1340 1835
1855 1835 1770 -2161 -2212 2044 2411 -1659 -2187 1233 1572 -1011 -695 1155 -180 -1612 796 2221 -1024
1872 -1024 -2741 883 2914 -551 -2668 288 2022 -325 -1207 727 474 -1407 -27 2151 -16
1887 -16 -2718 -205 2913 507 -2685 -633 2114 420 -1459 181 964 -1014 -776 1837 901 -2423
1903 -2423 -1233 2612 1537 -2362 -1562 1888 1217 -1404 -507 1133 -357 -1170 1148 1523 -1643 -1977
1919 -1977 1718 2316 -1470 -2319 1069 1928 -782 -1245 756 431 -1094 254 1661 -626 -2269 634
1935 634 2656 -398 -2679 137 2290 -67 -1633 322 925 -903 -378 1660 178 -2328 -273 2709
1951 2709 533 -2696 -726 2311 684 -1717 -276 1165 -380 -830 1171 865 -1808 -1143 2148 1494
1967 1494 -2092 -1696 1763 1599 -1318 -1140 1001 405 -978 376 1258 -994 -1721 1276 2171 -1241 -2378
1984 -2378 971 2211 -692 -1679 611 951 -819 -199 1309 -305 -1891 505 2376 -394 -2569 129
2000 129 2388 49 -1879 16 1240 -412 -682 1040 373 -1732 -383 2231 602 -2430 -897 2249
2016 2249 992 -1827 -792 1331 258 -966 463 880 -1195 -1069 1683 1406 -1853 -1699 1682 1743
2032 1743 -1324 -1455 997 872 -841 -140 990 -525 -1377 943 1840 -1038 -2166 862 2211 -598
2048 -598 -1904 437 1329 -521 -647 878 71 -1457 230 1999 -246 -2370 33 2396 165 -2073
2064 -2073 -203 1542 -39 -974 538 574 -1177 -453 1745 595 -2083 -862 2071 1072 -1792 -1057
2080 -1057 1341 725 -969 -139 793 -573 -913 1124 1220 -1459 -1599 1475 1792 -1251 -1701 954 1278
2097 1278 -778 -645 814 -52 -1140 591 1559 -856 -1967 811 2129 -605 -2005 395 1567 -355
2113 -355 -959 554 377 -1000 -5 1534 -84 -1981 -68 2171 304 -2053 -467 1679 385 -1193
2129 -1193 -36 794 -549 -614 1155 671 -1643 -907 1842 1138 -1743 -1239 1407 1022 -1064 -555 823
2146 823 -95 -837 715 1042 -1170 -1384 1314 1649 -1202 -1721 922 1478 -690 -1010 631 399 -824
2163 -824 157 1214 -497 -1669 570 1979 -427 -2042 210 1808 -102 -1357 197 807 -558 -374
2179 -374 1087 155 -1596 -213 1915 393 -1982 -599 1716 613 -1343 -408 917 -67 -659 636
2195 636 627 -1182 -812 1503 1087 -1569 -1276 1370 1234 -1077 -934 826 409 -763 216 942 -732 -1234
2213 -1234 1026 1562 -1057 -1744 873 1665 -642 -1314 522 779 -587 -234 895 -190 -1316 354
2229 354 1673 -285 -1877 87 1804 99 -1490 -115 1044 -136 -623 566 369 -1098 -354 1537
2245 1537 493 -1760 -709 1714 816 -1433 -699 1085 330 -786 213 679 -776 -773 1212 1000 -1395
2262 -1395 -1204 1330 1282 -1101 -1119 809 704 -679 -183 717 -335 -983 671 1316 -801 -1603 687 1679
2280 1679 -489 -1528 318 1125 -338 -662 549 218 -955 51 1393 -94 -1715 -15 1798 184
2296 184 -1625 -263 1258 117 -843 233 516 -715 -390 1168 451 -1500 -646 1569 801 -1417 -824
2313 -824 1111 603 -820 -184 656 -346 -695 800 895 -1114 -1168 1176 1334 -1056 -1315 823 1051 -655
2331 -655 -608 625 95 -810 319 1121 -547 -1448 542 1622 -396 -1587 218 1315 -151 -891 275
2348 275 460 -576 -163 1017 53 -1396 -126 1604 273 -1594 -407 1349 344 -1024 -104 693
2364 693 -331 -525 818 505 -1228 -650 1429 826 -1397 -904 1176 797 -898 -477 679 25 -636
2381 -636 456 776 -803 -1001 947 1244 -894 -1341 695 1222 -506 -917 442 477 -557 -62 834 -248
2399 -248 -1196 318 1471 -287 -1587 128 1448 -58 -1140 109 716 -366 -374 743 153 -1157 -140
2416 -140 1429 260 -1514 -409 1394 436 -1102 -308 792 -11 -551 435 497 -852 -600 1135 793
2433 793 -1236 -965 1114 963 -901 -787 688 404 -614 35 693 -463 -925 704 1175 -777 -1347
2450 -1347 669 1324 -515 -1106 382 731 -434 -325 628 -49 -948 201 1249 -214 -1448 95 1422
2467 1422 24 -1233 -36 900 -104 -564 420 317 -832 -248 1182 317 -1380 -452 1387 539 -1215
2484 -1215 -493 919 244 -676 117 534 -558 -588 886 733 -1074 -918 1045 991 -894 -918 679 663 -559
2503 -559 -285 567 -125 -731 426 999 -564 -1243 541 1335 -417 -1249 297 958 -312 -591 443 217
2521 217 -729 27 1053 -132 -1313 74 1402 35 -1299 -111 1033 20 -724 181 434 -540 -313
2538 -313 875 326 -1142 -469 1223 606 -1158 -648 943 532 -707 -239 570 -142 -573 518 711 -802
2556 -802 -888 887 1039 -828 -1044 681 871 -547 -548 500 145 -620 185 830 -416 -1075 460 1222 -380
2575 -380 -1244 246 1058 -191 -754 239 409 -460 -162 764 22 -1077 -46 1251 152 -1284 -255
2592 -255 1115 239 -868 -91 607 -222 -448 570 404 -895 -496 1060 633 -1091 -711 942 653 -741
2610 -741 -456 558 126 -511 230 584 -547 -771 693 937 -709 -1059 587 989 -460 -776 396 440
2628 440 -470 -108 656 -158 -915 282 1129 -263 -1247 167 1153 -94 -920 126 616 -270 -336 532 151
2647 151 -837 -120 1066 189 -1166 -308 1104 355 -919 -303 676 70 -508 229 435 -567 -511 825
2665 825 638 -947 -774 897 784 -753 -661 600 393 -522 -40 551 -294 -707 533 885 -623 -1014
2683 -1014 576 1028 -458 -884 340 621 -339 -305 474 29 -685 130 939 -164 -1112 74 1138 3
2701 3 -1024 -45 785 -56 -540 277 337 -584 -263 864 289 -1067 -389 1092 466 -981 -432 789 268
2720 268 -602 3 486 -311 -481 605 586 -776 -713 801 792 -702 -765 555 571 -465 -315 455 -18 -582
2740 -582 259 768 -422 -958 422 1051 -355 -1030 251 835 -251 -567 318 276 -534 -80 783 -27 -994
2759 -994 -4 1089 86 -1047 -142 880 108 -661 54 431 -310 -332 583 324 -820 -411 930 522
2777 522 -924 -565 778 472 -617 -275 500 -37 -491 331 553 -575 -710 676 811 -664 -840 556
2795 556 722 -453 -515 415 209 -476 56 633 -235 -823 292 970 -246 -1001 151 911 -104 -707 140
2814 140 455 -298 -253 532 143 -787 -134 954 186 -1028 -257 940 249 -771 -124 568 -100 -441 363
2833 363 378 -636 -441 800 510 -866 -588 764 561 -631 -426 491 176 -441 94 486 -335 -617 485
2852 485 753 -530 -851 458 841 -375 -693 328 460 -364 -190 516 -20 -721 137 895 -159 -1003
2870 -1003 100 955 -53 -822 56 600 -164 -386 357 221 -594 -176 798 202 -916 -289 892 327
2888 327 -787 -271 603 129 -476 121 409 -384 -437 594 535 -705 -636 710 649 -620 -576 513 374 -451
2908 -451 -125 458 -148 -559 333 688 -433 -831 393 848 -337 -782 250 580 -246 -377 333 145 -521
2927 -521 -26 703 -31 -877 -5 911 65 -866 -85 697 9 -518 153 347 -407 -264 633 255 -798 -309
2947 -309 843 364 -789 -352 643 247 -512 -74 405 -194 -410 392 460 -559 -590 592 650 -539 -661
2966 -661 435 531 -380 -342 372 99 -458 104 604 -237 -766 283 853 -242 -840 190 709 -185 -517
2985 -517 229 296 -381 -126 556 38 -749 -48 838 83 -830 -142 714 101 -556 -3 396 -195 -315 391
3005 391 298 -593 -360 700 430 -730 -475 635 424 -521 -282 430 53 -421 174 470 -370 -561 482
3024 482 650 -491 -687 414 627 -343 -466 314 250 -365 -42 469 -104 -644 163 744 -168 -809 90 747
3044 747 -62 -618 84 427 -199 -284 369 179 -582 -143 733 171 -805 -228 752 216 -628 -143 484 -23
3064 -23 -387 221 323 -438 -368 557 424 -625 -499 579 494 -490 -421 392 244 -365 -39 394 -162 -515 290
3085 290 612 -353 -712 321 701 -290 -620 237 437 -278 -236 377 67 -531 37 671 -65 -762 29 749
3105 749 9 -651 -9 512 -55 -344 208 234 -383 -197 552 216 -656 -279 684 327 -614 -301 499 187
3125 187 -417 -9 367 -199 -394 377 462 -490 -535 517 573 -464 -530 377 382 -333 -201 343 -11 -421 164
3146 164 527 -227 -617 251 684 -191 -636 150 525 -140 -361 220 201 -356 -87 510 48 -648 -55 703
3166 703 111 -687 -130 580 73 -458 44 331 -226 -264 410 265 -547 -314 615 361 -590 -361 486 299
3186 299 -409 -172 349 1 -338 188 409 -312 -491 385 571 -351 -575 309 500 -262 -361 261 190 -337 -18
3207 -18 439 -83 -566 130 655 -114 -676 81 606 -77 -464 119 320 -229 -183 369 128 -505 -124 602 154
3228 154 -618 -191 564 202 -462 -118 371 -16 -300 210 304 -363 -345 467 408 -505 -435 477 425 -396 -306 354
3250 354 160 -331 33 377 -187 -452 269 539 -286 -574 243 546 -205 -448 178 295 -226 -148 323 36
3270 36 -459 23 574 -7 -614 -19 621 45 -527 -12 424 -76 -305 215 227 -375 -202 518 227 -576 -245
3291 -245 575 264 -493 -197 402 103 -333 56 298 -223 -319 341 389 -394 -450 390 463 -337 -406 283 291 -263
3313 -263 -143 311 -6 -392 120 488 -174 -556 182 593 -134 -529 140 409 -156 -269 240 152 -352 -63
3333 -63 497 46 -565 -52 582 93 -535 -99 442 33 -341 60 261 -234 -240 351 244 -447 -297 479 331
3354 331 -464 -305 399 230 -340 -99 317 -51 -326 206 389 -290 -445 327 477 -315 -452 258 358 -233
3374 -233 -237 240 97 -295 28 395 -89 -493 92 532 -77 -537 38 461 -57 -367 114 242 -228 -166 357
3395 357 127 -472 -139 527 150 -537 -172 463 126 -371 -34 305 -97 -252 240 248 -341 -284 408 328 -399
3416 -399 -332 361 294 -310 -215 262 76 -279 57 329 -155 -407 209 473 -221 -502 182 454 -161 -359 173
3437 173 217 -232 -115 324 15 -438 27 511 -13 -521 7 476 16 -397 27 296 -99 -206 222 170 -338
3458 -338 -165 422 203 -451 -238 433 222 -369 -164 304 50 -271 71 264 -206 -316 294 350 -330 -391 323
3479 323 377 -274 -323 246 190 -248 -57 288 -38 -341 129 430 -125 -459 125 462 -90 -387 85 301 -120
3500 -120 -201 217 114 -314 -74 409 62 -475 -92 485 107 -438 -85 362 15 -273 95 235 -228 -211 338
3521 338 231 -385 -259 398 260 -346 -233 291 152 -254 -38 236 -75 -266 178 324 -218 -380 230 413
3541 413 -200 -376 185 302 -172 -195 208 82 -292 6 371 -45 -440 57 455 -43 -434 34 354 -58
3561 -58 -266 119 161 -210 -113 307 96 -389 -133 417 156 -389 -149 346 111 -278 -35 232 -80 -217 202
3582 202 255 -265 -284 313 328 -306 -304 287 261 -240 -163 230 37 -259 66 307 -146 -360 171 395 -158 -403
3604 -403 117 341 -105 -264 130 160 -192 -79 266 27 -355 -31 399 42 -410 -52 379 48 -308 18
3624 18 251 -88 -192 205 174 -294 -178 356 194 -373 -206 350 179 -303 -114 239 19 -213 77 226 -176
3645 -176 -273 215 308 -227 -332 206 312 -188 -253 173 176 -194 -65 245 -9 -317 76 384 -84 -400 69 402
3667 402 -49 -327 89 245 -124 -156 207 99 -284 -67 353 71 -386 -92 367 86 -311 -56 265 2
3687 2 -212 81 188 -182 -210 257 227 -297 -251 298 248 -275 -203 246 132 -229 -26 233 -72 -273 158 312
3709 312 -187 -341 190 348 -172 -301 153 224 -158 -125 194 60 -258 -1 323 -20 -367 7 383 9 -349
3730 -349 1 289 -35 -225 102 165 -197 -139 285 135 -340 -137 363 139 -348 -130 306 74 -253 19 221
3751 221 -103 -211 196 235 -260 -253 282 271 -233 -240 216 187 -196 -116 200 15 -229 52 286 -106 -333 113 366
3774 366 -111 -352 102 298 -115 -216 152 136 -205 -73 281 37 -341 -12 372 22 -355 -26 322 6
3794 6 -253 54 186 -126 -152 214 150 -270 -164 314 184 -303 -186 270 154 -255 -97 219 -6 -232 76
3815 76 243 -164 -278 189 292 -224 -293 196 252 -182 -193 181 95 -210 -25 250 -46 -291 68 323 -71 -335
3837 -335 66 312 -57 -248 76 186 -115 -133 197 99 -270 -81 319 94 -333 -87 320 70 -285 -33 236
3858 236 -34 -201 125 185 -213 -195 257 203 -275 -213 266 191 -230 -138 204 80 -206 18 213 -81 -240 135
3880 135 287 -140 -291 145 296 -126 -245 149 185 -157 -106 216 50 -273 -6 320 -12 -336 19 335 -22
3901 -22 -298 24 234 -82 -173 135 134 -203 -119 263 100 -291 -119 305 125 -269 -92 234 43 -203 20 181
3923 181 -98 -204 160 235 -206 -245 224 258 -204 -218 191 152 -187 -75 201 2 -248 58 271 -93 -309 97
3945 97 295 -109 -271 93 207 -118 -170 135 95 -194 -69 252 45 -294 -55 311 52 -300 -40 259 1
3966 1 -224 56 187 -126 -156 200 155 -249 -155 272 170 -276 -145 240 93 -219 -41 186 -39 -195 97 220
3988 220 -144 -237 157 248 -172 -248 145 201 -150 -165 146 73 -188 -20 240 -25 -281 37 311 -42 -308 55
4010 55 275 -69 -216 97 160 -149 -116 211 90 -262 -94 284 77 -294 -81 257 56 -228 -24 180 -57
4031 -57 -173 102 170 -172 -188 202 192 -213 -208 192 179 -205 -124 189 60 -200 15 233 -73 -242 121 265 -129
4054 -129 -266 127 248 -117 -198 131 137 -144 -68 190 33 -235 -15 274 11 -287 -8 277 16 -242 25
4075 25 206 -60 -169 120 143 -193 -137 240 129 -253 -134 261 114 -240 -78 218 23 -194 63 187 -121
4096 -121 -188 167 199 -176 -219 179 204 -175 -174 160 123 -172 -60 174 14 -225 22 238 -59 -279 61 278
4118 278 -72 -255 76 198 -120 -147 148 97 -217 -73 256 55 -284 -46 291 39 -250 -19 219 -13 -189
4139 -189 64 161 -134 -143 180 152 -210 -157 229 163 -221 -151 199 80 -203 -57 198 -38 -213 84 238 -128
4161 -128 -237 141 247 -163 -222 147 184 -151 -124 172 57 -199 -11 237 -24 -253 45 275 -36 -255 41
4182 41 229 -72 -195 98 146 -136 -111 200 100 -243 -110 258 87 -268 -89 240 36 -214 16 195 -73
4203 -73 -200 126 184 -180 -188 208 180 -213 -158 205 138 -188 -80 191 28 -193 42 218 -75 -221 100 243
4225 243 -102 -245 108 212 -116 -176 141 136 -171 -76 195 35 -264 -24 273 -3 -291 4 243 -29 -221
4246 -221 62 174 -112 -147 163 126 -209 -120 226 115 -237 -96 237 86 -198 -45 189 5 -182 60 181
4267 181 -110 -198 144 209 -172 -198 175 189 -170 -147 172 85 -182 -35 206 -26 -238 65 252 -76 -250 83
4289 83 233 -92 -206 92 153 -129 -113 158 72 -199 -48 228 47 -239 -35 258 16 -230 0 205 -42
4310 -42 -190 96 156 -144 -163 191 152 -216 -148 213 118 -218 -95 195 36 -192 14 178 -72 -205 93 188
4332 188 -142 -218 134 203 -143 -185 132 129 -157 -97 161 42 -206 -5 234 -18 -246 32 247 -46 -233 55
4354 55 190 -81 -151 129 122 -165 -95 203 82 -240 -61 241 57 -218 -41 199 -2 -191 36 158 -91 -167
4376 -167 118 147 -162 -164 174 147 -189 -146 173 101 -171 -53 191 5 -187 44 222 -71 -214 105 231 -103
4398 -103 -193 122 169 -117 -116 143 88 -167 -37 200 17 -215 -2 233 -8 -221 12 206 -44 -178 71 147
4420 147 -118 -130 159 113 -195 -100 220 105 -216 -69 217 61 -186 5 188 -34 -164 74 175 -117 -161
4441 -161 151 170 -152 -151 146 134 -149 -104 150 57 -159 -8 182 -39 -203 44 202 -68 -218 66 203 -79
4463 -79 -165 93 125 -135 -95 170 61 -196 -49 226 31 -218 -13 218 5 -182 48 172 -66 -135 114 129
4485 129 -135 -113 172 140 -174 -109 179 104 -168 -63 157 29 -168 14 161 -73 -187 98 190 -118 -191 127
4507 127 174 -133 -148 140 95 -152 -48 164 18 -198 8 217 -28 -196 42 206 -31 -174 64 147 -77
4528 -77 -118 125 95 -145 -76 183 70 -194 -55 210 47 -194 -28 174 -7 -171 66 165 -99 -153 142 141 -159
4551 -159 -138 172 130 -166 -103 160 59 -154 -12 162 -16 -159 58 189 -67 -174 86 188 -85 -155 111
4572 111 154 -119 -98 141 66 -171 -38 204 20 -205 4 214 -7 -199 42 167 -64 -146 86 122 -121 -103
4594 -103 158 101 -184 -86 185 73 -184 -48 188 38 -163 23 159 -40 -144 96 164 -121 -144 138 156 -140
4616 -140 -141 147 109 -149 -68 145 32 -175 16 188 -49 -198 66 176 -85 -194 84 152 -102 -128 116 87
4638 87 -142 -63 167 34 -182 -24 185 18 -184 -10 180 -9 -175 40 140 -81 -115 129 129 -152 -112 172
4660 172 90 -182 -72 175 58 -162 -19 156 -25 -147 61 150 -105 -163 104 158 -128 -134 122 135 -121 -87 122
4683 122 68 -146 -16 157 -12 -178 30 194 -35 -189 64 185 -53 -152 87 125 -115 -88 143 75 -172 -50
4705 -50 185 39 -204 -20 175 8 -174 21 135 -51 -127 82 111 -129 -123 136 106 -150 -104 159 87 -155 -57
4728 -57 162 31 -156 22 157 -54 -150 78 169 -88 -144 122 152 -113 -117 117 80 -138 -47 143 19 -167 1
4751 1 187 -27 -190 40 172 -46 -161 57 125 -84 -111 98 83 -137 -74 157 68 -170 -58 185 36 -175
4773 -175 -9 171 -25 -148 68 138 -84 -115 125 120 -134 -117 154 100 -155 -75 148 41 -139 -19 139 -22
4795 -22 -143 46 144 -69 -157 81 148 -91 -144 90 109 -127 -99 126 46 -149 -24 170 7 -185 9 177 -15
4818 -15 -171 57 148 -55 -109 93 106 -107 -77 143 78 -165 -62 161 48 -160 -36 139 6 -156 14 124
4840 124 -54 -135 80 131 -106 -132 113 108 -137 -110 123 79 -131 -48 132 12 -152 25 153 -45 -161 64 163
4863 163 -60 -142 95 137 -85 -86 110 72 -123 -46 146 23 -160 -15 157 8 -171 3 159 -25 -135 47
4885 47 112 -89 -114 95 84 -149 -89 155 69 -156 -54 145 33 -139 -14 141 -26 -125 43 134 -80 -125 95
4908 95 128 -107 -104 110 98 -100 -69 113 50 -128 -13 128 -12 -164 22 166 -43 -157 47 140 -60 -123 76
4931 76 90 -108 -78 109 43 -136 -28 149 22 -159 -5 153 3 -142 21 116 -41 -104 76 101 -102 -89 119
4954 119 97 -118 -81 137 66 -122 -43 126 12 -128 12 120 -51 -142 62 132 -92 -130 87 109 -106 -101 92
4977 92 61 -115 -33 124 5 -139 5 143 -27 -147 35 144 -29 -128 55 111 -57 -86 97 80 -118 -58 137
5000 137 51 -144 -42 147 16 -153 -11 127 -18 -120 43 109 -79 -107 101 111 -119 -93 126 75 -129 -69
5022 -69 119 39 -127 -17 123 -16 -122 53 141 -49 -128 71 135 -65 -106 89 101 -86 -72 112 46 -129 -25
5045 -25 146 3 -155 12 142 -33 -141 35 116 -59 -108 74 85 -99 -70 112 54 -141 -56 139 47 -140 -27
5068 -27 131 16 -119 4 121 -32 -118 70 116 -89 -116 112 116 -117 -87 120 70 -117 -36 124 11 -132 25
5091 25 142 -46 -138 54 136 -62 -119 58 99 -84 -89 83 63 -116 -48 120 23 -135 -21 152 6 -139 3
5114 3 138 -24 -130 50 97 -80 -98 99 86 -123 -65 143 67 -132 -39 137 28 -118 2 108 -16 -115 39
5137 39 103 -73 -119 82 105 -101 -108 90 69 -108 -70 106 37 -119 -5 117 -22 -144 34 152 -40 -147 49
5160 49 124 -72 -102 82 76 -94 -66 115 35 -136 -20 142 12 -148 -13 131 -10 -118 27 102 -59 -96 63
5183 63 84 -102 -94 103 76 -124 -71 133 52 -126 -36 120 -2 -124 24 111 -55 -120 69 127 -86 -112 97 105 -106
5208 -106 -79 100 49 -114 -32 115 9 -123 11 128 -33 -141 38 129 -44 -115 41 96 -66 -76 82 60 -115
5231 -115 -63 126 32 -130 -31 136 10 -130 9 121 -27 -99 61 100 -76 -88 101 83 -104 -73 116 65 -116
5254 -116 -45 106 17 -110 -4 113 -17 -111 43 107 -69 -120 73 101 -82 -95 89 77 -103 -58 98 18 -125
5277 -125 -5 118 -11 -135 17 118 -33 -119 46 100 -54 -79 70 71 -89 -56 107 44 -115 -32 120 23 -126
5300 -126 -14 107 -10 -124 24 98 -58 -102 65 88 -94 -98 94 64 -121 -67 105 47 -98 -25 101 -18 -112
5323 -112 13 100 -44 -114 55 109 -61 -103 57 88 -64 -60 89 49 -89 -35 99 12 -110 -7 115 -7 -122
5346 -122 19 109 -41 -108 38 76 -77 -74 83 50 -118 -58 111 27 -121 -36 96 0 -104 7 90 -34 -93 44
5370 44 89 -66 -89 71 75 -82 -73 89 71 -88 -37 88 27 -90 -8 95 -16 -106 41 116 -49 -118 48 84 -62
5395 -62 -84 54 55 -92 -59 80 23 -106 -20 97 -2 -119 -4 98 -14 -92 12 83 -39 -68 56 69 -80 -63
5419 -63 95 51 -103 -52 102 36 -104 -25 94 0 -94 22 100 -46 -90 53 95 -76 -80 68 61 -87 -73 69 31
5444 31 -92 -23 84 -12 -99 1 103 -26 -110 22 89 -40 -94 48 75 -66 -49 87 57 -86 -25 104 14 -116
5468 -116 -17 104 1 -108 -4 85 -43 -81 45 64 -66 -72 75 61 -87 -64 73 45 -79 -46 79 20 -83 -6
5492 -6 78 -13 -81 35 84 -53 -88 56 101 -50 -72 62 62 -64 -41 88 14 -89 2 92 -11 -105 19 101 -38 -88
5518 -88 32 78 -46 -61 57 45 -73 -46 86 34 -102 -32 91 17 -99 -23 93 -5 -84 19 81 -37 -72 66
5542 66 69 -70 -60 93 59 -86 -45 85 37 -80 -14 91 0 -77 14 89 -41 -95 47 78 -57 -84 57 64 -56 -62
5568 -62 70 29 -82 -27 90 5 -101 4 107 -12 -109 12 86 -33 -85 34 57 -54 -66 74 61 -78 -25 99
5592 99 23 -85 -7 91 16 -78 6 76 -14 -66 39 67 -55 -71 68 75 -75 -61 69 41 -79 -30 72 11 -77 3 78
5619 78 -27 -101 26 87 -45 -88 41 75 -51 -61 68 49 -63 -32 74 17 -82 -7 98 5 -81 9 88 0 -87 20
5645 20 69 -27 -55 46 39 -85 -54 72 36 -95 -42 70 21 -87 -21 79 1 -77 25 64 -50 -80 59 78 -60
5670 -60 -62 77 55 -70 -40 74 21 -67 2 75 -4 -72 21 83 -28 -85 25 84 -42 -66 41 67 -58 -50 66 19 -82
5697 -82 -26 90 -4 -108 -13 75 -12 -95 17 67 -31 -66 46 44 -58 -35 69 51 -70 -42 76 41 -75 -22 77 1
5723 1 -72 9 63 -26 -74 42 76 -56 -78 60 54 -62 -58 69 40 -80 -32 62 2 -77 0 76 -24 -81 22 79 -35
5750 -35 -64 35 68 -33 -37 55 33 -56 -23 83 22 -64 -3 85 9 -75 -7 79 -17 -70 25 51 -41 -56 62 52 -67 -48 79
5779 79 36 -86 -37 64 11 -75 -8 54 -19 -70 23 65 -40 -67 48 58 -52 -56 52 35 -49 -27 60 17 -68 0 80 1
5807 1 -80 20 93 -11 -71 23 74 -37 -50 38 39 -61 -38 59 10 -86 -15 76 4 -89 -10 69 -13 -64 19 44 -34 -47 47
5836 47 43 -54 -41 59 49 -71 -42 70 35 -59 -13 70 -4 -53 18 70 -33 -67 39 68 -39 -68 49 57 -51 -42 64
5863 64 18 -64 -10 72 -6 -69 6 62 -14 -74 12 63 -26 -65 23 45 -40 -38 50 36 -56 -26 78 23 -66 -16 75 13 -71 7
5893 7 61 -9 -57 41 58 -55 -46 43 45 -60 -52 57 27 -54 -32 45 10 -39 3 56 -9 -68 16 52 -35 -69 36 64 -42 -52
5923 -52 32 37 -42 -18 69 10 -65 10 65 -6 -67 14 81 -10 -72 24 69 -24 -41 38 29 -57 -43 59 20 -76 -20 56 18 -70 -24
5954 -24 39 6 -50 10 51 -32 -52 27 40 -47 -48 47 46 -58 -35 58 24 -54 0 62 3 -75 23 63 -19 -63 31 57 -16 -44 49
5985 49 54 -36 -35 46 26 -63 -16 65 1 -75 -4 68 -17 -80 5 58 -19 -57 28 42 -37 -46 52 34 -63 -28 64 22 -60 -15 68 23
6017 23 -51 3 56 -4 -55 34 64 -45 -52 46 44 -41 -47 48 37 -46 -42 45 10 -65 -2 60 -24 -74 0 60 -33 -71 21 54 -35 -42
6049 -42 48 29 -51 -18 48 15 -62 -9 66 9 -58 -9 64 -1 -46 17 51 -10 -47 40 40 -42 -46 67 39 -67 -38 60 19 -59
6079 -59 -17 57 -5 -58 11 50 -40 -58 39 54 -50 -67 31 34 -58 -20 51 20 -52 -12 58 -4 -58 18 72 -17 -61 8 64 -19
6109 -19 -58 20 40 -22 -29 54 31 -64 -27 61 12 -66 -10 60 -11 -70 -2 44 -25 -58 19 42 -53 -38 46 32 -59 -35 50 26 -53
6140 -53 -12 53 16 -49 10 54 -16 -56 26 65 -39 -57 40 58 -40 -38 46 33 -70 -24 48 3 -70 -14 61 -16 -74 2 59 -24
6170 -24 -70 5 37 -35 -40 31 27 -49 -26 54 29 -66 -25 55 20 -54 -1 58 -5 -40 28 62 -31 -41 50 49 -53 -42 52 29 -56
6201 -56 -25 52 22 -61 -5 39 -15 -60 15 45 -24 -54 21 43 -39 -48 26 31 -45 -31 48 7 -55 -5 61 11 -51 5 76 -4 -53
6232 -53 12 72 -9 -42 40 41 -33 -25 53 25 -47 -17 63 8 -73 -2 61 -8 -54 9 42 -39 -36 17 31 -52 -51 44 33 -48 -47 40 28
6265 28 -40 -14 47 10 -51 11 65 -14 -54 22 74 -26 -58 32 45 -21 -40 47 23 -40 -22 46 5 -52 -9 55 -8 -70 -4 36
6295 36 -26 -56 16 30 -41 -40 27 27 -59 -28 46 28 -71 -27 49 15 -53 -4 41 -14 -46 26 47 -33 -38 46 52 -33 -31 44 41 -31 -13
6328 -13 36 15 -47 -5 43 -11 -60 3 51 -18 -60 6 38 -20 -51 13 27 -32 -35 36 13 -53 -20 56 1 -69 5 61 -7 -46 22
6359 22 41 -22 -29 32 33 -41 -29 43 25 -53 -36 46 13 -51 -21 45 6 -50 -2 30 -15 -51 15 45 -32 -59 13 40 -44 -47 26 20
6391 20 -38 -18 44 -7 -46 -3 45 -6 -54 12 44 -6 -45 20 35 -22 -30 28 18 -31 -22 44 16 -40 -8 45 10 -51 -17 44 -5
6422 -5 -49 -3 25 -30 -45 28 29 -43 -32 38 23 -44 -30 31 9 -44 -7 41 0 -36 19 51 -16 -51 29 43 -27 -36 33 42 -29 -22 44
6455 44 23 -40 -2 47 -7 -57 -2 44 -14 -68 1 41 -28 -40 27 13 -46 -29 26 12 -61 -19 44 11 -46 -3 34 4 -38 2
6485 2 37 -7 -37 23 33 -24 -41 27 33 -33 -27 36 26 -30 -19 43 7 -32 -1 32 -13 -57 14 35 -29 -61 16 33 -34 -33 24 25 -44
6518 -44 -16 29 1 -46 -8 43 -5 -49 -10 40 -4 -40 -1 41 -23 -30 28 21 -38 -25 46 18 -48 -27 46 13 -53 -13 32 -3 -37
6549 -37 12 29 -28 -44 38 31 -34 -45 27 16 -42 -21 28 5 -47 4 46 -12 -47 6 48 -22 -52 32 43 -11 -40 23 30 -32 -18
6580 -18 38 15 -38 -19 48 12 -44 -8 51 -7 -53 4 32 -15 -35 3 15 -34 -26 29 9 -43 -27 36 12 -47 -11 37 -2 -39 13
6611 13 38 -25 -44 33 44 -27 -32 48 41 -34 -28 42 14 -39 -3 42 -2 -42 6 44 -25 -48 5 35 -6 -43 17 27 -28 -27 24 1
6643 1 -32 -27 26 5 -47 -14 40 6 -45 -3 46 3 -33 15 43 -24 -24 44 31 -42 -27 50 18 -52 -7 45 -5 -42 -5 39 -18 -50
6675 -50 20 23 -30 -45 32 25 -40 -37 24 16 -34 -21 33 14 -34 -1 39 -12 -59 7 41 -10 -44 9 52 -8 -30 31 26 -19 -8 40 11
6708 11 -40 -7 41 -1 -50 1 41 -15 -34 -4 32 -30 -36 22 26 -51 -36 37 18 -48 -33 44 4 -37 -8 29 -20 -38 16 43 -21
6739 -21 -30 28 38 -19 -32 35 30 -20 -17 38 20 -21 -3 47 3 -39 7 50 -15 -41 5 27 -15 -34 16 15 -27 -24 30 4 -49 -18 39
6772 39 -2 -59 -24 42 -2 -42 9 29 -8 -32 26 23 -31 -15 37 35 -30 -5 35 20 -28 -12 45 18 -25 3 45 7 -19 12 41
6803 41 -13 -39 23 35 -23 -35 19 5 -39 -20 34 -16 -51 -6 34 -15 -46 11 46 -18 -34 18 33 -21 -19 34 15 -36 -5 43 14
6834 14 -30 4 59 14 -30 1 38 -12 -29 17 34 -23 -28 27 20 -40 -29 35 22 -49 -25 22 5 -42 -11 16 -13 -37 6 37 -19
6865 -19 -37 4 43 -18 -11 25 24 -22 -11 39 9 -28 8 44 4 -49 10 35 -11 -33 6 37 -28 -29 16 22 -29 -7 30 6 -50 -16
6897 -16 35 6 -45 -9 32 -11 -23 7 23 -12 -25 25 34 -24 -24 17 28 -27 -24 34 19 -25 -7 33 -2 -25 11 43 -11 -43 22 32
6929 32 -32 -37 21 14 -38 -28 29 4 -39 -8 37 -9 -46 -2 40 -6 -40 1 24 -15 -28 21 26 -21 -20 28 22 -28 -15 31 28 -33 -4
6962 -4 38 13 -22 2 39 -9 -31 18 36 -30 -37 19 30 -27 -29 24 22 -39 -11 27 -8 -40 0 35 -17 -42 2 37 -15 -41 7 41
6994 41 -16 -26 29 26 -19 -21 40 16 -33 -11 47 9 -30 11 49 -1 -42 18 30 -7 -22 23 12 -31 -28 24 19 -31 -22 19 7 -32 -9
7027 -9 17 -3 -34 12 31 -9 -33 22 34 -18 -34 34 44 -30 -21 27 15 -28 -9 42 8 -46 6 38 -7 -33 17 47 -11 -40 10
7058 10 29 -30 -18 28 8 -40 -15 28 -3 -42 -5 30 -10 -50 -4 31 -24 -34 11 19 -32 -22 34 23 -40 -19 42 22 -37 -10 47
7089 47 2 -32 12 33 -17 -36 33 34 -30 -42 25 30 -36 -36 24 20 -35 -18 34 0 -49 -5 39 -12 -49 0 43 -5 -44 10 34 -16
7121 -16 -19 27 32 -23 -17 47 14 -52 -19 36 7 -32 8 39 -3 -42 22 35 -30 -27 32 22 -42 -27 38 22 -44 -30 36 6 -38 -11
7153 -11 31 -15 -38 6 28 -18 -47 18 36 -24 -44 27 28 -24 -26 38 17 -32 -1 37 5 -31 17 48 1 -29 17 38 -21 -31 24
7184 24 29 -32 -24 30 17 -52 -20 43 2 -52 -10 43 -5 -42 5 37 -26 -41 20 18 -29 -27 36 19 -48 -28 36 1 -30 -14 32 8
7216 8 -28 7 33 -1 -28 23 42 -13 -30 20 26 -22 -25 19 14 -45 -16 32 2 -54 -9 49 -11 -49 1 34 -23 -34 22 27 -31 -20 36
7249 36 5 -37 -12 41 12 -38 -2 50 4 -33 3 44 -5 -33 17 28 -8 -25 25 27 -30 -33 23 21 -48 -29 27 4 -47 -13 22 -16
7281 -16 -46 7 33 -29 -51 9 26 -32 -39 12 14 -36 -6 36 11 -38 -6 32 9 -48 11 42 -8 -35 5 39 -8 -27 32 27 -33 -25
7313 -25 32 17 -47 -19 45 3 -44 -6 22 2 -39 1 19 -33 -32 15 18 -28 -27 23 13 -32 -32 45 19 -25 -7 32 4 -27 17 33
7345 33 -14 -35 36 47 -22 -31 36 24 -17 -18 33 20 -40 -13 36 -2 -42 -8 39 -12 -46 -1 30 -8 -36 5 24 -26 -23 18 15 -32
7377 -32 -22 26 21 -28 -9 28 10 -29 5 48 1 -35 16 33 -23 -21 28 28 -33 -33 43 21 -35 -7 34 3 -40 -9 31 -12 -40 7
7409 7 26 -17 -41 7 23 -25 -30 14 20 -31 -17 33 9 -34 -10 42 13 -27 -1 46 5 -27 6 44 -7 -20 35 23 -24 -13 36 21
7441 21 -37 -12 43 9 -39 -10 26 -9 -34 10 24 -20 -35 19 21 -28 -34 18 22 -32 -28 28 4 -36 -14 36 3 -29 10 40 -8 -29
7473 -29 17 33 -4 -16 25 24 -13 -21 33 15 -33 -14 34 14 -27 -9 20 0 -37 -3 34 -2 -31 15 21 -24 -39 23 22 -42 -24 40
7505 40 18 -37 -20 39 6 -35 6 42 -11 -30 16 28 -18 -30 25 35 -18 -17 13 12 -27 -17 32 0 -36 -16 30 -2 -54 -2 32
7536 32 -7 -37 0 29 -8 -40 13 23 -34 -24 33 17 -29 -14 30 3 -41 -3 36 -6 -31 22 35 -10 -32 28 22 -35 -14 38 26
7567 26 -41 -8 33 1 -36 -4 38 -4 -32 2 30 -24 -39 11 26 -29 -28 11 25 -29 -14 34 3 -25 -3 29 -4 -31 5 28 -3
7598 -3 -32 7 29 -16 -26 25 12 -31 -19 20 19 -26 -10 39 16 -34 0 35 2 -40 4 33 -17 -44 21 22 -32 -24 16 13 -40 -20 32
7631 32 12 -26 -1 23 1 -31 8 35 -3 -21 18 40 -9 -20 20 45 -12 -11 23 23 -25 -8 35 19 -33 -13 39 -5 -42 -10 38
7662 38 -18 -42 10 14 -34 -30 15 9 -43 -19 27 9 -41 -7 35 -1 -29 -1 28 -6 -21 11 28 -16 -16 26 32 -27 -16 24 34 -21 -17
7695 -17 27 10 -27 -2 29 -1 -41 12 41 -19 -36 10 23 -27 -29 11 14 -34 -17 18 -2 -31 0 36 0 -39 3 32 -13 -28 12
7726 12 31 -18 -13 25 24 -17 -13 42 5 -28 -10 33 12 -43 -11 28 -4 -32 5 24 -20 -38 7 17 -33 -27 21 7 -30 -19 20 5
7758 5 -35 -3 20 -9 -37 5 32 -7 -37 22 29 -22 -17 19 24 -27 -9 36 25 -32 -9 41 2 -29 5 29 -12 -32 7 23 -12 -36
7790 -36 1 11 -26 -11 15 9 -37 -22 25 10 -33 -12 23 0 -28 9 37 -9 -26 17 34 -14 -30 27 26 -19 -19 34 25 -21 -5 35
7822 35 11 -32 6 32 -25 -33 11 22 -23 -31 -8 14 -29 -32 16 4 -33 -11 20 0 -37 -18 29 -1 -37 1 37 -10 -27 17 34 -15
7854 -15 -23 27 34 -21 -7 40 18 -25 5 29 2 -19 6 31 -10 -22 7 31 -20 -34 13 15 -25 -30 8 3 -30 -19 19 4 -42 -6 25
7887 25 -10 -36 -1 16 -9 -30 9 31 -22 -23 18 22 -25 -9 27 0 -25 3 32 -6 -27 -1 33 2 -28 11 24 -18 -22 17 7 -37
7919 -37 -26 14 9 -37 -21 19 -4 -31 -3 35 5 -25 2 28 -11 -43 23 37 -22 -18 23 24 -25 -11 32 28 -20 2 37 9 -17 2
7951 2 33 -2 -26 2 25 -8 -22 9 28 -13 -26 13 10 -34 -19 27 5 -37 -2 21 11 -28 4 33 -6 -29 16 29 -28 -25 23 24
7983 24 -18 -11 34 18 -27 -8 24 4 -22 10 24 -3 -27 7 23 -23 -33 17 25 -14 -35 12 10 -25 -17 20 3 -28 -8 19 0 -15
8015 -15 6 25 -2 -32 21 36 -5 -20 34 21 -20 -12 30 14 -20 -1 43 16 -22 0 35 5 -20 24 38 -12 -24 16 9 -21 -20 21
8047 21 21 -25 -20 31 6 -36 -4 30 -6 -30 5 29 -12 -27 19 40 -8 -19 14 28 -9 -18 25 13 -22 -3 43 11 -26 5 36 -1
8079 -1 -19 10 39 -14 -31 12 20 -19 -35 26 17 -35 -15 22 4 -33 -4 26 -2 -35 1 28 -6 -22 11 32 -13 -19 30 19 -14 -25
8111 -25 33 12 -16 1 34 14 -31 2 38 0 -31 13 27 -6 -24 6 27 -29 -35 21 -2 -37 -21 32 0 -40 -17 22 -14 -44 -9
8142 -9 32 -15 -34 22 26 -14 -14 23 32 -23 -11 39 30 -30 -8 39 10 -18 4 34 -3 -31 9 38 -15 -17 19 22 -26 -31 16 13 -35 -16 25
8177 25 -2 -29 -17 20 -17 -46 -2 36 -20 -35 9 29 -17 -25
8191b5
##END NTUPLES=NMR FID
##END=
