##TITLE=1H_ES-476
 D2O
 8 sc, 
 1.4.2024
##JCAMPDX= 6.0         $$ Bruker NMR JCAMP-DX V2.0
##DATA TYPE= NMR FID
##DATA CLASS= NTUPLES
##ORIGIN= UXNMR, Bruker Analytische Messtechnik GmbH
##OWNER= root
$$ XWIN-NMR		Version 3.5
$$ Mon Apr  1 14:10:57 2024 Russian Standard Time (UT+4h)  she@DPX200
##.OBSERVE FREQUENCY= 200.1313
##.OBSERVE NUCLEUS= ^1H
##.DELAY= (6, 6)
##.ACQUISITION MODE= SIMULTANEOUS
##.ACQUISITION SCHEME= undefined
##.AVERAGES= 8
##.DIGITISER RES= 18
##SPECTROMETER/DATA SYSTEM= spect
##.PULSE SEQUENCE= zg30
##.SOLVENT NAME= D2O
##.SHIFT REFERENCE= (INTERNAL, D2O, 0, 15.7039)
##AUDIT TRAIL= $$ (NUMBER, WHEN, WHO, WHERE, WHAT)
$$ ##TITLE= Audit trail, XWIN-NMR		Version 3.5
$$ ##JCAMPDX= 5.01
$$ ##ORIGIN= Bruker BioSpin GmbH
$$ ##OWNER= she
$$ F:/spectra/data/she/nmr/H-F/1/audita.txt
$$ ##AUDIT TRAIL=  $$ (NUMBER, WHEN, WHO, WHERE, WHAT)
(   1,<2024-04-01 14:08:55.50 +0400>,<she>,<DPX200>,
      <created by zg, POWCHK disabled, PULCHK disabled
       configuration hash MD5:
       00 E9 B6 7A A2 85 ED C7 34 08 36 98 17 FE 4E 26
       data hash MD5: 16K
       B4 E7 EE 8E FD 8B B6 DE 00 03 52 03 60 E6 E9 E0>)
$$ ##END=
$$ 
$$ hash MD5
$$ 83 58 AE 49 DB 4B F7 D4 B1 EB D3 26 54 89 A3 CD
##$RELAX= 
##$RELAX= 
##$RELAX= 
##$RELAX= 
##$RELAX= 
##$RELAX= 
$$ Bruker specific parameters
$$ --------------------------
##$DU= <F:/spectra>
##$EXPNO= 1
##$NAME= <H-F>
##$PROCNO= 1
##$TYPE= <nmr>
##$USER= <she>
##$AMP= (0..31)
100 100 100 100 100 100 100 100 100 100 100 100 100 100 100 100 100 100 
100 100 100 100 100 100 100 100 100 100 100 100 100 100 
##$AQSEQ= 0
##$AQ_mod= 1
##$AUNM= <au_zg>
##$AUTOPOS= <>
##$BF1= 200.13
##$BF2= 200.13
##$BF3= 200.13
##$BF4= 200.13
##$BF5= 200.13
##$BF6= 200.13
##$BF7= 200.13
##$BF8= 200.13
##$BYTORDA= 1
##$CFDGTYP= 0
##$CFRGTYP= 5
##$CHEMSTR= <none>
##$CNST= (0..31)
1 1 145 1 1 1 1 1 1 1 1 1 1 1 1 1 1 1 1 1 1 1 1 1 1 1 1 1 1 1 1 1 
##$CPDPRG= <>
##$CPDPRG1= <>
##$CPDPRG2= <>
##$CPDPRG3= <>
##$CPDPRG4= <mlev>
##$CPDPRG5= <mlev>
##$CPDPRG6= <mlev>
##$CPDPRG7= <mlev>
##$CPDPRG8= <mlev>
##$CPDPRGB= <>
##$CPDPRGT= <>
##$D= (0..31)
0 1.2 0 0 0 0 0 0 0 0.06 0 0.03 0 0 0 0 0.0002 0 0 0 0 0 0 0 0 0 0 0 0 
0 0 0 
##$DATE= 1711966135
##$DBL= (0..7)
120 120 120 120 120 120 120 120 
##$DBP= (0..7)
150 150 150 150 150 150 150 150 
##$DBP07= 0
##$DBPNAM0= <>
##$DBPNAM1= <>
##$DBPNAM2= <>
##$DBPNAM3= <>
##$DBPNAM4= <>
##$DBPNAM5= <>
##$DBPNAM6= <>
##$DBPNAM7= <>
##$DBPOAL= (0..7)
0.5 0.5 0.5 0.5 0.5 0.5 0.5 0.5 
##$DBPOFFS= (0..7)
0 0 0 0 0 0 0 0 
##$DE= 6
##$DECBNUC= <off>
##$DECIM= 32
##$DECNUC= <off>
##$DECSTAT= 4
##$DIGMOD= 1
##$DIGTYP= 9
##$DL= (0..7)
0 120 120 120 120 120 120 120 
##$DP= (0..7)
150 150 150 150 150 150 150 150 
##$DP07= 0
##$DPNAME0= <>
##$DPNAME1= <>
##$DPNAME2= <>
##$DPNAME3= <>
##$DPNAME4= <>
##$DPNAME5= <>
##$DPNAME6= <>
##$DPNAME7= <>
##$DPOAL= (0..7)
0.5 0.5 0.5 0.5 0.5 0.5 0.5 0.5 
##$DPOFFS= (0..7)
0 0 0 0 0 0 0 0 
##$DQDMODE= 0
##$DR= 18
##$DS= 0
##$DSLIST= <SSSSSSSSSSSSSSS>
##$DSPFIRM= 0
$$ [...]
##$SUBNAM2= <"">
##$SUBNAM3= <"">
##$SUBNAM4= <"">
##$SUBNAM5= <"">
##$SUBNAM6= <"">
##$SUBNAM7= <"">
##$SUBNAM8= <"">
##$SUBNAM9= <"">
##$SW= 18.0517328524113
##$SWIBOX= (0..15)
0 0 2 0 0 0 0 0 0 0 0 0 0 0 0 0 
##$SW_h= 3612.71676300578
##$TD= 16384
##$TD0= 1
##$TE= 0
##$TE2= 300
##$TE3= 300
##$TEG= 300
##$TL= (0..7)
0 120 120 120 120 120 120 120 
##$TP= (0..7)
150 150 150 150 150 150 150 150 
##$TP07= 0
##$TPNAME0= <>
##$TPNAME1= <>
##$TPNAME2= <>
##$TPNAME3= <>
##$TPNAME4= <>
##$TPNAME5= <>
##$TPNAME6= <>
##$TPNAME7= <>
##$TPOAL= (0..7)
0.5 0.5 0.5 0.5 0.5 0.5 0.5 0.5 
##$TPOFFS= (0..7)
0 0 0 0 0 0 0 0 
##$TUNHIN= 0
##$TUNHOUT= 0
##$TUNXOUT= 0
##$USERA1= <user>
##$USERA2= <user>
##$USERA3= <user>
##$USERA4= <user>
##$USERA5= <user>
##$V9= 5
##$VALIST= <valist>
##$VCLIST= <CCCCCCCCCCCCCCC>
##$VD= 0
##$VDLIST= <DDDDDDDDDDDDDDD>
##$VPLIST= <PPPPPPPPPPPPPPP>
##$VTLIST= <TTTTTTTTTTTTTTT>
##$WBST= 1024
##$WBSW= 4
##$XGAIN= (0..3)
0 0 0 0 
##$XL= 0
##$YL= 0
##$YMAX_a= 14312
##$YMIN_a= -13911
##$ZGOPTNS= <>
##$ZL1= 120
##$ZL2= 120
##$ZL3= 120
##$ZL4= 120
##$ABSF1= 10
##$ABSF2= 0
##$ABSG= 5
##$ABSL= 3
##$ALPHA= 0
##$AQORDER= 0
##$ASSFAC= 0
##$ASSFACI= 0
##$ASSFACX= 0
##$ASSWID= 0
##$AUNMP= <proc_1d>
##$AZFE= 0.1
##$AZFW= 0.1
##$BCFW= 1
##$BC_mod= 2
##$BYTORDP= 1
##$COROFFS= 0
##$CY= 11.3945322036743
##$DATMOD= 1
##$DC= 2
##$DFILT= <>
##$DTYPP= 0
##$F1P= 15.7292609196834
##$F2P= 12.9074282941183
##$FCOR= 0.5
##$FTSIZE= 0
##$FT_mod= 4
##$GAMMA= 1
##$GB= 0.15
##$INTBC= 1
##$INTSCL= 1
##$ISEN= 128
##$LB= 0.24
##$LEV0= 0
##$LPBIN= 0
##$MAXI= 10000
##$MC2= 0
##$MEAN= 0
##$ME_mod= 0
##$MI= 1.114404
##$NCOEF= 0
##$NC_proc= 0
##$NLEV= 6
##$NOISF1= 3.799351
##$NOISF2= 2.8
##$NSP= 1
##$NTH_PI= 0
##$NZP= 0
##$OFFSET= 15.70392
##$PC= 1
##$PHC0= -25376.74
##$PHC1= 4.58731
##$PH_mod= 1
##$PKNL= yes
##$PPARMOD= 0
##$PSCAL= 0
##$PSIGN= 0
##$REVERSE= no
##$SF= 200.130013532006
##$SI= 16384
##$SIGF1= 3
##$SIGF2= 2
##$SINO= 400
##$SIOLD= 16384
##$SREGLST= <1H.CDCl3>
##$SSB= 0
##$STSI= 0
##$STSR= 0
##$SW_p= 3612.71676300578
##$SYMM= 0
##$S_DEV= 0
##$TDeff= 0
##$TDoff= 0
##$TI= <>
##$TILT= no
##$TM1= 0
##$TM2= 0
##$TOPLEV= 0
##$USERP1= <user>
##$USERP2= <user>
##$USERP3= <user>
##$USERP4= <user>
##$USERP5= <user>
##$WDW= 1
##$XDIM= 8192
##$YMAX_p= 0
##$YMIN_p= 0
$$ End of Bruker specific parameters
$$ ---------------------------------
##NTUPLES= NMR FID
##VAR_NAME=  TIME,          FID/REAL,        FID/IMAG
##SYMBOL=    X,             R,               I
##VAR_TYPE=  INDEPENDENT,   DEPENDENT,       DEPENDENT
##VAR_FORM=  AFFN,          ASDF,            ASDF
##VAR_DIM=   8192,          8192,            8192
##UNITS=     SECONDS,       ARBITRARY UNITS, ARBITRARY UNITS
##FACTOR=    0.0002768,     1,               1
##FIRST=     0,             0,               0
##LAST=      2.2672688,     0,               0
##MIN=       0,             -13911,          0
##MAX=       2.2672688,     14312,           0
$$ Real data points
##PAGE= N=1
##DATA TABLE= (X++(R..R)), XYDATA
$$ [...]
$$ plain form
950 -1766 -34 1733 792 -1366 -1430 710 1725 61 -1723 -844 1309 1435 -686 -1751 -107 1656
966 1656 876 -1286 -1444 617 1726 149 -1676 -885 1243 1460 -579 -1709 -198 1645 917 -1195
982 -1195 -1449 534 1721 230 -1587 -958 1155 1472 -507 -1711 -272 1553 970 -1123 -1505 458
998 458 1680 300 -1554 -1016 1071 1477 -407 -1683 -355 1518 1033 -1054 -1484 372 1670 394
1014 394 -1493 -1047 1016 1509 -335 -1639 -409 1454 1087 -960 -1501 312 1646 441 -1415 -1087
1030 -1087 936 1506 -251 -1627 -478 1407 1090 -900 -1504 205 1588 508 -1372 -1140 849 1504
1046 1504 -185 -1580 -556 1322 1151 -815 -1515 136 1563 567 -1292 -1155 780 1505 -94 -1545
1062 -1545 -595 1275 1176 -730 -1495 66 1538 642 -1241 -1188 699 1488 -31 -1513 -665 1188 1214 -662
$$ packed form
950a766J732J767r41k158o4K140J015j664j784Q79K153J26k121j065J644J763
966A656p80k162j58K061J109j577j825P91K128K17k039j130J511J843p28k112
982a195k54J983J187j491j817O29K113L17j979j204J439J825n83k093l82J963
998D58J222j380j854N38K087M06j884j276J328J873m85k087m30J856J298j276
1014C94j887M46K063M93j844j304J230J863l67k047n41J813J334j205j856L28
1030a087K023N70j757j376J149J885l17j990o04J709J383j080j880K32J989O55
1046A504j689j395J024J878j71j966p00J651J427r96j859J37J935P25j599j451
1062a545R50J870r9j906p65J561J472q96j883N3J887P89j519j482Q48J853K6j876
$$ plain form
1080 -662 -1506 -22 1474 667 -1173 -1230 604 1489 32 -1489 -712 1133 1215 -587 -1491 -104 1455
1097 1455 750 -1108 -1239 555 1477 138 -1408 -752 1084 1257 -490 -1460 -132 1395 794 -1032 -1252
1114 -1252 472 1467 182 -1375 -813 1000 1245 -432 -1449 -240 1348 821 -986 -1273 395 1431
1130 1431 234 -1336 -864 932 1263 -365 -1434 -279 1305 864 -907 -1273 339 1425 311 -1281
1146 -1281 -886 877 1286 -292 -1407 -333 1266 912 -838 -1273 258 1404 367 -1228 -933 802
1162 802 1284 -245 -1394 -401 1193 928 -787 -1307 188 1364 400 -1192 -963 736 1280 -169 -1360
1179 -1360 -450 1148 977 -712 -1298 140 1342 484 -1130 -974 678 1285 -87 -1321 -486 1103 1017
1196 1017 -636 -1284 66 1326 540 -1075 -1024 603 1285 -24 -1316 -572 1042 1016 -586 -1302 -16
$$ packed form
1080f62q44J484J496q07j840n7J834Q85j457j521P77J845Q2j802r04J387J559
1097A455p05j858j31J794R22j339j546O56J836J73j747r70J328J527o01j826k20
1114a252J724R95j285j557N62J813K45j677j017J209J588n27j807k87J668J036
1130A431j197j570M72J796L31j628j069J155J584m41j771l66J612J086j114j592
1146a281L95J763M09j578j115J074J599l54j750m35J531J146j037j595K95J735
1162H02M82j529j149R93J594k65j715n20J495J176r64j592K29J699N44j449j191
1179a360R10J598j71j689n86J438J202q58j614J56J652O07j372j234Q35J589q6
1196A017j653o48J350J260p86j615N1J627O82j309j292P44J614k6j602p16J286
$$ plain form
1213 -16 1270 577 -1029 -1050 543 1276 29 -1269 -614 991 1056 -514 -1290 -63 1252 651 -964 -1056
1231 -1056 490 1290 106 -1236 -639 947 1069 -435 -1262 -122 1217 675 -907 -1096 412 1268 145
1248 145 -1209 -697 878 1075 -402 -1262 -187 1178 712 -863 -1094 347 1259 195 -1164 -746 825
1265 825 1114 -329 -1246 -248 1155 755 -788 -1102 309 1260 271 -1117 -773 776 1133 -263 -1221 -284
1283 -284 1101 798 -725 -1113 246 1222 318 -1091 -820 701 1130 -205 -1218 -341 1060 823 -687
1300 -687 -1120 161 1211 364 -1035 -836 645 1127 -144 -1196 -405 1024 851 -616 -1134 114 1191
1317 1191 433 -982 -860 608 1130 -67 -1164 -430 966 885 -564 -1128 61 1147 467 -948 -893
1334 -893 528 1108 -25 -1155 -494 911 888 -529 -1129 -8 1115 503 -897 -918 477 1142 28
$$ packed form
1213a6J286o93j606k1J593P33j247j298O55J605O5j570p76J227J315o01j615r2
1231a056J546Q00j184j342N97J586J22j504q27J140J339n42j582j89J508Q56j123
1248A45j354N12J575J97j477q60J075J365m66j575k31J441R12j064j359M18J571
1265H25K89j443r17R98J403m00j543l14J411R51r89j388L44J549L57j396r58R37
1283b84J385l03j523l88J359R76r04j409K71J521M29j335j013Q77J401k37j510
1300f87m33J281J050q47j399J99J481M82j271j052P91J429j73j467n18J248J077
1317A191p58j415J22J468N22j197j097P34J396q1j449n64J189J086o80j415N5
1334h93J421N80j133j130O61J405k3j417o00J121J123o12j400k1J395O65j114
$$ plain form
1351 28 -1106 -532 881 915 -453 -1127 -45 1103 571 -828 -930 427 1118 93 -1075 -574 829
1368 829 950 -386 -1099 -102 1067 607 -800 -944 370 1105 120 -1057 -608 746 955 -338 -1107 -163
1386 -163 1040 642 -749 -961 304 1111 191 -1009 -645 736 981 -273 -1093 -215 1014 671 -684
1403 -684 -968 263 1097 247 -981 -673 680 989 -221 -1085 -262 958 702 -643 -989 193 1070 275
1421 275 -958 -723 611 995 -187 -1067 -310 920 723 -608 -992 141 1064 311 -915 -740 584
1438 584 1002 -112 -1036 -338 895 766 -530 -983 116 1051 386 -864 -764 531 1001 -68 -1036 -391
1456 -391 857 773 -496 -1002 46 1022 414 -839 -781 466 996 -26 -1016 -433 798 805 -451 -1001 -5
1475 -5 998 452 -781 -811 418 1013 40 -958 -464 769 829 -366 -978 -55 978 507 -734 -830 371
$$ packed form
1351B8j134N74J413L4j368o74J082J148n32j399j02J357O91j025j168N01J403
1368H29J21j336p13R97J169m60j407j44J314P35r85j177M49J354K09j293p69R44
1386a63J203l98j391k12J265Q07r20j200L64J381K45j254q20Q78J229l43j355
1403f84k84J231Q34q50j228L08J353L09j210q64Q23J220k56j345l46J182Q77p95
1421B75j233K35J334L84j182q80P57J230j97j331l84J133R23p53j226J75J324
1438E84M18j114r24O98J233j29j296m53J099R35o65j250J00J295M70j069r68O45
1456c91J248q4j269n06J048R76o08j253N8J247N30j022r90N83J231Pj256n50R96
1475eJ003n46j233l0J229N95r73r98M94J233O0j195o12R23J033m71j241r6J201
$$ plain form
1494 371 997 93 -953 -513 716 840 -344 -997 -106 936 531 -702 -861 308 976 124 -932 -557
1512 -557 665 851 -289 -984 -151 915 549 -660 -855 266 985 178 -889 -572 640 870 -241
1529 -241 -951 -188 895 602 -601 -863 228 990 222 -857 -599 612 874 -178 -956 -240 846 616
1547 616 -574 -878 162 942 257 -844 -634 548 876 -157 -952 -281 813 662 -528 -875 123 948
1565 948 307 -784 -652 503 901 -74 -914 -311 790 681 -453 -876 90 919 351 -749 -678 459
1583 459 894 -42 -913 -370 745 695 -423 -903 22 905 383 -725 -725 380 892 -4 -897 -393 708
1602 708 716 -381 -888 -28 882 421 -685 -725 359 908 55 -852 -410 690 752 -323 -877 -51 861 468
1622 468 -645 -752 314 876 94 -849 -460 636 753 -292 -886 -120 819 475 -619 -766 261 865
$$ packed form
1494C71O26r04j046M40J229J24j184o53Q91J042m05j233j59J169O68q52j056L75
1512e57J222J86j140o95Q33J066l66j209j95J121P19q07j067L17J212K30j111
1529b41p10P63J083k93j203k62J091P62p68j079K58J211K62j052p78P16J086k30
1547F16j190l04J040P80o85j101K10J182L28j033p95O71J094j51j190l47R98Q25
1565I48o41j091J32J155L98r75q40O03J101j09j134m23R66Q29n68j100P1J137
1583D59M35r36q71N43J115n0j118m80R25Q83n22j108%J105N12q96q93N04J101
1602G08Qj097n07Q60R10m61j106m0J084N49q53r07M42J100O2j075n54Q26R12l93
1622D68j113j07J066N62p82r43L89J096J17j045n94P66R39l44j094j47J027O04
$$ plain form
1640 865 120 -832 -504 586 759 -246 -888 -145 815 527 -572 -773 222 881 182 -778 -531 561 783
1659 783 -174 -862 -193 790 554 -533 -764 175 851 210 -758 -564 509 787 -161 -860 -238 737 557
1678 557 -489 -803 130 836 237 -727 -588 467 791 -118 -839 -270 725 596 -447 -791 99 839 293
1697 293 -688 -596 449 814 -65 -804 -304 695 624 -396 -796 59 826 326 -666 -631 383 794 -25 -808
1717 -808 -346 641 611 -375 -799 -14 784 356 -641 -642 337 791 21 -787 -377 611 657 -319 -797 -28 781
1738 781 404 -579 -653 309 803 67 -766 -390 601 667 -281 -789 -77 755 415 -561 -683 257 794 90 -749
1759 -749 -427 548 667 -250 -788 -135 726 431 -536 -697 207 774 123 -723 -479 507 696 -200 -777 -157
1779 -157 720 470 -482 -691 186 787 187 -681 -482 488 712 -148 -771 -191 690 500 -451 -700 133 757
$$ packed form
1640H65p45r52L28J090J73j005o42P43R60k88j099k01R95O59o99r60K47J092K22
1659G83r57o88O69R83k36j087k31R39O76o41r68J94J073K78r48o99O22R75j80
1678E57j046l14R33P06n99r64J39J055L24r09p21N69R95j29j043l44Q90P40n46
1697B93r81R2J045L65q79p39N00R99p1j020m00Q55P67n00r92L5J014M11q19p83
1717h08M62R87l0r86m24P85P98m28r97jR79M54p70q08M10R88M6r76m78P69Q09
1738G81l77r83p4R62M94p36q33L76R91O6r48n08P12Q32l40r76j22R40N37p04q39
1759g49L22R75J19r17n38O53Q61k95r67j61R04N67o51q46K44R86J89q96n77O20
1779a57Q77k50r52k09Q77O01o00q68J99R70K24q60o23N80Q81j90r51k49Q33O24
$$ plain form
1799 757 208 -691 -526 441 704 -121 -771 -230 648 517 -433 -718 86 744 239 -652 -542 396 713 -81
1819 -81 -743 -259 632 543 -382 -704 49 755 288 -608 -551 377 730 -30 -727 -272 609 565 -352 -727 19
1840 19 719 292 -605 -575 310 711 -6 -727 -330 559 577 -306 -729 -24 705 327 -565 -588 285 728 36
1861 36 -700 -356 536 603 -265 -711 -49 698 368 -520 -594 249 732 74 -675 -364 511 615 -237 -720 -93
1882 -93 664 391 -499 -618 201 705 100 -673 -422 472 608 -201 -729 -133 631 405 -463 -640 178 708
1902 708 138 -637 -419 452 637 -167 -685 -152 640 448 -426 -620 144 698 189 -605 -456 416 645 -112
1922 -112 -691 -180 595 461 -392 -640 100 673 199 -600 -485 373 637 -93 -691 -227 569 470 -374 -645
1942 -645 61 666 229 -569 -486 352 653 -48 -662 -246 562 514 -315 -637 46 674 271 -547 -492 307 648
$$ packed form
1799G57n49q99J65R67K63q25o50N41Q78j31r50k85Q04O58n05q91J10R38L17p94
1819h1o62M84Q91q9r25l22P53P06m67q96N7R28L53p60o97M55Q81m4r17l75P46
1840A9P00m27q97L0Q85M01p17p21L97Q89J8q83m23P05P29l78q92k3Q73M43o92
1861C6p36L44Q92O7q68m46O62P47l30q88p4Q43M83o58p49L11Q75J04q52m83O27
1882i3P57k73q90j19Q19N04o05p73K51Q94J36q09n28N96P64k26q68j77Q18N30
1902G08n70p75K18Q71J85q04n18N33P92j92q74j94P64N54n09p94J49Q72K29p57
1922a12n79N11P75j34q53k48P40N73m74p99J15Q58K64p30n98M64P96r9q44k71
1942f45P06O05m37p98Q3Q38L01p01o14M16Q08m8q29l22O83O28m03q18N5P99L41
$$ plain form
1963 648 -14 -649 -267 539 517 -311 -655 -1 648 279 -522 -519 276 634 16 -656 -311 497 514 -271 -651
1984 -651 -43 636 319 -491 -533 241 661 60 -610 -311 488 558 -220 -639 -53 616 352 -459 -536 214 649
2005 649 90 -602 -350 444 562 -194 -647 -107 593 353 -443 -570 173 634 102 -587 -388 399 558 -165
2025 -165 -641 -125 581 386 -406 -571 142 640 154 -560 -397 395 594 -129 -616 -142 565 429 -354 -564
2045 -564 111 629 189 -533 -403 367 584 -102 -629 -184 533 423 -346 -595 62 613 192 -535 -444 322
2065 322 574 -68 -623 -207 509 442 -320 -594 56 609 238 -503 -447 294 596 -21 -590 -232 497 460 -267
2086 -267 -574 23 605 266 -477 -455 271 593 0 -588 -261 461 472 -257 -597 -25 571 272 -464 -489 224
2107 224 583 22 -582 -291 435 473 -228 -590 -49 567 311 -419 -491 218 595 76 -545 -302 423 512 -179
$$ packed form
1963F48o62o35L82Q06k2q28l44O54O49l69q01LP95L58o18o72L45Q08J7p85l80
1984f51O08O79l17q10m2P74M20o01o70K99P99P0p78m19N86O69k64q11p7P50M35
2005F49n59o92K52P94J18p56m53N40P00k40p96j27P43M61n32o89J99P87J59p23
2025a65m76N16P06j95p92j65P13M98m86p14J63P92J99p23m87M74P07j36p83k10
2045e64O75N18m40p22J30P70K17o86n27M45P17j10p69k49O57N51m21p27R1P66
2065C22K52o42n55M16P16o7p62k74O50N53l71p41N6P41L02o17n69L58P29l7p27
2086b67l07N97N82l39p43K2P26L22n93n88L27P22J1p29l40N72N96k99p36k5P13
2107B24L59n61o04K91P26L8p01l62N41O16k56p30p2P09L77n19o21K43P25Q9o91
$$ plain form
2128 -179 -577 -66 554 322 -401 -496 187 585 96 -551 -335 383 506 -171 -586 -114 536 328 -386 -520
2148 -520 137 575 103 -539 -354 352 515 -136 -581 -128 513 363 -349 -525 132 593 165 -491 -369 339
2168 339 526 -92 -560 -153 499 389 -326 -524 83 563 164 -482 -386 313 528 -77 -560 -187 467 386 -307
2189 -307 -531 43 547 199 -476 -404 278 531 -53 -552 -222 447 417 -276 -531 24 553 236 -436 -409 270
2210 270 547 0 -518 -218 436 459 -228 -532 -4 537 249 -417 -429 218 541 12 -530 -271 408 432 -226
2231 -226 -547 -35 518 258 -402 -451 188 536 46 -520 -273 384 445 -184 -532 -58 511 281 -373 -437 180
2252 180 538 80 -494 -281 376 468 -160 -517 -69 497 300 -353 -463 147 526 96 -490 -319 329 448
2272 448 -135 -534 -113 455 308 -343 -474 108 517 126 -475 -333 314 475 -102 -520 -134 465 343 -296
$$ packed form
2128a79l98N11O20k32p23r5O83L98m89o47K16P18J23o77m15M72O50k08p14j34
2148e20O57M38m72o42J85P06J63o51m45M53O41j50p12j76O57M61m28o56J22P08
2168C39J87o18m68M07O52j10p15j98O07M80l99o46R6O99K15o05m83L73O54q1o93
2189c07k24N74N04l48o75P2O82K53n84m99L30O69l0o93k55N55N29l17o72K7O79
2210B70K77n47n18L00O54K3o87l04N28N41k88o66j2O47L23n29n42K59O79K4o58
2231b26l21N12N53k60o60m9O39L48m90n66K47O57O1o29l48M74N69k30o54o4O17
2252A80L58m58n74K13O57R2o28l57M48N66j97o53j10O10L79m30n86J71O48J19
2272D48n83l99M21N68j47o51j31N82M09l91o01J42O47J61n77m18L86N99j22o39
$$ plain form
2292 -296 -462 105 517 148 -442 -337 298 477 -71 -516 -148 445 351 -283 -478 60 507 152 -438 -355 261
2313 261 472 -58 -513 -184 417 356 -274 -491 27 496 181 -427 -375 253 485 -40 -487 -206 398 391 -232
2334 -232 -475 26 493 215 -387 -384 233 503 6 -478 -212 388 405 -217 -484 -7 479 227 -379 -389 194
2355 194 480 9 -471 -250 356 397 -198 -500 -41 466 245 -370 -403 159 496 46 -475 -259 343 422 -148
2376 -148 -477 -57 475 272 -321 -402 163 511 79 -442 -271 321 424 -135 -480 -82 444 278 -324 -424
2396 -424 117 475 76 -455 -306 298 419 -136 -494 -118 418 287 -306 -428 103 473 110 -433 -306 278
2416 278 440 -92 -467 -119 409 331 -263 -421 79 476 136 -401 -304 259 448 -54 -469 -142 397 319 -257
2437 -257 -438 42 450 153 -400 -340 230 441 -56 -474 -174 378 339 -236 -437 24 453 174 -379 -334 227
$$ packed form
2292b96j66N67M12l69n90J05O35J79n48m45L68N93r4o34j95N38M47l55n90Q3O16
2313B61K11n30m55L29O01o1o30k17N18M69l15o08N2O28K32n25m47K81O04po23
2334b32k43N01M67k78o02LO17K70m97m84K66O00J7o22k67M77M86k52o06j0N83
2355A94K86m71m80K21O06M1n95l02M59N07k21o15l3N62L37m50n21K16O02P9n70
2376a48l29M20N32k03n93q1N65L48m32n21J71N92J03n59l45L98N26j66o02j00
2396d24N41L58l99n31J49O04J21n55l58L76N36j31n93j22N31L70l63n43J27N84
2416B78J62n32l75L48N28p8n94j58N00L97l40n37R7N63J89n02m15L27N39p8n76
2437b57j81M80M08k97n53O0N70K11m97m18L00N52l9n75k01M61M29k79n53M5N61
$$ plain form
2458 227 442 -24 -436 -173 372 363 -197 -431 12 448 216 -347 -338 208 455 16 -443 -202 355 365 -185 -446
2480 -446 -11 433 213 -352 -369 168 432 19 -441 -221 331 358 -178 -450 -30 425 225 -319 -372 157 441
2501 441 46 -414 -236 315 391 -142 -438 -53 429 255 -295 -357 143 450 87 -403 -236 290 387 -133 -433
2522 -433 -86 388 255 -288 -397 106 447 80 -398 -277 267 376 -109 -444 -101 397 267 -270 -384 95
2542 95 438 114 -380 -268 266 415 -66 -419 -105 386 307 -231 -383 70 438 142 -371 -284 228 414 -52
2563 -52 -434 -130 354 297 -228 -400 45 417 131 -365 -316 211 395 -45 -421 -148 337 312 -207 -403 25
2584 25 414 167 -338 -309 199 415 -3 -398 -158 343 314 -172 -394 -6 408 189 -310 -315 176 402 14 -397
2606 -397 -190 308 323 -177 -406 -18 395 193 -296 -340 141 401 14 -398 -214 292 327 -146 -400 -35 382
$$ packed form
2458B27K15m66m12K63N45rn60k34M43M36k32n63RN46K47m39m59K41N57J0n50k61
2480d46M35M44k20n65j7N37K64m13m60K20N52K7n36k72M20M55k00n44n3N29K84
2501D41l95m60J78N51P6n33k96L85M82j74n50o2N00L07l63m90J67N26R7n20l00
2522d33L47M74j33n43j09N03L41l67m78J21N44J09m85l35L43M98j30n37j14M79
2542I5L43l24m94J12N34J49m81l53L14M91p9n38j52M53L68k96n13Q7N12J86m66
2563e2l82L04M84n7n25j72M45L72k86m96M9N27J84m40l76K73M85k5n19j96M28
2584B5L89k47n05K9N08K16m18l95K40N01k9m86k22L88M14k19m99nM91K26l88m11
2606c97K07M98J5n00k29L88M13k02m89m4M81K60l87m12J84N06L5m73k54L65M17
$$ plain form
2627 382 217 -291 -332 142 419 59 -375 -204 285 367 -124 -392 -49 380 239 -262 -343 126 411 73 -368
2648 -368 -223 265 347 -109 -399 -72 361 235 -275 -355 87 384 76 -365 -256 235 360 -93 -402 -86 357
2669 357 259 -226 -351 91 401 111 -335 -245 235 372 -57 -387 -105 352 279 -213 -342 64 386 129 -330
2690 -330 -269 203 355 -52 -393 -134 328 268 -198 -373 28 378 129 -319 -289 176 361 -31 -387 -148 309
2711 309 286 -186 -363 29 384 155 -309 -280 176 370 -7 -367 -151 306 299 -167 -350 1 372 172 -285
2732 -285 -290 156 368 14 -371 -169 284 299 -153 -372 -25 352 158 -284 -309 129 348 11 -356 -186 259
2753 259 311 -126 -357 -26 346 189 -257 -303 122 376 47 -326 -189 260 324 -99 -351 -54 337 209 -240
2774 -240 -317 93 366 55 -351 -215 222 305 -98 -360 -81 316 209 -231 -328 86 355 75 -322 -226 219
$$ packed form
2627C82j65n08m1M74K77l60m34J71M89Q2m91k68L43M29j41n01q1M69K85l38m41
2648c68J45M88Q2m56k90L27M33j26n10q0M42K97l08m41J09M91J25m53l09L16M43
2669C57r8m85j25M42L10k90m46R0M80J37m29l30K82M57p3m92j29M06L22k57m59
2690c30O1M72J52m07l41K59M62o0m66j75M01L50k49m48L0M65J85l92l56K39M57
2711C09k3m72j77L92L55k29m64K9M56J94l77l60K16M57pm66j83L51L71k00m57
2732b85nM46K12l54l85K02M53J5m52k19L47L77j94m42k5M38K19l37l67J70M45
2753B59N2m37k31L31L72j57m46m6M25K54l29l73J37M49O4m23k52K97L91j28m49
2774b40p7M10K73l11m06J36M37Q3m03k62K79L97j07m40r7M14K69k80l97R6M45
$$ plain form
2795 219 314 -74 -355 -83 322 247 -211 -313 67 367 107 -309 -230 204 338 -53 -358 -94 308 242 -192
2816 -192 -321 56 347 92 -309 -240 177 321 -55 -352 -126 279 230 -195 -330 25 338 111 -309 -251 173
2837 173 328 -29 -334 -127 277 251 -158 -315 10 333 148 -260 -253 157 329 -4 -336 -135 261 268 -152 -323
2859 -323 -3 327 141 -265 -265 139 314 4 -337 -160 247 258 -136 -339 -24 305 163 -254 -288 117 321
2880 321 17 -319 -158 241 279 -97 -315 -30 319 185 -214 -279 112 331 36 -297 -169 231 279 -95 -329
2901 -329 -45 297 175 -229 -283 82 316 42 -307 -206 198 274 -95 -313 -63 296 177 -207 -290 74 318
2922 318 71 -289 -194 194 294 -62 -314 -65 299 205 -184 -277 63 309 91 -270 -202 189 297 -48 -316
2943 -316 -97 266 212 -181 -306 36 312 91 -280 -225 156 280 -47 -318 -99 250 202 -163 -289 19 304
$$ packed form
2795B19R5l88k81K72M05p5m58j02L80L00k60m16P9M34J34l91l05K64M02o6m34
2816a92j29L77K91k55m01O9M17J44l76k97K26M05m9m25j35L55L13k27m20N8M24
2837A73J55l57l05K07M04k6m09j57L25L23j85m08PM10J72l33l32K01L96Pm20j71
2859c23L20L30j86m06%M04J75l10l41J77M07J1l94k03L15L29j42m17l4M05K04
2880C21l04l36J61L99L8l76k18K85L49j34l99o5L91K19k95l33J28M00M8l74k34
2901c29K84L42j22m04n4L65K34k74l49J01M04P6l69k18K50L59j19l84q3L64K44
2922C18k47l60R5L88J00l56k52K49L64r4l89r3L40K46k18l61O8L91J08l45k68
2943c16K19L63n4l93j25L42K76k21l71N5L81J24l27k71K19L49m8l65j26L08K85
$$ plain form
2964 304 101 -256 -219 152 286 -24 -305 -106 250 231 -141 -282 27 309 124 -234 -212 150 298 -1 -287
2985 -287 -119 242 235 -128 -293 -3 294 121 -237 -248 104 270 -12 -302 -142 211 230 -132 -295 -13 290
3006 290 144 -218 -241 108 299 29 -279 -145 237 255 -89 -288 -13 281 161 -212 -238 101 290 38 -269
3027 -269 -151 202 243 -87 -295 -45 274 154 -197 -251 69 285 28 -267 -175 178 230 -77 -286 -64 244
3048 244 171 -182 -257 73 283 52 -255 -160 178 255 -60 -268 -43 258 192 -164 -251 54 283 75 -240 -180
3070 -180 160 247 -48 -275 -74 228 183 -162 -260 30 258 68 -244 -191 124 250 -38 -274 -97 222 178 -144
3092 -144 -261 31 270 89 -218 -191 134 256 -10 -265 -91 228 210 -121 -251 18 266 110 -214 -199 129
3113 129 251 -6 -269 -117 203 190 -124 -252 2 253 105 -221 -226 102 249 -13 -262 -122 206 195 -111
$$ packed form
2964C04k03l57L7L71J34l10k81J99L56j9l72j41L09K82j85l58K2L62J48k99k86
2985b87J68L61pl63j65K90K97j73l58j1L52J66k82k90J60L53J9l62j63K82L03
3006B90j46l62k3L49J91k70l08J34L82J8l44j99K75K94j20l73k6L39J89k52l07
3027b69J18L53M1l30k08K50L19j20l51n4L20K16k57k95R2L53N2l07k09K22L08
3048B44p3l53p5L30K10k31l07R5L38P7l15k08K25L01o6l56q7L05K29k08l15O0
3070a80L40Q7k95k27K01L02m5l45r8K90K28j90l12N3L15J26k88k36J77L19m4l22
3092a44j17K92K39j81l07K7L25J22k66k55J74L19j8l31j30K69K48j56l24J5L28
3113A29J22k57k63J52L20j3l14j28K54K51j48l26nL28J47k62k49J40L28j1l06
$$ plain form
3134 -111 -259 -16 244 124 -195 -213 99 251 10 -241 -114 190 214 -92 -251 -12 248 132 -185 -219 79
3155 79 250 28 -231 -144 168 201 -85 -258 -52 225 116 -185 -227 61 246 24 -242 -137 164 208 -74 -256
3177 -256 -37 234 150 -155 -216 56 246 51 -217 -141 164 217 -47 -240 -41 222 159 -144 -213 46 251 57
3199 57 -207 -147 152 212 -49 -248 -54 195 148 -144 -226 32 226 59 -222 -166 127 212 -34 -231 -77 204
3221 204 164 -128 -222 29 230 95 -195 -158 133 223 -5 -215 -75 202 172 -110 -209 30 227 73 -194 -169
3243 -169 110 211 -22 -226 -100 181 174 -112 -227 2 205 77 -194 -181 86 201 -18 -232 -94 165 166 -98
3265 -98 -214 2 220 94 -155 -170 93 226 18 -211 -92 175 187 -79 -212 -15 220 109 -154 -182 72
3286 72 210 1 -210 -117 155 172 -82 -217 -33 206 113 -162 -188 60 211 26 -211 -126 150 188 -67 -210
$$ packed form
3134a11j48K43K60j20l19j8L12J52k41k51J27L04K4l06j59K39K60j16l17l4K98
3155G9J71k22k59Q7L12L3k86j73K06K77j09l01m2K88J85k22k66J05L01M4k82j82
3177b56K19K71q4l05o1K72J90j95k68P6L05N3k64j93J99K63o3l03o9K59K05j94
3199E7k64O0K99O0k61j99J94K49m7k92q2K58J94j67k81N6K93Q5k46j97J54K81
3221B04m0k92r4K51K01j35k90L7K91R0k28k10J40K77l0k82r9K39J97j54k67K5
3243a69K79J01k33k04J26K81pk86j15K29K03j28k71J3K67J15k19k14J38K59Jk64
3265i8j16K16K18j26k49j5K63J33k08k29J19K67J2k66j33J97K35j11k63k8K54
3286G2J38k09k11R3K72J7k54j35J84K39r3k75k6K48J51j85k37Q5K76L8k55j43
$$ plain form
3308 -210 -33 195 123 -140 -173 68 220 56 -189 -122 144 202 -52 -198 -27 197 141 -130 -184 54 199 48
3330 48 -189 -131 121 179 -46 -217 -51 178 126 -130 -189 27 194 51 -195 -138 109 194 -21 -196 -64 185
3352 185 144 -100 -187 32 203 70 -171 -129 120 194 -16 -187 -58 177 138 -102 -180 33 199 61 -168 -160 99
3375 99 183 -23 -206 -78 154 141 -101 -198 6 189 67 -174 -156 92 179 -15 -197 -81 164 150 -78 -182
3397 -182 3 195 81 -140 -146 88 196 2 -186 -89 155 153 -72 -191 -13 184 82 -149 -157 68 186 11
3419 11 -190 -90 133 142 -78 -188 -17 173 85 -133 -166 61 169 14 -180 -108 148 152 -56 -173 -11 181 107
3442 107 -113 -147 58 190 34 -163 -106 133 156 -47 -187 -28 173 100 -127 -168 38 182 22 -171 -113 110
3464 110 160 -51 -186 -45 151 94 -126 -165 32 171 27 -164 -109 110 161 -34 -163 -33 160 121 -101 -153
$$ packed form
3308b10J77K28p2k63l3K41J52j64k45O7K66N8k54j46J71K24n6k71n4K38J45j51
3330D8k37N8K52N8k25j71J66K29n2k56n9K16J67j43k46N7K47Q5k15j75J32K49
3352A85m1k44q7K19J71j33k41M2K49P4k10j71J29K35l9k40p8K13J66j38k29QK59
3375I9Q4k06j83J28K32j3k42r7K04J83j22k41J8K48Q7j94j82J16K45j4k28j04
3397a82J85J92j14k21oK34J08j94j88R7K44kk25j19J78J97j02k31qK25J18j75
3419A1k01J00K23Rk20j10J71J90q8k18l3K27J08j55j94P2K56Mk08j17J62J92p4
3442A07k20l4K05J32j56j97N7K39K3k03j40J59K01p3k27m1K06J44j60j93N8K23
3464A10N0k11j35J41J96n7k20l9J97J39j44j91N5K19N1j95j29J30J93l9k22n2
$$ plain form
3486 -153 43 182 53 -151 -97 107 167 -21 -171 -49 146 114 -102 -174 13 167 42 -145 -133 86 157 -30
3508 -30 -178 -66 132 111 -105 -177 17 172 48 -148 -115 87 163 -6 -167 -59 139 131 -76 -153 10 173 73
3531 73 -133 -116 87 169 -6 -162 -69 146 131 -73 -158 -13 147 69 -135 -143 55 146 -16 -170 -83 129 129 -72
3555 -72 -168 -19 151 69 -131 -144 68 152 1 -143 -63 130 144 -56 -145 3 156 81 -105 -130 53 169 29
3578 29 -153 -83 119 133 -47 -154 -4 139 76 -104 -140 36 150 8 -150 -95 91 126 -59 -156 -29 130 83
3601 83 -115 -133 39 157 33 -130 -88 98 141 -20 -133 -14 146 101 -86 -124 31 153 44 -133 -99 92
3623 92 135 -44 -147 -37 123 96 -103 -150 25 139 25 -130 -106 74 132 -19 -157 -47 123 90 -83 -146 27
3646 27 140 31 -126 -99 87 148 -8 -142 -38 135 119 -58 -127 31 153 53 -124 -98 80 141 -10 -147
$$ packed form
3486a53J96J39j29k04N4K04O0j88j50J22J95l2k16p2J87J54j25j87J2K19P1j87
3508c0j48J12J98k1k16p2J94J55j24j96L3K02P6j69j61J08J98qk07p7J63J63j00
3531G3k06J7K03Q2j75j56R3K15j5k04q5J45J60p8k04qJ98R1j62j54Q7K12%k01
3555g2r6J49J70q2k00j3K12Q4j51j44Q0J93J4k00q9J48J53p5j86k5J83J16j40
3578B9j82P0K02J4j80j07J50J43o3j80l6J76J14j42j58N5J86L5j85r7J27J59m7
3601H3j98j8J72J18j24j63M2J86M3j61j13J19J60m5j87l8J55J22j09j77L4J91
3623I2M3j79j03J10J60k7j99m7J75J14j14j55K4J80N8j51j38J10J70l3j73o3J73
3646B7J13j09j57K7J86O1j56j34J04J73j6j77o9J58J22j00j77K6J78O1j51j37
$$ plain form
3668 -147 -52 114 107 -75 -155 -2 123 39 -129 -115 53 139 -13 -142 -68 111 108 -72 -136 -9 141 63 -126 -116
3692 -116 63 137 10 -128 -51 110 118 -48 -138 -4 143 74 -99 -112 54 135 13 -117 -68 106 112 -46 -146 -23
3716 -23 114 70 -97 -121 42 121 0 -134 -79 86 103 -50 -145 -27 125 79 -103 -123 44 141 21 -124 -74 97
3740 97 122 -27 -123 -18 139 76 -93 -115 44 125 24 -116 -82 82 108 -31 -143 -35 111 66 -93 -131 16
3763 16 124 22 -128 -92 72 111 -36 -140 -39 110 85 -81 -119 26 135 34 -117 -88 80 125 -14 -125
3785 -125 -33 120 88 -74 -122 23 129 37 -109 -88 63 117 -17 -123 -45 102 82 -74 -122 6 120 37 -110
3808 -110 -105 58 118 -9 -128 -56 85 82 -67 -121 2 123 46 -95 -91 50 134 1 -117 -42 94 107 -51 -119 2
3833 2 109 51 -90 -99 47 111 -2 -131 -69 89 79 -53 -127 -18 111 39 -100 -108 38 111 5 -126 -69 85 95
$$ packed form
3668a47R5J66pj82q0J53J25q4j68J4J68Q6j52j29P4J79lj80o4J27J50p8j89J0
3692a16J79P4j27j38P7J61Qj66r0J34J47o9j73j3J66Q1j22j30M9J74Oj58j00J23
3716b3J37m4j67k4J63P9j21j34N5J65J7j53r5J18J52m6j82k0J67R7j20j45N0J71
3740I7K5j49r6J05J57o3j69k2J59Q1j01j40L4J64K6j39j12J08J46m5j59l8J47
3763A6J08j02j50L6J64L9j47j04J01J49k5j66l8J45J09j01j51K9J68M5j39j11
3785a25R2J53l2j62m8J45J06r2j46K1J51N4j34j06P8J47k0j56m8J28J14q3j47
3808a10NJ63O0j27j19P2J41lj49n4J23J21p7j41MJ41Q4j33j18P5J36J3j58o8J21
3833BJ07n8j41rJ46O4j13j29O2J58j0j32p4J09J29p2j39qJ46P3j06j31N7J54J0
$$ plain form
3858 95 -42 -120 -18 114 66 -93 -118 47 116 30 -107 -67 84 104 -37 -113 -20 119 73 -90 -110 26 112 9
3882 9 -111 -80 69 99 -44 -129 -29 89 56 -77 -108 18 107 18 -108 -80 78 101 -24 -114 -29 103 69 -65 -98
3907 -98 19 115 25 -98 -64 75 116 -10 -112 -29 104 80 -80 -98 15 112 28 -103 -72 55 94 -18 -130 -42
3931 -42 90 55 -77 -113 6 98 24 -107 -78 50 107 -11 -106 -39 96 77 -44 -106 8 110 37 -94 -81 55
3955 55 108 8 -102 -50 99 78 -50 -109 -2 105 35 -83 -96 38 79 -8 -118 -53 83 67 -54 -115 -14 98
3979 98 29 -89 -88 31 97 -1 -101 -52 76 88 -45 -105 -5 103 53 -68 -89 40 110 12 -90 -56 78 99 -33
4004 -33 -97 -9 92 45 -87 -93 28 93 1 -98 -69 56 88 -39 -124 -23 86 48 -79 -102 11 94 3 -100 -65 66
4030 66 90 -25 -101 -21 85 55 -55 -92 27 107 28 -85 -59 66 100 -13 -93 -33 78 62 -62 -98 10 98 19
$$ packed form
3858I5j37p8J02J32m8j59k5J65O9q6j37M0J51K0j41p6R3J39m6j63k0J36Q6j03
3882Ij20L1J49L0j43q5J00J18l3j33l1J26Q9q9j26K8J58K3j25r0Q5J32l4j34l3
3907i8J17R6r0j23L4J39M1j26j02Q3J33k4j60j8J13R7q4j31L1J27L9j12j12Q8
3931d2J32l5j32l6J19R2p4j31K9J28N7j18r5O7J35j9j21o2J14J02p3j31J3J36
3955E5N3j00j10N2J49k1j28n9J07J07p0j18j3J34M1q7j10O5J36j6j21o1J01J12
3979I8o9j18JJ19O6r8j00M9J28J2j33o0J00J08n0j21k1J29P0r8j02L4J34K1j32
4004c3o4Q8J01m7j32oJ21O5r2r9K9J25L2j27q5J01J09l8j27k3J13Q3r1j03L5J31
4030F6K4j15p6Q0J06l0j10l7J19Q0p9j13K6J25L4j13q0O0J11j6j24l6J08Q8p9
$$ plain form
4055 19 -98 -74 47 87 -25 -115 -36 79 50 -65 -93 10 89 21 -88 -67 59 100 -8 -97 -32 78 67 -50 -88
4080 -88 21 100 34 -75 -61 53 87 1 -99 -37 87 76 -59 -101 2 87 29 -88 -84 32 85 -14 -108 -39 58 55 -47
4107 -47 -96 -10 86 34 -74 -69 38 93 6 -91 -33 76 78 -30 -96 2 90 44 -75 -83 40 92 10 -72 -40 64 76 -37
4135 -37 -96 -12 90 45 -79 -94 17 79 -3 -96 -53 51 72 -53 -105 -25 76 43 -74 -85 27 83 16 -85 -48 67
4161 67 87 -20 -90 -4 86 61 -60 -83 22 93 23 -77 -54 62 72 -28 -91 -17 78 35 -69 -97 15 78 24 -93
4187 -93 -69 35 69 -39 -105 -38 73 57 -56 -87 10 83 19 -73 -59 56 88 -6 -79 -32 81 63 -43 -76 21 91 31
4214 31 -61 -62 52 88 -3 -89 -35 61 52 -59 -91 -9 77 16 -82 -74 30 72 1 -108 -41 64 53 -40 -91 -8 78 28 -67
4243 -67 -64 38 81 1 -76 -32 68 71 -28 -81 1 84 41 -62 -63 41 89 13 -76 -43 67 56 -40 -87 -12 77 34 -80 -86
$$ packed form
4055A9j17K4J21M0j12r0P9J15k9j15k8J03P9o8j09K1J26M1j08q9O5J10j1j17l8
4080h8J09P9o6j09J4J14L4q6j00O2J24j1j35m2J03Q5n8j17MJ16N3r9r4O9R7lj02
4107d7m9Q6R6n2j08NJ07N5q7r7N8J09Kj08o6R8Q8m6j19qJ23N2q2q2L2J04J2j13
4135c7n9Q4J02m5j24j5J11O2q2r3M3J04K1j25n2Q0J01l3j17j1J12N6o7j01L7J15
4161F7K0j07p0Q6R0k5j21k3J05P1p0j00K3J16J0j00o3P4R5m3j04k8J12O3n4j17
4187i3K4J04L4j08o6O7J11j6j13l1R7P3o4r2J4J15L2r4p3M7J13j8j06l3R7P0o0
4214C1r2jJ14L6r1q6N4R6rj11l2Q2Q6o1r8QJ04M2p1j09O7J05j1r3n1Q3Q6n0r5
4243f7LJ02M3q0p7M4J00Lr9n3Q2Q3m3j03jJ04M8p6q9L3J10j1r6m7P5Q9m3j14o
$$ plain form
4272 -86 19 70 3 -80 -49 57 76 -42 -80 -15 72 52 -42 -64 26 87 23 -68 -39 60 90 -16 -92 -5 89 51 -48 -71
4300 -71 24 84 12 -79 -58 44 66 -25 -87 -23 66 36 -58 -92 4 61 14 -84 -61 38 71 -19 -86 -21 66 57 -47 -79 12 89
4330 89 22 -55 -45 51 84 1 -75 -21 78 54 -33 -72 20 82 28 -75 -56 33 73 2 -93 -28 63 54 -38 -74 -4 81 30 -67
4360 -67 -61 29 66 -7 -81 -38 56 51 -50 -75 -9 80 40 -56 -57 39 83 6 -63 -22 66 75 -21 -67 -10 73 41 -57 -57 32 80 11
4392 11 -74 -44 43 50 -35 -80 -10 63 34 -68 -75 22 64 -2 -80 -47 50 59 -31 -67 -3 71 38 -65 -68 23 77 20 -66 -45 50
4423 50 61 -22 -74 -15 64 49 -49 -75 16 77 10 -63 -62 38 53 -28 -87 -37 55 36 -57 -75 4 65 10 -72 -56 33 67 -22
4453 -22 -81 -19 62 51 -50 -69 6 70 32 -60 -42 47 72 -2 -72 -22 59 58 -41 -65 5 70 18 -67 -63 26 60 -20 -84 -43 51
4484 51 38 -48 -84 -8 55 19 -57 -65 24 61 -6 -68 -42 61 49 -34 -64 -6 69 35 -48 -53 28 72 8 -65 -34 64 58 -30 -79
$$ packed form
4272h6J05N1o7q3L1J06J9j18l8O5Q7k0r4k2R0O1o4r1K9R9L0j06p6Q7R4l8r9k3
4300g1R5O0p2r1K1J02K2r1o2O4Q9l0r4l4R6N7m7r8K3R9L3r0o7O5Q7rj04l2R1P7
4330H9o7p7J0R6L3q3p6N4R9k4q7l9R2O2n4j03J9Q9M0p1r5O5R1rr2l6P0Q5n1r7
4360f7OR0L7p3p4M3R4nj01k5O6Q9m0r6jR6M4p7o9M1Q8Rr6m6N7Q3l2r8%Q9M8o9
4392A1q5L0Q7Pq5m5P0P3k9j02pR7M2o6p8L3R7Rr0l6O4P4l3j03lR1N4n7q6K1R5
4423E0J1q3n2N9P9j5r8k6R1O1o7p3JJ00J5q1n9N0R2j9r3j8P9O1n5q2J6Q9L4q9
4453b2n9O2Q1j1j01j9P5O4l8r2J8Q9K5p4p0N0Q1jr9k4P0O5n2q5MQ9L4q0o4M1R4
4484E1j3q6l6P6O3l6p6qQ9L7o7o2K6J03j2q3l0N8P5l4q3nQ1M4o4p3L1R8oq8m9
$$ plain form
4515 -79 -10 55 36 -53 -72 18 68 -5 -87 -46 28 44 -45 -81 -30 51 29 -61 -74 8 55 -1 -72 -43 34 48 -22 -75 -15 67
4545 67 37 -37 -53 15 75 18 -66 -35 45 58 -13 -62 -19 49 34 -48 -64 6 62 -6 -62 -54 23 48 -31 -74 -23 44 33 -54 -69
4576 -69 8 61 11 -60 -49 39 61 -16 -61 -15 67 50 -26 -61 9 65 36 -47 -40 42 67 8 -68 -27 50 43 -42 -62 4 52 21
4607 21 -62 -63 15 52 -5 -79 -38 32 40 -38 -74 -8 57 29 -52 -60 35 66 -3 -61 -31 55 59 -24 -69 -1 67 41 -48 -52 25 71 -5
4640 -5 -53 -36 43 41 -36 -67 -8 59 27 -43 -52 10 46 -10 -77 -47 35 53 -36 -82 -17 46 30 -54 -66 18 60 10 -55 -38 46 54
4672 54 -17 -59 -9 57 42 -34 -45 19 56 15 -53 -32 42 42 -20 -52 -26 51 30 -37 -66 -2 58 12 -67 -59 19 53 -19 -66 -30
4703 -30 45 30 -48 -51 -4 53 18 -52 -52 35 62 -7 -56 -13 56 38 -27 -55 8 63 22 -48 -37 35 61 0 -69 -20 29 30 -39 -64
4735 -64 -7 53 16 -57 -56 22 44 -12 -70 -37 40 33 -38 -65 -10 56 29 -49 -48 12 47 -3 -57 -27 45 42 -25 -56 11 60 27 -46
$$ packed form
4515g9O9O5j9q9j9R0N0p3q2M1P4J6q9l6N1Q1k2r0j3Q2M7n6p1K9P7J4p0n3O0Q2
4545F7l0p4j6O8O0n7q4L1Q0J3p1m9M3O8j5q2j6P0N6o8n6QP7K5p9m3N1O7j1q7j5
4576f9P7N3n0p1J1Q8K2p7m5M6Q2j7p6l5P0N6k9q3PQ2K5n9p6M1P7pq5k0O6M8l1
4607B1q3jP8L7n7p4M1P0Qp8l6O6O5k8q1qR5L1o9n8L0Q6Mq3m5O8O8k6q9mP7M6p6
4640em8J7P9kp7l1N9O7l2p0rO2L6n6o7L0Q2J8q9m6O5O3j6q4j2Q4M2n0o5J7Q4Q
4672E4p1m2N0O6j5p6j1O4L7m1o8K1P4%o2l2K6P7k1o7k9O4O0m6p9QP8L4p2m7L6
4703c0P5j5p8lM7N7l5p0%Q7K7o9m9M3O9j8o5k8O3N5m1p0J1P2K6o1o9M9M9Jo9k5
4735f4N7O0l7p3JP8K2n6n8L3P7pp1k7N5O6k7p8JO0L5n0n4L0P2lo7l1O7M9l3p3
$$ plain form
4767 -46 -45 23 58 1 -58 -32 33 44 -30 -72 -7 47 17 -62 -59 13 54 -15 -67 -41 19 35 -26 -62 -18 43 26 -36 -51 19 67
4798 67 11 -48 -29 32 44 -14 -50 3 57 36 -33 -49 20 60 8 -59 -29 35 40 -26 -67 -28 38 20 -50 -71 -6 38 -11 -68 -50
4829 -50 17 31 -23 -72 -24 38 21 -37 -51 4 45 21 -50 -35 29 61 -2 -55 -17 51 36 -31 -50 13 55 4 -42 -52 21 32
4859 32 -16 -67 -26 33 25 -39 -65 -8 37 3 -55 -53 13 42 -12 -69 -22 28 28 -30 -47 -1 51 16 -49 -38 30 59 -5 -49 -25 45
4891 45 41 -18 -42 6 50 13 -39 -47 14 56 -12 -63 -34 27 29 -35 -62 -1 49 16 -43 -44 10 36 -7 -61 -39 39 40 -31 -54 -13 51
4924 51 21 -36 -44 27 58 2 -48 -37 37 51 -14 -53 -15 61 33 -37 -49 6 56 -6 -56 -30 24 38 -25 -67 -21 36 27 -51 -61
4955 -61 9 34 -1 -66 -38 21 25 -24 -68 -16 43 30 -43 -48 5 53 6 -54 -36 32 43 -10 -49 -20 33 34 -32 -50 12 45 6 -52
4987 -52 -49 17 44 -30 -66 -26 31 30 -49 -61 -8 36 -5 -60 -38 18 48 -17 -73 -28 40 36 -22 -45 7 43 37 -31 -30 41 40 -7 -57
$$ packed form
4767d6JO8L5n7n9K6O5J1p4m2O5N4l0p9LP2M1o9n2K6O0J6o1l6M4O1j7o2j5P0M8
4798F7n6n9J9O1J2n8l6N3N4k1o9j6O9M0n2o7L0O4No6m1L9O6j8p0k1O5M4m9n7J8
4829e0O7J4n4m9M8O2j7n8j4N5M1k4p1J5O4L2o3n3L8O8j5o7j9O3M2n1m6j0P3J1
4859C2m8n1M1N9qo4k6N7M5l4n8KO6K9n4n7M7N0%n8j7M6N2l5o5J1O8K9o4m4K4P0
4891D5mn9k4M8M4l7n2qO1M2o8n1K9O1Ko4k7O1N0l3n9jN4K6m3n4K2P8Jp1k3M1O4
4924E1l0n7qP1L1n6n0J1P4J4o5l9L8P6k8p0j2N5N0o2n0K6N4J4o3m2M6N7rp8j0
4955f1P0K5l5o5K8N9Mm9m4N2N9j3p3nN3M8m7o0J8O8J1n3l9K9N3Jo6j8O2L3l9n8
4987e2LO6K7p4l6M0N7jp9j2N3M4m1n5K2N6L0o5n6M5O8mn8k3N2L6oo8JP1jm7n0
$$ plain form
5020 -57 -18 43 39 -23 -46 4 44 14 -44 -49 19 36 -13 -59 -39 27 29 -46 -64 -12 35 4 -56 -59 3 36 -20 -53 -35 32 37 -29 -60
5053 -60 -1 52 19 -41 -35 14 44 -1 -49 -25 28 42 -17 -59 -12 43 9 -49 -44 5 23 0 -60 -36 18 29 -27 -69 -22 22 8
5084 8 -42 -56 1 36 -4 -53 -50 28 40 -20 -62 -9 47 25 -25 -44 17 46 21 -42 -25 33 39 -15 -49 -24 41 37 -38 -51 3 34
5116 34 4 -58 -44 20 23 -22 -65 -25 29 20 -44 -58 0 40 -2 -51 -46 14 39 -16 -62 -26 36 32 -33 -55 1 55 20 -35 -30 23 45
5149 45 -12 -48 -17 49 39 -26 -47 3 43 12 -47 -48 22 38 -23 -66 -41 25 27 -38 -60 -12 54 5 -53 -37 12 44 -7 -59 -23
5180 -23 37 32 -29 -48 -5 50 11 -33 -16 18 55 2 -40 -26 29 37 -28 -48 -4 48 17 -39 -46 6 35 -12 -61 -34 24 30 -30 -55
5212 -55 -11 28 16 -47 -41 25 41 -1 -35 -32 36 50 -9 -53 2 71 29 -30 -30 12 46 9 -50 -30 35 32 -14 -63 -16 29 24 -35 -53
5245 -53 6 51 7 -53 -44 8 34 -26 -60 -25 26 17 -41 -52 -3 40 4 -37 -31 28 40 -14 -45 -13 48 37 -31 -47 17 48 16 -50
$$ packed form
5020e7L9O1mo2k3N0M0l0n8nO8J7m9m6K0O6Kp5j8N2M7l1o0lO2L3n6l3J8O7No6l1
5053f0N9N3l3o0OM9L0m5m8K4N3J4n9m2M7N5l4n8NM9J8k3o0K4N4J1n6m2M7M4j4
5084Hn0j4N7L5m0m9LP8J2o0m2N3N6k2n0j9O1K9k5o3J7N8On4l4K5O5mp5j3N4L1
5116C4l0o2J4O4Lm5m3M0N4ro4j4N8M0m2m9NO0K5n5m6L6O2mo5k2N6N4l5n5NN3K2
5149D5n7l6L1O6j0o5k1N0M0l1n9jP0J6o1m3K5O6Ko5k2M8O6m9n8J6M9L2n1n2L6
5180b3O0no1j9M3N5l9m4J7L4L7n3m2J4N5Qo5k0M4N2l1n6pN2K9m7m9K7N8Oo0k5
5212e5M4L9j2o3OO6J6m2l4LO8J4n9m4N5O9m2n9%M2L4l7n9K0O5lm6m9M7M5nn9j8
5245e3N9M5m4o0RN2K6o0l4L5N1rn8j1M9M3l6m1ON9J2n4l1L2O1j1o8j6O4L1l2o6
$$ plain form
5277 -50 -39 19 34 -13 -54 -16 35 25 -37 -48 -1 33 2 -53 -41 10 32 -15 -58 -28 28 28 -37 -45 7 39 13 -44 -44 19 53 -13
5309 -13 -44 -29 38 43 -28 -45 10 48 25 -31 -34 16 44 -3 -55 -30 25 34 -27 -55 -13 41 0 -46 -41 10 25 -6 -48 -30 19 33
5341 33 -15 -48 -10 52 23 -39 -40 3 43 3 -45 -21 31 41 -14 -46 3 36 30 -30 -40 17 41 -2 -43 -26 29 39 -23 -51 -11
5372 -11 36 17 -37 -54 -8 22 -6 -50 -44 16 22 -23 -51 -14 28 11 -36 -46 1 45 9 -38 -35 19 43 -8 -41 -14 47 30 -22 -45
5404 -45 16 40 5 -44 -37 26 30 -20 -60 -11 36 17 -42 -40 -4 27 -6 -52 -46 11 24 -13 -54 -23 23 22 -23 -32 10 38 10 -43 -26
5437 -26 26 39 -2 -28 -10 29 39 -25 -45 0 45 7 -42 -35 12 39 -12 -45 -26 20 15 -34 -60 0 37 11 -50 -32 8 42 -12
5468 -12 -58 -29 26 23 -24 -50 0 42 14 -37 -38 19 36 -1 -46 -9 35 45 -19 -30 -1 33 19 -23 -30 15 31 -8 -43 -21 22 14
5500 14 -20 -58 -11 30 9 -35 -54 -11 32 -12 -44 -20 22 19 -18 -43 -2 37 29 -28 -28 22 39 7 -41 -11 35 37 -12 -30 -8 39
$$ packed form
5277e0J1N8J5m7m1L8N1j0o2j1M7L4l1n5J2N1K2m7m3L0N6%o5qN2L2k6n7%O3L4o6
5309a3l1J5O7Np1j7N5L8k3n6lN0K8m7n2K5N5Ro1k8M2N4m1m6NN1J5l1m2J8M9J4
5341C3m8l3L8O2k9o2jM3M0m0m8K4N2J0n5l2M9L3oo0j0N7K4m3m1J7N5J0o2k8M0
5372a1M7j9n4j7M6L0k8m4OO0Om5k8L7M2j7m7j0M7M4l6m7LN4K4n1l3K7O1j7n2k3
5404d5O1K4l5m9PO3Mn0m0M9M7j9n9KL6L1l3m6ON7J3l7m1L1M6jm5rM2K8k8n3J7
5437b6N2J3m1k6J8L9J0o4k0M5M5l8m9PM7K7n1l3J9M6nm9k6O0L7k6o1J8M0L4n4
5468a2m6K9N5lm7k6N0M2k8n1jN7J7l7m5L7M4J0o4j1K9L4j4m2pM5J6l9l5K2M3q
5500A4l4l8M7M1k1m4j9M3M3m4l2K4M2ll7k5M1L9qn7%N0J7l2m8L0M6Km9j8K2M7
$$ plain form
5532 39 26 -25 -31 16 38 5 -43 -23 25 28 -14 -60 -17 30 22 -41 -44 3 26 -7 -46 -30 14 29 -20 -52 -8 38 17 -17 -25 6 32
5565 32 18 -43 -20 24 36 2 -40 -10 30 39 -15 -36 7 41 8 -43 -31 13 41 -12 -48 -12 24 17 -24 -43 -9 38 14 -44 -32
5596 -32 13 36 -13 -42 -23 29 23 -19 -40 3 59 20 -28 -27 16 49 -2 -38 -14 33 29 -18 -43 -1 37 17 -31 -35 9 22 -10 -48
5628 -48 -28 22 26 -27 -46 -16 36 11 -38 -42 1 31 -1 -33 -31 25 24 -13 -34 5 42 25 -26 -19 24 42 6 -32 -24 31 31 -20 -34 -3
5662 -3 36 19 -19 -35 13 37 -1 -37 -21 17 25 -19 -50 -15 24 6 -38 -43 8 33 3 -41 -20 21 32 -9 -44 -4 32 28 -20 -38
5694 -38 14 53 15 -23 -13 24 40 -7 -29 -5 34 24 -15 -27 5 33 -14 -37 -18 13 24 -17 -44 -18 23 24 -34 -43 -7 22 3
5725 3 -45 -27 19 33 -3 -38 -16 32 26 -15 -31 21 48 23 -20 -20 17 36 -11 -40 -7 34 22 -24 -35 8 34 9 -37 -28 16 20 -16
5758 -16 -48 -17 19 18 -26 -43 -9 29 8 -45 -29 10 33 -6 -42 -12 35 32 -11 -40 13 41 16 -34 -24 14 42 2 -39 -19 30
$$ packed form
5532C9j3n1oM7K2l3m8K0M8Lm2m6M3M7qo3lM7K3l3l9J6M4J5m9l2M4M6k1l4qL1K6
5565C2j4o1K3M4J2l4m2L0M0Rn4k1M3L4l3n1J2M4K8n3l6L6L6pm1j9L4M7k4n8J2
5596c2M5K3m9k9J9N2om2k1M3N6l9m8JM3L3n1l6K4M7mm7k5M2L8k0m8mM4J3l2l8
5628d8K0N0Mn3j9L0N2k5m9mM3L0l2l2KN6jl7k1L9L7j7n1PM3J8l6l8QN5%n1j4L1
5662cL9j7l8j6M8K4l8l6J6L8Qm4l1L5L9j8m4nN1K5l0m4K1M1J1m1l5M0L6mm8j8
5694c8N2L9l8l8J0L7J6m7k2K4L9j0l9j2L2K8m7k3J9L1J1m1k7K6M1Jn8rL6K9j9
5725Cm8J8M6J4l6l5K2M8om1j6N2K7k5m3%L7J9m7k9L3M1j2m6j1M3K6k5m6RM4Ml6
5758a6l2L1L6jm4j7L4L8k1n3J6L9K3l9l6L0M7lm3k9N3K8k5n0J0L8K8m0m1K0M9
$$ plain form
5789 30 23 -9 -37 -2 37 19 -40 -35 5 23 1 -58 -28 13 15 -23 -42 -8 16 5 -42 -36 -1 31 -2 -40 -24 19 27 -8 -43 -10 28
5822 28 35 -25 -25 23 35 2 -39 -22 17 25 -13 -44 3 27 20 -43 -42 -2 14 -14 -43 -25 15 12 -25 -36 -19 17 8 -27 -37 3 20 11
5856 11 -33 -24 18 35 -10 -32 3 25 13 -20 -20 4 27 11 -28 -15 14 40 -20 -39 -12 33 22 -37 -42 -4 22 0 -39 -39 23 20 -14
5889 -14 -46 -15 16 16 -18 -32 7 30 13 -28 -18 11 26 -8 -38 -13 23 21 -19 -26 11 31 5 -35 -35 11 30 -4 -38 -11 26 23 -18
5922 -18 -44 -8 26 5 -36 -39 8 14 -12 -38 -20 9 4 -23 -39 -8 23 5 -45 -37 14 35 4 -37 -13 18 33 -8 -28 5 31 11
5954 11 -28 -19 6 30 9 -31 -15 24 23 -19 -33 -17 30 16 -33 -39 -13 23 -14 -47 -33 8 23 -18 -39 -8 25 12 -24 -40 -3 28
5986 28 4 -26 -17 28 25 -7 -24 0 16 20 -25 -28 11 32 0 -32 -18 20 26 -16 -30 -18 25 3 -19 -31 -6 18 1 -39 -34 4 19
6019 19 -15 -35 -12 37 9 -23 -39 6 26 3 -23 -16 27 16 -3 -31 0 27 26 -16 -25 14 40 16 -26 -15 13 17 -18 -38 -23 22
$$ packed form
5789C0pl2k8L5L9j8n9NM0J8k2n9L0M1Kl8j9L4K4j1m7OL5L2l3l8J6M3Ql5l5L3L8
5822B8Po0%M8J2l3m1J7L9Ql8l1M7K4po3JM0J6k8k9J8M0ll7j1J7L6rl5j0M0J7r
5856A1m4RM2J7m5k2L5K2j2l3%K4K3j6l9J3K9K6o0j9K7M5j1n9nL8K6k2l9%O2ll4
5889a4l2L1L1%l4j4L9K3j7m1J0K9J5l4l0K5L6km0pL7K0k6m0%M6J9l4l4K7L7lm1
5922a8k6L6L4k1m1lM7Ok6k6J8K9nk7j6L1L1j8n0QN1K1l1m1K4L1J5m1k0L3K6k0
5954A1l9RK5K4k1m0J6L9jm2j4J6M7j4m9oK6L6l7l3J4M1J5m1k1L1L3j3l6j6L7L1
5986B8k4l0RM5ll2j7K4J6Mm5lL9K1l2l2J4L8Om2j4J2M3k2k2j2K5K4j7m0NL8J5
6019A9l4k0K3M9k8l2j6M5K0k3k6PM3j1j9k8L1K7jm2rL9K6k4m2J1K8Ml5k0J5M5
$$ plain form
6051 22 12 -31 -37 -10 16 -9 -42 -20 12 31 -10 -34 -25 18 11 -15 -31 1 28 8 -28 -19 12 35 2 -29 -8 28 22 -5 -23 10 35
6084 35 9 -24 -22 23 25 9 -31 -18 5 21 -20 -43 -11 12 1 -29 -39 -17 12 -26 -38 -29 20 11 -19 -33 -5 26 4 -22 -26 10 35
6117 35 1 -30 -9 33 31 -2 -29 10 33 14 -10 -20 5 36 -6 -28 -16 17 23 -21 -37 -17 18 5 -20 -36 -2 15 -5 -43 -25
6148 -25 11 6 -20 -42 -21 15 20 -13 -32 6 29 1 -26 -10 11 30 0 -24 9 30 21 -19 -25 2 20 -4 -37 -28 5 22 -21 -45 -21
6181 -21 9 7 -27 -39 -12 14 -2 -45 -28 8 13 -17 -44 -11 24 13 -20 -25 11 30 16 -21 -22 22 38 5 -21 -2 28 27 1 -15 13
6214 13 25 7 -30 -20 8 20 -4 -32 -19 18 5 -35 -33 -13 19 3 -31 -26 1 21 2 -33 -8 20 25 -10 -26 11 30 15 -19 -22
6246 -22 25 32 3 -33 -9 31 31 -10 -28 3 28 12 -26 -21 -3 22 2 -31 -14 10 9 -25 -36 -8 20 3 -34 -33 10 13 2 -28 -14
6279 -14 10 24 -10 -38 -7 27 18 -21 -21 9 33 3 -28 -8 16 20 -4 -22 5 24 16 -13 -28 -2 16 -2 -31 -22 10 16 -13 -43 -14
$$ packed form
6051B2j0m3oK7K6k5l3K2L2J9m1k4RM3pk6j6L2K7k0l6RL1K3l3l1K1L6ok7j8L3K5
6084C5k6l3KM5Kj6m0J3K3J6m1k3L2K3j1l0j0K2K9l8j2RM9rl0j4K8L1k2k6mL6K5
6117C5l4l1K1M2kl3k7L9K3j9k4j0K5L1m2k2J2L3Om4j6K0L5j3k5j6L4J7k0l8J8
6148b5L6nk6k2K1L6Nl3j9L8K3k8k7J6K1J9l0k4L3K1rm0oK7J8k4l3RL3J7m3k4K4
6181b1L0kl4j2K7K6j6m3J7L6Nl0k7L3L5j1l3nL6J9j4l7jM4J6l3k6J9L0jk6j6K8
6214A3J2j8l7J0K8J2k4k8J3L7j3m0KK0L2j6l4NK7K0j9l5K5K8Nl5j6L7J9j5l4l
6246b2M7Pk9l6K4M0%m1j8L1K5j6l8NJ8K5k0l3J7K4jl4j1K8K8j7l7JM3Lj1l0J4
6279a4K4J4l4k8L1L4rl9%L0K4l0l1K0K4Mk4j8K7J9qk9j5K6J8j8k9RL2Ok9l0K9
$$ plain form
6312 -14 13 5 -28 -39 -3 27 -1 -31 -28 8 31 -8 -28 -11 14 25 -11 -21 11 42 12 -26 -14 18 36 4 -23 -4 27 20 -12 -25
6344 -25 -4 12 -4 -31 -30 2 11 -19 -32 -17 3 6 -14 -23 -8 16 3 -18 -19 3 17 -2 -22 -16 13 19 -19 -21 13 24 10 -10 -14 8 21
6379 21 0 -13 -11 11 8 -7 -19 6 13 12 -24 -26 7 5 -8 -28 -18 10 13 -20 -28 -18 16 14 -18 -23 8 18 -16 -25 -6 7 15 -18 -26 -1 23
6416 23 -3 -11 -26 7 31 7 -24 -16 10 25 -9 -14 8 23 14 -21 -28 0 7 -5 -25 -30 5 9 -24 -28 -5 2 -7 -25 -24 2 22 -4 -23 -4
6452 -4 7 24 -5 -21 -6 38 16 -2 -11 15 23 11 -15 -7 18 18 2 -20 -2 26 17 -23 -19 -2 19 11 -33 -26 -2 13 -1 -31 -11 2 11
6487 11 -21 -23 -9 6 -6 -13 -15 12 19 3 -18 -5 23 15 4 -3 14 23 12 -10 -13 6 27 -5 -23 -4 16 7 -13 -27 -11 9 -3 -26 -19
6522 -19 0 7 -17 -30 -19 8 5 -19 -25 1 14 -5 -21 -13 10 4 1 -24 5 19 25 -3 -15 5 27 13 -13 -8 8 12 1 -23 -10 11 8
6557 8 -9 -31 4 14 -3 -18 -33 -10 20 -10 -20 -18 7 1 -24 -34 -7 9 -1 -27 -26 8 14 -5 -19 -9 13 26 2 -7 -3 35 16 -11
$$ packed form
6312a4K7ql3j1L6L0k8l0LL6K3l9k0J7K5J1l6j0L2L1l0l8J2L2J8l2k7J9L1pl2j3
6344b5K1J6j6k7JL2Rl0j3J5K0Lk0rJ5K4j3k1jK2J4j9k0OK9Ol8kL4J1j4k0mK2J3
6379B1k1j3KK2lj5j2K5Pjl6kL3kj3k0J0K8Ll3qJ0L4kl2nL1J0l4rJ9J3Ql3qK5K4
6416B3k6qj5L3K4k4l1QK6J5l4nK2J5rl5pK8Pj2k0nL5Ml3mK3Prj8JK6K0k6j9J9
6452dJ1J7k9j6J5M4k2j8rK6Qj2k6QK5%j6k2J8K8rm0MJ7K1qm4PK4J5j4l0K0J3R
6487A1l2kJ4J5j2pkK7Pj6k1J3K8qj1pJ7Rj1k2lJ9K1l2j8J9K0rk0j4J6K0j2k3P
6522a9J9Pk4j3J1K7lk4oK6J3j9j6QK3olk5K9J4Ok8j2K0K2j4k6NJ6Mj1k4J3K1l
6557Hj7k2L5J0j7j5j5K3L0l0j0KK5ok5j0K7J6j0k6JL4Oj9j4J0K2J3k4rML8j9k7
$$ plain form
6591 -11 -21 7 22 3 -20 -22 6 13 -7 -25 3 14 1 -14 -27 -13 12 -18 -31 -27 -2 3 -10 -26 -14 0 6 -25 -10 -3 17 3 -17
6624 -17 -10 16 23 -3 -10 2 10 10 -16 -27 3 25 6 -12 -5 9 22 -4 -25 -1 7 0 -17 -26 -10 14 -10 -28 -17 1 9 -19 -29 -22 4 11
6660 11 -8 -27 -12 21 8 -22 -8 18 25 -9 -18 -7 22 20 -1 -21 6 28 5 -22 -27 10 15 -4 -24 -17 12 15 -18 -20 -17 14 -1 -40 -26
6695 -26 -6 -2 -6 -27 -26 9 17 -9 -22 -19 6 1 -30 -17 -6 13 6 -19 -19 14 33 -4 -10 15 24 6 -10 -9 4 7 3 -17 -15 11 10 -8 -25 -9
6733 -9 1 -8 -24 -34 -14 11 -10 -26 -20 2 5 -22 -16 -15 5 1 -18 -12 4 9 0 -22 -17 20 16 -4 -21 -11 11 11 -17 -23 1 8 -8 -17 -18 -5 6
6772 6 -20 -23 -23 -5 1 -30 -26 -19 0 -4 -39 -32 -10 8 -12 -25 -10 -1 16 -13 -23 -6 14 10 -10 -16 6 23 -5 -14 -3 20 20 -2 -16 6 11
6809 11 6 -20 -23 7 4 -13 -22 -18 1 7 -20 -30 -12 4 -13 -17 -23 -9 -4 -16 -21 -12 7 8 -2 -20 1 16 12 -16 -19 8 7 7 -9 -16 13 17 5
6848 5 -20 -2 13 1 -22 -15 -4 8 -1 -17 -17 4 9 -9 -23 -7 -1 -6 -11 -19 -7 6 -11 -21 -23 7 8 -12 -19 -5 17 -2 -10 -24 4 16 8
$$ packed form
6591a1j0K8J5j9k3kK8Pk0j8K8J1j3j5j3J4K5l0j3MK5Nj3j6J2J4Ol1J5PK0j4k0
6624a7PK6Pk6pJ2Q%k6j1L0K2j9j8PJ4J3k6k1K4Qpj7rJ6K4k4j8J1J8Qk8j0PK6P
6660A1j9j9J5L3j3l0J4K6Pl4rJ1K9kk1k0K7K2k3k7nL7Nj9k0PK9Ll3kLL1j5l9J4
6695b6K0Mmk1JL5Qk6j3LK5nl1J3J1J9pk5%L3J9l7oK5Rj8j6JJ3Lmk0KK6jj8j7J6
6733iJ0rj6j0K0K5k1j6OK2Lk7OJK0mj9OJ6Nrk2NL7mk0j7J0K2%k8oK4Pj6rjJ3J1
6772Fk6l%J8Ol1MPJ9ml5PK2J8k0j3J5RJ7k9j0J7K0mk0oK2J7k8rJ1K3%k2j4K2N
6809A1nk6lL0lj7rMJ9Ok7j0J8J6j7moJ4Nj2nRJ9Jj0j8K1J5mk8lK7j%j6pK9Mj2
6848Ek5J8J5j2k3PJ1J2rj6%K1Nj8j4J6OnnqJ2J3j7j0kL0Jk0pJ4K2j9qj4K8J2q
$$ plain form
6885 8 -8 -1 10 21 -4 -8 8 11 11 -15 -19 -4 9 -3 -16 -15 -5 0 -22 -20 -14 2 12 -20 -32 -14 6 -2 -27 -21 -3 8 -3 -21 -15 -2 4
6922 4 -18 -12 3 11 5 -10 -9 2 14 -8 -3 -4 21 12 -21 -16 -3 14 -4 -13 -20 0 11 -18 -25 -22 -4 -4 -8 -20 -15 -3 -6 -27 -18 6 -2 -8 -20 -11 11
6963 11 -2 -6 -20 -7 14 10 -4 -9 6 9 2 0 2 17 12 -2 -17 -2 9 -5 -4 -3 -7 -2 -8 -16 -8 4 -8 -18 -29 -10 -8 -5 -15 -17 1 6 -10 -23
7003 -23 -15 2 5 -7 -9 -4 10 6 1 -15 -5 13 5 -13 -7 -4 11 2 -15 -7 1 0 -9 -15 -2 8 1 -22 -16 13 -3 -19 -18 -14 1 -2 -21 -24 -5 -8 3
7044 3 -16 -18 4 7 -5 -11 -7 10 7 -6 -16 13 7 1 -10 0 7 12 -6 -12 0 12 6 -7 -16 -6 -1 -8 -17 -12 -9 2 -16 -19 -13 3 1 -7 -20 -15 0 0
7086 0 -20 -14 4 3 -7 -3 1 16 13 -6 -5 3 12 9 2 6 7 2 8 -18 4 8 3 0 -17 1 -1 -4 -20 -27 -8 -3 -17 -23 -15 -3 0 -17 -23 -19 9 -6 -12 -20 -7
7131 -7 8 -10 -11 -15 0 9 -4 -10 5 6 5 -13 -7 4 11 -13 -11 -7 5 4 -9 -18 -19 -12 -3 -22 -20 -20 -5 -18 -22 -18 -4 -9 -11 -23 -21 -4 -10 -16 -24 -8 1 -5
7175 -5 -9 -5 9 8 -1 -8 -1 0 4 3 -8 1 4 3 -2 1 2 4 -18 -12 -11 2 -5 -15 -16 -8 -5 -17 -23 -20 -8 -5 -10 -16 -8 -9 -4 -22 -16 -6 -5 3 -5 -10 9 9 7 -11 4
$$ packed form
6885Hj6PJ1J1k5mJ6L%k6mJ5J3j2j3JJ0Nk2KOJ6J0l2j2J8K0qk5OJ8J1j1j8OJ3O
6922Dk2OJ5Qoj5JJ1J2k2NjK5rl3NJ3J7j8rpK0J1k9pLJ8%mj2NJ2lk1RK4qoj2RK2
6963A1j3mj4J3K1mj4nJ5LpkKJ5nj4j5J5J1j4JJmNoqQJ2j2j0j1J9KLj0kJ8Nj6j3
7003b3QJ7Lj2kNJ4mnj6J0J8qj8OLJ5rj7QQjroJ3J0pk3OK9j6j6JMJ5lj9lJ9lJ1
7044Cj9kK2Lj2oMJ7lj3j0K9ooj1J0PNj8oJ2J2oj3rJ0NprNLJ1j8lOJ6kqj3NJ5%
7086@k0OJ8jj0MMJ5lj9JQRlpMJnOk6K2Mnlj7J8klj6pJ9Nj4oQJ2Lj7oMK8j5oqJ3
7131gJ5j8jmJ5Rj3oJ5Jjj8OJ1Pk4KMJ2jj3rjPRj9K%J5j3mMJ4nkj2KJ7ooqJ6Ro
7175emMJ4jrpPJMjj1RLjnLJKk2OJJ3pj0jQLj2oLJ2LnoQjNj8OJ0JQqnJ9%kj8J5
$$ plain form
7224 4 8 8 -6 -17 2 13 1 -13 -4 12 7 -3 -13 -3 3 -2 -3 -11 -5 6 -7 -18 -12 0 -3 -2 -11 -8 -1 0 -18 -13 -10 9 11 -14 -4 -1 11 3 6 5
7266 5 8 9 0 -1 3 9 6 -7 -10 7 9 0 -13 -8 3 1 -9 -24 -4 -11 -14 -13 -13 -10 2 -15 -22 -16 -4 -1 3 -25 -15 -4 -2 -5 -8 -6 3 -1 -9 -2 12 13 12 2
7312 2 2 11 13 2 -4 2 16 5 -10 -12 12 -2 -3 -14 -7 -8 -8 -9 -25 -12 -7 -13 -12 -15 -10 -5 -5 -9 -18 7 -5 -10 1 -11 2 2 -1 -10 -5 -4 -2 0 -8 10 -8
7357 -8 1 -17 -8 12 4 -5 -8 -5 8 -10 -20 -13 -4 -6 -17 -10 -10 2 -11 -15 -18 -8 -4 -12 -1 -11 -3 -5 -12 -8 6 2 6 -7 -1 2 7 -1 -12 -10 12 6 3 -14 -7
7402 -7 7 2 -16 -9 -4 4 -6 -10 -14 0 -10 -9 -15 -11 -8 -3 -11 -11 -8 2 -5 -17 -13 -8 -15 -14 -6 -7 0 -8 -10 -2 9 1 7 -5 0 3 8 0 -1 5 4 5 -11 -3 -8 4 0 -9
7452 -9 -11 -5 -6 0 -18 -8 1 -1 -11 -12 -13 4 -12 -11 -6 -4 4 -2 -8 -13 8 7 2 -4 4 7 4 2 0 3 1 -4 4 -4 -3 10 -4 -8 3 8 0 -6 -4 -1 2 -9 -10 -4 -3 -12 -17
7503 -17 -11 -14 -5 -4 -1 -1 -3 -5 3 -8 -7 1 -12 -11 -4 4 3 1 -1 2 3 -2 6 -7 3 11 2 -6 1 5 7 -10 -8 -4 -8 -3 -5 -17 -7 -6 -11 -16 -31 -12 -9 -10 -21 -9 -5
7552 -5 1 -5 -6 -12 2 3 7 -12 0 -1 3 1 7 -1 7 6 -4 5 0 5 0 -11 0 -1 -3 -2 -6 -1 -2 -7 -10 2 -1 0 -18 -10 -3 -10 -8 -13 -13 -8 -2 -6 -16 -9 -3 4 -2 -14 1
$$ packed form
7224DM%j4j1J9J1j2j4RJ6nj0j0J0OnjqOJ1j3j1OJ2lJrLPJj8NLJ9Kk5J0LJ2qLj
7266ELJrjMOlj3lJ7Krj3NJ1kj0j5K0plJ%LJ2j7pOJ2LMk8J0J1KllKRmqPJ4Jjj0
7312B%RKj1oOJ4j1j5kK4j4jj1Pj%jj6J3NoJlNN%mrK5j2nJ1j2J3%lrNJKKqJ8j8
7357hRj8RK0qrlLJ3j8j0PRkj1P%J2j3mlJ0MqJ1j0QkpMJ4mMj3OLNqj1KK2olj7P
7402gJ4nj8PNQj0mmJ4j0JoMLNq%LJ0pj2MNpJQjPqkQJ1qOj2NLNqjOjJj6QnJ2mr
7452ikOjOj8J0Rkj0jjJ7j6JNKQoonK1jnoQLlkkLknQqJJ3j4mJ1NqoKLLj1jOJrn
7503a7OlRJL%kkQj1JQj3JPQjkkLJnQj3J0QrqPMKj7KMmNkj2J0Jnnj5J9Ljj1J2M
7552eOojoJ4JMj9J2jMkOqQjj0RnNnj1J1jkJmNjnlJ2lJj8QPpKn%NOmj0POPoj2J5
$$ plain form
7603 1 -2 -2 5 -2 2 5 5 7 2 6 13 10 6 7 -4 -3 -7 -9 -4 2 -8 -20 -6 -21 -1 -6 -10 -6 -3 -8 -5 -12 -12 -10 -10 -10 0 5 -2 5 10 12 22 6 5 -3 4 3 9 0 9 8
7655 8 12 0 -15 2 12 0 -3 -6 -2 -3 -3 -7 -13 -4 4 -11 -22 -10 -3 0 -19 -4 -13 -8 -9 -15 -10 10 3 -8 -7 -15 4 -2 -8 -2 11 3 2 -4 -5 0 4 -6 -1 -8
7701 -8 12 6 4 -1 -6 3 0 -11 -9 -7 -9 -11 -23 -13 -4 -5 -2 -17 -8 -13 -9 -4 -8 -3 9 2 -12 -1 2 -1 1 -6 4 3 14 4 -2 7 11 7 0 2 -3 1 -4 -3 -1 -2 -9 -14
7751 -14 -13 -2 -4 -11 -8 -10 -7 -6 -8 -8 -5 0 -21 -15 -9 -22 0 -3 -13 -9 -4 6 7 1 1 -1 2 8 -5 9 2 -1 9 -5 -1 13 -4 -6 -7 -4 -13 -15 -7 -10 2 -3 -14
7798 -14 -12 -8 -5 -22 -12 -16 -7 -18 -16 -16 -5 -8 -10 -4 -12 8 9 4 -10 -10 -1 2 10 7 -2 4 5 -2 2 -5 3 3 -4 7 3 7 -4 -12 -15 -9 -9 -20 -4 -6 -9 -9 -16 -8 -3 -5
7848 -5 -6 -16 -8 2 -5 -9 -2 9 -3 -14 1 4 3 6 4 7 1 6 8 7 3 13 -4 0 0 -1 -1 2 4 -13 -7 -5 -15 -17 -15 -7 -11 -4 -11 -8 -5 -4 -6 -7 -18 -11 -5 -5 1 -6
7898 -6 -4 3 -4 13 3 8 -4 10 -1 4 -4 5 2 -4 10 4 -4 2 -2 6 -9 -12 -9 -3 -4 -2 -13 -13 -13 -7 -8 -3 -11 -16 -9 -12 -15 -5 -3 -4 -6 3 6 3 -6 4 2 20 11 -3
7948 -3 7 8 3 3 1 -2 10 -6 1 1 6 5 -4 -6 -3 2 -4 -8 -13 1 -2 -8 -6 -9 -5 -2 -8 -6 -9 -6 -7 0 1 -1 -10 -7 4 6 1 4 11 9 6 12 21 1 9 -5 10 16 6 -2
$$ packed form
7603Al%PpML%KnMPlmJj1JmkNOj0j2J4j5K0nmMLnLp%K%%J0NpPNKJ0j6jqPjOrRj
7655HMj2j5J7J0j2llMj%moRQj5j1J2PLj9J5rNjoNK0pj1JqJ9ooOJ3qjojNMj0Np
7701hK0oknnRlj1KKkkj2J0RjLj5RnMNmNJ2pj4J1LlKpJ0jJ1j0oRMmpKnMnJKjpn
7751a4JJ1kpLkLJk%LNk1OOj3K2lj0MNJ0Jo%kLOj3J4plJ0j4MJ4j7kjLrkQlJ2nj1
7798a4KMLj7J0mRj1K%J1lkOqK0Jnj4%RLQlrOJpMpQ%pJ1mMj1qlO%j1J6kl%pQNk
7848ejj0QJ0pmPJ1j2j1J5LjLkLoNKjmJ0j7M%j%LKj7OKj0kKQmPpLLJkjj1PO%Op
7898fKPpJ7j0Nj2J4j1NqRloJ4oqOmQj5lLOjKj1%%OjNqnPllJ0KjkRLlrJ0kJ8rj4
7948cJ0Jn%klJ2j6P%NjrkLNomnJ4loKlMLoKlLjPJkrLJ1KnLPklORk0Qj4J5Oj0q
$$ plain form
8000 -2 -1 -11 -3 -8 -4 -7 -14 -11 -4 -4 -13 -10 -15 -17 -10 2 0 -2 -2 -2 -18 -9 -20 -6 5 4 -3 -3 -6 11 -2 4 12 15 11 -4 1 6 2 12 1 2 -1 -2 -1 -10 -12 6 -1
8049 -1 -13 -7 -7 -5 -9 -10 -20 -9 -10 -12 -8 -3 1 7 -5 -4 0 -2 -1 3 -5 12 1 1 4 3 4 4 9 1 -14 -5 -1 2 4 12 2 -1 3 -2 6 -6 -10 -10 -10 -8 -8 -14 -8 -11 -2 -7
8101 -7 -9 -10 -6 -5 -2 -6 0 0 0 2 -5 1 3 3 12 9 5 5 2 4 -9 4 13 -3 3 -1 1 -2 -4 -4 -6 -12 -11 1 -14 6 -4 -10 -15 -6 -11 -13 -10 0 -6 -9 -3 -7 -15 -4 -10 -9
8153 -9 -3 -11 1 1 -8 5 1 5 0 3 10 9 -3 -8 -3 -3 -1 0 -9 -12 -4 -11 -2 -3 9 -10 -19 -9 -17 -14 -11 -8 -8 -9 -15 -7 -5 -18
$$ packed form
8000bJj0QnMlpLP%rLnkPJ2kk%%j6Rj1J4J1jp%lJ7j3OQLmj5NNmJ0j1JljJrkJ8p
8049aj2O%Kmjj0J1jkMNMOj2JMkJMqJ7j1%LjJ%Nqj5RMLKQj0lMnQj2m%%K%oOlRn
8101gkjMJLmO%%KpOK%Rlm%lKj3J3Rj6OmKlk%koJJ2j5K0j0onRnkLJ0olOmqJ1oJ
8153iOqJ2%rJ3mMnLPjj2nN%KJrlQpRjJ2j9rJ0qLLL%joQKj3
8191a8
$$ Imaginary data points
##PAGE= N=2
##DATA TABLE= (X++(I..I)), XYDATA
$$ plain form
0 0 0 0 0 0 0 0 0 0 0 0 0 0 0 0 0 0 0 0 0 0 0 0 0 0 0 0 0 0 0 0 0 0 0 0 0 0 0 0 0 0 3 -4 4 -6 8 -8 8 -8 8 -8 11 -12 12 -13
54 -13 14 -18 20 -20 20 -23 26 -26 28 -28 27 -23 7 35 -196 1557 14312 5915 -7316 -11966 2322 13067
76 13067 4054 -11494 -9562 7871 12262 -2046 -12955 -2671 7957 11102 -6423 -13058 2144
89 2144 10961 5172 -9745 -8511 4458 11426 501 -11247 -5600 9311 8586 -5049 -8953 -2298
103 -2298 10862 5554 -8125 -8353 3551 10272 470 -8798 -5396 6544 8467 -2642 -10321 -563
117 -563 8730 4388 -5350 -8341 2715 8827 1559 -8291 -5005 6023 7101 -2277 -8087 -1643 7422
132 7422 5268 -5879 -6771 2235 7584 1557 -7139 -4486 4776 6941 -2071 -7615 -1141 6761 4085
147 4085 -4481 -6470 1710 7472 1073 -6508 -4055 4654 6021 -1805 -6807 -1354 6413 4071 -4703
$$ packed form
0@%%%%%%%%%%%%%%%%%%%%%%%%%%%%%%%%%%%%%%%%LpQj0J4j6J6j6J6j6J9k3K4k5
54a3K7l2L8m0M0m3M9n2N4n6N5n0L0K8k31J753J2755q397j3231m650J4288J0745
76A3067r013j5548J932J7433M391j4308j0909J0284J0628L145j7525o635J5202
89B144Q817n789j4917J234J2969O968j0925j1748N647J4911p25j3635l904O655
103b298J3160n308j3679k28J1904O721r802r268L402J1940J923j1109p679R758
117e63R293m342r738k991J1056O112p268r850L286J1028J078r378n810O444R065
132G422k154j1147q92R006N349o027q696K653R262K165r012n544O474P902k676
147D085q566j989Q180N762o399p581K453Q709J367p826n002N453P767k342q774
$$ plain form
162 -4703 -5860 2002 6470 1275 -6194 -3942 4498 5811 -1879 -6674 -950 6007 3730 -4276 -5795
177 -5795 1788 6681 955 -6083 -3627 4292 5645 -1764 -6457 -1183 6094 3765 -4424 -5610 1811
192 1811 6373 1179 -5936 -3902 4361 5692 -1757 -6452 -1165 5894 3867 -4141 -5834 1656 6542
207 6542 1236 -5921 -3895 4073 5815 -1477 -6550 -1447 5927 4057 -4113 -5847 1376 6487 1627
222 1627 -5834 -4264 3992 6014 -1297 -6520 -1706 5717 4371 -3769 -6121 1065 6599 1904 -5687
237 -5687 -4478 3646 6168 -864 -6570 -2102 5601 4649 -3476 -6237 636 6532 2323 -5487 -4821 3311
253 3311 6283 -445 -6477 -2518 5306 4961 -3072 -6392 229 6442 2696 -5183 -5050 2850 6371 66
269 66 -6386 -2942 5049 5193 -2651 -6391 -269 6268 3114 -4836 -5307 2382 6410 529 -6178 -3325
$$ packed form
162d703j157P862M468n195p469K252Q440J313p690m795N724O957k277q006j519
177e795P583M893n726p038K456P919J353p409m693N274P277k329q189j186P421
192A811M562n194p115K034Q263J331p449m695N287P059k027q008j693P490M886
207F542n306p157K026P968J742p292n073N103P374j870q170j734P223N111m860
222A627p461J570Q256K022p311n223M814P423j346q140k352P186N534m695p591
237e687J209Q124K522p032n706M468P703r52q125k761O873N896m209p810O66Q132
253C311K972o728o032L959P824l45q033l320O621O213l746p879J33P900L521o305
269F6o452L444P991J44p844l740O122O537l154p950m71P689M028n881o707K853
$$ plain form
285 -3325 4668 5384 -2164 -6392 -762 6029 3489 -4414 -5538 1912 6371 975 -5920 -3682 4210
300 4210 5551 -1649 -6311 -1240 5734 3853 -3988 -5638 1423 6251 1422 -5559 -3970 3751 5676
315 5676 -1186 -6158 -1652 5415 4106 -3535 -5670 956 6070 1821 -5202 -4224 3288 5681 -707
330 -707 -5979 -2009 5055 4278 -3061 -5654 480 5846 2180 -4850 -4382 2848 5642 -281 -5743 -2308
346 -2308 4641 4433 -2597 -5603 58 5620 2475 -4466 -4477 2394 5564 139 -5467 -2591 4250 4546
362 4546 -2171 -5489 -312 5324 2741 -4053 -4551 1962 5427 509 -5177 -2830 3854 4573 -1760 -5344
378 -5344 -678 5039 2929 -3681 -4562 1572 5240 838 -4864 -3059 3503 4560 -1376 -5175 -951
393 -951 4707 3094 -3288 -4580 1230 5061 1118 -4573 -3136 3091 4564 -1020 -5008 -1185 4405
$$ packed form
285c325P993P16p548m228N630O791k540p903j124P450M459n396o895K238P892
300D210J341p200m662N071O974j881p841j650P061M828m829o981J589P721J925
315E676o862m972M506P067j309p641k135O626N114m249p023R78P512K393o388
330g07n272L970P064p77p339k593O134N366l666p030M68P230K794n923n462L435
346b308O949k08p030l006N661N562l145o941j1O871L170n425n606K876O841K96
362D546o717l318N177N636k583o794m98O513L465m918n686K347O684P19o333l584
378e344M666N717k110o610q81O134L668m402n702J805O562J057n936l799M224
393i51N658j613o382j292N810L831l943n691J437O227J473n584l988L823N590
$$ plain form
408 4405 3230 -2949 -4500 849 4883 1370 -4271 -3264 2770 4498 -765 -4743 -1466 4091 3320
423 3320 -2596 -4480 584 4693 1508 -3927 -3351 2437 4403 -394 -4626 -1624 3845 3327 -2229 -4414
439 -4414 301 4458 1778 -3704 -3381 2149 4291 -128 -4368 -1806 3486 3469 -2017 -4289 57 4247
455 4247 1886 -3374 -3393 1768 4271 81 -4183 -1965 3285 3365 -1669 -4157 -259 4097 2001 -3114
471 -3114 -3466 1598 4065 322 -3924 -2114 3011 3414 -1427 -4078 -340 3784 2158 -2856 -3438 1325
487 1325 3978 509 -3791 -2106 2726 3391 -1172 -3903 -625 3685 2219 -2696 -3326 1067 3852 636
503 636 -3504 -2296 2509 3400 -1023 -3775 -722 3426 2248 -2342 -3411 886 3731 791 -3317 -2305
519 -2305 2294 3297 -712 -3695 -880 3264 2347 -2199 -3264 677 3547 1010 -3164 -2383 2066 3321
$$ packed form
408D405j175o179j551N349M034l513n641J007O034J728n263l978L277N557p71
423C320n916j884N064M109l185n435N76N788J966m797m232L002N469n18n556k185
439d414M715M157k680n482L23N530K142m419m240K562N292j7n486k272M346M190
455D247k361n260j9N161K503m190m264K218N250Q0n034k488L898M356k096n115
471c114l52N064K467l743m246J810N125M03m841k651L738M124j626n014n82M763
487A325K653l469m300J685M832O65m563k731L278M310j466m915o30M393K785l216
503F36m140J208M805Q91m423k752L053M148j178m590j069M297K845k940m108J012
519b305M599J003m009k983K815M144r17m546j065L941K870k537m174P81M449J255
$$ plain form
535 3321 -620 -3511 -971 2993 2407 -1947 -3285 478 3498 1028 -2957 -2377 1853 3217 -372 -3395
551 -3395 -1163 2925 2376 -1782 -3183 325 3311 1189 -2788 -2444 1716 3146 -254 -3266 -1194 2665
567 2665 2444 -1578 -3177 215 3213 1235 -2617 -2397 1489 3120 -82 -3167 -1305 2577 2426 -1464
583 -1464 -3036 21 3075 1364 -2486 -2470 1389 3030 3 -3009 -1390 2390 2469 -1269 -3056 -71
599 -71 2978 1384 -2305 -2458 1182 3000 161 -2944 -1462 2264 2449 -1111 -2933 -246 2863 1532
615 1532 -2190 -2482 1069 2934 263 -2766 -1545 2076 2506 -984 -2935 -312 2740 1555 -2006 -2487
631 -2487 886 2888 397 -2703 -1599 1942 2463 -831 -2837 -480 2633 1653 -1913 -2468 764 2804
647 2804 500 -2544 -1681 1794 2505 -714 -2787 -553 2516 1680 -1726 -2486 614 2770 620 -2472
$$ packed form
535C321l941k891K540L964n86m354j338L763L020k470l985N80M230J364l589l023
551c395K232M088n49m158j401L508K986k122l977L44M160J430l400l012K072L859
567B665k21m022j599L392K998j978l852K20L886J631l202l085J862L882j51l890
583a464j572L057L054j711l850J6L859J641l027l012J619L780P9l738j787K985
599g1L049j594l689j53L640J818k839l105J482L726J85l560j822K687L109j331
615A532l722k92L551J865k671l029J221L621M30l490j951K623L052j185l561m81
631b487L373K002k491l100J104L541N21l294k006K357L113r80l566n55L232K040
647B804k304l044Q63L475P11l219k073K234L069q36l406p60L100K156k150l092
$$ plain form
663 -2472 -1694 1688 2450 -538 -2725 -658 2417 1744 -1631 -2456 492 2663 714 -2366 -1770 1538
679 1538 2467 -457 -2645 -754 2277 1806 -1476 -2462 362 2633 792 -2250 -1807 1422 2416 -306
695 -306 -2558 -867 2208 1827 -1351 -2426 257 2520 901 -2128 -1854 1302 2414 -186 -2495 -923
711 -923 2071 1886 -1206 -2415 135 2458 976 -2012 -1883 1141 2405 -74 -2419 -1032 1957 1895
727 1895 -1100 -2378 -9 2380 1063 -1884 -1920 1021 2374 27 -2337 -1097 1827 1923 -954 -2361
743 -2361 -96 2298 1137 -1787 -1936 915 2326 145 -2262 -1153 1717 1946 -851 -2320 -187 2212
759 2212 1194 -1701 -1938 775 2294 226 -2182 -1219 1616 1953 -748 -2275 -282 2150 1227 -1576
775 -1576 -1950 699 2258 327 -2106 -1270 1536 1954 -627 -2236 -352 2058 1307 -1462 -1955 588
$$ packed form
663b472P78L382P62k988k187K067L075o73l375q25K948K171j949l080N96L308
679A538R29k924k188J891L031m71l282r86K824K271j841l042M43L229R94k722
695c06k252J691L075l81l178j075K683K263j619l029K74L156J112k600k309J572
711i23K994j85l092j209K550K323j482k988J29L024J264k479k345J387K989o2
727A895k995j278K369K389j317k947l6K941J353k347k364J240K924R6k877j407
743b361K265K394j161k924j49K851J411k181k407J109K870K29k797j469K133K399
759B212j018k895k37K713J519k068k408R63K835L37k701j527J993K432r23k803
775a576l74K649J559j931k433Q36K806M18k581j609J884K410p51k769m93K543
$$ plain form
791 588 2219 424 -2030 -1318 1420 1952 -527 -2193 -471 1950 1357 -1370 -1964 472 2157 501
807 501 -1948 -1382 1306 1961 -430 -2147 -566 1897 1398 -1256 -1972 369 2115 578 -1850 -1424 1207
824 1207 1963 -318 -2093 -632 1823 1442 -1152 -1961 267 2069 655 -1752 -1459 1109 1951 -231
840 -231 -2054 -704 1722 1476 -1069 -1953 170 2018 721 -1703 -1490 1015 1936 -152 -2002 -766
856 -766 1647 1512 -979 -1926 98 1966 793 -1610 -1510 907 1936 -53 -1932 -810 1590 1524 -870
873 -870 -1916 -5 1928 854 -1513 -1551 829 1912 54 -1897 -896 1483 1547 -768 -1927 -85
889 -85 1841 926 -1448 -1584 728 1889 139 -1846 -954 1382 1590 -692 -1883 -167 1797 988 -1361
906 -1361 -1591 620 1879 221 -1768 -1029 1314 1607 -584 -1860 -254 1740 1029 -1270 -1610 547
$$ packed form
791E88J631j795k454P12K738N32k479j666J722K421n93k727n94K436J685j656
807E01k449N66K688O55k391j717J581K463m99k654p16K341J746j537k428M26K631
824A207P56k281j775J461K455l81k594q09K228J802j414k407K93K568Q42k182
840b31j823J350K426k46k545q84K123J848j297k424K13K505R21k088j850J236
856g66K413j35k491r47K024J868j173k403J00K417J029j989j879J122K400o6k394
873h70j046J911J933j074k367l8K380J083j858j951J001K379O4k315j159J842
889h5J926r15k374j36K312J161j750j985Q92K336K08k282j191J716J964q09k349
906a361k30K211J259j658j989P39K343K93k191j276J606J994p11k299l40K157
$$ plain form
922 547 1842 291 -1714 -1067 1245 1601 -498 -1835 -329 1666 1103 -1207 -1639 456 1800 360
938 360 -1668 -1102 1142 1629 -430 -1796 -408 1607 1121 -1110 -1618 360 1798 431 -1588 -1144 1082
955 1082 1629 -329 -1758 -464 1567 1177 -1027 -1641 309 1734 497 -1515 -1190 988 1629 -241
971 -241 -1746 -529 1483 1199 -942 -1627 193 1720 574 -1469 -1225 874 1634 -161 -1711 -607
987 -607 1411 1253 -865 -1631 117 1685 647 -1374 -1281 804 1637 -80 -1649 -678 1361 1279 -759
1004 -759 -1621 30 1649 699 -1323 -1284 735 1613 20 -1627 -743 1284 1306 -695 -1625 -32 1584
1021 1584 756 -1249 -1321 646 1615 78 -1578 -794 1205 1333 -616 -1609 -131 1557 819 -1183 -1327
1038 -1327 575 1594 156 -1516 -832 1154 1352 -529 -1582 -182 1495 867 -1098 -1366 486 1576
$$ packed form
922E47J295j551k005O47K312L56k099j337J506J995n63k310m32K095J344j440
938C60k028N66K244M87k059j366J388K015m86k231n08J978J438j367k019M44K226
955A082N47j958j429J294K031l90k204o14J950J425j237k012L25K178O41j870
971b41j505J217K012k84k141o85J820J527j146k043K44K099P60j795j550J104
987f07K018j58k118p66J748J568j038k021R3K085Q33j717j569R71K039q2k038
1004g59q62J651J619r50k022L9K019Q78j593j647Q84K027K2k001r30J593J616
1021A584q28k005p2J967R69j537j656P84J999J28j949r93J478J688p38k002j44
1038a327J902J019j438j672O84J986J98j881j053J400J677o28j965k68J852J090
$$ plain form
1054 1576 218 -1474 -886 1062 1363 -457 -1576 -264 1449 904 -1038 -1376 404 1554 296 -1433
1070 -1433 -937 1005 1379 -368 -1538 -324 1383 962 -960 -1396 329 1543 354 -1358 -968 922
1086 922 1400 -279 -1517 -390 1352 986 -888 -1391 248 1498 420 -1311 -1013 862 1376 -228
1102 -228 -1477 -458 1274 1023 -814 -1409 188 1474 467 -1251 -1049 774 1394 -146 -1458 -501
1118 -501 1221 1056 -749 -1384 108 1441 540 -1198 -1066 727 1395 -82 -1415 -562 1159 1080 -668
1135 -668 -1386 56 1407 573 -1142 -1105 638 1395 -25 -1387 -608 1108 1100 -606 -1384 -26 1376 639
1153 639 -1097 -1122 571 1370 63 -1346 -664 1048 1131 -544 -1369 -83 1329 688 -1016 -1135 507
1170 507 1377 115 -1316 -700 999 1150 -474 -1355 -156 1288 731 -968 -1160 434 1361 180 -1280
$$ packed form
1054A576j358j692N88J948L01j820j119J312J713n45j942l38J780J150j258j729
1070a433M96J942L74j747j170J214J707m21j922m36J725J214j189j712L90J890
1086I22M78j679j238J127J742l66j874n03J639J250j078j731K98J875N14j604
1102b28j249J019J732k51j837n95J597J286j007j718K02J823O20j540j312R57
1118e01J722j65j805o35J492J333r01j738J32J793O68j477j333Q53J721p9j748
1135f68p18J442J351q34j715L7J743P57j420j362P79J716qj706p78J358J402p37
1153F39j736k5J693P99j307j409O82J712Q3j675q25J286J412o41j704j19J642
1170E07Q70j262j431O16J699J51j624q81J199J444n57j699j92J594R27j181j460
$$ plain form
1187 -1280 -762 933 1175 -396 -1349 -220 1237 778 -890 -1180 363 1339 244 -1237 -795 867 1178
1204 1178 -323 -1335 -269 1213 822 -826 -1185 292 1331 293 -1179 -837 803 1199 -268 -1307
1220 -1307 -329 1167 850 -785 -1207 231 1307 353 -1142 -875 752 1201 -206 -1293 -386 1122 878
1237 878 -720 -1209 161 1283 412 -1097 -908 693 1214 -150 -1277 -428 1075 917 -655 -1207 115
1254 115 1256 450 -1047 -930 638 1214 -80 -1241 -480 1022 962 -599 -1209 44 1232 510 -1003
1271 -1003 -957 552 1208 -24 -1216 -539 949 964 -531 -1216 -8 1199 556 -946 -989 506 1204 52
1289 52 -1188 -578 923 993 -459 -1229 -66 1165 597 -893 -999 439 1206 117 -1156 -615 863
1306 863 1012 -416 -1199 -130 1128 646 -842 -1019 375 1192 151 -1111 -665 820 1013 -361 -1184
$$ packed form
1187a280N18J695K42j571r53J129J457m59j668k90J543R76j095j481M42J662L11
1204A178j501j012J066J482l91j648l59J477J039j038j472L42J640L96j467j039
1220a307R78J496l17j635m22J438J076r54j495K67J627M49j407j087R07J508k44
1237H78j598m89J370J122q71j509J89J601N21j364j127Q49J503j58j572n52J322
1254A15J141q06j497J17J568N76j294j161P61J502o0j561o10J253J188p22j513
1271a003M6J509O56j232j192O77J488J5j495o85J208J207o43j502m3J495O98j152
1289E2j240O10J501P0j452p70J163J231n68j490j06J438P67j089j273N41J478
1306H63J49j428p83J069J258m82j488j77J394Q17j041j262M46J485J93j374q23
$$ plain form
1323 -1184 -188 1095 664 -785 -1050 317 1168 221 -1074 -700 763 1040 -282 -1163 -236 1056 727
1340 727 -739 -1037 275 1154 265 -1040 -724 708 1044 -240 -1155 -288 1020 736 -693 -1052 197
1357 197 1141 300 -994 -774 652 1057 -176 -1140 -341 978 769 -630 -1058 154 1125 358 -958 -779
1375 -779 613 1065 -119 -1110 -381 930 808 -570 -1061 94 1103 414 -920 -811 539 1066 -63
1392 -63 -1082 -426 882 828 -522 -1070 27 1080 447 -877 -850 481 1061 -12 -1071 -490 846 849
1410 849 -468 -1066 -8 1046 487 -824 -860 438 1074 52 -1042 -501 801 869 -422 -1052 -72 1025
1428 1025 534 -777 -869 385 1057 90 -1011 -541 767 886 -365 -1050 -114 985 562 -747 -909 332
1446 332 1045 134 -978 -577 720 901 -312 -1044 -159 971 601 -681 -910 289 1037 199 -941 -610
$$ packed form
1323a184R96J283m31j449k65J367Q51r47j295L74J463K77j322q81R27J292l29
1340G27j466k98J312Q79q89j305L16J432L36j284r15Q67J308k84j429l59J249
1357A97R44q41j294K20J426M05j233r64P99J319k09j399m28J212R71p67j316J79
1375g79J392M52j184r91P29J311j22j378m91J155J009o89j334J09J350N27j129
1392f3j019O56J308n4j350n48J097J053o33j324K7J331N80j073j059N81J336L
1410H49j317n98J058J054n59j311l6J298O36j022j094N41J302O8j291o30R80J097
1428A025m91j311r2J254O72r67j101M70J308J19j251o85R36J099m23j309j62J241
1446C32P13r11j112M01J297J81j213p32Q85J130l70j282k29J199P48q38j140L31
$$ plain form
1464 -610 683 926 -245 -1022 -201 936 645 -643 -918 232 1039 237 -904 -643 617 926 -203
1481 -203 -1017 -266 881 664 -598 -941 168 1009 282 -867 -677 570 943 -149 -990 -318 866 702
1499 702 -543 -940 122 996 334 -836 -702 527 947 -89 -983 -342 832 724 -495 -936 71
1516 71 970 367 -815 -709 490 924 -48 -974 -388 777 738 -454 -943 29 944 406 -772 -764 438
1535 438 943 -16 -941 -419 764 755 -396 -945 -17 936 443 -724 -750 389 951 65 -907 -447 727
1554 727 778 -349 -936 -57 910 484 -675 -785 335 939 86 -892 -494 657 783 -315 -939 -119 879
1573 879 510 -640 -805 273 934 152 -865 -536 630 807 -261 -932 -163 849 560 -600 -824 258
1591 258 938 193 -832 -557 584 837 -198 -920 -195 834 580 -564 -817 202 917 224 -812 -595
$$ packed form
1464f10J293K43j171p77Q21J137k91j288k75J150Q07q02j141K61J260L09j129
1481b03q14P51J147k17j262l43J109Q41p27j149J90J247L73j092q41O72J184j64
1499G02j245l97J062Q74o62j170J34J229M20j036q94O41J174j08j219m41J007
1516G1Q99o03j182J06J199M34r72r26N86J165l9j192m89R72R15n38j178QJ202
1535D38N05r59r25N22J183rj151n49R28R53m93j167k6J139N62q86r72M60J174
1554G27N1j127n87Q79R67m26j159j10J120O04q53r78L98J151J26j098o24Q20R98
1573H79l69j150j65J078O61p82j017L29J166J77j068o71P69J012k89j160k24J082
1591B58O80p45j025K75J141K53j035p22P25J029k54j144k53J019P15o93j036K17
$$ plain form
1609 -595 546 836 -178 -897 -244 784 596 -528 -839 144 898 251 -774 -619 501 853 -119 -899
1627 -899 -289 760 607 -469 -834 106 886 324 -735 -628 457 850 -59 -864 -319 729 659 -431
1645 -431 -844 47 864 345 -706 -664 415 847 -27 -861 -372 691 664 -384 -843 -12 848 368 -677
1664 -677 -684 365 843 13 -839 -396 653 695 -346 -847 -26 827 414 -630 -693 327 851 55 -811 -426
1684 -426 621 711 -296 -838 -71 798 445 -594 -719 281 842 107 -790 -447 580 715 -259 -842 -114
1703 -114 776 471 -567 -729 240 832 131 -757 -480 548 725 -217 -823 -165 755 506 -512 -732 203
1722 203 829 191 -730 -511 499 744 -158 -815 -194 722 530 -479 -750 152 802 221 -710 -542 457
1741 457 748 -129 -809 -230 683 546 -454 -748 112 787 254 -673 -567 435 753 -78 -780 -259 676
$$ packed form
1609e95J141K90j014p19O53J028j88j124l11R83P54o47j025J55J120L52r72p80
1627h99O10J049j53j076l65R40P80n62j059J07J085L93r09q05N45J048p0j090
1645d31m13Q91Q17n19j051M2J079M32q74q34M89J063k7j048m59Q31Q60m80j045
1664f77pJ049M78q30q52M43J049M2j041n01Q21Q53m13j044o3J020N24p96q66L85
1684d26J047R0j007n42P67Q69l53j039j25J000N61p35q97L43J027J35r74n83P28
1703a14Q90l05j038j62R69N92p01q88K77J028J77r42o06O58R20k49j018k20R35
1722B03O26o38r21K19J010K45r02o57O21R16j92j009k71R02O50n81r31J68R99
1741D57K91q77o80N79R13j37j000k94Q60O75n33r27J06J002L18q31p02N21R35
$$ plain form
1760 676 577 -400 -733 71 800 295 -643 -571 405 757 -45 -768 -296 644 601 -364 -754 40 774 335 -619
1781 -619 -592 358 759 -3 -753 -337 603 617 -329 -766 -6 758 355 -594 -619 315 767 40 -745 -361 577
1802 577 638 -279 -750 -42 734 385 -543 -634 279 754 81 -713 -390 551 644 -241 -757 -82 702 423 -526
1823 -526 -659 231 742 107 -707 -423 510 652 -200 -759 -127 700 440 -485 -660 195 741 152 -673 -436
1843 -436 469 662 -163 -733 -159 680 469 -438 -655 157 743 194 -650 -473 438 677 -132 -721 -211 640
1863 640 498 -430 -673 117 727 221 -633 -492 395 673 -91 -719 -231 605 521 -387 -670 80 715 257
1883 257 -600 -518 365 691 -48 -703 -255 590 531 -339 -678 50 707 295 -567 -530 342 682 -23 -689 -290
1904 -290 568 549 -307 -678 10 690 309 -547 -550 287 676 15 -676 -327 521 568 -267 -693 -31 674 336
$$ packed form
1760F76r9r77l33Q04P29n05r38P2R76L52q02p23M72R40m3r65l90P94P34m39r54
1781f19K7R50M01p62p50M16R40J4r46m37P60P64m03r49k5R34M52p27p85L84R38
1802E77O1r17m71P08P76l49r28r1R13M75o73p94L23R41R3q85n16O75P84k79r49
1823e26j33Q90N11o35q14K84R33J42q52n59O32Q27k60r25j75Q55N46n89q25K37
1843d36R05J93q25n70N74Q39k11r07k17Q12N86n49q44J77R11K39q09n89N10Q51
1863F40j42r28k43P90O10n06q54J41Q87K78p64o28M88Q36q4r08k83P50O35m58
1883B57q57Q2Q83L26p39o55M48Q45n9q70l39P28O57m12q62L7Q72L40p05o66L99
1904b90Q58j9q56l71O88O80l81q56lQ37L89o61o91L49Q48M7q35m26O62P05l38
$$ plain form
1925 336 -500 -563 266 684 52 -652 -349 510 584 -220 -677 -63 664 366 -484 -568 238 681 98 -639 -366
1946 -366 464 584 -193 -677 -105 619 391 -462 -589 179 661 95 -630 -415 436 591 -171 -678 -139 618
1966 618 411 -425 -597 155 678 159 -604 -411 420 605 -140 -656 -152 593 441 -407 -602 125 667 186
1986 186 -563 -430 367 621 -87 -651 -190 567 444 -363 -611 90 644 203 -567 -468 349 607 -77 -642
2006 -642 -220 537 476 -335 -615 53 637 246 -532 -467 323 621 -27 -626 -243 518 477 -290 -604 16 631
2027 631 268 -499 -487 291 613 3 -616 -285 492 497 -262 -612 -31 603 293 -481 -514 241 614 29 -608
2048 -608 -314 451 506 -223 -618 -50 600 318 -447 -510 221 623 69 -586 -330 449 525 -189 -609 -68 586
2069 586 341 -423 -527 186 600 97 -569 -338 413 524 -162 -613 -103 557 353 -398 -540 147 592 115
$$ packed form
1925C36q36o3Q29M18o32p04L03Q59P4q04m57O14P27k98q50q4Q06M43n83p37K73
1946c66Q30J20p77m84N72P24k28q53j27P68M82n66p25K15Q51J55p62n07N39P57
1966F18k07q36j72P52N23n19p63J93Q31J85p45n16N04P45j52q48j95P27N42m81
1986A86p49J33P97K54p08n64M61P57j23q07k48P01N54m41p70R9Q17K58o84n65
2006f42M22P57o1q11k80O68N84l91p78O5P90K98o48n99L83P61m1p67l14O20O15
2027F31l63p67J2P78L22o10o19L31P77Np59l50N81O34l10p74l3P55L73n85o37
2048f08K94P65N5p29l95N68O50k82p65o3P31M02n54o55K56P79P6p14m20N41O54
2069E86k45p64j04P13M14n03o66K31P51J11o86m51N10O60k04p51j42O87M45m77
$$ plain form
2089 115 -560 -379 379 535 -134 -603 -138 536 384 -366 -548 128 617 160 -527 -384 357 553 -93 -595
2109 -595 -155 536 401 -342 -555 91 586 172 -518 -415 314 551 -78 -592 -184 500 411 -315 -561 48
2129 48 579 203 -492 -434 295 553 -46 -581 -210 490 431 -293 -565 37 575 237 -475 -437 271 559 -19
2150 -19 -567 -238 464 454 -242 -550 21 568 268 -449 -449 238 550 3 -560 -270 424 454 -232 -555 -26 545
2172 545 270 -431 -476 208 555 44 -540 -287 399 482 -195 -561 -47 537 317 -385 -481 189 559 78 -528
2193 -528 -305 395 493 -161 -540 -74 520 328 -373 -479 150 555 107 -519 -324 364 489 -139 -558 -104
2213 -104 505 339 -346 -505 120 546 123 -495 -358 340 489 -102 -548 -132 481 357 -315 -503 92 539
2233 539 166 -469 -360 307 509 -89 -543 -172 466 384 -293 -497 67 531 177 -466 -390 275 492 -54 -542
$$ packed form
2089A15o75J81P58J56o69m69M65O74j52p50j82O76M89m57o87J43P41J96o46n02
2109e95M40O91j35p43k13O46M95m14o90J03P29K37o29n14M08O84q9p26k46O09
2129D8N31l76o95N8P29K58n99n35L71P00n9p24k72O02N38l38p12L8P08K88n78
2150a9n48L29P02j0o96l08N71N47l00p17%O87L12n47n63K90O94L0o86l23N29N71
2172E45k75p01m5O84L47n11n84K53O86Q3o77l66N14N84k20p02r6O70L70m81o06
2193e28K23P00R8o54l79M66N94j92p01j06O29M05m48o26J95O88J25o28m19M54
2213a04O09j66o85j59O25M26m23o18J37O98J49n91m46M16O13j24o72j88N95M47
2233E39l73o35J09O67K02n98m54L71O38q2o77k04N64M64l54o43P6O65K17n46m88
$$ plain form
2254 -542 -192 440 382 -268 -512 42 519 196 -436 -396 255 502 -25 -514 -205 431 414 -241 -508 25 523
2275 523 227 -407 -389 247 501 2 -510 -221 408 416 -215 -510 -33 496 238 -394 -420 196 503 29 -514
2296 -514 -252 387 427 -196 -518 -44 483 261 -386 -420 173 499 59 -488 -259 356 430 -157 -503 -49 474
2317 474 278 -350 -436 162 507 73 -473 -269 346 450 -136 -502 -82 460 300 -329 -452 132 499 95
2337 95 -474 -313 314 442 -116 -494 -106 448 315 -304 -450 108 498 124 -451 -323 296 465 -87 -482
2357 -482 -118 451 331 -275 -460 91 493 149 -427 -332 278 463 -53 -489 -152 422 344 -257 -461 48 481
2378 481 163 -414 -353 250 463 -39 -481 -177 397 359 -235 -469 22 470 194 -390 -361 229 458 -13 -466
2399 -466 -192 387 385 -214 -456 14 462 219 -369 -377 207 473 12 -460 -211 361 380 -192 -469 -22 454 220
$$ packed form
2254e42L50O32n8o50k44N54M77l23o32M0O51K47n27m89L09O36j7o55k67N33M98
2275E23k96o34J8O36K54m99n12K89O29Qo31k95M77N29k58o32k6O16L07m74n43
2296e14K62O39M0o23l22M74N27k22o47l4N93L26m40n47K29O15P4n87l46M54N23
2317D74j96o28q6N98L45m34n46K04O15J04n86l66M20N42j60o29j23N84L67m04
2337I5n69J61O27J28n58l78L88N54j33o19j46N58L90l74n75J28O19J69n52l95
2357d82L64N69j20o06j85N51M02l44n76R5O10J85n16m36L37N74p8o01k04N09M33
2378D81l18n77O1O03K13n02m42L04N74l8n94k34M91M48k76n84K9N90K29m71m53
2399d66K74N79kn99k42M70M48k43n88qN84K66m61m72K49N72J9n72k77M47M76k34
$$ plain form
2421 220 -370 -392 180 451 22 -455 -239 346 386 -172 -458 -40 439 238 -335 -388 163 470 68 -433 -243
2442 -243 338 395 -137 -462 -59 438 261 -317 -399 134 455 78 -430 -264 298 392 -121 -460 -82 418 270
2463 270 -300 -409 104 452 97 -410 -281 287 410 -98 -460 -99 406 295 -264 -426 96 451 120 -404
2483 -404 -288 267 415 -64 -449 -116 398 307 -257 -418 75 451 140 -383 -296 253 402 -57 -437 -151 382
2504 382 304 -233 -431 43 435 149 -376 -328 215 413 -31 -440 -173 359 329 -210 -415 20 430 182 -353
2525 -353 -337 212 430 -4 -435 -179 343 348 -197 -426 3 423 194 -343 -347 172 423 17 -421 -201 323 343
2547 343 -170 -433 -35 397 195 -324 -361 152 411 25 -410 -211 302 359 -156 -428 -40 405 225 -310 -364
2568 -364 141 434 58 -396 -230 298 362 -120 -426 -58 379 233 -284 -380 107 405 66 -388 -256 272 357
$$ packed form
2421B20n90k2N72K71m29m77K16N85M0n58k86M18M79k01n73n3N51L07m02n01J90
2442b43N81N7n32l25M03M97j77n78q2N33L21l77n08J66N62R4n13l39L78N00j48
2463B70n70j09N13L48l55n07J29N68J23n08l62L61N05j11n59j62N22L55l31n24
2483d04J16N55J48m79l85L33N14r1n64j61M93L76l11n23Q7N49J49m59l80K86N33
2504C82p8n37j98M74L92k86n25M8N43J98m44m09K67N32l0n39k05M35M10k48n35
2525c53J6N49K18m34m31K56N22Nn45k29M29M20k29n37mN19K51m06m38K20N24K0
2547C43n13k63L98M32k02n19l7N13K59l86m35J99N13N7n15k72L88M45j80n35n4
2568c64N05K93l76m54J66N28O4m82l06L68M37j46n17r6M87K98l39m54J32N28Q5
$$ plain form
2589 357 -114 -436 -93 379 251 -274 -396 87 399 83 -376 -263 260 357 -85 -410 -87 365 270 -253 -384
2610 -384 76 410 118 -356 -253 244 381 -57 -397 -109 356 268 -234 -388 57 390 124 -361 -292 208 379
2631 379 -44 -406 -151 339 278 -209 -397 28 399 141 -341 -301 201 382 -22 -390 -148 325 295 -182 -396
2652 -396 18 394 158 -309 -297 183 375 6 -385 -161 320 303 -168 -392 -1 383 175 -310 -317 160 381
2673 381 18 -378 -189 290 306 -156 -397 -31 378 187 -291 -330 136 377 34 -368 -193 281 324 -125 -379
2694 -379 -44 352 216 -262 -323 127 388 62 -357 -211 265 339 -109 -389 -59 351 212 -262 -338 106 379
2715 379 72 -362 -238 252 330 -95 -380 -93 343 227 -243 -344 80 373 82 -347 -230 226 337 -78
2735 -78 -378 -88 331 237 -221 -333 64 374 104 -314 -255 220 347 -55 -369 -111 310 248 -209 -360 44
$$ packed form
2589C57m71l22L43M72j28n25j22M83L12l16m59J13N23R7m42l25L23M52r5n23j31
2610c84M60L34k92m74J03M97J37m38l40K88M65q8n02j54M45L33k66m85O9N00J71
2631C79m23l62K55M90o1m87j88M25L71k58m82M0N02J81m04l68K42M73l0m77k14
2652c96M14L76k36m67J2M80J92l69l91K24M81j7m71k24L91L84k08m85pM77K21
2673C81l63l96J89M79J6m62k41L66M09j91m78l9M66K41l43m02J75M74M3m49k54
2694c79L35L96j36m78o1M50K61l26m19J46M76P4m48k80L30M10j39m74p6M44K73
2715C79l07m34J24M90P8m25k85K87M36j16m70j01M24K93k91m29J17M56J11m15
2735g8l00K90M19r4m58j12L97L10k70m18N9M75J27m02l14K58M21o2m57j51M04
$$ plain form
2756 44 353 111 -316 -264 197 345 -40 -375 -123 293 248 -191 -355 31 353 130 -305 -269 172 353 -17
2777 -17 -351 -135 291 260 -149 -342 14 353 155 -293 -269 161 339 3 -348 -150 275 282 -145 -339 -5 344
2799 344 160 -276 -295 132 332 4 -339 -177 260 285 -129 -345 -39 325 170 -252 -294 127 348 32 -337
2820 -337 -182 257 290 -110 -346 -44 327 184 -238 -296 122 345 59 -334 -189 233 309 -103 -340 -59 314
2841 314 201 -236 -313 87 328 54 -317 -213 217 299 -85 -338 -77 290 199 -223 -310 72 337 78 -297
2862 -297 -211 213 302 -63 -335 -84 297 218 -198 -308 59 332 90 -290 -231 199 308 -50 -325 -99 272
2883 272 220 -200 -324 34 312 106 -289 -243 175 305 -45 -338 -126 267 233 -171 -322 19 319 114 -270
2904 -270 -241 165 304 -14 -310 -118 252 246 -142 -293 8 306 135 -252 -250 149 311 6 -296 -141 230 238
$$ packed form
2756D4L09k42m27N2M61J48l85l35K52M16m5m39j64L86L22k23m35L6M41J81l70
2777a7l34K16M26l1m09j93L56L39j98m48K4M30J78l36l51J98M25Pm27j94L34L49
2799C44j84m36j9M27K00l28l43J62M37K5m14k16L06L64j55m22m2M21K21l16l69
2820c37J55M39L3m00k36L02L71j43m22n8M18K23k86l93J45M22P6m12k37K81L73
2841C14j13m37p7M00K41k74l71J04M30Q2l84k53K61L67r1m22q7L82K65k59l75
2862b97Q6M24Q9l65k72K51L81p9m16j10L67K73k42l80N9M30J09l58k75K26L71
2883B72n2m20j24L58K78k06l95M6M18J30l50k93K12L93l4m04j51L41L00k05l84
2904b70K9M06J39l18k96J92L70ol88j51L01K98j71l87KL99J62l05l02J55L71Q
$$ plain form
2926 238 -133 -317 -6 309 139 -251 -262 118 302 -1 -307 -155 217 247 -131 -313 -27 297 145 -228 -258
2947 -258 109 315 18 -291 -163 231 266 -97 -310 -32 287 172 -219 -261 96 302 46 -286 -170 211 263
2968 263 -93 -310 -62 268 171 -214 -273 76 304 57 -284 -187 191 253 -78 -313 -70 263 169 -188 -282 52
2990 52 296 77 -273 -175 183 279 -52 -282 -68 263 190 -173 -267 53 298 71 -263 -196 159 271 -53 -301
3012 -301 -96 237 196 -165 -281 31 275 93 -251 -219 146 243 -41 -289 -102 232 202 -152 -269 35 289
3033 289 102 -238 -211 155 284 -9 -273 -108 233 216 -135 -275 19 281 114 -222 -212 127 273 4 -272
3054 -272 -120 225 212 -134 -291 -12 263 123 -223 -227 119 267 8 -268 -136 199 221 -103 -280 -11 255
3075 255 136 -196 -218 101 270 34 -259 -136 208 233 -98 -266 -32 256 147 -194 -231 93 262 42 -255
$$ packed form
2926B38l71j84L11L15j70l90j1L80J84l03l06J52L72L0l78j82K86L24j52l73l0
2947b58L67K06k97l09J28L94L5l63k13K78L19j15l91m2L57K06k56l32J16L81N2
2968B63l56k17K48L30r7l85n9L49K28k47l41R7L78O2l31k35K43L33r4l57r4L34
2990E2K44k19l50R8L58R6l31k30K14L31p3l63r4L20K45k27l34O7L55J12l24k48
3012c01K05L33m1l61j16L12K44j82l44L2L65R7k84k48J87L34l0l54j17L04K54
3033B89j87l40K7L66J29k93k64J65L41j7l51j40K94K62j67l36J0L39J46k69k76
3054b72J52L45j3l46j57K79K75j40l46mL46J48k59k76J32L35K2l24j77K69K66
3075B55j19l32k2L19J69k36k93J23L44K5l31j68K34K88j09l41l7L24J69k20k97
$$ plain form
3096 -255 -150 186 219 -85 -275 -42 244 139 -187 -225 74 260 39 -251 -158 166 219 -63 -264 -46 236
3117 236 157 -160 -240 66 272 72 -227 -159 167 241 -56 -255 -51 236 167 -145 -233 54 252 70 -216 -166
3139 -166 158 232 -48 -258 -80 225 171 -158 -239 40 253 83 -210 -179 145 248 -26 -252 -83 203 171 -124
3161 -124 -237 22 247 92 -204 -171 135 256 -16 -239 -87 201 183 -118 -231 13 240 83 -195 -176 106
3182 106 238 -3 -241 -107 181 179 -110 -240 1 232 94 -186 -194 95 236 12 -233 -117 188 185 -97 -234
3204 -234 -5 235 122 -172 -191 77 247 35 -222 -110 180 194 -95 -228 -5 229 124 -176 -196 85 237
3225 237 22 -227 -123 162 191 -90 -236 -29 216 122 -144 -196 67 236 38 -214 -127 157 196 -46 -231 -39
3247 -39 208 134 -152 -191 62 224 52 -200 -134 138 198 -40 -227 -50 194 143 -131 -212 42 219 49 -194
$$ packed form
3096b55J05L36L3l04j90K33K86j05l26l8K99J86k21k90R3L24N3k82k01K18K82
3117B36p9l17q0L06K06k00k99O8L26P4k97j99K04K87o9l12q8K87J98j82k86N0
3139a66L24P4k80k10J78L05n4l29q1K79K13j70k93L1L24J03k74k26J69K86l2k95
3161a24j13K59K25j55k96L3L06J21k72k23J52K88j8l01j13K44K27j57k78J9K82
3182A06J32k41k38J34K88kk89j30K41K31j38k80qK89J41k24k45J16L05lk82j37
3204b34K29K40j13k94j9K68J70k12k57J12K90J4k89j33K23K34j05l00k0K81J52
3225B37k15k49J04K85K9k81j46K07K45r4k66n2K63J69j98k52Q7K84L9k42j85J92
3247c9K47p4k86l9K53J62j72k52O6K72O0k38j87J77K44n1k74q1K54J77j70k43
$$ plain form
3269 -194 -148 121 196 -47 -234 -57 184 152 -137 -211 40 223 64 -192 -143 116 205 -28 -216 -52 190 154
3291 154 -118 -197 30 221 66 -180 -148 112 207 -11 -210 -77 185 161 -105 -195 16 206 83 -171 -158 99
3313 99 204 -21 -207 -86 160 148 -106 -204 -1 209 88 -164 -145 92 210 1 -199 -91 164 166 -86 -204
3335 -204 -4 202 101 -148 -173 87 208 23 -197 -91 142 167 -70 -192 -13 201 102 -150 -164 62 196
3356 196 22 -186 -109 137 164 -63 -205 -28 187 109 -141 -171 62 193 26 -181 -108 142 174 -53 -190 -26
3378 -26 180 117 -127 -175 54 203 48 -178 -106 136 174 -52 -192 -37 181 115 -128 -173 46 189 40 -179
3400 -179 -128 119 170 -40 -193 -50 162 112 -114 -174 44 195 45 -168 -113 119 179 -26 -178 -59 170 134
3422 134 -104 -163 30 191 62 -162 -131 108 176 -26 -184 -65 158 132 -88 -171 22 175 53 -157 -144 90
$$ packed form
3269a94M6K69P5k43j87J77K41l2k89p4K51J83j59k56M9K59Q9k33j88J64K42l6
3291A54k72p9K27J91j55k46L2K60R5k18j99J33K62k4k66r0K11J90j23k54J3K57
3313I9J05k25j86J21K46j2k54r8K03K10j21k52J9K37J18k09k00J08K55Kk52j18
3335b04K00K06j01k49k5K60J21j85k20J06K33K5k37j22J79K14r9k52j4K26J34
3356A96j74k08P7K46K7k27j42J77K15p8k50l0K33J31j67k07P3K50L2k27j37J64
3378b6K06o3k44m8K29J49j55k26P2K42L8k26j40J55K18o6k43m5K19J43j49k19
3400a79N1K47N1k10j53J43K12n0k26o0K18J51j50k13N5K32O0k05j52J19K29l6
3422A34k38n9J93J61j29k24L1K39O8k02j58J19K23k6k20q3J93J53j22k10J3K34
$$ plain form
3444 90 165 -23 -188 -68 152 126 -91 -171 10 185 72 -148 -131 90 171 2 -175 -67 145 147 -76 -171 8
3467 8 186 75 -145 -132 87 175 -2 -170 -74 134 138 -74 -172 -11 171 70 -150 -142 71 169 4 -170 -89 130
3491 130 136 -72 -168 -17 167 82 -124 -139 62 170 6 -171 -81 125 146 -49 -158 -16 167 97 -111 -141 59
3514 59 175 17 -157 -91 120 148 -50 -174 -31 152 88 -109 -148 41 154 21 -152 -96 119 140 -44 -167
3536 -167 -29 146 101 -105 -146 33 171 35 -147 -105 113 149 -34 -150 -30 150 112 -89 -141 37 163 44
3558 44 -137 -102 93 145 -26 -167 -50 139 93 -89 -162 12 148 43 -132 -113 83 150 -29 -162 -45 126
3580 126 108 -73 -149 17 162 59 -126 -102 75 149 -14 -151 -61 128 118 -76 -156 6 158 62 -126 -112 79
3603 79 147 -1 -145 -67 119 110 -65 -152 0 150 62 -130 -114 74 148 2 -151 -81 114 123 -62 -144 4 144
$$ packed form
3444I0P5j88j65J20K20k6k17q0J81J75j13k20J7K21Q1j69j77J08K12Kk23r5J79
3467HJ78j11k20J3K19Q8j77j68R6K08Mk12r8J61J82j01k20QK13R8j65j74Q1K19
3491A30Ok08r6J51J84q5k06j5K01J08j64j77R0K06K1j95j09J42J83p0k08l0K00
3514E9J16j58j74O6K11K8j98j24J43J83o4j97l9J89J13j33j73N6K15K1j84j23
3536a67J38J75m5k06m1J79J38j36j82M2K18L6j83j16J20J80l8k01n2J78J26j19
3558D4j81L5J95N2j71j41J17J89m6j82p3J74J36j05j75J9J96O7j79j33J17J71
3580A26j8j81p6J66J45j03j85K4J77P4j63j37R0J89j0j94q0J62J52r6j88J4J91
3603G9O8j48j44P8J86rj75q7J52J50q8j92J6J88P4j46j53P0J95Rj85q2J48J40
$$ plain form
3627 144 79 -109 -124 67 153 14 -150 -74 110 130 -57 -138 -5 131 75 -108 -122 54 158 10 -140 -75 98
3650 98 121 -50 -147 -19 140 83 -110 -136 39 137 31 -139 -85 93 134 -34 -150 -19 129 85 -95 -124 49
3673 49 150 38 -121 -71 97 126 -28 -135 -24 130 83 -86 -117 39 145 26 -133 -88 85 128 -31 -153
3695 -153 -36 114 90 -87 -138 28 140 41 -120 -98 77 129 -22 -135 -35 111 92 -78 -119 25 140 56 -111
3718 -111 -88 78 141 -8 -138 -45 108 108 -72 -127 16 136 44 -113 -104 67 127 -4 -141 -48 106 92 -67 -126
3742 -126 9 123 43 -121 -92 71 127 -5 -134 -55 107 104 -58 -128 9 128 67 -100 -92 56 136 2 -113 -43
3766 -43 101 101 -56 -125 -2 138 61 -90 -103 45 126 4 -128 -63 86 98 -55 -133 -4 120 65 -91 -108 43
3790 43 130 19 -116 -63 95 111 -41 -123 -8 126 79 -82 -101 46 131 21 -110 -64 84 108 -41 -123 -12 112
$$ packed form
3627A44o5j88j5J91Q6j39j64P6J84K0j87q1J33J36n6j83j4J76J04j48j50O5J73
3650I8K3j71r7J28J59n7j93k6J75R8j06j70N4J78M1j68j16J31J48m4j80k9J73
3673D9J01j12j59N0J68K9j54j07J11J54m7j69l1J56J06j19j59M5J73M3j59j22
3695a53J17J50k4j77n1J66J12r9j61K2J75N2j51j13J00J46j9j70m1J44J15q4j67
3718a11K3J66O3j49j30R3J53%j80n5J43J20r2j57RJ71O0j31j37R3J54j4j59n9
3742a26J35J14q0j64K9J63N6j32j29P9J62lj62p0J37J19o1j67QJ48Q0j34j15P0
3766d3J44%j57o9J23J40p7j51j3J48Q1j22j32O5J49J2j53p8J29J24n5j56j7J51
3790D3Q7j11j35N3J58J6j52q2J15J34m7j61j9J47Q5j10j31M6J48K4j49q2J11J24
$$ plain form
3814 112 63 -79 -107 35 126 22 -119 -75 75 101 -32 -127 -34 108 66 -80 -112 28 127 28 -118 -82 70 108
3838 108 -16 -122 -27 109 78 -68 -110 21 124 40 -95 -75 84 117 -20 -121 -33 109 88 -66 -111 20 111
3861 111 29 -104 -89 61 109 -16 -121 -43 107 72 -64 -104 14 125 53 -89 -92 69 117 -19 -107 -43 112 90
3885 90 -45 -105 15 125 48 -74 -82 60 115 2 -100 -46 100 98 -47 -123 -2 118 59 -87 -103 50 108 -10
3909 -10 -112 -53 88 88 -48 -112 -6 104 53 -90 -90 40 112 5 -106 -50 88 97 -36 -113 -6 118 65 -81 -86
3934 -86 37 116 14 -106 -59 73 100 -20 -116 -15 111 54 -75 -91 33 116 16 -108 -65 63 98 -39 -122 -20
3958 -20 90 68 -85 -100 34 114 29 -97 -68 69 86 -34 -111 -14 107 73 -63 -95 32 100 26 -84 -68 66 93
3983 93 -23 -98 -24 90 70 -63 -100 7 94 20 -96 -73 48 90 -25 -115 -40 84 76 -62 -94 13 99 39 -86
$$ packed form
3814A12m9j42k8J42R1j04j41M4J50K6j33r5R3J42m2j46l2J40R9r9j46L6J52L8
3838A08j24j06R5J36l1j46m2J31J03q4j35K0J59L3j37j01Q8J42k1j54m5J31R1
3861A11q2j33J5J50M8j25j05P8J50l5j36m0J18J11p2j42lJ61M8j36q8O4J55k2
3885I0j35o0J20J10p7j22qJ42N5j13j02N4J46kj45p6J21J20n9j46j6J53N8j18
3909a0j02N9J41%j36o4J06J10n1j43%J30P2j07j11N6J38Rj33p7J07J24n3j46n
3934h6J23P9j02j20M7J32K7j20r6J01J26n7j29j6J24Q3j00j24M3J28L5j37q3J02
3958b0J10k2j53j5J34Q0q5j26K9J37J7j20p7R7J21l4j36l2J27O8p4j10J6J34K7
3983I3j16p5P4J14k0j33l7J07Q7p4j16K3J21M2j15r0P5J24qj38l2J07Q6o0j25
$$ plain form
4008 -86 -66 61 92 -13 -104 -39 99 80 -47 -89 10 110 39 -87 -75 57 107 4 -100 -39 91 78 -45 -99 4
4033 4 94 38 -81 -78 39 100 -6 -107 -50 73 78 -48 -102 -2 94 52 -66 -69 50 107 1 -86 -30 83 80 -34 -86
4060 -86 0 108 47 -70 -76 50 100 10 -103 -60 74 78 -40 -100 -13 87 52 -69 -85 29 96 0 -94 -61 58 71
4086 71 -37 -100 -14 80 59 -65 -88 30 100 21 -81 -55 69 98 -23 -95 -13 91 60 -54 -77 30 98 30 -80
4111 -80 -65 65 84 -15 -97 -26 71 62 -48 -81 27 88 25 -88 -62 52 82 -19 -97 -29 86 71 -46 -79 25 100
4137 100 36 -73 -68 60 94 -5 -82 -23 85 71 -38 -85 18 92 40 -68 -63 58 94 -1 -95 -34 76 76 -40 -88 8
4164 8 99 38 -84 -74 34 85 0 -97 -36 58 73 -23 -88 1 93 39 -57 -55 41 98 8 -88 -39 72 75 -28 -73 5 92 44
4194 44 -56 -70 29 82 2 -82 -42 63 84 -26 -82 -5 87 48 -66 -83 32 90 4 -78 -61 62 75 -31 -85 -2 82
$$ packed form
4008h6K0J27L1j05r1O5J38j9j27m2R9J00p1j26J2J32N0j03j04O1J30j3j23n4J03
4033DR0n6j19LJ17O1j06j01N7J23Nj26n4J00R6m2j18lJ19N7j06q7N6J13lj14n2
4060h6Q6J08o1j17oJ26N0r0j13M3J34Mj18o0Q7J00l5j21j6J14O7r6r4L3J19J3
4086G1j08o3Q6R4k1j24k3J18P0p9j02K6J24K9j21p2Q2J04l1j14k3J07O8o8j10
4111h0J5J30J9r9q2P1R7rj10l3J08O1o3j13K6J14L0j01p8O8J15j5j17l3J04P5
4137A00o4j09NJ28L4r9p7N9J08j4j09m7J03P4n2j08NJ21L6r5r4O1J10%j16m8R6
4164HR1o1j22J0J08N1q5r7O1R4J5r6o5Q9R2n4r6KR6N7r0r6M9J11Lj03m5P8Q7m8
4194D4j00j4R9N3q0q4M0J05K1j10n6P7R2l9j14j7J15N8q6q2J7J23J3j06n4Q3Q4
$$ plain form
4221 82 48 -58 -76 28 89 24 -79 -45 61 81 -21 -82 -19 73 66 -56 -78 17 87 14 -83 -59 56 72 -12 -89 -27
4248 -27 76 56 -50 -72 7 79 19 -81 -64 43 71 -12 -85 -28 66 71 -43 -65 15 92 28 -71 -56 57 81 -7 -81 -13
4276 -13 82 61 -35 -81 3 86 27 -74 -60 38 86 -4 -91 -49 69 53 -46 -95 -1 86 36 -71 -57 40 85 -2 -81 -30 68
4305 68 77 -23 -74 -1 88 34 -63 -52 44 92 4 -75 -36 70 76 -28 -67 -1 86 46 -51 -72 35 79 -2 -80 -45 54 70
4334 70 -43 -97 -1 70 31 -63 -76 19 70 12 -77 -41 56 78 -22 -71 4 93 58 -47 -55 21 84 12 -65 -48 63 70 -12
4363 -12 -63 -1 72 43 -48 -63 21 73 20 -70 -61 37 68 -18 -82 -16 61 53 -53 -66 12 71 29 -73 -52 49 79 -15 -83 -30
4393 -30 60 54 -38 -62 14 78 21 -67 -43 43 71 -8 -77 -28 68 58 -33 -70 6 69 31 -67 -50 27 61 -3 -76 -26 61 56 -30
4424 -30 -78 0 75 24 -59 -59 35 84 4 -73 -24 62 55 -23 -59 6 66 38 -53 -46 30 75 5 -65 -31 60 68 -23 -67 -4 66 41
$$ packed form
4221H2l4j06j8J04O1o5j03L4J06K0j02o1O3R2pj22k2R5P0p3r7K4J15J6q4p7O2
4248b7J03k0j06k2P9P2o0j00J7J07K8q3p3N7R4Nj14k2Q0P7o4r9J5J13K4q8p4O8
4276a3R5k1r6m6Q4Q3n9j01J4R8M8r0q7M2J18j6r9m9R4Q7n0j07J4R7M5q7p9N1R8
4305F8Rj00n1P3Q9n4r7J1R6M8q8p9L9J06Oj04l9O6Q7m0r7k1J07M4q1p8L5R9J6
4334G0j13n4R6P1l9r4j3R5N1n8q9L6R7K2j00m9P5Q9l5j05qP6O3p2p7J7J11Pq2
4363a2n1O2P3k9r1j5Q4N2n3r0RR8L1q6o4O6P7qj06j3P8N9m2j02K1J01L0r4o8N3
4393c0R0or2k4P6O4n7q8K4Q6K8p9o9M9R6j0r1l7P6O3l8r8J7P7L4o4p3N0Q7nq6
4424c0m8P8P5n1q3%R4M9q0p7M9Q6pp8l6O5O0k8r1PP6M5p0p0L4R1Qr1m4O3P0k5
$$ plain form
4456 41 -65 -64 19 68 10 -71 -46 50 51 -28 -72 -4 72 47 -58 -70 25 79 3 -60 -39 54 68 -14 -68 -8 79 59 -28 -67
4486 -67 24 74 16 -63 -36 57 72 1 -62 -11 59 43 -42 -74 6 58 10 -67 -54 38 59 -12 -62 -17 59 45 -46 -61 16 75
4516 75 12 -56 -40 48 64 1 -61 -10 65 64 -30 -68 11 80 21 -55 -45 31 57 -1 -67 -24 54 50 -35 -63 1 70 27 -58 -60 28
4548 28 53 -11 -76 -33 40 42 -23 -68 -2 59 36 -52 -56 27 73 11 -58 -27 54 59 -25 -60 -3 59 34 -47 -50 28 63 6 -67 -25
4580 -25 46 50 -25 -64 -8 57 33 -56 -61 9 53 -3 -74 -38 42 57 -13 -73 -20 65 33 -49 -59 17 63 5 -48 -38 45 58 -19
4611 -19 -59 -10 69 41 -32 -54 14 54 12 -68 -46 39 55 -18 -67 -11 62 33 -47 -70 -5 62 3 -66 -46 31 65 -16 -64 -21
4641 -21 55 41 -27 -54 13 73 21 -48 -38 41 69 7 -51 8 64 53 -31 -53 23 66 24 -46 -47 38 57 -8 -61 -18 55 49 -31
4672 -31 -60 7 58 23 -45 -50 29 59 -14 -62 -22 50 50 -22 -54 -2 65 24 -47 -40 33 59 9 -59 -11 60 59 -15 -42 8 56 31
$$ packed form
4456D1j06JQ3M9n8q1K5R6Jp9m4O8P6k5j05j2R5N4p6o3K1R3J4q2n4O0Q7k0q7l9
4486f7R1N0n8p9K7R3J5p1o3N1P0j6q5l2Q0N2m8p7J3R2K1p1n0M5P6j4r1j5P7N9
4516G5o3o8J6Q8J6o3o2N1P5jr4l8P9O9n9p6J0P6K6n8o6M3P8mq5k8O4O9m3q5kQ8
4548B8K5o4o5M3P3Ko5m5O6O1k3q8mQ3M6o2o9L1Q1Nq4l5N7O2k5q1lP8L5n7p3M2
4580b5P1Mp5l9N6O5k4q9nP0M4n6p1L6Q0J5p0o0N3Q5l2q2j0P6M6n8n3J0Q3J3p7
4611a9m0M9P9k8p3k2O8M0m2q0K2Q5J6p3m9N6P3k9q0k3O5O7n9o9K0P7L4q1m8M3
4641b1P6j4o8k7O7O0n2o9J0P9K8o2n8N9N6j1q4k2P6M3m2p0jQ5J9o5n3M3P3oq0
4672c1k9O7N1l5o8nP9L0p3m8M0P2%p2l2N2O7m1p1PP3K6n0o8M8P1jp4k7N0M8k5
$$ plain form
4704 31 -54 -58 13 54 3 -56 -31 44 50 -27 -62 -2 56 29 -49 -56 14 50 -1 -62 -33 41 46 -18 -48 -3 58 38 -37 -41 22 59 15
4737 15 -44 -15 43 59 1 -51 -5 54 39 -45 -47 9 48 13 -52 -42 27 51 -9 -53 -5 48 28 -48 -57 9 55 6 -51 -35 41
4768 41 54 -15 -57 -13 56 48 -18 -45 11 61 27 -34 -34 42 65 -7 -50 -2 57 44 -29 -57 20 58 24 -49 -45 23 55 0 -48 -19
4800 -19 47 39 -32 -51 8 59 15 -48 -38 31 51 -12 -56 -25 55 47 -35 -55 5 56 25 -48 -42 27 70 6 -43 -26 48 52 -21 -58
4832 -58 0 51 27 -50 -48 22 50 -12 -63 -26 39 44 -33 -61 -6 50 29 -54 -44 27 43 5 -51 -32 39 52 -12 -51 12 56 40
4863 40 -28 -39 32 54 9 -45 -25 52 43 -12 -51 -16 54 34 -39 -46 1 46 12 -50 -33 34 44 -17 -59 -23 45 29 -37 -48 14
4894 14 66 12 -49 -36 31 50 -14 -55 -13 58 48 -28 -51 18 59 16 -40 -30 33 57 -7 -57 -15 42 31 -34 -50 3 42 10
4924 10 -54 -44 25 39 -9 -64 -20 39 24 -36 -56 16 53 17 -50 -36 36 50 -11 -51 -13 41 39 -25 -46 12 44 24 -38 -30 29
$$ packed form
4704C1q5mP1M1n1n9K5P5Op7l5O0N8k7p8pP0L6n1o1K9P4No4l0M5O1k0p5mO3L7m4
4737A5n9K9N8J6n8n2M6N9j5q4kN6L9l5o5J0O9K4o0m4M8N3k0p6rO6M6m9n7J6P6
4768D1J3o9m2M4O9qo6k7N6N0l4o1%P6K3p2m3M8N9j3p3k8P7L8l4p3MO8L2n5m8K9
4800a9O6qp1j9N9N1m4o3J0O9K0o3m4L1Q0qq2k0O0N1l1p3OO9M3o4m9J7P4Mp3l7
4832e8N8N1k4p7KP0K8o2n1L7O5Np7k8N5N6k1q3J0P1J6l8n6J9P1J3o4l9O3M4j6
4863D0o8j1P1K2m5n4K0P7rn5l9L5P0k0p3pM7M5l4o2J7O7J0o1m2L6O8j6o6j1O2
4894A4N2n4o1J3O7J9o4m1M2P1j0p6k3O9M1m3n6J0O3K4o4n0M2N7j1o5j6N3L9l2
4924A0o4J0O9J4m8n5M4N9j5o0k0P2L7l6o7J4P2J4o1m0L8N4ko4k1N8L2k0o2QN9
$$ plain form
4955 29 46 -4 -64 -32 40 38 -21 -52 -8 46 19 -48 -49 18 54 -5 -49 -18 37 37 -25 -54 -5 43 14 -50 -51 23 50 -3 -55 -18
4987 -18 38 46 -26 -51 -3 61 32 -35 -43 27 55 10 -55 -21 36 41 -23 -47 -12 39 20 -36 -57 11 43 0 -61 -28 26 38 -13 -62
5019 -62 -12 39 15 -40 -56 5 41 -4 -46 -31 32 43 -15 -49 -14 43 34 -31 -40 10 59 12 -43 -22 27 47 -15 -52 -27 37 31 -41
5051 -41 -47 8 42 10 -52 -33 22 49 -17 -46 -19 38 24 -24 -57 -6 44 16 -39 -35 35 45 -5 -42 -20 36 45 -26 -38 11 51 25
5083 25 -43 -25 31 53 -5 -38 -30 32 34 -22 -55 0 25 15 -49 -51 24 52 -6 -51 -20 44 29 -21 -46 -4 47 16 -29 -43 30 52
5115 52 4 -51 -16 51 48 -14 -44 5 54 24 -46 -30 24 56 2 -55 -21 49 34 -16 -49 0 48 15 -29 -45 20 47 2 -43 -35
5146 -35 38 37 -19 -58 1 40 15 -33 -49 21 55 4 -38 -29 44 50 -10 -43 -5 49 26 -27 -47 17 49 11 -40 -35 38 40 -14 -46 -14
5179 -14 37 26 -40 -50 9 43 3 -51 -41 31 37 -15 -44 -10 43 27 -32 -39 4 55 16 -47 -34 25 45 -8 -45 -8 47 25 -21
$$ packed form
4955B9J7n0o0L2P2kn9l1M4N4k7o7jO7L6n9m4L1N5%o2k9M9M8k9o4jP4K7n3n2L7
4987a8N6Qp2k5M8O4k9o7qP0K8m5o5L4N7No4k4L5N1j9n6k1O8L2m3o1L3N4J2n1m9
5019f2N0N1k4n5j6O1L6m5m2J5O3J1n8l4L5N7ro5rN0M9m7n5K1M9K0o2l7K5O4op2
5051d1oN5L4l2o2J9N5K7o6k9K7N7j4m8l3N1N0k8n5MP0J0n0l7K2N6Rp1j2M9M0k6
5083B5o8J8N6K2n8l3QO2Kn6l3N5K5j0o4kP5K8n8m5L1O4j5n0k5M2N1l1m5j4P3K2
5115E2m8n5L5O7lo2l0M9M9l0p0J6N4L2n4n7L4P0j5n0l3M9M8l3m4j6O5K7m5m5Q
5146c5P3jn6l9N9L9k5m8j6P0L4n1m2RP3Oo0l3L8N4k3n3k0O4L2l8n1NP3Kn4l2L2
5179a4N1j1o6j0N9L4m0n4J0P2On2k9L4N3j6n9pM3N1l9o3J3N9K0n3l7L7N5k2m6
$$ plain form
5210 -21 -38 1 50 18 -34 -29 30 43 -6 -51 -19 35 27 -37 -54 -6 46 2 -43 -43 12 45 -10 -44 -17 36 33 -28 -48 16 40 28
5242 28 -31 -27 29 62 10 -39 -8 41 38 -27 -44 0 41 8 -40 -40 24 37 -5 -41 -21 37 36 -19 -60 -14 32 13 -38 -44 10 47 -4
5275 -4 -46 -21 35 45 -14 -44 -8 55 26 -20 -27 20 53 8 -41 -23 36 38 -10 -40 -4 36 21 -30 -40 14 47 8 -46 -20 25 40
5307 40 -14 -38 -17 37 25 -31 -40 4 44 12 -40 -23 31 41 -17 -37 -12 39 37 -16 -29 13 61 21 -30 -20 43 60 0 -35 2
5338 2 49 39 -24 -36 0 47 8 -33 -28 33 43 -1 -39 -16 35 25 -34 -45 8 43 16 -39 -31 28 40 -7 -39 -7 28 34 -17 -31
5370 -31 16 45 29 -33 -27 25 49 4 -32 -13 42 41 -19 -38 4 45 14 -35 -38 17 49 0 -52 -21 31 29 -35 -46 -1 40 17 -38
5402 -38 -37 17 46 3 -50 -23 42 27 -14 -48 4 44 17 -27 -34 20 45 12 -33 -12 43 44 -12 -41 -1 37 19 -24 -35 16 39 2
5434 2 -44 -26 26 32 -18 -43 -18 27 -1 -37 -38 19 40 7 -51 -22 25 34 -9 -44 1 33 23 -35 -32 9 51 5 -23 -33 40 38 -5
$$ packed form
5210b1j7L9M9l2n2NN9J3m9m5L2N4qo4j7M8N2m4m5%N5L3n5l4K7N3lo1k0O4K4j2
5242B8n9MN6L3n2m9L1M9lo5j7M4M1l3m8%O4J3m2l6K0N8jn5m1M6M6j9n1oN4L7n1
5275dm2K5N6J0n9l0L6O3k9m6pM7L3m5m9J8N9Km8l0L6M0j5n1j0N4L3l9n4K6M5J5
5307D0n4k4K1N4j2n6rM4M0l2n2J7N4J0n8k0K5N1kn3j3M2M8m0n1J0O3J7o0l5L7
5338BM7j0o3j2L6M7l9m1NO1J0m4l8K3N1j0n9j1N3L5k7n5QN9J2m7l2L2L5On1j4
5370c1M7K9j6o2ON2K4m5l6J9N5jo0j9M2M1l1m9lN5L2m9n2L1N2ko4j1M5M1k3n5
5402c8JN4K9m3n3K7O5j5m1l4N2M0k7m4pN4K5l3m5K1N5Jn6k9M0L8j8m3j1N1K3l7
5434Bm6J8N2On0k5K5M5k8l6jN7K1l3n8K9M7Rm3l5M5L2j0n8LM1M2m6k8j0P3km3
$$ plain form
5467 -5 -41 -12 43 25 -40 -41 14 38 17 -37 -22 16 38 -12 -40 -20 33 19 -38 -46 3 37 13 -41 -29 27 41 -3 -43 -15 31 33
5499 33 -20 -26 15 55 16 -28 -20 23 34 5 -36 -10 31 23 -20 -44 3 32 12 -35 -30 19 29 -1 -51 -16 36 21 -25 -40 -3 35
5531 35 12 -31 -24 20 38 2 -34 -15 33 36 -12 -35 2 48 18 -29 -16 23 51 -1 -45 -8 32 34 -17 -42 -5 35 16 -33 -36 9
5563 9 38 -9 -37 -29 25 25 -22 -40 -13 38 10 -39 -38 13 44 8 -38 -22 23 39 -6 -35 8 43 25 -25 -25 19 47 17 -25 -12 25
5596 25 34 -14 -34 -22 28 12 -45 -39 10 38 0 -38 -15 21 26 -20 -46 -12 27 12 -20 -39 9 34 10 -37 -23 26 40 -1 -32 -3
5628 -3 38 24 -27 -33 5 36 20 -32 -15 31 33 -9 -38 1 34 15 -31 -41 -10 35 4 -31 -30 23 23 -12 -58 -15 27 29 -32 -33 2 41
5662 41 15 -36 -21 30 41 -7 -33 -11 36 24 -18 -22 5 48 16 -21 -8 16 32 -2 -43 -19 27 18 -16 -35 6 33 15 -29 -27 13
5694 13 37 -11 -49 -15 21 29 -30 -39 -6 36 6 -24 -29 15 49 1 -24 -11 36 41 -11 -22 -4 39 22 -23 -17 23 48 6 -25 -18 24
$$ packed form
5467el6K9N5j8o5jN5K4k1n4J5L8K2n0k8K0N3j4n7qM9L4k4n4J2N6J4m4m0K8M6K
5499C3n3oM1M0l9m4QM3J1k9m1K6M1qm3k4M7K9k0m7NM9J0l0n0L5N2j5m6j5L7L8
5531C5k3m3PM4J8l6l6J9M8Lm8k3L7M6l0m7J3L9K8n2m4L7M0Kn1k5L7M0j9m9lM5
5563IK9m7k8QN4%m7j8K7N1k8m9JN1L1l6m6J6M5J6m5k9M3L5j8n0%M4K8l0m2J3L7
5596B5Rm8k0J2N0j6n7OM9K8l8l8K3L6Nm6k6L4L9j5l2j9M8K5k4m7J4M9J4m1l1K9
5628cM1j4n1oL8L1j6n2J7M6Km2k9L9L3j9m6j0L1M5l1l5JN3%l5m6M3M2Ko1jL5L9
5662D1k6n1J5N1J1m8k6K2M7j2m2mK7M3l2l7J3K4J6l4m1K4M6rl4j9M1K7j8m4KM0
5694A3K4m8l8L4L6Qn9rL3M2l0l0nM4L4m8k5J3M7Nn2j1J8M3j7m5OM0K5m2l1PM2
$$ plain form
5727 24 19 -23 -36 -15 24 9 -33 -32 13 32 0 -39 -24 23 27 -13 -44 0 32 16 -20 -30 10 35 -5 -24 -11 30 36 -4 -28 -1
5759 -1 39 27 -14 -23 11 42 9 -31 -8 19 26 -7 -42 -13 28 12 -21 -41 1 25 12 -31 -25 13 28 -20 -50 -5 38 21 -15 -34
5791 -34 11 40 16 -16 -18 28 32 -12 -37 -7 31 27 -18 -35 2 36 3 -23 -23 28 35 -11 -39 -26 25 19 -25 -43 -4 15 8 -29 -44 17
5825 17 25 -6 -40 -17 26 21 -19 -42 0 49 10 -30 -27 20 31 0 -25 -5 38 19 -16 -25 3 33 17 -23 -23 11 27 -3 -43 -10 29
5858 29 32 -15 -40 -12 36 11 -25 -28 11 30 -14 -30 -20 16 23 -16 -40 -5 39 22 -20 -7 16 30 6 -22 -21 26 30 -11 -40 -1 20
5891 20 29 -31 -33 16 38 5 -33 -17 17 17 -18 -42 -15 28 21 -21 -37 3 32 3 -41 -25 25 20 -20 -37 -3 23 9 -18 -17 15 32
5924 32 8 -33 -17 21 28 -3 -36 -13 36 15 -23 -28 0 41 9 -15 -14 23 25 -8 -36 -11 29 15 -30 -40 0 20 3 -30 -18 9
5956 9 29 -7 -38 -7 23 27 -14 -37 7 32 20 -19 -25 17 25 1 -26 -10 28 28 -23 -23 5 40 18 -29 -21 18 27 2 -30 -14 21 20 -26
$$ packed form
5727B4nm2j3K1L9j5m2JM5J9l2l9J5M7Mm0l1M4L2j6l6j0M0K5m0j9J3M1Om0k4K7
5759aM0j2m1rL4L1l3m0K3K7Pl3l5K9M1j6l3k0M2K4j3m3OL8J5m8l0M5M3j7l6j9
5791c4M5K9k4l2kM6Mm4k5L0L8mm5j7L7L4l3k6%N1Pm6k8J3N1om4j8L9J9pl7j5O1
5825A7Ql1l4K3M3nm0k3M2M9l9m0LM7J1l1k5K0M3j9l5rK8L0j6m0%L4J6l0m0L3L9
5858B9Lm7k5K8M8k5l6lL9J9m4j6J0L6Pl9k4L5M4j7m2J3K3J4k4k8JM7Mm1k9L9K1
5891B0Ro0kM9K2l3l8J6L4%l5k4K7M3pm2j6M0K9k9m4J6N0nm0j7L4K6j4k7JL2J7
5924C2k4m1J6L8Pl1l3K3M9k1l8nK8M1l2k4JL7Kl3k8K5M0j4m5j0M0K0j7l3J2K7
5956IK0l6l1L1L0Mm1k3M4K5j2l9oM2Qk4k7J6L8%n1%K8L5k2m7QL9Rk5l2J6L5jm6
$$ plain form
5991 -26 -40 6 30 7 -31 -25 13 28 -10 -32 -5 22 31 -4 -24 9 31 19 -26 -16 16 42 11 -19 0 24 33 -5 -22 6 33 6
6023 6 -29 -34 9 35 -1 -29 -16 21 20 -10 -39 -3 28 8 -35 -21 16 38 4 -31 -20 24 18 -13 -30 -2 35 21 -13 -18 15 32 9
6056 9 -16 -21 33 36 -3 -25 8 26 6 -19 -25 4 28 6 -23 -9 15 35 -18 -28 -14 33 15 -14 -24 6 29 4 -23 -17 23 31 1
6089 1 -31 2 32 23 -18 -27 6 42 16 -18 -12 20 31 -2 -27 -1 25 25 -18 -36 5 22 3 -32 -27 13 24 -8 -38 -27 15 8 -25 -37
6123 -37 7 33 5 -34 -22 19 34 5 -27 -2 25 19 -16 -29 7 37 14 -15 -29 18 40 -2 -23 -3 27 23 -8 -29 2 37 6
$$ packed form
5991b6j4M6K4k3l8OL8J5l8k2K7K7Rl5k0L3K2j2m5J0L2K6l1l0J9K4Rl8j7K8K7k7
6023Fl5nM3K6l6k8J3L7jl0k9L6L1k0m3J4L7K2l4l5J1M4ol1j7K8L7j4l4nL3J7k3
6056Ik5nN4Ll9k2L3J8k0k5oK9K4k2k9J4K4K0n3j0J4M7j8k9j0L0K3k5k7OM0Ql0
6089Al2L3L0rm1rL3L6k6l4OL2J1l3k5K6K6%m3j8M1J7j9l5NM0J1l2l0J1M2pl3j2
6123c7M4K6k8l9J2M1J5k9l2K5K7ol5j3L6L0k3k9j4M7K2m2k1K0L0ml1k1L1L5l1
$$ [...]
8191a7
##END NTUPLES=NMR FID
##END=
