##TITLE=1H_ES-476-OS
 D2O
 8 sc, 
 2.4.2024
##JCAMPDX= 6.0         $$ Bruker NMR JCAMP-DX V2.0
##DATA TYPE= NMR FID
##DATA CLASS= NTUPLES
##ORIGIN= UXNMR, Bruker Analytische Messtechnik GmbH
##OWNER= root
$$ XWIN-NMR		Version 3.5
$$ Tue Apr  2 15:58:24 2024 Russian Standard Time (UT+4h)  she@DPX200
##.OBSERVE FREQUENCY= 200.1309
##.OBSERVE NUCLEUS= ^1H
##.DELAY= (6, 6)
##.ACQUISITION MODE= SIMULTANEOUS
##.ACQUISITION SCHEME= undefined
##.AVERAGES= 8
##.DIGITISER RES= 18
##SPECTROMETER/DATA SYSTEM= spect
##.PULSE SEQUENCE= zg30
##.SOLVENT NAME= MeOD
##.SHIFT REFERENCE= (INTERNAL, MeOD, 0, 15.7039)
##AUDIT TRAIL= $$ (NUMBER, WHEN, WHO, WHERE, WHAT)
$$ ##TITLE= Audit trail, XWIN-NMR		Version 3.5
$$ ##JCAMPDX= 5.01
$$ ##ORIGIN= Bruker BioSpin GmbH
$$ ##OWNER= she
$$ F:/spectra/data/she/nmr/H-F/1/audita.txt
$$ ##AUDIT TRAIL=  $$ (NUMBER, WHEN, WHO, WHERE, WHAT)
(   1,<2024-04-02 15:56:30.53 +0400>,<she>,<DPX200>,
      <created by zg, POWCHK disabled, PULCHK disabled
       configuration hash MD5:
       00 E9 B6 7A A2 85 ED C7 34 08 36 98 17 FE 4E 26
       data hash MD5: 16K
       74 09 AE 90 13 36 69 CA 5F E2 B7 77 0D DB 7E 60>)
$$ ##END=
$$ 
$$ hash MD5
$$ E4 7E B2 FB 17 1F 0C 63 6B 0E 6D 3D 5A 01 B6 79
##$RELAX= 
##$RELAX= 
##$RELAX= 
##$RELAX= 
##$RELAX= 
##$RELAX= 
$$ Bruker specific parameters
$$ --------------------------
##$DU= <F:/spectra>
##$EXPNO= 1
##$NAME= <H-F>
##$PROCNO= 1
##$TYPE= <nmr>
##$USER= <she>
##$AMP= (0..31)
100 100 100 100 100 100 100 100 100 100 100 100 100 100 100 100 100 100 
100 100 100 100 100 100 100 100 100 100 100 100 100 100 
##$AQSEQ= 0
##$AQ_mod= 1
##$AUNM= <au_zg>
##$AUTOPOS= <>
##$BF1= 200.13
##$BF2= 200.13
##$BF3= 200.13
##$BF4= 200.13
##$BF5= 200.13
##$BF6= 200.13
##$BF7= 200.13
##$BF8= 200.13
##$BYTORDA= 1
##$CFDGTYP= 0
##$CFRGTYP= 5
##$CHEMSTR= <none>
##$CNST= (0..31)
1 1 145 1 1 1 1 1 1 1 1 1 1 1 1 1 1 1 1 1 1 1 1 1 1 1 1 1 1 1 1 1 
##$CPDPRG= <>
##$CPDPRG1= <>
##$CPDPRG2= <>
##$CPDPRG3= <>
##$CPDPRG4= <mlev>
##$CPDPRG5= <mlev>
##$CPDPRG6= <mlev>
##$CPDPRG7= <mlev>
##$CPDPRG8= <mlev>
##$CPDPRGB= <>
##$CPDPRGT= <>
##$D= (0..31)
0 1.2 0 0 0 0 0 0 0 0.06 0 0.03 0 0 0 0 0.0002 0 0 0 0 0 0 0 0 0 0 0 0 
0 0 0 
##$DATE= 1712058989
##$DBL= (0..7)
120 120 120 120 120 120 120 120 
##$DBP= (0..7)
150 150 150 150 150 150 150 150 
##$DBP07= 0
##$DBPNAM0= <>
##$DBPNAM1= <>
##$DBPNAM2= <>
##$DBPNAM3= <>
##$DBPNAM4= <>
##$DBPNAM5= <>
##$DBPNAM6= <>
##$DBPNAM7= <>
##$DBPOAL= (0..7)
0.5 0.5 0.5 0.5 0.5 0.5 0.5 0.5 
##$DBPOFFS= (0..7)
0 0 0 0 0 0 0 0 
##$DE= 6
##$DECBNUC= <off>
##$DECIM= 32
##$DECNUC= <off>
##$DECSTAT= 4
##$DIGMOD= 1
##$DIGTYP= 9
##$DL= (0..7)
0 120 120 120 120 120 120 120 
##$DP= (0..7)
150 150 150 150 150 150 150 150 
##$DP07= 0
##$DPNAME0= <>
##$DPNAME1= <>
##$DPNAME2= <>
##$DPNAME3= <>
##$DPNAME4= <>
##$DPNAME5= <>
##$DPNAME6= <>
##$DPNAME7= <>
##$DPOAL= (0..7)
0.5 0.5 0.5 0.5 0.5 0.5 0.5 0.5 
##$DPOFFS= (0..7)
0 0 0 0 0 0 0 0 
##$DQDMODE= 0
##$DR= 18
##$DS= 0
##$DSLIST= <SSSSSSSSSSSSSSS>
##$DSPFIRM= 0
$$ [...]
##$SUBNAM2= <"">
##$SUBNAM3= <"">
##$SUBNAM4= <"">
##$SUBNAM5= <"">
##$SUBNAM6= <"">
##$SUBNAM7= <"">
##$SUBNAM8= <"">
##$SUBNAM9= <"">
##$SW= 18.0517689322627
##$SWIBOX= (0..15)
0 0 2 0 0 0 0 0 0 0 0 0 0 0 0 0 
##$SW_h= 3612.71676300578
##$TD= 16384
##$TD0= 1
##$TE= 0
##$TE2= 300
##$TE3= 300
##$TEG= 300
##$TL= (0..7)
0 120 120 120 120 120 120 120 
##$TP= (0..7)
150 150 150 150 150 150 150 150 
##$TP07= 0
##$TPNAME0= <>
##$TPNAME1= <>
##$TPNAME2= <>
##$TPNAME3= <>
##$TPNAME4= <>
##$TPNAME5= <>
##$TPNAME6= <>
##$TPNAME7= <>
##$TPOAL= (0..7)
0.5 0.5 0.5 0.5 0.5 0.5 0.5 0.5 
##$TPOFFS= (0..7)
0 0 0 0 0 0 0 0 
##$TUNHIN= 0
##$TUNHOUT= 0
##$TUNXOUT= 0
##$USERA1= <user>
##$USERA2= <user>
##$USERA3= <user>
##$USERA4= <user>
##$USERA5= <user>
##$V9= 5
##$VALIST= <valist>
##$VCLIST= <CCCCCCCCCCCCCCC>
##$VD= 0
##$VDLIST= <DDDDDDDDDDDDDDD>
##$VPLIST= <PPPPPPPPPPPPPPP>
##$VTLIST= <TTTTTTTTTTTTTTT>
##$WBST= 1024
##$WBSW= 4
##$XGAIN= (0..3)
0 0 0 0 
##$XL= 0
##$YL= 0
##$YMAX_a= 487924
##$YMIN_a= -504168
##$ZGOPTNS= <>
##$ZL1= 120
##$ZL2= 120
##$ZL3= 120
##$ZL4= 120
##$ABSF1= 10
##$ABSF2= 0
##$ABSG= 5
##$ABSL= 3
##$ALPHA= 0
##$AQORDER= 0
##$ASSFAC= 0
##$ASSFACI= 0
##$ASSFACX= 0
##$ASSWID= 0
##$AUNMP= <proc_1d>
##$AZFE= 0.1
##$AZFW= 0.1
##$BCFW= 1
##$BC_mod= 2
##$BYTORDP= 1
##$COROFFS= 0
##$CY= 11.3945322036743
##$DATMOD= 1
##$DC= 2
##$DFILT= <>
##$DTYPP= 0
##$F1P= 15.7292609196834
##$F2P= 12.9074282941183
##$FCOR= 0.5
##$FTSIZE= 0
##$FT_mod= 4
##$GAMMA= 1
##$GB= 0.15
##$INTBC= 1
##$INTSCL= 1
##$ISEN= 128
##$LB= 0.24
##$LEV0= 0
##$LPBIN= 0
##$MAXI= 10000
##$MC2= 0
##$MEAN= 0
##$ME_mod= 0
##$MI= 1.114404
##$NCOEF= 0
##$NC_proc= 0
##$NLEV= 6
##$NOISF1= 3.799351
##$NOISF2= 2.8
##$NSP= 1
##$NTH_PI= 0
##$NZP= 0
##$OFFSET= 15.70392
##$PC= 1
##$PHC0= -25307.67
##$PHC1= 15.38731
##$PH_mod= 1
##$PKNL= yes
##$PPARMOD= 0
##$PSCAL= 0
##$PSIGN= 0
##$REVERSE= no
##$SF= 200.130013532006
##$SI= 16384
##$SIGF1= 3
##$SIGF2= 2
##$SINO= 400
##$SIOLD= 16384
##$SREGLST= <1H.CDCl3>
##$SSB= 0
##$STSI= 0
##$STSR= 0
##$SW_p= 3612.71676300578
##$SYMM= 0
##$S_DEV= 0
##$TDeff= 0
##$TDoff= 0
##$TI= <>
##$TILT= no
##$TM1= 0
##$TM2= 0
##$TOPLEV= 0
##$USERP1= <user>
##$USERP2= <user>
##$USERP3= <user>
##$USERP4= <user>
##$USERP5= <user>
##$WDW= 1
##$XDIM= 8192
##$YMAX_p= 0
##$YMIN_p= 0
$$ End of Bruker specific parameters
$$ ---------------------------------
##NTUPLES= NMR FID
##VAR_NAME=  TIME,          FID/REAL,        FID/IMAG
##SYMBOL=    X,             R,               I
##VAR_TYPE=  INDEPENDENT,   DEPENDENT,       DEPENDENT
##VAR_FORM=  AFFN,          ASDF,            ASDF
##VAR_DIM=   8192,          8192,            8192
##UNITS=     SECONDS,       ARBITRARY UNITS, ARBITRARY UNITS
##FACTOR=    0.0002768,     1,               1
##FIRST=     0,             0,               0
##LAST=      2.2672688,     0,               0
##MIN=       0,             -504168,         0
##MAX=       2.2672688,     487924,          0
$$ Real data points
##PAGE= N=1
##DATA TABLE= (X++(R..R)), XYDATA
0@%%%%%%%%%%%%%%PpPj4J4j4J4j4K1k6K6l2L6l9M5m9N6o8P5q3R5j07J20j32J47
$$ 0 0 0 0 0 0 0 0 0 0 0 0 0 0 0 7 0 7 -7 7 -7 7 -7 14 -12 14 -18 18 -21 24 -25 31 -37 38 -45 50 -57 63 -69 78
39G8j65J81k00K21k42K68k95L24l57L91m32M77n23N79o42P11p91Q83r92J123j279
$$ 78 -87 94 -106 115 -127 141 -154 170 -187 204 -228 249 -274 305 -337 374 -417 466 -526 597 -682
60f82J475j726K055k510L166m193N982r641J9848r6521l97338N4761K08854L11890
$$ -682 793 -933 1122 -1388 1778 -2415 3567 -6074 13774 -82747 -480085 -425324 -216470 95420
74I5420L37850l73k58841l71397k86303Q3821L32576L85903J69268k25042k87199
$$ 95420 433270 432897 174056 -197341 -483644 -399823 -67247 318656 487924 262882 -24317
85b4317k61620k18231K25229M53474K21499J3074k45954l86812j86651N0672K75014
$$ -24317 -285937 -504168 -278939 174535 396034 409108 163154 -223658 -410309 -359637 -84623
96h4623L57162J63199j01231l66369l51864K129J79995K59878L22679L3553k76046
$$ -84623 272539 435738 334507 -31862 -383726 -381597 -201602 58276 380955 414508 138462
107A38462l17161k31798N2878L15819K97264J33662j08539k83980k82514j37695
$$ 138462 -178699 -410497 -357619 -41800 255464 389126 280587 -3393 -285907 -423602
117d23602J85645L73230K07274L167j85649l31185j97880M9488K33808L18724
$$ -423602 -237957 135273 342547 345714 160065 -171120 -369000 -319512 -85704 233020
127B33020J58822j20758k87469k70830o7861J46750K68090K67605L5017k30650
$$ 233020 391842 271084 -16385 -287215 -355076 -208326 59764 327369 362386 131736
137A31736k84032j88941K7204K51712K71187J31913p3878k59467k69726r3063
$$ 131736 -152296 -341237 -314033 -62321 208866 340779 266901 7434 -262292 -355355
147c55355J52229K88095K06371K2079j65819k79343j91312L0837K15754K73569
$$ -355355 -203126 84969 291340 313419 147600 -131743 -323055 -292218 -76464 197105
157A97105J38804r5795k42319k32138q2968J19388K53030K27041K8599j84759
$$ 197105 335909 240114 -2205 -234343 -317311 -197923 55107 282148 310747 125988
167A25988k51964j69560K1074K07319K44286J27363o7696k31317k34797p5109
$$ 125988 -125976 -295536 -274462 -67143 177143 304506 236810 5493 -229304 -304413
177c04413J26806K39144J92533K9588j54803k45539j65594K4151J93757K37828
$$ -304413 -177607 61537 254070 283658 128855 -116684 -282278 -258127 -64370 173458
187A73458J16678p8008k09710k10564p6130J11470K27988J93226K2131j59492
$$ 173458 290136 212128 2418 -208146 -284276 -172806 55182 248408 270539 111047
197A11047k23848j48713K0588J80844K19394J14547o6891k08027k03227o3427
$$ 111047 -112801 -261514 -240926 -60082 159312 273859 206968 -1059 -204286 -267713
207b67713J10708K11256J75227K4960j43953k18679j43813K4319J73925K08065
$$ -267713 -157005 54251 229478 254438 110485 -108194 -252007 -227688 -53763 154302
217A54302J04003o6960j90169j91744o6038J05626K04850J68045J9591j40462
$$ 154302 258305 191345 1176 -190568 -256606 -150980 53870 221915 241506 101044
227A01044k04280j34033K0718J63431J98929J02243o3525j85426j82698n9164
$$ 101044 -103236 -237269 -216551 -53120 145809 248052 184527 -899 -183597 -242761
237b42761J00417J92010J59948K1920j32896j97405j29979K2205J57587J87905
$$ -242761 -142344 49666 209614 231534 98638 -98767 -228746 -206541 -48954 138951
247A38951R6249n8637j75808j75944n8798R6229J86545J52446J9100j26164j87507
$$ 138951 235200 176563 755 -175189 -233987 -137758 48787 201233 220333 94169 -93338
258i3338j25213J9549J50391J82007R3023n6833j68772j68381n6457R2083J77008
$$ -93338 -218551 -199002 -48611 133396 226419 169586 814 -167567 -224024 -131941 45067
269D5067J47003K0466j20713j80473j21216J8095J44953J74369Q9276n3229j61823
$$ 45067 192070 212536 91823 -88650 -209866 -191771 -46818 127551 216827 163598 1775
280A775j61993n4924Q7350J70713J41640J9491j15156j73476j17322J7312J39094
$$ 1775 -160218 -215142 -127792 42921 184561 204052 88896 -84580 -201902 -184590 -45496
291d5496J68085Q5415n1685j53777j55838n4494Q4475J64454J36380J9055j10900
$$ -45496 122589 208004 156319 2542 -153296 -207790 -123315 41139 177519 196574 85674
302H5674j66799j12885J6187J34169J61132Q2383m8487j48448j50071n1946P9565
$$ 85674 -81125 -194010 -177823 -43654 117478 199861 151374 2926 -147145 -199091 -119526
313a19526J58729J31496J8066j06085j60405j08105J5217J27297J55693Q0687
$$ -119526 39203 170699 188765 82680 -77725 -185830 -170613 -43316 112377 193064
323A93064m7424j42575j44123n1039P6988J52722J25995J7544j01992j52936j04212
$$ 193064 145640 3065 -141058 -192097 -115109 37613 163608 181152 79160 -73776 -177988
334a77988J3126J22388J50252P7690m5353j36660j38726m8690P3056J46218J21732
$$ -177988 -164862 -42474 107778 185468 140115 3455 -135271 -183961 -110905 35313 157045
345A57045J7300r6973j47375j01039J2300J17363J44109P5520m3066j31611j33015
$$ 157045 174345 77372 -70003 -171042 -158742 -41379 102730 178250 135184 3573 -129442
356a29442m7315O9231J39595J18160J7921r2713j42195r7237J1071J12005J38907
$$ -129442 -176757 -107526 32069 150229 168150 75437 -66758 -163995 -152924 -40919 97988
367I7988P3174m0694j25861j27709m6278O5575J33219J14298J8672q8937j36838
$$ 97988 171162 130468 4607 -123102 -169380 -103805 29414 143712 162384 73447 -63391
378f3391r4038R938J07774J32583P0792l6971j20470j23869m5605O1370J29780
$$ -63391 -157429 -147491 -39717 92866 163658 126687 6217 -117652 -163257 -101887 27893
389B7893J10103J7630q4296j31411r1003R655J01843J27431P0170l5900j16085
$$ 27893 137996 155626 71330 -60081 -151084 -141429 -39586 87845 158015 122115 6030
400F030j18767m4384N9638J23446J06127J8898q2539j26286q6537P992R8119J22691
$$ 6030 -112737 -157121 -97483 25963 132090 150988 68449 -57837 -144374 -136382 -38263 84428
412H4428O6687l2555j12123j16121m1374N7552J18757J01570J6469p6355j20907
$$ 84428 151115 118560 6437 -109684 -151058 -93506 25251 126821 143290 66935 -53972
423e3972q6351Q600R5237J18057O4859l3521j07376j09136m1939N4786J14766
$$ -53972 -140323 -131723 -36486 81571 146430 112909 5533 -103603 -145542 -90756 24010
434B4010R8199J7698p6237j17465p9472O726R0675J15087O0954l0273j03572j08329
$$ 24010 122209 139907 63670 -53795 -133267 -126541 -35866 79221 140175 109902 6330 -101999
446a01999l7807N3380J09190R4641J6522p1035j12823q1168Q481Q9510J08151
$$ -101999 -139806 -86426 22764 117405 133927 62892 -49931 -131099 -122618 -33108 75043
457G5043O0343l0295r9212j01481m0202N0186J08453R1062J5771o9562j09006
$$ 75043 135386 105091 5879 -95602 -135804 -85618 22835 113897 129668 60106 -48900
468d8900p4779N144Q3682J08233N7379k8276r5274j01743l6058M9848R9810Q9600
$$ -48900 -123679 -118535 -34853 73380 130759 102483 7209 -94534 -130592 -80744 19066 108666
480A08666J7320o6764j05297p5179O744Q2346J00296N7283k5408r3192r4973l8541
$$ 108666 125986 59222 -46075 -121254 -114510 -32164 68132 125415 100007 6815 -88158 -126699
492a26699M5278J01723Q4904J4515o1628j00868p2030L106P6883J01762N4521
$$ -126699 -81421 20302 105206 119721 58093 -42775 -114805 -111699 -34816 66946 121467
503A21467k5991q6794r4396l5510M4383R2511Q4431J8245o2792r6893o9640L845
$$ 121467 95476 8682 -85714 -121224 -76841 15670 100101 118346 55554 -41339 -110979 -107134
515a07134P5081R3720N4524k1713q6139q9827l6281M1512R3663P8904J4906n5978
$$ -107134 -32053 61667 116191 94478 8339 -81488 -117769 -76257 17406 96310 111216 55238
527E5238r3237o8995K834P1348R3809N1910k3805q0873q6334l4666M0100Q6548
$$ 55238 -37999 -106994 -104160 -32812 60997 112907 89102 8229 -78105 -112771 -72671 13877
539A3877P9289J6939n8312r0049o4160K602O8786Q8543N0607k0184p9850q4076
$$ 13877 93166 110105 51793 -38256 -102416 -99814 -31028 57515 108122 87938 8088 -75988
551g5988l3007L8313Q5723P4367J4748n1928q7753o4549L442O6522Q6289M8286
$$ -75988 -108995 -70682 15041 89408 104156 52228 -35525 -100074 -96632 -30110 56179 104465
563A04465k1144p4661q0699l3258L6663Q1703P3812J5490n3803q3608n9441J136
$$ 104465 83321 8660 -72039 -105297 -68634 13069 86881 102371 48568 -35040 -94481 -93345
575i3345O3454Q3183M7643j9040p3460p8988l0605L5616P8611O9715J4810m9024
$$ -93345 -29891 53292 100935 81895 8435 -70553 -101158 -65542 13069 82784 97594 48570
587D8570q1520n9520K560O1599P9331M5447j8509o9392p5018l1410L4001P5815
$$ 48570 -32950 -92470 -89910 -28311 51020 96467 77958 8566 -66452 -97862 -63861 11954
599A1954O8016J3857m8150p6797n6217J043N8218P6831M4249j7787o7381p1882
$$ 11954 79970 93827 45677 -31120 -87337 -86294 -28076 48755 93004 75217 7836 -64046
611f4046k8552L1834P1620O4461J4841m5291p4689n4742J897N6830P2565M1559
$$ -64046 -92598 -60764 10856 75317 90158 44867 -29822 -84564 -82667 -25837 46728 88287
623H8287j6226o3598o9432k8774L0901O9786O2005J3032m3296p0923n1956O42
$$ 88287 72061 8463 -60969 -89743 -58842 10944 72949 85981 42685 -28238 -80194 -79552
635g9552N4174P0479M0282j6569o1768o5434k7189K9421O6272N9344J3444m2203
$$ -79552 -25378 45101 85383 68814 7046 -58388 -85577 -56156 10116 69460 82904 40701
647D0701o8772m9592K187N1699O6946L8209j4681n9271o4374k5472K8803O4267
$$ 40701 -28071 -77663 -75476 -23777 43169 81378 66697 7426 -56948 -82420 -53617 10650
659A0650N6725J1840m0206o5425m8294J107N0272O5304L6974j5333n7130o0775
$$ 10650 67375 79215 39009 -26416 -74710 -73603 -23331 41973 78947 63614 6484 -54291
671e4291k5200K7529O1887N5125J1672l8971o3929m5609J413M7781O2658L5825
$$ -54291 -79491 -51962 9925 65050 76722 37751 -26178 -71787 -70374 -22593 40065 75890
683G5890j4175n5286n9654k3514K7364N8560N3066J1531l7688o0942m4523J040
$$ 75890 61715 6429 -53225 -76739 -49375 9185 62251 73782 36094 -24848 -69371 -68331
695f8331M7072O0158L4266j4008n3342n6291k3308K5240N7967N0771J1003l6518
$$ -68331 -21259 38899 73165 59157 5815 -50476 -73784 -48544 9423 60194 71197 34679
707C4679n8827m2535J484M4426N8232L3037j3584n1027n4979k1816K4633N4998
$$ 34679 -24148 -66683 -65199 -20773 37459 70496 56912 5885 -49094 -70910 -46277 8721
719H721M9345J0892l5124n6860m1507J142M3327N6298L1590j2709m9142n3021
$$ 8721 58066 68958 33834 -23026 -64533 -63391 -20064 36234 67824 55115 5973 -47048
731d7048k1787K3662N3624M7786J0052l3233n5454m0009J690M0899N4500L1272
$$ -47048 -68835 -45173 8451 56237 66289 33056 -22398 -62407 -60717 -19818 34682 65954
743F5954j2728m7303n1389k0949K3124N1436M6015J0505l3134n2793l8757R21
$$ 65954 53226 5923 -45466 -66415 -43291 8145 54160 64665 31531 -21262 -60019 -59098
755e9098M0031N2476K9923j1588m6150m9504j9954K1909M9891M4118R872l1159
$$ -59098 -19067 33409 63332 51744 5594 -43910 -63864 -41955 7936 52054 61926 30767
767C0767n1623l6784O77L8333N0821K9191j1663m4491m7513j9592K1593M7754
$$ 30767 -20856 -57640 -56963 -18630 32191 61382 49719 5228 -42285 -61877 -40284 7470
779G470M2883R044l0080m9285l5854R59L7912M8253K7756j1391m2746m5593j8679
$$ 7470 50353 59397 29317 -19968 -55822 -54863 -16951 31302 59058 47667 4921 -40672 -59351
792e9351K0777M5975M1044Q681k9247m7516l4021J127L6354M6605K6180j1420
$$ -59351 -38574 7401 48445 57126 27879 -19637 -53658 -52531 -16177 30428 56608 45188
804D5188m1069m3834j6982K0209M4266L8725Q356k8539m5285l2526J495L4761
$$ 45188 4119 -39715 -56697 -36488 7778 46503 54859 26320 -18965 -51491 -49996 -15235
816a5235M4698K4630j0960l9426m1614j6510J9439M2946L7108P062k7524m3367
$$ -15235 29463 54093 43133 3707 -37907 -54417 -34978 7968 45076 52138 24614 -18753
828a8753l0827J965L3489M2522K3737j0775l8162l9996j5579J8945M1068L5526
$$ -18753 -49580 -47615 -14126 28396 52133 41358 3196 -36800 -52379 -33434 7634 43160
840D3160O780k6001m2090k9811K175L1994M1064K2923j0238l6956l8597j5058
$$ 43160 49940 23939 -18151 -47962 -45787 -13793 27271 50194 39956 3000 -35597 -50655
852e0655J8534L9261L4300P110k5151m0643k8663J374L0884L9668K2561r719l5592
$$ -50655 -32121 7140 41440 48550 23399 -17244 -45907 -44533 -13649 26019 48580 38861 3269
865C269l7214j4871J7413L8028L3805O845k3933l9489k8336J051K9562L8883K1700
$$ 3269 -33945 -48816 -31403 6625 40430 47275 23342 -16147 -44483 -43432 -13870 25013 46713
878D6713q686l4119l6427j4788J6282L6719L2594P580k3149l7920k7925N36K8927
$$ 46713 38027 3908 -32519 -47307 -31025 5694 38288 45868 22719 -15201 -43126 -42590 -13663
891a3663L7595K1245q049l3195l5167j4609J5289L5587L2544O897k1943l7176
$$ -13663 23932 45177 37128 3933 -31234 -45843 -30554 5033 37577 44474 22531 -14645
903a4645k6940M47K7836L6290K0839q098l1562l4219j4828J5831L4150L0896P206
$$ -14645 -41585 -41138 -13302 22988 43827 35729 4167 -30052 -44880 -29049 5101 35997 43203
916D3203k1558l5623k6341P42K6518L5337K0216p838l0396l3868j3461J4805L3395
$$ 43203 21645 -13978 -40319 -39577 -13059 22278 42494 34656 4260 -29608 -43069 -28264 5131
929E131K9934O473k0957l4453k5133P20K6099L3594J9462p752k9640l1802j3010
$$ 5131 35065 41538 20581 -13872 -39005 -38285 -12186 21408 40870 33118 3478 -28324 -41334
942d1334J4397L2265K8179O107k0035l2975k3834O26K4820L2734J8479p732k8366
$$ -41334 -26937 5328 33507 39614 19579 -13396 -37230 -36604 -11784 20950 39429 31697 3331
955C331l0701j2264J3662L0725K7650N720j9591l1057k3307P70K3801L1190J7749
$$ 3331 -27370 -39634 -25972 4753 32403 38123 18532 -12525 -35832 -35062 -11261 19929 37678
968C7678p266k7360k9232j1861J3192K9583K5975N561j8273l0048k1976L08K2796
$$ 37678 30412 3052 -26180 -38041 -24849 4734 30709 36270 17997 -12051 -34027 -33719 -10923
981a0923K9722J6979o788k5931k8011j1187J2610K8323K4616N279j7611k8832
$$ -10923 18799 35778 28990 3059 -24952 -36139 -23529 4794 29410 34689 17078 -11754
993a1754k0840M42K2056K8255J6145o728k4806k6523j0686J1804K6929K4194M846
$$ -11754 -32594 -32152 -10096 18159 34304 27576 2770 -23753 -34439 -22635 4294 28488 33334
1006C3334j6667k7983j9769N22K0692K7211J5465o104k3863k5311j0786J1219
$$ 33334 16667 -11316 -31085 -30563 -9871 17340 32805 26701 2838 -22473 -33259 -22040
1018b2040K5953K3136M895j6185k6444j9321L92J9911K6365J4987n630k3083k4792
$$ -22040 3913 27049 31944 15759 -10685 -30006 -29614 -9703 16662 31649 26019 2936 -21856
1031b1856j0315J1074K4825K2377M695j5215k5675j8663L68J8765K5200J5033
$$ -21856 -32171 -21097 3728 26105 30800 15585 -10090 -28753 -28385 -9620 15580 30613
1043C0613n402k1908k3849j0487J0524K3921K1531M946j4371k4785j8408m29J8416
$$ 30613 25211 3303 -20546 -31033 -20509 3412 24943 29889 15518 -9267 -27675 -28104 -9688
1056i688K4699J4469n114k1199k3027r929R390K3074K0903N607j3955k4181j7744
$$ -9688 15011 29480 24366 3167 -19860 -29789 -20399 2675 23578 29185 15230 -8951 -26695
1069b6695l49J7417K3528J4614m715k0325k2365r593Q884K2223J9872N521j3195
$$ -26695 -27044 -9627 13901 28515 23800 3475 -18890 -28483 -19599 2624 22496 28017 14822
1082A4822k2992j7127n44J6725K2749J3248m114j9148k1427r740Q790K1084J9405
$$ 14822 -8170 -25297 -25841 -9116 13633 26881 22767 3619 -17808 -27548 -18758 2326 21731
1095B1731N076j2912k1940j6153j62J5654K1524J3056m333j8411j9989r031Q215
$$ 21731 26807 13895 -8045 -24198 -24360 -8706 12818 25874 21541 3130 -16859 -25890 -17675
1108a7675J9856J8282M676j2441k0199j5581r4J5587K0004J1610l855j7149j9393
$$ -17675 2181 20463 25139 12698 -7501 -23082 -23176 -7589 12415 24025 20170 3021 -16372
1121a6372q115Q352J8546J7068M213j1680j9378j4194m01J4853J9014J1335m693
$$ -16372 -24487 -16135 2411 19479 23692 12012 -7366 -21560 -21961 -7108 11906 23241 18548
1134A8548j6401j7940p178P853J7640J5656M224j1142j8129j3875j6J4185J8079
$$ 18548 2147 -15793 -22971 -15118 2522 18178 22402 11260 -6869 -20744 -20760 -6575 11504
1147A1504R920l403j5707j7205p078P284J7157J5458L260j0468j7543j2834J56
$$ 11504 21424 18021 2314 -14891 -21969 -14685 2472 17930 21190 10722 -6821 -19655 -19499
1160a9499J2665J7614J0212l583j5070j6509o997O811J6283J5025L176r507j6886
$$ -19499 -6834 10780 20992 17409 2339 -14170 -21167 -14356 1927 16952 20128 10621 -6265
1173f265j2439l30J2650J6657R471l294j3958j5914o813O623J5248J4257L500
$$ -6265 -18704 -19034 -6384 10273 19744 16450 2492 -13422 -20235 -13612 1636 15893 19393
1186A9393r038j6084j2022m47J1921J5611R640l213j3177j5014o871N925J4959
$$ 19393 10355 -5729 -17751 -18198 -6277 9334 18974 15761 2584 -12430 -19301 -13376 1583
1199A583J3270L571q812j4891j1570l18J1026J5148Q924k784j2624j4527o001
$$ 1583 14853 18424 9612 -5279 -16849 -17167 -6141 9007 17931 15147 2523 -12004 -18005
1212a8005N576J3878J3167K805q417j4136j0569m88J0430J4006Q350k602j1712
$$ -18005 -12429 1449 14616 17421 9004 -5132 -15701 -16189 -5759 8247 16597 13995 2283
1225B283j3391o193N688J3082J1891L090p786j3293j0317k59R533J3065Q267k332
$$ 2283 -11108 -17301 -11613 1469 13360 16450 8664 -4629 -14946 -15205 -5672 7393 15660 13328
1239A3328j1110j2508n768N218J1843J1333L070p051j2668r576m33Q895J2843
$$ 13328 2218 -10290 -16058 -10840 1003 12336 15406 8355 -4313 -13889 -14322 -5427 7416
1252G416P211k150j0179j1944n116M539J1072J0999K698o634j2110q951n6P926
$$ 7416 14627 12477 2298 -9646 -14762 -10223 849 11848 14546 7912 -4198 -13149 -13205 -5279
1266e279J1899P305j916j0051j0769n470M402J0672J0021K888o426j0831q579
$$ -5279 6620 13925 12009 1958 -8811 -14281 -9879 793 10814 13702 7276 -3555 -12134
1279a2134p50P923J1498O262j488r014j0875m759L822J0053R535K764n607j0498
$$ -12134 -12884 -4961 6537 12799 11311 2297 -8578 -13337 -9515 538 10073 12837 7230 -3268
1293c268q277m92P428J0287O562j716q489r894m561L573R618Q888K477n155r966
$$ -3268 -11545 -12037 -4609 5678 12240 10524 2035 -7859 -12420 -8847 771 9659 12136 6981 -2985
1308b985p701j011P324R469O173j049q154r203m569L185Q827Q751K332m717r321
$$ -2985 -10686 -11697 -4373 5096 11269 10220 2066 -7137 -11706 -8521 306 9057 11389 6672 -2649
1323b649p277r33O906Q575O113j219p669q369m154K681Q038Q224K611m611q631
$$ -2649 -9926 -10859 -3953 4622 10735 9516 1847 -6522 -10676 -7995 43 8267 10878 6267 -2364
1338b364o902p92N675Q583N625j140o491q178m238K938P298P247K401l944p696
$$ -2364 -9266 -10058 -4383 4200 9825 8685 2194 -5984 -10222 -7284 14 7261 9662 5718 -1978
1353a978o548r19N914P441N198j019o441o762l952K100P074O292K395l353p087
$$ -1978 -8526 -9445 -3531 3910 9108 8089 1648 -5114 -9066 -6966 108 6400 8795 5442 -1645
1368a645o077p24N076O943M795r99n679o770l332K251O343N702K073l329o101
$$ -1645 -7722 -8446 -3370 3573 8368 7369 1690 -5080 -8412 -6161 182 5884 7957 4628 -1473
1383a473n146q45M173O526M109o87m943n917l029J641N746N298J755k709n652
$$ -1473 -6619 -7464 -3291 3235 7344 6657 1714 -4203 -7232 -5591 155 5453 7208 4499 -1153
1398a153m840p44L820N675L894q00m252n363k759J500M702N154J751k414n336
$$ -1153 -5993 -6737 -2917 2758 6652 5852 1600 -3763 -6522 -5022 -320 4834 6585 4171 -1165
1413a165m163j238L689N236L458J7m156m867k959J001M787M472J922k056m638
$$ -1165 -5328 -6566 -2877 2359 5817 5834 1678 -3189 -6148 -5147 -360 4112 6034 3978 -660
1428f60m495r85L414M754L537m76l371m741k845J073M284M434K064k298m243l868
$$ -660 -5155 -6140 -2726 2028 5565 5089 1718 -3023 -5868 -4795 -511 3923 5987 3689 -554 -4422
1444d422j321K708M534L665r0l376m357k693N67M063M249J880j738l940l930j123
$$ -4422 -5743 -3035 1499 5164 5074 1698 -2659 -5352 -4785 -722 3527 5407 3669 -271 -4201 -5324
1460e324K498M326L052Q2k861m090k718J012L367L931J552j542l400l302j081
$$ -5324 -2826 1500 4552 4634 1773 -2317 -5035 -4023 -656 3275 4827 3285 -115 -3417 -4498
1475d498J933M027K351L64k701l286k251M70K674L535J557r45l111k934j224J841
$$ -4498 -2565 1462 3813 4177 1476 -1810 -4061 -3591 -917 2618 4175 3230 119 -2815 -4039 -2198
1491b198K783K527N02k131l149j896M72K453K690J146n20k508k449r75J434K156
$$ -2198 585 3112 3614 1483 -1666 -3562 -3090 -637 2053 3199 2679 171 -2278 -3253 -1819 337
1507C37K204L75j643k429j222OJ465K212J211k99k198j848o42P65J669J896N30
$$ 337 2541 2916 1273 -1156 -2378 -2372 -907 1305 2516 2217 19 -1829 -2471 -1706 -37 1859 2389
1524B389r26k001j386K5Q05J840J294J5j562j442j201M07J751J627N25q51j414
$$ 2389 1463 -538 -1924 -1899 -1094 746 2040 2055 493 -949 -2150 -1743 8 1635 2160 1309 -105
1541a05j464n87J121J146J571n1r15j379j140K87J094J464N72K7j645j347o33
$$ -105 -1569 -2156 -1035 111 1682 1631 716 -663 -1803 -1516 -422 1042 1614 1641 -4 -1351 -1984
1558a984Q40J011J236Q50q04j362j089p0O44J466P04J19r87j275j025N38J132
$$ -1984 -1144 -133 1103 1953 1149 -213 -1302 -1372 -728 738 1442 1561 574 -701 -1726 -1188 -56
1575e6J028O45m32j317j029l90P55J239Q55L95j114j215o20l1Q68R10P57L68j788
$$ -56 972 1617 1185 -132 -1161 -1551 -796 443 1298 1693 579 -636 -1256 -1287 -419 491 1248 1616 -172
1594a72r54l29O87N31J344L57m12j232j039l25P49J045P45L25m61j318j130L63
$$ -172 -1126 -1455 -768 -237 1107 1464 1052 -180 -1219 -1544 -795 250 995 1320 859 -459 -1589 -1226
1612a226N34J229R00J46j323j357m09J80J379J137K56q3j610p99p67O80J358J091
$$ -1226 -692 537 1437 1583 260 -1097 -1506 -1326 53 1190 1446 1363 -247 -1046 -1813 -1133 225 1316
1630A316L26p77j449q39p2Q01J233J227j20j342j909J32J2R97J896P35o80j698
$$ 1316 1642 865 -584 -1423 -1495 -694 539 1766 1646 304 -1605 -1473 -1461 -464 1432 2167 1487 -211
1648b11j413n57R66J771J283J00r52k317m68j43J657J827N77k87j563k012n72
$$ -211 -1624 -2181 -1215 556 1839 1939 987 -1330 -1798 -1941 -284 1543 2120 1833 270 -1742 -2314
1665b314J090J827J708L0j352j956j288K54J679J863J011p76j745j929q01J359
$$ -2314 -1224 603 2311 2341 989 -967 -2255 -2001 -322 1541 2552 1776 31 -1898 -2699 -1340
1681a340J811J891L15j676k348j427K03J875K348J235o95k006k362p27J215K487
$$ -1340 471 2362 2677 1001 -1347 -2774 -2571 -696 1652 2887 2192 186 -2176 -2903 -1688 799
1697G99J784J27j310k466j723k4K016K627J271n75k177k424r53P90K726K193L94
$$ 799 2583 2710 1400 -1066 -2789 -2813 -797 1830 3101 2526 349 -2075 -3028 -2238 488 2681 3075
1714C075j381k650k061Q2J526L003J596l19k356k658j295J185K462K466N73r90
$$ 3075 1694 -956 -3017 -2935 -1409 1594 3190 2871 515 -2143 -3438 -2253 209 2675 3248 2258
1730B258k867k462k19J783L022K071o39k377k668j488Q65K810K444J071j073l147
$$ 2258 -609 -3071 -3290 -1507 1515 3586 2947 570 -2098 -3586 -2721 89 2533 3604 2531 -616
1746f16k684p0J785K805K210k84k105k961j770P73K775K887J232j636l100k653
$$ -616 -3300 -3370 -1585 1220 3430 3146 1041 -1920 -3690 -2917 -142 2745 3977 2341 -759 -3412
1762c412p22K615L194J849K5k679l201j337N44K888L208R77j390l471k636l93
$$ -3412 -4134 -1519 1675 3524 3549 870 -2331 -3668 -3124 -236 2972 3949 2559 -912 -3548 -3941
1778c941J961L606K523n70k623l361k110J316L275L031J122j786l303k606n54
$$ -3941 -1980 1626 4149 3579 956 -2405 -4515 -3199 76 3107 4229 2443 -860 -3466 -4020
1793d020K134L474K759m21k994l532j609P15L724L187O81j451l265l304j12J965
$$ -4020 -1886 1588 4347 3926 932 -2600 -4209 -3494 230 3417 4098 2647 -618 -3922 -4034 -2069
1809b069L896K465m15l066l462j960J132L194L474J491j908l529k993p58K386
$$ -2069 1827 4292 3877 811 -2651 -4611 -3479 -285 3189 4680 2772 -757 -3750 -4508 -2122
1824b122M083K650k08l289l698j952P84L492L607J518j879m085l369j33K392L740
$$ -2122 1961 4611 4403 1114 -2584 -4536 -3752 -260 3347 4865 2986 -1099 -4468 -4601 -2209 1531
1840A531L082n37k756l710k449R55L726L615J548j538m192l386p36K441L860L098
$$ 1531 4613 4076 1320 -2390 -4839 -3884 -158 3457 5005 3467 -725 -4111 -4847 -2406 1454 4552
1856D552N9k815m815j912R09L763M140J113j649l996l745m07K284M416L104k91
$$ 4552 4611 1796 -3019 -4931 -4022 -259 3881 4994 3345 -651 -4396 -4803 -2519 1897 5001 4710
1872D710l111m307k513J244L540M020J574j662m110l744o55K775M158K748J28
$$ 4710 1599 -2708 -5221 -3977 -437 3583 5157 3495 -615 -4359 -5014 -2239 1919 4667 4795
1887D795l376m319k316R17L706M429J369j535m389l836p71K823M448K911q8l101
$$ 4795 1419 -2900 -5216 -4299 -593 3836 5205 3670 -719 -4555 -5326 -2503 1945 4856 4768 1667
1903A667m391k465Q94L768M310J329j669m251l497o84K456M386L196k28l211m627
$$ 1667 -2724 -5189 -4295 -527 3783 5112 3443 -808 -4305 -4989 -2533 1853 5049 4821 1610 -3017
1919c017k411J015M099M235J561j790m199m030p44K806M356L326j96l492m425
$$ -3017 -5428 -4413 -314 3921 5482 3692 -507 -4537 -5281 -2475 1881 5207 5011 1519 -2906
1934b906k758J309M099M323J392k089m240l576r20K812M395L225j10l256m479
$$ -2906 -5664 -4355 -256 4067 5459 3370 -870 -4446 -5366 -2554 1841 5066 4956 1700 -2779
1949b779k759J396L842M406J324j863m455m036n84K991M510L305m47l337m638
$$ -2779 -5538 -4142 -300 4106 5430 3567 -888 -4924 -5508 -2517 1993 5298 4851 1514 -3124
1964c124k524J389L970M414J626k357m161m029n05K623M766L331k30l545m682
$$ -3124 -5648 -4259 -289 4125 5751 3394 -767 -4796 -5301 -2678 2088 5419 5189 1644 -3038
1979c038k612R43M433M458J539k135m722l703j027K969M748L803m39l722m442
$$ -3038 -5650 -4707 -274 4184 5723 3588 -1134 -4837 -5864 -2895 1853 5656 5217 1495 -2947
1994b947k823J386L710M934J691k144m345m366j008K835N377L256k90l705m767
$$ -2947 -5770 -4384 -674 4260 5951 3807 -538 -4904 -5912 -3077 2300 5556 5266 1561 -3206
2009c206k327Q11M251M642J988k497m716l843j049L083M858L650q9l930m530l022
$$ -3206 -5533 -4722 -471 4171 6159 3662 -1054 -4897 -5946 -2863 1995 5645 5556 1626 -2904 -5926
2025e926J223M149M736J776j978m600m327q30K903M813L843n38l414n145k651
$$ -5926 -4703 -554 4182 5958 3980 -620 -4947 -5777 -2874 1939 5782 5244 1830 -3315 -5966
2040e966J018M640M680J747k227m839m297o77K994N168L628l23l957n064k586
$$ -5966 -4948 -308 4372 6119 3892 -947 -5244 -5921 -2927 2241 5869 5546 1589 -3475 -6061
2055f061J532M179M828J774k325m694m705n19L422M871L230J36l967n096k856
$$ -6061 -4529 -350 4478 6252 3927 -767 -5472 -5991 -2569 2302 5532 5668 1701 -3395 -6251
2070f251J582M458M710J536k318m618m314q89L345N192L309q0m182n019k581J253
$$ -6251 -4669 -211 4499 6035 3717 -901 -5215 -6104 -2759 2433 5742 5662 1480 -3539 -6120 -4867
2086d867M470M720J848k184n007m403p47L364N048L736m46l694n349k403R75M651
$$ -4867 -397 4323 6171 3987 -1020 -5423 -6170 -2806 2242 5978 5532 1838 -3511 -5914 -4939 -288
2102b88M703J715j935n432m277n66L273N272L539m74m029n031k740J095N110N028
$$ -288 4415 6130 4195 -1237 -5514 -6080 -2807 2465 6004 5530 1501 -3530 -6270 -5175 -65 4963
2118D963J519k695m820m407o96L023N506L652j24m696m859k741J554M610M943
$$ 4963 6482 3787 -1033 -5440 -6136 -3113 2393 6045 5921 1225 -3634 -6375 -4821 -211 4732
2133D732J670k566m929m344o40L236N504L476j67m236n592k539J463M837N254
$$ 4732 6402 3836 -1093 -5437 -6077 -2841 2663 6139 5972 1736 -3856 -6395 -4932 -95 5159
2148E159J156k658m854m283q13L427N676L661r82m433m869k729J567M966M830
$$ 5159 6315 3657 -1197 -5480 -6293 -2866 2810 6471 5489 1056 -3813 -6542 -4975 -9 4821
2163D821J629k723n232m332o18L887N238L591o73m429n018k695J829M811M632
$$ 4821 6450 3727 -1505 -5837 -6455 -2568 2670 6261 5588 1159 -3859 -6554 -4725 86 4718
2178D718J988k908m966m445r62M120N115L809n99m505n321k289J362M872M997
$$ 4718 6706 3798 -1168 -5613 -6575 -2455 2660 6469 5870 1365 -3956 -6245 -4883 -11 4986
2193D986J650k828n141m154o71L725M905L579l22m386n474k134J408M855N149
$$ 4986 6636 3808 -1333 -5487 -6158 -2433 2472 6051 5729 1343 -4131 -6265 -4857 -2 5147
2208E147J287k597n183m531k83L471N511L461n33m540n046k836J811M734N157
$$ 5147 6434 3837 -1346 -5877 -6160 -2689 2822 6283 5750 1210 -3836 -6672 -4861 -127 5030
2223E030J493k676n129m702j24L344N603L460o87m037n325k717J595M904M776
$$ 5030 6523 3847 -1282 -5984 -6108 -2764 2839 6299 5612 1575 -3750 -6467 -4872 32 4808
2238D808J935k872n272m544l78L612N525L611o80m474n361k824J875N387M895
$$ 4808 6743 3871 -1401 -5945 -6323 -2711 2814 6425 5745 1271 -4090 -6914 -5039 348 5243
2253E243J344k634n271m518o74L759N522L649p30m095n476k958K056N003M761
$$ 5243 6587 3953 -1318 -5836 -6510 -2751 2771 6420 5690 1595 -3881 -6839 -4783 220 4981
2268D981J534k675n200m551l52L775M978L881o87m535n103k851J770N110M973
$$ 4981 6515 3840 -1360 -5911 -6263 -2488 2490 6371 5684 1149 -3954 -6805 -5035 75 5048
2283E048J436k832n051m244p20L763N462L542o82m504n134k649J640N309M706
$$ 5048 6484 3652 -1399 -5643 -6363 -2600 2862 6404 5722 1218 -3916 -6565 -4925 384 5090
2298E090J477k867n348m032m92L765N183L522q01m359n123k544J637N071M964
$$ 5090 6567 3700 -1648 -5680 -6172 -2407 2776 6298 5497 1138 -3985 -6529 -4892 179 5143
2313E143J732k986n514m198l29L898N268L321p42m508n365k304J866N102M792
$$ 5143 6875 3889 -1625 -5823 -6152 -2254 3014 6335 5593 1085 -4280 -6584 -4718 384 5176
2328E176J468k952n254m587K16L545N643L259j296m063n284k396J930N011M579
$$ 5176 6644 3692 -1562 -6149 -5933 -2388 3255 6514 5218 1155 -4129 -6525 -4595 416 4995
2343D995J402k817n402m011m00L829N383L373j142m358n170k350J979N321M542
$$ 4995 6397 3580 -1822 -5833 -6233 -2404 2979 6352 5210 852 -4318 -6668 -4689 632 5174
2358E174J486k799n558m158k84L818N348L230r80m271n155k294J730N103N147
$$ 5174 6660 3861 -1697 -5855 -6139 -2321 3027 6257 5277 1006 -4149 -6443 -4713 390 5537
2373E537R92l027n460m041j26L938N113L421q30m590m833k402J766N009M362J533
$$ 5537 6529 3502 -1958 -5999 -6125 -2187 2926 6347 5517 927 -3906 -6308 -4542 467 4829 6362
2389F362l004n197m143n8L763N409L145p53m582n129j961J554N413M281J062k500
$$ 6362 3358 -1839 -5982 -6040 -2277 3132 6277 5524 942 -4187 -6148 -4594 819 5100 6162 3662
2405C662n166m553K59L572N465L178j256m196n322j986J883M959M618J354l242
$$ 3662 -1504 -6057 -5798 -2226 3239 6417 5161 965 -4357 -6343 -4460 499 5117 6471 3229
2420C229n074m023k37L882N058L102q55m147n175j993K017M654M778J015l091
$$ 3229 -1845 -5868 -6105 -2223 2835 5937 5082 935 -4240 -6233 -4216 438 5216 6231 3140
2435C140m951l883k84L792N206L012p26m401n304j978K144M630M644R38k907n002
$$ 3140 -1811 -5694 -5978 -2186 3020 6032 5306 905 -4399 -6377 -4233 397 5041 5979 3072 -1930
2451a930l666k36L767N053L099j117m276m819k297K200M769M561Q88k682n197
$$ -1930 -5596 -5832 -2065 2988 6087 4970 694 -4125 -6422 -4222 547 5108 5996 3314 -1883
2466a883l916j76L905N022L231j244m166n020k091K201M812M402P40k773m822
$$ -1883 -5799 -5975 -2070 2952 6183 4939 773 -4247 -6338 -4137 675 5077 5817 3044 -1778
2481a778l893p1L698N017L091r32m325n116j849K063M735M370P92k795m895l933
$$ -1778 -5671 -5742 -2044 2973 6064 5132 807 -4309 -6158 -4095 640 5010 5802 3007 -1888 -5821
2497e821J22L661N225K767q41m441m867k151K264M842M613P86k953n266l463Q2
$$ -5821 -5699 -2038 3187 5954 5113 672 -4195 -6346 -4082 760 5373 6159 3206 -2060 -5523 -5441
2513e441L519M771L101j002m377m528k083K092M576M353P01k503n007l521m13
$$ -5441 -1922 2849 5950 4948 571 -3957 -6040 -3948 628 4981 5682 3179 -1828 -5349 -5762
2528e762L993N072K567j204m189m464j849J827M490M090J297k866n168l222o8
$$ -5762 -1769 3303 5870 4666 477 -3987 -5836 -4009 481 4571 5868 3002 -2166 -5388 -5456
2543e456L794M469L022q88m477m641j662K053M803L672R76k920m681l474M07L370
$$ -5456 -1662 2807 5829 4941 464 -4177 -5839 -3786 1017 4689 5665 2745 -1936 -5410 -5003 -1633
2559a633M510K873j142m226m395j721J913M587L856R93k647m661l527K42L369
$$ -1633 2877 5750 4608 382 -4013 -5734 -3821 766 4622 5615 2968 -1693 -5220 -4978 -1609
2574a609M591K463o57l970m718j864K051M262L812J152k844m669l362L58L499
$$ -1609 2982 5445 4788 818 -3900 -5764 -3713 549 4361 5513 2669 -2000 -5362 -5004 -1505
2589a505M310K715j232l794m523j955K245M406L989P97l008m352l137k0L313M845
$$ -1505 2805 5520 4288 494 -4029 -5984 -3739 667 4656 5453 2445 -1907 -5044 -5064 -1751 3094
2605C094K681j347l970m279j583J596M603L968N90k853m513l294N30L366M451
$$ 3094 5775 4428 458 -3821 -5404 -3808 795 4763 5353 2500 -2013 -5307 -4777 -1411 3040
2620C040K420q99m354l962j710J781M359L856R65k851m580l182L07L097M752K248
$$ 3040 5460 4561 207 -3755 -5465 -3684 675 4531 5496 2645 -1935 -5117 -4810 -1713 3039 5287
2636E287j152l739m255j474K108L823M166N67k496m776l104L76L122M301K752
$$ 5287 4135 396 -3859 -5333 -3225 598 4764 5331 2835 -1941 -5045 -4669 -1547 2754 5506
2651E506j295l852m120j559J846M361L779N86k851m124l278K35L325M372K445
$$ 5506 4211 359 -3761 -5320 -3474 887 4666 5252 2401 -1723 -5001 -4766 -1441 2931 5376
2666E376j482l625m019j557K031M166L535P20k765m158l060J71L268M083K666
$$ 5376 3894 269 -3750 -5307 -3276 890 4425 5145 2380 -1778 -4838 -4667 -1399 2684 5350
2681E350j336l561m348j251J646M611L307O54k839m184k804Q0L440M194K134j178
$$ 5350 4014 453 -3895 -5146 -3500 1111 4418 5072 2233 -1951 -4755 -4675 -1235 2959 5093 3915
2697C915l576l812j596J741M201L752N18k846m166k861K2L227M546K022j304l628
$$ 3915 339 -3473 -5069 -3328 873 4625 5143 2297 -1869 -4730 -4708 -1481 3065 5087 3783 155
2713A55l839j353K006L951L369O79k829m130k511J46L067L899K350j165l740l546
$$ 155 -3684 -5037 -3031 920 4289 4968 2139 -1991 -4502 -4356 -1289 2610 4960 3795 55 -3491
2729c491j152J623L882L319M22k240m185k809L47L107L783K449j260l588l975
$$ -3491 -4643 -3020 862 4181 4603 2363 -1822 -4631 -4284 -1177 2606 5055 3795 207 -3768
2744c768j101J795M050L460K39k665l834k624L4L153L867K349j336l580l466j605
$$ -3768 -4869 -3074 976 4436 4675 2010 -1824 -4448 -4414 -1261 2606 4955 3619 39 -3427 -5032
2760e032J959L759L464M92k804l488k961L90K853L963K213j255l453l614j255
$$ -5032 -3073 686 4150 4642 1838 -1650 -4611 -4221 -1368 2595 4808 3553 100 -3514 -4769
2775d769K030L552L308M41k404l637k817L96K715L810K108r87l575l319j653J771
$$ -4769 -2739 813 4121 4562 2158 -1479 -4296 -3900 -1185 2625 4733 3746 171 -3148 -4801 -3030
2791c030L749L416K66k539l580k487K64K993L654K066j326l330l415r66J260L713
$$ -3030 719 4135 4401 1862 -1718 -4205 -3941 -948 2706 4772 3446 116 -3299 -4265 -3005 708
2807G08L156N26k261l877k180j73L095L659J802o42l714l248j198J398L931L031
$$ 708 3864 4390 2129 -1748 -3928 -4101 -1006 2653 4455 3813 99 -3149 -4347 -2949 982 4013
2823D013L32k499l521k319j87L109L425K321j525k982l380j165J653L396L291
$$ 4013 4345 1846 -1675 -3994 -4181 -1072 2353 4674 3149 167 -3213 -4378 -2725 671 3962
2838C962L31k440l358k925K34K902L706J922j120k961l416j340J872L537K912
$$ 3962 4293 1853 -1505 -4430 -4196 -1294 2412 4334 3214 253 -3163 -4503 -2631 906 3818
2853C818N69k648l372k567O50K361L725J810j166l080l332j123J769L470K688
$$ 3818 4387 1739 -1633 -4200 -3550 -1189 2536 4346 3180 100 -3232 -4355 -2586 884 3572
2868C572P03k442l611k056q6K843M009J249j006l058l147j000J583L291K591N13
$$ 3572 4275 1833 -1778 -3834 -3920 -1077 2932 4181 3175 117 -3030 -4030 -2447 844 3435 3948
2884C948k072l388k287J39K510L428J743r94l027k906j140J461L414K750L41k161
$$ 3948 1876 -1512 -3799 -3660 -1150 2278 4021 3027 0 -2906 -4046 -2585 829 3579 3920 1759
2900A759l391k009N4K741L228J525p40l339k949o19J174L421K743K30k083l247
$$ 1759 -1632 -3641 -3587 -846 2382 3907 3167 -172 -3121 -3740 -2566 855 3598 3828 1745 -1502
2916a502k145L52K429L281J562j068k676k951j228J543L336K510J13k001l205
$$ -1502 -3647 -3295 -866 2415 3977 2909 233 -2718 -3946 -2403 933 3443 3556 1555 -1650
2931a650j998K12K447L468J539j130k852k804r48J416K962K770L07j962l633j690
$$ -1650 -3648 -3436 -989 2479 4018 2888 36 -2768 -3716 -2300 662 3432 3739 1777 -1856 -3546
2947c546J20K586L095J436q27k947k701q55J449K815K567L99j964l263j856J97
$$ -3546 -3426 -840 2255 3691 2864 -83 -2784 -3639 -2190 625 3192 3591 1627 -1636 -3492 -3295
2963c295K284L133J446p56k719l241n41J457K907K558L32k068k852k182K55K418
$$ -3295 -1011 2122 3568 2812 93 -3148 -3689 -2232 675 3233 3565 1497 -1355 -3537 -3282 -864
2979h64K946J474o88l040k625p61J074L225K569J55k031k811j889L15K193K697
$$ -864 2082 3556 2868 -172 -2797 -3558 -2484 741 3310 3465 1434 -1377 -3266 -2951 -758 1939
2995A939J788j290k313l039n79J454K899K270L43k152k679j897J48K406K812J245
$$ 1939 3727 2437 124 -2915 -3494 -2040 859 3129 3472 1320 -1359 -3256 -3108 -702 2110 3355
3011C355r41k633k222q25J139K871K296L58k113k829j893K06K615K811J208q05
$$ 3355 2414 -219 -2441 -3266 -2127 744 3040 3398 1285 -1544 -3437 -3231 -616 2195 3403 2598
3027B598k692k497r00J415L053K079K0j703k980j405L00K023K413J612p31k554
$$ 2598 -94 -2591 -3491 -2076 977 3056 3076 1373 -1607 -3012 -2712 -689 1724 3336 2605 51
3043E1k564m67J169K336K225M67j894k567j909J17K327K588J320p59k343k483
$$ 51 -2513 -2980 -1811 525 2750 3217 1323 -1244 -3153 -3036 -709 1879 3199 2440 97 -2386
3059b386p79J278K633K230L11j811k999j479M5K401K443J453j067k574j853j081
$$ -2386 -3165 -1887 746 2976 3287 1476 -1523 -3002 -2957 -556 1887 3340 2273 -301 -2154 -3235
3075c235J442K505K456j06j875k530j886N39J951K699J290q96k348k494o37J426
$$ -3235 -1793 712 3168 3062 1187 -1343 -3229 -2690 -739 1960 3250 2354 6 -2488 -3125 -1699
3091a699K428J878N14k104k515j593M39K177K359J463j028k500k115r43J552K456
$$ -1699 729 2607 3121 1017 -1498 -3091 -2652 -475 1884 3347 2319 -181 -2296 -3239 -1687 769
3107G69J975K08j691k620j529L34J948K549J473j348k227k274n99J535K140J756
$$ 769 2744 2952 1261 -1359 -2888 -2554 -606 1943 3416 2068 -159 -2433 -3032 -1497 643 2399
3123B399L89j604k401j687M64K121K083J087p57k244j985p90J221K285K253L1
$$ 2399 2788 1184 -1217 -2904 -2440 -319 1764 2851 2094 -150 -2135 -2925 -1704 581 2834 2865
3139B865j755k508j222M39J472K487J130q24k373j897o70J300K372J884J02j908
$$ 2865 1110 -1398 -2620 -2181 -709 1778 2908 2084 -289 -2186 -2856 -1556 816 2700 2802 894
3155H94k307j070J70J842K218Q44o62k029j999o89J113K250J545N08j614k171
$$ 894 -1413 -2483 -2313 -471 1747 2591 1929 -100 -2099 -2788 -1675 575 2120 2628 1014 -1157
3171a157j362J30K019K011J348j076k189j727n72R93K208J806l9j339k349j471
$$ -1157 -2519 -2389 -370 1641 2989 1913 -276 -2003 -2575 -1582 626 2432 2393 1054 -1295 -2766
3187b766R82J263K369R65q63k086j992k02R91J894J716K12j479k330j343M38J788
$$ -2766 -1784 -521 1848 2813 1950 -136 -2128 -2330 -1339 555 2271 2483 1004 -1326 -2669 -2231 -443
3204d43K450Q59j049j665k321m19J131K270J499%j393k068j085n1K078J790O65
$$ -443 2007 2866 1817 152 -2169 -2588 -1457 813 2312 2312 919 -1149 -2234 -2285 -207 1583 2248
3221B248n25j778j959m54Q13K276J745l5j532k022j061K63J710J842P87m03j888
$$ 2248 1723 -55 -2014 -2468 -1655 621 2366 2331 799 -1223 -2284 -2021 -311 1531 2318 1915 27
3238B7k004o04J373K140J198K28j612k135r39L67J634J801Q73q14j618j515p28
$$ 27 -1977 -2581 -1208 932 2130 2358 746 -1389 -2328 -1961 -327 1474 2347 1533 -85 -1600 -2328
3255b328J137J895J534J42j486j949j136K46J603J873P67r18j780j502m74J148
$$ -2328 -1191 704 2238 2380 894 -1055 -2191 -1945 -342 1531 2298 1380 -400 -1902 -2376 -1228
3271a228K061J286mj271j716j296j0J832J801Q59l32k009j880m65J303J754J479
$$ -1228 833 2119 2115 844 -872 -2168 -2178 -346 1455 2314 1982 -27 -1907 -2372 -1069 685 2164
3288B164j35j295k104j117L37J978J696O43o37j822j266q80J497J735J340k37
$$ 2164 2029 734 -1370 -2487 -2150 -172 1524 2167 1530 -292 -1558 -2438 -941 794 2134 1897
3304A897j105j792j286O12J533J778N04n40j713j733l72Q50J825J403J0j038j877
$$ 1897 792 -1000 -2286 -1674 -141 1637 2141 1601 -112 -1845 -2217 -1367 458 1861 1871 833 -1044
3321a044p61m9J587J529Q96p20j599j572m31J173J494J429mj487j301q54j69J405
$$ -1044 -1805 -1854 -267 1262 2158 1438 -161 -1733 -2164 -991 503 1932 1928 441 -860 -1714 -1883 -478
3339d78K009M42n57j867j091m36R66J543J329R2j137j960r60M64J400J735N65
$$ -478 1531 1973 1416 -451 -1542 -1978 -1012 531 1860 1952 815 -1145 -2105 -1641 -241 1494 2059
3356B059n90j564j254p85R12J822J153J10j304j493q40J30J336J903N46q66j329
$$ 2059 1469 -95 -1349 -2134 -1222 600 1753 1863 559 -934 -1774 -1644 -308 1595 2141 1275 -54
3373e4j482n68R85J666J037K65r96j625j025m9J555J445R12q90j058j840j79O94
$$ -54 -1536 -2104 -1119 547 1584 1849 853 -772 -1797 -1846 -291 1154 2066 1176 118 -1722 -1901 -1207
3391a207J725J472k00j296j340j022L72J060J666Q03q11j230j317m89P36J589
$$ -1207 518 1990 1790 494 -846 -1868 -1496 -436 1230 2033 1222 -8 -1325 -1814 -1078 511
3407E11J406j97j363j154r63J11J716J008O85l61j517j387k18P13J568J226k00
$$ 511 1917 1720 357 -797 -1760 -1649 67 1075 1760 1399 -118 -1505 -1723 -1010 558 1784 1584
3424A584j054j309o78q7J000J846N05p65j273j244kP06J495P13J14r97j591n80
$$ 1584 530 -779 -1457 -1544 -544 1302 1807 1042 -231 -1475 -1477 -771 724 1437 1551 554 -1037 -1617
3442a617P3J314J593K74k11j638j224j73P16J378J063m4j073j227j010M00J294
$$ -1617 -1544 -230 1363 1637 1426 -212 -1436 -1609 -893 485 1548 1504 431 -796 -1806 -1406 -112
3459a12J256M99l56j338j282j77O49J291J171J9j239r80j087N07J216J295J74
$$ -112 1144 1643 1287 -51 -1333 -1510 -861 430 1601 1620 381 -599 -1686 -1179 37 1332 1506
3476A506l61j240j153k70O25J628N99J73j039j330p50J16J343J514J17m01q64
$$ 1506 1145 -95 -1248 -1518 -893 735 1334 1507 468 -862 -1612 -1496 -153 1361 1478 1077 213
3493B13j482l56R88J116R67J20r61j437o36L71R72R91P04l96j311j091l67R86
$$ 213 -1269 -1625 -637 479 1446 1566 605 -832 -1468 -1097 -125 866 1570 1174 -137 -1228 -1595 -609
3511f09J446K83K79r90j228m98j8J191J129O18n89r80j231j57O58J052Q79L78
$$ -609 837 1120 1399 409 -819 -1317 -1335 -144 985 1603 1014 34 -1197 -1354 -696 356 1235 1613
3529A613j063j121q54N11Q69R07N14l82j133r54j02M69Q84J108J39r49j428n49
$$ 1613 550 -571 -1425 -914 -45 862 1376 994 -139 -1093 -1195 -726 158 1266 1405 456 -972 -1521
3547a521L83P74J193O54l71j240j171P4O03J082R23k64o14j252o13K95R51J338
$$ -1521 -1138 -364 829 1483 1112 -128 -1299 -1225 -622 460 1383 1119 505 -747 -1360 -1065 -114 1224
3565A224N2n16r51j062l11R70P77J086Q1j143r01p10M18N83J138M97m83r48q45
$$ 1224 1276 760 -191 -1253 -1564 -594 183 1269 1350 207 -694 -1404 -986 -403 735 1232 749 -199 -1044
3584a044j90N35J143Q34mq11j154n23Q0R25J239J24l42q95q57m72P13J159N88
$$ -1044 -1234 -699 444 1278 1274 463 -691 -1214 -1134 -209 1030 1154 812 -83 -940 -1412 -699 460 1048
3603A048q0o39q86m01J0Q99O99M73j08j154j029J08N10Q27Q40P4o51j322o59N13
$$ 1048 968 329 -557 -958 -948 -49 650 1123 1015 -139 -1168 -1060 -550 277 1117 1191 540 -782 -1441 -928
3623i28R30R05J14l44r46o76p5N97Q11N85J08q10j003l60K71P01Q86N98o91q08
$$ -928 2 907 1021 677 -269 -945 -1020 -423 388 973 1081 271 -732 -1092 -821 -120 766 1364 673 -135
3643a35q48j56O09J119M89k70n84n77o60K69P06P11L17l00o90r32j78M09J163
$$ -135 -983 -1139 -530 589 1078 808 224 -353 -1013 -744 -38 673 990 690 0 -932 -1110 -701 462
3662D62O23J27n96j414k73K58P03Q96K60k38r76p97n9N38J004N47k83o97n52p24
$$ 462 1085 1212 616 -798 -1071 -813 -110 786 1046 808 -168 -965 -1024 -486 518 1065 782 85 -467 -1191
3682a191L11O22Q05M19m28p46o71j25N98M85J090k71o50r31k73L08N49O82M40
$$ -1191 -880 -258 547 966 538 -208 -879 -1004 -406 79 1169 898 248 -683 -956 -648 -99 583 1023
3701A023m75p72m47k58L92R68M89J51o62p30o01M6Q93O89N46p05n99o53j91K50
$$ 1023 548 -224 -671 -929 -537 431 920 1071 409 -321 -922 -876 17 706 1252 547 -52 -705 -896 -646
3721f46J177K98m4n26q75m63M30N62O09K88k47o37p67n7K31R50P54k35n55m85
$$ -646 531 829 785 259 -616 -1079 -649 -87 522 810 563 -74 -841 -898 -667 283 1037 802 247 -238
3741b38p17j4R08Q97J93o90r46k31J0M63P15N37k11m63o99m77K36O53Q18K13m60
$$ -238 -955 -969 -61 836 1029 339 -607 -838 -828 -365 350 887 676 213 -486 -963 -727 -74 744 957 497
3762D97o57l67k55N17O38N54l39l29p58l41J98Q41L46K15K1j294k62J10N23M94
$$ 497 -160 -527 -782 -265 373 927 588 259 -499 -840 -642 199 545 760 781 -513 -775 -665 -142 352
3782C52L21q6j84j082m7m2N55O65K32k41l21p10j35M73N94M84o7n76n42k45j70
$$ 352 673 587 403 -679 -726 -768 -213 452 684 443 122 -588 -723 -250 344 828 761 185 -357 -602 -772
3803g72Q05M31J85l92k20r62L13K32N97N74q1m71p39k51L28K64Q96P4n17n01m40
$$ -772 33 464 649 257 37 -925 -612 -380 217 791 710 239 -500 -751 -423 -159 737 811 294 -207 -647
3824f47k0L75N13K06K95m95p42j06j51O36N83M43k19q84l34k77L64R50K92k97
$$ -647 -667 -292 221 427 722 227 -515 -621 -772 -136 447 890 671 -213 -547 -824 -460 490 782 485
3844D85j56p67l00J52N87N21M35n57o46l79k72N75L11O68J11o26o54k04K01N30
$$ 485 329 -438 -738 -586 1 522 957 400 -246 -625 -897 -322 -11 657 768 142 -512 -716 -515 15
3864A5M60K46j28q89k78k70N03O46J17K95m86o09k40K40J52O20M87l26n50o73
$$ 15 475 721 593 -296 -574 -844 -341 305 422 717 231 -378 -618 -378 -226 394 881 555 5 -668
3884f68J96L9O40L12M2l97m14m69J89O44L47L25k18q36l63q7L55P49J66k53k54
$$ -668 -472 -433 207 519 561 164 -250 -719 -530 114 461 786 568 -268 -631 -718 -363 386 552 299 45
3905D5j58m71K69K90L19J92k11m48k61j49K95L99N42K7n14m73j64J16J97K77O20
$$ 45 -113 -584 -315 -25 294 486 275 -173 -434 -583 -288 111 653 680 166 -307 -471 -355 -158 119 739
3926G39l76l97k66k55L80M33L81n8o60k53l25K84J43Q72j23J03q21k18j53K82
$$ 739 363 -34 -300 -555 -175 258 639 581 -79 -332 -657 -373 -230 642 519 622 -199 -417 -570 -288
3946b88M84L51o6m22l21l24j52M24O06J24J25n84l40p8P1N01L95Q5n10l76n8L07
$$ -288 196 547 481 59 -262 -586 -738 -314 292 416 541 -43 -383 -461 -390 111 506 591 81 -295 -353 -46
3968d6j9M98j19J32l96l88k6Q6J05N77J09l07n94jJ6J81O51J9p9n76l32J06L60
$$ -46 -65 433 314 446 50 -338 -364 -278 -173 404 513 206 -388 -389 -373 -192 459 478 399 -177 -509 -403 -43
3991d3O5L20J66l80p04P9KM76N78o6J5o99j40j96L22K55L94l05J96p44m59L53
$$ -43 22 342 508 128 -576 -497 -495 -19 559 493 508 -191 -331 -527 -205 50 444 139 335 -409 -868 -515
4013e15K60O08J24k22j83n50p7J12O54J84pj06m03k96J27k5Q27L2j74l43k63k28
$$ -515 -255 353 477 255 72 -478 -555 -443 211 395 388 282 -121 -417 -290 -315 512 544 370 27 -236 -464
4035d64J97R3N96Q0k35m65k79J9L15N75O8k09j70n91J20q4M23M76J3n4o91l24
$$ -464 -267 -174 422 502 267 -198 -477 -458 -143 432 500 291 121 -470 -350 -434 -11 465 478 424 -267 -591
4057e91J27K01N50J12K41n52n48j03N35j12M25n6M6k99l96j84L97N50jj91k83
$$ -591 -464 -263 287 399 640 88 -460 -563 -28 -140 285 229 275 -24 -420 -604 -207 343 342 151 -132
4078a32j05j86N4N38K04N1k97l35k95M9K81N59p2o1k69k35o8J09K57L07M0k51
$$ -132 -237 -423 -369 169 373 424 127 -208 -503 -454 -173 386 314 253 -16 -251 -319 -210 47 354 394 143
4100A43l65j17j73K54O69p6p7j98m15j80L94J36M97k2k61k16m84L58j77M57L81
$$ 143 -222 -339 -512 -258 411 335 258 60 -355 -535 -141 -5 492 470 209 -7 -491 -133 -310 147 528
4121E28k13m14j33q2Q1K65M57L0m05l5m89K06J22J58J28K85k56l03n16K63M19
$$ 528 315 -99 -232 -314 -233 32 489 519 114 79 -410 -204 -82 76 204 489 233 -70 -586 -323 96
4142I6K62k9j37l46k43o8L31M51J39M6n48n44j46M77M49J73J87l07l53l02N6J50
$$ 96 358 329 192 -154 -397 -465 -134 317 456 502 -46 -590 -736 -259 190 363 550 243 -110 -412 -356 -206
4164b06M16N74o08m5l26j98L18K67J50J24n39r5j02O0L24J07p9K13m59k37o8J41
$$ -206 210 784 176 131 -195 -393 -75 192 342 466 -73 -168 -270 -210 114 221 142 355 -104 -341 -409 -268
4186b68L40M39j85m01m4l35Q6J06M23N1K99p33K50n95L04K17L98j37q7j22j97
$$ -268 72 511 326 -75 -119 -454 -368 -262 161 212 511 -222 28 -567 -263 -46 352 215 128 6 -191
4207a91j02K17M34k40L14m22j21m05K34M27J75L5k06k82j82r6K10M61K03rm59
$$ -191 -293 -76 358 118 432 10 -111 -516 -282 145 320 355 149 -133 -315 -411 -201 260 463 454 -5
4228el94J77k40M18M27j31j67r4Pl13L26L5P0L32n04j52j23L8L24N61m53J26j21
$$ -5 -399 -222 -462 -44 383 252 85 -9 -2 -315 11 46 116 448 -56 -208 -331 -293 31 592 139 265 144
4251A44n87q9N90O2K50n6r5m59k48M8L30M80J63k21l70l26L75J10J24J94j32k68
$$ 144 -443 -532 58 120 370 314 219 -240 -488 -440 -110 370 533 312 -58 -384 -9 101 225 419 287 19
4273A9j45m42L02M07k0M49j74n39o2R3NJ16L74l04j85J34k28j50N73N8J0j03k
$$ 19 -126 -568 -266 141 121 570 396 -143 -205 -112 -107 9 383 79 -106 28 -200 -350 223 281 291 188 186
4296A86m09P4r6K84L30on25J54k74j11M40M81k41q6l50k35J46P8M08j3N4k37l42
$$ 186 -223 -149 -245 39 369 363 -162 -8 -282 -393 47 528 287 201 -149 -384 -238 -160 248 235 289 52 -290
4319b90J65j32K52J97l5K7k44k67k2J94M12N2j38l10j84J5J64L68R6J63k82n89
$$ -290 -125 -257 -5 192 157 184 -60 -327 -349 -155 257 309 171 -139 -323 -308 -144 224 320 483 201 -388
4341c88O1R7J10M6K15J6J9n57J52Q9L42N8n8Rl18j36j82K58K43M20m5l65l77J04
$$ -388 -327 -230 -120 -74 141 157 176 -381 -229 -140 202 260 202 211 -107 -243 -425 -167 76 496 451 86 -291 -187
4365a87N9m1N02K0j81l61k48J46J85K29l3J55j48k85M3l30N15J36jl9k07l43N7
$$ -187 -128 -169 333 353 172 -189 -437 -291 -106 123 90 245 97 -188 -145 -475 40 176 175 136 -71 -414 -357
4388c57L44J14J11L14l99k49k38j44M93O0L36q4k31l87j92L63L35n1K20l46l02
$$ -357 -13 101 212 526 127 -122 -360 -504 -11 49 385 301 70 -317 -509 -146 189 138 358 12 -290
4409b90Q8j37M78J15j7K0m85j00J83j40O75J20l76j44k35K2k30N44NK38j26k79
$$ -290 -202 -339 139 254 237 257 -228 -328 -145 -285 390 510 134 -10 -245 -223 -453 91 96 334 208 -71
4431g1Ok64L16K19L02k59k9l26k52J15L82L04j99K7n12q8j1L12J99M27l49k27
$$ -71 -65 -329 -13 206 508 249 220 -106 -358 -243 139 443 244 271 -241 -329 -340 -28 171 598 249 22
4453B2j30j59J5L07J33J44k70l16j54R6K02J63L69k86K2m57m1J52K85L8J4o3k95
$$ 22 -108 -267 -252 55 188 332 62 -254 -408 -312 -110 53 422 136 158 -299 -340 -188 97 135 149 86 -209
4476b09P7j75K07J71L91j59k06l63j73O9L66M30l66J46m59o6J50o3M42K30k99
$$ -209 -132 -307 -100 71 462 303 97 -266 -439 -370 -4 426 60 206 -253 -319 -169 -232 210 440 141
4497A41j37j08j01K6J93K73ko9l58k41K78J18Q3qK18l26n8l93J87K94K57j2M4
$$ 141 4 -104 -205 -179 14 287 285 216 -142 -383 -105 13 96 88 306 -20 -78 -471 -284 10 267 255 299
4520B99n07l3K08j90L38K00j55M4l62l54K10P8M36J01K20o93Jp1L38J2Q4J56j32
$$ 299 -208 -241 -33 -223 115 315 160 204 -158 -512 -302 -224 212 313 533 -160 -159 -230 108 120 204 360 228
4543B28m35r2J09R1K00m8K47j73l87J83j90K94K68K3m7m71j4o9k1N86q3j39j57
$$ 228 -207 -299 -190 -99 101 53 300 127 -260 -77 -267 27 295 318 271 -200 -214 -283 -304 282 199 60 -97
4566i7m71M02K78J75n8o4l63J87l39Q7K77L6L75k55j99j77q0J97L18Rk85q8L05
$$ -97 -568 -166 112 287 229 165 -198 -11 -350 -263 14 50 425 170 -29 -206 -286 -89 229 238 -47 -135 170
4589A70n55J13K87K23M04n91o6m84J49K68L90L7O6l0o59J8J92J95N9J82k42k62
$$ 170 -385 -272 15 238 642 51 -15 -499 -350 -82 308 345 411 381 -278 -260 -68 127 186 368 126 -136
4611a36k87L85k17L37J58j04k11ol58L75J47J55J48j59l01j05k05K89L59j36j28
$$ -136 -423 -38 -255 82 240 136 -75 -81 -439 -64 83 238 386 227 -74 -179 -384 -95 264 128 0
4632@j27j85J90o9K72J05J02k86K7o1l91L14N18k89Q0j76l56Q8k17L76K51MrK0
$$ 0 -127 -312 -122 -191 81 186 288 2 29 -32 -423 -109 409 120 200 24 -332 -244 -461 -85 166 170 161 181
4656A81j54j30L00n6m3P8k70mk59J45J02K86K16j47l96j0q2L82M2J35n8o04J6
$$ 181 27 -103 197 141 98 176 -94 -98 -357 -212 -110 176 392 245 -151 -161 -243 139 181 316 258 -346 -330
4679c30K42M7p9J65K53k07j69k09K85j89J97J71k72j80K0k2J74K80J36J05Qp07
$$ -330 -88 -41 -120 45 298 91 -78 -287 -2 -191 6 177 -95 -275 -255 -277 -103 177 313 418 426 -281
4701b81j24M0L13J28L05l66j89r8K6O0L07K3Q8k23j89J45k52J90L62M5K65r12
$$ -281 -405 -365 -52 76 381 15 -174 -272 -246 -186 121 144 232 9 -180 -35 -287 -97 265 310 575 -337
4723c37K42j21J00L28J73K6l35p7m10K81r3K11L43Kk55l66O0Q9J93J08M8J51l93
$$ -337 -95 -216 -116 212 385 411 76 -1 -411 -130 -223 -12 331 333 78 -288 -228 -139 54 162 210 361 -32
4746c2l14M2pL14L7K67k82qk12n8J26M33p9j15l0n05J46P9K33M91m88J05m59J42
$$ -32 -346 -304 -311 3 40 307 25 17 -195 -253 -127 306 227 112 82 -423 -277 -198 35 526 38 143 -316 -174
4770a74J89n5J87J04r9l15Rj26J05K58K82l96K67l50Qp4M04j90L40m05n4j03j28
$$ -174 15 -40 147 251 152 -163 -154 -280 -175 83 365 -31 236 -114 -106 -180 224 34 374 -31 -85 -188 -316
4793c16J32M16p9J80m79L17o89L49P7N30l22L14q64L67l49L65J74K09K14q52M32
$$ -316 -184 232 153 333 -146 171 -518 -169 -92 438 116 430 -434 -67 -416 -51 123 332 546 -306 126
4814A26r04J049o47J012l84k49O3r58R28j63L57N72j003K85n91k7Q01o02M15O06
$$ 126 -778 271 -376 636 252 3 66 -892 36 -127 230 802 -201 84 -507 -534 267 -335 80 686
4834F86j028P03q35k11J256o80K03P96j146K3M58n55J96Q85o50k37N15r82kP22
$$ 686 -342 361 -474 -685 571 -109 94 890 -256 -233 225 -330 -134 751 101 -136 379 -603 -605 117
4854A17L89o12L78n7q94L6J044k45m75P74q9p89m08R47J3k89n0N86L1q85j50N51
$$ 117 506 -106 272 215 -679 -643 401 156 -319 455 366 -423 -831 116 129 -160 -210 376 407 -478 -628 -77
4876g7K40k27o4N13j26q51L6N04N14r8l18l43L36J43n78j25Q71M26j88r11o9K04
$$ -77 163 -64 -128 385 259 -592 -556 -52 462 364 46 -297 39 182 -396 -521 350 776 588 -323 -392 -188
4898a88L86N56m53m01l39O41p8p6k10P2J60L53l35m98j84J09M47N11L62o96l87
$$ -188 198 754 301 -100 -439 202 124 48 -162 -90 70 423 88 -410 -594 -485 -38 473 835 139 -248
4919b48p22N42L75P91n7n66k98o77N81L44M48J68j47l19p06k35L59L56N44Q8m21
$$ -248 -970 -428 -53 738 681 115 -183 -860 -279 65 513 681 534 215 -491 -726 -367 -11 533 621 200
4940B00l26m82K5J31O78M0L55R8o03k36k71k06M18K29k1J02J52J47j26j11k57
$$ 200 -126 -608 -583 -452 226 266 621 719 116 -120 -391 -597 -179 50 29 131 283 430 304 193 -64
4961f4m0o25j76J53O86L83J80L41l52k09n68K83p2o8l7k16R0l70K96M07K39K26
$$ -64 -104 -729 -905 -752 -66 317 497 838 486 277 -291 -8 -80 -148 -185 -401 -311 -681 -385 22 261 487
4983D87K52k83o0k98k29K81j18L1j43m72o6j53L55K8L51J00k1j90k3R1L23L22
$$ 487 739 456 396 98 -131 150 32 63 -80 -552 -618 -771 -416 -388 -37 63 42 -148 -171 -80 243 565
5005E65M7j09j25k67J03N8M70k84J3l78l00J97l39K4K61J1k36p9J42k58L10J8
$$ 565 612 503 378 111 214 272 742 458 471 93 -207 -10 -349 -325 -64 -53 -289 -368 -226 -484 -174 -156
5027a56m2p9O4m85kJ46L47K3j51j22j22Mm6K68j12O06n10J29k86k77Q0M83O2J09
$$ -156 -198 -277 -213 -698 -700 -554 -207 -184 -335 -457 -579 -575 -621 -353 -465 141 -369 -240 -526 -803 -723 -240 -178 -69
5051f9k27p4m37L34j11Q0K46J23k74j84P9n8J13N29j01m37K49n17L99K94J18J04
$$ -69 -296 -370 -807 -473 -584 -504 -258 -135 -409 -593 -514 -572 -459 70 -31 -468 -219 -736 -337 -43 75 179
5073A79N1o1j36l88N13N46l03R3K34J1o55J36J12L95r9j09k77p19O6k9L49l8n9
$$ 179 230 169 33 -355 158 704 401 494 728 739 84 220 332 727 628 519 242 -477 -411 -440 -91 -129 -188
5096a88r4j86j10j95J37N18K20O3j02k78K81K0L06J30k1J38o74K38l59K28j08
$$ -188 -282 -468 -578 -773 -636 -118 102 165 63 -215 66 86 392 522 501 639 -35 203 -156 72 -36
5117c6L28l63j90k54j98J55L00L77J12J35l55O1K33J6L73J05m08j61k44k77j48
$$ -36 292 -71 -261 -515 -713 -558 -258 119 231 366 11 72 305 321 694 799 391 230 -14 -291 -439
5138d39J59L41k57j38K06m60N47J46K15K83J8k43q0n28K81n9L22l02o25J66J15
$$ -439 -280 61 -196 -334 -128 -588 -41 105 320 603 621 378 298 -230 51 -8 314 12 -613 -447 -332
5159c32m72O97K67L27Rj00l44J50j59K02m4m34k1j59%K4L63M22J27q2j7m09j67
$$ -332 -804 -107 160 487 496 396 52 202 43 245 201 -233 -254 -413 -413 -389 -26 396 523 441 424 15 -152
5182a52J35k91M41k01j98k04L05J65L25L29j41M4n95j66k06n2M3L07R9j5k0j15
$$ -152 -17 -308 133 -68 -266 -470 -165 0 325 654 513 557 -38 -204 -410 -462 -419 -112 -13 -28 -48 -163
5204a63L37JL10N8k60m39n76kN06l2O50Q2L3m64k05K48j38J76k03j68J85r6K9
$$ -163 174 175 485 543 283 -156 -732 -734 -228 -260 390 472 505 41 -164 84 -54 122 -81 -249 -64 -160 -131
5227a31K14L17J39k08Mo78k45j13L27J73L03K61k74k4j12M3j31J29m0l54K20Q
$$ -131 83 400 539 331 335 -343 -588 -701 -374 -201 102 363 89 65 -47 -4 -135 -6 -46 -400 -180 -172
5249a72L27K96o6J83l42n72j56l4J35M23K57K75J69o64j15j73p7L30J6l01k2j2
$$ -172 155 451 385 568 226 -346 -502 -536 -401 22 279 554 723 59 -56 -229 -306 24 40 -261 -283 -295
5271b95N96kK18k32l30m26k58J58K18L74N28k2k57O4o26pj56K05K69J61M4m2k26
$$ -295 301 299 517 285 -45 -471 -729 -571 -353 21 549 527 270 334 -292 -299 -455 -250 19 180 224 182 -44
5294d4Q7M2qj87J05j5k80L95K88J44n44J0k50k6k29R8N63M72J58l28m08l92j4
$$ -44 43 85 77 -110 -5 -20 -300 95 383 527 -17 -7 -257 -283 -512 -414 149 621 779 451 43 -349 -363
5317c63n8L84K55M77m73P9m77k45J88q0J50J65j5K2K80k07P5J03l64l33K65r2
$$ -363 -421 -37 218 695 222 301 -176 -421 -233 -313 -163 2 -13 9 289 82 157 260 -104 -437 -172 -264
5339b64M25K97J78l47m74j22k54M40M94Qq8K44o50o4k01j02K87J79L76J03l5n52
$$ -264 161 458 636 289 -185 -307 -561 -121 373 381 293 537 -113 -177 -378 -480 -193 -14 362 465 430 -122
5361a22r3r0J35K06K29j37Q3j51q8j64L77k63p8J21M4L39j15O7l08j29q2r6p1
$$ -122 -215 -305 -170 36 265 128 211 60 -28 -192 185 -78 -156 -35 9 348 233 300 -8 -137 -219 -315 -386
5384c86O43M11k27J84r22l72q0N31J40M97K02m5n16m94kJ68L54K66J16p7o03K
$$ -386 257 668 441 625 -297 -669 -749 -218 -78 419 621 576 60 -434 -436 -268 86 352 468 391 -212 -210
5406b10j16J4K47K49n5j44K27k61k97R0j28N76k5l6J83k04K9k70L31k87K4l2J78
$$ -210 -326 -312 -65 184 129 -15 212 -49 -346 -256 -384 192 167 131 314 110 139 -131 200 -87 -63 -95 83
5429H3Jr8L23j71k79j1j67N04J37J55l43m61k66J49K7M76M73j59Mo20L0l81J92
$$ 83 84 -14 309 138 -141 -152 -319 185 322 477 134 -327 -593 -444 -417 59 532 373 377 -243 -213 -594 -402
5452d02Q99l2M1q4m64q18N01J0N25M50q8qn45n63J10K54M09L00j40k87k00j73
$$ -402 497 465 506 422 -42 -860 -359 -349 176 626 538 530 -15 -578 -468 -214 195 495 355 68 -132 -305
5474c05Q9R6L31j12L57m50k4m2l63L68J58K16k48j63J99l77J44J89j40J61k48
$$ -305 -216 -120 211 99 456 6 -18 -60 -423 -55 103 319 71 -92 107 -270 -126 63 -77 84 -164
5495a64K97N3m38J78j8Or4JL76j3r7J34m33j38J88L93j08LK67m77k25j29q6M90
$$ -164 133 186 -252 -74 -92 -86 -180 -179 197 184 87 221 -212 -350 -162 231 123 126 393 -84 -309 -438 -524 -34
5519c4M14J52j90m91N9n79K75N21L81q5L1m66n05k73N23J83N18Q7m04k87k84P4
$$ -34 380 532 342 -149 -90 -669 -394 127 508 423 454 -12 -517 -790 -267 -84 434 521 117 -170 -454 -380
5541c80K1M05M55j16l18k8o25Q8N84K31J43K7j94o52j44J67K98M44L27k19p69
$$ -380 -359 46 501 385 67 39 -586 -498 86 317 460 487 293 -359 -503 -336 -38 406 733 514 -255
5562b55j13q9L88J06O02J96n63k90m13o8J45L77K55L27m43j80o52L45o8O50J66
$$ -255 -368 -457 -69 37 639 835 272 -18 -431 -499 -354 23 278 605 162 -18 -670 -325 -393 257 423
5583D23p1k00m88j22K19l2K48L49k12o6l30J10J87p3J58K10k39l03m2P2k7M35
$$ 423 352 152 -336 -458 -239 -271 -23 326 114 48 -282 -172 15 -58 100 310 71 -232 -274 -202 -229 206
5605B06j04M4j27K5J49k11j02K4J09k8O5j13j22K51l06K8L85l01K5J93O1k34k83
$$ 206 102 146 19 44 193 -18 -120 -96 13 -15 50 -63 -185 66 -240 -212 173 -128 -103 90 151 -83 -366
5628c66r1K20J69K47K49r8o75J19j24M01J96J03o3O5m90n8j11N95k51L55j95j56
$$ -366 -457 -237 -68 179 428 330 -345 -226 -350 51 247 350 287 352 -138 -196 -307 288 37 392 197 41
5650D1j50K19m74N33L73m91L89p69k26J93K26K54L48j15j40m78M5k11K56O95j20
$$ 41 -109 110 -364 169 542 51 440 -329 -555 -362 -136 118 466 351 211 -267 -222 -433 -177 518 398
5671C98k82j00k81r1J41K36J51J51L17n24m74rN57J16O1J20k53p55oJ48M08L04
$$ 398 116 16 -265 -356 -215 21 172 323 640 116 -358 -367 190 306 367 487 234 -521 -527 -379 29 333
5693C33J00J58o37m78J05M98l97Q36P7l03o24l46L64J81J95N75l33j77n32%J02
$$ 333 433 591 -46 -524 -419 79 -318 518 595 292 -332 -678 -314 -133 62 637 304 127 -405 -405 -303
5714c03K78M69j2n87j41l37M1O50K48L32k85j44n70l76K35N02K85M75n03m38m41
$$ -303 -25 444 432 -155 -296 -633 -592 58 306 638 353 209 -361 -737 -502 0 285 760 257 -181 -622
5735f22l0M71N36L02k8o8o71o10K24M74K73O3n7j53n82r1K82K48M53j08l5m35
$$ -622 -652 -181 355 657 629 561 -110 -720 -496 -22 251 314 257 104 -478 -569 -287 -39 414 306 271 -164
5757a64k56M7K53M68K01j46j71m01n97M45M45J13M12m15l47j86P4R8J89L62j47
$$ -164 -420 -373 -120 348 549 403 232 -169 -766 -321 124 237 649 234 -113 -299 -225 -127 62 424 277
5778B77k90l67J35j07L91M76l43N36r66j86l8J86M29L00j82l22r3k6J18m7K56
$$ 277 -13 -380 -245 -352 39 515 172 708 -258 -444 -482 -296 133 433 251 -71 -164 -190 -72 -119 137
5799A37m1R0j15l56J0k00P48J88j68o6l65j07j25L11J19K16Kl24k86K2N4K83J55
$$ 137 96 186 71 -285 -275 -475 273 461 293 227 -138 -245 -370 -59 60 276 278 -46 -332 -310 -256 27 182
5822A82NJ2m52j83K53j94O09p6K1j24l35l8l1M40R0J78m66J00n28K36K33j10K54
$$ 182 187 199 -253 -436 -183 -377 232 156 177 53 -282 -320 -351 89 179 357 -109 -9 -537 -301 -68 -178 76
5845G6K68l05j31j37J09L49j68J1p0l6l1o3K74J57k67M0P8n76M06j33L63j96J02
$$ 76 344 39 -92 -229 -120 229 61 72 2 -34 -65 -128 146 303 36 76 154 -422 -16 -149 214 18 120
5868A20r2J79l10J31Q9k3j6JO6j80oK14j57J36j37mJ2j22J49J88m23J55J77l75
$$ 120 28 207 -103 28 117 94 78 79 145 -35 -41 173 16 152 15 11 23 -99 50 238 -185 -30 147 -228
5892b28J25q2J78nj07N2j08J62PJ98l5l07J43O8j53J10oR2k08K60K6m32M01O8
$$ -228 -103 -185 -7 -12 -119 -67 -175 -13 -6 192 157 -150 -7 61 -92 18 12 104 -104 156 182 -250 151 219
5916B19l57N00k74m59L71l74M13kL04j24l16K5l1NRL33l0l93l7K59j51J88KK41
$$ 219 -138 362 88 -371 0 -374 39 37 341 217 -99 -74 -105 -100 -91 242 212 -181 -218 41 -110 78 80 321
5940C21k07k13K63l94L05j03JK48j73R2m26K76j79K67k2K6j58N3l49K66L87o5
$$ 321 114 -99 164 -230 75 -28 -27 221 48 140 -286 -10 -189 78 56 82 -76 -23 -372 -106 281 216
5962B16J5j39p3P1l26L26J74k00J01p2k71l22O30Q9J39j12k23p5k13o8J38N00
$$ 216 231 92 19 90 -236 90 264 64 165 93 -178 -500 130 219 358 246 23 -52 -265 -333 -195 305
5984C05N0k29k03n8l52J79L68K66m0k70l09L44j46J21K56K61m15n2l72j23J14
$$ 305 355 126 -77 -135 -487 -308 60 326 286 16 -293 51 -95 26 282 543 128 76 -296 -419 -305
6005c05L11M17j77k34m03K52k68O39J38o5r4p8l65j76K95K60J84L2j78m76Q2j80
$$ -305 6 423 246 12 -391 -139 -407 232 370 305 211 133 -232 -408 -113 147 331 363 185 -291 -209 -389
6027c89L55K15J66l1l44l68p1K15L25L12J70n81k51m58O51L0M33J52k95k18k75
$$ -389 -34 181 347 316 -28 -396 -467 -252 73 385 555 -26 -277 -735 -84 -54 379 531 236 18 -257
6048b57l59L78L80K56K2m04l01j80J78M31K20R8k48m0n61R0J38M1P26j57k72q29
$$ -257 -616 -238 142 398 420 16 -285 -465 -287 144 364 462 214 174 -387 -297 -159 -118 608 451 179 -650
6070f50J83J86M94J49j8j12l12l16M0J6N25L26J8l00o97Q1J05J89L38K36k29j81
$$ -650 -467 -281 213 362 344 232 -80 -396 -356 -340 185 511 529 229 -468 -387 -282 -93 245 481 252 71
6092G1m52j73L23J42L88L98m59m10l11R2O27N5J06J45m50o95L18O4M31J15K63
$$ 71 -381 -554 -231 -89 299 697 238 -172 -483 -391 236 291 397 542 92 -603 -285 -221 210 325 588
6113E88l22p68J45R8K12L36L24k48n38m7l47M19K45K87Rl12k33l02K2K08M41M44
$$ 588 266 -502 -357 -259 -47 289 613 365 -173 -220 -567 -148 97 384 393 81 -152 -454 -432 -224 217 661
6135F61j79k85m87n98M25O24K54m9m06l88j45J90K26N40K6J45m94m83l17K14O54
$$ 661 482 197 -290 -888 -463 161 415 366 -40 -428 -573 -383 -157 383 409 554 60 -423 -740 -526 128
6156A28M38j79o1o12p9N3J98M55J94l84j83o22j07M56J95O48J28n24n61L9k9J32
$$ 128 566 387 326 -286 -365 -312 -114 341 535 151 -32 -654 -761 -305 -110 538 666 142 -419 -380 -409 -277
6178b77P49ppm40n73M3K1P79L77k90k12j14l72l30M28O72J66l56m83l90J06K92
$$ -277 472 465 458 18 -555 -512 -491 288 665 375 163 49 -323 -653 -225 447 613 257 -226 -616 -510 -218
6200b18M10M04j36l92n12l01K11L67O22M96n53l39m48p8l2N99L73N6R0q13n21
$$ -218 192 596 460 68 -444 -745 -534 -167 455 951 398 59 -389 -467 -499 100 473 529 619 -194 -715
6221g15O7M48M22J01L8m64k15k01L12R9P98j22k87l89l93Q1J84L71K65n4k24l79
$$ -715 -648 -200 222 323 361 -103 -318 -519 -207 -108 690 568 281 -108 -501 -420 -236 135 400 346 122 -257
6243b57l82L39K07N99j0j87l78n59L4P43L07O23n51n51n01m5J78M61L90J71k66
$$ -257 -639 -300 -93 506 496 309 -69 -628 -594 149 456 1079 528 -23 -524 -569 -391 70 460 631 365
6264C65l44o68j95M16R47K62o9q90m46O2J83N34M94r6k57m79l61J46K79N15M82
$$ 365 21 -647 -842 -426 521 783 714 -176 -622 -560 -377 157 651 555 298 -181 -542 -396 -117 398 880
6285H80m36k28p65M7J81J79P40j46k65m84l13K02L34L35J79j05j65m70k36L80
$$ 880 444 216 -549 -502 -321 -142 598 452 187 -297 -610 -408 -74 261 440 335 170 -300 -536 -156
6305a56J96K27M47m34j48j019K60N07M66J90np37O8m56R2N37O02J39m14o46n43
$$ -156 40 267 714 280 132 -887 -627 -120 346 536 531 -206 -138 -594 -502 35 637 776 362 -284 -827
6326h27K47K35O00L75r1l40n12m31J97N84M20ok1n36q31M03M52M98N84o39j18
$$ -827 -580 -345 255 630 539 199 -313 -744 -547 37 457 451 430 -106 -937 -534 -82 416 1000 361 243
6347B43n88k46K0L60Q48J9l71l34m88j35N78M93M50l42n00m95j21J28N07O98n2
$$ 243 -345 -591 -571 -211 637 656 285 -49 -537 -672 -94 399 849 507 7 -488 -609 -481 26 724 672
6368F72l25o26k61j54O85K97N38k60n36l07l43M45J42P08m3o03n70k80K81K08
$$ 672 347 -279 -540 -694 -9 288 826 566 30 -277 -620 -175 -33 675 632 29 -541 -821 -540 -332
6388c32P54K19J90q34k93l40K71J50P00J30k86n41o56L65L52M30N35o7m76n98
$$ -332 422 641 831 -3 -296 -636 -365 -215 485 615 329 -212 -868 -503 -151 279 814 747 271 -327
6408c27j48J25L80L99O00m59q89j9l34L50P31N35m57l17n46l60J01N65M62M54
$$ -327 -475 -350 30 429 1029 570 -319 -338 -672 -322 409 944 487 170 -376 -736 -635 -70 392 846
6428H46p16l05m51M9L96O15J89j35n70o45MM02N75M90j12k55o32m36p6O07Q34
$$ 846 130 -175 -626 -577 -181 434 623 488 -82 -727 -723 -321 254 744 632 377 -255 -691 -767 -160 674
6449F74O0k26n91l53k31K39J58J130k39j96m64n20jK77O90K13K93p95m36l27L9
$$ 674 734 508 -83 -436 -667 -428 -270 860 621 425 -39 -559 -560 -283 407 620 913 118 -318 -645 -606
6470f06N48O74K01l28m89n15q6L84O60K67j61p11n29k08L20P02N17M73o47n85
$$ -606 -58 616 817 489 0 -515 -601 -217 443 710 549 -162 -691 -899 -579 123 640 1113 466 -119
6490a19o52K75N54Q6O20m1o72m49n66K55Q02N07l8k58o13j76M1n7P46K49O2l93
$$ -119 -771 -496 58 144 764 723 51 -398 -964 -709 93 600 562 304 -309 -485 -444 -501 245 494 556 163
6512A63n85m10K61P96L01K74m68q05j89j83O36Q43N62n48n47m87m82K68O38N24
$$ 163 -422 -832 -571 225 526 800 332 -473 -662 -845 -209 634 1196 648 101 -386 -868 -600 38 562
6532E62K50q20j50o28J73K10Q86K77k1n70p56k30K29Q47N58p4l40n20m71j13M55
$$ 562 812 -8 -158 -786 -613 -403 483 760 739 169 -587 -817 -588 259 817 743 403 -117 -588 -701 -246
6553b46P67L34q5p32m35n87N95K73P68J0l34o14p18K05L87J042M3Rp31n00k47
$$ -246 521 855 770 38 -397 -984 -389 -116 652 662 328 -286 -1004 -799 -412 630 673 682 -49 -549 -796
6574g96K37O75N12J96n10l53m82l29L50P89L19J90n52q10m04L07Q24N70J1m01
$$ -796 -559 116 628 824 314 -39 -521 -850 -500 289 608 798 246 -564 -968 -661 163 733 744 343
6594C43q23l55J24L06O47Q15k47q78o03k67O44L77O79j08j92p30m95O9M74P44
$$ 343 -480 -835 -711 -405 242 1057 810 -68 -671 -938 -294 83 762 654 462 -268 -763 -694 -220 524
6614E24J70j82n29p51p8N05L80P54K4n02o28m75J12K30Q54N15l58m88p28k24M06
$$ 524 694 512 -17 -768 -846 -341 39 793 817 315 -313 -788 -676 -446 408 923 565 77 -651 -875 -469
6635d69P01O54k00k36o66l08lN63O53R6j99n72o15l83K80P81N85O1l57o35o21
$$ -469 232 886 686 450 -216 -524 -527 36 689 785 586 14 -601 -984 -704 77 662 723 366 -269 -890
6656h90J5Q03L76N81k00p30l56m19L41P00P98k15k38p11o17J9M41Q14P7po48o00
$$ -890 -875 -72 304 885 685 -45 -401 -820 -479 221 1019 804 566 -145 -762 -743 -302 512 589 582 -66 -666
6678f66j48K43N79O95L68o96p97l10L4M94O47M08k88l66o60m88J30Q38P95l9k86
$$ -666 -814 -571 8 703 1071 375 -422 -732 -698 -204 443 851 563 197 -463 -951 -821 17 812 773 487
6699D87q68o15K93K91P69N83j19o16p40k11K79O20O11J03k45j031l25K83J61P15
$$ 487 -381 -996 -703 -412 357 940 821 205 -535 -746 -467 153 764 867 622 -409 -734 -451 -290 425
6719D25M48k9q01p67q0K26O02N01L05m01r43k57j08M62Q95K90j63r33j22m35L00
$$ 425 873 844 43 -724 -804 -578 24 525 830 429 -514 -771 -879 -417 478 768 605 -328 -450 -885 -585
6740e85P52N47L41o59o27p91L10Q93M74L50n22n78m58l22L29O37P91r1m24p58
$$ -585 167 714 1055 396 -231 -1022 -712 181 655 1005 483 -95 -553 -875 -546 91 882 791 367 -391
6760c91j43o2K22R43L37k03o57o66j39K14P51P00j39k09q07n34K1Q57K98L76l72
$$ -391 -534 -596 -374 569 906 703 46 -620 -759 -545 206 906 767 558 -249 -783 -762 95 393 769 397
6781C97l83n28k78J62R55K24K62o67n51n47M27L81Q50K00m88l43n63l8J0R18M08
$$ 397 14 -514 -792 -630 325 549 811 144 -407 -954 -527 -146 704 904 416 73 -490 -528 -518 400 808
6802H08O5m15m56p60pL86P99M47q9p82n30m95O24P68N21l08p4q45o02K02N95O32
$$ 808 873 458 2 -758 -765 -379 420 867 778 -4 -534 -1029 -405 363 884 576 502 -343 -945 -743 -148 484
6824D84K69k93n52l87l70L08R76K03J8l95p22k59J26M64L70M91p0p23p69m7N58
$$ 484 753 460 -92 -479 -849 -541 435 638 656 261 -461 -720 -594 -130 240 731 661 -62 -831 -878 -320
6845c20M70P45j24o49l52m92L04L95O15o1J15l54j111R6L39P42J90K93n77p64
$$ -320 150 895 771 122 -230 -722 -418 -23 592 531 646 292 -819 -723 -384 358 548 841 264 -500
6865e00j52j8M48O83J23J5o49o04r4J44P40O07M4l45o88n18L13K05P25K69j20
$$ -500 -652 -670 -222 461 584 599 -50 -654 -748 -604 136 743 787 442 -246 -764 -451 -246 479 748 628
6886F28n32p37j72K66R57L78K44m13q69k17l87Q39N60K77Jr11o27n3K06P74K46
$$ 628 96 -641 -813 -547 410 788 1032 619 -250 -467 -854 -15 545 822 823 -88 -715 -768 -562 212 458
6907D58L10m53p25k27n4K63J034K9k71k81o21k81L06P00N68l6m82l96n72K64K52
$$ 458 768 315 -410 -637 -691 -428 606 635 364 83 -538 -819 -513 187 755 719 237 -159 -731 -467 -215
6928b15Q35L08j88p72n80l14M54Q14M06K66r51m53r5k7M10L43M98l12n52l49l90
$$ -215 620 928 740 -32 -612 -926 -472 342 748 1014 63 -390 -485 -512 -102 241 739 427 -125 -474 -864
6949h64M37N33O15L3o86n27k30K07K72O62K69l0o73m49k36P0J076J04M15r15o13
$$ -864 -427 106 721 754 68 -459 -689 -482 -210 452 721 691 18 -431 -667 -597 479 583 998 83 -530
6970e30m26L01O07N80J84k91m72m35k34K22Q02N94j52n24p24l42J20M66P97L45
$$ -530 -956 -655 -48 532 716 425 -47 -482 -716 -494 308 902 750 226 -498 -840 -720 -254 543 888
6990H88n57l22o50l15M10Q49L52j79k0p47k69k30O06O63L89m19n42p36n3L90N59
$$ 888 331 9 -641 -956 -546 303 655 476 456 -291 -560 -790 -184 479 868 449 -93 -829 -882 -492 67
7011F7O04Q2n62o53p1rM98O39Q8l27p61j76P3N9O57M10K14p15k75m37j15N50O07
$$ 67 671 753 191 -462 -533 -542 -44 595 683 356 -405 -581 -508 -449 208 618 832 117 -158 -595 -710 -160 447
7034D47K90l20n98l17j37K05O20O34j91k60q63k54K63N22M61L91l73o90l17j53
$$ 447 737 417 -181 -498 -635 -430 190 824 633 373 -490 -744 -481 41 502 893 520 -170 -487 -640
7054f40M16Q13K6P2m50o49k24M5P16J06J16K86p17p00K62O3O80O31m08k79l04
$$ -640 -224 589 615 687 237 -412 -636 -591 125 231 347 633 -84 -784 -522 -459 221 852 444 165 -139
7075a39n96L09M09P61j09Q2q33l08l16L70N28N28L4n67p29k17K65M53N83M2j82
$$ -139 -735 -426 -17 744 635 717 -116 -424 -740 -370 158 686 720 153 -576 -793 -528 -75 508 550 368
7096C68l95p95P7N80M71N31j81m33p65n67O12M66N92K32l80k22n88l00J13R35
$$ 368 -27 -822 -745 -165 306 837 656 223 -542 -1109 -497 -31 561 793 413 191 -397 -697 -584 351
7116C51K67K3m41n57j24K5M86L20K93o3q76m03J07M80K49N66K2n17q35j00K52
$$ 351 618 641 200 -357 -481 -456 30 350 643 580 -296 -699 -592 -112 137 703 725 208 -627 -727 -475
7137d75M32M70L74m3q94n39J93jQ22M82k00m36p55j38J43L62N96K17k89m06m80
$$ -475 -43 427 801 758 -136 -675 -482 -483 339 821 621 185 -570 -708 -565 -203 393 610 321 -85 -565
7158e65j60K95N77K23L22n61n92r6Q2N98M17N26n48o67l32o5J40N13P47r7o29
$$ -565 -725 -430 147 370 692 131 -461 -557 -475 123 540 1066 518 -149 -481 -546 -406 107 854 757 128
7179A28n95M4k5O21L50K67j50q26m41o1N90M28K34L5k22o07j82j55N24N08J31
$$ 128 -467 -423 -448 173 523 790 640 -186 -627 -688 -98 330 564 599 377 -230 -412 -567 -43 465 596
7200E96j58o17k67j55O02M47K49m5p16j41k68k38Q01K08K78l95n02k83j62L95
$$ 596 438 -179 -446 -601 1 448 697 652 -64 -205 -473 -711 90 298 576 181 -321 -604 -766 -371
7220c71M16O18j04n59m60k22K51K40N76K38k05n59m13q6L51N99L40K08n41m62
$$ -371 45 663 559 0 -460 -682 -431 -191 385 623 418 -141 -554 -640 -289 310 650 858 317 -145
7240a45n24L67M17M72o6q2p53l94K50N12K49L09j37k51n12o15M34O21K19K68l61
$$ -145 -669 -302 115 587 521 439 -314 -708 -458 54 303 612 475 224 -288 -903 -469 152 371 639 278
7261B78l18o60j72O01M36M95J96q84l61k24J62K45O73P1j47m83n76Q5L40O57N18
$$ 278 -40 -700 -872 -271 165 660 856 -28 -389 -613 -451 -206 467 538 391 -92 -668 -583 -243 414 932
7282I32l83m36m25l97k4J038p4M27K2r88k03oL51M89M20q5m09o95k6p8O98J52
$$ 932 549 113 -312 -709 -733 305 231 658 680 -308 -511 -517 -166 323 743 658 249 -446 -472 -550 148 300
7304C00M21k11m90p22J65R5O19N26k37m11l31m51M17L52O7O07o13l24k86j4M09
$$ 300 721 510 20 -702 -537 -442 177 703 466 55 -276 -727 -310 42 109 716 103 -221 -507 -521 -112
7325a12M65K25o1k84n22k37l04Q83M29j57J64r34q4j3K19P70j65K75k97q83k1
$$ -112 353 578 517 233 -289 -526 -830 53 482 325 489 -445 -529 -542 -323 447 282 557 260 -623 -644
7346f44K13L03M36L14l25o98j4k57P01K62L76j07n09m33k16Q0L83O25J80m01n96
$$ -644 -431 -128 308 622 297 -401 -415 -672 29 291 667 560 51 -382 -598 -518 -135 490 670 269 -327
7367c27k10m6M14M38K9L78n56k99k76J17K30M79K66n11k03n03l6M48O37J36l6
$$ -327 -537 -583 -169 269 298 676 120 -179 -455 -338 -108 371 637 126 -77 -580 -616 -168 469 605 569
7388E69p28%m64P6O50M12M02o54n55l65K06J84M68M96k13l08o66r9O9N12L73M0
$$ 569 -159 -159 -623 -547 103 515 917 263 -292 -657 -451 -267 201 697 484 176 -490 -589 -520 -8 365 405
7410D05p5p47j37l3K17N74J21K6j94o81M1L5L27P26K17m44n88n88K99J49N87P9
$$ 405 330 -417 -554 -587 -370 204 325 351 157 -524 -483 -448 -121 605 822 378 -210 -798 -499 -350 237 316
7432C16M7l74k26m13N11K38M16M71p95k94m73J93K88L28L85j6q54j25k00K26J16
$$ 316 363 -11 -237 -650 -139 99 515 986 191 -103 -576 -383 -95 233 618 602 -252 -377 -577 -351 -235
7453b35O10K59l61n16k28j49N83K67M15k32m36m90o8J86K50M68K81n07m05k8J4
$$ -235 375 634 273 -243 -471 -620 -37 230 645 413 -23 -513 -581 -395 -145 323 604 97 -308 -336 -322
7474c22J63L84M56l41l38m77r6K6O05L66J76k94l59o74L35J90N72M5K13o44l86
$$ -322 -159 225 681 340 2 -475 -571 -545 60 426 602 308 -51 -725 -390 -200 372 417 630 -14 -400
7495d00j7J02N75J39J54m60l52l67K40L41J96N61l18l31n75j08K38K52O43ko14
$$ -400 -417 -315 260 399 553 93 -259 -626 -386 -45 151 712 394 63 -512 -620 -382 -130 513 511 -103
7516a03k16k89J67L03M81p7L51p08l10p9K51N84L78l15j8o23m01N6M51L00L35
$$ -103 -319 -608 -441 -138 343 266 617 -91 -401 -480 -229 355 733 418 400 -223 -624 -568 -117 183 518
7537E18k76k59n04o3L30N39K9J39m71k88l64M1N68M08l4R9n89r8j18J44N74L86
$$ 518 242 -17 -521 -584 -254 285 314 453 -18 -306 -670 -629 -61 347 313 412 -177 -275 -393 -249 325 711
7559G11j83j03o47k93jM11O89J41l03k45p08J93%N21M05j48k70o23J94m73J006
$$ 711 528 425 -222 -515 -516 -105 584 725 422 177 -531 -338 -338 183 588 440 170 -453 -259 -732 274
7580B74J97J05j56m12n10k36P31J10K99q6k71l27j09j1M53J79M34l68l38m79J6
$$ 274 471 576 420 8 -502 -738 -7 103 402 316 45 -282 -391 -402 51 230 664 296 -42 -521 -505
7601e05K30M48L89J0l98n77J18P9P2N24j83K29n15k21k14KO69L0Mm8n01N0j53
$$ -505 -275 173 562 572 174 -403 -285 -206 -134 390 207 436 -79 -300 -514 -512 157 187 191 143 -358 -308 -461
7624d61O75N6M04k93n09l26l29N54L7M71K49m86l62J04l1L08K63M39m02m52k02
$$ -461 214 270 674 381 -128 -454 -783 -229 -192 279 528 42 -320 -216 -247 61 324 763 361 -91 -293
7645b93j08L2N19L15j81k33l31l36M02J57K88K00mp28q1j78K33M22K59J65l50
$$ -293 -401 -369 150 465 284 51 -280 -616 -214 -57 231 431 427 -301 -382 -560 -327 95 354 519 169
7666A69m74j95J01N35K93j84J39k26n06J19j62N54K45L09p12l28j26m5N50K60
$$ 169 -305 -500 -399 136 429 245 384 158 -348 -229 -391 163 408 717 5 -323 -449 -494 56 316
7686C16K24k05m25n10J17K84L03L38M3l18n46j57K51M24J88J58m34j37n20K35
$$ 316 540 335 -90 -600 -483 -199 104 442 485 167 -379 -536 -285 139 327 485 51 -86 -606 -371
7706c71J39K97O48k53m99l21j35K89K65J47M11m42m10k62n8L23M40Q5K71o76k41
$$ -371 -232 65 713 460 -39 -360 -495 -206 59 206 617 175 -235 -497 -555 -232 208 293 564 -112 -353
7727c53qM8L34K60L78o34n36K02k97O20Q6N44r4l41l56l92J49M49M53q5j97m05
$$ -353 -361 -313 21 281 659 25 -511 -309 -606 14 100 644 550 209 -147 -539 -390 59 512 427 230 -175
7749a75l24J19K35M21K50R0n69k87l54R8O68M97j57l75k37m0k64M03M8L33J8l99
$$ -175 -499 -380 -145 276 526 616 47 -240 -594 -496 172 669 512 137 -100 -140 -404 -1 47 380 398 -1
7771aq8l64Q5N84K75m1o7m64k05j21L53N83N9k97j46l73nrL54L72r5j34l61l75
$$ -1 -89 -453 -368 216 491 450 383 -81 -286 -407 -54 529 588 291 145 -228 -233 -242 112 484 389 255 -106 -481
7795d81kM49L25J30k44J19o21j91K49L50K34K19j49k86o05J25M15K42K25mp21
$$ -481 -483 -34 291 421 177 296 -325 -516 -267 83 317 536 387 101 -504 -379 36 278 503 499 -222
7816b22J0k11l4N43J21N3J5l20n03J85K67L69J84l11o6n04O5K04P5M99K04k93
$$ -222 -212 -423 -457 86 207 260 275 -45 -548 -363 -96 273 457 146 80 -424 -359 -155 -80 419 623 330
7838C30o58j3k2n0O32R5k86j00k39m2J80K86K28L7q6l53m38K59Q4N94j4j29j30
$$ 330 -328 -341 -363 -413 219 314 28 -72 -311 -353 -173 113 341 378 292 -61 -499 -240 -156 438 424 295 165
7861A65n09j22K64K82K79N8j28n98k20K66O88j61K14j0l92l77JL95J46l0J44j66
$$ 165 -344 -466 -202 80 359 417 289 -309 -529 -263 425 264 478 468 76 -301 -300 95 241 211 355 189
7883A89m18J01j43L10K00J6J13k30m62o4L47J15K33pj36l71R8m93M50M92J29k85
$$ 189 -229 -128 -271 39 239 255 368 138 -324 -388 -41 74 307 300 164 -207 -109 -602 -152 340 469 184
7905A84J08n78j20L45L37O8ml22j19l27K36K99q5M39l00k72j99j0p5O87J57K9
$$ 184 292 -286 -406 -61 276 344 340 18 -101 -428 -192 107 22 461 161 -111 -310 -320 -395 292 449 478
7927D78k15l27r9j05K59L05K12l27k25k40k0K3K38L58o8j28l26J03j00J49K12
$$ 478 263 -64 -163 -268 -9 296 508 181 -44 -284 -304 -281 -43 315 247 119 -207 -104 -204 -55 157
7948A57L21j37m03j43m53P11J87J52Po3k89k02l00O61K15n7O9n59r4m6J94J70
$$ 157 478 341 -62 -205 -658 53 240 392 399 336 47 -155 -455 206 421 364 433 -126 -220 -266 -72 98
7970I8K84j3r3n56j51n3L73L55J96l36l30k31O9L72M14l10j6j80k15j43L36K51
$$ 98 382 369 276 -280 -431 -484 -111 244 440 104 -226 -457 -388 -16 398 88 72 -108 -323 -466 -130 121
7992A21J61j04l19j92J67n44M65M41m0P6k89k47j95K63L27K34J41m27k4k72J61
$$ 121 282 178 -141 -333 -166 -710 -245 196 156 232 -57 -304 -499 -236 91 325 466 39 15 -257 -96
8013i6M5J11K27J2k87j49k18j5M80K96k0o07J91l47J26J86R4L82k91n5k3m23K10
$$ -96 -51 60 287 299 12 -137 -355 -370 110 406 386 -221 -30 -377 -251 -65 29 411 120 65 42 -381 -171
8036a71J71L05J59m43l98L9K63j46M47K8M6j25k57l01K23L22N0Q2k70k91J03K5
$$ -171 0 305 464 21 -377 -338 -75 -221 226 254 300 175 -82 -383 -160 162 212 294 24 -267 -164 -139
8058a39M6O7K23J28n35pL3J08R6J00o3M2k92l76L46J74R9K26j16K27r67J70K6
$$ -139 -93 -26 197 325 -210 -217 -184 -76 20 120 57 99 -193 -569 -223 -49 50 276 160 387 -580 -410 -384
8081c84M30K67K69m39l34l28L17L09l8M29j83k01j82j70J01J17M25L6m75n7o6
$$ -384 46 313 582 143 -191 -519 -202 107 69 498 315 114 -68 -238 -137 -20 405 441 -34 -91 -157
8102a57p6L03J35K65l78j69j80j05K1M70j0K75l94J14n17N3L06J23L84j93m83
$$ -157 -233 70 205 470 92 -77 -257 -362 -341 129 119 394 0 114 -403 -350 -44 79 463 270 -213
8123b13R4k65J62M81k12L11j93l13n1J6K33Q7L50k47l29k40R9K37o1K59L7k19
$$ -213 -119 -384 -222 259 47 358 165 -148 -199 -183 50 137 487 240 -89 -329 -230 7 -54 205 242 23
8145B3R8o12J78L82j9Q9P7k35r1l5j67M48K06p9l35p6N9j99L27K77q1k9k07k39
$$ 23 121 -491 -313 69 50 139 216 -19 -110 -145 -312 136 342 263 -72 -148 -89 -288 39 316 235 206 -1 -240
8169b40j03J45L58J88j72l45j72l8J2N54k15J78J66m44k84M37m3L12J02L8m54
$$ -240 -343 -198 160 348 176 -169 -341 -379 -367 187 -28 150 316 -128 -412 25 -18 294 396 434 -20
8190b0j28
$$ -20 -148
8191a48
$$ Imaginary data points
##PAGE= N=2
##DATA TABLE= (X++(I..I)), XYDATA
0@%%%%%%%%%pJ4j4K1k8L5m3N0o4P9r3J13j34J58j89K20k58L04l50M03m64N30o05
$$ 0 0 0 0 0 0 0 0 0 0 -7 7 -7 14 -14 21 -22 28 -36 43 -50 63 -71 87 -102 118 -140 164 -186 217 -247 283 -322
32c22O87p82Q86r96J121j259J407j571J751j947K165k398K651k933L237l570L936
$$ -322 365 -417 469 -527 594 -665 742 -829 922 -1025 1140 -1258 1393 -1540 1697 -1873 2063
49B063m336M779n265N801o399P064p814Q667r636J0758j2076J3641j5543J7912
$$ 2063 -2273 2506 -2759 3042 -3357 3707 -4107 4560 -5076 5682 -6394 7247 -8296 9616
63I616k0961K5048l0841L9768n5472R1240l25072n9066N15631J42466J36586k59806
$$ 9616 -11345 13703 -17138 22630 -32842 58398 -266674 -325740 189891 332357 468943 209137
75B09137l77031k65426M05K93967M24167J82052q6207m06851l17125m6585P5750
$$ 209137 -167894 -433320 -432915 -138948 285219 467271 381064 -25787 -342912 -389497 -313747
86c13747L27496M34686m730k73238l24167k73467L6950K96654L11864K14156q6167
$$ -313747 13749 448435 443705 170467 -153700 -427167 -390217 -93563 218301 432457 346290
97C46290l10209l43774j65133K26546L59243J91740R4050j67183l94759k30795
$$ 346290 36081 -307693 -472826 -246280 112963 304703 398753 231570 -163189 -393984
107c93984K4870K46549L66336J65497j12430k74551k93179j14907J10590L09496
$$ -393984 -369114 -122565 243771 409268 296838 22287 -270892 -385799 -275209 34287
117C4287L31987K2920k38223k72054k30745m948K56606K90847J81899n3480k92672
$$ 34287 366274 389194 150971 -121083 -351828 -356776 -100170 190677 372576 319096 26424
128B6424k95644j06599J41025K86438K32280P5924j59296l29487k13952K2495
$$ 26424 -269220 -375819 -234794 51644 283924 359848 200552 -128935 -342887 -320392
138c20392K08796K97563J65828p7290k34293k67154j28478J14140K78726K54634
$$ -320392 -111596 185967 351795 274505 40212 -226942 -355420 -241280 37446 292080
148B92080M2158j75799k54983k05289j4574K09016K71694J63252n0581k45322
$$ 292080 334238 158439 -96544 -301833 -316407 -107391 164303 327555 276974 31652
158C1652k56023r6611J05951K40517K26466O8894j49571k73216j90198O941J83384
$$ 31652 -224371 -320982 -215031 25486 251952 320846 171275 -101941 -292139 -285198 -101814
169a01814K54741J51072n3402k10261k41064j11421J03678K40641K12608M7145
$$ -101814 152927 303999 250597 40336 -200728 -312149 -208471 32170 244778 291923
179B91923j41172k35074j84621p027J80693K40259J43939n0038k10557k20803
$$ 291923 150751 -84323 -268944 -275971 -95278 144981 288920 238882 28325 -192478
189a92478r1324Q9891K17835K03983N3992j36397k35577j67056N147J64494K23055
$$ -192478 -283802 -193911 23924 227907 281899 145502 -90075 -257131 -251984 -87490 135565
200A35565J33938m5197j91856k15820r2612R5851K10315J86078M4707j26343k14763
$$ 135565 269503 224306 32450 -183370 -275982 -180131 30184 216262 260969 134626 -80137
211h0137j62933m67J62212K13853J24472m6435j84551j98668q4631Q3667J99818
$$ -80137 -243070 -243537 -81325 132528 257000 210565 26014 -172654 -257285 -173618 26200
222B6200J81854M2042j23406k06597j51400L055J51019K01299J19921m1469j75927
$$ 26200 208054 250096 126690 -79907 -231307 -228252 -77233 124066 243987 202518 26591
233B6591j93418q0740Q4236J90002J69551M1221j15007j96877j47135J318J47247
$$ 26591 -166827 -247567 -163331 26671 196222 237443 122436 -74441 -221576 -220258 -73011
244g3011J93086J12789m1203j66080j82752p9012P7826J82914J65269L8115j11940
$$ -73011 120075 232864 191661 25581 -157171 -236183 -158357 24557 189826 227941 116001
255A16001j87718j38906j62J39320J85316J09597l8050j60366j76305p5454P5145
$$ 116001 -71717 -210623 -210785 -71465 113851 223448 185398 25032 -151273 -226727 -151582
266a51582J74755J57656L7035j04767j80013j35407r33J33738J78644J05439l6876
$$ -151582 23173 180829 217864 113097 -66916 -202323 -203256 -69518 109126 214565 177689
277A77689j53251j69007p3399P1789J67412J51871L7300j01868j72524j29986
$$ 177689 24438 -144569 -217968 -146179 21233 173104 210404 108536 -63988 -193974
287a93974j778J28278J71962J01832l5024j48091j61729o9927O6991J60992J47220
$$ -193974 -195752 -67474 104488 206320 171296 23205 -138524 -208451 -141460 19532 166752
298A66752L5752r7452j66464j25090j411J22533J65443R8268l4080j41024j55469
$$ 166752 202504 105052 -61412 -186502 -187913 -65380 100063 198331 164251 23227 -132242
309a32242o8498O4483J54293J41858L5426r4092j60278j20205j418J17838J58312
$$ -132242 -200740 -136257 18036 159894 195320 101228 -59050 -179255 -180673 -62835 95477
320I5477R4430l1000j35743j50470o5626O1497J48992J36449L3728r0638j53587
$$ 95477 189907 158907 23164 -127306 -192932 -131435 17557 154006 187734 97096 -56491
331e6491j15035j664J11566J52424R2296k9703j31038j44524o3104N9001J42329
$$ -56491 -171526 -173190 -61624 90800 183096 153393 22355 -122169 -185273 -126272 16057
342A6057J31038L3258q6389j47090j11520k498J07026J47080Q9017k8162j25370
$$ 16057 147095 180353 93964 -53126 -164646 -167144 -60118 86962 175979 147817 22447
353B2447j39391o1122N6574J35711J26185L2892q1722j41516j08204k911J02643
$$ 22447 -116944 -178066 -121492 14219 140404 173296 91574 -49942 -158146 -161057 -58414
364e8414J40809Q6022k5753j20652j33801n9072N3440J29803J21610L2763p7208
$$ -58414 82395 168417 142664 22012 -111789 -170861 -117421 12382 133992 166755 89547
375H9547j36472j04654l569R8445J35065Q3187k4594j13925j28580n8832N0163
$$ 89547 -46925 -151579 -155148 -56703 78362 161549 136955 23030 -105550 -164382 -114219
386a14219J24819J17588L2998p5263j30589j00166m825R4322J30118P9719k1550
$$ -114219 10600 128188 161186 85923 -44666 -144832 -149657 -55335 74783 154502 132952
397A32952j10057j24838n5765M7773J19756J13096L1327p0428j26122r7565l243
$$ 132952 22895 -101943 -157708 -109935 9821 122917 154244 83816 -42306 -139871 -143114
408a43114Q9983J24212P7703k1010j05003j19578n6312M6694J16431J08252K9902
$$ -143114 -53131 71081 148784 127774 22771 -96807 -153119 -106425 10006 118258 148160
419A48160o8618j19785r2362p017Q7216J21838P3757j9964j01802j15624n1598
$$ 148160 79542 -40243 -132605 -139622 -52406 69432 143189 123225 21423 -94201 -145799
430a45799M4100J10512J05089K9157o5171j16572r1371k901Q3799J14513P3011
$$ -145799 -101699 8813 113902 143059 77888 -38684 -130055 -132956 -49157 65356 138367
441A38367j9891r7789j10373n2515M3921J08438R9014K8062o2406j11691q6903
$$ 138367 118476 20687 -89686 -142201 -98280 10158 109172 137234 74828 -36863 -123766
452a23766o363Q1337J14015O7539j8860r2948j07883m8333M0104J01767R9592
$$ -123766 -130129 -48792 65223 132762 113902 20954 -86929 -135262 -95158 6609 106201
463A06201K7504o1767j07747q4442l700P7044J06819O8947j7518r1612j02486
$$ 106201 133705 71938 -35809 -120251 -123951 -46907 59912 128859 111341 19729 -82757
474h2757m9155L9347J01263R1563K7706n6073j05307q1878n794P4371J06529O2973
$$ -82757 -131912 -92565 8698 100261 127967 71894 -33413 -115291 -121085 -46714 59815 122788
486A22788j6292q4957j01381m6638L6703R4329R3766K6930n7779r9008p8097o598
$$ 122788 106496 21539 -79842 -126480 -89777 4552 98318 125248 67469 -31539 -109636 -116234
498a16234P0226J00161O5669j4563q5674r5186m6320L4372R3182Q6139K7498n0458
$$ -116234 -46008 54153 119822 105259 19585 -75601 -121921 -87549 5633 91772 119270 68812
510F8812r8272p7394n451O7547R7651O0938j3854p7982r4926m5036L3753Q7728
$$ 68812 -29460 -106854 -112305 -44758 52893 113831 99977 21995 -72931 -117967 -84214 3514
522C514Q6657K5837n2516r0740p3618q283O5250R3518O1147j3067p8353q9370
$$ 3514 90171 116008 63492 -27248 -100866 -109149 -43899 49619 110766 97699 19346 -70024
534g0024m2824L1124Q5410Q1612K6100m6867r1831p1961m636O1948Q9911N8027
$$ -70024 -112848 -81724 3686 85298 111398 64531 -27300 -99261 -103897 -41949 47962 105989
546A05989j2661p3216q7031m2939L0828Q2196P9995K4436m7439q5155o9228p962
$$ 105989 93328 20112 -66919 -109858 -79030 3166 83161 107597 60158 -24997 -94225 -102187
558a02187O0947Q8046N5768j1791p2314q2905m0363K8246P8845P7268K4752m4441
$$ -102187 -41240 46806 102574 90783 18469 -64436 -104799 -76553 2292 79560 104312 59871
570E9871q5055o6866m707N7016Q3368N4978j0967o8475q0984m0505K8737P6585
$$ 59871 -25184 -92050 -96757 -39741 43627 98605 87638 19163 -61821 -102326 -73589 2996
582B996P3438K3422m2919p9570o4734p266N6259Q1172N1749j0472o5956p6838
$$ 2996 76434 99856 56937 -22633 -87367 -94633 -38374 42798 94547 84075 18119 -58719
594e8719l8383K5571P3295P1574K2838m1010p7669o1366n790N2053P7454N0960
$$ -58719 -97102 -71531 1764 73338 96176 55166 -22503 -83869 -89659 -37606 39848 90808
606I0808r520o3470p5168l6117K5819O9936O7367K2088l8401p3640o0605o072
$$ 90808 81288 17818 -57350 -93467 -67648 2288 69655 91743 53342 -20298 -80903 -86975
618h6975N1385P4644M7790r995n9794p0789l5618K3442O7608O5639K0879l7975
$$ -86975 -35590 39054 86844 76849 17055 -53734 -89352 -65910 1698 67337 88216 50241
630E0241p0384n6400o523M8491P1470M6710q944n8558o8629l2980K3041O4090
$$ 50241 -20143 -76543 -83066 -34575 36895 83605 74661 16103 -52526 -85506 -62465 1625
642A625O2516K0315l5544o8054n5230n404M7504O8057M4345r237n5081o5207l3460
$$ 1625 64141 84456 48912 -19142 -74372 -79776 -32272 35785 80130 70893 15812 -49395 -82855
655h2855K2482O2438O0178J9021l4749o5479n2091n739M4942O6604M2777q881
$$ -82855 -60373 2065 62243 81264 46515 -18964 -71055 -76794 -31852 34752 77529 68648
667F8648n3672o3459l0761K1381N9475N8406J8581l3829o3055n0741m759M3975
$$ 68648 14976 -48483 -79244 -57863 1612 60018 78599 44770 -18285 -69026 -73785 -29810
679b9810O2891M1524q440n1853o0695l0648K1320N8123N5471J7507l2169o0889
$$ -29810 33081 74605 66165 14312 -46383 -77031 -55711 2412 57883 75390 43221 -17668
691a7668m8292n239M2143O1330L9344q148m9906n8603k8598J9905N5501N4391
$$ -17668 -65960 -71199 -29056 32274 71618 63470 13564 -45039 -73637 -53732 1769 56160
703E6160J6440l1110n8274m7173m461M0657N8640L8226p333m8644n6356k8237
$$ 56160 72600 41490 -16784 -63957 -68418 -27761 30879 69105 61772 13128 -43228 -71465
715g1465J9779N3654N1494J6323k9249n6725m5244m811L9043N7223L6912p680
$$ -71465 -51686 1968 53462 69785 40536 -16189 -61433 -66244 -27201 30022 66934 59254
727E9254m6568n4546k7094J8697N1517N0452J6203k9028n4274m4040m559L7994
$$ 59254 12686 -41860 -68954 -50257 1260 51712 67915 38887 -15387 -59427 -63986 -25992
739b5992N4572L5839p135m4607n2899k6064J7402N0176M8794J5399k7670n2986
$$ -25992 28580 64419 57284 12677 -40222 -66286 -48884 1292 50086 65485 37815 -15171
751a5171m2377m370L6277N3033L4846o903m3157n1262k4917J7142M8193M7065
$$ -15171 -57548 -61918 -25641 27392 62238 55335 12178 -39084 -64001 -46859 1334 48399
763D8399J4838k6836n0592m1191m133L5444N0811L3349o514m1759m9378k4263
$$ 48399 63237 36401 -14191 -55382 -59515 -24071 26740 60089 53575 11816 -37562 -61825
775f1825J6667M6607M5261J4170k5869m9246l8974m104L3614M9769L1859o713
$$ -61825 -45158 1449 46710 60880 35011 -14235 -53209 -57313 -23699 26070 57929 51216
787E1216m0287m7510k2750J5929M5076M3061J3367k4726m7116l7618l410L2658
$$ 51216 10929 -36581 -59331 -43402 1674 44735 58102 33376 -13740 -51358 -54768 -22110
799b2110M7099L0591o723l8970m5187k1545J5633M3076M1442J2596k4214m5291
$$ -22110 24989 55580 48857 9887 -35300 -56845 -41212 1864 43306 55902 31688 -13603
811a3603l5787l029L1515M5348K8822o556l7694m2908k0585J5576M0707M0049
$$ -13603 -49390 -52419 -20904 24444 53266 46710 9016 -33892 -54477 -38901 1806 41855
823D1855J1694k3827m3479l3909k315L0287M3680K7022o549l5858m1500j9358
$$ 41855 53549 29722 -13757 -47666 -49981 -19694 23986 51008 44459 8601 -32899 -52257
835e2257J4822L9907L7733J1027k2626m1534l2920k313K9270M1646K6293o048
$$ -52257 -37435 2472 40205 51232 28606 -12928 -45848 -48161 -18891 22755 49048 43000
847D3000l4433m0191j8763J4095L8403L6646J0549k1722l9782l1983k576K8299
$$ 43000 8567 -31624 -50387 -36292 2111 38757 49306 27584 -12198 -44181 -46757 -18458
859a8458M0014K5856n386l3618l8706j8538J3653L6776L5415J1100k0772l8722
$$ -18458 21556 47412 42026 8408 -30298 -48836 -35183 1593 37008 48108 27336 -11386
871a1386l0965l190K7237L9123K5083n105l1970l7936j8205J2890L5567L4396
$$ -11386 -42351 -45541 -18304 20819 45902 40797 8827 -29109 -47314 -34424 1143 35539
883C5539J0768j9150l7767l0812k542K5500L8278K4521m596l0862l6505j8460
$$ 35539 46307 27157 -10610 -41422 -43964 -18464 19814 44335 39739 8877 -27628 -46088
895d6088J2560L4192L3677J1077j9322l6189k9505l367K5303L6687K3810m352
$$ -46088 -33528 664 34341 45418 26096 -10093 -39598 -42965 -17662 19025 42835 38483
907C8483k9792l5224j8048J1558L3640L3089J0228j8484l5321k8442l421K4456
$$ 38483 8691 -26533 -44581 -33023 617 33706 43934 25450 -9871 -38313 -41734 -17278
919a7278L5702K3344m762k8410l4460j7374J1654L2460L1469J0052j7840l3755
$$ -17278 18424 41768 37006 8596 -25864 -43238 -31584 876 32345 42397 24557 -9198
931i198k8043k782K3533L4379K2336m527k7652l3319j5970J0902L1307L0089R820
$$ -9198 -37241 -40023 -16490 17889 40225 35698 8046 -25273 -41243 -30341 966 31055 40875
944D0875j7547l2638k6537k438K2285L3289K1337m166k6823l1824j5543J0788
$$ 40875 23328 -9310 -35847 -38285 -16000 17289 38626 34460 7637 -24187 -39730 -28942
956b8942L0135K8771R029j6756l1328k5066k666K1749L1859K0248m508k5274l0087
$$ -28942 1193 29964 38993 22237 -9091 -34157 -36823 -15074 16785 37033 32525 7251 -22836
969b2836j5332J0341K8957K7359Q703j5830l0120k3802k402K0166L0512J9570
$$ -22836 -38168 -27827 1130 28489 37192 21362 -8758 -32560 -34962 -14796 15716 35286
981C5286m154k4291k8880j3988R790K6886K6605Q391j5328k8802k2726k387J9905
$$ 35286 31132 6841 -22039 -36027 -26237 649 27254 35645 20317 -8485 -31211 -33598 -13693
994a3693K8746J8360l511k3356k7741j3322R298K5965K4916Q471j4345k7503k2005
$$ -13693 15053 33413 29902 6546 -21195 -34517 -25219 746 25662 34133 19788 -7715 -29720
1007b9720k342J9213K7273J7875l536k2690k6312j2711Q723K4710K4457P800j3996
$$ -29720 -32062 -12849 14424 32299 28763 6073 -20239 -32950 -24227 483 24940 32740 18744
1020A8744k6105k1574j749J8060K6332J7045l023k1441k5589j2517Q506K3873
$$ 18744 -7361 -28935 -30684 -12624 13708 30753 27730 6289 -19300 -31817 -23311 562
1032E62K3378P608j3081k5430k0730k150J7430K5333J6867k856k0727k4641j2421
$$ 562 23940 31548 18467 -6963 -27693 -29843 -12413 12920 29787 26931 6204 -18437 -30858
1045c0858Q175K3128K2309P735j2816k4183j9625k573J6207K4789J6643k650k0032
$$ -30858 -22683 445 22754 30489 17673 -6510 -26135 -28708 -12501 12288 28931 26281 6249
1058F249k4004j1999P531K1753K2195P682j1560k3538j9927k547J5921K3922J5807
$$ 6249 -17755 -29754 -22223 -470 21725 29407 17847 -5691 -25618 -28165 -12244 11678 27485
1071B7485k088j8768k3181j1949O699K1331K1468P277j1104k2302j9150k633J4903
$$ 27485 25397 6629 -16552 -28501 -21802 -471 20997 28274 17170 -5132 -24282 -26915 -12012
1084a2012K3185J5404k238j8163k1821j1641O784J9909K0408P304j0727k1658
$$ -12012 11173 26577 24339 6176 -15645 -27286 -20502 -593 19815 27119 16392 -5266
1096e266j7889k462J4436K1476J4473j717j6878k1243j1092O442J9517J9038O376
$$ -5266 -23155 -25617 -11181 10295 24768 23051 6173 -15070 -26162 -19720 -203 18835 25211
1109B5211r919k0649j6510k415J3704K0801J3454k204j6411j9478j0113O433J8140
$$ 25211 15292 -5357 -21867 -24282 -10578 10223 23677 21473 5062 -14416 -24529 -18096 44
1122D4J8050N978j0238j8880j5541k233J3403J9215J2771k294j5476j8790q993
$$ 44 18094 24072 13834 -5046 -20587 -22820 -9417 9798 22569 20275 4799 -13991 -22984
1135b2984N968J7316J6819N391r414j7794j5204j481J2404J8291J2073k348j4509
$$ -22984 -17016 300 17119 22510 13096 -4698 -19902 -21383 -8979 9312 21385 19037 4528
1148D528j7530q942N670J6242J6460N170r004j7228j4007j732J1615J7473J1387
$$ 4528 -13002 -21944 -16274 -32 16428 21598 12594 -4634 -18641 -20373 -8758 8715 20102
1161B0102j879j3925j6700q517N377J5517J5604N192q399j6813j3223j829J1026
$$ 20102 18223 4298 -12402 -20919 -15542 -25 15579 20771 12372 -4441 -17664 -19493 -8467
1174h467J6765J1128j938j3051j5919q574N005J4647J5167N112q060j5790j2956
$$ -8467 8298 19426 17488 4437 -11482 -20056 -15051 -404 14763 19875 11815 -3975 -16931
1187a6931j884J0710J5834J0952k005j2492j5282q010M591J4160J4046N118p358
$$ -16931 -18815 -8105 7729 18681 16676 4184 -11098 -19108 -14517 -357 13689 18807 11449
1200A1449j4885j2236k264J0019J5070J0240j344j1973j4389p584M180J3397J3220
$$ 11449 -3436 -15672 -17936 -7917 7153 17393 16049 4076 -10313 -17897 -13717 -320 12900
1213A2900M886o851j4130j1955j660R233J4453R400j189j1084j3942o935L663
$$ 12900 17786 10935 -3195 -15150 -16810 -7577 6876 16276 15087 4003 -9939 -16874 -13211
1226a3211J2818J2510M727o858j3170j0805j862Q759J3152R393j308j0443j3037
$$ -13211 -393 12117 16844 9986 -3184 -13989 -15851 -7092 6060 15453 14145 3702 -9335
1239i335o669L767J1763J1842L977n717j2434j0371j555Q199J2258Q672r02r848
$$ -9335 -16004 -12237 -474 11368 15345 9628 -2806 -13177 -14732 -6533 5725 14397 13495 3647
1253C647j2138o197L271J0804J1115M493n965j1598r836j730P725J1594Q204q04
$$ 3647 -8491 -14688 -11417 -613 10502 14995 9030 -2568 -12404 -14134 -6409 5185 13389 12585
1267A2585q777j1680o327L157J0406J0566L893n067j1076r316j632P030J1135
$$ 12585 3808 -7872 -14199 -11042 -636 9930 13823 8756 -2320 -11636 -13268 -6238 4897
1280D897P772m40q930j0364n971K747R734R662M071n041j0132q905j469O650J0481
$$ 4897 12669 12229 3299 -7065 -13036 -10289 -555 9107 13178 8137 -1995 -10900 -12369 -5719 4762
1295D762P093o60p801j0298n679K566R417R392L373m389r567q547j346N907J0222
$$ 4762 11855 11195 3394 -6904 -12583 -10017 -600 8792 12165 7776 -1791 -10338 -11684 -5777 4445
1310D445O970q17p438r509n308K481Q757Q580L122l713r157q050j163N341R218
$$ 4445 11415 10598 3160 -6349 -11657 -9176 -419 8161 11283 7570 -1587 -9637 -10800 -5459 3759
$$ [...]
8191a04
##END NTUPLES=NMR FID
##END=
