##TITLE=1H_AM_PROPCARBON
 CDCl3
 8 sc, 
 17.5.2023
##JCAMPDX= 6.0         $$ Bruker NMR JCAMP-DX V2.0
##DATA TYPE= NMR FID
##DATA CLASS= NTUPLES
##ORIGIN= UXNMR, Bruker Analytische Messtechnik GmbH
##OWNER= root
$$ XWIN-NMR		Version 3.5
$$ Wed May 17 14:58:50 2023 Russian Standard Time (UT+4h)  she@DPX200
##.OBSERVE FREQUENCY= 200.13135
##.OBSERVE NUCLEUS= ^1H
##.DELAY= (6, 6)
##.ACQUISITION MODE= SIMULTANEOUS
##.ACQUISITION SCHEME= undefined
##.AVERAGES= 8
##.DIGITISER RES= 18
##SPECTROMETER/DATA SYSTEM= spect
##.PULSE SEQUENCE= zg30
##.SOLVENT NAME= CDCl3
##.SHIFT REFERENCE= (INTERNAL, CDCl3, 0, 15.7039)
##AUDIT TRAIL= $$ (NUMBER, WHEN, WHO, WHERE, WHAT)
$$ ##TITLE= Audit trail, XWIN-NMR		Version 3.5
$$ ##JCAMPDX= 5.01
$$ ##ORIGIN= Bruker BioSpin GmbH
$$ ##OWNER= she
$$ F:/spectra/data/she/nmr/H-F/1/audita.txt
$$ ##AUDIT TRAIL=  $$ (NUMBER, WHEN, WHO, WHERE, WHAT)
(   1,<2023-05-17 14:57:41.50 +0400>,<she>,<DPX200>,
      <created by zg, POWCHK disabled, PULCHK disabled
       configuration hash MD5:
       00 E9 B6 7A A2 85 ED C7 34 08 36 98 17 FE 4E 26
       data hash MD5: 16K
       6D A0 52 EC 8B C2 CE BA 6B 89 90 BD 1C AD D2 E9>)
$$ ##END=
$$ 
$$ hash MD5
$$ 90 DC F2 EC 81 24 42 0E 90 9F 69 FB 32 DE 4C 0A
##$RELAX= 
##$RELAX= 
##$RELAX= 
##$RELAX= 
##$RELAX= 
##$RELAX= 
$$ Bruker specific parameters
$$ --------------------------
##$DU= <F:/spectra>
##$EXPNO= 1
##$NAME= <H-F>
##$PROCNO= 1
##$TYPE= <nmr>
##$USER= <she>
##$AMP= (0..31)
100 100 100 100 100 100 100 100 100 100 100 100 100 100 100 100 100 100 
100 100 100 100 100 100 100 100 100 100 100 100 100 100 
##$AQSEQ= 0
##$AQ_mod= 1
##$AUNM= <au_zg>
##$AUTOPOS= <>
##$BF1= 200.13
##$BF2= 200.13
##$BF3= 200.13
##$BF4= 200.13
##$BF5= 200.13
##$BF6= 200.13
##$BF7= 200.13
##$BF8= 200.13
##$BYTORDA= 1
##$CFDGTYP= 0
##$CFRGTYP= 5
##$CHEMSTR= <none>
##$CNST= (0..31)
1 1 145 1 1 1 1 1 1 1 1 1 1 1 1 1 1 1 1 1 1 1 1 1 1 1 1 1 1 1 1 1 
##$CPDPRG= <>
##$CPDPRG1= <>
##$CPDPRG2= <>
##$CPDPRG3= <>
##$CPDPRG4= <mlev>
##$CPDPRG5= <mlev>
##$CPDPRG6= <mlev>
##$CPDPRG7= <mlev>
##$CPDPRG8= <mlev>
##$CPDPRGB= <>
##$CPDPRGT= <>
##$D= (0..31)
0 1.2 0 0 0 0 0 0 0 0.06 0 0.03 0 0 0 0 0.0002 0 0 0 0 0 0 0 0 0 0 0 0 
0 0 0 
##$DATE= 1684321060
##$DBL= (0..7)
120 120 120 120 120 120 120 120 
##$DBP= (0..7)
150 150 150 150 150 150 150 150 
##$DBP07= 0
##$DBPNAM0= <>
##$DBPNAM1= <>
##$DBPNAM2= <>
##$DBPNAM3= <>
##$DBPNAM4= <>
##$DBPNAM5= <>
##$DBPNAM6= <>
##$DBPNAM7= <>
##$DBPOAL= (0..7)
0.5 0.5 0.5 0.5 0.5 0.5 0.5 0.5 
##$DBPOFFS= (0..7)
0 0 0 0 0 0 0 0 
##$DE= 6
##$DECBNUC= <off>
##$DECIM= 32
##$DECNUC= <off>
##$DECSTAT= 4
##$DIGMOD= 1
##$DIGTYP= 9
##$DL= (0..7)
0 120 120 120 120 120 120 120 
##$DP= (0..7)
150 150 150 150 150 150 150 150 
##$DP07= 0
##$DPNAME0= <>
##$DPNAME1= <>
##$DPNAME2= <>
##$DPNAME3= <>
##$DPNAME4= <>
##$DPNAME5= <>
##$DPNAME6= <>
##$DPNAME7= <>
##$DPOAL= (0..7)
0.5 0.5 0.5 0.5 0.5 0.5 0.5 0.5 
##$DPOFFS= (0..7)
0 0 0 0 0 0 0 0 
##$DQDMODE= 0
##$DR= 18
##$DS= 0
##$DSLIST= <SSSSSSSSSSSSSSS>
$$ [...]
##$SUBNAM2= <"">
##$SUBNAM3= <"">
##$SUBNAM4= <"">
##$SUBNAM5= <"">
##$SUBNAM6= <"">
##$SUBNAM7= <"">
##$SUBNAM8= <"">
##$SUBNAM9= <"">
##$SW= 18.05172834244
##$SWIBOX= (0..15)
0 0 2 0 0 0 0 0 0 0 0 0 0 0 0 0 
##$SW_h= 3612.71676300578
##$TD= 16384
##$TD0= 1
##$TE= 0
##$TE2= 300
##$TE3= 300
##$TEG= 300
##$TL= (0..7)
0 120 120 120 120 120 120 120 
##$TP= (0..7)
150 150 150 150 150 150 150 150 
##$TP07= 0
##$TPNAME0= <>
##$TPNAME1= <>
##$TPNAME2= <>
##$TPNAME3= <>
##$TPNAME4= <>
##$TPNAME5= <>
##$TPNAME6= <>
##$TPNAME7= <>
##$TPOAL= (0..7)
0.5 0.5 0.5 0.5 0.5 0.5 0.5 0.5 
##$TPOFFS= (0..7)
0 0 0 0 0 0 0 0 
##$TUNHIN= 0
##$TUNHOUT= 0
##$TUNXOUT= 0
##$USERA1= <user>
##$USERA2= <user>
##$USERA3= <user>
##$USERA4= <user>
##$USERA5= <user>
##$V9= 5
##$VALIST= <valist>
##$VCLIST= <CCCCCCCCCCCCCCC>
##$VD= 0
##$VDLIST= <DDDDDDDDDDDDDDD>
##$VPLIST= <PPPPPPPPPPPPPPP>
##$VTLIST= <TTTTTTTTTTTTTTT>
##$WBST= 1024
##$WBSW= 4
##$XGAIN= (0..3)
0 0 0 0 
##$XL= 0
##$YL= 0
##$YMAX_a= 844817
##$YMIN_a= -810217
##$ZGOPTNS= <>
##$ZL1= 120
##$ZL2= 120
##$ZL3= 120
##$ZL4= 120
##$ABSF1= 10
##$ABSF2= 0
##$ABSG= 5
##$ABSL= 3
##$ALPHA= 0
##$AQORDER= 0
##$ASSFAC= 0
##$ASSFACI= 0
##$ASSFACX= 0
##$ASSWID= 0
##$AUNMP= <proc_1d>
##$AZFE= 0.1
##$AZFW= 0.1
##$BCFW= 1
##$BC_mod= 2
##$BYTORDP= 1
##$COROFFS= 0
##$CY= 11.3945322036743
##$DATMOD= 1
##$DC= 2
##$DFILT= <>
##$DTYPP= 0
##$F1P= 15.7292609196834
##$F2P= 12.9074282941183
##$FCOR= 0.5
##$FTSIZE= 0
##$FT_mod= 4
##$GAMMA= 1
##$GB= 0.15
##$INTBC= 1
##$INTSCL= 1
##$ISEN= 128
##$LB= 0.24
##$LEV0= 0
##$LPBIN= 0
##$MAXI= 10000
##$MC2= 0
##$MEAN= 0
##$ME_mod= 0
##$MI= 1.114404
##$NCOEF= 0
##$NC_proc= 0
##$NLEV= 6
##$NOISF1= 3.799351
##$NOISF2= 2.8
##$NSP= 1
##$NTH_PI= 0
##$NZP= 0
##$OFFSET= 15.70392
##$PC= 1
##$PHC0= -19900.68
##$PHC1= 11.45272
##$PH_mod= 1
##$PKNL= yes
##$PPARMOD= 0
##$PSCAL= 0
##$PSIGN= 0
##$REVERSE= no
##$SF= 200.130013532006
##$SI= 16384
##$SIGF1= 3
##$SIGF2= 2
##$SINO= 400
##$SIOLD= 16384
##$SREGLST= <1H.CDCl3>
##$SSB= 0
##$STSI= 0
##$STSR= 0
##$SW_p= 3612.71676300578
##$SYMM= 0
##$S_DEV= 0
##$TDeff= 0
##$TDoff= 0
##$TI= <>
##$TILT= no
##$TM1= 0
##$TM2= 0
##$TOPLEV= 0
##$USERP1= <user>
##$USERP2= <user>
##$USERP3= <user>
##$USERP4= <user>
##$USERP5= <user>
##$WDW= 1
##$XDIM= 8192
##$YMAX_p= 0
##$YMIN_p= 0
$$ End of Bruker specific parameters
$$ ---------------------------------
##NTUPLES= NMR FID
##VAR_NAME=  TIME,          FID/REAL,        FID/IMAG
##SYMBOL=    X,             R,               I
##VAR_TYPE=  INDEPENDENT,   DEPENDENT,       DEPENDENT
##VAR_FORM=  AFFN,          ASDF,            ASDF
##VAR_DIM=   8192,          8192,            8192
##UNITS=     SECONDS,       ARBITRARY UNITS, ARBITRARY UNITS
##FACTOR=    0.0002768,     1,               1
##FIRST=     0,             0,               0
##LAST=      2.2672688,     0,               0
##MIN=       0,             -810217,         0
##MAX=       2.2672688,     844817,          0
$$ Real data points
##PAGE= N=1
##DATA TABLE= (X++(R..R)), XYDATA
0@%%%%%%%%%%%%%%%%Qj0KmJ2j6J6j6J6j9K3k4K4k7L3l8L9l8M2m8N0n3N8o4O9p2
42c7P6q2R0r7J04j11J21j35J49j65J83k06K37k72L16l75M54n61P06r10J207j665
64i73K405l676O108j1595K8223j57656o73053N73774K96207m74834N88215O71672
76H44817p75217m76499O12837j94969n91175O03217M00265o99193P8596P42212
86E44891l89406n05049N27741m8022p30562M01904P05827m59119k17649N53396
96C83952l31601o50957N82102M69781n93040k2004N03642m80329l97491P60357
106B24412K56360o14523J31405K99767o61918j82341P94738M2198m55996L95519
116B29621J65060p24546j1883N96448l08754l37141N93102J12680n32988K86449
$$ y = [0, 0, 0, 0, 0, 0, 0, 0, 0, 0, 0, 0, 0, 0, 0, 0, 0, 8, -2, 0, -4, 8, -8, 8, -8, 8, -11, 12, -12, 12, -15, 18, -20, 19, -19, 23, -25, 25, -28, 30, -34, 35, -37, 39, -43, 47, -50, 54, -57, 64, -71, 78, -87, 96, -110, 127, -145, 171, -204, 250, -311, 395, -515, 692, -973, 1432, -2244, 3864, -7731, 20492, -137164, -810217, -236443, 59764, -415070, 173145, 844817, 69600, -406899, 205938, 10969, -580206, 23011, 423276, -275917, -197321, 544891, 155485, -349564, 178177, 130155, -600407, -198503, 507324, 48205, -169444, 383952, 52351, -598606, -16504, 453277, -139763, -161767, 341875, -138454, -535945, 224412, 480772, -133751, -2346, 297421, -364497, -546838, 247900, 290098, -165898, 229621, 394681, -329865, -341748, 254700, -54054, -391195, 201907, 314587, -218401, 68048]
126F8048L92862o30725l08961N33762o2391l08081N93007L10985o73490j72727
136b57711L63712l25385k08724O67523J71560n38461J02933K80987m57343j14774
146c15683N54879r2646m34430L24580K23784m36461O4857M33811l26295l36460
156c40064M22294Q9114l95227K30782L17593m44598j71221M69575n3345l32575
166b07672L16872J41411n04546J953M55500j50471j89489L78343l5694n01820
176b95613J25971L29683k51682l2533M11118j42618l82354K41833J56172l51413
186a91436O0756L51257k20618k00665L56712L2959l68273J18555K16542l01263
196a45474n4326M00183m7687k89063J88206Q5982l41667M6957L45819j36412j78421
$$ y = [68048, 460910, -169815, -478776, 54986, -7405, -315486, 277521, 588506, -84984, -257711, 106001, -219384, -428108, 239415, 410975, -127486, -24553, 256434, -200909, -315683, 239196, 146550, -287880, 36700, 260484, -175977, -111120, 322691, -3604, -340064, 82230, 171344, -223883, 6899, 324492, -120106, -291327, 178248, 124903, -207672, 109200, 250611, -253935, -251982, 203518, 53047, -136442, 241901, 206207, -295613, -169642, 160041, -91641, -124174, 286944, 144326, -238028, 3805, 159977, -191436, -130680, 220577, -41, -200706, 156006, 188965, -179308, -60753, 155789, -145474, -199800, 200383, 152696, -136367, 51839, 137821, -203846, -156889, 188930, 52518, -125903]
207a25903K48084j2938l11133J39754K41511k21407p3653K63125j01344k36750
217a90654K21093J28801k66740K6897K37452j73864j46330K61211J7496k63417
227a48055J11548J81204k09958m6519K56790p9769k19901J64579R8281k13624
237a05424M8095K18180j45262j43441J86337N761j93586J18080J53174j80139
247c8225n2378J87388p0813j54409J58064P6742j89302K6744J66766j18594r8660
258a06677J71800M992j73416Q3272J22784j42206l5959J62034n2664j33304J17353
269A8009O3327j44767K3100J31296r4289p8570J31213K048j28342P0903Q7785
280H1713j18648k3369J26645m6564r7599J00246M2009j21479K1357J04210p6535
$$ y = [-125903, 122181, 109243, -201890, -62136, 179375, -42032, -115685, 147440, 46096, -190654, 30439, 159240, -107500, -80603, 156849, -17015, -163345, 97866, 115362, -148055, -36507, 144697, -65261, -111780, 145010, 65241, -154660, 9919, 108200, -105424, -57329, 160851, 15589, -127852, 58485, 64246, -129340, -11260, 141914, -38225, -90603, 96785, 25972, -128437, 29627, 106369, -82933, -56189, 110577, -8017, -106677, 65123, 70115, -103301, -20029, 102755, -39451, -75410, 86624, 33960, -99344, 18009, 81336, -63431, -40331, 90965, -3324, -81894, 49319, 51367, -76975, -6072, 81713, -36935, -60304, 66341, 19777, -77822, 22424, 64433, -57046, -35689, 68521, -8014]
291h014n8133J08217K009j04451N1243O8927q7799j8363R7266k9348p3705O6880
303A4729K9898q3462J5327P2461n1275l8795P1025l060o8607L8475M3878o1665
315b1071r745O4378k4352m7205M9173J9514n8065R955M7192l4600k5702M8111
327A7583L041m2101J9812K5583l6332r342L6693n875k0974K3809O586l1662J04
340a3075K0201j0499l711K2778k199k2158L006O720j0735K563J5369k495q933
353c168L956K724o250l524O18J656J982M429R961L554j6520j5884M235M408K637
368e186K4031J5213k6737k4261M756n115k412L6776K0806l0592j5485Q330k0520
381b0396q504M0755J1205l0481R217J8681l2212q901L4124j5883l2630L9201L0966
$$ y = [-8014, -66147, 42070, 44079, -60372, -9129, 59798, -28001, -46364, 50902, 21554, -52151, 14729, 44627, -38835, -23508, 48953, -2322, -41117, 29908, 26848, -41759, -3284, 40594, -21071, -30816, 33562, 9210, -37995, 11178, 30692, -27373, -17418, 29774, -4826, -30528, 17583, 20624, -21477, -1665, 23918, -12414, -21756, 14937, 9062, -11912, 11897, 18483, -13179, -13075, 7126, -3373, -7084, 15694, 13495, -8663, -5657, 1063, -9672, -7109, 8260, 5765, -3168, 788, 3512, -2738, -6262, -5644, -3988, -2006, 2423, 12384, 15938, -582, -16466, -12231, -7823, -5186, 18845, 34058, 7321, -16940, -12184, -17299, -19711, 17065, 37871, 7279, -8206, 124, -20396, -28900, 11855, 23060, -7421, 1796, 20477, -11735, -20636, 13488, -2395, -35025, 4176, 35142]
394C5142l2364K586K3083n2680l8033N9675L4041k3488K6763J4236q2817l7221
406g1077O3739J7281j4520N4099Q893r1435j9122N6054j7363j3288P0036J03p6505
419c3105K0088M6284n5234j7332O4870k0672m8452P0178M1222p9220j8231L9568
431I964n3285j9798J12914L5920q0494n215Q053q8677J387J29052K0402o1262
443H961K6017j3125j08971J6210J10405j6592l6804O5966j6025r7857L8370O7599
455D4154p3359k4156R0838j2648n5707P7199K3981j24845k1174Q2894k3676n419
467b1918J18541o016j42704q144N2213n1288L1578J36090l1651j22672K3704K0180
479b087p5401N3010J19879o0661q1164O3943n043q4574O3413P7128q8272k7403
$$ y = [35142, 2778, 5364, 28447, -24233, -62266, -2591, 31450, 7962, 34725, 48961, -33856, -71077, -7338, 9943, -4577, 49522, 58415, -33020, -52142, 3912, -13451, -26739, 43297, 43400, -33105, -13017, 33267, -21967, -39299, 25571, 4899, -43553, 26625, 67847, -11373, -29604, 9964, -43321, -63119, 49795, 85715, 5221, 6, 8059, -80618, -79231, 49821, 70223, 8961, 34978, 21853, -87118, -70908, 39497, 22905, -13899, 52067, 36042, -61815, -23445, 44154, -29205, -53361, 37477, 24829, -30878, 46321, 70302, -54543, -75717, 7177, -16499, -21918, 96623, 90607, -52097, -60241, -8028, -59316, -27738, 108352, 76701, -45971, -22267, -2087, -77488, -24478, 95401, 34740, -46424, 17519, 12476, -72098, -8685, 68443, -19829, -47232]
491d7232J01911k0687p8480O1249J4257j15138K4899J30391k1222m5956O0913
502F4905n4435j42411N2428J24779k1326J0774Q0458r2499j42907N9424P0672
513I862m9255N2636R8759q9863q8225Q1507N107r4063N3949P3640q4459n902J22545
526H6238l0349j06423M3746J4199r7294N2658J37758m7992p8320N2005l2403r7743
538a03920Q6514J12101p4569m5539N8119o0372p2368J16437P6913r0424j1382
549h490M9961q9839n0144J22742L3465q3101M2368N4055r8372k6692R4214m0439
561b72q6702Q3771O3244o6364L2053P3919j09664j02879P6054K9724l8123J01381
573E6142P9647j21198p6667N5577l7230m7120J17851O1397r7367k661O7857p0771
$$ y = [-47232, 54679, 33992, -44488, 16761, 31018, -84120, -59221, 71170, 49948, 3992, 64905, 10470, -131941, -79513, 45266, 23940, 34714, 115172, 22673, -120234, -60810, 9862, -39393, 13243, 112002, 22139, -66086, 15421, 20528, -73535, -19586, 54054, -30405, -36307, 86238, 55889, -50534, -6788, 7411, -89883, -37225, 100533, 52541, -25779, 26226, -6177, -103920, -17406, 94695, 20126, -25413, 32706, -27666, -100034, 16403, 93316, 2892, -8490, 41471, -48368, -98512, 24230, 57695, -25406, 16962, 71017, -27355, -54047, 40167, -272, -86974, -3203, 60041, -6323, 25730, 99649, -10015, -112894, -36840, -7116, -45239, 56142, 135789, 14591, -62076, -6499, -43729, -90849, 27002, 88399, -8968, -11629, 56228, -14543]
585a4543n0380R1084k694r3182N4435P9656o4416j2787P7335n7396r1483P1898
597a2473N2139o6959K3877P0858p5584n6406R0772J7114p5867L5233L7791r4281
609e3786j5115J09351J551n3877N5359J548j14755K443R0017k7507k1168Q8506
621F2567o299r6085K8075M8009p7352j5950Q7424j6181m7823P8098K9396r8020
633b4141j3525N0238n4415k1576J05892K1969p4955K0667K6931q3878j3922Q8370
645B7655j1392n1644N7413K2797p4802J1868O3647n1068m4405O3055M424n7215
657c9667M6217N2128o4179k3955N6971k6949n1259N8536L0404o3137J0598N8764
669D4472m1948l6288N7373n052o7452L1723N0797m4484m432O2628k9410o1771
$$ y = [-14543, -64923, 26161, 23467, -69715, -15280, 64376, -40, -12827, 64508, 7112, -84371, -12473, 39666, -27293, -3416, 67442, -8142, -64548, 26224, 43338, -32529, 2704, 40495, -53786, -68901, 40450, 42001, -11876, 43483, 45031, -69724, -67281, 22736, -4771, -25939, 62567, 56268, -39817, -11742, 36267, -41085, -57035, 30389, 14208, -33615, 44483, 73879, -24141, -37666, 12572, -41843, -63419, 42473, 64442, -10513, 10154, 37085, -46793, -60715, 27655, 16263, -35381, 22032, 44829, -29973, -18105, 45542, -5526, -49931, 13124, 17548, -39667, 6550, 58678, -5501, -29456, 27515, 566, -50693, 7843, 38247, -24890, -14292, 44472, 2524, -33764, 23609, 18557, -48895, -17172, 33625, -10859, -15291, 47337, 17927, -43844]
681d3844L9137K1964n2785K0233O1281l7113l5151M9918m660n8634K9599M0890
693C0835m6956p408N8528j7947m5341L8717J5588n6460Q355N0150k9620k4560
705b6119M9962M93n2265K0825L2258m2755r226N0755j2590l7340L5821J7619m7597
718b0159M484M0501k8443k4458M3928M379m1052K1379K8859m0477j2724M1330
730A7547j2006l1373L5238J8065m2386J686L3863k6044k1009M0356M163l7902
742a9802J6432K5147l2948p981L7864j0697l0196K6439J4443l3502N792L1400
754B2391k2305k0880L0760K977k9589J6382K2528k9740r838L0593p464k2993K3691
767F513J1688l1547R77K6622j5552j4542K6694J584k8704J0917J9976k0834n810
$$ y = [-43844, -4707, 17257, -35528, -15295, 45986, 8873, -26278, 23640, 18980, -39654, -10055, 30835, -16121, -23529, 34999, 17052, -28289, 10428, 26016, -30444, -22089, 28061, -1559, -26119, 23843, 24336, -27929, -7104, 25154, -17601, -26827, 23928, 11338, -26002, 9819, 27438, -20159, -15675, 24826, -3617, -28075, 15853, 20232, -20820, 559, 29418, -11059, -23783, 17547, 5541, -25832, 9406, 27471, -14915, -13229, 20634, -5410, -26419, 13937, 18100, -19802, -3370, 21777, -11171, -19152, 18712, 8015, -22181, 4258, 18701, -14801, -9009, 22391, 86, -20794, 9966, 12943, -16646, -264, 22264, -7476, -17314, 13279, 5815, -17178, 6513, 18201, -13346, -12369, 14253, -1299, -15841, 10853, 12437, -16267, -5350, 14626, -6208, -12018]
780a2018K5772q099k2220J8802J1909k2696K690K1018j6212j4667K3111L729k1112
793i993J0203J4407k1275o732K2505l936j6443J5587Q192k1983L05J8437j0655
806a381j0727J8615K851j8595P068J2545j5456n684J7666k578j2657J2669P249
819A1585j7247j028J3537q304p634J5980L277j4722L546Q535j3654m713J5826
832D984Q4r542R185M425j6016l110J1617l898l335J3829K017j4294p17N830q464
847g405K26J4734R27r418L602J195j1372L80J1131k287l708Q964O78j1117N0M014
863E94p258n91J2259L134n814J141k431j2033j096J2012M751O31M327m892j3707
878h973j967P013K932M725P514l900j0321j536J547j863L568P183j057l570K337
$$ y = [-12018, 13754, 5655, -16565, 2237, 14146, -8550, -5860, 15158, -1054, -15721, 7390, 11119, -9993, 210, 14617, -6658, -13390, 9115, 5179, -11264, 4323, 12515, -9468, -9163, 9274, -1381, -12108, 6507, 9358, -9237, -2169, 10376, -5080, -10764, 6902, 4324, -8333, 4336, 11585, -5662, -6690, 6847, -1457, -9091, 6889, 10166, -4556, -1010, 7525, -6129, -10842, 4984, 5068, -4474, 4711, 9136, -6880, -9990, 1627, -2271, -5606, 8223, 10240, -4054, -4771, 1059, -7405, -7179, 7555, 8482, -936, 2666, 3861, -7511, -7131, 4000, 1713, -1995, 6969, 7647, -3470, -3420, 594, -6664, -7255, 5004, 8138, 2324, 3465, 1034, -10999, -12095, -83, 4668, 5299, 9626, 4734, -8973, -10940, -3927, -995, 3730, 11244, 7344, -2977, -4513, -2966, -4829, -1261, 5922, 4865, 1295, 3632]
893C632j325o797j318K520J95L604Q322K82q065o488m152j561P184J2415M504
908A2952n063p951q640m806N783J1421O566k90m616p924n931J856N391L691K252
923D691O58k535k509r58j984k608R5L843N062L755j25n896q667n028K625R483
939i8R829L177n279j0600r353p44Q523J0704N655j448p170r195l637M113N903
954C80L847J833j493m000j723K21k221j275J494K826L174M125o35p797p411j204
970i859K877P977R933J801r102r631m888P3P541J2236L956o300p191n083l410
985i070M016Q896K619k483j110k380l803L85K553j885r31M755K763r61k21l464
1001c21q152j435P773O482L251J944n964j1993l528O659O230N517N059m523j1287
$$ y = [3632, 2307, -4490, -5808, -3288, -3093, 511, 8833, 9115, 1050, -5438, -9590, -11151, -3967, 8448, 12952, 7889, -62, -8702, -13508, -7725, 3696, 10262, 9972, 5356, -2568, -8499, -6643, -1252, 2439, 4691, 5349, 2814, 305, -653, -2637, -5245, -5150, -1307, 3755, 7510, 7385, 1489, -7178, -12206, -9581, -98, 9731, 12908, 7629, -2971, -12324, -13068, -4545, 6159, 11814, 10366, 3196, -5999, -9636, -5523, 380, 4227, 6060, 4567, 567, -1156, -935, -3156, -4431, -2937, -111, 3063, 7188, 6553, -1244, -8655, -9859, -6982, 995, 10928, 12729, 3627, -6004, -10892, -10819, -3278, 8958, 12914, 6614, -577, -5660, -9070, -5054, 3842, 6461, 3978, 2868, 488, -3315, -2930, -377, -2262, -3193, 1562, 4325, 3364, 3143, -321, -8473, -9908, -2135, 4347, 7598, 9542, 3578, -8415, -11943, -5284, 946, 6463, 11522, 6999, -4288]
1016d288l338K904J917M507N424k070o181K62Q53l060O84K942k118n43N854J139
1032D888m945j841q77m001K482R080J981m425j641l257n621L719R479J473l111
1047C383r94m369n756M336P469m1j150J102m635n256L509L571k395J057L667k582
1063I16k383L253j439n834J015M412q7K065N317l539p930m71J647r85M843P124
1079G924k549n805K48j094l694L751N193k863j922L383j380l505K884J467n277
1094c239k91M456j113j169M475l14n671R62L285l318r95N045r82l650L793K893
1110D167l954p86K601l660l207N047K997k429J656K042n706l096L354m6k034M668
1126A614K662m360p44K794l739l065M289J446l413L036L886l907k091L520j947
$$ y = [-4288, -7626, -4722, -2805, 1702, 7126, 5056, -1125, -863, -10, -3070, -2386, 556, -1562, -2105, 3749, 4888, -57, -1898, -2775, -6776, -4294, 4786, 6767, 2342, 701, -2556, -8177, -4458, 5021, 6494, 3383, 2389, -1980, -7736, -3400, 4069, 4028, 2878, 3980, -655, -5911, -2402, 1169, -1226, -169, 3498, 916, -1467, 1786, 347, -5487, -4472, -60, -147, 1918, 7235, 3696, -4234, -4705, -3058, -4043, 800, 7924, 5375, -430, -182, -1276, -4970, -1219, 3974, 1111, -811, 2572, 1192, -2313, 571, 2038, -3239, -3530, 926, -187, -1356, 3119, 2805, -2866, -1904, 1381, -1937, -2932, 2113, 1131, -2519, 1274, 4167, 213, -573, 2028, -1632, -4839, 208, 3205, 776, 2432, 4474, -1232, -4328, -974, -1020, -3054, 1614, 4276, -84, -828, 1966, -1773, -4838, -549, 897, -2516, 520, 4406, 499, -1592, 1928, -19]
1141a9m298L394L470l066J096M152k819l966K378O6l970K489M013k511p16L449
1157C142j765m571K041J256l488J080N045j269k008L191j077n592P81L581j332
1172i85N88M892j320m803J392J235l403Q78M343j557k393K855L02l606J243J892
1188A553l392j095M209k50k430K601M51m383J31L825j404j539L245l40l537J762
1204e93L125k394p11K397j858k828L036K621k252L20J394k910k194K956J008j817
1220g00J414J139l162n74K984r89k000J809M40k112J238K803j819j796J668q51
1236e08j689K610K293j977q53J148j565j441K968J110j933J77P97j705o24K247
1252A055m87j848R83O80j499Q48J801j865j574J326J08q10J956J481k188j028
$$ y = [-19, -4317, -923, 2547, -519, 577, 4729, 1910, -2056, 322, 388, -3582, -1093, 2920, 409, -307, 3142, 1377, -3194, -1153, 103, -3385, -2305, 2740, 1471, -537, 2654, 1577, -4015, -3234, 347, -985, -397, 4495, 3175, -1628, -236, 999, -2404, -1526, 2817, 1260, -1133, 1722, 2024, -1582, -339, 1553, -1839, -2934, 1275, 1025, -1405, 1196, 1647, -2736, -2605, 1220, -184, -1723, 1522, 1182, -2355, -593, 2532, 138, -573, 1824, -34, -2862, 174, 2795, 543, 863, 2257, -653, -2847, 109, 1117, -700, 714, 1853, -1309, -1883, 1101, 112, -1888, -79, 361, -1751, -513, 2290, 471, -1325, 343, -508, -2197, 413, 2706, 729, -124, 1024, -541, -1982, 986, 2096, 163, 340, 1137, -568, -1192, 1055, 568, -1280, -297, 383, -1116, -268, 1533, -332, -1906, -580, -472, -1282, 674, 2155, -33, -1061]
1268a061J004n85p13K371Q29j691R1P62j490k23J516l83j056J046P01j205K88
1285B01N44j690r79J923M63q81J057K81k279n18J565n4q1J847k54j987lR12q30
1304g63O90J737k59j325L50j25j448O15J468p18R3J367j260j776L54O22j062J116
1322c24J889r63j115L33o71j497J316J893k78l5J124j716j835J118P72n17J629
1339A123J657j715j560N61j185q18K584J827j331n48Q7k204j583K478J365q09
1355g1J323N06k583j423J553m10l78K379J172j500k25M57k304j084K372J516l58
1372I42J524K76l478j573J374N6L85K979M17l065j268O82j426L99L191M48k076
1389b13R0L50k318R1K495j96p38J790K89k224j51O98j278L28K884O67j577q9q44
$$ y = [-1061, -57, -642, -1355, 1016, 1845, 154, 245, 1007, -483, -706, 810, 427, -629, 417, 1118, -87, 201, 745, -945, -1924, -1, 462, -419, 638, 919, -1360, -1878, -313, -367, -448, 1399, 1145, -842, -845, 67, -763, -73, 1664, 1405, 80, 430, 305, -1143, -528, 940, 222, 315, 1682, 422, -1354, -1000, -378, -1440, -324, 1565, 602, -513, -180, -851, -2348, -1032, 861, 583, 548, 1672, -44, -1879, -761, 11, -506, 1123, 2780, 1065, -495, 66, -1119, -1937, 647, 2474, 1143, 595, 682, -1522, -3105, -627, 738, -71, 1252, 1758, -825, -2248, -695, -1105, -1483, 896, 2068, 568, 343, 800, -1504, -2588, -216, 1300, 942, 2466, 2742, -736, -2309, -935, -879, -494, 2485, 2902, -163, -1431, -749, -2175, -1776, 1415, 1863, -213, -123, 227, -2091, -2000, 495, 299, -439, 1351, 1640, -584, -735, -37, -1315, -987, 1897, 2564, 987, 898, 54]
1408E4k903M44L306J068l00P46j846l817J76K449M41R07J822j498k782J28Q90
1425g15o65P37K114o77o59R80m81k170K49J128l62J271K257p34k736o28k90o30
1443b011K170K713o12j913p22j488j271K273K450k34p34r7j648j257J422J425
1459D66l34L00N95p23p82P10k83j278R21J514oL47J99j740j784L87J359P37J323
1478A928L76k133k015j04M92J023J720M58j432j328k72N9M05J238K74l43k62Q5
1496A69n05j18M30j99M2Q02O49k15m03p56q47j06J025J010N48o83r43j230j80
1515a510O41J075R35n56q02p39l21L76Q91N56m27Jp3m01J80L07J93l21K92L25
1535F22l42N3J13k55q17M61O40k92K10K08r57p97P68K84k11N46M26j267m82Q42
$$ y = [54, -2849, -2405, 901, 1969, 1669, 2415, 569, -3248, -3072, -623, -182, 725, 2547, 1049, -1733, -1605, -715, -1380, -643, 1471, 794, 135, 1115, 634, -1536, -1287, -159, -521, 750, 3007, 2273, -463, -1091, -1381, -2011, 159, 2872, 2260, 347, -375, -1863, -3134, -861, 1589, 1355, 621, 524, -1124, -2381, -959, 466, 132, 432, 1027, 304, -478, 232, -51, -1329, -408, 1106, 1100, 1447, 1646, -94, -1878, -1491, -132, 605, 1928, 2304, 171, -1844, -1948, -1456, -433, 1287, 1745, 313, -1015, -1287, -1228, -823, 415, 689, 346, 84, 169, -336, -454, -24, -223, -181, 621, 1270, 1055, 652, -104, -951, -1057, -32, 978, 1526, 843, -100, -1330, -1510, -869, 206, 1141, 585, -217, -956, -1277, -901, -10, 546, 119, 120, 47, -354, -174, 133, 326, 5, 297, 622, 280, 333, 446, 191, -626, -165, 475, 183, 393, 601, -356, -1153, -385, -101, -312, 234, 660, -607, -1089, -247]
1555b47J03k32O69M63j208k5R19l39k17J018k5j270L64P87r22j52J080j33j007
1574c74P04J65j234M53J165q10r99J130j80j377J105J121j363k33J396n45j463
1591a339J763O33j904N43J500q18r06J677m40k035J038J402j089K5J848j310k368
1608a780J000R64j332J397J843k138j564J275L5j331J926J517k357o19K009q75
1624c0j346K246L85k565N10K681j481q50J910r63k441J605K309j939j43J963k405
1641e54k207K977J290j796P65J130l395j262L267Q33j751J881N23l741NL287p52
1658E00j548K466Jl070J510K616k515j373K179o86k125L146K063l222j031J503
1674D14k085j018M158J329l535J86J301l090r5M380m20l036J432J079l093J179
$$ y = [-247, -144, -376, 293, 756, -452, -477, 442, 103, -114, 904, 879, -391, -27, 760, -162, -314, 766, 633, -374, 330, 495, -739, -286, 879, 69, -930, 200, 20, -1357, -252, 869, -494, -727, 669, 124, -1339, 424, 1057, -847, -304, 1196, 378, -528, 1149, 709, -1326, -288, 1114, 25, 50, 1898, 588, -1780, -780, 184, -1148, 249, 2092, -46, -1610, -335, -300, -1631, 295, 1812, -545, -1164, 845, -30, -1376, 870, 1255, -1310, -800, 1881, 400, -450, 1460, 497, -1944, -339, 1970, 31, -112, 1851, -554, -2761, 216, 1506, -290, 475, 1605, -1790, -3052, 215, 1048, -703, 1178, 1701, -2040, -2035, 1252, 500, -1048, 1418, 1419, -1651, -141, 2475, -40, -1413, 766, 80, -2045, 1101, 3164, -58, -1089, 414, -1671, -2689, 1469, 2798, -737, -551, 750, -2340, -2435, 1945, 1525, -1511, -79, 1000, -2093, -914]
1690i14L740k289k503K607J31k338K251K705l676j770L043r82j815L562J203m601
1706a646l37K837j798o78M111q44m177J141K495k428L13L785k131l505K782J608
1722A528k721J231K893l490k292L697O84k436K070J362m130r67M057n83k047K978
1738A834j00m589Q76L588j793j100L299j190m077K480K497k888J17L123k251k367
1754b541L927Q91l871R40K253l154l13M732m04l636J636M64l833R98M707j339
1770A457k335K655j029m225J750L562k547l80L552j626l388K623J218l774J007
1785a480L772j690j851L599q25m255J443L027k654N02M059k113l937K189Q94l182
1801b502K163L734k680k350K555j094l498L094L077k850j81L201k921l059K924
$$ y = [-914, 2826, 537, -1966, 641, 772, -1566, 685, 3390, -286, -2056, 987, 5, -1810, 1752, 2955, -1646, -1983, 854, -944, -1622, 2489, 1645, -2532, -1391, 1104, -1324, -1011, 2774, 643, -2862, -80, 1528, -1193, 38, 2931, -559, -2851, 846, 1530, -906, 1164, 2526, -1604, -2571, 1486, 903, -1144, 1834, 1734, -2855, -1979, 1609, -184, -1284, 2015, 825, -3252, -772, 1725, -1163, -1046, 2077, -174, -2541, 1386, 2277, -1594, -654, 1599, -1555, -1868, 2864, 2460, -1176, 460, 924, -2909, -1911, 2796, 1457, -878, 1777, 748, -3477, -1727, 1835, -712, -1092, 2460, 834, -2554, 69, 1287, -2487, -1480, 2292, 602, -1249, 2350, 1525, -2730, -1287, 1740, -914, -412, 3647, 1534, -2403, -214, 680, -2502, -339, 3395, 715, -1635, 920, -174, -3672, -578, 2499, -351, -532, 2669, -252, -3311, -387]
1816c87J451k857K174L255l314k116K680j073k953L669K794l141j15K537l301
1831f97k981L768J310k708K385K497m173k195L028j132k263M161K523l826n91
1846h94K090l207j787M543J791k876J904J305m989j306L822j12j661M059R61m248
1862f05o16K168k641j379M493P52k807K158J152m682j412L506p50j054M323J061
1878C667m612o74J922k730j60N161K01l557J360P94l914O35M416j149k461K482
1894A381k3l787J233L302k506r77L565j027l277J912J111l597Q95M115j124j923
1910g27K596j134m650J383L658j108M71L550k320m544J395J431k143J968M102
1925C928k208k681K218q32l331J984K637k496rL453j573l047J799L73l111J390
$$ y = [-387, 1064, -1793, 381, 3636, 322, -1794, 886, -187, -3140, 529, 3323, 182, 67, 2604, -697, -3678, 90, 1400, -1308, 1077, 3574, -599, -2794, 234, -898, -3161, 1000, 3523, -303, -894, 1196, -2011, -3798, 745, 2536, -340, 1564, 2869, -2120, -3426, 396, 284, -1377, 2682, 3643, -605, -1221, 947, -1694, -3073, 1420, 2172, -635, 1523, 2675, -2007, -3419, 87, -663, -1717, 2606, 3667, -945, -1619, 303, -2427, -2587, 2574, 2775, -782, 578, 1372, -2542, -1907, 2509, 1360, -1101, 1381, 1358, -2429, -1196, 2106, -400, -1377, 2188, 1161, -2116, -204, 907, -2690, -1795, 2320, 1196, -727, 1869, 735, -3915, -2532, 1126, 18, 489, 4039, 1719, -2825, -1430, 1, -2142, -174, 3928, 1720, -961, 1257, 425, -2906, -922, 1715, -781, -790, 2663, 1090, -1957, -158, 215, -2896, -1506]
1941a506L830j682j583K339j000l430K322K788k384j91K520j957k523L074J226
1956A843k305O08J875k865j478L317Q8k253J995J117l099l77K518j298j853K745
1972E78P92k464R77J764k441j298K403p5j560K280J407k641n26J942j475j550
1988a887K928N79k424R39J574k352p31K404n10j900J442J074k355J62K202j124
2004B1j395J802j09k318J300J915j518l20J937q16k152J324J237j420N35K010
2020B033j611j383J517R9j647J104J247j556l20J592o18j791J184L90j485Q59
2036c86J645r50j042O82l29j438J419J800p87n36L40j195j045J884J188n90L2
2053F92J62j593p33J467P48n94J96M71j237j87R76m15q57O96K45l65O25O90j132
$$ y = [-1506, 2324, 642, -941, 1398, 398, -3032, -710, 2078, -306, -497, 2023, 66, -2457, 617, 1843, -462, 146, 2021, -844, -2322, 995, 1083, -1170, 825, 1942, -1157, -1534, 984, -314, -2167, 578, 1370, -1094, -117, 1647, -794, -2092, 311, 236, -1324, 956, 2363, -278, -804, 1138, -337, -1887, 1041, 1620, -804, 135, 1709, -643, -1374, 1030, 520, -1380, 62, 1136, -1219, -1057, 1145, 21, -1374, 428, 319, -1999, -699, 1216, -302, -622, 1315, 499, -1653, -329, 908, -512, 23, 2033, 422, -961, 556, 655, -992, 112, 1359, -197, -517, 1075, 457, -1334, -150, 240, -1245, -386, 1259, 309, -733, -51, -380, -1818, -399, 1401, 614, 78, 418, -777, -1822, 62, 1250, 660, 692, 854, -739, -1472, -5, 743, 149, 345, 816, -421, -608, 368, -47, -904, -208, 37, -328, 297, 987, -145]
2072a45j089Q8M12M51J565M46j228j430m69N0J268J541M51r00j534n36J05O96
2090b58J053K67n39p89k65J53L24k4j42j31j15M69N61P4q29p17l08J55J398J463
2110A800m26j087j121p54K50J761J795o62j113p69j094J9J780J150q70n69k23
2127a33p61J62J416P3j434QN78l21M43J297j152j915N18R58J11J265J192k416
2145a11j654J214K95J47J796O81k438j387J054M5lJ885R2k763k8J607n45n66K001
2164A322r55k360J147J828j019k4J324k045j856K429J783j366N57Q11k687j175
2180b286K828Q82j640J133M95k995j96L219l78k091J756N6k856J138L059j516
2196F08j966J814p79k266K609K559k635r67J942j963j542L515J673l154L71J616
$$ y = [-145, -1234, -1146, -734, -283, 1282, 1728, 500, -930, -1399, -1349, -81, 1460, 1911, 1011, -523, -1059, -954, -258, 795, 1062, 523, -266, -531, -378, -54, -78, -220, -351, -466, 3, 564, 638, -191, -908, -1216, -1061, 337, 1800, 1374, 287, -834, -1588, -1338, 423, 2218, 1556, 443, -326, -1420, -1401, 379, 1529, 659, 90, -133, -894, -732, 684, 757, -677, -669, -91, -412, 31, 1328, 176, -1739, -1221, -263, -152, 1113, 2305, -111, -1765, -551, -256, -109, 1687, 2368, -70, -1457, -403, -358, -361, 1524, 1616, -1147, -1175, 432, -113, -679, 1322, 367, -1993, -846, 982, -37, -61, 1263, -782, -2638, -209, 1574, 208, 765, 1576, -1111, -2286, 542, 1424, -216, 917, 1412, -1583, -1779, 1440, 1062, -1029, 727, 783, -2073, -935, 2124, 608, -1358, 456, -323, -2589, 20, 2579, -56, -1023, 919, -1044, -2586, 929, 2602, -552, -181, 1435]
2212A435k515j253M081j0l199J631J758l261K47L379j836l078K718J223k811J538
2228D7K770l310k448L031L00k380K961K234m105j490L410j327j795L843J159m285
2244a385K92L043k868j157M124j45l889K161K358l952l50L836j895k805L806J653
2260B827m376O67K734l499j863N141M81l565K299J637m977o03M892j080k479L986
2276B222P16n228O27L800k992j615M889O4m431K449K260m876n22M607j294l047
2292b371M043J269n262L21L896k993j707N225J66m868J983K289m213l45N501j356
2308A578l705L643J058n479Q62M932k980j907M944n70n290K112L118m392k79N718
2324C363j736m238L542R51n173J199M882k901k327M815m69n248K358L503m062
$$ y = [1435, -1080, -2333, 1748, 1738, -1461, 170, 1928, -1333, -1086, 2293, 457, -2621, 97, 1320, -1491, 47, 2817, -493, -2941, 90, 390, -1990, 971, 3205, -900, -2390, 1020, -307, -2102, 1741, 2900, -1385, -1093, 1950, -918, -2075, 2049, 1904, -1985, 176, 2534, -1418, -1768, 2068, 173, -2632, 1174, 2827, -1549, -882, 1852, -1647, -3510, 1631, 2112, -1453, 846, 2483, -2494, -3097, 1795, 715, -1764, 2222, 2938, -2290, -1663, 2137, -855, -2470, 2419, 2483, -1948, 501, 2761, -2115, -2637, 1970, 676, -2371, 1672, 2941, -2321, -2000, 1896, -1097, -2804, 2421, 2587, -2281, -298, 1991, -2222, -2567, 2934, 1578, -2127, 1516, 2574, -2905, -2043, 2889, -91, -1998, 2946, 2376, -2914, -802, 2316, -2076, -2355, 3363, 1627, -2611, 931, 1882, -3291, -2092, 2790, -111, -2438, 2377, 1908, -3340, -982, 2521, -1541]
2339a541l92N300j633m688L559J550m993J311N215k899l067M345k60n639K493
2354a339M311l889r18N290k366m834L506K176m619R00N452l140l149M535k57n389
2370c730K648M101m110o92N171j803m841L557K050m879Q64N095k744l297M396
2385A786M15n248K030L986m078j794N027j084m339L782K763n050k78M601k805
2400b86l234M715J419m703J931L766m463k406N055o74m256L677L241m757n45M341
2416B821l066l589M513J468m465K038M112m084k561M397q84m336L450L209m344
2431a321j94M779k517l877M015J086m711J676M322l229k021M578p41m990K585
2446e60K719m232j29N113j336l741L396Q41n264R96M638k731j873M699j45n139
$$ y = [-1541, -1933, 3367, 1734, -2954, 605, 2155, -2838, -1527, 3688, 789, -2278, 2067, 1807, -3832, -1339, 2972, -917, -1835, 3455, 1089, -3745, -239, 1937, -2682, -1782, 3670, 530, -2619, 1916, 1659, -3730, -1082, 3019, -1091, -1783, 3388, 1585, -3256, 301, 2351, -2528, -1664, 3431, 687, -2610, 1786, 2201, -3047, -1017, 2969, -1109, -2903, 2124, 1040, -3299, 483, 3246, -1804, -2082, 2519, -286, -3520, 1195, 2614, -2089, -158, 3608, -855, -3261, 1794, 1120, -3136, 541, 3782, -975, -1520, 2821, -245, -3834, 679, 2147, -2318, -280, 3832, -252, -2813, 1584, 700, -3636, -186, 3023, -1321, -1515, 3264, 747, -3130, 885, 1971, -2740, -1064, 3258, 29, -1992, 2586, 1845, -3145, -560, 2159, -2073, -2202, 2911, 1575, -2166, 1230, 2071, -3193, -2197, 2441, -290, -2163, 2536, 2391, -2748]
2462b748K045K933m352p34N053q46l353L535J361n054J83M224k877j760M788K56
2478B654m819J878K792l855p83M482j411l876L065K017l826N97M016k946k867
2493b882L563M30l711K224L459l517j362L962j232l700K869J816l787P26M377
2508C235j939l100L026k51m492K112M067k320j198L576j866m464K655K645k844
2523a158M27L704k589l038L122J109l737J538K950l071r90L739l85l650J758J871
2539A600l234M08L996j684l071K283O84l240J649L545k435k422K710q05k883L069
2555A70K690l225j062K750j636k355L309J300l176L89K831k304j350L309l94l445
2571b199J542K406k141N3K543j741l149K137J786k016J072K338k801k302K251
$$ y = [-2748, -703, 2230, -2122, -2856, 2197, 1351, -2002, 1533, 2894, -2160, -1977, 2247, -630, -2390, 2398, 2654, -2165, -287, 2505, -1350, -2133, 2349, 938, -2938, 127, 2144, -1682, -1085, 2931, -15, -2882, 681, 1111, -2600, -376, 3083, -434, -1796, 2166, 934, -2766, 103, 1919, -1868, -1142, 3235, 1296, -1804, 1222, 971, -3521, -1409, 2658, 338, -860, 2716, 850, -3614, -959, 1686, -1158, -731, 2973, 384, -2654, 468, 1577, -2160, -622, 2328, -743, -1733, 2006, 1621, -2029, -271, 1600, -1634, -1226, 2770, 1086, -1985, 298, 982, -2258, -609, 2936, 501, -1921, 789, -16, -2899, 170, 2860, -365, -1427, 1323, -313, -2668, 641, 1941, -1235, -846, 1985, -319, -1669, 1640, 1246, -2199, -657, 1749, -392, -339, 2204, 463, -2686, -549, 1237, -779, 293, 2631, -170, -2472, -221]
2586b21O77j749J876J766l135j100K473l70j455K004Q81k894K61K400j135j170
2602h91J820k67k343J116K330j411r09J592j231j894K056J781j694k30J186j952
2618i41j380K704J020j873O58O86j980m63K494J30j575O91K43j361M06J815o20
2635F54j348P65k1q44R34J498j202j254O69l75m57J594P32j421o37N10m00N6J271
2654G24J89j228p7J89j54J04Q62j25q27k64M08K61M77L63o50p81l8N29L63M82
2674H07k27n27o61j77M78Q03k3l95k30l91KM56O04n34k92M02k37k06R43K48j272
2695d29k48Q49k64q4J340j16j677p9R92q15L81J626n93j951Q02L72j167R12J499
2714A350j132j519J648Pj595J156J265j842l26J970l58j661J404Q02k739N43K656
$$ y = [-221, 456, -1293, 583, 2349, -786, -1886, 587, 217, -1238, 766, 1647, -1247, -986, 1414, 279, -891, 929, 662, -1681, -565, 1765, 354, -555, 1037, -194, -2088, -32, 1749, 55, -175, 1011, -941, -2321, 383, 1403, -470, 188, 874, -1106, -1569, 925, 1055, -520, 171, 414, -947, -541, 1274, 654, -694, 71, 50, -794, 140, 1638, 436, -818, -149, -524, -981, 613, 1345, -76, -713, -203, -603, -547, 724, 913, -315, -392, -203, -357, -253, 609, 484, -343, -607, -199, 62, 539, 902, 252, -529, -567, -38, 325, 807, 580, 53, -608, -785, -307, 496, 473, 78, -152, -543, -541, -85, 519, -15, -307, 95, -142, -348, 595, 843, -429, -677, 172, -92, -176, 1164, 1048, -629, -708, 284, -531, -150, 1476, 883, -1068, -266, 106, -1061, -149, 1350, 218, -1301, 347, 354, -1241, -85, 1180, -662, -988, 982, 624, -1037, 367, 1169, -1570, -1027, 1629]
2731A629j156j388K321l03l171J417K340j851m10K635j412l027K124J804k703
2746a151L21K962k211k122L086K74l157J335K860k743j275L759r49l590K779J718
2762A896l646O08M136k465k942L429N51m181K136L792l664j757M199j369m260
2777c537L907K362m536O74M059l201l178M867O06m855K316L970m327j771N206
2792B562j302m728L804L019n321L67N130l483l734N348R34n620K471M632n276
2807a197k094N828j000n414M652K911o204O9O161l646m423O405J028o433K518
2822h39N182n690k277O875j328o304N190L591p149L93O484l933m609O639J014
2837C239p137K914N676o286k518P445j423o607N266L824p436n5P545m152n123
$$ y = [1629, 473, -915, 1406, 1103, -2068, -651, 1689, -162, -572, 2063, 651, -2376, -252, 1552, -1151, -830, 2132, -79, -2201, 885, 1159, -1998, -663, 2197, -546, -1821, 1938, 989, -2601, 178, 1896, -1750, -1142, 2994, 529, -2413, 1016, 1567, -2614, -478, 3314, -350, -2107, 2092, 723, -3537, 370, 2732, -1804, -1130, 2929, -272, -3450, 1417, 2023, -2832, -516, 3454, -873, -2644, 2562, 1260, -3468, 336, 3355, -1966, -1599, 3531, 48, -3686, 1662, 2596, -3024, -553, 4079, -1197, -3291, 2537, 1537, -3877, 775, 3686, -2518, -2449, 3712, 66, -4357, 2048, 3076, -3357, -839, 4343, -1347, -3624, 3251, 1923, -4381, 809, 4400, -2749, -2356, 4128, 195, -4414, 2225, 3239, -3898, -984, 4692, -1594, -4112, 3333, 1910, -4697, 569, 4393, -3043, -3098, 4447, 295, -4828]
2852d828P154J554q319K945O490o531k809Q334j482p430N496M444q295Q5Q238
2867E046m628n722P879J562q908L364O929p253l010Q812j870p977O282M740q636
2882c390K43Q575n019o364Q329J570q715L635P537p887l381R060j872q368O598
2897E51N166r098J50R065n153o926Q610J703r421L736Q015p543m022R585j994
2912B424r196O730O023r265j34R584n421p393R002K348r760L421Q248q401m022
2927e812J0542j765q945O926N316j0371k32J0084n035o797R180J784j0339L579
2941a885Q185q363m064J0566j806q714P330N686j0530j082R583n307o500J0442
2955C541K720j0487K649P629q725m077J1279q79r178O510N597j0433o34J0228
$$ y = [-4828, 2326, 3880, -4439, -1494, 4996, -1535, -4344, 3990, 2508, -4922, 574, 5018, -3277, -3192, 5046, 418, -5304, 2575, 4137, -4771, -1407, 5522, -1731, -4741, 4071, 2201, -5776, 506, 5246, -3390, -3147, 5428, 409, -5955, 2374, 3944, -4771, -1136, 6401, -1486, -4867, 4193, 2321, -6047, 551, 5717, -3381, -3231, 5834, 681, -6245, 2365, 4068, -5353, -1617, 6398, -1145, -5167, 4418, 2424, -6772, -42, 5981, -3284, -3418, 6166, 745, -6648, 2354, 4702, -5058, -1637, 6611, -1790, -5812, 4730, 2965, -5980, 946, 6262, -4109, -4341, 5743, 708, -6089, 3091, 4875, -5464, -1885, 6300, -2063, -6127, 4439, 2633, -6081, 1249, 6935, -3595, -4677, 4906, -401, -6901, 3541, 6261, -4226, -1577, 6052, -2673, -6750, 4529, 3650, -5528, 982, 6579, -3854, -4488, 5740]
2969E740n043p737R441K702j0182L627Q621q956m626J0065j233q632P141N966
2983F894j0610r32R965m687o726R578K014j1265L114Q315p435l225J0752j848
2997C904j0371N927N692r350L78J0361n117p802Q813K474j0431L382Q113q104
3011b131l980J0860n71r486N959M773j0473m87J1263l738o599Q443J250j1473
3025f390K982R208o835l374R682k074r811O552N971r142n80R339n039p058R076
3040B507K582r612K448P501p767l435J0495r82q882N066M911r092N31R884m386
3055A769p008P162J535r055L907Q601p020m471Q142j822q159O722N857q736q91
3070c467Q048m494n698Q120K152r224K188P086o223k732R036j474q909M666M988
$$ y = [5740, 697, -7040, 2401, 5103, -5079, -1452, 7169, -1787, -6413, 3652, 2419, -6213, 928, 6894, -3716, -4648, 5317, 630, -6096, 3482, 5496, -5769, -2655, 5660, -1775, -5000, 5752, 3904, -6467, -540, 5152, -4198, -3820, 6541, 1424, -6378, 2435, 4909, -5522, -2140, 5973, -2131, -6111, 4749, 4178, -5308, 651, 5424, -5049, -5536, 5727, 1989, -4610, 3833, 5083, -6390, -3408, 5800, -1035, -4409, 5273, 3199, -6612, -60, 5911, -3231, -3811, 5528, 489, -6569, 2507, 5089, -4523, -2075, 5426, -2341, -5776, 4719, 3737, -5145, -79, 4832, -4260, -3729, 6155, 1769, -5239, 1923, 3458, -5597, -1690, 6911, -109, -4580, 3562, 1740, -6419, 303, 6160, -2576, -3467, 4581, 87, -5611, 2509, 4661, -4563, -2375, 4711, -1512, -4244, 4792, 3318, -5591, -925, 4063]
3085D063p080N70Q549m530p207O606K223p189L160O885o882m009P323n77o243
3100d338N226M182q018q47P399k816m720O561J086q287K195O676m720k548O703
3115C734j720p213M442M713n607n6N991m039n205O093K438o009J788M857n670
3130a463k763O869j40n632L426K952o205k39O627j958m505M353O81n791K219N549
3146C980l606k946M896j228n232M109L874m846q13M465k709l557N116J351n002
3161b148J129L438l414j548N062o08m670K258K535l814M10M615k337l758K960
3176A10J211l423J778L531k969k553L242l22l070K738K600l661p17L147j561k014
3192a933K763R65l293N08K613j669j238K640o09k994J698J968j773l51K265j485
$$ y = [4063, -3017, -2447, 6102, 1572, -5635, 971, 3194, -3995, -835, 6050, -832, -4841, 2482, 1905, -4338, 888, 5070, -2948, -3795, 3604, 788, -3932, 2629, 3715, -4572, -2377, 4299, -421, -2969, 3734, 2014, -5199, -757, 3956, -1651, -1707, 4284, 245, -4960, 1133, 3571, -2438, -650, 4207, -1463, -4226, 2643, 2503, -3129, 297, 3249, -2956, -3195, 3432, 1474, -3031, 1322, 2003, -3788, -1569, 3980, 374, -2572, 2324, 1096, -4136, -27, 3847, -999, -1812, 2653, -56, -3613, 1503, 2854, -2148, -1019, 2419, -995, -2543, 2519, 1911, -2759, -501, 2034, -1780, -1370, 3245, 908, -2850, 110, 1321, -2102, -324, 3207, 238, -2315, 927, 605, -2465, 273, 2873, -788, -1505, 1642, 81, -1933, 830, 1795, -1498, -990, 1623, -46, -1284, 1356, 747, -2247, -549, 1419, -354, -705, 1560, 75]
3208G5k263K030J253j769Q28J620j952j470K045K61j208J135Q90j806n44J425
3224E50l55j016J343K71j382J95J228p49p74P71j60n94O96P17n47n58L60k66m41
3243g11P63N36n10N7p5l49o3K50L33jnk06J38l90m8L56L89m55j3M45m97l14K20
3266a50L19m64P0O34n71l71O76Rr49O43R10j099j36J193n00q41R17O35j462K53
3286b84J288r85j074J609Q6j762R98J227j663n31K104p54j613J669R68k362J40
3303i39J989j462j044K298L35k517J189J697k581k78K783p59k178K102R70k981
3319a376J34K740j478j545K877J44l128J049K307k857o45L689q20k970K288J123
3335A532l580O60L386j819j853L309R1l913J260K957l218n88M311j026l727K582
$$ y = [75, -2188, -158, 1095, -674, 154, 1774, -178, -1648, 397, 658, -550, 585, 1475, -331, -875, 550, 195, -821, 522, 793, -589, -394, 834, 85, -689, 82, -78, -672, 24, 741, 194, -364, -4, -270, -711, 52, 588, 78, 135, 60, -289, -352, -102, 231, 230, 225, 19, 157, -233, -281, 75, 464, 9, -4, 441, -56, -370, -150, 169, -295, -225, 409, -162, -533, 143, 152, -797, -154, 756, -343, -479, 714, 214, -627, 290, 925, -537, -284, 1004, 19, -1055, 554, 640, -1122, -124, 1103, -560, -1091, 1013, 259, -1354, 315, 1283, -1079, -939, 1050, -412, -1456, 842, 1177, -1340, -151, 1546, -1035, -1313, 1470, 711, -1467, 635, 1605, -1376, -1242, 1498, 20, -1525, 1352, 1496, -1632, -583, 1724, -1133, -1778, 1911, 1091, -1879, 409, 1532, -2048, -1388, 1998, 179, -1674, 1635, 1726, -2187, -927, 2030, -1188, -1776, 2535, 1509, -2218, 364]
3351C64J429m267R36M269k118k454L473r6m644J748L699l136q57M406j486m250
3367b984K746K145l874N04M608k602l130L940L67m803K074M078l828j068M904
3382C077j860m594L163K260m269J145N084k971l983L917J06m895L149M576l698
3397B07j952M077k060m539M129L084m559N11M902l618l479M498O57n269K482M523
3413C594l880j549N151k335n451L796L145m267J238N113m106m924M651J240m455
3428c039L628M255n494l148N321r58m119M939K813o041l26M897l150l289N559
3443A848R08n740K404M656m787j990M720j878m749M972M060m914j47L811m953
3458a779l972O333K698m485K333L250o776k371O089l9m090M559K290o418j88N953
$$ y = [364, 1793, -2474, -1538, 2731, 613, -1841, 1632, 1536, -3108, -1360, 2339, -797, -1654, 2752, 1266, -2984, -238, 1907, -1967, -1463, 3145, 543, -2587, 1353, 1720, -3083, -1009, 3069, -759, -1827, 3077, 1217, -3377, -214, 2046, -2223, -1078, 4006, 1035, -2948, 969, 1075, -3820, -671, 3905, 207, -1745, 2332, 272, -4267, -138, 2946, -1613, -1102, 3800, 182, -3297, 1201, 1858, -3411, -929, 3594, -286, -1835, 3316, 981, -4470, -674, 2471, -1796, -558, 4555, 449, -4475, 176, 1416, -3039, 589, 4844, -650, -3798, 1523, 565, -3554, 1385, 4198, -1843, -2169, 2728, -422, -3711, 1848, 2756, -2984, -580, 4076, -711, -2701, 2019, 141, -4608, 364, 4424, -490, -637, 3174, -1779, -5751, 582, 3280, -1205, 1128, 4378, -2398, -4769, 1320, 1281, -2809, 1750, 4040, -2378, -2566, 3387]
3474C387k957m312N401O44n537K974N180m835l113M856j399m544N414L717o056
3489a180j027M303l469k879O889J575o302O64L415m759p85P256l35n893K666J825
3505A964n398J076O372k982m157M695Q21n207K423M234n314k863O006P6l860M418
3521B304K247p494j438N676j515k067N969L66p295P33M427l485q24O266j647n989
3537c766L293L360m538L38M979l867m294N197K221m635J834L393n405k283O019
3552A846M71m249L097J647o097P4O112j375l536L778j40n896K207N605k942k095
3568a493M130k015m986L926L928m164n88L933l062l428N263J914n074P04L276
3583B264m114j237O244j68n362J870K138m570R32N701k125m076L059N43m337K347
$$ y = [3387, 430, -3882, 1519, 2163, -3374, -400, 4780, -55, -3168, 1688, 289, -4255, 1159, 4876, -1180, -2207, 2096, -1373, -4252, 2637, 4212, -2090, -1426, 1989, -2770, -3555, 3701, 3366, -2527, 139, 1964, -3434, -2358, 4014, 1032, -3125, 1570, 2391, -2816, -393, 3841, -1473, -4336, 1670, 1746, -2114, 2304, 4551, -2943, -4381, 1295, -220, -2287, 3682, 4048, -3247, -2514, 1913, -1572, -2396, 3870, 2223, -3766, -473, 2887, -1651, -1313, 3666, -201, -4495, 702, 2923, -1712, 122, 3515, -1890, -4173, 1846, 2317, -1932, 1165, 2812, -3285, -3211, 2901, 1526, -2010, 1768, 1628, -4268, -2061, 3544, 602, -1493, 2637, 622, -4364, -438, 3490, -674, -1262, 2671, -391, -3819, 1444, 3358, -1716, -1012, 2264, -1850, -3087, 3157, 2989, -2373, -503, 1635, -2935, -2003, 3698, 1573, -2503, 556, 1099, -3238, -891]
3599h91M838l883k699L933m97l601L538K858m909j168M134j601k323M641O14n347
3615b363L19L624k479q59M845q69m869J672K482l191M82M207k211l668L336J394
3631A852l595J365L042l439j989M101M23l199K177J755m537n91M298r05k162L097
3647A693M22m621P43L783k220j245L223o80l856K327K787l087l34L052j839k772
3663b624L101J450l018O27K587k671j430L471j82l093J708J670k860J2L523j296
3679I75k830K148N78k788J071L063j974j554K422n07k726J610K100k277k64K672
3695A719j412k222K287Q40k447N43K281j648j279K538l9k600J322J444k141j16
3711i30K262q91j752J790O45k158K28K071j545r70J959J04k075J150J540k060
$$ y = [-891, 3947, 64, -2635, 1298, 801, -2800, 738, 3596, -1313, -2481, 1653, 52, -2271, 2370, 2984, -2363, -2044, 1580, -899, -1758, 3087, 2218, -2651, -979, 1503, -1688, -1206, 3001, 790, -2878, 458, 1852, -1743, -378, 2664, -775, -2764, 1337, 1760, -1439, 738, 2493, -2044, -2635, 1663, 758, -1404, 1693, 2115, -2506, -1763, 2020, -200, -1445, 1778, 1098, -2758, -431, 2356, -731, -1065, 1987, 148, -2624, 477, 1927, -1091, -464, 2123, -548, -1978, 1493, 1311, -1782, -74, 1596, -1264, -1252, 2271, 975, -1855, 293, 871, -1917, -846, 2217, 243, -1311, 1111, 604, -2122, -512, 1588, -689, -953, 1719, 307, -1915, 372, 1212, -1235, -692, 1589, -59, -1338, 1200, 1161, -1439, -117, 1327, -814, -930, 1332, 441, -1311, 479, 1124, -1034, -806, 1265, -280, -1250, 709, 813, -1262, -112, 1428, -632]
3727f32k58J698o96j295J743P05j847K40J211j335p59J969L38j677Q96O57j776
3744h18l27J914j93j201J462Q1k037K76J477q03n37J651l76j507P13Q89j307j19
3762g62J581l77r44J011J39j468o8J198o05M4J388j39j400k26M19o25N17J450
3780A133j68j028R8j34j163L62J533n5k74L33m01j309K84O68j54M89P70rj122
3799a47j03j71n73L80J043K43P5K8r77j003J50Q19L63P76M00n11j211o98L1K37
3819h49R06J057j0o75o26n93m94O42R04Q00k9j45q25q48m91M23R60O97L00j29
3839I75p79j167j65M28L92Q10P77j28p71j008n98j01N34J421P14j14n30r11j315
3858a536j07J081R34P43P32r65j782o57N19L93J071J125P5j542n04k04r57O92
$$ y = [-632, -890, 808, 112, -1183, 560, 1265, -582, -342, 869, -466, -1225, 744, 1082, -595, 301, 958, -818, -1145, 769, 576, -625, 837, 918, -1119, -843, 634, -169, -706, 945, 569, -938, -225, 664, -643, -762, 819, 442, -502, 509, 648, -820, -888, 310, -295, -251, 1137, 998, -402, -628, -209, -834, -317, 1133, 965, -63, 35, -99, -1262, -900, 633, 578, 304, 637, 236, -1073, -789, -121, -275, 214, 984, 975, -147, -250, -421, -994, -614, 429, 672, 747, 775, -202, -1205, -1055, -236, 127, 903, 1303, 792, -419, -1117, -1086, -849, 57, 1114, 1104, 429, -197, -790, -1284, -642, 262, 1062, 1033, 888, 63, -785, -1276, -853, 107, 804, 1104, 975, 196, -971, -1136, -708, -316, 494, 1271, 1143, 372, -636, -1234, -1335, -801, 620, 1334, 1220, 690, -221, -1536, -1643, -562, 372, 1115, 1847, 882, -900, -1557, -1038, -645, 426, 1551, 1626, 84, -420, -624, -1581, -889]
3876h89J567K33l75M84o92j427k61O97k8Q43J600j88j561n98o86o53J236K187
3894A489L53p69l25j444j679R08K002M62K36M50j488j722M65Q35j88P06J355j050
3912E96p99N51m37j412M47J367k18M11J436r81k416j90P00j17J678K238j361k232
3930g39k35k49n57K103K237j262j442J56j074r07J813J532j107l6P69j291q14
3947a103J465m2j648R78J554o75k02Q12j683k001J379J764PJ078O43k664k300
3964b638J421J188j41J688J153k803j547J418j79m15J839M79k199r1J788j014
3980e3q62J492o25j619J322K154j378n78O87j459j201K295J865j522k97N56k124
3997a347q15K848J118j448M29j36k384j65K900O4j237Q67o4k240N70K276j094
$$ y = [-889, 678, 911, 536, 1020, 328, -1099, -1360, -663, -691, 152, 1752, 1564, 3, -595, -1281, -1934, -698, 1489, 1842, 1073, 748, -696, -2375, -1467, 535, 997, 1233, 1683, 195, -1527, -1062, -227, -415, 291, 1646, 596, -203, 348, -89, -1501, -1054, 313, 95, 506, 1942, 961, -1455, -1645, -945, -1062, 616, 2854, 1493, -739, -974, -1223, -1780, 323, 2560, 1298, -144, 12, -1062, -1969, -156, 1376, 269, 233, 1002, -289, -1103, 362, 320, -1328, -350, 1204, 529, 327, 1139, -544, -2545, -1166, 598, 605, 1683, 2326, -338, -2638, -1217, -29, -170, 1518, 2671, -132, -1679, -261, -440, -855, 984, 1463, -736, -827, 961, -53, -915, 577, -48, -1667, -345, 1809, 431, -147, 540, -919, -2120, 175, 2040, 518, 221, 777, -1347, -2162, 686, 1804, 356, 785, 649, -1735, -1900, 1000, 1064, -173, 694, 630, -1610, -1040, 1236, 142]
4014A42j232J574k32j471J642J508k193j136J290o40m52K665Q21k604m30Q49j370
4031a269o5K934J26k455M74O20j756N92K435j012k010J271N75j433J226J516j948
4048a79j651J891J38r61J690J063k668r51J942l59o57J939L96k762J42J796r96
4065a87l79J961p03k316J400J350j538J93J766j730j793K034R75j664P79J329
4081A477k421p84K328P3j501J490O21k468j3K281q05j074J539J4k124R33J899
4098A465j556n45J824r36k146J836J371j968Q1J873j432j027J911J20k210R50
4114c89J378j667j21K211m56k041J172M97j965O73K020q49r60J550l15k287R12
4131f37J612j520k21K141n12j853J477N03k081J74J791j119q15K164K7k036Q18
$$ y = [142, -1090, 484, 252, -1219, 423, 1931, -262, -1398, -108, -748, -1200, 1465, 2286, -318, -748, 101, -1269, -1334, 1600, 1726, -729, -255, 365, -1391, -799, 1636, 624, -1386, -115, 460, -973, 253, 1769, -179, -1830, 61, 199, -762, 928, 1991, -677, -1628, 314, -45, -702, 1237, 1633, -1129, -987, 809, -187, -566, 1395, 692, -1624, -224, 1126, -412, -219, 1547, -183, -1976, 58, 1033, -631, 148, 1477, -944, -1728, 600, 673, -828, 662, 1283, -1185, -1198, 1083, 278, -796, 743, 757, -1367, -434, 1465, -91, -636, 1188, 252, -1894, -58, 1313, -655, -574, 1299, -133, -1160, 751, 871, -1339, -389, 989, -678, -799, 1412, 956, -1085, 87, 584, -1381, -708, 1312, 463, -497, 1053, 738, -1549, -637, 975, -545, -766, 1375, 863, -990, 487, 990, -1091, -917, 874, -245, -1060, 1104, 1131, -905, -87]
4148h7J090j960m85K123l49j210J885M15k075p5J619j603p02K147K42j641J069
4165D03J097j910o69J378o97j201K123J171j788J41Q55j685r79J873M19j153J339
4182G17P73k104l29J607n83j312J769N33j974N71J734j371q13J412m30j699J468
4199c1J258j681j90J663r19j139J700L13k070K00J259r08K7K343n48k049K00K57
4217c15j391P96K560l58j329P44m79k129O86K081p39l08J543n74j813Q83N36j828
4235a434L39J999k80n87J103n07k382L80J632l49L93J522q84k274N51N15o91J057
4253A03J793j200j453M17R0j096J272J565j207m68Q31p45j316R81J030q08L03
4270I2J393r41j358N43m73p83J399J614n43l83J26j398j541J354J640l03P93K87
$$ y = [-87, 1003, -957, -1442, 681, 332, -878, 1007, 1422, -653, -728, 891, -712, -1414, 733, 975, -666, 403, 1500, -410, -1079, 299, -398, -1599, 524, 1695, -93, 48, 903, -782, -1761, 112, 531, -622, 717, 1490, -614, -943, 664, 81, -1231, 538, 1071, -903, -332, 1402, 31, -782, 630, 200, -1499, -31, 1227, -454, -644, 1019, 100, -1039, 661, 974, -1096, -896, 363, -545, -518, 1825, 1277, -772, -572, -315, -1706, -910, 1650, 1292, -37, 707, 228, -1901, -1215, 866, 127, -181, 1362, 788, -1025, -142, 394, -1434, -1095, 904, 624, 37, 1140, 633, -1749, -1369, 263, -86, 307, 1829, 945, -1329, -778, -263, -954, 103, 1896, 696, -757, -340, -250, -1346, -74, 1491, 284, -184, 647, -98, -1414, -433, 597, -211, 92, 1485, 544, -814, -271, -744, -1527, -128, 1486, 943, 560, 686, -712, -2253, -899, 741, 438, 1231, 1518]
4288A518j618j627P59O59n26J672J063j344j027L20o66o58J446R65n65K90N28
4305A189j614j189P92N79j23J373Q71j552j028kn46M4J761J017p55l50j68j481
4323a182o43J494R02M0N91k2j497q11K00M13m6J498P81j143q26m8r30j49J383
4342EJ003k87L14m66j483l19M92N06L87J024L22j311p21j77o48N39J414Q37n64
4361H67k52o58j165l77J163Q27O09K18m48j260p38L64L26O49J017n1q51l72l04
4380d36m91K37Q11M49m8J99l78r38m07K41K91Q26Q47j2p33r08o09k63Q65J032
4400E75O20l55p21q83n59M67Q10N38M02m23n53l39j60P8L70J90L09m0O1l18k61
4421a92k85p3J43O56N65j69k06q46m67P9N87R44L01l42o50j114J43O02N09K58
$$ y = [1518, -100, -1727, -968, -309, -835, 837, 1900, 556, -471, -151, -817, -1475, -29, 936, 371, 661, 1189, -425, -1614, -822, -243, -366, 1007, 1878, 326, -702, -704, -1250, -1206, 555, 1572, 817, 467, 299, -1182, -1825, -331, 571, 611, 1202, 1180, -317, -1128, -928, -515, -561, 937, 1718, 575, -251, -299, -1229, -1378, 5, 1008, 721, 1035, 569, -914, -1233, -741, -235, 152, 1176, 1498, 187, -534, -711, -1359, -820, 594, 1431, 867, 615, -43, -1208, -1585, -422, 405, 1014, 1232, 784, -476, -1214, -850, -524, 125, 1142, 1091, 240, -132, -436, -927, -690, 121, 570, 522, 721, 343, -595, -1002, -761, -470, 356, 1203, 1191, 458, -450, -1059, -1322, -457, 575, 1195, 840, 119, -764, -1323, -856, -46, 492, 894, 471, -82, -421, -581, -503, -133, 57, 366, 326, 387, 69, -192, -477, -550, -407, 249, 814, 645, 439, -407, -874, -795, -208, 736, 1037, 695, 45, -1069, -926, -324, 185, 443]
4441D43K91l25r80o0N82j1j18O48l51k62K30K73m65l56M38k97J17Q34K84r94m23
4462e02M2m40L91J438J0q41l11o2n36L69J184j03p88M41k87o60M77Q49m82n61
4482c72M66ln91Q40M20r45m30O63l8j73Q48J05j390q4Q66m05Q9J125n62j129L64
4503c36N10l35R4R57q00q57P75L01p60N27Q49j278m15J194k19p50J038J80j180
4522e05N5R43l17m91P81j50j200L24J235o86m85J061m72j077R54P81j112q0J449
4541A008r52q11J158L07j438P04P18q72n17J444k82j263R47L95j179rJ609p79
4559A88j092J293J34j361M67J097j087k82J390k38j347Q82P81j360N2J414o57
4576B74j149J373J39j425O08J071j131n95J499k22j135J032N59j702o9J519o17
$$ y = [443, 734, 409, -571, -631, -49, -60, -178, 470, 119, -143, 87, 360, -105, -461, -23, -320, -203, 631, 915, -79, -502, -460, -900, -509, 929, 939, 98, -213, -275, -811, -442, 742, 639, -149, 292, 5, -655, -178, 671, 189, -372, 94, 91, -500, 340, 760, -185, -615, 48, 10, -163, 685, 790, -600, -684, 182, -223, -134, 991, 429, -700, -336, 174, -161, -67, 890, 90, -767, 8, 309, -451, 76, 925, -353, -768, 426, 207, -543, 495, 675, -505, -450, 493, 176, -315, 466, 316, -884, -560, 675, -11, -496, 565, 93, -984, -30, 751, -361, -441, 1008, 56, -755, 403, 710, -728, -24, 694, -178, -695, 749, 467, -796, 151, 546, -633, -642, 967, 188, -904, 389, 523, -838, -371, 726, -361, -643, 747, 509, -838, 44, 825, -535, -483, 931, 274, -875, 498, 637, -788, -180, 891, -240, -835, 664, 442, -693, 339, 898, -804, -873, 646, 29]
4593B9q91J386M67j916N70J328j534m80J739l36j366J394Q52j673m8J376j284
4610c87j112J904O46j540P02J107j934q19K123j54j376J492N59j861l2J794r60
4627A52j140J322J47j557Q73J592j415p08J438n31j412J440J016j721J02J509
4643A107j090j067K018J73k130J67J158j139L6K293j10k229O83M39j961M85K524
4660A357n93j086J286j85k165N94J373j241m00K169l1j356Q45L10k346o8K009
4677D72k01n67K115k24k886K69J289r69K78J891m82k109Q63R76j494M76J631j262
4695F6j351J292M78j428Q08J614j683p86J907n88j747J347P30j597N18K264q81
4712I63j846J068m97j765J505K457q10o31Q80j666k102J251J812p20O07J640j820
$$ y = [29, -862, 524, 991, -925, -355, 973, -561, -1041, 698, 362, -1004, 390, 1242, -431, -479, 897, -387, -1499, 405, 1051, -489, 213, 1320, -614, -1433, 690, 536, -840, 652, 1211, -650, -682, 1112, 152, -988, 334, 481, -1076, -203, 1389, -26, -734, 704, 173, -1239, 201, 1217, -504, -402, 1107, 17, -1050, 968, 1141, -989, -822, 336, -803, -767, 1526, 1416, -813, -130, 309, -1652, -1167, 1357, 764, -322, 964, 779, -1386, -792, 581, -660, -1060, 1109, 1078, -278, 567, 877, -1469, -1537, 472, 271, -296, 1819, 1595, -1291, -1022, 267, -702, -424, 1467, 985, -1124, -261, 715, -779, -303, 1328, 66, -1285, 7, 485, -943, -135, 1479, -204, -990, 917, 329, -1418, -71, 659, -938, -420, 1844, 963, -883, 185, -312, -2077, -572, 1885, 1075, 444, 1324, -342, -2444, -1193, 619, -101, 506, 2146, 326]
4729C26j675J198J65j393R82J996j264n19J646j062k087J094J018j003O02J920
4745A944j159j867Q29P0j078J308J797j349j261J181r32j082J752J395j518l32
4761c02J222j433j164J751P52j093Q75Q24j626j070J477m73j140J844J275j273
4777D46l44R72j919j390J973J018q12Q09J162k156j638J440M0n00J553J095j655
4794I4p31Q45j099o18J905P97j110M35N65j555j094J530K70p74J250Q57j663o20
4812g16Q25o67o03J915O22j277O5M67j593n34J720K93n94R18K12j774l13J077
4830D3m68k81J646K26j441r3O33j041k60J894J62j047M77J99j442l64J331r0m15
4849c31J184J52j684J27O00p92J94J374q3q45L10R8j324rJ410J17o35J164k80
$$ y = [326, -1349, -151, 14, -1379, -397, 1599, 335, -184, 1462, 400, -1687, -593, 425, -578, 24, 1944, 785, -1082, -253, -183, -1261, 47, 1844, 495, -766, 415, -517, -1599, 153, 1548, 30, -302, 920, -513, -1677, 74, 826, -267, 608, 1432, -194, -1264, 213, -260, -1400, 444, 1719, 446, 102, 1074, -845, -2235, -262, 756, -56, 753, 1915, -241, -1879, -439, -399, -899, 654, 1749, 94, -637, 208, -891, -1509, 396, 1193, 83, 518, 1083, -472, -1566, -36, 234, -540, 710, 1567, -96, -716, 109, -558, -1161, 754, 1376, 99, 164, 631, -962, -1496, 224, 517, -77, 841, 1053, -721, -1034, 43, -425, -706, 940, 1166, -275, -368, 265, -776, -1036, 858, 1020, -27, 450, 649, -793, -1157, 174, 84, -331, 853, 1005, -679, -552, 48, -744, -550, 824, 741, -104, 206, 304, -1020, -1029, 381, 498, -137, 1027, 747]
4868G47j602K4R50m51J29J194j75j190K99J03o49J98J060j71p90Q93l35q28P6
4887e18P85l94k35J008m1j154L99L29q44K38J188k21n82M40m73p35L55R42l40
4906A47j45O04m75r25M72N90l76J88N56l93n08J21L06n02J89M50m32Q8L53j60
4926A48n87J91L42l23J78N71k07o69K44J44m12M71N36m21l35J96k64l09M66K75
4946B35l13j12L04n5j65K64J2l65k07N85k60n8L85k74l16L32J61k82K40L01l41
4967G1k60M7K44p6K09O4k63k27K19m8J30N0n5k75qJ66nj07R2J62k71N9O3p7N5
4992d1M8P0j65J16k42R6J59O7j60J14q2j11K10Q7k16J05m6j70r5L39k29Q1J12
5015D7n2j90j4N36k28j53K20j81k99L56K92l60Q1J45n02J33K16K17l52J83J94
$$ y = [747, -855, -831, 119, -332, -203, 991, 816, -374, -75, 28, -621, -423, 637, 466, -324, 569, 234, -594, -518, 267, -127, -362, 646, 605, -549, -150, 179, -665, -427, 761, 540, -42, 398, -75, -810, -455, 487, 147, 2, 606, 131, -794, -322, 268, -108, 80, 636, 243, -265, -144, 162, -340, -151, 299, -133, -45, 308, 148, -439, -248, 94, -229, -51, 520, 313, -356, -112, 32, -380, 91, 627, 206, -129, 67, -197, -506, -40, 235, -78, -190, 114, 59, -106, 158, 170, -195, -402, 183, -77, -135, 250, -24, -340, -8, 153, -129, 111, 412, 71, -189, -142, 102, 26, 235, 299, 36, -191, 28, -20, 110, 160, 105, -170, -178, -12, -17, -124, -32, 130, -141, -82, -19, -96, -41, 7, 77, -88, 28, -214, -118, 41, 108, -52, 62, -20, -131, 79, 166, -50, 55, 9, -161, -256, 83, -146, -65, 47, -5, -195, -209, 327, 99, -54, 166, -15, -314, 42, 334, -26, 55, 200, -302, -169, 47, 264, -88, 95, 289]
5036B89n46J45N17j40k11o4K4m29L33L16J1l46o5N0l64M15M19k00m46K83j40j65
5058c14K57M11l78r2K67l10j69N64J38m57p9K76l84J07O31m73l44J0L69k10J60
5079b0P10o69o78M49K31j35N74K52r84l66K96L99j18N69J17q91k56M15j25j40
5099c70O95K07r07K95N26n03k20L92k69n82P94M97l37n6N7p31n32J020Q46k88
5119E34k02J13j186k40Q45N93j71J16P7j018K6R38k24k89N78k42n21K28N33n51
5139f3l15M26k04q5O68M26j049n16L87j57L55J054J20j113m06j95m40N63J578
5158A034J40p37n15j21p72K26J070j9j38M97k9j014P2M97q53l7R35M85m43L67
5178F45k53j198m14Q92M71M52N28m94j426j90O70J68K95Q48n16j114K44L32l00
$$ y = [289, -257, -112, 405, 265, 54, -10, 14, -415, -82, 234, 245, -101, -166, -116, -480, -65, 354, 154, -292, -9, -149, -314, -57, 354, -24, -116, 151, -159, -328, 236, 374, -83, -162, 114, -270, -163, 468, -5, -349, -339, 30, -180, -20, 690, 21, -657, -208, 23, -112, 462, 714, -270, -636, -340, 59, -59, 510, 627, -264, -520, -105, -230, -370, 325, 532, -375, -80, 446, -57, -277, 115, -154, -736, 58, 555, 218, 162, 219, -512, -1044, -24, 822, 534, 332, 445, -741, -981, -136, 457, 286, 402, 479, -539, -513, 425, 201, -88, 490, 248, -273, -45, 488, -63, -378, 48, -156, -241, 427, 853, -196, -712, -325, -482, -127, 927, 1047, -66, -472, -667, -1107, -544, 1034, 1174, 437, -78, -199, -971, -745, 325, 306, 168, 665, 636, -378, -306, 191, -662, -699, 236, 721, 278, 645, 392, -806, -1220, -328, 143, 595, 1123, 629, -797, -987, -317, -149, 146, 994, 478, -636, -392, -60, -360]
5197c60N40P10m36q08J91J41n03K31M72L3p9M92l65p27l5J46l81N35J217K73j043
5218B44m26n33o89N95J493N13l09j4r37j052K01P47L47K25N24k36j132L87o2n19
5238f33J85N77K11l2K68l24r06N0M26J5M02O88m69j033L2J30K5M95Q42o61n84
5259b96j01k3j64O56N61q3l65k14l23m48N21L43O1K18K98l29o94Op1j60N41P67
5281G01J23n60Pq09l74K72R04K54K62N0o14p51j38L53K44L96N64m59n10r8n1j59
5303c93J31M94Pp6o7q6l81J04K11O8L07J70k89l03k74P8mL77M39j30l11j97r5
5326b20j37L07L84J00j22L3m07l30k0N39JJ70J63k56n01k07K12k0K35L86kl25
5348a7O5j84r7J02K39J47q2J36j48l90L5J63p5n0O80j88m09j15L9p9r9M73J60
$$ y = [-360, 180, 890, 454, -354, -163, -22, -525, -294, 178, 211, 132, 624, 259, -468, -503, -357, -738, -203, 1014, 1287, 244, -182, -715, -1404, -809, 684, 1197, 888, 874, -63, -1115, -914, -167, 180, 405, 929, 693, -439, -52, -114, -633, -448, 129, 340, 308, 576, 252, -654, -604, -178, -163, 239, 927, 458, -575, -543, -413, -388, 107, 949, 288, -296, -397, -420, -584, 72, 633, 550, 185, -29, -352, -800, -279, 64, 125, 343, 641, 312, -382, -376, -447, -607, -66, 701, 824, 264, 271, -538, -912, -640, 264, 518, 780, 830, 216, -535, -673, -320, -76, 320, 884, 425, -85, -183, -234, -393, -262, 232, 239, 163, 96, 10, -371, -267, -56, 12, 319, 489, 200, -103, -377, -299, -303, 74, 513, 383, 72, -125, -220, -357, -50, 334, 434, 312, 345, -62, -392, -412, 127, 128, 298, 461, 205, -296, -503, -291, -311, -76, 310, 308, -17, 48, -136, -233, -131, 108, 255, 173, 309, 161, -229, -194, -31, -106, -156, 524, 336, -73, -188, -149, -228, -327, 146, 306]
5371C06m05K76k14q3k15M47r0Q4L2L1k65J46j9q8J11K10k68j76L34n8k27q1K14
5394BO7k57L43J4l33R3J07n2pK18n3l09J65J99m21K05J44j07k30K63M7k38J11
5417b9K08l33OK65o6m02L12K29k32O3J33j24k82K69J91j95k07K78j86n3J77K17
5439B39l78J23O6j40m5L53k06j22J22J77l12m3K91p7k36K73nl69J71M44j18m84
5461b76L60j81k99K95M25l67k4J30k12j64M69Kj66o3J27j56j6J77K42m21nK54
5483A31k92Q0M05k39k94J22R8j52K01K67k57l34NK15j36M29p9j26l46M13l00N9
5505a30M09j9l74j41K66k3P7J29j94l69J06M79J15j44J3n19k93K00O23R4m0O1
5527C26o50k03K78J99M48o5j21m62k08N05J71n3O9j21l71kM86J32l21k60k06J20
$$ y = [306, -99, 177, -37, -120, -335, 112, 22, 106, 138, 169, -96, 50, 31, -57, 54, 264, -4, -180, 154, 96, -131, -212, 2, 69, -188, 155, 169, -164, -71, 36, -16, -23, 195, 142, -167, -2, 197, -224, -19, 125, 18, -212, 51, 98, -140, -29, 179, -154, -148, 117, 51, -351, -39, 190, -42, 21, 154, 30, -252, 17, 208, 13, -194, 84, -102, -155, 22, 239, -139, -16, 50, -90, -135, 218, 12, -110, 12, 189, -123, -166, 125, 48, -188, 85, 80, -289, -118, 326, 208, -276, 84, -97, -396, -101, 324, -43, -67, 63, -149, -313, 156, 158, -8, -71, 56, -100, -116, 61, 303, -118, -123, 131, -161, -81, 324, 85, -209, -87, 11, -141, 60, 327, 70, -264, -259, -44, -180, 249, 170, 44, -302, 111, -189, -130, 279, 260, -114, -255, 11, -12, 65, 194, 0, -369, -263, 216, 331, 187, 200, -319, -612, -412, 211, 305, 265, 326, -324, -527, -249, -50, 398, 333, 212, -250, -458, 47, 218, 165, 234, 113, -258, -260, 226, 358, 37, -223, -429, -309]
5549c09N81L19l6n63m80k25J73Q79L80j21l17o25m21J39O88L94K02m69l51l24
5569d86K55J86L64n2k39o9J42M8o8j05l88r3L38O01K38l22k45q40q1M47Q60M63
5591I54j50p38p93j47L24Q93L29r2m49m78m38O29K58p6J48n1j69L3K21j26m84
5612d02NK77J42M84M74m71j028l72J8N77J124M89n22j069n57j23K15J136O89n89
5632D97n07k67m60J64P59L48m47L3J79l61j36K58k78l90L42Q59j30O2r6j013o48
5653a232P91Q09K00M53k07j363r18P07O40M51Q91j92j361n69L52N6J11J001J12
5672G32q09J13M19p97l59O75k3k22P26P19j017n63Rl69q4J420O44p91k25k86j018
5693a106O3J355N69n69O7l5j449MJ290k7j17O08k22r90PP34n59j86J010J41n63
$$ y = [-309, 272, 591, 555, -8, -488, -713, -540, 339, 719, 598, 281, -344, -765, -626, 62, 456, 658, 189, -162, -486, -231, -45, 319, 267, 28, -41, 101, 149, 81, -24, -412, -505, -167, 434, 672, 350, 105, -735, -816, -369, 491, 954, 804, 66, -727, -874, -550, 343, 672, 580, 131, -347, -785, -156, 102, 26, 174, 123, -46, -13, 208, 82, -402, -397, -120, 22, 506, 980, 509, -519, -891, -873, -296, 828, 1317, 795, -274, -831, -954, -739, 397, 1086, 497, -10, -277, -737, -573, 186, 534, 87, 120, 299, -62, -198, 60, -218, -608, -266, 593, 463, 525, 429, -584, -1232, -441, 368, 568, 1021, 814, -549, -1467, -760, -120, 331, 1222, 1030, -331, -900, -548, -492, -381, 620, 732, -77, 36, 455, -342, -701, -26, -49, -271, 455, 1174, 157, -406, -397, -766, -850, 570, 1214, 423, 198, -88, -1106, -1043, 312, 881, 312, 379, 344, -1105, -1101, 189, 162, 45, 653, 431, -559, -552, 182, -377, -563, 447, 588, 25]
5714B5M13J30j281k98R70J20J6J092mj785m20N85k93N14J601j27j436j4o1p74
5734a027K48J508l85m94O32j14j111K75Q91p40k78J483r2j279N12L77j221L4J493
5753G12j62n98L74O9j456L45J226m25j08R38n23j488N11Q85m76J10J077o08j235
5772h32P80J86r91M09J385n54o53J061m00j447O21Q52p53J31J170l85j273N73
5790a20K46q23K02J483o78o05R99m86j341P15J113j047j40J317m98j310J152L56
5808E35j139L30J298r38p30J174j04j303Q92P74j042k47J143o04r48J006O65j366
5826f04L94J062j088m76J283k41j196Q31R30j196j81R74l52q36J103L31j183K58
5844a87R33p51j034J499K5j240Q58P55j155l55J344o19p87J098K31j288L11J147
$$ y = [25, 438, 568, -713, -1011, -41, 79, 95, 1187, 1183, -602, -1022, -437, -730, -216, 1385, 1258, -178, -192, -253, -1027, -779, 729, 344, -150, 482, 368, -743, -468, 423, -317, -595, 888, 796, -483, 29, 406, -815, -781, 712, 550, -48, 326, 395, -1061, -716, 510, 85, -23, 915, 392, -1096, -585, 300, -176, -66, 1011, 403, -832, -52, 134, -857, -448, 937, 383, -270, 791, 391, -1056, -435, 417, -336, -205, 965, 580, -693, -120, 126, -697, -495, 988, 310, -295, 704, 218, -1123, -408, 705, -342, -482, 835, 337, -973, 179, 535, -604, -274, 1024, 86, -644, 530, 426, -877, 15, 789, -253, -500, 643, 39, -909, 97, 762, -604, -210, 852, -236, -712, 571, 330, -866, -35, 895, -301, -482, 492, 140, -696, 407, 738, -445, -187, 746, -5, -1039, 460, 485, -755, 103, 858, -297, -652, 692, 73, -714, 384, 615, -673, -362, 785]
5862G85j089m27J344n7j298Q10O08j162l0J201m55q70J043L79j521L38J112o50
5880F1q17J299k08j150P07Q38j080k34J312n32j082J043L76j319N61J081q88o27
5898f59J267r9j406Q59O94q69k74J281m11r85P22M97j131M20R52p27o77P96J29
5917C79j258P36Q24q96l97J234m11q25P48L08j229L75J118o31m69Q74l5j225L44
5936d36J047o82j89J064o88j018Q51P03j016K88P64q97n94J101Rq27L82O85r27
5955c80j51R98M9q75M03K12r94J33J426p38m10P35k26r94P21P86o09l32O11l66
5975ap12Q96M55q44j71P48n21l06J021%j017k2O47n80N4J224m54j000K01M30m37
5996c89N33Q10n28p32J4R5k70M57R92p08o53N36l10n02O73M53p62M0P72k99l34
$$ y = [785, -304, -731, 613, 556, -742, 68, 676, -486, -516, 685, 230, -640, 403, 782, -739, -401, 711, 61, -756, 543, 335, -815, -108, 730, -350, -584, 728, 196, -886, 157, 533, -786, -225, 856, -32, -659, 608, 509, -897, -38, 656, -213, -487, 794, 383, -602, 120, 617, -514, -94, 858, 131, -546, 250, 379, -879, -143, 681, -215, -612, 622, 211, -614, 134, 442, -787, -412, 706, 75, -394, 480, 445, -780, -436, 611, -71, -260, 804, 116, -902, -51, 652, -364, -76, 688, -209, -803, 298, 307, -520, -138, 547, -380, -531, 467, 516, -359, 44, 256, -738, -605, 821, 83, -327, 408, 182, -812, -91, 695, 86, -246, 365, -1, -713, 183, 638, -206, -377, 371, -150, -456, 565, 565, -452, -474, 173, -407, -353, 871, 417, -583, -382, 48, -389, 144, 954, 426, -306, -292, -197, -467, -10, 982, 274, -379, 157, -153, -655, 18, 471, -291, -251, 521, 222, -112]
6017a12N35m18r37L29J023o3l1N34o90j469N65Q86p6N89L10j069q93N46N09k49
6037a81L58N96q22l91O56q2l98K10L46o64K28O41j11q04J31k7l22P13R61m13p31
6058a06l20k72l52J110Q88j59k84m40q73j52P14R34j71q5Kq23k43L97L49j75K52
6079A91O2k35J51P1l62o14J98L49N29L93J81r48o43k64K44P04R27J65q14p72k10
6100f97j19N03O82N26m60l34j73n12j2O26K70j27l5L72l78j99k12j92P7M88N62
6121F56k41Lm22q63k27O80Q29M81P9o97p30m32J82O87P21J87l38o14m57k2K69
6142b69K64J74K77j50k12k28n6l27J25J23O58K44o7m16n65k11jM92Q61J47k24
6163F39n09p05j59M27N52L32K58m45p65j85J15K35L47K65k12j25Q7k62l45J44
$$ y = [-112, 423, 5, -932, -603, 420, 357, 326, 860, 170, -1299, -734, 152, 76, 665, 975, -94, -987, -441, 68, -181, 177, 773, -49, -440, 216, 134, -264, -54, 292, -372, -144, 497, 386, -418, -287, -314, -636, 77, 1038, 625, -106, -426, -698, -1050, 60, 948, 789, 505, 65, -808, -960, -246, 688, 517, 432, 434, -389, -632, -235, 114, -61, 191, 253, 18, 169, 240, -122, -736, -538, -189, 340, 733, 914, -34, -677, -941, -697, 7, 934, 1099, 285, -487, -697, -816, -313, 369, 895, 435, 101, -72, -584, -596, 30, 300, 173, 138, 510, 132, -67, -279, -471, -394, 94, 656, 415, 418, -4, -867, -1094, -414, 415, 896, 975, 278, -452, -884, -702, -15, 706, 893, 555, -59, -516, -538, -269, -5, 169, 446, 296, 84, -144, -200, -527, -402, -279, 379, 623, 556, 140, -425, -636, -637, -145, 716, 863, 639, 130, -575, -734, -307, 245, 577, 835, 390, -375, -560, -445, -210, 137, 402, 190, 65, 152, -110, -455, -311]
6183c11K39L5L92K60l51l53j41l68K4O84N07j50l28J06p16k40O29N13N3j09l2
6204C43n92j79K30J98K4L92R5n31q3R8k97N3K46R9J48j84K87n68l51M08K16p9
6226b7L99K25n88l07K9o0n8O73M60n89l42K14l55j33M84K55k31J21n0k22j29K96
6248F5j73j99L05L24m81P1L27k12m47N09K98m70O4J87k15k87N99mm79L55K73o33
6270b23k6M39m5l91M11M6m54J02M96n60k00P00Rn94K53L64p30Q8P14j97o46O43
6292A99J1m03J26N58l60l93N33j62o37M87N30m92j52O94n66m63M49K30m39J03
6312a47N93m83k90L90O7p29N31M76m06k29O82k42o93N40L01n52R7P64n35m73M63
6333A25N6p85O15N30o60k86P64l43n54N28M43o58J90O06o66n37O77K21n45L28
$$ y = [-311, -72, -37, 355, 615, 264, -89, -230, -598, -574, 110, 617, 467, 139, 245, -471, -711, -82, 431, 484, 375, 343, -249, -428, -198, 0, 24, 416, 511, -20, -103, -5, -302, -249, -3, 96, 244, 60, 347, -221, -572, -164, 52, -27, 372, 597, 9, -298, -269, -329, -387, 286, 746, 157, -185, 29, -326, -459, 25, 280, 49, 170, 120, -102, -231, 65, -108, -307, -2, 322, -159, -88, 239, 27, -420, 89, 387, -83, -19, 168, -47, -334, 265, 261, -218, 137, 410, -223, -249, 190, 145, -246, 165, 211, -243, -141, 355, -205, -405, 295, 304, -290, -37, 327, -403, -315, 399, 202, -444, 199, 210, -193, -67, 491, 131, -262, 271, 109, -528, -41, 489, -3, -155, 539, -27, -490, -41, 189, -250, -147, 446, -37, -327, 63, 130, -599, -68, 408, 2, -227, 455, 213, -480, 60, 361, -191, -94, 670, 135, -338, 125, 181, -604, 11, 541, -119, -405, 359, 16, -538, -10, 433, -225, -35, 571, -95, -632, 45, 266, -279, 49]
6353D9N52o74l57O58m9q21O40N49p56J21N37m30o28P95R0n75K31Q28q19m91P53
6374B03j27o35Q21L78q18j05N95k64o94Q88L18r67K29O70n84n30R67j78o37L41
6394a29P08o85l20J031n51n97O17L15n48K33N14p66l86O98Q4p14O59L70p61k03
6414d31P44j65o58O86L32j044J72R45n38m42Q37l57p46O01O71p13k97R43n80p27
6434g67P92N84r10L73O01r16o50J034M8n81L54N70p09l59R92m07p53Q49J94q47
6454e08L45R69o45o17N98k14p04R16O63n39m36N10n60q39J094N99p63J2N99p91
6474c11l54P44K75p97L26O16p97J24O37l02j062R10L91p78M24N36q66n38P80L74
6494C32o24M91N58j091n44O72J83l84J262L04j329n19P30n47k51J026L79q26L70
$$ y = [49, 601, -73, -430, 228, 179, -642, -2, 547, -209, -88, 449, 19, -609, 186, 276, -299, -68, 760, -59, -550, 203, 76, -559, 262, 640, -178, -283, 312, 48, -646, 242, 560, -407, -178, 492, -92, -622, 345, 167, -470, -129, 579, -106, -426, 605, 54, -543, 74, 389, -159, 74, 588, -178, -564, 134, 218, -496, 163, 533, -228, -431, 313, 148, -510, 176, 508, -536, -364, 581, 43, -399, 438, 81, -665, -64, 607, -106, -403, 540, -40, -767, 25, 609, -301, 72, 673, -243, -893, 141, 189, -392, -38, 532, -177, -536, 456, 49, -704, 145, 339, -508, -163, 806, 161, -456, 142, -72, -776, 140, 803, 264, -172, 338, -222, -1061, 33, 632, -131, -119, 480, -311, -665, 79, 354, -443, -117, 499, -298, -174, 463, 161, -901, 9, 400, -378, 46, 582, -284, -822, -42, 332, -292, 199, 757, -334, -878, -206, -23, -407, 855, 1159, -170, -689, 41, -506, -757, 269, 648, -178, 192]
6513A92L84r03l57P36j75n49J163N89q67m00K65p11m51J271O20m59K73o1j123
6532e63m91J067L16m47P62L0j063o4O68k87m38Q86J39q85L33M12p50l16R00j62
6552D7m18P62K24j024KM74j54l6Q93K7j067l22L84n36K17J245J52p09L9j97q40
6573h37K48Q30L0j44N13k23j011J40N03m59j3Q79J84m51J61p8j093r3J000K15
6593C01L4N23k75j141p4N95k55K88O64k77o62j20M38m01J73O44j39m56L79j35
6613A04o12K41N01j72k49O95l85l84K07L5m98K65Q25k44m62J10r3n22M59P01j83
6634C39l05L64l31p15L10M65j68J83N46n49l95J96kj28M6N40k86j14L69l54m26
6655d15K10L22k53K05L68m05l72J08J63j48J59L80j20m06O9P1l12K32M13l66L5
$$ y = [192, 576, -327, -684, 52, -123, -672, 491, 1080, 213, -187, 78, -633, -1084, 187, 807, 348, 621, 560, -563, -1054, 13, 329, -118, 644, 674, -389, -453, 215, -72, -510, 376, 515, -370, -37, 375, -375, -691, 209, 47, -371, 391, 615, -409, -407, 67, -87, -123, 770, 797, -270, -592, -208, -744, -527, 718, 870, 161, 200, 3, -837, -589, 241, 271, 127, 640, 417, -594, -454, 49, -410, -423, 456, 640, 189, 350, 272, -821, -914, 86, 301, 335, 858, 583, -558, -632, -37, -292, -4, 660, 383, -279, -399, 39, -362, -189, 455, 316, -140, 239, 104, -508, -267, 234, 62, -187, 508, 123, -261, -54, -19, -517, -252, 573, 329, -133, -23, -116, -638, -179, 522, 339, 34, 398, 67, -648, -338, 127, -41, 142, 688, 139, -256, -60, -62, -190, -144, 396, 110, -4, 365, 11, -415, -205, 117, -136, 69, 437, 32, -340, -232, -69, -217, -58, 322, 202, -204, -135, -64, -376, -144, 269, -97, -62]
6676f2J68J3l12J87P6j56J74O0p8l18L17j29j91K67J50q7j17oN7j18O2O9o0n8
6700i2j1k5q2Q8J29L4K0J38k30r3K04j07P5J29O6k68r2N1M4P5O4j5j00r3k0J26
6726A5j03J04O4N7k67Q1R2j99r9J95P2n1K3n7j14l0J67J11n0J50R2l18k07J4J87
6751g1k1L66m2k94J09o7j66K49J67k10P4O5j35k27o5L14pO8R0r8k19j11L83p5
6775G7k39L29J76l18J9M1r8k00J82J72q9K30j27k03j23K15j80J71K13K6m05j55
6797b86K78j01k32N82o6m36L92j53k62J42L24J2k77L36q5m91L49k5j08n2M17m4
6819B14m79L08J32l22l4L62k21l4K04R0n28O2M22k93O6K52k2n57K35K05m49J41
6841b46P35l72k39J56n1k55J19M93k83k87M99j49l95K75J10l13J42L54l39k00
$$ y = [-62, 106, 119, -193, -6, 70, -86, 88, 148, 70, -248, 69, -60, -251, 16, 166, 79, -38, -44, 13, -105, -43, 26, -34, -92, -103, -128, -210, -122, 7, 41, 61, 199, -31, -124, 80, -27, 48, 177, 243, -25, -117, -66, -22, 53, 117, 102, 2, -91, -111, 15, -88, 16, 80, 137, -130, -49, 43, -156, -255, -60, 12, -39, -16, -73, -187, -217, -50, 61, 11, 161, 253, -65, -272, -258, -71, -92, 274, 232, -62, 47, -20, -186, 63, 230, 20, 94, 159, 24, -203, -268, 46, 39, 107, 197, 99, -120, -231, 152, 77, -162, 167, 343, 25, 44, 85, -13, -213, -31, 141, 52, 282, 155, -48, -171, 44, -136, 35, 248, 274, -131, -286, -8, -109, -341, 241, 175, -261, 131, -22, -284, -142, 182, 194, -83, 253, 168, -323, 26, 1, -107, -159, 258, 214, -265, 43, 175, -147, -181, 181, -40, -74, 130, 220, -308, -246, 176, -117, -51, 201, 179, -378, -143, 62, -387, -246, 489, 117, -122, 34, -17, -272, -153, 340, 57, -230, 269, 120, -275, 0, 110, -203, -61, 293, -46, -246]
6861b46N05o9m14k8N94k71k45L98j39m45L07L59n03O2P01m20m34M30J09n12J42
6882a19M69l22k77K84J25n58M13L18n35M6M29k07l45M97n9n03Q7M47k02j35M95
6903C48k61k56K35J85m26p0N78n09k15M75L83o42N1N53n00l44P43k3n94L44P9
6924A34n90m2R39k71l68J48J90o21L41M60j50m31O73l69n36N16M44m20j34O17
6944E30m98l58L92J91n61J03O39k32l41O66l48q87L28P31m29rP69l74q85J48L52
6965g3l09L61P32m08n61J15K16n46L52O03o34o2N40j98m29M54K7m45j3N56l16
6986c8j30M86j30o74M76M27k73k02J99m15m41N33P06m61J11K72o01n60N20M09
7006B14k86M92L66o76m42K55k55k53Q29K18m83L15L02o13o51L66J42k35N86P05
$$ y = [-246, 259, 190, -224, -252, 342, 71, -174, 224, 85, -360, -53, 306, -197, -135, 566, 146, -288, 142, 251, -261, -119, 350, 28, -249, 35, 160, -398, 15, 333, -202, -156, 273, 66, -279, 218, 159, -344, -257, 190, -12, -147, 348, 87, -169, 66, 251, -175, -245, 333, -176, -391, 84, 467, -175, -124, 429, -71, -415, 328, 305, -289, 55, 134, -456, -498, 441, 170, -198, -50, 140, -481, -140, 320, 170, -261, 412, 43, -493, 23, 467, 47, -87, 530, 32, -326, 66, 257, -304, -201, 438, 206, -135, 531, 183, -704, -376, 355, -74, -83, 686, 312, -573, -425, -73, -382, -21, 711, 303, -258, -143, 73, -473, -121, 482, -152, -214, 326, 128, -301, 153, 180, -265, -278, 278, -38, -168, 318, 188, -486, -10, 417, 144, -58, 141, -274, -715, -182, 524, 63, 174, 446, -155, -715, -195, 214, -72, 420, 786, 110, -332, -77, -332, -585, 244, 462, -21, 294, 596, -17, -668, -302, -160, -395, 191, 896]
7026H96o61l67K21o44j85O77N08k97j5K72n68m33N92K67n47K15N01n55j25N14
7046B66l3m75K54J00o00K62N25k56m19M76K26n17L25J67n12l17N13L01j63K97
7066D20J61q53k66M88j87R3O44J95p12j10J3l20pO75q6k25L99J52o23j97J64l5
7088b17k69O64L41m85J76J84m91m06M93M0k67M66K35p10J0M53j56k86L12Lm73
7109c83K21O11l41l09M70k46n28L12L17k82J78M40l57k48J17M8n06L11N16k76
7129F5o2L40k54m63K54J29j97K05K13J22m94K37l1l30R0L64k80l7K13O9j89J50
7151A14k9k12j06K86l00j10L10K73l00L8N0j60k9J46P8j52K30K62m09j60K19j55
7173a16j26M25J10k48J01N2k28k74L34K6k16L31J69l10k26J58j95p6L62K92l96
$$ y = [896, 235, -132, 89, -555, -740, -63, 445, 148, 133, 405, -163, -596, -4, 263, -284, -69, 432, -123, -248, 266, 233, -242, 12, 112, -488, -226, 299, 43, -376, 100, 326, -191, 134, 301, -211, -528, -15, 286, 123, 420, 581, -272, -538, -50, -237, -144, 500, 695, -17, -127, -114, -434, -441, 234, 148, -77, 322, 474, -149, -346, -182, -217, -486, 178, 519, 34, 210, 394, -97, -503, -10, 30, -237, 229, 464, -246, -236, 217, 61, -225, 87, 90, -383, -162, 449, 108, -201, 269, 23, -505, -193, 124, -158, 20, 460, 103, -145, -28, 20, -486, -175, 341, 65, 3, 343, 89, -374, -120, 9, -188, 17, 230, 352, -142, 95, 64, -266, -176, 188, -92, -129, 84, 153, -36, 114, 85, -127, -233, 53, -247, -357, -47, 226, -74, -36, 14, -146, -175, -29, 49, -103, 127, 389, -20, -180, 39, -116, -242, 183, 293, 45, 146, 198, -30, -304, 30, 56, -160, 171, 340, 30, -196, -38, -233, -309, 53, 345, -51]
7194e1j53K93l43j07N14L3j01j62R7j84k7K88N2r7J36r3k95M1K69j45k35M76l6
7217A70l01K13R1k72L4J7J91o6R7J88n05j15P7J9J52L11J07m59j22q7P1J91K82
7240B84j40k49J68j88j58K24k5R5Q0m1J81l04l1K8l6j29M36j37N5Qk25j61J09
7263a56J53L14j08lp8l19j44M02l9K19jk36j56J06K7j52K60j16K37k16ol4q9j51
7287b86J39L8N1J52lq8l3O0j01J05J00q9J48k76R5j02l1J88mL12m64K06l04N4
7311a33N0R8p5J08p3K8r7K1P7N9M0j48J88j56Q0n3j26J0R3R2J1J02j11j19M2J02
7337A10l30K62kj19N7J41j64oj8J49L6q4r6J47j06m1J17l2j49J12L5p3O2R8j37
7362c1j46M07j07j8J13p2l00O4J3O9r6J97P5k65Q9Q1j30J2m2O9l6J64j8l18J38
$$ y = [-51, -204, 89, -254, -361, 153, 186, 85, -77, 20, -164, -191, 97, 149, 52, 188, 95, -200, -159, 110, -35, -270, 206, 170, -131, 82, 173, -99, -65, -48, 143, 77, 174, 362, -143, -258, -181, -162, -10, 301, 408, -51, -173, -260, -189, 2, 284, 144, -105, 63, -125, -283, -59, -84, 11, 91, 50, 231, -73, -104, -76, -112, -241, 195, 58, 113, 121, -104, -265, -156, -3, 311, 203, 200, 122, -197, -341, 61, 22, 241, 240, 4, -152, -46, -19, -171, 89, -27, 210, -6, -12, -46, -135, -286, -147, -109, -58, 94, 91, 3, -30, 30, -71, 34, 134, 45, 193, -83, 12, -90, -121, 67, 63, 375, -89, 117, -187, -133, -83, 15, -60, 48, -25, 3, -94, -73, 4, 63, 103, -45, 143, -13, 67, 14, -112, -102, -9, 83, 94, 196, 85, -34, 8, 110, -220, 42, 40, -79, -22, 119, -45, -51, -69, 80, 116, 32, -64, 83, -23, -64, 53, 21, -128, -16, 19, -54, 8, 106, -31, -177, 230, 123, 105, 218, 146, -154, -90, -77, -8, -104, 93, 168, -97, -8, 73, -57, -45, -87, -18, -54, 110, 92, -226, -88]
7387h8N4J39j90J66M3l4j30M7j59k4L06j2M4J01n2k88k35K36J92PJ50j41l03q4
7411b55J63n2J52J58k8j96M9K0j46L1K20N4j93K6K02k39j37%qJ46J73J23k53J3
7435B3j19k60J09M54N5j91J19k67k69J44L65m5j6O0p8m02J47K54l30L24J42o1
7457A58j79m2o0k14J78K86o6P0K20k72l80J34MJ16O0K75l1l69J3l7j48J11L38
7480A65k18k1J57o8k97K50K70k17o9K03r0j26K44q1k93J96K9j18L7K2m8k22K74
7503b1K24j38J57Jm60k93K95K07o7L24K09m82j60J38Jj50K10J72j98J11j1j66
7525i7j38K20O9j91K43K13k79L4R8k77k13K78J53j45J84K44n02j33J94O6k65J47
7547i7K31l22K47%J70k26m5q5j51j17N95k18L3K64j24l50p1K11j88J32L51m3j58
$$ y = [-88, -34, 105, -85, 81, 124, 90, -40, 7, -152, -176, 130, 118, 162, 263, 211, -77, -312, -76, 116, 123, 273, 132, -171, -255, -92, -144, 8, 166, 138, -58, -9, 11, -135, -104, 116, 170, -23, 3, 205, -34, -171, -171, -179, -33, 140, 263, 10, 23, -96, -356, -247, 207, 262, 71, 190, -77, -346, -202, 163, 118, 102, 162, 84, -318, -171, 83, -247, 77, 219, 158, -21, -63, -123, -337, -159, 127, 61, 131, 351, 79, -301, -167, -163, -47, 13, 288, 257, -112, -99, -136, -284, -173, 165, -53, -74, 83, 15, -282, -32, 238, 21, -48, 155, 65, -61, 183, 102, -191, 5, 34, -84, -47, -25, -73, -295, -21, 203, 65, 222, 223, -237, -530, -235, -28, -95, 229, 438, -44, -204, -66, -65, -215, -5, 167, -31, 80, 69, -97, -235, -15, 54, -137, 106, 319, 40, 74, 172, -105, -318, -40, 113, -32, 152, 396, -106, -239, -45, 21, -244, -97, 134, -188, 59, 59, 229, 3, -42, -127, -278, -395, 200, -18, 15, 279, 155, -195, -266, -55, -243, -111, 240, 197, 39]
7570C9J10N5m66N3K03k4l7L85j07k71J97q3k99O8Q5K1O0L04p3k94k3K45l39N8
7594a33K44j66N0K51J36l51pQ1l84q8M09R7N8J01k6l12j81r2M1P1M55K44l80J0
7618A28j5m13L5O0J88n2L51J59k99k02Q9k87r8L42L29k58N1Q6n21J66K06O3j46
7641c8J14k04R6k12L61P2k87K07q1k83J91L28k61Q8J90k06k63Q3k7j61R6J53K94
7664B50r5P0J9o38m4J65M2K28M45n2l05k56J31l66K37L07J84n8o0k56j65K7J54
7687c6J74j30J99j01l8m7j02k33K33K97rj53M9k05k04J02J52J59J28K03n80k95
7709d37L00P0J26K38K79m64m07J42O7m8L17J55j03k87L8j14j27R5K00j62L96J72
7731D46l54k30O9r4k65M82K62j24j53j83p2n3K23K07K8l6K8l46j54J61L01k34
$$ y = [39, 149, 204, -262, -209, -6, -30, -67, 318, 211, -60, 137, 54, -245, -177, -92, -71, -11, 293, 220, -74, -97, 148, -191, -133, 111, -55, -5, 246, 382, 31, 24, 105, -279, -367, 42, 139, 197, 298, 272, -40, -221, -313, -272, -201, 254, 498, 118, 128, 113, -300, -265, -205, -17, -69, 282, 441, 142, -60, 29, -258, -356, -14, 315, 57, 108, 194, -327, -161, 45, 108, -38, 76, -128, -32, -244, 117, 189, -98, 109, 28, -255, -64, 264, 3, 91, 281, 75, -188, -105, -132, -293, -197, -44, 250, 155, 225, 244, -394, -438, -273, -231, -3, 442, 390, 85, -171, -40, -406, -169, 138, 322, 264, 204, -52, -217, -190, -36, 138, 8, 207, 106, 68, 21, -81, -314, -81, 216, 207, 54, 103, -102, -306, -204, -52, 107, 235, 438, -142, -437, -137, -67, 59, 297, 576, 112, -295, -153, -86, -134, 183, 338, 235, -52, -14, -128, -255, -160, 40, -122, 274, 446, 92, -138, -69, -163, -428, 54, 316, 192, 39, -144, -216, -269, -46, 161, 189, 153, 181, -165, -319, -158, 143, -91]
7753i1J30N0r8M4O0o5j85K29J6k19K71K0k22r7K26k04q3L58j12J08n52K61R3l8
7777a00K10P3n9k2k17j55J82J77j94N3J92r4k36K02J12k20L5K22r1j26J76o5j19
7800f4r8K01J18j96J51k7p4j43J00l5p7K92j26p0P0o2m0J26L9o0q6J02mj28R2
7825AO1j23oJ71r9q8J40j07j36K3J06R4k38L07Pk70P1L9o8J08J38j46L9J14M6
7850A84k08k4R4l8N1k5Q1j18k3J6pk5J09P0k14K31k30k6J7m9K2K06j0p0j70k1
7876a77M1J05K3M8J88k19%j05P2J2M4m4J82o1k39n6J46J37k02J86p8R6%J2k66
7901a55K6J25M1J50rj04j69M9j2j31K62K02j56k30J23r5k4R0K23r3J50j15k63
7924a15K3o7J52mM5J41j31j64o6K02j64J91M3k8Q6j25j37J4J39j53J81R0J81k95
$$ y = [-91, 39, 89, -9, 35, 95, 30, -155, 74, 90, -129, 142, 162, -60, -157, 69, -135, -218, 140, 28, 136, -416, -155, -62, -100, 110, 183, 124, 102, -115, -270, -88, 89, -105, -52, 140, 46, -190, 12, 124, -96, -61, 161, 70, -56, 120, 55, -64, -162, 39, 157, -39, 112, 85, 11, -132, -32, -67, -144, 148, 22, -48, 22, -40, -80, 46, 85, 25, -61, 41, 37, -91, 1, 62, -61, -67, 104, 5, -83, 57, -50, -186, -163, -57, 37, -201, 106, 113, -157, -86, -47, -115, -7, 131, -15, 24, 138, 184, -24, -48, 46, 8, 59, 34, 115, -3, -26, -10, -17, -42, 67, 137, -77, 154, -76, -102, -85, -134, -112, 94, 84, 14, -156, -177, -136, -31, -8, 40, 228, 9, 9, -96, -24, -12, 32, -12, 170, 109, -130, -186, -40, 97, -105, 81, 3, 99, 99, 111, -155, -129, -4, 37, 187, 178, 74, -95, -46, -58, -189, 73, 275, 119, -111, 12, -83, -107, -17, 206, 113, 263, 148, -115, -92, -159, -7, -11, 34, 175, 44, -120, -186, 16, -148, 43, 86, 58, 144, 19, -118, -104, 35, -118, 63, 153, 334, 39]
7948C9l6n9L7j36K16L3k28K09k32j9l5L14Q7k40K41j09k89K81N7l62J82K29N2
7971B32j77j77L22k60J74Q3k45r6L26j56j59j2J93q7j35L66k02k41J97K09k59
7992a04j41L44r2j46R9J33k23J50M17m00m9Lk8j40L75j3l22J14J22k27O0J94n9
8015F7j52J38J06r6j38K51j95j66K64m8k58K55O2o6j33K63j55j72M5J45Mj89L35
8038A67j72j1R2J77n09J37K25j81M4K45K1m69J43k5j11nM58j83P3J12k49j78o6
8061b65J96N6k18O22J05o04Q8j06k87J27M19P3L9o8j40l39J39K81k77J99J33J8
8083A91n29K70K30l52K01K25j33m10K08J82k18M9L92k32M5o6O0m41J80O8J20L00
8105C40O6k35n47L11k00lK62L84O7l64p7k57k63L09L60o2J76P3k74k32J15j56
$$ y = [39, 3, -56, -19, -155, 61, 94, -134, 75, -157, -176, -211, 103, 190, -50, 191, 82, -207, 74, 131, -231, -49, 180, 232, 55, -122, 200, -60, 114, 197, -48, -144, 182, 26, -133, -145, 48, -39, -174, 192, -10, -251, -54, 155, -104, -245, 99, 7, -139, -40, 93, -130, 20, 437, 37, -12, -9, -37, -177, 198, 185, -137, -23, 99, -128, -68, 126, 67, -85, 53, 159, 63, -75, 176, -19, -185, 79, 31, -227, 28, 90, 24, -109, 154, -1, -173, -128, 17, 21, -168, 167, -5, -16, 76, 253, -256, -119, 106, -75, -31, 214, 235, -234, -91, -116, -227, -232, 226, 43, 116, 228, -21, -199, -265, -69, -13, -231, 391, 496, -108, -20, -126, -413, -286, 133, 206, 245, 177, 37, -302, -163, 118, -159, 40, 173, 191, -338, -68, 162, -190, 11, 236, 103, -307, -99, 83, -135, -86, 306, 74, 119, 53, 113, -328, -148, -80, 40, 340, 406, 171, -376, -65, -265, -268, -6, 378, 445, 81, 4, -253, -516, -207, 153, 91, 267, 340, 66, -166, -51, -207]
8127b07m5J33K49J42n2K9k75l74J51K67q9K07K19k88m39J84K71o4K19J27m85j71
8149b91K82J07j82K93K19l39l57K56p0j24K16K34j75K4K42m51l24L16M4k3M57
8170C54J9j23l93L7j49j88M26M10j90N8j4m32j21J14J45K1K26J00l32j79L47
$$ y = [-207, -252, -119, 130, 272, 220, 249, -26, -400, -249, 18, -71, 136, 355, 67, -372, -188, 83, 19, 238, 365, -120, -291, -9, 98, -84, 209, 428, 89, -268, -12, -82, -206, 10, 244, 69, 93, 335, -116, -440, -124, -80, -103, 354, 373, 250, -143, -106, -255, -443, -17, 393, 203, 261, 247, -185, -306, -192, -47, -26, 200, 300, -32, -211, 136]
8191A36
$$ Imaginary data points
##PAGE= N=2
##DATA TABLE= (X++(I..I)), XYDATA
0@%%%%%%Qj6J6j6J6k4M0m8N6p2Q9j13J37j62J96k37K84l39L99m64N41o30P27q32
30d44R53j090J242j408J589j791K016k262K530k822L145l502L888m307M764n265
46b764N815o415P067p786Q580r453J0420j1489J2683j4032J5561j7306J9322k1683
60a1480K4498k7920L2178l7647M4973n5348P1264r9034J61102n41475J12921Q34348
72E08380n72379K65781N14102p28967p00285P21357J24809n65387M37091N65184
82E69686o82455j53639P18004k60531o90103M67374K29242o18668K66795P82683
92F28388m52707n00066M84376p8712o27562N01050N98747o03852k70449N57644
102B36857k39791m46290O65897L45356p38012j00211M45761m09112k15230Q05420
$$ y = [0, 0, 0, 0, 0, 0, 0, 8, -8, 8, -8, 8, -16, 24, -24, 32, -40, 49, -64, 73, -89, 107, -130, 154, -185, 214, -250, 291, -339, 388, -444, 509, -581, 661, -747, 842, -949, 1067, -1195, 1335, -1487, 1658, -1844, 2044, -2263, 2501, -2764, 3051, -3364, 3703, -4083, 4497, -4956, 5464, -6025, 6658, -7374, 8187, -9119, 10203, -11480, 13018, -14902, 17276, -20371, 24602, -30746, 40518, -58516, 102586, -438889, -325968, 508380, -63999, 201782, 715884, -13083, -713368, 7989, 132798, -432589, 4502, 569686, -112769, -266408, 451596, 191065, -499038, -31664, 197578, -421090, -154295, 628388, 175681, -324385, 159991, 81279, -546283, -45233, 553514, -50338, -320787, 236857, -2934, -449224, 216673, 562029, -175983, -276194, 169567, -239545, -454775, 350645]
112C50645J45231o53499J50445K80297o12323r3654P07137j24704m57685M86111
122A78001K34353o00926O2428M48381n00833l63638O34847J72143l99449L48656
132B13963K90415p10086k92247N29676n2822k49775N54453K04573o48864o7906
142b28620M00407k97127j91937N44616K2703n09862K16881L38799l98846q6622
152a89608M44883k10724m01182L96147K31041m17970P3322L61702l59738k55200
162c27327M80793O6790m16444J85180K34829m30821o2649N16245o6537l35036
172a54977K59719N7418m70924Q9153M51214j75559j75656L41082p3833m29615
182b81978J91390K81011l00043l7622L73133j43805k87612K94746J11627l86398
$$ y = [350645, 495876, -157623, -7178, 273119, -339204, -432858, 274279, 149575, -308110, 178001, 412354, -188572, -126144, 322237, -178596, -542234, 92613, 264756, -134693, 213963, 504378, -205708, -497955, 31721, -21101, -270876, 283577, 488150, -160714, -228620, 171787, -125340, -317277, 227339, 250042, -259820, -42939, 295860, -102986, -189608, 255275, 44551, -356631, 39516, 270557, -147413, -74091, 287611, -72127, -327327, 153466, 220256, -196188, -11008, 223821, -207000, -269649, 246596, 180059, -154977, 104742, 162160, -308764, -219611, 231603, 56044, -119612, 221470, 147637, -281978, -90588, 190423, -109620, -147242, 225891, 82086, -205526, 89220, 200847, -185551]
192a85551L9779L05068k08863j26755L73254P73l69119J09210J85373k73374p810
203a58015L70163r0326k75326J91373P7284k93190Q4737K93856j84281j63725
213a47450K48849j8248k60047J69811J91549k53676n3873K60562j05082j98843
223a66448K26833Q3895k73683M9178K31382j66236j16795K41795k1011k50010
233a61100J27280J67648j92829k2386K24129j04661j91489J71146P8608j93854
243i7508O3105J80936j56857j09300J88963j0278j76491J21234J20343j81140
253e6993k5938J84156p6498j37980J50719N2765j79575M1619J54067j17332q1849
264i2839J57807j0085j53845Q9140J02686j35784j9862J43682o1627j09248J17942
$$ y = [-185551, -145772, 159296, -49567, -176322, 196932, 197705, -171414, -62204, 123169, -150205, -158015, 212148, 121822, -153504, 37869, 115153, -178037, -93300, 200556, 16275, -147450, 101399, 83151, -176896, -7085, 184464, -69212, -123085, 137477, 32395, -166448, 60385, 144280, -129403, -80225, 151157, -15079, -131874, 109921, 88910, -161100, -33820, 133828, -59001, -81387, 142742, 38081, -153408, 17738, 96346, -97508, -34403, 146533, -10324, -119624, 69339, 59061, -117430, 3804, 124147, -56993, -82931, 101225, 24727, -113253, 37466, 90231, -89344, -47725, 106342, -10990, -92839, 64968, 54883, -98962, -9822, 92864, -42920, -62782, 80900, 19273, -89975, 27967]
275B7967M2052j34945L6778J12236r9204n7524J27932j2520j16488P6428P1640
286G4352j15959j0467J17230n1183q3835R5988L0031j11131K5812Q9730p2366
297a1798m4053R7026o683q8928N0401N3253p8160o525Q2040l4630n7496O3728
309A8175J7964p2779K1950N8447n2026k7475O5523q021n8098L8127L3794n6315
321b0734m862N4513k3455l7167M3242J4394m7533Q671L4388k9739j6702L9306
333A4322K204k9876J5251J3086k9721k758K8365m160j1248J7493o26k5014K259
346a0423J4821o307o25J4221k941j3543K124M574n886k898M151L465K216K004
360D953K689k731j5224j1266J2165J4442K158J0848M484l0038k3793J6413J3757
$$ y = [27967, 70019, -64926, -28148, 84088, -15116, -72640, 55292, 42772, -73716, 2712, 74352, -41607, -52074, 65156, 13973, -69862, 26126, 56157, -54974, -29162, 60568, -11798, -55851, 41175, 34492, -54436, -4035, 49218, -28942, -35467, 46573, 11943, -45553, 18175, 36139, -36640, -14690, 43757, -8269, -35744, 29779, 21758, -36340, 1787, 35581, -20734, -25596, 28917, 5462, -31705, 11537, 25931, -21602, -12931, 21457, -8282, -24984, 14322, 16526, -13350, 1901, 14987, -14734, -17492, 10873, 6713, -4535, 12958, 12332, -12682, -10423, 4398, -1909, -2534, 11687, 8746, -4797, -2673, 1901, -3985, -6883, -2732, 733, 2949, 4953, 7642, 4911, -10313, -21579, -9414, 5028, 7186, 18034, 22518, -7520, -31313, -14900, -1143]
373a143O53K4659J1922l8494k3572J8046j412n719L5067J2067l8334l813K3123
386A3050k2763j5331L4948j600l2583L0309L3755l9036j9199K4979k9021k8652
398e1144O4242M2883m2514q997J2667o1399k5848Q2548L6602l6449J6265N273
410C4129q2524j7018P9571P251l1095M6318M500q0956O757O2559l8483l1425O4908
423B4492J005n7464M7004M3422q2979l4874O2223j2770k3027R1769K8065j08275
435b1409l1024M1097l9002O701J22819J3314j04575q281J6750p1290K1702J23344
447G0146j0859p6690L7270L790q9886K7263Q8422n4288m3900Q8261P381p7953
459c1043M1501L5202j09110k2367J15701Q587m0446P1420r986j46433n689J06403
$$ y = [-1143, -490, 24169, 36091, -2403, -25975, -7929, -9341, -15060, 20007, 32074, -6260, -10073, 13050, -9713, -25044, 9904, 8304, -24279, 6030, 39785, 749, -18450, 6529, -22492, -51144, 13098, 55981, 13467, 4470, 17137, -44262, -70110, 12438, 49040, 12591, 28856, 34129, -48395, -65413, 14158, 21409, -9686, 36632, 41132, -39824, -33067, 29492, -8991, -40416, 24492, 25497, -31967, 15037, 58459, -24520, -59394, 2829, -9941, -32968, 58801, 86866, -21409, -52433, -11336, -50338, -43637, 79182, 92496, -12079, -20360, -3610, -74900, -53198, 70146, 59287, -17403, 19867, 23657, -66229, -38966, 49456, -4832, -48732, 39529, 46910, -31043, 10458, 45660, -63450, -85817, 29884, 38471, -1975, 69445, 59459, -86974, -92663, 13740]
471A3740j0719n86R9498l9944j45765K1523P5543m4047K5463J05196o2250j11385
483g3733N8989L8098p4473L9584Q7307p8099n5304R7309R51r6896M0289M8348
495C2370q7284J2770J33763k3878r9022L1314j2299j04175O7064J53404k9899
506G4128o2864L9566o8447j23543Q3348J23909m3854l989P3114q3670j07052Q4298
518a5056M9347q6837L0992R1964o8738m0767J04401j8840j25860L4613O5239o5085
530d4627K9290J26798n5496j21009M3973K1765p2841O9676J14291q5228q8491
541f1899O2829p821o2559R8659Q0865j11500n4223O5898m2095m6384J18863M9211
553H9844j06237j4O4711p8718m4499J01175l600q8174P0939Q2459p8098k2543
$$ y = [13740, 3021, 2435, 101933, 61989, -83776, -62253, 13290, -30757, -5294, 99902, 37652, -73733, -14744, 23354, -51119, -11535, 75772, -2327, -57631, 39678, 40629, -56267, -15978, 32370, -54914, -42144, 91619, 67741, -31281, 33, -12266, -116441, -49377, 104027, 74128, 11264, 50830, -17617, -141160, -57812, 66097, 22243, 18254, 91368, 7698, -99354, -15056, 34291, -52546, -21554, 70410, 1672, -39095, 65306, 46466, -79394, -44781, 20458, -44627, -15337, 111461, 55965, -65044, -21071, 694, -72147, -2471, 111820, 26592, -61899, 930, -6891, -69450, 29209, 110074, -1426, -55649, 10249, -31846, -78230, 40633, 89844, -16393, -16407, 48304, -30414, -74913, 26262, 22662, -65512, 5427, 87886, 9788, -12755]
565a2755O2379q2812r3670J04467Q2605m7091M0396N3322j30264r3857Q8041K7059
577b180m1050R0847O0011j16051m1144P8626l9358o1543Q6646K8067r1857L3674
589a5312R1850o2641n2141O8089k7483q7791P1086Q0517o8485j3920O9272n4795
601a754o7359Q7024L8867q7782P538N7589o5949k3144J11256J0720q8048K0924
613a18K1157r1969L709J13747p866n3620N8558J629j02782J3339P3930n2029k8092
626e0407R1402M205o9129M6215L4432r8368k6358P8118j5436k9066Q9408K2904
638G7920r9074q093M6605n5882j8000R4873N612p0912L4553L6124p1575p833P0737
651C5055l3265n5175O1289K7743o0059K2750N5508o0005m2658O1778j089n4149
$$ y = [-12755, 49624, -33188, -126858, -22391, 60214, 13123, 53519, 106841, -23423, -117280, -29239, -2180, -43230, 47617, 107628, -8423, -49567, 29059, -10299, -71842, 14804, 42871, -48986, -15312, 76538, 13897, -38244, 29845, 2362, -85429, -14343, 66174, -2311, -16231, 53041, -1754, -69113, 17911, 56778, -31004, -23466, 34123, -31826, -54970, 56286, 67006, -21042, -118, 21039, -70930, -67221, 46526, 38660, -14960, 43598, 45227, -57555, -44216, 29714, -22315, -50407, 40995, 45200, -23929, 22286, 56718, -41650, -68008, 10110, -5326, -34392, 55016, 77920, -21154, -29247, 17358, -38524, -56524, 38349, 43961, -26951, 7602, 43726, -27849, -35682, 35055, 1790, -53385, 7904, 35647, -24412, -1662, 53846, -6159, -48817, 12961, 11872, -42277]
663d2277M7289M4439o2667j0810O2253k8859n1166N0602J5673o4052K1751O3809
675D5985l8211k8905N2615j6400o7248L5209M5420m4835K018O0345l1240n2293
687c7540M2804J4484n6147J9279N3351l7855k3994N4884o596n5555K8481L0798
699B6394m9147k482N7027j8575l8247M0486J1400n4617R908M3648l2294k0676
711b7175M9455j315m6142K4269K7620m3926p036M6031j6732l2762L8539J5057
723B5883m4420Q675L5585l2923k1380M3108J712l6894K4751K5150m1278r270L9283
736A7982j4240k7722L5079J2955m0906N711L2096k5988j7183L7188j404l5368
748b1800J9230K3118l1041m592L3859j4937k6897K7937J2645l1155P287K6901
$$ y = [-42277, 5012, 49451, -13216, -24026, 38227, 9368, -41798, 8804, 24477, -39575, -17824, 45985, 7774, -21131, 31484, 15084, -52164, -16955, 28465, -16370, -14352, 45993, 14753, -37540, 5264, 19748, -36399, -17120, 36231, -1624, -25618, 29266, 22670, -32885, -4404, 26394, -22753, -25235, 31792, 13217, -25030, 15456, 26856, -27761, -17853, 25795, -6499, -27175, 22280, 20965, -25177, -908, 26712, -17214, -24250, 21781, 5049, -27713, 10826, 25883, -18537, -9862, 25723, -7200, -28580, 14528, 16240, -20654, 4097, 29247, -12031, -21301, 17982, 3742, -23980, 11099, 24054, -16852, -11141, 20955, -5033, -22216, 14972, 13568, -21800, -2570, 20548, -10493, -15085, 18774, 3837, -23060, 4877, 17522, -13633, -6346, 20555]
760B0555k4274j6705L1575J720k7527J6305J7517k9160n937L0435q130k1288K1854
773F940P872k9299M742K5098j6256j3301K4099j383k5113J4016J8023k1512m922
786a0996K2729r843j8232K0850R796k2844L153J8276j6387j0812K3223J962k0375
799i500J0129J2283k0020m217K1013n420j4994J5264O653j9804K008J5839j1835
812b601r128J7597J929j5848P953R977j6168m321J6345l186j0313J3019N851j6421
826e315o12J1805q964n837J5772L092j3179L964O112j3935l760J4963N82p216
840b528R082J967j6099k236J0525l229j628J2841K14j3459P46M587p847P14J2787
855F437n90p527N655J493j1345p00Q074l022j057J0880J833j0617k428N30p032
$$ y = [20555, -3719, -20424, 11151, 12871, -14656, 1649, 19166, -9994, -15931, 14504, 6374, -14914, 6940, 14812, -14487, -9745, 15353, -903, -14204, 9895, 8512, -16601, -2585, 15438, -6074, -10996, 11733, 1890, -16342, 4508, 14304, -8540, -5387, 12889, -3498, -14310, 8913, 10875, -9500, 629, 12912, -7108, -11325, 9688, 4268, -10726, 4538, 11191, -8613, -6605, 9234, -2601, -11729, 5868, 7797, -8051, -98, 9879, -6289, -10610, 5735, 2549, -7764, 5255, 11106, -5315, -5927, 5878, -3086, -8923, 6849, 9941, -3238, 726, 6838, -7097, -10857, 4106, 4688, -2528, 6554, 8521, -7578, -9814, 711, -2518, -4146, 8695, 8909, -4550, -3804, 783, -7064, -6350, 6437, 5847, -1680, 3975, 5468, -5877, -6577, 1497, -1525, -2582, 8298, 10131, -486, -2914, -2384, -9416]
870i416K285J3993L801o126j730m905j0550J862J2304M389l49J898n786j0667
884h997M75O789J066K411N651k669o112Q58L13m928L24N969K163J126L781l009
900E211j0290m732K460L812Q174Q288k353j1055q770l019K425J0027J0473R26
914A1577p141p444n916q83O519P233K294r61k261l368k751K63O34l47K078M577
930D103L018o74m410o732n282J085P649R686M392m782j0107r400k516O541J1658
945D229Q141j546p895q875n515K595Q294O665J173k250l672m298o07J846K52R3
961a370K831K871P92l30l180p590l987M050P293O360L848m674j2199p660K313
976a0632O772Q643P672k211j1283p739j91K642O509Q089k22o286l197p18j860
$$ y = [-9416, -7131, 6862, 10663, 4537, 2807, -2098, -12648, -10786, 1518, 5907, 5558, 7456, 1670, -8997, -8522, -1733, -667, 1744, 7395, 4726, -1386, -528, -215, -5143, -4819, 1150, 3313, 4439, 8220, 5211, -5079, -9811, -7351, -3539, 4635, 12923, 10570, -485, -9255, -12274, -9849, 178, 10651, 11577, 4436, -3008, -8924, -9807, -3288, 3945, 6239, 5278, 3017, -351, -3102, -2839, -2205, -2552, -474, 4103, 7121, 6447, 2037, -4695, -9977, -8892, -1243, 8443, 12835, 8053, -2054, -11454, -13970, -7429, 4229, 12370, 10824, 2929, -5946, -11461, -8866, -572, 6093, 7266, 5016, 1344, -2954, -3561, -1715, -1463, -1370, 1461, 4332, 5124, 4794, 1614, -5976, -9963, -5913, 1380, 7740, 11588, 6914, -5285, -12945, -10632, -3860, 4783, 12455, 10244, -1039, -8778, -8969, -6327, 182, 8271, 8049, 1763, -1434, -2152, -4012]
991d012J567L977m82j100L761J736l996k855k090m069J955R537N369k794l878
1006B626o683q040J866J1052O960M34j527o921r868K52Q437M337J722K482m225
1021B904o881N99L230j293O63L407j082j668L868K30o325k144J997n79K565P383
1037F874m76p947l158K59j355M561Q566r99p124k101j282k078N471P886j825m880
1053C92j88k506l283M483N373k269j407K958k423l684K526K26m664J680N915o3
1069C066j296K233m075p733J263N942Q99K474M599m543p696R15K267j433L457
1084C39N190l055m065L133N0l935K102K469m265n75N364n58k740K646rn672L78
1101c203M548j861j969M532j39m431K377L295m208k271L423j173k592N280L426
$$ y = [-4012, -2445, 1532, 1050, -50, 3711, 5447, 1451, -1404, -3494, -7563, -5608, 3929, 9298, 6504, 2626, -4057, -12097, -10231, 821, 7781, 8215, 6688, -233, -10101, -9849, -1412, 2925, 4647, 7129, 2904, -3977, -3378, -148, -1441, -778, 2629, 1547, -121, 3747, 3977, -2348, -4492, -2495, -3074, -509, 6874, 6398, -1549, -4707, -4448, -5803, -1242, 7324, 6325, -799, -2900, -4182, -6260, -789, 7097, 5272, 392, 204, -2302, -5585, -1102, 4271, 2002, 595, 3553, 1130, -2554, -28, 198, -4466, -2786, 3129, 3066, 1770, 4003, -72, -7805, -6542, -600, 299, 2773, 7372, 2829, -4867, -3952, -1685, -3118, 339, 5529, 2474, -1591, 1542, 1592, -2343, -241, 2228, -2037, -2612, 2752, 2194, -546, 2100, 2091, -3581, -3203, 1345, -516, -2485, 2047, 1908, -2523, -146, 3149, -1059, -3330, 93, -1080, -3672, 1608, 5034]
1116E034l746r69J760m341k835N161K132k265K688K308n201k369L097j601k922
1131d069M442K645l564O44L583m146l530L496J81l579K996M384k878r72L218k231
1147F20m779L096J934k887K070M487k665k654K708r78m324J867L127k776M25M547
1163C818j155m223J691J1m732J217N224p25j454L229j239n471J169L111j842J04
1179a267M558j318l738K540J214l566N26L072k504j562M150N79l567J258J277
1194A652l665n24M267o38k693K198N57l776J323L429k113k112K270n72k347K912
1210A68L084k600j601J737j696j717L579J745k345j39J507k608q48L080j73k675
1226a502J429J282k305L50K974j984k732J698O75j546J818K492k627k054J473
$$ y = [5034, 1288, 319, 2079, -2262, -5097, 64, 2196, -69, 2619, 4927, -274, -2643, 454, -1147, -4069, 373, 3018, -546, 98, 3681, -465, -3995, -499, -318, -3897, -901, 3483, 605, -367, 2851, 620, -4159, -1063, 871, -2016, 54, 4541, 1876, -778, 1930, 952, -3372, -1505, 1622, -1154, -729, 3818, 2663, -1560, 131, 142, -4590, -3373, 1851, 1126, -328, 2901, 1662, -3809, -2640, 471, -1371, -1267, 3291, 1973, -1765, 775, 1989, -1577, -1051, 2021, -483, -2045, 2105, 2684, -883, 375, 1652, -2013, -2537, 1730, 1092, -1601, 597, 1154, -2622, -1299, 2130, 17, -2095, 175, -397, -2744, 168, 3252, 652, -949, 788, -908, -2625, 954, 2699, 354, 215, 1722, -886, -1734, 1346, 1173, -1502, -73, 1209, -1096, -746, 2228, 244, -2488, -790, -115, -1661, 157, 2649, 22, -2032, -559]
1241e59O5j109K473J463k577m45J466j119p12K503mk143N24J356j152L1J483j457
1259H7k154J484J303j117R12J158k343j755J694K49m76J568Q43j892m79R46n52
1276e24m77J462M92j383J006P88j285k38Q05r52p65K032O51j408K00K61k060k90
1294a685J948N49j024Q69k21k235J86J403j37QJ686n88j793N98M13j132Q60J894
1312A599n79q20O53m73j785O97J593p02L97J539j504j846N79K63j262J555J785
1329A689r42j262P02j150j664J644J710o09N45J133k096j807J149O02k72K145
1345A517J559k393j240M87j167p45K876J650j460l70L72k256j411K206O91p88
1361d72J595J025k285j469Q04r23q05L117J361j042J8J25l149q95K785J438j41
$$ y = [-559, -494, -1603, 870, 2333, -244, -689, 777, -342, -1054, 1449, 1445, -698, -174, 1182, 30, 61, 1544, 87, -2067, -583, 720, -397, 515, 1673, -670, -2425, -731, -482, -958, 610, 1453, -439, -918, 28, -524, -1001, 461, 953, -430, 576, 1364, 79, -159, 646, -306, -1071, 961, 1612, 204, 404, 665, -1395, -1685, 263, 812, -212, 657, 436, -1799, -1613, -210, -347, -339, 1347, 759, -1034, -436, -23, -1155, -295, 1599, 1020, 200, 853, 380, -1405, -708, 885, 183, 580, 2119, 615, -1231, -652, -389, -1651, -96, 1689, 747, -515, 187, -963, -2627, -983, 727, 118, 663, 1796, -300, -2107, -958, -356, -628, 1517, 3076, 683, -557, -70, -1237, -1982, 894, 2544, 1084, 714, 1086, -1170, -2581, -375, 316, -472, 1123, 2148, -137, -1606, -802, -1725, -2530, 587, 1948, 906, 924, 1049, -2100, -2995, -210, 1228, 1087]
1378A087J571l24l476j247K019j21N91K327k7k968n68J020j357J59K453j65j533
1395e59J034J82k209l54J490k92J7K625J76k629n37J06j307J191L743L63j875
1412A165n62j251k523J298L543O35p84M36j750k882Q77J757k43M67J542r64j835
1429a074O67K96k097O58J968M2K75J302j449k659k7J382N14J621K139j835k858
1446a135m28K69q1K374K046j338k049n14m74m56J627J447q61o62N26q16q78Q83
1464e20R9r10J094J495k86n74j31j550q98J481J956L99J76m78k185j477J273J689
1482F53P12N77m63j826j417N05Q35N13Q27l19p83n31J42K5j73M39K02RN83K90
1502H00m26o64n30j60Q24J052O93k13j104j093m64O56J236J001k07j052j124k66
$$ y = [1087, 2658, 2334, -1142, -2389, -370, -491, 100, 2427, 2400, -568, -1136, -116, -1473, -1314, 1139, 974, -559, 475, 657, -1552, -1906, -416, -708, -691, 1934, 2110, -519, -1056, -950, -2257, -1066, 2677, 3040, 1165, 603, -648, -3171, -1873, 1670, 2305, 1521, 1957, 207, -2675, -1798, -41, -284, 183, 1725, 761, -1074, -407, -111, -2208, -1550, 418, 460, 735, 2037, 588, -2071, -2098, -716, -202, 1419, 3558, 1723, -1135, -1563, -1294, -1375, 999, 3045, 1707, -342, -856, -1330, -1786, -159, 1288, 427, -235, 291, -525, -1403, -520, -421, -1331, -237, 1258, 972, 398, 267, -1283, -2181, -700, 1256, 1655, 1831, 1353, -832, -2309, -1036, 653, 1365, 1942, 1479, -347, -1764, -1259, -424, 89, 916, 597, -186, -717, -575, -550, -723, -284, -82, -73, 510, 800, 374, -290, -820, -980, -156, 896, 1589, 1376, 272, -821, -1285, -629, 607, 1608, 1401, 349, -775, -1041]
1520a041K24O51N39J61n96n66jO1O2N87M0k98NM96Jl75J58j87k74N06Q43l25l58
1543C13J25m91n40O81O45m39o4M02j079n04R90J64n90L23L82j015m42J121J02
1562H4n64O59L20j290O0J305o63k62J240j14j144L53Q86j069m2J383n79j186Q59
1581B36L81j353M75J252j104j092J655j91j625J200J043j757J3J683o42j153J300
$$ y = [-1041, -817, -166, 373, 534, -62, -628, -629, -568, -506, 81, 121, -177, -172, 324, 325, -50, 108, -79, -353, 153, 996, 671, 313, 438, -53, -593, 88, 733, 294, 230, 632, -447, -951, 39, 203, -387, -64, 318, -697, -1139, -18, 84, -480, 179, 499, -791, -731, 574, -89, -351, 889, 775, -369, -16, 870, -199, -241, 1142, 563, -623, 236, 617, -736, -261, 991, -113, -1205, 450, 259, -1366, -166, 877, -880, -867, 816, 174, -979, 321]
$$ [...]
8191f
##END NTUPLES=NMR FID
##END=
