##TITLE=1H_AM_NV_BENZIL
 
 8 sc, 
 12.04.2022
##JCAMPDX= 6.0         $$ Bruker NMR JCAMP-DX V2.0
##DATA TYPE= NMR FID
##DATA CLASS= NTUPLES
##ORIGIN= UXNMR, Bruker Analytische Messtechnik GmbH
##OWNER= root
$$ XWIN-NMR		Version 3.5
$$ Tue Apr 12 10:36:43 2022 Russian Standard Time (UT+4h)  she@DPX200
##.OBSERVE FREQUENCY= 200.13135
##.OBSERVE NUCLEUS= ^1H
##.DELAY= (6, 6)
##.ACQUISITION MODE= SIMULTANEOUS
##.ACQUISITION SCHEME= undefined
##.AVERAGES= 8
##.DIGITISER RES= 18
##SPECTROMETER/DATA SYSTEM= spect
##.PULSE SEQUENCE= zg30
##.SOLVENT NAME= CD2Cl2
##.SHIFT REFERENCE= (INTERNAL, CD2Cl2, 0, 15.7039)
##AUDIT TRAIL= $$ (NUMBER, WHEN, WHO, WHERE, WHAT)
$$ ##TITLE= Audit trail, XWIN-NMR		Version 3.5
$$ ##JCAMPDX= 5.01
$$ ##ORIGIN= Bruker BioSpin GmbH
$$ ##OWNER= she
$$ F:/spectra/data/she/nmr/H-F/1/audita.txt
$$ ##AUDIT TRAIL=  $$ (NUMBER, WHEN, WHO, WHERE, WHAT)
(   1,<2022-04-12 10:35:04.20 +0400>,<she>,<DPX200>,
      <created by zg, POWCHK disabled, PULCHK disabled
       configuration hash MD5:
       00 E9 B6 7A A2 85 ED C7 34 08 36 98 17 FE 4E 26
       data hash MD5: 16K
       2A 07 C2 B3 06 13 67 DD F0 4B C3 EC 73 AA C1 B3>)
$$ ##END=
$$ 
$$ hash MD5
$$ EE BB 31 4D F5 84 A4 17 C9 96 4E A9 7A 84 48 A9
##$RELAX= 
##$RELAX= 
##$RELAX= 
##$RELAX= 
##$RELAX= 
##$RELAX= 
$$ Bruker specific parameters
$$ --------------------------
##$DU= <F:/spectra>
##$EXPNO= 1
##$NAME= <H-F>
##$PROCNO= 1
##$TYPE= <nmr>
##$USER= <she>
##$AMP= (0..31)
100 100 100 100 100 100 100 100 100 100 100 100 100 100 100 100 100 100 
100 100 100 100 100 100 100 100 100 100 100 100 100 100 
##$AQSEQ= 0
##$AQ_mod= 1
##$AUNM= <au_zg>
##$AUTOPOS= <>
##$BF1= 200.13
##$BF2= 200.13
##$BF3= 200.13
##$BF4= 200.13
##$BF5= 200.13
##$BF6= 200.13
##$BF7= 200.13
##$BF8= 200.13
##$BYTORDA= 1
##$CFDGTYP= 0
##$CFRGTYP= 5
##$CHEMSTR= <none>
##$CNST= (0..31)
1 1 145 1 1 1 1 1 1 1 1 1 1 1 1 1 1 1 1 1 1 1 1 1 1 1 1 1 1 1 1 1 
##$CPDPRG= <>
##$CPDPRG1= <>
##$CPDPRG2= <>
##$CPDPRG3= <>
##$CPDPRG4= <mlev>
##$CPDPRG5= <mlev>
##$CPDPRG6= <mlev>
##$CPDPRG7= <mlev>
##$CPDPRG8= <mlev>
##$CPDPRGB= <>
##$CPDPRGT= <>
##$D= (0..31)
0 1.2 0 0 0 0 0 0 0 0.06 0 0.03 0 0 0 0 0.0002 0 0 0 0 0 0 0 0 0 0 0 0 
0 0 0 
##$DATE= 1649745303
##$DBL= (0..7)
120 120 120 120 120 120 120 120 
##$DBP= (0..7)
150 150 150 150 150 150 150 150 
##$DBP07= 0
##$DBPNAM0= <>
##$DBPNAM1= <>
##$DBPNAM2= <>
##$DBPNAM3= <>
##$DBPNAM4= <>
##$DBPNAM5= <>
##$DBPNAM6= <>
##$DBPNAM7= <>
##$DBPOAL= (0..7)
0.5 0.5 0.5 0.5 0.5 0.5 0.5 0.5 
##$DBPOFFS= (0..7)
0 0 0 0 0 0 0 0 
##$DE= 6
##$DECBNUC= <off>
##$DECIM= 32
##$DECNUC= <off>
##$DECSTAT= 4
##$DIGMOD= 1
##$DIGTYP= 9
##$DL= (0..7)
0 120 120 120 120 120 120 120 
##$DP= (0..7)
150 150 150 150 150 150 150 150 
##$DP07= 0
##$DPNAME0= <>
##$DPNAME1= <>
##$DPNAME2= <>
##$DPNAME3= <>
##$DPNAME4= <>
##$DPNAME5= <>
##$DPNAME6= <>
##$DPNAME7= <>
##$DPOAL= (0..7)
0.5 0.5 0.5 0.5 0.5 0.5 0.5 0.5 
##$DPOFFS= (0..7)
0 0 0 0 0 0 0 0 
##$DQDMODE= 0
##$DR= 18
##$DS= 0
##$DSLIST= <SSSSSSSSSSSSSSS>
$$ [...]
##$SUBNAM2= <"">
##$SUBNAM3= <"">
##$SUBNAM4= <"">
##$SUBNAM5= <"">
##$SUBNAM6= <"">
##$SUBNAM7= <"">
##$SUBNAM8= <"">
##$SUBNAM9= <"">
##$SW= 18.05172834244
##$SWIBOX= (0..15)
0 0 2 0 0 0 0 0 0 0 0 0 0 0 0 0 
##$SW_h= 3612.71676300578
##$TD= 16384
##$TD0= 1
##$TE= 0
##$TE2= 300
##$TE3= 300
##$TEG= 300
##$TL= (0..7)
0 120 120 120 120 120 120 120 
##$TP= (0..7)
150 150 150 150 150 150 150 150 
##$TP07= 0
##$TPNAME0= <>
##$TPNAME1= <>
##$TPNAME2= <>
##$TPNAME3= <>
##$TPNAME4= <>
##$TPNAME5= <>
##$TPNAME6= <>
##$TPNAME7= <>
##$TPOAL= (0..7)
0.5 0.5 0.5 0.5 0.5 0.5 0.5 0.5 
##$TPOFFS= (0..7)
0 0 0 0 0 0 0 0 
##$TUNHIN= 0
##$TUNHOUT= 0
##$TUNXOUT= 0
##$USERA1= <user>
##$USERA2= <user>
##$USERA3= <user>
##$USERA4= <user>
##$USERA5= <user>
##$V9= 5
##$VALIST= <valist>
##$VCLIST= <CCCCCCCCCCCCCCC>
##$VD= 0
##$VDLIST= <DDDDDDDDDDDDDDD>
##$VPLIST= <PPPPPPPPPPPPPPP>
##$VTLIST= <TTTTTTTTTTTTTTT>
##$WBST= 1024
##$WBSW= 4
##$XGAIN= (0..3)
0 0 0 0 
##$XL= 0
##$YL= 0
##$YMAX_a= 960004
##$YMIN_a= -725463
##$ZGOPTNS= <>
##$ZL1= 120
##$ZL2= 120
##$ZL3= 120
##$ZL4= 120
##$ABSF1= 10
##$ABSF2= 0
##$ABSG= 5
##$ABSL= 3
##$ALPHA= 0
##$AQORDER= 0
##$ASSFAC= 0
##$ASSFACI= 0
##$ASSFACX= 0
##$ASSWID= 0
##$AUNMP= <proc_1d>
##$AZFE= 0.1
##$AZFW= 0.1
##$BCFW= 1
##$BC_mod= 2
##$BYTORDP= 1
##$COROFFS= 0
##$CY= 11.3945322036743
##$DATMOD= 1
##$DC= 2
##$DFILT= <>
##$DTYPP= 0
##$F1P= 2.36226072786647
##$F2P= -0.459571619588291
##$FCOR= 0.5
##$FTSIZE= 0
##$FT_mod= 4
##$GAMMA= 1
##$GB= 0.15
##$INTBC= 1
##$INTSCL= 1
##$ISEN= 128
##$LB= 0.24
##$LEV0= 0
##$LPBIN= 0
##$MAXI= 10000
##$MC2= 0
##$MEAN= 0
##$ME_mod= 0
##$MI= 1.114404
##$NCOEF= 0
##$NC_proc= 0
##$NLEV= 6
##$NOISF1= 3.799351
##$NOISF2= 2.8
##$NSP= 1
##$NTH_PI= 0
##$NZP= 0
##$OFFSET= 15.70392
##$PC= 1
##$PHC0= -18299.51
##$PHC1= 9.200776
##$PH_mod= 1
##$PKNL= yes
##$PPARMOD= 0
##$PSCAL= 0
##$PSIGN= 0
##$REVERSE= no
##$SF= 200.130013532006
##$SI= 16384
##$SIGF1= 3
##$SIGF2= 2
##$SINO= 400
##$SIOLD= 16384
##$SREGLST= <1H.CDCl3>
##$SSB= 0
##$STSI= 0
##$STSR= 0
##$SW_p= 3612.71676300578
##$SYMM= 0
##$S_DEV= 0
##$TDeff= 0
##$TDoff= 0
##$TI= <>
##$TILT= no
##$TM1= 0
##$TM2= 0
##$TOPLEV= 0
##$USERP1= <user>
##$USERP2= <user>
##$USERP3= <user>
##$USERP4= <user>
##$USERP5= <user>
##$WDW= 1
##$XDIM= 8192
##$YMAX_p= 0
##$YMIN_p= 0
$$ End of Bruker specific parameters
$$ ---------------------------------
##NTUPLES= NMR FID
##VAR_NAME=  TIME,          FID/REAL,        FID/IMAG
##SYMBOL=    X,             R,               I
##VAR_TYPE=  INDEPENDENT,   DEPENDENT,       DEPENDENT
##VAR_FORM=  AFFN,          ASDF,            ASDF
##VAR_DIM=   8192,          8192,            8192
##UNITS=     SECONDS,       ARBITRARY UNITS, ARBITRARY UNITS
##FACTOR=    0.0002768,     1,               1
##FIRST=     0,             0,               0
##LAST=      2.2672688,     0,               0
##MIN=       0,             -725463,         0
##MAX=       2.2672688,     960004,          0
$$ Real data points
##PAGE= N=1
##DATA TABLE= (X++(R..R)), XYDATA
0@%%%%%%%%%%qJ6j6J6j6K4l2M0n6O4p2Q8j04J23j41J65j96K21k55K95l36L84m34
$$ 0 0 0 0 0 0 0 0 0 0 0 -8 8 -8 8 -8 16 -16 24 -32 32 -40 48 -56 67 -74 91 -105 116 -139 156 -180 204 -230
33b30M92n56O27p03P86q83R84j091J213j345J489j647J822k011K213k438K686
$$ -230 262 -294 333 -370 416 -467 517 -574 639 -706 783 -864 958 -1053 1160 -1278 1408
50A408k962L263l596L970m388M859n394O014o737P587q609R868j1464J3558j6438
$$ 1408 -1554 1709 -1887 2083 -2305 2554 -2840 3174 -3563 4024 -4585 5283 -6181 7377 -9061
65i061K0667k7487M0323p2744L08842O99464l08333m28843o5090j0986m54630
$$ -9061 11606 -15881 24442 -48302 260540 960004 651671 222828 157738 146752 -307878
76c07878m15943Q6283L79364K50599K83419L63822L6228m76041m02724J8546m603
$$ -307878 -723821 -637538 -258174 -7575 275844 639666 675894 199853 -202871 -184325 -188928
87a88928l71022j65513N20788O86178J14996k52386n6399L3957l02300m32811
$$ -188928 -559950 -725463 -204675 481503 596499 344113 287714 321671 19371 -413440
97d13440r1683J64942P2455J28427M25345L47758k03091m35259p7040J17231k31459
$$ -413440 -505123 -340181 -267726 -139299 286046 633804 430713 -4546 -81586 35645 -195814
108a95814l97164Q6675N34223L23588o1662l3977Q9036j29421l39956j59206M8667
$$ -195814 -592978 -506303 27920 351508 289846 255869 344905 215484 -124472 -283678 -235011
119b35011n7298p4442K83465M64150N8314l34770j26269J89598l9299m06323k04577
$$ -235011 -292309 -366751 -83286 380864 439178 104408 -21861 167737 128438 -277885 -482462
130d82462K77596L08045L471k6442J49707M6506k11513j62059M3559l9358k08180
$$ -482462 -204866 103179 106650 80208 229915 276421 64908 -97151 -53592 -92950 -301130
141c01130R095L49755K23681j67572j60541J56963J29822k26932k72228N9698
$$ -301130 -292035 57720 281401 113829 -46712 110251 240073 13141 -259087 -199389
151a99389J86106j1579m8726J53405J36847j27178j48288R5947Q4651k09708k09289
$$ -199389 -13283 -24862 -73588 79817 216664 89486 -58802 37145 121796 -87912 -297201
162b97201J64858K85151l5611k01055N7911K17677k7295k24345n6805J01079k4265
$$ -297201 -132343 152808 117197 -83858 -25947 191730 164435 -59910 -116715 -15636 -39901
173c9901r7163Q6482J61771n0636j37923R4473J86884j01118k75188o415K35909
$$ -39901 -137064 -50582 111189 60553 -77370 17103 203987 102869 -172319 -178734 57175
184E7175L9791k00036l5457K14782R9159j38222p7847Q7954j476j49170k4556
$$ 57175 96966 -103070 -138527 76255 175414 37192 -40655 47299 45823 -103347 -127903
195a27903J46365K7791j35700J2627K14878O3397k02001j19423J31763P9316j53528
$$ -127903 18462 46253 -89447 -76820 138058 201455 -546 -119969 11794 91110 -62418
206f2418j08152J32274J28305o8177n4624J11222M7840j59774j06206J23461R0612
$$ -62418 -170570 -38296 90009 21832 -32792 78430 126270 -33504 -139710 -16249 74363
217G4363j40029j00779J74669J88817r0413j71502M6312J19673p9433j52815L2950
$$ 74363 -65666 -166445 8224 197041 106628 -64874 -18562 101111 21678 -131137 -98187
228i8187J19307j8114n4765R7386J02462j03596j43435O4838J18507r7890j64831
$$ -98187 21120 3006 -51759 45627 148089 44493 -98942 -34104 84403 -13487 -178318
239a78318Q1369K16144R407j53987m570J31531j8034j64243l6415J06983J0303
$$ -178318 -96949 119195 128602 -25385 -29955 101576 83542 -80701 -117116 -10133 170
250A70q5588M8611J55100j718j48153j7525J23857j3247j71894l5329J63001P8782
$$ 170 -85418 -36807 118293 116575 -31578 -49103 74754 61507 -110387 -145716 17285 96067
262I6067r9564l3024J17419L0515j37158o6694R2168K3675j20381j7008J70313
$$ 96067 -3497 -36521 80898 111413 -25745 -92439 -271 23404 -96977 -113985 56328
273E6328Q3774j30639q4620J16698P5622j39202j26043Q9360J20499m6732o6843
$$ 56328 140102 9463 -75157 41541 117163 -22039 -148082 -58722 61777 15045 -51798
284e1798Q1004Q0236p9461q8150N7026M8704j03686p6306J20241J28109p3674
$$ -51798 29206 109442 29981 -58169 -1143 47561 -56125 -132431 -12190 115919 42245
295D2245j11224P5854J17863p9455j55210K3319J21805j6272r1755M7802J19466
$$ 42245 -68979 6875 124738 45283 -109927 -86608 35197 18925 -72830 -25028 94438
306I4438k5858j10692J8694Q9598n2679j27635L2642J42453M525j11216J1634
$$ 94438 68580 -42112 -23418 66180 13501 -114134 -81492 60961 65486 -45730 -34096
317c4096J22729l556j31764k7659R4669M372r7120J3262J28041J4830j15414j3496
$$ -34096 88633 85077 -46687 -74346 20323 24695 -72425 -59163 68878 83708 -31706 -45202
329d5202J16289O764j46439m9060J26854O6049r7997n1484J04627O7080q7746
$$ -45202 71087 77851 -68588 -117648 9206 75255 -22742 -74226 30401 97481 9735
340I735o9730O1701L8027q0752l8495R4778N6430q2565m5984R9167N9943j08306
$$ 9735 -59995 1706 39733 -41019 -79514 15264 71694 -10871 -56855 42312 102255 -6051
352f051r2873P9522Q8339p1894q6252P4108J02826m8872q9062M4823P5597o2237
$$ -6051 -98924 -19402 68937 -2957 -89209 -15101 87725 38853 -50209 -5386 70211 7974
364G974r4446M9462R3897m2350q6737N4091J07268l6819j09478J7321Q9627k8744
$$ 7974 -86472 -37010 56887 14537 -72200 -18109 89159 52340 -57138 -39817 49810 21066
376B1066r7404K3728J01877q294q0820K9317R5836l0793j17908L280J02879q862
$$ 21066 -76338 -52610 49267 40973 -39847 -10530 85306 54513 -63395 -60115 42764 33902
388C3902j11752K650J28185L5099r8297l2491Q4201J8543r8568m0361P6126L2297
$$ 33902 -77850 -75200 52985 88084 -10213 -42704 41497 60040 -38528 -78889 -2763 29534
400B9534o3575l757R7084K6648r5222m1697P5090J8721j05846m6683J03715P6318
$$ 29534 -34041 -37798 59286 85934 -9288 -50985 24105 42826 -63020 -109703 -5988 70330
412G0330o2592m5031Q2115N5667q8955q5290M9396N4893o2197m9927Q7165R0334
$$ 70330 7738 -37293 44822 100489 11534 -73756 -24360 30533 -31664 -81591 5574 95908
424I5908n0877p6865M0954N2668p5517r4861M1917Q9993j4748m4621O2330Q1713
$$ 95908 45031 -31834 9120 61788 -13729 -108590 -66673 23320 8572 -36049 26281 107994
436A07994m7882r6222J1639N1749n5555q3520N5201J21914J311p8677J7871Q0845
$$ 107994 60112 -36110 -24471 27278 -28277 -111797 -56596 65318 66629 -12048 5823 86668
448H6668l4831j25748k6876P9874K1264m8777K9479J05887J9569q1152k9337L8696
$$ 86668 51837 -73911 -100787 -20913 351 -48426 -18947 86940 106509 25357 -3980 34716
460C4716l4153j04644p649J06389M7419n0568O559R3618J1219j17202p1270N0430
$$ 34716 563 -104081 -111730 -5341 42078 -8490 -1931 91687 102906 -14296 -85566 -35136
472c5136K6059o3456n460J16445P7647n5031n2145M0829O177j08670p8302O1639
$$ -35136 -9077 -72533 -77993 38452 116099 61068 8923 49752 55929 -52741 -131043 -69404
484f9404P8882j7690j4222Q2439O2217o7846q9953P100K0341o1964m0756Q7222
$$ -69404 9478 -8212 -22434 60005 122222 54376 -35577 -28477 -8136 -70100 -110856 -23634
496b3634J03327j5134m9172L9994M0671q7925j20688R506Q1535J186l5762O2903
$$ -23634 79693 64559 15387 55381 96052 8127 -112561 -103055 -21520 -20334 -56096 6807
508F807J06380p062r1011k6662K4087m5654p8111K8254J04103L0222l5558K7067
$$ 6807 113187 106125 15114 -11548 12539 -33115 -111226 -82972 21131 51353 15795 42862
520D2862O4204m0981j21103l6591N7021O435n0517L4124J17408L7225p3137l6619
$$ 42862 107066 66085 -55018 -91609 -34588 -28153 -78670 -44546 72862 110087 36950 331
532C31L7232k0262j00667k9855Q7266O0426l0194k388P4174K2179q9010p1237
$$ 331 37563 17301 -83366 -113221 -25955 34471 4277 1889 76063 98242 9232 -62005
544f2005K5577K1145m5621p548Q8147O4934l7636l8265L4635O347q9666o5491
$$ -62005 -36428 -15283 -60904 -68452 19695 84629 46993 8728 43363 49710 -39956 -105447
556a05447N4765O8781k3368k6530O8222O6129n2473q7757M123L8388l6513m9078
$$ -105447 -50682 18099 -5269 -31799 36423 102552 50079 -37678 -33555 4833 -31680 -80758
568h0758M9067Q4350k661m5952J9657L7543n0590q1115J1861O3015o490m0546
$$ -80758 -31691 52659 49998 4046 23703 61246 10656 -70459 -58598 4417 -2073 -42619
580d2619M0683P8449j4450p7209o944M7613k1208p0617J1741Q3139J7143n5429
$$ -42619 -1936 76513 62063 -15146 -22090 25523 4315 -66302 -54561 28578 45721 -9708
592i708k162N9413m261q0033k5765N6687K1360m4854k072O7815K4337n4908k6400
$$ -9708 -11870 47543 43282 -36751 -62516 -5829 15531 -29323 -31395 36420 60757 5849 -20551
605b0551L9817M737o1595j8268O3369L2007m7983j9540N9251K6140o6879m7481
$$ -20551 19266 24003 -37592 -55860 7509 39516 -8467 -28007 31244 57384 -9495 -56976
617e6976M6992M0469m4672l5678N3973N2927l6450m6670L0376L5123m3133m7889
$$ -56976 -9984 30485 -14187 -49865 4108 57035 20585 -26085 4291 39414 -3719 -51608
629e1608L3992M6889k8093l8562L7303M7297l4170n2390K5678M6990k8403m9330
$$ -51608 -17616 29273 1180 -37382 -79 47218 13048 -39342 -13664 33326 4923 -44407
641d4407L0525N9329j8726n4310J7789N3269k0764o3797P083N7641l878n3054
$$ -44407 -13882 45447 26721 -27589 -9800 43469 22705 -41092 -34009 23632 19754 -33300
653c3300O233N8178K397n3480n777M6114j67m9791j332N2416P261m6097j154N1983
$$ -33300 -27067 31111 33508 -19972 -25749 20365 20198 -29593 -30925 21491 28752 -17345 -18499 33484
667C3484K204n9912j4720N2139J2850n3975j4349O0267K8365m8974k7331M4630
$$ 33484 35688 -24224 -38944 13195 26045 -27930 -42279 17988 46353 -2621 -29952 14678
679A4678K4011m9381l2974M1592L3253l4520k5450M0770L0307m0413l6428L0631
$$ 14678 38689 -10692 -43666 -2074 31179 -3341 -28791 11979 42286 1873 -34555 -3924
691c924K7693l7000l1017M0720M1953k9174l5484L1784L5773l7095m7964K6386
$$ -3924 23769 -13231 -44248 -3528 38425 9251 -26233 5551 41324 4229 -43735 -17349
703a7349M6586k1210m1410K7012N1312j8319n2909P097M1211j4111m5468J2501
$$ -17349 29237 8027 -33383 -6371 44941 26622 -26287 -19190 22021 7910 -37558 -25057
715b5057N0094j450l8290Q781L9427j4645n0683L300M4364m468m2809J1046N5599
$$ -25057 25037 23587 -14703 -5922 33505 18860 -31823 -28523 15841 11373 -31436 -20390 35209
728C5209J169n3067q166M4751K089n2238r615N2576K0162l9471j2688M2025J3024
$$ 35209 36378 -16689 -24855 19896 21985 -30253 -39868 12708 32870 -6601 -19289 22736 35760
741C5760m6519k3512L5352J8076l4226j3102M2249K2451l6495k2917L1721J6014
$$ 35760 -10759 -34271 1081 19157 -15069 -28171 14078 36529 34 -22883 8838 24852
753B4852m0597k4319L9181L0820l1028k5509L5664L0235l6349l9311K5960L5562
$$ 24852 -15745 -40064 -883 29937 -1091 -26600 9064 39299 2950 -36361 -10401 25161
765B5161k4394l3795K7085M1049j8339l7790J4503L1657j9835l6022J7169L6893
$$ 25161 767 -33028 -5943 35106 16767 -21023 -6520 25137 5302 -30720 -13551 23342
777B3342j3270l2198J8010L6020j8726m2033J2133L9740j1986m1043J1591M6185
$$ 23342 10072 -22126 -4116 31904 13178 -28855 -16722 23018 11032 -30011 -18420 27765
789B7765m353m4235L78M0860n90m2448l262M1532P670l6329n901L6330O431l7060
$$ 27765 23412 -20823 -20445 20415 19825 -22623 -25885 15647 23317 -13012 -18913 17417 23848 -13212
803a3212r402L4237Q760l3711p729L5829R903l6519j2530L5451J2832l7007j5577
$$ -13212 -22614 11623 20383 -13328 -21057 14772 24675 -11844 -24374 11077 23909 -13098 -28675
816b8675L8038K0636l5299k2797L2912K3727l2212k6870K8854K8222k4804k6435
$$ -28675 9363 29999 -5300 -28097 4815 28542 -3670 -30540 -1686 26536 1732 -24703
828b4703K3988K6018k3636k7068K1539K6095k0986k4580K3826K8041k2416k9919
$$ -24703 -715 25303 1667 -25401 -3862 22233 1247 -23333 493 28534 6118 -23801
840b3801K0295K9718k1363l3572J8936L6138j4530l6047J1777L5524j0599l7286
$$ -23801 -3506 26212 4849 -28723 -9787 26351 11821 -24226 -12449 23075 12476 -24810
852b4810O349L6146k700l2377M015L3553k101l3352n49L0131j202l0753J859L3303
$$ -24810 -18461 17685 14985 -17392 -13377 20176 18075 -15277 -15826 14305 13103 -17650 -15791 17512
866A7512J011l2603j814L2304Q67l5994m740L6918R487l3704r258L4834J2226
$$ 17512 18523 -14080 -15894 16410 17277 -18717 -23457 13461 22948 -10756 -20014 14820 27046
879B7046l5078j7804K9322J6632k7640j5927K8119J8560k5220j8436K2530J5376
$$ 27046 -8032 -25836 3486 20118 -7522 -23449 4670 23230 -1990 -20426 2104 17480
891A7480k4795j6504K6254K0568k2234j8188K4163J9275k6810k5791K1695K5891
$$ 17480 -7315 -23819 2435 23003 769 -17419 6744 26019 -791 -26582 -4887 21004
903B1004j9357k4752K1304K9745j7170l1684J0693K6751j2726k8130J2364L1564
$$ 21004 1647 -23105 -1801 27944 10774 -20910 -10217 16534 3808 -24322 -11958 19606
915A9606n487k5902P135K4137j1359l0140N929K7797m879k4327J0616L1404o612
$$ 19606 14119 -11783 -4648 19489 8130 -22010 -16081 11716 6837 -17490 -6874 24530 17918
928A7918l3598P97K8706m011l2127K753L7300O876l0376o379K7476K750l3625
$$ 17918 -15680 -14883 13823 9812 -22315 -19562 17738 24614 -5762 -12141 15335 18085 -15540
941a5540j1406K7702J2643k0843m561K7616R023k7797j4436J9520O491k5190p489
$$ -15540 -26946 756 13399 -7444 -12005 15611 24634 -3163 -17599 1921 8412 -16778 -24267
954b4267L1038J7867k1988j3717K2466J0868l0651k2615K2514K3201j5835j5211
$$ -24267 6771 24638 2650 -11067 11399 22267 -8384 -30999 -8485 14716 -1119 -16330
966a6330K4332K4102j9771k8238Q802J7082j6278k0290J8259K7931p449j8825
$$ -16330 8002 32104 12333 -15905 -7103 9979 -6299 -26589 -8330 19601 12152 -6673
978f673J1213J6434j9719k8308J0129K4859p487j8029J8101L0517j0105l2441
$$ -6673 4540 20974 1255 -27053 -16924 7935 448 -17581 520 31037 20932 -11509
990a1509O67K1693r493k9057O323L4748O703k2100l07K2489l816l1413q332K1657
$$ -11509 -10842 10851 1358 -27699 -21376 13372 20075 -2025 -2332 20157 16341 -15072 -23404 -1747
1004a747N665j6833M183K8722N592k5299r145J6830j741k8558n751K9780J4827
$$ -1747 3918 -12915 -8732 19990 25582 283 -8862 7968 6227 -22331 -28082 1698 16525
1017A6525j8810o206K5181R077k9570k0173J8178J4671j7689j0715K5262K1292
$$ 16525 -2285 -8491 16690 25767 -3803 -23976 -5798 8873 -8816 -19531 5731 27023
1029B7023j6007j8465J1397R764k1114j8426J6665J9693j0487j0970J9354J7265
$$ 27023 11016 -7449 3948 13712 -7402 -25828 -9163 10530 43 -10927 8427 25692
1041B5692j9319k3602J0846J6903j5523j9774J7489K8146p286k2569P515K0454
$$ 25692 6373 -17229 -6383 10520 -5003 -24777 -7288 20858 13572 -8997 -1482 18972
1053A8972j1424k7883K618K3223p88j7657P178K4329j479k2029j026J6432n677
$$ 18972 7548 -20335 -17717 5506 4718 -12939 -5761 18568 17089 -4940 -5966 10466 4789
1066D789k2573K714K4023J771j9195K824K3612j180k7556o351K1450L557k2941
$$ 4789 -17784 -15070 8953 10724 -8471 -5647 17965 16785 -10771 -17122 4328 7885 -15056
1079a5056l780K6780J1632j9743r285J8539O861k2443j2957J7086J1530j4206
$$ -15056 -18836 7944 19576 -167 -9452 9087 15948 -6495 -19452 -2366 9164 -5042
1091e042o545J9852J1537j7350j2689J3528P339j9803j2260J9490J7068j3268
$$ -5042 -11587 8265 19802 2452 -10237 3291 10630 -9173 -21433 -1943 15125 1857
1103A857j2336J7168J5465j8123k2277R360J6989j0426j6248J3421K2757n520
$$ 1857 -10479 6689 22154 4031 -18246 -8886 8103 -2323 -18571 -5150 17607 12087
1115A2087j8107M645J3661j0523k0024N844J9057k542j2801R884J9101p805k2335
$$ 12087 -6020 -1375 12286 1763 -18261 -12417 6640 4098 -8703 1181 20282 12477 -9858
1128i858J515J6044o899k0126O772K5997J982j9859l38J8941k520k5272n874J9896
$$ -9858 -8343 7701 802 -19324 -12552 13445 15427 -4432 -4770 14171 11651 -13621 -19495 401
1142D01O727j4707o40K0620N574j8978q882J2203J915j7258l172K0675R813j3880
$$ 401 7128 -7579 -8219 12401 17975 -1003 -9885 2318 4233 -13025 -16197 4478 14291 411
1156D11n058J6320M018k2185j2511J6278J1766j3801q144J9202J4916j5385j7290
$$ 411 -4647 11673 15691 -6494 -19005 -2727 9039 -4762 -12906 6296 21212 5827 -11463
1169a1463Q725J0815j3169j3628J3249J7902o132j1564R006J0577j3284j6825
$$ -11463 -2738 8077 -5092 -18720 -5471 12431 6299 -5265 3741 14318 1034 -15791
1181a5791P770J4128p311j0735J3282J7700r452j9108M692J4153r181j8375P864
$$ -15791 -8021 6107 -1204 -11939 1343 19043 9591 -9517 -4825 9328 147 -18228 -10364
1194a0364K2583M1j6470K016J5827m485k1203k851J6048K778j1901K969J7613
$$ -10364 12219 12260 -4210 -2194 13633 9148 -12055 -14906 1142 3920 -7981 -5012 12601
1207A2601J056j6965m339J1300j753j6193O43K0164O420j3927k659J5537J467
$$ 12601 13657 -3308 -7647 3653 1900 -14293 -13650 6514 12934 -993 -3652 11885 13352
1220A3352k1193r632J5677R273j2329n002J7695J0904j4749j3271Q192O512j2880
$$ 13352 -7841 -17473 -1796 7477 -4852 -9854 7841 18745 3996 -9275 -1083 5429 -7451
1233g451q628J4158J3439p445p652J0362O523j5470j3807R646J1467q858q222
$$ -7451 -16079 -1921 11518 4073 -3579 6783 13306 -2164 -15971 -6325 5142 -3716 -11938
1246a1938J4868J5619j0220j6679N282J1438r781j5725Q177J9093q14j2530L904
$$ -11938 2930 18549 8329 -8350 -3068 8370 -1411 -17136 -8959 10134 9320 -3210 694
1259F94J2676o147j7541l60J2353j102j0132N977J5917j727j4797j05J1198m740
$$ 694 13370 7223 -10318 -10678 1675 573 -9559 -3582 12335 10608 -4189 -4294 6904 2164
1273B164j6408J956J8356L156j3506J12J5767P24j8733o612J3694N120j2372k891
$$ 2164 -14244 -12288 6068 9224 -4282 -4170 11597 12321 -6412 -13024 670 5790 -6582 -9473
1287i473J5838P420j2311p252R308L031j3184n698J2728P490r534m130J2567N414
$$ -9473 6365 13785 1474 -5778 3530 6561 -6623 -12321 407 7897 -1637 -5767 6800 12214
1301A2214j4402r597J0691Q055j1342q188J3248J2522r348j1935P518J0279r038
$$ 12214 -2188 -11785 -1094 6961 -4381 -12569 679 13201 3853 -8082 -564 9715 677
1314F77j2748O764J2815m013r744O003J0826n813j1938L630R460n463j0331O525
$$ 677 -12071 -5307 7508 3495 -6249 -246 10580 4767 -7171 -3541 5919 456 -9875 -3350
1328c350J2767m351j2034M385J2215n271j5016K331J4564p91j3216J425J4807
$$ -3350 9417 5066 -6968 -2583 9632 4361 -10655 -8324 6240 5449 -7767 -6342 8465
1341H465Q80j3982k681J1646J439j2163k119J2195L575r879j796J0784J683j2082
$$ 8465 9345 -4637 -7318 4328 5767 -6396 -8515 3680 7255 -2624 -4420 6364 8047 -4035
1355d035l496J0595K580j1526k676J3357N539j1774o013J1045N589j2697q888
$$ -4035 -7531 3064 5644 -5882 -8558 4799 10338 -1436 -7449 3596 9185 -3512 -12400
1368a2400J0274R394q014p364R621R582p832r959N307O929p481p994P812R803
$$ -12400 -2126 7268 -746 -8110 1511 11093 3261 -6698 -1391 5538 -1943 -9937 -2125 7678
1382G678n050o982P292P612r126j1439N583R587o058r281Q388J3853m024j2619
$$ 7678 2628 -4354 2938 10550 1424 -10015 -4432 5155 -903 -10184 -1796 12057 8033 -4586
1396d586K075R802n083j3627J513J2917J556q156K345J0770j443j2291k519P446
$$ -4586 -2511 7291 2208 -11419 -9906 3011 4567 -3589 -1244 9526 8083 -4208 -6727 719
1410G19j250q796L017J3464K631r128o02Q884k521j5008m083J1450M719q264n22
$$ 719 -531 -9327 -6310 7154 9785 657 55 8939 6418 -8590 -12673 -1223 3496 -4768 -5290
1425e290J3643N704j1772q735N652K831r907m894J0966R736l907l436P075K619
$$ -5290 8353 14057 2285 -6450 -798 2033 -7874 -12768 -1802 7934 4027 591 7666 10285
1439A0285j1697r415N135N156n970k208J2628J0285o938r198M265M275j0662j1108
$$ 10285 -1412 -10827 -5692 -536 -6506 -8714 3914 14199 7261 -1937 2328 6603 -4059 -15167
1453a5167O956J3001o37n943O157R394o017j3857k141N792k700o193O355J3018
$$ -15167 -8211 4790 4153 -1790 4367 13761 7744 -6113 -8254 -2462 -5162 -11355 -5000 8018
1467H018J468o889R77M787p098j2963L82J0522J495n511N467J3121m87j3757n324
$$ 8018 9486 2597 3574 8361 1263 -11700 -11318 -796 699 -4812 655 13776 13289 -468 -5792
1482e792O012j409j0898j84J4070P872n269j991O822n77j2714p298N584L600m440
$$ -5792 220 -1189 -12087 -12271 1799 9671 4402 2411 9233 8656 -4058 -11356 -5772 -2172 -6612
1497f612J725J2094N380q274n920M335m48j1482n129J0712R463l706k990Q732
$$ -6612 -4887 7207 12587 4313 -1607 2728 2280 -9202 -14331 -3619 5844 2138 -852 7880
1511G880N627j0181j1691K188N891m224m647Q144J0786j747p028J280K828p332
$$ 7880 13507 3326 -8365 -6177 -286 -4510 -9157 -1013 9773 8026 998 2278 5106 -2226
1525b226q713L653Q341q22l418O669Q133n488j1013K34O045l959q202M715J2615
$$ -2226 -10939 -7286 1055 233 -3185 3484 11617 6129 -4884 -4650 1395 -2564 -10766 -6051 6564
1540F564J670p758J5O963k496j1178k520P800K494m994J404Q662J250q033k969
$$ 6564 8234 476 491 7454 4958 -6220 -8740 -940 1554 -3440 -2036 6626 7876 -157 -3126
1555c126M708r84p885j15R513L528o303j288P798J349j0079n334P015M666o223
$$ -3126 1582 598 -7287 -7402 2111 5639 -664 -1952 5846 7195 -2884 -8218 -1203 3463 -2760
1570b760l510Q098O178n998o414M057M352n249m906N440O148l330m256M304L730
$$ -2760 -6270 1828 8006 2008 -4406 -349 4003 -1246 -6152 -712 5436 2106 -2150 2154 5884
1585E884o188o089M366N392m588m978O040P165m677p796L199O921l580p570L195
$$ 5884 -304 -6393 -2027 3365 -1223 -6201 -161 7004 2327 -5469 -2270 4651 1071 -6499 -3304
1600c304Q830p76p115P96O247j839p688l7O439J70m985J734O645q98o976j63N775
$$ -3304 5526 4750 -2365 -1569 4678 2839 -4849 -4886 1553 1723 -3262 -1528 5117 4219 -2757 -2920 2855
1617B855j109o783J157Q591J369p347j578O508K63q884l382P156M279m759j769
$$ 2855 1746 -5037 -3880 4711 6080 -1267 -2845 3663 3926 -4958 -8340 -1184 3095 -1664 -3433
1632c433O964L655o086m822L381K115m994k067O450M536l803k647M390J330p625
$$ -3433 3531 7186 1100 -3722 -341 1774 -3220 -5287 1163 5699 1896 -751 3639 4969 -2656
1647b656n311N013M875l853k712P011O584m808p360J763M182m246o041L632P767
$$ -2656 -7967 -2954 1921 -1932 -4644 2367 8951 4143 -3217 -1454 2728 -1518 -7559 -3927 3840
1662C840%m382J622L920l581o912L31M802n52k772M254O962j505o690j67L822
$$ 3840 3840 -542 1080 5000 1419 -5493 -5162 -360 -912 -3684 570 7532 6027 -663 -830 2992
1678B992l288p287J591Q610K024n140J33N988p19q614l496M946K442l540N93P079
$$ 2992 -296 -7583 -5992 2618 4642 -498 -365 5623 4904 -3710 -7206 -2260 182 -3358 -2765 4314
1694D314K849m992l144K394p88o138j263O415L639l178m39N704J135p580m937
$$ 4314 7163 2171 -973 1421 633 -5505 -6768 -353 3286 108 -331 5373 6508 -1072 -6009
1709f009M174L393m156k195O651N780l917n774J523K624m380m689L485O012l46
$$ -6009 -1835 1558 -2598 -4793 1858 7638 3721 -2053 -530 2094 -2286 -6975 -3490 2522 2176
1724B176k448K774K811m277n703J294L529k049k430M947O201k252n982O49L540
$$ 2176 -272 2502 5313 1036 -4667 -3373 156 -1893 -4323 624 6825 4573 -1409 -760 2780
1739B780l523o312K028P577J434l929Q49M805j361p062k314L551O80k952J520
$$ 2780 -743 -7055 -5027 2550 3984 55 904 5709 4348 -2714 -5028 -1477 -797 -3749 -2229
1754b229N767J098m301j203K662j518n428rO159K405l407j38N145N65o880m030
$$ -2229 3538 4636 335 -868 1794 276 -5152 -5161 998 3403 -4 -142 5003 5568 -1312 -5342
1770e342L677K568l572j555N566M464l119l926J615J528l861l151L308L986j240
$$ -5342 -1665 903 -2669 -4224 1342 5806 2687 -1239 376 1904 -1957 -5108 -1800 2186 946
1785I46j285L430J986m529m501J879K328l308k662M762N599j832m083K080L732
$$ 946 -339 3091 5077 548 -3953 -2074 254 -3054 -5716 -954 4645 2813 -1270 810 4542
1800D542l049n620R78M851j53l460J407M319o70m405n55K585j186l559J113M281
$$ 4542 1493 -4127 -3149 1702 1549 -1911 -504 3815 3145 -1260 -1815 770 -416 -3975 -2862 1419
1816A419Q9l054J360M179r73n033l79M165j64m786l59N191J746m193j563L927
$$ 1419 1508 -1546 -186 3993 3020 -2013 -2392 1773 1609 -3177 -3536 1655 3401 -792 -2355 1572
1832A572J381m341k436L215K249k384r12L751K103k813j933K006J68m257j946
$$ 1572 2953 -1388 -3824 -609 1640 -744 -1656 2095 4198 1385 -548 1458 1626 -2631 -4577
1847d577L463K409k522r57M405K665l951m019J931K409l052l019L415N041l85
$$ -4577 -1114 1295 -1227 -2184 2221 4886 935 -3084 -1153 1256 -1796 -4815 -1400 3641 3256
1862C256k748J137K165k806m678j12K524k65j049L036M085p50l195Q2J293l120
$$ 3256 508 1645 3810 1004 -3674 -3786 -1262 -1527 -2576 460 4545 3795 600 682 1975 -1145
1878a145m267J461M878P75k371J604M085j117n795k261K555M05k661Q00N289K664
$$ -1145 -5412 -3951 927 1702 -669 935 5020 3903 -1892 -4153 -1598 -1193 -3854 -3054 2235 4899
1894D899k183j412J129j224m482j607K817J856q24J527M301P06m387k908J286
$$ 4899 2716 1304 2433 1209 -3273 -4880 -2063 -207 -1031 496 4797 5503 1116 -1792 -506
1909e06l34l919r15N188M382j167j621K160R38m505m878N76K662k14j38L803L850
$$ -506 -840 -4759 -5674 -486 3896 2729 1108 3268 4206 -299 -5177 -4601 -1939 -2153 -2291 1512 5362
1926E362q80k934m78l84l545k756K316L893L12m30K975K524l297n381o42J983
$$ 5362 4482 1548 1070 686 -2859 -5615 -3299 594 906 476 3451 5975 2678 -2703 -3345 -1362
1942a362j201k221K823N696J360k800r12J000k186m552r48K925J828J2K069L230
$$ -1362 -2563 -4784 -1961 3735 5095 2295 1383 2383 197 -4355 -5303 -2378 -550 -538 1531 4761
1958D761m47l746j910M91j395k645J408N154K417j595l25J950j133n420l256K095
$$ 4761 4314 568 -1342 -851 -2246 -4891 -3483 1671 4088 2493 2168 4118 2985 -2435 -5691 -3596
1974c596K325o44N05M063K836k103l280o22l97k563j217K821L305L85J33J860
$$ -3596 -1271 -1915 -1410 2653 5489 3386 106 -516 -913 -3476 -4693 -1872 1433 1818 1951 3811
1990C811R1l945l584O24J414j188k84M107M028j002l133j93P95k639l438R18L794
$$ 3811 3902 -43 -3627 -3003 -1589 -2777 -3061 1046 5074 4072 939 746 1541 -1098 -4536 -3618 176
2007A76J357q22R32J753j446l649j289Q94k63o09K346L663M90j960k53R14k173
$$ 176 1533 711 1643 3396 1950 -1699 -2988 -2094 -2357 -2966 -620 3043 3533 1573 1320 2234 61
2024F1l800j12L320J464j344O59L089L01l725k490J076P59j467k7L172K330r43
$$ 61 -3739 -3851 -531 933 -411 248 3337 3638 -87 -2577 -1501 -742 -2209 -2236 936 3266 2323
2041B323j166M97p51k872j396J676J309q00M43K884J012k702k111J193R36k003
$$ 2323 1157 1654 903 -1969 -3365 -1689 -380 -1180 -737 2147 3159 457 -1654 -461 475 -1528
2057a528j192K740K998q13j964N44J088j882k686L51K026K36o07J226J660q85
$$ -1528 -2720 20 3018 2205 241 785 1873 -9 -2695 -2344 -318 -82 -689 537 2197 1312
2073A312j918K1P19j108j252J602K489l17j797M94J563j390k972p5K546P12j480
$$ 1312 -606 -585 134 -974 -2226 -624 1865 1548 -249 245 1808 418 -2554 -2629 -83 629 -851
2090h51L92K516N05k207j326J021K19j407j21J807Q01j032l03R56m66k064l83
$$ -851 -459 2057 2562 355 -971 50 269 -1138 -1259 548 1349 317 14 970 504 -1560 -1943
2107a943J827O64j310O3K226P05k319j622J323J076j494j099J884K022q31j661
$$ -1943 -116 548 -762 -699 1527 2232 -87 -1709 -386 690 -804 -1903 -19 2003 1172 -489
2123d89L71Q51j120j384Q56J626M4l49J019P11j608j858K98P30j114r03J903K407
$$ -489 -118 733 -387 -1771 -915 711 755 406 1425 2136 528 -1330 -1032 -302 -1416 -2319 -416 1991
2141A991n34j836L40J311j143k349K88K409Q11r31J74J422m13k230j098N69P3
$$ 1991 1457 -379 -39 1272 129 -2220 -1932 477 1288 357 531 1953 1540 -690 -1788 -1219 -1146
2158a146n13J016K057N52j049j76N14j119k231pK163J032q24K50J757N1k797k193
$$ -1146 -1659 -643 1414 1966 917 741 1255 136 -2095 -2102 61 1093 269 519 2276 2327 -470 -2663
2176b663M30P49o92N8K439K361p6j002j76m77j913j328P65J263K84N69J599N33
$$ -2663 -2233 -1484 -2176 -2118 321 2682 2606 1604 1428 951 -962 -2290 -1525 -262 22 591 2190 2723
2194B723k011k132n4J47j194m60K452K857K90j145Q1L98j680k536l55J572Q63
$$ 2723 712 -1420 -1474 -1327 -2521 -2981 -529 2328 2618 1473 1554 1952 272 -2264 -2619 -1047 -184
2211a84J2R22J278m33j794j100j93o05l76J489K435R30l87K71M51j590k922r11
$$ -184 -172 750 2028 1595 -199 -1299 -1492 -2097 -2473 -984 1451 2381 1994 2265 2716 1126 -1796 -2707
2229b707J281P12n14P18K211Q83j711j721o7m2j043k26J696J797L63K6M59n09
$$ -2707 -1426 -714 -1228 -510 1701 2584 873 -848 -915 -957 -2000 -2226 -530 1267 1630 1656 2115 1606
2247A606j807j263K63J79n55M27J918J049j088j034N69L96j386j055J165J778
$$ 1606 -201 -1464 -1201 -1022 -1577 -1150 768 1817 729 -305 264 660 -726 -1781 -616 1162
2263A162l8q45L76P69q55j620l77O50L4k23P15J035n5o36J76K79p90r35O15J191
$$ 1162 1124 279 655 1424 569 -1051 -1428 -778 -744 -967 -252 783 728 92 268 547 -243 -1178 -563 628
2283F28j57q29N29J197l49j600l06J112J63j152k64J183N79p03l98O70L89n76
$$ 628 471 -358 171 1368 1019 -581 -887 225 388 -764 -1028 155 734 31 -367 303 692 116
2301A16l44L65M0o85j77N93L5o27J75J127L21r42l54Q92L05j177p66Q90R90n64
$$ 116 -228 137 177 -508 -685 -92 -57 -684 -509 618 939 -3 -357 535 840 -337 -1103 -213 777 213
2321B13p57N71Q82m65j050RO67j06m20L04O59j49l62K11K22o02o16N07P19m56
$$ 213 -544 27 909 444 -606 -597 70 -36 -456 -152 507 358 -4 207 429 -173 -789 -282 437 -19
2341a9o86N93Q73m55j195J27J117Q5q47R2J172L50q64m73L89R1p03k96M38K22
$$ -19 -705 -112 761 306 -889 -762 355 440 -407 -315 857 1207 343 -130 259 350 -353 -649 -211 11
2361A1l15O1M65q9n92O7P18J3p21L4R12J82j023m77Q21N77p13n89P47O91m97q23
$$ 11 -304 -243 222 133 -459 -392 326 339 -382 -348 564 746 -277 -754 67 644 -69 -658 89 780 283 -540
2383e40Q8N27k22l86L60O79P4j50K38j3p33n91K34K63m53j49R06Q61m41q90J28
$$ -540 -452 75 -147 -533 -173 506 580 430 668 655 -78 -669 -435 -172 -625 -774 132 993 552 -338 -210
2404b10M94n30r31K97J176M97m02k6M68j30r18n79J20K61O4M03O75J57l72j70
$$ -210 284 -246 -1177 -880 296 793 391 365 833 703 -215 -794 -674 -413 -349 54 729 886 514 344
2424C44o6o67q61J22J001M99l06K16Q38K9j241r92J93M44k73r0R69J073rn98l08
$$ 344 278 -389 -1250 -1128 -127 372 66 282 1120 1149 -92 -1084 -891 -447 -720 -810 159 1232 1223 625 317
2445C17k18o56n82J90N46L40M48P47J93p92p70p0p4o37k59R89J220O7n61K3K24
$$ 317 99 -557 -1139 -949 -403 -63 385 1132 1325 533 -237 -307 -381 -1018 -1277 -288 932 999 438 461 685
2466F85o77j224l12P44N77J61L96P20J45o08o21l27l80k66M11Q28L02n4K79K85
$$ 685 8 -1216 -1528 -784 -207 -46 350 1070 1215 607 -14 -341 -721 -987 -576 252 554 500 779 1064
2486A064o52j205l35N25K64k85L03J132N61o50p93j13J7n65l93M66P65L52O6J23
$$ 1064 412 -793 -1128 -603 -339 -624 -321 811 1372 722 -71 -184 -167 -732 -1125 -659 106 458 524 647
2506F47q9n16m77pj1j40L22Q41M63l87m54J64j2p84o92L79Q03J20l05J82O17n5
$$ 647 558 42 -435 -442 -453 -593 -271 570 1033 646 192 356 344 -440 -1132 -753 50 170 -135 47 664 609
2528F09p04l26K16J50j83L5L17J13j90pJ00k65l08J93M38j44l24J67O06On97m7
$$ 609 -95 -421 -205 -55 -238 -203 114 227 37 30 130 -135 -443 -250 188 44 -280 -113 493 499 -98 -145
2550a45O37K18n85m07L01J88n17m84J96M60O6p2K20K43j26k18Pl6j89J19N54K57
$$ -145 492 710 125 -282 19 207 -310 -794 -598 -138 -72 -144 76 319 193 -25 -18 -54 -243 -124 430 687
2572F87k96k71J76j02q49n90L77P34J22m4N16O90j81q70m93Q0j1j76K50O42L95
$$ 687 391 120 296 194 -655 -1245 -868 -134 -12 -56 460 1150 969 99 -394 -314 -325 -501 -251 391 786
2593G86o4j93l92p15o65o6L29K89L64R27R11m4p47n10o2m66p05J4R15P96L8k21
$$ 786 722 529 137 -578 -1243 -1309 -980 -691 -327 600 1511 1467 720 210 148 -318 -1023 -1009 -94 702 740 519
2615E19lk27p72p74p5M50N27N98O83L39j93m55m47n83o54n0O97O63O6O9L12L0
$$ 519 516 289 -483 -1257 -1332 -882 -355 243 926 1265 1072 617 170 -413 -1067 -1117 -420 243 309 378 690 720
2637G20r33r15k9N40K83J89O91Q68J47o56o83m06m42m27N6N41M55L49L03K7m98
$$ 720 -213 -1128 -1157 -617 -334 -145 546 1414 1561 905 222 -184 -626 -1053 -997 -456 -1 348 651 678 180
2658A80o36j99J55n6k8O11Q64J60n66l85M1j57o70k50N89O06P8j46J30O0l61m25
$$ 180 -456 -655 -500 -556 -584 27 891 1051 485 100 141 -16 -686 -936 -347 259 337 191 321 381 20 -405
2680d05k9J96J31L02L81N9l83l06m9j93n19o9O86N44q4j77L22K02n12o33mM56
$$ -405 -434 -238 -107 195 576 635 252 -54 -103 -296 -815 -884 -198 346 262 85 407 609 97 -536 -540 -84
2702h4J65j24J50L23kl81l04k9m9M0K55L45K3j02Q8l7m33m41J33N08J10k16J52
$$ -84 81 -43 107 430 428 47 -257 -286 -335 -295 -40 305 328 226 314 277 -156 -597 -464 44 154 -62 90
2725I0L98j31p45m27K57L10j3J29O06M95j04m16k94k70l76j63K14K96J87K88K91
$$ 90 488 357 -388 -815 -558 -248 -261 -132 474 969 865 449 155 -115 -491 -654 -440 -144 43 331 622
2746F22j55o36m28J36R1j66J64P76O37j78n63j84p5n29n40R7P00M80J65J22R6
$$ 622 467 -169 -597 -461 -370 -536 -372 404 1041 863 300 116 41 -488 -1028 -931 -231 249 414 536 632
2767F32l34n77l93r1R4L70P09P19R0l41k48l70q67q26QP53N45K34M47O24q9r19
$$ 632 298 -279 -672 -763 -669 -299 410 1129 1219 878 630 260 -607 -1433 -1425 -672 -127 107 554 1178 1089 170
2789A70q61j99J8qL76Q36Q11J98k43m42p51q77m03J95M13M79Q01Q25J48p13p90
$$ 170 -691 -890 -872 -880 -504 332 1143 1341 1098 656 -95 -972 -1375 -1180 -767 -288 513 1338 1486 773 -17
2810a7m06l50m77K4R88J127M12j32j73m08r30j063l66L76P10P29R14O06o2n90
$$ -17 -423 -773 -1250 -1226 -238 889 1301 1169 996 588 -342 -1405 -1771 -1395 -685 44 958 1564 1502 912
2830I12q09p76p81k01O37J081P25M14L52Jr79j354p80P8K54L66Q57J180O57l94
$$ 912 103 -673 -1454 -1655 -1018 63 788 1202 1554 1555 576 -778 -1558 -1480 -1226 -860 -3 1177 1834 1440
2850A440p97p60p57o36j26O50R59P92O20K66n00j041q86m08k07L9P62J313Q47
$$ 1440 643 -117 -874 -1510 -1636 -986 -27 765 1385 1651 1151 110 -776 -1184 -1391 -1352 -590 723 1570
2869A570r5m20m20o94j044p21L54R83P44N36N57J90n85j062q52l77j27L37Q91
$$ 1570 1475 1055 635 -59 -1103 -1824 -1470 -487 257 793 1350 1540 955 -107 -959 -1336 -1463 -1126 -235
2888b35R54M63P2j23n63j041q69K6N09M18M38Q08O84k09r12p31k80l08l13L16
$$ -235 719 1182 1254 1131 568 -473 -1342 -1316 -807 -389 49 857 1541 1332 420 -311 -591 -899 -1212 -896
2908h96Q81P83K28m4j86n46p49m16j9K02L18O41O52J24m06l49k08m32n88%O93
$$ -896 -15 768 996 952 766 220 -529 -945 -964 -762 -444 197 849 973 567 218 10 -422 -1010 -1010 -317
2929c17O36J32L1K94K1n76o48j75J69k2Q5L77M12J00j59j11j81l81k28J84J84
$$ -317 319 451 482 776 797 221 -427 -602 -433 -455 -370 7 419 519 360 249 68 -313 -541 -357 -173
2950a73k4J40M20L18k91m01n3J31l27m12J12N05K37j19J01L28J1l56k92k6n4j37
$$ -173 -197 -57 363 681 390 -11 -64 67 -260 -672 -560 -55 182 63 164 492 503 147 -145 -171 -225 -362
2972c62J00L28K02NJ14L6l32n29j69J43rq8L38P30L08k64k58M0j66n73l81K78
$$ -362 -262 66 268 273 387 423 91 -438 -607 -464 -473 -561 -223 507 815 551 293 333 167 -406 -787 -509
2994e09M64J87J15K90P5l36n02k73j51j03K47N95M88P5rM9k68p57n71J28L65O9
$$ -509 -45 142 257 547 622 286 -216 -489 -640 -743 -496 99 587 662 653 702 434 -323 -894 -766 -401 -332
3016c32J64N48M83j73o40l80p9j93j87L07P02M84J31M6j53n29o03k75nOJ89N80
$$ -332 -168 380 863 690 50 -330 -409 -602 -789 -482 220 704 835 881 728 199 -404 -679 -684 -678 -489 91
3038I1O17K4m13j63p1l74n18M4N93M80O8K5K61q3n38n57q4R0L9J96M47L28l9r3
$$ 91 708 732 319 156 85 -289 -807 -763 -170 310 378 403 664 581 43 -514 -598 -508 -469 -273 174 502 463 370
3062C70n8k73m30j13K75K70k1J46L73R7m58n18k1P7j73j10L96N33J13j83n0Nk59
$$ 370 312 39 -391 -504 -229 41 20 166 539 636 178 -340 -361 -284 -457 -567 -171 362 475 292 242 247 -12
3085a2l28o1J64Q6R6K44J99j23k39k7K8k49k17K32M34K4k14J11K53j42m59j48
$$ -12 -340 -401 -237 -151 -55 189 388 265 26 -1 27 -222 -439 -207 227 251 37 148 401 259 -200 -348
3107c48J78J07k04K8L18J56j33j31M8k4j48pK18J28o8M7J81j62l61j41J91N5k50
$$ -348 -170 -63 -267 -239 79 235 102 -29 19 -5 -153 -160 58 186 118 165 346 184 -177 -318 -127 -72 -322
3130c22nM26K89j68k44J30J05k42k40P8K81L4q9P5P4j41k61l1J1r6K5L17K90r6
$$ -322 -327 99 388 220 -24 106 211 -31 -271 -193 88 122 33 108 182 41 -220 -251 -240 -336 -311 6 296 200
3154B00j13J47J13l00l43J57L41l8k10R1K26o7m50j71J45R2p6J41L32J53r1p4
$$ 200 87 234 347 47 -296 -139 202 164 -46 45 271 204 -246 -417 -272 -180 -256 -115 217 370 279 205
3176B05k6j80k71k9K01Q4m8J82K89q4m44k21J35M0k46L4M95L60o1j71N5o2l11
$$ 205 179 -1 -272 -301 -100 -16 -64 118 407 323 -121 -342 -207 -167 -413 -379 116 476 415 244 299 237 -74
3199g4l12K7K04P8R0K29J02k43k29m1q8k03J1M21M10l4q9J45K8m04n03nK63O1
$$ -74 -386 -359 -155 -77 13 242 344 101 -128 -169 -257 -460 -449 -28 382 348 259 404 432 28 -475 -480 -217 -156
3223a56MK36M14j3k97k74r0j87j45J41L34K22J25J82P4l24m73j72L2q2m8L12N72
$$ -156 -152 84 498 485 188 -86 -176 -363 -508 -367 -33 189 314 496 570 246 -227 -399 -367 -449 -497 -185 387
3246C87J86k15j43Pk19m61j88L08L26J59J48K71Ml43l48k30j54j09J95M37L41
$$ 387 573 358 215 222 3 -458 -646 -338 -12 147 295 566 570 227 -121 -351 -505 -614 -419 18 359
3267C59O3K6N3k77n71l61J16K80J10J83M80L58k14m84k77j46k36j83L29M67L79
$$ 359 422 448 501 224 -347 -708 -592 -312 -202 -19 461 819 605 121 -156 -302 -538 -721 -392 75 454
3288D54J45P2j21m34m84k46L0O0K01N24N06jl24j90j92m22m22J12N27M21J31J57
$$ 454 599 671 550 116 -368 -614 -584 -524 -323 201 707 706 382 192 0 -422 -844 -732 -205 216 347 504
3310E04J91j76n88m09j41N5J04L23N33K92q3j83j94m04m60r4L90K76J51L09L76
$$ 504 695 519 -69 -478 -619 -564 -460 -137 396 688 605 422 228 -176 -636 -730 -340 -64 87 396 772
3331G72q2n34n12r9k4p8R1N21N17L9j87j76k03l88l02P3L18K25L32K59N0l16l66
$$ 772 690 156 -356 -455 -479 -557 -466 55 572 611 424 248 45 -343 -645 -572 -254 -29 303 562 612 296 -70
3354g0j74j02j84M3M46M67P5j90m3m8l84m31JL38K91P3J94K19o9l94k97q0p4J6
$$ -70 -244 -346 -530 -487 -41 426 501 311 268 220 -164 -595 -594 -256 35 108 302 521 452 58 -239 -319 -393 -377
3378c77K43L57J70r5j1q5k59l83m5K84J85K5J77L14K6l94l55k4J0j11J6L43L04
$$ -377 -134 223 393 298 287 202 -57 -440 -485 -201 -16 9 186 500 526 132 -223 -247 -237 -348 -332 11 315
3401C15J4j13o5j73k27j82J15K00R5K07K65K6k63k82m1m7k02n5L36L40L8j49L5
$$ 315 329 216 151 -22 -249 -431 -316 -116 -21 186 451 477 214 -68 -109 -156 -358 -413 -77 263 301 152 187
3424A87mk24l49k8K21J48P8J76K15j19k05j30q5j94j02J61K96Q7j2J50J08k25
$$ 187 183 -41 -390 -418 -197 -49 29 205 420 301 96 -34 -119 -313 -415 -254 42 129 117 267 375 150
3446A50l67r8J44K9m5J74L48J36j78j77p1j75k50q5J82K31J19J69J59l1k87j70
$$ 150 -217 -315 -171 -142 -187 -13 335 471 293 116 45 -130 -380 -465 -283 -52 67 236 395 364 77 -93
3468i3q5n9j97J27L79K71n4p5R2r7m10l01R1J91J01J34K96K28o0k92k44j54k24
$$ -93 -178 -237 -434 -307 72 343 289 214 306 209 -201 -502 -411 -220 -119 15 311 539 479 187 -57 -211 -435
3491d35o1J88L26J93J28J49p1l82l97r7P4j6J04M37M67P2k79j96j62l37l75lL80
$$ -435 -496 -308 18 211 339 488 417 35 -362 -459 -385 -401 -297 140 607 679 400 204 42 -295 -670 -673 -293
3514b93L41K14J79J26j45m14k87j60j26P6L39M66K63k7r2j58m32m80j61K09L23
$$ -293 48 262 441 567 422 8 -279 -439 -565 -489 -150 316 579 552 460 302 -130 -610 -771 -562 -239
3535b39K18K70L97Q4l45m75k12j50j04J11M47M07K22k7j02l30m97l47n5J64K23
$$ -239 -21 249 646 730 385 -90 -302 -452 -556 -445 2 409 631 604 502 172 -325 -672 -727 -563 -340
3556c40L83M80K73k09l56k46k35l54j20L03N31K90R6P4q0l85m93k76LJ73K59M30
$$ -340 43 523 796 587 231 -15 -250 -604 -724 -421 110 400 496 570 490 105 -388 -664 -661 -488 -229 201
3578B01L92J33j42k49l14m11k81Q6L36L31K12K09J82k62n36l80o8LL7L11N31L89
$$ 201 593 726 584 335 21 -390 -671 -585 -249 82 294 503 685 423 -113 -493 -561 -558 -521 -210 321 710
3600G10k2j63k60l34m23k12J40K82K91L17L36k1l33l82k29k09j77J19N45M75J30
$$ 710 688 525 265 -69 -492 -704 -564 -282 9 326 662 641 308 -74 -303 -512 -689 -570 -25 450 580
3621E80rm1j92m72m71p4J84K41K25L92K71n8k97l15k85k55p1K57M18K86J61J52
$$ 580 571 530 338 -134 -605 -679 -495 -254 -29 363 634 576 279 -36 -321 -576 -647 -390 28 314 475 627
3643F27l9m17n20k03KO3J29M31M64J48k07k23k58l15l12l4L07L80K56K46J14j49
$$ 627 588 171 -349 -552 -550 -487 -358 73 537 685 478 255 -3 -318 -630 -664 -357 23 279 525 639 490
3665D90m09l33j99j39L5L33M63K84k0m9n8l31m66k23J31K40K16K26K93J14k17
$$ 490 81 -252 -451 -590 -555 -222 241 525 505 456 398 67 -399 -622 -491 -251 -35 191 484 598 381
3686C81l85k50j30j40N6L01L76J81Q5J0k27l63l28m2M4R0K42L88K76p0k63j64
$$ 381 -4 -254 -384 -524 -468 -167 209 390 475 485 258 -105 -433 -475 -431 -341 -99 289 565 495 232 68
3708F8j70k60j71J44L51K34J23J00Mj55l51k26j18k3J05K82K76J45k2k4j14k71
$$ 68 -102 -362 -533 -389 -38 196 319 419 423 268 -83 -309 -427 -450 -345 -63 213 358 336 312 198 -73
3730g3k56n7J66J41N9K01K06k1k31k35r7n0j12P1K30K26J07J8j5j23k47j59QN1
$$ -73 -329 -386 -220 -79 -20 181 387 366 135 -100 -197 -247 -359 -288 -58 168 275 293 278 155 -92 -251 -243 -192
3754a92K8J38K17J17j46j05J8j50k16r1J82K11J03j1J81P5j69k32j07Kq2j7J45
$$ -192 -164 -26 191 308 162 57 75 -75 -291 -382 -200 11 114 103 284 359 190 -42 -149 -147 -229 -246 -101
3777a01K01P8nj9j6j67j82JO4J4O2J65K10o3j37n7j5j30j86K7K22J08J4M6N6j7
$$ -101 100 178 173 154 138 -29 -211 -210 -146 -132 -70 95 305 242 105 48 33 -97 -283 -256 -34 74 88 134 190 173
3803A73j93j12kj2kJ10J61O6l2k0k0j36k07n0J21J03k2J44J67O2j82j89j2l1j06
$$ 173 -20 -132 -134 -146 -148 -38 123 189 157 137 117 -19 -226 -276 -155 -52 -74 70 237 299 117 -72 -84 -115 -221
3828b21qJ77J87P2%L8q6j78j50l4QL4P7K30Q8o1o5p1o6j66j18J54K14O0lO1L8
$$ -221 -229 -52 135 207 207 245 159 -19 -169 -203 -195 -161 -84 146 234 173 108 37 -29 -195 -313 -159 55 115 112 173 211
3855B11o7k72r4N9J1QJ46J90Om6r3n8j52j07O8J41J00L8J11J12j46k67p9M1j2
$$ 211 144 -128 -222 -163 -152 -144 2 192 198 152 59 1 -151 -258 -190 -49 51 89 200 312 166 -101 -180 -139 -151
3880a51l8J12K13J53j32q3n0p1j52n7J10J69Q0O4P4n6j71j58l3k8j7J26K18J35
$$ -151 -189 -77 136 289 157 74 24 -47 -199 -256 -146 23 103 167 241 185 14 -144 -177 -205 -222 -96 122 257
3904B57q2j04nr3k01p0J27J79J12L5P9nj83j96q6J9J6R1K04J78j5o4p2j33k07
$$ 257 175 71 66 -27 -228 -298 -171 8 120 155 234 229 46 -150 -236 -217 -201 -110 94 272 257 193 121 -12 -219
3929b19r9J05J77J44N7J47L3j94k97j49K8J2M1J98K72J47j35j26j23j79j78J6
$$ -219 -318 -213 -36 108 165 312 345 151 -146 -295 -267 -255 -214 -16 256 403 268 142 19 -160 -338 -322
3951c22J77J91J32J24O1j34l14j67n3nK8K11L17J66m4j40j47j62k64q9J55K74
$$ -322 -145 46 178 302 363 229 -85 -252 -305 -310 -282 -71 246 412 368 228 81 -81 -345 -434 -279 -5
3973eJ61J45Q7n1k68k52j58o5L0K22K86K37M0r0j01k08l20j72R6K31J63J94K12
$$ -5 156 301 388 337 69 -183 -341 -406 -376 -154 132 369 409 319 218 10 -310 -482 -386 -155 8 202 414
3996D14K7j70l46k08o7l7R2K45L20J71l1j05j95l13k26PJ57J48K23K23J76j56
$$ 414 441 271 -75 -283 -350 -387 -295 -50 270 441 410 305 110 -203 -429 -422 -265 -117 106 329 505 349
4018C49k69k54j33r0l8K31L27K57N6r0j02k42l17j84L0K56K02K51J89L9k12k26
$$ 349 80 -174 -307 -397 -435 -204 123 380 436 346 244 2 -315 -499 -469 -213 -11 240 429 468 256 30
4040C0k24j65j02R6L19K91P9N3%j65l49k72j9J28J39J89L07J55p0k35k32j93j36
$$ 30 -194 -359 -461 -365 -46 245 324 377 377 212 -137 -409 -428 -300 -161 28 335 490 420 185 -47 -240 -376
4063c76n1J93K55K10J25L4j15k61k90j12O1M1J44K78K50N0j90j48j68k01j77O3
$$ -376 -427 -234 21 231 356 390 275 14 -276 -388 -327 -286 -142 136 386 436 246 98 -70 -271 -448 -385
4085c85K51K11J39R7N3j26k73k04o5j4J03J85K56J39o8k2j51k58j99n0J35J49
$$ -385 -134 77 216 313 366 240 -33 -237 -302 -316 -213 -28 228 367 299 277 126 -132 -331 -381 -246 -97
4107i7J34J34J49Rj83k54o8l1l1P0J97J77M0n4n3j18k08r0L4J17N7J52J72O9j27
$$ -97 37 171 320 329 146 -108 -176 -207 -238 -168 29 206 246 192 139 21 -187 -277 -243 -126 -69 83 255 324 197
4132A97j56r3o7j07nJ63J83N4k8Jj7j48j59m7O9O1O0J42J02%r0o7p5q4q3M6J29
$$ 197 41 -52 -119 -226 -231 -68 115 169 141 142 125 -23 -182 -229 -160 -99 -39 103 205 205 115 48 -27 -111 -194 -148 -19
4159a9M0j3Q1L4o5j45m9P4J5j1K8J19Q1p6p0j2%q5j2K2M0JN8K9l2n6k5M7jj6j9
$$ -19 21 8 89 123 58 -87 -136 -62 -47 -58 -30 89 170 94 24 12 12 -73 -85 -63 -23 -22 36 65 33 -23 -48 -1 -2 -18 -37
4190c7Q6L9q0l0N9J9q3o9N8N9m3n2P6K1k1RPK6mo1j5Q5p2l6O6O7l5o4O9J9q6o0
$$ -37 49 88 8 -22 37 56 -27 -96 -38 21 -22 -74 2 23 2 11 18 44 40 -21 -36 49 -23 -59 7 74 39 -25 44 63 -23 -83
4222h3O3N3rn7O2O8K0p8m7J3k5o0K5O8Pk6K2O2l2p9l0J9J4j4L3Q0Oo4NK6l2q7
$$ -83 -20 33 24 -33 29 97 117 39 -8 5 -20 -80 -55 13 20 -6 16 78 46 -33 -63 -44 -30 -44 -11 69 75 11 16 42 10 -77
4254g7n4Q2J11k8j2L6L8p0p3qnJ2nO1O7m6%L2n1r7l4P6N4m0J8R1M3n7q8j8Kl1
$$ -77 -131 -49 62 34 22 58 96 26 -47 -55 -60 -48 -53 8 75 29 29 61 10 -87 -121 -45 9 -31 -13 78 121 64 -24 -42 -40 -71
4286g1l9K5J03L4l3K7K2m7n1nJ4Jl0N3R8j7m4l9M3o7q1K2O4%JM5N1Oo9p8O4Ml3
$$ -71 -110 -85 18 52 19 46 68 21 -30 -35 -21 -20 -50 3 101 84 40 1 44 -23 -104 -82 -18 -18 -17 28 79 85 16 -62 2 6 -27
4319b7JO6L2k8k9mm3p0k1N1N7lK7R0L6q3o8N0l5o5k0P4Q9l8n6M9j7m2o1J2M6q
$$ -27 -26 40 72 44 15 11 -32 -102 -123 -72 -15 -18 9 99 135 52 -16 34 -1 -66 -86 -12 77 39 -17 32 15 -27 -88 -76 -30 -38
4351c8M2N3K2K4o1%Km8o7O2L6l9l6J5N5n8l9J8N4L1m1M6O5ln1n9j3J1nn1Q3mJ1
$$ -38 4 57 79 103 42 42 44 -4 -71 -9 27 -12 -48 -33 22 -36 -75 -57 -3 28 -13 33 98 95 44 -15 -28 -17 -22 -73 10 6 17
4384A7rK9l3n6j6M5O0n7M6J04j1r1m6L8m8J4p0Q3K7j3j9k8K9m0j4M9J5L0L3P%
$$ 17 8 37 4 -52 -68 -23 37 -20 26 130 119 28 -18 20 -28 -14 -84 -1 26 13 -6 -34 -5 -45 -59 -10 5 35 68 75 75
4415G5r2n1J5j4Nj2J22N0k6m4j7Jn5o5K0P3O0QnO9l2j15k7ql5M4K6Q7J2kk7Ko6
$$ 75 -17 -68 -53 -67 -62 -74 48 98 72 28 11 12 -43 -108 -88 -15 45 53 48 117 85 -30 -57 -65 -100 -56 -30 57 69 67 40 42 -24
4448b4p4mR6J0K9j0M0Nq9r8L0K7mN2P7O8j4n9m5m2q5k6N5Q5L5J6R0n2r3p4j9L0
$$ -24 -98 -102 -6 4 33 23 63 68 -21 -119 -89 -62 -66 -14 63 131 117 58 13 -29 -114 -140 -85 0 35 51 141 89 -4 -78 -97 -67
4480f7j0%J05J11J2o7l3m4o5n9K4M9O3M5oN7q5r8j0rK3K3P4P0J3n3j8l9o9r9J2
$$ -67 -77 -77 28 139 151 84 51 7 -58 -117 -93 -44 19 64 58 115 30 -68 -78 -87 -64 -41 33 103 116 63 45 6 -63 -162 -150
4511a50J30N0JN2K5j8j03p4K7k6J4O5J05Qj5j1n1p5q7j3P4M1M2M6M4jp6p0%m0
$$ -150 -20 30 31 83 108 90 -13 -87 -60 -86 -72 -7 98 106 91 80 29 -46 -133 -146 -72 -31 11 57 101 100 24 -46 -46 -86
4541h6qL4Q5R8rn1n3n3p2NK4O5M5M3L6J4o3q3l5j5l5OJ13R5M1o4j6Jr3j04PN6
$$ -86 -94 -60 25 123 114 63 10 -43 -115 -110 -86 -21 24 67 103 117 54 -29 -64 -79 -114 -108 5 100 141 77 61 62 -31 -135 -128 -72
4573g2Q7J6M6L2Jp6n7n7k7lL3Q2M0M4NK1q7p9n4K7J6j9J02Q5L6p0p4j5j9q3j1
$$ -72 15 31 77 109 110 34 -23 -80 -107 -110 -77 5 45 89 94 115 28 -51 -105 -78 -62 -81 21 106 142 72 -2 -17 -36 -119 -130
4604a30P4P7O8O1n2J2r5o5n1k7J8M4R9P0J7qm1o2j08o3M9O1M3N0P8N3n4j02p4
$$ -130 -56 21 89 150 98 110 15 -50 -101 -128 -110 -66 33 103 120 112 71 9 -99 -162 -113 -52 -9 41 119 172 118 16 -58
4633e8m8j7l1R0P5J29k5M3n8r3p6l8nL1M3J00J20k1p7p9j2j00n8j3J29J06M3L9
$$ -58 -106 -123 -154 -64 11 140 115 158 100 7 -69 -107 -112 -81 -38 62 182 161 84 5 -7 -107 -165 -178 -49 57 100 139
4661A39L2n0j01j25k7k4K7Q4J37M5qm2o2p3r4l1P4O3O1Q0P9rq1r4r6k9m1L9J20
$$ 139 171 121 20 -105 -132 -156 -129 -45 92 137 129 87 25 -48 -142 -173 -99 -36 25 105 184 175 94 0 -96 -125 -166 -127 -7
4690gQ5M2J0j3n4j23o1oJ0P1Q7Q2L7k6q4p2p4o3l2M4J04R6M3K4%l4q6p6pJ0M0
$$ -7 78 120 130 117 63 -60 -121 -127 -117 -46 41 123 160 134 50 -22 -96 -159 -191 -147 -43 53 96 120 120 86 0 -76 -83 -73 -33
4721c3M1J00Rk3n3o9n8p2lM9O8N1Q4N9l6m5n7l4k8l4JR4O1j0k3k2k3q1p1MN5O5
$$ -33 8 108 117 94 41 -28 -86 -158 -161 -112 -44 7 91 150 114 69 12 -22 -50 -84 -83 11 72 62 39 17 -6 -87 -158 -154 -99 -34
4753c4P9M8O7k0k9p0n4n1n9PP2M3N2M9J3p8q6m9JK4J0M3J21O2J9m8o7p2r3k7L
$$ -34 45 93 160 140 111 41 -13 -64 -123 -116 -44 -1 51 100 113 35 -51 -100 -99 -75 -65 -22 99 161 180 132 65 -7 -100 -127 -124
4784a24PR4N8Q4nn7n2l4p4j4L3R1P3M3j7j1k4j47p2LNL7J09R4O7j1l9r2r3o1J
$$ -124 -117 -23 35 119 114 57 5 -29 -103 -117 -84 7 80 123 106 95 71 -76 -148 -145 -140 -103 6 100 167 156 117 25 -68 -129 -128
4815a28K7J00M9P4M9j1r5j21o6m4lO0J04J23K3L3k6r4j16j20J7L0P7O8J07J7k3
$$ -128 -101 -1 48 122 171 160 65 -56 -122 -166 -169 -109 -5 118 141 174 148 54 -62 -182 -165 -135 -58 10 117 134 111
4842A11n9p0q3l0J7M8O9J03K0J8j9j23r1r2J4K3N9R7J28K7jr7q8n0j08L2P7Q7
$$ 111 52 -18 -101 -131 -114 -66 3 106 126 144 125 2 -89 -181 -167 -144 -85 12 140 167 166 69 -19 -69 -177 -145 -68 19
4870A9N2J22j1n8j14j15o8n1K0J15J24J09K4M5n9j01j03j05K0M2N9P3O5K9j6r6
$$ 19 71 193 182 124 10 -105 -173 -224 -204 -89 35 144 168 213 154 53 -50 -155 -135 -93 -34 39 104 133 117 21
4896B1q2p8Pl9J19R8P7N8Oo5j06o5o7nKN1J01M3L1m0p5o2o0k6rJ13J16P2M2Rm4
$$ 21 -61 -139 -132 -171 -52 46 123 181 187 122 16 -49 -116 -121 -119 -68 33 76 107 67 -8 -70 -130 -156 -165 -52 64 136 178 187 143
4927A43j19p8p8m4L5M5J20M3K5J1m4n4p6l5K0M7N0N4O1K9n1q8l6l8m7mN8J5N6
$$ 143 24 -54 -132 -176 -141 -96 24 67 92 103 59 5 -71 -106 -86 -39 11 65 126 155 104 16 -20 -58 -105 -109 -51 -36 20
4956B0L6K3k2n7k2mj0J5M3RP0l6n8j4Kn9j8lL2M0N4JJ0Ll5k9k6j0K0nK7QK9RJ6
$$ 20 56 79 57 0 -22 -26 -36 -21 22 31 101 65 7 -7 -5 -64 -82 -85 -53 -13 41 42 52 55 20 -9 -35 -45 -25 -30 -3 5 34 43 59
4991E9k0n7j3j1l4MM1L2J4L3lM4m2j8p2j2j2qN3J8K3O1j6jn9l5m5j0LN1L4Q5J7
$$ 59 39 -18 -31 -42 -76 -72 -31 1 15 48 45 89 47 29 -43 -55 -67 -75 -22 -4 19 80 64 63 4 -31 -76 -86 -83 -32 2 87 104
5024A04k9m2n3l3j9J2MP0O9K4lm8n7l7p8NJ9R1L0M8L5k9l9q3p8koO7J06K4O1J6
$$ 104 75 33 -20 -53 -72 -60 -56 14 83 107 104 56 -1 -38 -116 -111 -92 -1 29 77 112 83 44 -39 -117 -119 -125 -58 48 72 133 149
5056A49m3j07r8l0kL9K3J09N7N0J0o5r4o0n7oM8P1O7N6Jk3p0m7o9k1J3N4P8M1
$$ 149 106 -1 -99 -129 -131 -92 -69 40 97 147 157 92 -2 -62 -119 -125 -77 -6 61 117 118 95 25 -22 -91 -112 -99 -45 33 74
5086G4K3K7o4o5q6l8RL2Q2N9N2J0l6o1o5n7mJ8N1O1N7K4K5p7p3m4p3K2M7O0L8
$$ 74 97 124 60 -5 -91 -129 -120 -88 -6 53 105 115 79 18 -47 -104 -108 -90 -39 22 79 103 128 51 -22 -66 -139 -117 -70 -10 28
5117B8O8J8j1n8o7l4l4PK3N3Q5j4J1l3m7n4m5J0M4O0K9L3RJ2p0l2n8kkJ1N5L1
$$ 28 96 114 103 45 -22 -56 -90 -83 -60 -7 78 64 75 42 -5 -59 -104 -94 -50 10 39 72 81 93 23 -9 -67 -69 -71 -60 -5 26
5149B6M7om1l9l2JqL4K1M3M8pk3l0l1l8l3j7K2M9J9K4k5J1j8K0l5k2L0JPL3k2
$$ 26 73 67 26 -13 -45 -44 -52 -18 3 46 94 87 64 34 3 -35 -68 -85 -63 -14 5 29 4 15 -3 17 -18 -40 -10 -9 -2 31 9
5182IJ5Pn8qK0j4rjK3QL0J6j9L0j2j0k0j6l1RPJ5J6k1L7ol2J0j7kk3L7N5J3Ko
$$ 9 24 31 -27 -35 -15 -29 -38 -39 -16 -8 22 38 19 49 37 27 7 -9 -40 -31 -24 -9 7 -14 23 17 -15 -5 -22 -24 -47 -10 45 58 60 54
5218E4k4k3o4m3QL7K9L7O9orl0m7m7j4K0M0M2K9K7j8j0o2o0l2pM8N0M7P8J2k3
$$ 54 30 7 -57 -100 -92 -55 -26 11 80 74 65 35 -12 -59 -73 -53 -13 29 58 85 67 57 -5 -65 -97 -104 -56 -6 41 119 131 108
5250A08o3p5m3k0M0L0M1N9PKp8m6m0Km4O3P8O8O1l9l3n4m5q7j3K1Q8L4N7Lj9l0
$$ 108 45 -30 -73 -93 -53 -23 18 77 84 86 8 -38 -78 -76 -120 -57 21 89 150 111 78 24 -21 -108 -121 -100 -12 22 79 82 63 33
5282C3o1m7nK4J1Q9P7J2l9o0m3o8m7OP5M8L4RJ0k5n3o2MJ7L3P4K5L3l3k2o6o1
$$ 33 -28 -75 -80 -56 -45 44 121 133 94 34 -9 -77 -124 -118 -43 5 39 48 58 33 -20 -82 -78 -61 -28 46 71 104 71 49 -17 -78
5314g8k5l5O8K0N1L8MK0o4k0MKk1L7O1K5mk3m8m4n0l4L0O8K2J4J9J6k3m6Nj1l
$$ -78 -103 -138 -70 -50 1 39 43 63 -1 -21 -17 -15 -36 1 62 87 83 60 12 -32 -82 -116 -86 -18 4 18 37 53 30 -16 -11 -22 -25
5347b5j4O2K1qk8k0l0m7kK3L3M0L7LNKm9l9Jj3L2J0N6KJ6l0m9j5n1J1K3O0K5L
$$ -25 -39 23 44 36 8 -12 -42 -89 -91 -68 -35 5 42 45 50 52 3 -36 -35 -48 -16 -6 50 52 68 38 -11 -26 -77 -66 -43 17 42 45
5381D5%mm1j1j9J8j2lL6J8L0o4l1j6k6J1M4L1QO6j8j4m5m2jk4L5K2J0N0ppj5j1
$$ 45 45 41 0 -11 -30 -12 -24 -27 9 27 57 -7 -38 -54 -80 -69 -25 6 14 80 62 48 3 -39 -40 -64 -29 -7 3 53 46 39 24 13
5415A3j9l3jK2K2ML9K3l8j9l0nm1lL6L7J4J9Jj5l0n9K9K3J8J1J8k1L7m6j8J0l8
$$ 13 -6 -39 -40 -18 4 8 47 70 32 13 -17 -22 -63 -66 -30 7 21 40 41 26 -4 -63 -34 -11 7 18 36 15 52 6 -12 -2 -40
5448d0j8K5N9K4kk9K9j9k9j1oqMM5KKj7K1lk1l2oJ8M0k1k3P7k9J2n5K4kl0k2j9
$$ -40 -58 -33 26 50 48 19 48 29 0 -11 -17 -25 -21 24 26 28 11 32 29 8 -24 -30 -12 28 7 -16 61 32 44 -11 13 11 -19 -41 -60
5483f0N9jnMJ9k1L0j0j8J4m1K3K9j8KM3Jl9j4Jk5MJ1rM6Nj2K2k1km1k2J3K0J4
$$ -60 -1 -2 -7 -3 16 -5 25 15 -3 11 -30 -7 22 4 6 49 50 11 -3 -2 -27 -23 -12 -21 25 30 18 40 19 17 -24 -46 -33 -13 1
5518AQL3J5m3j1m4J7m6LN4L9%K2K1j8o7l9n%K3J2O7M2j5nPo1n0m7L1J0K7K8K8
$$ 1 9 42 57 14 3 -41 -24 -70 -67 -13 26 26 48 69 51 -16 -55 -60 -60 -37 -25 42 84 69 64 71 10 -40 -87 -56 -46 -19 9 37
5552C7P1l4r2jl1oj9O5J5M4J7oK1n6r0k3K2J8L6J1R5Lqm9o5l1l9LO4O7K2K8Qj7
$$ 37 108 74 -18 -19 -50 -56 -75 -10 5 49 66 60 81 25 -65 -88 -66 -48 -12 -1 94 97 89 40 -25 -56 -95 -92 -28 39 61 89 97 80
5586H0m9q8l4RJ1K3O5Q6mj9m7j5o4m7k4M7N7M4O1L4n8n1n7l5m5J0Q7L5P2K9ll6
$$ 80 31 -57 -91 -82 -71 -48 17 103 99 80 33 18 -46 -93 -117 -70 -13 31 92 126 68 17 -40 -75 -120 -110 -23 12 84 113 110 74
5618G4l3j09l0K1N1j5Q8N2J2m8l4o1m4l3K1L0P2N9K6K7n7n3r8j0k9K2L3R6O1%
$$ 74 41 -68 -98 -77 -26 -41 47 99 111 63 29 -32 -76 -109 -88 -58 14 73 99 126 69 16 -82 -92 -121 -99 -66 30 91 91
5648I1j0k3m3j04k0M3J9O7N3J9rj9n6l4o8m5L9Q3M3N8J9j1J5r9q0LJ7j2R6J8N1
$$ 91 81 58 15 -89 -109 -66 -47 20 73 92 83 64 8 -26 -94 -139 -100 -17 26 84 103 92 107 8 -72 -69 -52 -64 32 50 101
5679A01jm4n4l8q8nN2N9M9M4K3km9p7l7j5J3l6Q8L6N4Kk8k5l4o0l9M5L7O9M1J1
$$ 101 100 56 2 -36 -124 -129 -77 -18 31 75 98 96 47 -30 -67 -82 -69 -105 -17 19 73 75 47 22 -12 -72 -111 -66 -29 40 81 92
5711I2L1o2n0k1n8l1K9M5N3L6LJ5n6o6l2L0mJ6M4M8J5Mo1om0l7j9K4J4K5L8L3
$$ 92 123 61 11 -10 -68 -99 -70 -25 28 64 67 82 26 -40 -72 -42 -46 -30 14 62 77 81 20 14 -26 -63 -82 -58 -44 -19 19 52
5743E2Nj7k8m3jj4j7O6J5L6Kk1k0k3p8QL4J1J6K4Q9n0Kl6m1j7j9J7K8K7M0NPm3
$$ 52 57 40 12 -31 -32 -46 -63 3 18 54 56 35 15 -8 -86 -78 -44 -33 -17 7 96 46 48 12 -29 -46 -65 -48 -20 7 47 52 59 16
5777A6l2m7J9J0k1M3N5J6j2j8ppp4PK1PL6J4M3Qm1l4k9J7l0jN2L3j2j0Rjm0k9
$$ 16 -16 -63 -44 -34 -55 -12 43 59 47 29 22 15 -59 -52 -31 -24 12 26 69 77 36 2 -27 -10 -40 -41 11 44 32 22 31 30 -10 -39
5811c9kJ0Kj8N6K4jq%k0j4o8L5L4NOJ4K4Nn3j4K4m3J7j8N5K9l3L9K5j6q4j5L3
$$ -39 -41 -31 -29 -47 9 33 32 24 24 4 -10 -78 -43 -9 -4 2 16 40 45 -8 -22 2 -41 -24 -42 13 42 9 48 73 57 -27 -42 -9
5845iOl3N9LJ4rl8J0ok0j4QL2KK6M6k5m8k9J6k4j8LK9M7lL3Prp7rk6K0J1L8J3
$$ -9 -3 -36 23 26 40 31 -7 3 -3 -23 -37 -29 3 5 31 77 52 4 -25 -9 -33 -51 -48 -19 28 25 58 65 56 -21 -30 -56 -36 -25 13 26
5881B6K5j6mLl8k0m4K7rP4mN9Ql4p3j4J3n2L2J2M5K0lJ8j0o7k5l8K9K9J4N1L1
$$ 26 51 35 31 34 -4 -24 -68 -41 -50 24 20 79 87 53 -20 -34 -21 -73 -41 -29 16 36 33 51 41 -26 -51 -89 -60 -31 -17 34 65
5914F5pj5j8l2k1m0k1R4K6JK3Moo0n5K1J9k6L9M8J4K0m3%m3mo8L8M9k3N5NJ9n9
$$ 65 58 43 25 -7 -28 -68 -89 5 31 32 55 59 53 -7 -62 -41 -22 -48 -9 39 53 73 30 30 -13 -17 -85 -47 2 -21 34 39 58 -1
5948aJ2n4jj4K2j0N4K4POj5l7k9k1L7qKM8J7J6k2j5%j5o9%P1j3J5NM9op0J7qn
$$ -1 11 -43 -44 -58 -36 -46 8 32 39 45 30 -7 -36 -57 -20 -28 -26 22 39 55 33 18 18 3 -66 -66 5 -8 7 12 61 55 -15 2 -6 -11
5984a1p0L5M2L2l2L3j1L3p1l7L0k0J4j1N8L6nj2rno7nL1NK6lN0J4l7k0j5j3n5
$$ -11 -81 -46 -4 28 -4 29 18 51 -20 -57 -27 -47 -33 -44 14 50 45 33 24 19 -48 -53 -22 -17 9 6 56 70 33 13 -2 -15 -70
6017g0jM7N0K1%knl4n3j8j9L6K5L1O5ok9j6k2n3m0J1L5L9O0K9J6k0r5j3l1k4J7
$$ -70 -71 -24 26 47 47 45 40 6 -47 -65 -84 -48 -23 8 73 67 38 22 0 -53 -93 -82 -47 -8 52 81 97 77 -18 -31 -62 -86 -69
6050f9N2M2O9j2Ml5o1n5n1N1K0O8K9N1J4n3o2m3l6k0KO1R9J6j3Rpq5p3j5J8M9
$$ -69 -17 25 94 82 86 51 -10 -65 -116 -65 -45 23 52 103 117 64 2 -41 -77 -97 -95 -34 65 81 68 77 70 -15 -88 -103 -85 -36
6082c6L3P7M9j0q7m4j0n7l5M4R2M2K6L9m8o0n8n0KlJ9Q8O8M1m4j9n1o9m7LN1N1
$$ -36 -3 74 123 113 26 -18 -28 -85 -120 -76 16 58 84 123 75 15 -43 -93 -91 -94 -75 13 81 122 78 59 8 -61 -108 -105 -54 -3
6114cM2L4L2k1q7n5l3j0MM4R5N4qrl3o4p4kK3J8P1K5M2N6p0o7p1j9k1M1M0R1Q
$$ -3 39 73 105 84 -3 -58 -91 -101 -97 -53 42 96 88 79 46 -18 -92 -94 -71 -53 18 43 85 141 71 4 -67 -86 -107 -66 -26 65 73
6147G3J7j5j5q5o0k2L5K2M3L9O2nm0n4k3n5j8N3M6P0%QNj8j00k9qnK8N9M1L0k2
$$ 73 90 75 60 -25 -85 -107 -72 -50 -7 32 94 89 49 -5 -28 -83 -101 -48 -2 68 68 76 81 63 -37 -66 -74 -79 -51 8 49 79 57
6180E7j8k9l5m4KL1M7j4N6K9j6m5l7m0j0QJ4L9M8K0k2J0l0l4n2jK7L5k2M3O3n
$$ 57 39 10 -25 -69 -67 -36 11 -3 53 82 66 21 -16 -56 -66 -58 -44 -5 43 63 41 51 21 -13 -65 -66 -39 -4 -26 17 80 75
6212G5l9l4j1o9k0N7L4L0K5J2Rn1n6J1Jl4J2M1N6j6K5j4J6p5m7k8O1J3K3K2K9
$$ 75 36 2 -9 -78 -98 -41 -7 23 48 60 69 18 -38 -27 -26 -60 -48 -7 49 33 58 44 60 -15 -62 -90 -29 -16 7 29 58
6243E8J7m7k4n4Ro6M3N8K7K0K2K4k8p5k2l4nL1L5M5P6l4k2l1k0p9QlM9L3RO7j4
$$ 58 75 28 4 -50 -41 -107 -64 -6 21 41 63 87 59 -16 -38 -72 -77 -46 -11 34 110 76 54 23 3 -76 -68 -71 -22 11 20 87 73
6276G3k1o9k9km6M5M7L5M3%nm0p6m7J7K4QM1O4RJ0p5j8j3l6l4M1M1M5KL9lk3r4
$$ 73 52 -17 -46 -48 -94 -49 -2 33 76 76 71 31 -45 -92 -75 -51 -43 -2 62 71 81 6 -12 -25 -61 -95 -54 -13 32 34 73 70 47 -47
6310d7l0J4MM2LP8kJm9Mm7j2m0N6M6oK4pK6p5l3J9o2J9N8L5K2Jm3K4k8j3m9L4
$$ -47 -77 -63 -59 -17 -14 64 62 63 14 18 -29 -41 -81 -25 21 15 39 32 58 -17 -50 -31 -93 -74 -16 19 41 42 -1 23 -5 -18 -67 -33
6344c3N1j7LL5K2l0n5J5J7k6j6N0L3k9j1Klj2k8K2KQj7RK2rl5J2Rj5j1RM0Oj4
$$ -33 18 1 4 39 61 31 -24 -9 8 -18 -34 16 49 20 9 11 8 -4 -32 -10 -8 0 -17 -8 14 5 -30 -18 -9 -24 -35 -26 14 20 6
6379Fj3J5oj4JK5j8Kj3M1j0k9j8N8Qk1KJ2j4k1j3J2lmqL8K1j7l0L5k6l0mOL0%
$$ 6 -7 8 2 -12 -11 14 -4 -2 -15 26 16 -13 -31 27 35 14 16 28 14 -7 -20 -8 -11 -15 -23 15 36 19 -11 24 -2 -32 -36 -30 0 0
6415@RLL0n4lnk0K0KJ4N4k3k3qM3n1m1LN5K2k0K9J8l8k2Nj9K0m5K0K4L5Nj4J3
$$ 0 9 12 42 -12 -15 -20 -40 -20 -18 -4 50 27 4 -4 39 -12 -53 -50 5 27 7 36 54 16 -6 -1 -20 0 -45 -25 -1 34 39 25 38
6450C8k4m4Mj4jK2K0L3Rk7k8J2l8j3J6jM2L8k3M3k0l8k9%k3QJ5M9N4l3k2mJm2
$$ 38 14 -30 -26 -40 -41 -19 1 34 43 16 -12 0 -38 -51 -35 -36 6 44 21 64 44 6 -23 -23 -46 -38 -23 26 80 47 25 21 22 -20
6484b0l3M2pN2Jj5L9j1l0o3J1%nJ5N8qoNj3l5rk1K7k4L9K9N5j0m1k6j9Pm3K0N3
$$ -20 -53 -11 -18 34 35 20 59 48 18 -45 -34 -34 -39 -24 34 26 20 25 12 -23 -32 -53 -26 -50 -11 18 73 63 22 -4 -23 -16 -59 -39 14
6519A4J5k0M0K1l0o6m0O6j7J6J9J2L5k1m4j4jp6M0J6L7K8k9K7K8m9j6k7oJ6MJ4
$$ 14 29 9 49 70 40 -26 -66 0 -17 -1 18 30 65 44 0 -14 -15 -91 -51 -35 2 30 1 28 56 7 -9 -36 -42 -26 -22 -8
6551hN4k4LK7p1k2l6K9L7k8N8M1k2rl8J2k7Nk3L9K6K0j3KJ9n0n8J0L3l4M5%K4
$$ -8 46 22 25 52 -19 -41 -77 -48 -11 -39 19 60 38 29 -9 3 -24 -19 -42 -3 23 43 30 32 51 1 -57 -47 -14 -48 -3 -3 21
6584B1Pj5kJ4n4k8pL2K7J8QJ9j5l2Jk1J6j4j1P0k2Nj4j4K4m2j6K4J3QKN4j1J6
$$ 21 28 13 11 25 -29 -57 -64 -32 -5 13 21 40 25 -7 -6 -27 -11 -25 -36 34 12 17 3 -11 13 -29 -45 -21 -8 0 2 56 45 61
6618F1n0j5j8k3QK2J8k5L4J4K4n4j5k7K1l3PN6M1lJ0k0Rn0n4NK3L0OM3OK1m7j2
$$ 61 11 -4 -22 -45 -37 -15 3 -22 12 26 50 -4 -19 -46 -25 -58 -51 5 46 43 53 33 42 -8 -62 -57 -34 -4 2 45 51 72 25 13
6652A3k5m0J5j0O3J2j5K6L4m9k7p4J0PK3J4M2N3j4j1k1om9p8K3O3nN7J4L6n8n0
$$ 13 -12 -52 -37 -47 16 28 13 39 73 24 -3 -77 -67 -60 -37 -23 19 72 58 47 26 20 -29 -107 -84 -21 -26 31 45 81 23 -27
6684b7j3m3K3nM3O3J5JJ7m2m7k6n7L5J6L4O6K8qj7o4k7o6J5NP9J6K3K5J8n3q6
$$ -27 -40 -83 -60 -65 -22 41 56 57 74 32 -15 -41 -98 -63 -47 -13 53 81 73 56 -8 -35 -101 -86 -81 -2 14 37 62 80 27 -59
6716e9Kj2oJ6M0O7J8j3Nn7l0m3k0M3M1KN1J6j1k8l1k7qpJ2M4K6L9lk4l1p1j1O
$$ -59 -57 -69 -75 -59 -19 48 66 53 58 1 -29 -72 -92 -49 -8 -6 45 61 50 22 -9 -36 -44 -51 -39 5 31 70 67 43 12 -59 -70 -64
6750f4JnM3N1L4k8k3J4m0l7j7L7L9kL6Knk5k6jkk9J8L3M4l0K1qK0o5loJJ6k2M8
$$ -64 -63 -68 -25 26 60 32 9 23 -17 -54 -71 -34 5 3 39 41 36 11 -15 -16 -18 -47 -29 4 48 18 39 31 51 -14 -17 -23 -22 -6 -28 20
6786B0PMk6jk0Qn4K4K3J9k1J5J6K3n1l1M0j3%k9M0L2k6L3mJ0k7k6jjj5MN6l6K1
$$ 20 27 31 5 4 -16 -8 -62 -38 -15 4 -17 -2 14 37 -14 -45 -5 -18 -18 -47 -7 25 -1 32 28 38 11 -15 -16 -17 -32 -28 28 -8 13
6821A3j7oJ6l4j5NJ3J4J1K7J9k6k5nj4j9J1NK6Lj3M4J4m8k4k8L6l0K8MM3K5l5
$$ 13 -4 -10 6 -28 -43 -38 -25 -11 0 27 46 20 -5 -10 -24 -43 -32 -27 -1 2 -11 33 47 -1 -25 -53 -17 -47 -19 -15 28 53 18
6854A8J5j0j8n4J4PL0J7J9K0Pn9qlpl3MO2%Rj7J2k5k1k9J0OPJ2J1L8j2j3pK6p4
$$ 18 33 23 5 -49 -35 -28 2 19 38 58 65 6 -2 -5 -12 -45 -41 21 21 30 13 25 0 -21 -50 -40 -34 -27 -15 -4 34 22 9 2 28 -46
6890d6%N4j2j5K9L3j3m6kk8J4mK5L5K2qqkk6L5o7k3N7l8J4K1J2K7m4kRj9m5J4
$$ -46 -46 8 -4 -19 10 43 30 -16 -18 -46 -32 -36 -11 24 46 38 30 28 2 37 -30 -53 4 -34 -20 1 13 40 -4 -6 3 -16 -61 -47
6924d7L6M5k1K2j1jm4J5l2k4rN0P0k0Kk3L1k2k6l2kN2l0L1J3J2j9rj8rl3nJ7N6
$$ -47 -11 34 13 35 24 23 -21 -6 -38 -62 -71 -21 49 29 31 8 39 17 -9 -41 -43 9 -21 10 23 35 16 7 -11 -20 -53 -58 -41 15
6958A5J3J2KLm3m5j6K4k2L2M5K1Ol2nMm3m5K3M1L6J2K0L2o0m5lj2j8K7pN5K0j7
$$ 15 28 40 42 45 2 -43 -59 -35 -57 -25 20 41 47 15 10 14 -29 -74 -51 -10 26 38 58 90 30 -15 -18 -30 -48 -21 -28 27 47 30
6992C0MK1n4n9J9K8J0%K4L5J5p9k9j2J5l4K8L6L9j0pOl7Rl6l1M8J8J0K4j5K3m9
$$ 30 34 55 1 -58 -39 -11 -1 -1 23 58 73 -6 -35 -47 -32 -66 -38 -2 37 27 20 26 -11 -2 -38 -69 -21 -3 7 31 16 39 -10
7025a0L6n2Pj0pN7j3L1rK1k1o0J6N%k5K0M4j5j5j1J4o0J2J3K4J7j9j0M0j7k4J2
$$ -10 26 -26 -19 -29 -36 21 8 39 30 51 30 -30 -14 -9 -9 -34 -14 30 15 0 -11 3 -57 -45 -32 -8 9 -10 -20 20 3 -21 -9
7058ij9K8k7kL4Ml6K3oj5QKJ0L9m2qK6J1m4K3j2J7l7L5j3j7K6k6K5JMnNj0oRj
$$ -9 -28 0 -27 -29 5 9 -27 -4 -10 -25 -17 -15 -5 34 -8 -16 10 21 -23 0 -12 5 -32 3 -10 -27 -1 -27 -2 -1 3 -2 3 -7 -13 -4 -5
7095eNj8J5NK3l0J2k6J0k2J7rM0k7K9Mj5Om6K6jj0K1qN6j0l5j8KJ5l0QJ4J3mJ3
$$ -5 0 -18 -3 2 25 -5 7 -19 -9 -31 -14 -23 17 -10 19 23 8 14 -32 -6 -7 -17 4 -4 52 42 7 -11 -9 6 -24 -16 -2 11 7 20
7131B0Jm1krk6MK7J6K7L4j7k0k4k2j9k0O6j3J2KM3rj1l1kj3nK2J7M9j7k8QK0o1
$$ 20 21 -20 -22 -31 -57 -53 -26 -10 17 51 34 14 -10 -32 -51 -71 -5 -18 -6 -4 39 30 19 -12 -14 -27 -32 -10 7 56 39 11 19 39 -22
7166b2Kj6KRM0K0Rl2lk2pj3j3J7K2N6l7K3Kp3J0oJ8j2J5J3L0Mk5oj4j6k1L8%L0
$$ -22 -20 -36 -34 -25 15 35 44 12 9 -13 -20 -33 -46 -29 -7 49 12 35 37 -36 -26 -32 -14 -26 -11 2 32 36 11 5 -9 -25 -46 -8 -8 22
7202B2j1j5K7lm0j0j5ORRL2RkPQj6l3lJM0j3j5K4pj1l1J5%lrK0K4OkpOk2l0J2
$$ 22 11 -4 23 20 -20 -30 -45 -39 -30 -21 11 20 18 25 33 17 -16 -19 -18 22 9 -6 18 11 0 -31 -16 -16 -19 -28 -8 16 22 20 13 19 -3 -33 -21
7241b1K4k9J6L9j4k7rJ4Ol5L2P%J5j1%k2J1qNJ3k1J1k7J4K1jlRj2k0%KJ8l9L5
$$ -21 3 -26 -10 29 15 -12 -21 -7 -1 -36 -4 3 3 18 7 7 -15 -4 -12 -7 6 -15 -4 -31 -17 4 3 0 9 -3 -23 -23 -21 -3 -42 -7
7277gRK5k4l4N0kk9nkJ5j1LK8j6QOk4J3j7kJK5qk2K2Pl9J3J5KOn4L5J2nKLRj2
$$ -7 2 27 3 -31 19 17 -12 -17 -19 -4 -15 -12 16 0 8 14 -10 3 -14 -16 -15 10 2 -20 2 9 -30 -17 -2 0 6 -48 -13 -1 -6 -4 -1 8 -4
7316dm2K2L3l1K8K5%j3k3K1l4J0lJ8J3Pk7J3k1J0j6mj2KJ5oK2nJ9k4QJ7m2mJ2
$$ -4 -46 -24 9 -22 6 31 31 18 -5 16 -18 -8 -11 7 20 27 0 13 -8 2 -14 -18 -30 -28 -13 -19 3 -2 17 -7 1 18 -24 -28 -16
7351a6Qj5J2RmKj1J1k1j9L3J9J8j5K0J1n4J7k4nj2JPL1J3J1m6J5j2%j1J7k1J0
$$ -16 -8 -23 -11 -2 -6 -4 -15 -4 -25 -44 -11 8 26 11 31 42 -12 5 -19 -24 -36 -35 -28 3 16 27 -19 -4 -16 -16 -27 -10 -31 -21
7385b1L9j5J3j5mpk0j4mJ8J3L6j3kjll0k0K5L8k8J5J0pJ0m1RJ0k7L4J4L0m5N5
$$ -21 18 3 16 1 -3 -10 -30 -44 -48 -30 -17 19 6 4 3 0 -30 -50 -25 13 -15 0 10 3 13 -28 -19 -9 -36 -2 12 42 -3 52
7419E2k6jj2k9j8L0kj0K5J7k9nNj0k7JK5L0lJ6J0ol1k0k6nK9nlN8j4qrm0Pj3K6
$$ 52 26 25 13 -16 -34 -4 -6 -16 9 26 -3 -8 -3 -13 -40 -39 -14 16 13 29 39 33 2 -18 -44 -49 -20 -25 -28 30 16 8 -1 -41 -34 -47 -21
7456b1K4L0j8kL0k6j9m6J1Oj1K8J9L7n5K4Rl8k9J2MK2LK6J8j2l3oln9M5RN1kj7
$$ -21 3 33 15 13 43 17 -2 -48 -37 -31 -42 -14 5 42 -13 11 20 -18 -47 -35 -31 -9 -6 20 38 26 -7 -13 -16 -75 -30 -21 30 28 11
7491A1qJ5j4j7j7K1J8pMJ5ok2Rj8J7k2JJ7M1ll3K7j4k3Jj0K4k8JJ7M0k2k2Lk6
$$ 11 3 18 4 -13 -30 -9 9 2 6 21 15 -7 2 -16 1 -21 -20 -3 38 35 2 29 15 -8 -7 -17 7 -21 -20 -3 37 15 -7 -4 -30
7526c0KJ8j6LL6lRj8J3lj5k7JPJ7K3Plj5M%oj4lJ1K%J3%J4m7J6j0k6J8L1jj8J2
$$ -30 -28 -10 -26 -23 13 10 19 1 14 11 -4 -31 -30 -23 -6 17 24 21 6 10 10 4 -10 -13 -2 0 0 13 13 27 -20 -4 -14 -40 -22 9 8 -10 2
7565Bn%rj0PjOMK2kj4j6J6Kj0k1j1L8MlJ0J0J5j8j8LojkK5PjkK0o1j0O%J1NnK2
$$ 2 -3 -3 -12 -22 -15 -16 -10 -6 16 14 0 -16 0 2 -8 -29 -40 -2 2 -1 9 19 34 16 -2 1 -5 -6 -8 17 24 23 21 41 -20 -30 -24 -24 -13 -8 -13 9
7607IMK6k2l7Jk0J3J1J5QMK2k6pk2jj8J4L1L6j4rNk9Rk4j1L1j3NK2QK2j9k0m5
$$ 9 13 39 17 -20 -19 -39 -26 -15 0 8 12 34 8 1 -21 -22 -40 -26 5 41 27 18 23 -6 3 -21 -32 -1 -14 -9 13 21 43 24 4 -41
7643d1K0pJ2J2J8m%NMk8j7OJ4j1j0M2j6K0k1J7l2kPJ3J8j2%OLj2j1k4QMM7qmK5
$$ -41 -21 -28 -16 -4 14 10 10 15 19 -9 -26 -20 -6 -17 -27 15 -1 19 -2 15 -17 -19 -12 1 19 7 7 13 16 4 -7 -31 -23 -19 28 20 16 41
7681D1k2j3k0%rNJ3nK1oPJpJj1pJ8l7J8J5K2j6oKlj7JMJ3J2j1K5j4k5j1J8J1m4
$$ 41 19 6 -14 -14 -23 -18 -5 -10 11 5 12 13 6 7 -4 -11 7 -30 -12 3 25 9 3 5 2 -15 -14 -10 3 15 4 29 15 -10 -21 -3 8 -36
7719c6L0LqJ1jJ8l4KK7l4J8l2L7K6m1kKJ5nkj4pPK0k5L1Rqj0K5lk8K7m5J3K2r
$$ -36 -6 -3 -11 0 -1 17 -17 -15 12 -22 -4 -36 1 27 -14 -16 -14 1 -4 -6 -20 -27 -20 0 -25 6 15 7 -3 22 19 -9 18 -27 -14 8 -1
7756aJ1nKRk3L5m0rJ6K7rl5L5%ql9L0ooqK9j7Nj0K0j9Ol8L5KjL3jl3M9j5m0J7
$$ -1 10 5 7 16 -7 28 -12 -21 -5 22 13 -22 13 13 5 -34 -4 -10 -16 -24 5 -12 -7 -17 3 -16 -10 -48 -13 -11 -12 21 20 -13 36 21 -19 -2
7794bok0K8%QPj8J6Loj5J1Rj9QJK9l4k5K9Nk8J6LJ0j5KJ9ml2qJ0L3j5J7k7J7P
$$ -2 -8 -28 0 0 8 15 -3 13 16 10 -5 6 15 -4 4 5 34 0 -25 4 9 -19 -3 0 10 -5 -3 16 12 -20 -28 -18 15 0 17 -10 7 14
7832A4l5OJ3lJ5qJ6j2k0L4Mj6Ml1J4J2K1k9rJ0NrOOoJ0Loj4qQK3j8oL2m8JL8j4
$$ 14 -21 -15 -2 -5 10 2 18 6 -14 20 24 8 12 -19 -5 7 28 -1 -10 0 5 -4 2 8 2 12 15 9 -5 -13 -5 18 0 -6 26 -22 -21 17 3
7871CJj4K3rJ4j0j0Nj4J6k3L0k9K6J1Orj8J1k6K6k2nK9RnL9n1Kj3l4kOK1J7pJ5
$$ 3 4 -10 13 4 18 8 -2 3 -11 5 -18 12 -17 9 20 26 17 -1 10 -16 10 -12 -17 12 21 16 55 4 6 -7 -41 -43 -37 -16 1 -6 9
7908IJ5m5J9mroJ8J9KNomj8Ql2JM0JJ3mrJ8rj9LJj7K2LJ1O%j0k8jrj1M5k5QK2
$$ 9 24 -21 -2 -6 -15 -21 -3 16 18 23 17 13 -5 3 -29 -28 12 13 26 22 13 31 22 3 6 7 -10 12 15 26 32 32 22 -6 -7 -16 -27 18 -7 1 23
7949B3kj3JJ4n7J0J1nL7k3nM1j1l3knJ9J1QJ6j2Rj4Ll8lJ8rQj0J2K4onLk2j2J2
$$ 23 21 8 9 23 -34 -24 -13 -18 19 -4 -9 32 21 -12 -14 -19 0 11 19 35 23 32 18 21 -17 -20 -2 -11 -3 -13 -1 23 17 12 15 -7 -19 -7
7987gjJ1PKj2QNl5l0K6J9nK0KORk7Mk2mJ5MNJ4qLLj8j5NK7k2RJ3pJ9k4Nj0qJ2
$$ -7 -8 3 10 12 0 8 13 -22 -52 -26 -7 -12 8 10 16 25 -2 2 -20 -24 -9 -5 0 14 6 9 12 -6 -21 -16 11 -11 -2 11 4 23 -1 4 -6 -14 -2
8028bJ0%Rk1J4J4k5j4LjnrNK7JnM0j5k8K5j8k2LmL2Rk8pJ6K7k7j4J4RJ%j1lJ1
$$ -2 8 8 17 -4 10 24 -1 -15 -12 -13 -18 -27 -22 5 6 1 41 26 -2 23 5 -17 -14 -18 14 23 -5 -12 4 31 4 -10 4 13 14 14 3 0 11
8067A1oqJ6l2j3LL9j7j1N2m5j1J5k8K2jmPK1j1J8J2j4J4k6lmMjL7l0mJ9j1qLj2
$$ 11 5 -3 13 -19 -32 -29 10 -7 -18 34 -11 -22 -7 -35 -13 -14 -18 -11 10 -1 17 29 15 29 3 0 -4 0 -1 36 6 2 21 10 2 5 -7
8104gL0j3J2k2Qjj8kk0K1L0j6j3L8Kl0l6M1m2L0k4RL7mk1KJ2oj4OlJ0J4NQj2o
$$ -7 23 10 22 0 8 7 -11 -13 -33 -12 18 2 -11 27 29 -1 -37 4 -38 -8 -32 -23 14 10 -11 -9 3 -3 -17 -11 -14 -4 10 15 23 11 5
8141Ej1J9kk6K5j2llNMK0l6KJ8J6k0kJ1k0L3k2j7Rk1J3k2L4k4K9lk3M7j6J4j1
$$ 5 -6 13 11 -15 10 -2 -5 -8 -3 1 21 -15 -13 5 21 1 -1 10 -10 23 1 -16 -7 -28 -15 -37 -3 -27 2 -1 -24 23 7 21 10
8176A0JlQJ7m5K3Oj2K9l0K9k6j0Oj3
$$ 10 11 8 16 33 -12 11 17 5 34 4 33 7 -3 3 -10
8191a0
$$ Imaginary data points
##PAGE= N=2
##DATA TABLE= (X++(I..I)), XYDATA
0@%%%%%%lJ1j0J0j6K4l2M0n6O4q0J01j17J44j74K06k46K94l44L98m67N44o25P20
$$ 0 0 0 0 0 0 0 -3 8 -2 8 -8 16 -16 24 -32 32 -48 53 -64 80 -94 112 -134 160 -184 214 -253 291 -334 386
30C86q24R40j071J214j374J548j742J953k187K445k721L028l362L725m122M555
$$ 386 -438 502 -569 645 -729 819 -923 1030 -1157 1288 -1433 1595 -1767 1958 -2164 2391
46B391n032N551o119O743p427Q183r018R946j0983J2148j3469J4976j6720J8766
$$ 2391 -2641 2910 -3209 3534 -3893 4290 -4728 5218 -5765 6383 -7086 7890 -8830 9936
60I936k1198K4148k7824L2553l8884M7862o1687Q5981j41188M97534K2219q34634
$$ 9936 -11262 12886 -14938 17615 -21269 26593 -35094 50887 -90301 407233 429452 -405182
72d05182M2141N1038j64327j76576M30044N25152K33599k1572K0106k70751n53427
$$ -405182 -363041 -312003 -476330 -652906 -222862 302290 535889 514317 534423 263672 -289755
83b89755l44069K14413K18205q9959M7477N87674M97577k06218n69714k16061
$$ -289755 -633824 -419411 -201206 -291165 -243688 343986 841563 635345 65631 -150430
93a50430J2643j96092k50584J61095L99621K09920P9569K14343O4788m10894n03445
$$ -150430 -137787 -333879 -584463 -423368 -23747 186173 265742 480085 544873 133979 -369466
104c69466j8646K40635n5192j87618K62602N64340J75016l10901k51804k6246
$$ -369466 -388112 -147477 -202669 -390287 -127685 436655 611671 300770 48966 22720
114B2720j38773k71693k5972K30641J28168L2555K46429K95903j42177m66519
$$ 22720 -116053 -387746 -413718 -183077 -54909 -22354 224075 519978 377801 -88718
124h8718j66335K04048J3665k92710m0569M10419L25136r7321j71562L2290k0298
$$ -88718 -255053 -51005 -37340 -330050 -370619 39800 364936 267615 96053 128343 108045
135A08045k34050j42431J13091P7029q1720Q1976L26468J25695k72118k26200
$$ 108045 -126005 -268436 -155345 -78316 -160036 -78060 248408 374103 101985 -124215
145a24215J22015J08917k17018k07360J60611K65264M077r1751Q5588P7086j65331
$$ -124215 -2200 106717 -110301 -317661 -157050 108214 112291 20540 106128 183214 17883
156A7883j68858Q8685J02381j51090j26895K18748K75856q6119k45207L4299J91877
$$ 17883 -150975 -62290 40091 -110999 -237894 -19146 256710 170591 -74616 -40317 151560
167A51560o2934k41417k7786J64768L3532p5530P3942J38084o7921j54813O1285
$$ 151560 88626 -152791 -180577 -15809 17723 -57807 16135 154219 86298 -68515 -7230
178g230J44611j16978k42110N0102K68908L8791k05862k9376K12210O5705j87508
$$ -7230 137381 20403 -221707 -171605 97303 136094 -69768 -99144 113066 178771 -8737
189h737j06564R6323L1090j14268NJ61822M0416j27928N63J73237J2041k27961
$$ -8737 -115301 -18978 12112 -102156 -102151 59671 100087 -27841 -27278 145959 158000 -69961
201f9961j08377J58564R9875j35761q2743J56508J31305r3590r5755P5802L4464
$$ -69961 -178338 -19774 80101 -55660 -138403 18105 149410 55820 -39935 35867 70331
212G0331j47446q0723J45336J07432j18801q0923J68969J46797j42646j97786
$$ 70331 -77115 -157838 -12502 94930 -23871 -104794 64175 210972 68326 -129460
222a29460N1576J35533o5397j32252O6295J51530r036p6977N6231O6946j15577
$$ -129460 -77884 57649 -7748 -140000 -73705 77825 68789 -8188 48043 114989 -588
233e88j34884P8027J30326p5838j29757J05155K02595l3955j94356k2570J27256
$$ -588 -135472 -57445 72881 -2957 -132714 -27559 175036 141081 -53275 -75845 51411
244E1411j8265j53783p967J45224L9491p9304K9609J20442l3850j64476k0237
$$ 51411 33146 -120637 -128604 16620 56111 -23193 6416 126858 93008 -71468 -91705
255i1705J27194j349j44159p0J82058O9119j27098o0873R7494J9166j37822n4804
$$ -91705 35489 34140 -110019 -110089 71969 141088 13990 -46883 50611 69777 -68045 -122849
267a22849J14603N2456r3156o241J54394N0576j58071r5285J12687P1366j32593
$$ -122849 -8246 44210 -48946 -55187 99207 149783 -8288 -103573 9114 80480 -52113
278e2113r9124J23119J36086n7409q9969O0105O5463q9516r2709O2383O7778p3839
$$ -52113 -151237 -28118 107968 50559 -39410 20695 86158 -3358 -96067 -33684 34094 -39745
290c9745n0391J24241J09360r6845j25091O6599J05267q6039j41117N3304J46822
$$ -39745 -90136 34105 143465 46620 -78471 -11872 93395 7356 -133761 -80457 66365
301F6365q851r8306L5103J03256m2911j23430J3593R3802l7056j03904N1652J44267
$$ 66365 57514 -40792 -5689 97567 54656 -68774 -55181 38621 1565 -102339 -50687 93580
313I3580q358j26034j0J10745j4897j33849j5450J14969K2791q6790J2006J16034
$$ 93580 85222 -40812 -40822 69923 55026 -78823 -94273 20696 43487 -43303 -31297 84737
325H4737l34j25961k0162J09035M403j33437k4971J43616O4854j07877n7844R9488
$$ 84737 84403 -41558 -61720 47315 51718 -81719 -106690 36926 101780 -6097 -63941 35547
337C5547N5383j01937p4910P0374N3896o6831l2091R2837N0354q7957n2592Q7011
$$ 35547 90930 -11007 -85917 -15543 38353 -28478 -60569 32268 82622 -5335 -57927 29084
349B9084M7161j09186p8627R5765R5257p0475q2740P6381R6008o2898j00147M1201
$$ 29084 76245 -32941 -111568 -15803 79454 8979 -73761 2620 98628 35730 -64417 -23216
361b3216P7804n5279q3926N9067R8253m2067q7524M8903R4866n0095j13970K2866
$$ -23216 54588 -691 -84617 -25550 72703 30636 -56888 -7985 86881 36786 -77184 -54318
373e4318R8186k1417q9839L0799J04196j2668r0674J5983Q2516l6500j11245J6034
$$ -54318 43868 22451 -67388 -36589 67607 54939 -35735 -19752 62764 26264 -84981 -68947
385f8947J12511j683j01281J2374J24978J7230j16901m0447Q4677K1108r2993
$$ -68947 43564 41881 -59400 -47026 77952 95182 -21719 -62166 22511 43619 -49374
396d9374k8070R1896M3184o3146j4772P8436Q926j04391m1744Q0072K9031q6762
$$ -49374 -77444 14452 57636 -5510 -20282 58154 67080 -37311 -79055 1017 30048 -56714
408e6714k4567J15008O9926p9653o2869O5544M1195r4263p6150O8739P5221m6722
$$ -56714 -81281 33727 103653 24000 -38869 26675 67870 -26393 -102543 -33804 41417 -5305
420e305m2627Q1395P1341p3837r2590L5890N7170o0841o9983O8251J04901j7252
$$ -5305 -47932 33463 104804 30967 -61623 -25733 31437 -29404 -99387 -31136 73765 56513
432E6513o1824L6367N4058o8150j01844K0727P1569k8359n6184O8943J13012k3710
$$ 56513 -5311 31056 85114 16964 -84880 -64153 7416 -20943 -77127 -8184 104828 81118
444H1118j04761k000O7195l7162j08487P265J14358M0072m9690J2180P6405j4556
$$ 81118 -23643 -25643 41552 4390 -104097 -96832 17526 57598 7908 20088 96493 81937
456H1937j08995m1317M6968o828o5666K7509J22590M1587p2232k3528O0697j3785
$$ 81937 -27058 -68375 -21407 -28235 -93901 -66392 56198 97785 25553 2025 62722 48937
468D8937j20393m9686Q5556N9866m0167N05R9900M1648r5954q2214K9218J5293
$$ 48937 -71456 -121142 -35586 24280 -15887 -15382 84518 126166 30212 -52002 -22784 -7491
480g491p9030l5121J01457R8409k3120l8944M6840K5521r2671r2401K8092N6430
$$ -7491 -86521 -121642 -20185 78224 55104 16160 63000 88521 -4150 -96551 -68459 -12029
492a2029k2800j2728R1683Q2153n1802q7240R452K5284p8287q4713N7043J18733
$$ -12029 -34829 -47557 44126 126279 74477 -12763 -3311 21973 -56314 -141027 -83984 34749
504C4749J6328m2254L8008O6954m8959j17894k7497M8026p520l8500N5247J08571
$$ 34749 51077 8823 46831 113785 64826 -53068 -80565 -32539 -40059 -78559 -23312 85259
516H5259J1734o9561j1923L2275n2595j05451j93R7898L8243l4873K8417Q9469
$$ 85259 96993 27432 15509 47784 -4811 -110262 -110455 -12557 25686 -9187 19230 108699
528A08699m005j09829n5291L9468L03o6633O879J10317O0212n0412l2515M2453
$$ 108699 104694 -5135 -60426 -20958 -20655 -87288 -80409 29908 90120 39708 7193 49646
540D9646k662r6457n6161N6841N4937k0743R94P7424L8706o9161o4225K1291J0353
$$ 49646 46984 -49473 -105634 -48793 6144 -14599 -13605 63819 102525 33364 -30861 -9570 783
553G83o6645l1406Q3826Q1327k7373m2203M3697L7106p3562q9429K1206O3776
$$ 783 -65862 -97268 -13442 67885 40512 -1691 42006 79112 5550 -83879 -62673 1103
565A103j2625l2177N3932P3801k5276p1206M62L0360m2936o0962L6185Q1539J608
$$ 1103 -11522 -43699 10233 84034 58758 -12448 -11986 18374 -24562 -85524 -49339 32200 33808
578C3808m3190K7130N7183l4802q7077m114N8458n988n3712K4030Q3780O253p0157
$$ 33808 -9382 17748 74931 40129 -46948 -51062 7396 1408 -52304 -28274 55506 61759 -8398
591h398j4371N0627p466p3537j0482P2648L0144m4346p715N6695J0019o7078l1769
$$ -8398 -22769 27858 20392 -53145 -63627 9021 39165 -5181 -12896 43799 53818 -13260 -45029
604d5029M2288J3669m8811o957O7815K9371n3656k6416N0745J8690o6787l8352
$$ -45029 -2741 10928 -37883 -44840 22975 52346 -1310 -27726 23019 41709 -25078 -63430
616f3430N8302M7537m1467l4271N1522M4183m7793n4200K8731L7458l8026m0676
$$ -63430 -5128 42409 942 -33329 18193 62376 14583 -39617 -10886 26572 -11454 -52130
628e2130M0942N0340k8305m1174L2664M1471l7895n1585K9174N0140k5412m5984
$$ -52130 -11188 39152 10847 -30327 2337 43808 5913 -45672 -16498 33642 8230 -37754
640c7754L1448N5409k5031n8437J6027N1396k1013n9107J4873O2923k987n3329
$$ -37754 -6306 49103 24072 -34365 -18338 33058 12045 -47062 -32189 30734 27747 -25582
652b5582O206N5788k800n7515o052M8565K737m7022Q10N2306N007m9391n523M6778
$$ -25582 -19376 36412 33612 -23903 -29955 18610 21347 -25675 -24865 27441 32448 -16943 -22466 24312
666B4312r40n7894q960N6997J5782n0439j0874N9186K1952n5640k9929M4677K4212
$$ 24312 23372 -34522 -43482 13515 29297 -21142 -32016 27170 49122 -6518 -36447 8230 32442
679C2442m7548k7851M7204L5205l6352k8893L6623K5779m3020l5445L4580L2544
$$ 32442 -15106 -42957 4247 39452 3100 -25793 10830 36609 -6411 -41856 -7276 25268
691B5268l1979k6699M1260L7816l5183m0365K7954L2928l6285m2150L3049M9641
$$ 25268 -6711 -33410 7850 45666 10483 -29882 -1928 31000 -5285 -47435 -14386 35255
703C5255k1383m2257K4642M5404k4832n4655J0849M6904r179m0802J6163N0168
$$ 35255 13872 -28385 -3743 41661 16829 -37826 -26977 19927 10748 -30054 -13891 36277
715C6277n872m4867K749L5644j4465m6470R327M9158j411m1170R314M9111o866
$$ 36277 30405 -14462 -11713 23931 9466 -37004 -27677 21481 20070 -21100 -11786 37325 30459
728C0459n7181p323M7299N011m7172l348N5231J6994m5482j7592L8549J0418m6103
$$ 30459 -26722 -34045 13254 18265 -28907 -32255 22976 39970 -5512 -23104 15445 25863 -20240
741b0240j8843M1919K2941l2069j3425L9099J7172m1197k5046L1985J8368l5876
$$ -20240 -39083 2836 25777 -6292 -19717 19382 36554 -4643 -29689 2296 20664 -15212
753a5212j8604M1992K9350l4320k8522L1885K5729l8146l5961L1240L8736k3334
$$ -15212 -33816 8176 37526 3206 -25316 6569 32298 -5848 -41809 -10569 28167 4833
765D833l3018K6930L7657k3500m1022J4769L3791j7054l2827J9996L7986j4045
$$ 4833 -28185 -1255 36402 12902 -28120 -13351 20440 3386 -29441 -9445 28541 14496
777A4496l4122J5105L2785j9806m0005J5263M1302j1242l9424J2525M3833q518
$$ 14496 -19626 -4521 28264 8458 -31547 -16284 25018 13776 -25648 -13123 30710 22192
789B2192m6340J231M1831o89m1400p01M2815O161l8746p141L5686N562l7009q001
$$ 22192 -24148 -22917 18914 18225 -23175 -23876 18939 25100 -13646 -20787 14899 20461 -16548 -24549
803b4549L5962R733l3249p730L4870Q629l6465j1401L5955J2771l5925j3716L7851
$$ -24549 11413 21146 -12103 -19833 15037 23666 -12799 -24200 11755 24526 -11399 -25115 12736
816A2736J8032l7129k2367L3500K2860l2843k5352L0759K7964k6634k7552K4008
$$ 12736 30768 -6361 -28728 4772 27632 -5211 -30563 196 28160 1526 -26026 -2018
828b018K5941k3978k6478K2836K7140k0470k4706K2594K6068k3622k9462K0956
$$ -2018 23923 -55 -26533 -3697 23443 2973 -21733 861 26929 3307 -26155 -5199
840e199K9617k0738l1233K0790L5301j6715l6370J2785L5403j1369l6439Q782
$$ -5199 24418 3680 -27553 -6763 28538 11823 -24547 -11762 23641 12272 -24167 -15385
852a5385L7264m026l4106L011L2294l855l4252K30L1625K1k9749K114L2403l68
$$ -15385 21879 17853 -16253 -13242 19052 15197 -19055 -18825 12800 12821 -16928 -14814 17589 17221
866A7221l3216j714L2135J276l3675j944L7479P798l5138r625L3623R780l5937
$$ 17221 -15995 -17709 14426 15702 -17973 -19917 17562 25360 -9778 -19403 14220 24000 -11937
879a1937j5630L2248J7778k7854j5809K8030J7010k7215j9230K3243J6817k3166
$$ -11937 -27567 4681 22459 -5395 -21204 6826 23836 -3379 -22609 634 17451 -5715
891e715j5058K6333J9034k4250j9911K2244J7614k6203k2589K4967K6951j9380
$$ -5715 -20773 5560 24594 344 -19567 2677 20291 -5912 -28501 -3534 23417 4037
903D037k4467K0635K6900k0213l1806J3212K9313j0915k6224J3676L0630q939
$$ 4037 -20430 205 27105 6892 -24914 -11702 17611 6696 -19528 -5852 24778 15839
915A5839k9706M653K3303j0381k7448R265L0212l926k4901Q080K7171r998l4030
$$ 15839 -13867 -9214 14089 3708 -23740 -14475 15737 11811 -13090 -5010 22161 12163 -21867
928b1867K779L1093j579k8797N181L6020K325l4766q324K7186L349l0788o175
$$ -21867 -19088 12005 10426 -18371 -13190 22830 25155 -9611 -17935 9251 12600 -18188 -24363
941b4363L2521J4182k2667q193K3200M814k9958j3625K2864J1070k0609m686K9985
$$ -24363 8158 22340 -327 -8520 14680 19494 -10464 -24089 -1225 9845 -10764 -15450 14535
954A4535J3287k7308j7727J9772J0192k7556j6066K8701K5702j6670j7894J9872
$$ 14535 27822 514 -17213 2559 12751 -14805 -30871 -2170 23532 6862 -11032 8840
966H840J8002k4725k8775J2792K2818j0813j6038J9856K5827j2712k4864O659
$$ 8840 26842 2117 -26658 -13866 8952 -1861 -17899 1957 27784 15072 -9792 -3133
978c133J4811j7412k2616J6369K9084o062j9406J3263K2834j6957l4737K957K6156
$$ -3133 11678 -5734 -28350 -11981 17103 11041 -8365 4898 27732 10775 -23962 -21005 5151
991E151m119k2930J1043L4745J656k8941n609J9466m264k8221j839K8619J0046
$$ 5151 1032 -21898 -10855 23890 25546 -3395 -9004 10462 6198 -22023 -23862 4757 14803
1004A4803j6279R55K2611j250l0018j0500J8783L070k1493O76L2195J2632k3505
$$ 14803 -1476 -521 22090 20840 -9178 -19678 -895 2175 -19318 -18642 13553 26185 2680
1017B680j1380J9769M788k9830j5779K4445J9431j5238j0327K2758J5833k2305
$$ 2680 -8700 11069 15857 -13973 -29752 -5307 14124 -1114 -11441 11317 27150 4845
1029D845k2464J1155J2622j6240j2669K1381K1694j1535j4548J4151J2078k1761
$$ 4845 -17619 -6464 6158 -10082 -22751 -1370 20324 8789 -5759 8392 20470 -1291
1041a291k2423J4135K0602j1837j6352J8412K4965j2749k6887N288J9443j0849
$$ -1291 -23714 -9579 11023 -814 -17166 1246 26211 13462 -13425 -8137 11306 457
1053D57k4522P953K7475N26j8616M832K0703n518k4937j474J8101k387j8489N808
$$ 457 -24065 -16112 11363 11889 -6727 -1895 18808 13290 -11647 -13121 4980 2593 -15896 -10088
1067a0088K4970P69k1153J8K0076l670k7145l344K4702N947k0677k173K5916P966
$$ -10088 14882 15651 -5502 -5484 14592 10922 -16223 -19567 5135 11082 -9595 -11768 14148 22114
1081B2114k4057j1999J7408O662k1173r756K0787J3854j4084p988J7140Q267j9931
$$ 22114 -1943 -13942 3466 10128 -11045 -20801 -14 13840 -244 -8232 8908 17175 -2756
1094b756j3503J4362R668j5971q254K1510J6091j5718j4939J4040J2123j9483
$$ -2756 -16259 -1897 7771 -8200 -16454 5056 21147 5429 -9510 4530 16653 -2830
1106b830k0086J3645K0523q326j4943J3107J9911j0196k2085L159J4299q199j6369
$$ -2830 -22916 -9271 11252 2926 -12017 1090 21001 10805 -11280 -8121 6178 -2021 -18390
1119a8390R555K1353k412j4928O142J4709j0663k2371L604J9168l131j6243Q829
$$ -18390 -8835 12518 10106 -4822 1320 16029 5366 -17005 -13401 5767 2636 -13607 -4778
1132d778K4508k097k3752k802J7535k536k2752j190K4051Q144j5846l168J7118
$$ -4778 19730 17633 -6119 -8921 8614 6078 -16674 -17864 6187 14331 -1515 -4683 12435
1145A2435J642k1679q991J4758N679j3434p13K0674P486j7346q484J3405K854
$$ 12435 14077 -7602 -16593 -1835 3844 -9590 -10303 10371 17857 511 -7973 5432 8286
1158H286k0277q184K0408J3846j3307q810J6670J0746j8886j7848J0900J3903
$$ 8286 -11991 -20175 233 14079 772 -8038 8632 19378 492 -17356 -6456 7447
1170G447j0145j0771J4752J6916r433j5596N994R298j2448j4117J1109J6794n987
$$ 7447 -2698 -13469 1283 18199 8766 -6830 -836 8462 -3986 -18103 -6994 9800 3813
1183C813j1160J0748J3650j2719j9885N957J6357o286j4879J0265K1953l398k0080
$$ 3813 -7347 3401 17051 4332 -15553 -9596 6761 475 -14404 -4139 17814 14416 -5664
1196e664l58J4515m523j9158J206J9857M458j2584O05J4228k202j8984m207J3406
$$ -5664 -6022 8493 3970 -15188 -13982 5875 10333 -2251 -1646 12582 10380 -8604 -12811 595
1210E95J552j2521K881J9684L585j7391n694J3023N00j9268n343J9681J1216j2357
$$ 595 2147 -10374 -7493 12191 15776 -1615 -7309 5714 6214 -13054 -18397 1284 12500 143
1224A43o188J5080P098j7726j3677J0486R957r485n990J5092J2092j0704j1467
$$ 143 -6045 9035 16133 -1593 -15270 -4784 5173 -4312 -10302 4790 16882 6178 -5289
1237e289P139N209j4217j0524J3239J4037p624q531J2274J1349j3976j7852O464
$$ -5289 1850 7059 -7158 -17682 -4443 9594 1970 -6561 5713 17062 3086 -14766 -8302
1250h302J3647p011j2261J0705J8905l730j6170J216J1023o333j5842L049J5995
$$ -8302 5345 -1666 -13927 -3222 15683 11953 -4217 -3001 8022 1689 -14153 -11104 4891
1263D891J150r713M344J2933m734j6746o00J2026k510j3117M558J8655J367j5873
$$ 4891 6041 -3672 672 13605 8871 -7875 -8475 3551 1041 -12076 -7518 11137 12504 -3369
1277c369k168J3503j002j8272l933J6792P011j1760l051J4576M882j4877q429
$$ -3369 -5537 7966 6964 -11308 -15241 1551 8562 -3198 -6249 8327 13209 -1668 -10097
1290a0097R948M801j0949l532J3995P515j0672n937J0378L745j4517q067J2596
$$ -10097 -149 4652 -6297 -9829 4166 11681 1009 -4928 5450 9195 -5322 -13389 -793
1303g93R269j0268p329J2767J0391j1796j3061P668J0566q382j1205Q527J3578
$$ -793 8476 -1792 -9121 3646 14037 2241 -10820 -3152 7414 -968 -12173 -3646 9932
1316I932m775j0998M775R786o439j1840M493J0848m027r190O578J1821n485j2778
$$ 9932 5157 -5841 -1066 8720 2281 -9559 -5066 5782 1755 -7435 -857 10964 5479 -7299
1330g299L901J1537n287j3758M066J5228j135j3621J135J3815o88j4979k298J2595
$$ -7299 -3398 8139 2852 -10906 -6840 8388 7253 -6368 -5233 8582 7894 -7085 -9383 3212
1344C212K166j1584j278J2667L218j0866k821R947J269j1726k646J1494L381j0479
$$ 3212 5378 -6206 -7484 5183 8401 -2465 -5286 4661 5930 -5796 -8442 3052 6433 -4046
1358d046k083J2735M118j2979o297J0836N343j2080p120J2005R750q630q155Q691
$$ -4046 -6129 6606 10724 -2255 -8552 2284 7627 -4453 -11573 432 10182 1552 -6603 2088
1372B088P987r438j0570O049Q380o052o773Q433R526o183q567N601O500q915r763
$$ 2088 10075 637 -9933 -3884 4496 -1556 -8329 104 9630 3447 -5120 481 6981 -1934 -11697
1387a1697P621J1235m910q444P850J1638o770j4303J905J0373l856j1418M108
$$ -11697 -4076 7159 2249 -6195 1655 13293 6523 -7780 -5875 4498 642 -10776 -6668
1400f668J4368R59j0205P7Q591l097j2655j159J0022J533o766L466J1930j24j2044
$$ -6668 7700 8659 -1546 -1469 7122 4025 -8630 -9789 233 1766 -5000 -1534 10396 10272 -1772
1415a772k904P568k118j2270j64J4573O018q498j945J0821K047j4327q715P821
$$ -1772 -4676 2892 774 -11496 -11660 2913 8931 433 -1512 9309 11356 -2971 -11686 -3865
1429c865N861o806k368J1939Q380p344p542L750J098j0808o549Q949Q796l614
$$ -3865 1996 -4810 -7178 4761 13141 5797 -1745 2005 3103 -7705 -14254 -5305 3491 -123
1443a23j942J0355O063j0991j1477L888N684p539o641J0648J3948k466r227K512
$$ -123 -2065 8290 14353 3362 -8115 -4227 1457 -6082 -12723 -2075 11873 9407 180 2692
1457B692N908q070j3253J296J0398J358l932O329J0564k698j1334k330L805n375
$$ 2692 8600 530 -12723 -11427 -1029 329 -3603 2726 13290 10592 -742 -3072 733 -4642
1471d642r053M833J3554K509o559K426Q563m780j5493m033R411K626o755K828
$$ -4642 -13695 -8862 4692 7201 642 3068 11631 6851 -8642 -12675 -3264 -638 -7393 -4565
1485d565J4450N168r908o368L951j299j1121l558J0089P218k984N21Q658R94j1917
$$ -4565 9885 15053 5145 -1223 2728 1429 -9692 -13250 -3161 4057 1073 1594 10252 11246 -671
1500f71p593M678K001p457q79J3065R030o311o455N057K497j1185r808O121R839
$$ -671 -8264 -3586 -1585 -9042 -9921 3144 12174 5863 -592 4465 6962 -4223 -14031 -7910 1929
1515A929j504l497P562Q129n536j0309j67L549m782n401O702R980r40n231L487
$$ 1929 425 -3072 4490 12619 7083 -3226 -3393 156 -4626 -10027 -3325 6655 5715 484 3971
1530C971M628p655j1018K029Q585j235n757N717J1451j378j0866k025O128k210
$$ 3971 8599 944 -10074 -8045 540 -695 -6452 -735 10716 9338 -1528 -3553 2575 365
1544C65r470L69J0483L784n295n2O643p41r356k999N821J050n606J362R541K327
$$ 365 -9105 -8736 1747 5531 236 184 6827 6086 -3270 -6269 -448 602 -5004 -3642 5899 8226
1560H226p997k925O154L18r631l549Q851N580n881l550P386M709p449o813M631
$$ 8226 229 -2696 3458 3776 -5855 -9404 -553 5027 -854 -4404 2982 7691 242 -6571 -1940
1575a940N415m348m163N815N905m285n481L360L413n643m967N502O085l933m762
$$ -1940 3475 -873 -5036 779 6684 2399 -3082 278 3691 -1952 -6919 -1417 4668 735 -4027
1590d027N443O031n751p908L627P224l238p027L664Q393k092q282L38O224j603
$$ -4027 1416 7447 1696 -6212 -2585 4639 1401 -5626 -1962 6431 4339 -3943 -3605 2619 1016
1605A016o984J168P538P20n227J003N690j587p141R1O331k78n886J531P889j3
$$ 1016 -5968 -4800 2738 3458 -1769 -766 4924 3337 -3804 -3713 2618 2340 -3546 -2015 5874 5861
1621E861q396k069O284N54p787j508Q671M549n390k863N634K126p222m869M419
$$ 5861 -2535 -4604 1680 2234 -5553 -7061 1610 6159 769 -2094 3540 5666 -1556 -6425 -2006
1636b006L648l670j409O303L560n232m176L363J343o386l116P030O047l493l165
$$ -2006 1642 -2028 -3437 2866 6426 1194 -2982 381 1724 -4662 -7778 -748 5299 1806 -1359
1651a359N566M215o849p937K520N466k768m497M696P515j598o418O8L305l271
$$ -1359 4207 8422 1573 -6364 -3844 1622 -1146 -5643 -947 6568 4970 -1448 -1380 1925 -1346
1666a346n643K268O713N24k913K856M637l599p745k30M733j467m918L384Q855
$$ -1346 -6989 -4721 1992 2516 -397 2459 7096 3497 -4248 -4478 255 -1212 -6130 -2746 6109
1681F109P76o911j446M699j304p928j433P371L904l325l23N343O04p034m074K849
$$ 6109 6885 -26 -1472 3227 1923 -6005 -7438 -67 3837 512 189 5532 6136 -898 -4972 -2123
1697b123Q41l846O22P264L246m441k178L799j37p379l299O201M835l325k039N743
$$ -2123 -1282 -5128 -4506 2758 6004 1563 -615 3184 3047 -4332 -7631 -1430 3405 80 -1959 3784
1713C784L838n937o650J984L791k751l029M721O065j581m350Q81J764m331m710
$$ 3784 7622 1685 -4965 -2981 810 -1941 -4970 -249 5816 4235 -115 766 2530 -1801 -6511
1728f511K879N144q40k260L950M263m215o895Q27M329j981m303L699P826K49n733
$$ -6511 -3632 1512 672 -1588 2362 6625 2410 -4485 -3658 671 -1310 -5613 -1914 5912 6161 428
1744D28q29L539j993o543o42N640K303k446J040M458m93n676j963K902l55l763
$$ 428 -401 3138 1145 -5398 -6040 -400 1903 -543 497 4955 4462 -1214 -3177 -275 -630 -4393
1760d393J391O497J659m660j547L666m64o697k508N500M026k842j352N006K997
$$ -4393 -3002 3495 5154 494 -1053 2613 2149 -4548 -7056 -1556 2470 -372 -1724 3282 6279
1775F279m736m880J794K419k643j931M207M067j943k747J807Q84m792l693L090
$$ 6279 1543 -3337 -1543 876 -1767 -3698 509 4576 2633 -114 1693 2577 -2215 -5908 -2818
1790b818L716j952j772M692M472l351n327J380L415k949m738K222N722j46l886
$$ -2818 898 -1054 -2826 1866 6338 2987 -2340 -960 2455 -494 -5232 -3010 2712 2566 -1320
1805a320Q28L728j326m772k16L417j33k656J589M313k59l568M43L238j637n040
$$ -1320 -492 3236 1910 -2862 -3078 339 206 -2450 -861 3452 3193 -375 68 3306 1669 -3371
1821c371N2M478J37m281J08N265J132m759j794L861J371m136j808M042K755k390
$$ -3371 -3319 1159 1296 -2985 -2877 2388 3520 -1239 -3033 828 2199 -1937 -3745 297 3052 662
1837F62j364L019J294l646k516J947P76l071p72M357K714k666j483L310J428m760
$$ 662 -702 2317 3611 -35 -2551 -604 172 -2899 -3671 686 3400 734 -749 2561 3989 -771
1853g71l847K683L288k150k219L791M360j896m349Q5J785k513l538J619M267Q49
$$ -771 -4618 -1935 1353 -797 -3016 775 5135 3239 -1110 -1025 760 -1753 -5291 -3672 595 1444
1869A444r93K098K491k313m374l42J713j735k401K926N314J48l427R2K595k231
$$ 1444 451 2549 5040 2727 -1647 -1989 -276 -2011 -4412 -1486 3828 3976 549 641 3236 1005
1885A005n664q90M355J966j775R47M435Q65m234k949P85m83k809K11M483K691
$$ 1005 -4659 -5549 -1194 772 -1003 -56 4379 5244 1010 -1939 -1154 -1637 -4446 -4235 248 2939
1901B939j104J62K272j118n295k526K443J476j967O44N489L126l209l635O89L05
$$ 2939 1835 1997 4269 3151 -2144 -4670 -2227 -751 -2718 -2074 3415 6541 3332 -303 386 691
1917F91m124l128K949M638O73n55K332J798l065m434p61O93j459n87L918M322
$$ 691 -3433 -6561 -3612 1026 1699 1144 3476 5274 2209 -2225 -2986 -2293 -3752 -4339 -421 3901
1933C901l56j942R36O54m118m652J093M026N17j093K862M318r48n013k228R18
$$ 3901 3545 1603 2539 3193 -925 -5577 -4484 -458 59 -1034 1828 6146 5198 185 -2043 -1125
1949a125j188k769J100M653K403q24K20J176k039m476j398J943N79p26K470M674
$$ -1125 -2313 -5082 -3982 671 3074 2250 2470 3646 1607 -2869 -4267 -2324 -1745 -2471 -1 4673
1965D673Q23l627k172Q18j329m212r41M473L836l60k77K385P27l965m091M7J142
$$ 4673 5496 1869 -303 515 -814 -5026 -5967 -1494 2342 1982 1705 4090 4817 852 -3239 -3192 -2050
1982b050o67L41L599K930j007j858l5r20l669k203K536L200N3N4L192K158l034
$$ -2050 -2717 -2376 1223 4153 3146 1288 1253 333 -3336 -5539 -3003 197 250 304 3496 5654 2620
1999B620m475l80J437j323j745K483M354P27k183n60O11j954l183l0K526J178
$$ 2620 -1855 -2235 -798 -2121 -3866 -1383 2971 3698 1515 955 1566 -388 -3571 -3601 -1075 103
2015A03j2J926K296j212l441j136P27j299k277J503M262J453j987l91J891o99
$$ 103 91 2017 4313 3101 -340 -1476 -749 -2048 -4325 -2822 1440 2893 906 515 2406 1707
2031A707l912j707K478K037o81K06K678J144k339k391J9k83j858j54K704J918
$$ 1707 -2205 -3912 -1434 603 -78 128 2806 3950 1611 -780 -761 -1044 -2902 -3056 -352 1566
2047A566p86j90J722p9l212j940J760J621j294o51K730K224j855k837K30J188
$$ 1566 780 590 2312 2233 -979 -2919 -1159 462 -832 -1483 1247 3471 1616 -1221 -991 197
2063A97j419j799J398K830M40j019M98Q97j351k101K11J292m36p15J595J989j062
$$ 197 -1222 -3021 -1623 1207 1647 628 1126 2023 672 -1429 -1218 74 -362 -1077 518 2507 1445
2080A445k385O1J325j112k304Q81L120P79j794m0J888j14k705j162J555Q58r88
$$ 1445 -940 -879 446 -666 -2970 -2089 1031 1810 16 -24 1864 1750 -955 -2117 -562 296 -692
2097f92P2J781N52j469p50P63k39j519J38K149P44j418l42J692J04k618j374J790
$$ -692 -620 1161 1713 244 -506 257 18 -1501 -1363 786 1530 112 -230 1462 1566 -1052 -2426 -636
2115f36J444j252r07J853J637j447k062M26J168p00q93J240J788k41j041L07K05
$$ -636 808 -444 -1351 502 2139 692 -1370 -944 224 -476 -1369 -129 1659 1418 377 684 889
2132H89j659j446Q94J452l90m72J793J743j290k413J28J293q83j748R24K668M66
$$ 889 -770 -2216 -1322 130 -260 -732 1061 2804 1514 -899 -771 522 -361 -2109 -1185 1483 1949
2149A949j720m80Q53o85k048m15J575J015k3Q58J514k98j813p39M68o72j358Q16
$$ 1949 229 -251 602 -83 -2131 -2546 -971 44 21 879 2393 2095 282 -457 11 -661 -2019 -1203
2167a203K549Q05j410n89R41o08k731j300J765J908M4K17J973J171j523k243p16
$$ -1203 1346 2151 741 152 1093 485 -2246 -3546 -1781 127 171 388 2361 3532 2009 -234 -950
2184i50k11j043k92J700J825J66j64N20m60k328j630Q75J409rL77K373J896j165
$$ -950 -1161 -2204 -2496 -796 1029 1195 1031 1551 1091 -1237 -2867 -1992 -583 -592 -215 2158 4054 2889
2202B889k481p51J44j327j584Q82K510J071m82J2L94j122j913n63Q68O35M98J647
$$ 2889 408 -343 -199 -1526 -3110 -2228 282 1353 871 883 1277 155 -1758 -2321 -1453 -818 -320 1327
2220A327J786k10j713q93k51j525j879M36K477J413l77K89J370j79k431j719N95
$$ 1327 3113 2903 1190 297 46 -1479 -3358 -2922 -445 968 591 880 2250 2071 -360 -2079 -1484
2237a484R08j53L40J806J276p33j229m97p90j528n53J171J062J7N46J484L34j669
$$ -1484 -576 -729 -389 1417 2693 1960 731 234 -556 -2084 -2637 -1466 -404 -387 159 1643 1977 308
2255C08j267O26O34r20n28J496J623n51j407o6N24q73j333K31J283M89k02M84
$$ 308 -959 -333 301 -619 -1147 349 1972 1421 14 -52 472 -401 -1734 -1503 -220 269 67 551
2273E51O76m91r85o9K99n63n37Q32J197l07r79L47R00n83j486j2J388L55j019
$$ 551 1227 736 -249 -318 -19 -582 -1119 -287 910 603 -376 -29 871 288 -1198 -1210 178 533 -486
2292d86o7J261N26r35n85O53L09p05m37L95J24n71q2O82J73n24J19R44lj067m65
$$ -486 -553 708 1234 299 -286 367 676 -29 -466 -71 53 -518 -600 82 255 -269 -150 794 791 -276 -741
2313g41Q18K69j038m87J106R70o31q29N30Q09n51j020K46Q94P5m86K64N34k42
$$ -741 77 346 -692 -1179 -73 897 266 -563 -33 776 225 -795 -549 345 420 -66 198 732 490
2332D90o17Q0J78m64m37O07O92m77o92N12P73n82j040L54J236N3r01L3J023O4
$$ 490 -127 -47 131 -333 -770 -163 529 52 -640 -128 645 63 -977 -623 613 666 -235 -202 821 885
2352H85j109n35N49K67n35j07O11L51k88m9L77q2n69J04O74j15p41LP97Rj055
$$ 885 -224 -759 -210 57 -478 -585 26 377 89 40 417 335 -234 -130 544 429 -312 -309 488 497 -558
2373e58l57R52M99p54n29O87O68o10q39L59P39q0l24M00O23j79m80p0p0o05l63
$$ -558 -915 37 536 -218 -747 -60 608 -2 -841 -482 257 177 -147 253 876 697 217 147 77 -528 -891
2394h91N39N05j89j03P44N09q32j004J74O02k80o66N82J196J62q03m03K92k33
$$ -891 -352 153 -36 -139 605 1114 282 -722 -548 54 -226 -892 -310 886 1048 245 -158 134 -99
2413i9p97k12O16O44J41K74L64j90p44l30K1k99l25N86J128L61n81k55L82l36
$$ -99 -896 -1108 -492 152 293 567 931 741 -3 -333 -312 -611 -936 -350 778 1139 558 303 685 349
2433C49j288o25P61Q73k4m0P35N88n98j082m02l6k01k5O80Q20L37M7J56l06j042
$$ 349 -939 -1564 -803 70 46 6 741 1329 731 -351 -753 -789 -990 -1015 -335 485 822 869 1025 719 -323
2454c23o99K63M04r5J33J013Q90n27j058k92J27n15p50L35J211P30j27l7J71l74
$$ -323 -1022 -759 -355 -450 -317 696 1586 1059 1 -291 -164 -679 -1429 -1094 117 847 720 683 854 480
2474D80q99n58O7J45K09O70P68N2m61j54p6o68q15J78J046N28k24K05O93j2j110
$$ 480 -419 -977 -910 -765 -556 114 882 934 473 319 243 -425 -1240 -1062 -16 512 288 493 1186 1174 64
2495F4r11Q6L29j91k1P01P25K6m04k35k64m83k31K78L68R8L50N81O5p28o04J15
$$ 64 -847 -761 -432 -623 -644 57 782 808 404 169 -95 -578 -809 -531 -163 -65 285 866 931 203 -401 -286
2517b86R9m85k40P39R33Mn27J3L49k87p29k44M60K74j77j1K73K2k88q4O1j30j50
$$ -286 -187 -672 -912 -173 760 764 237 250 599 312 -417 -661 -201 73 -104 -115 158 180 -108 -192 -131 -261 -411
2540d11K94L92r7l40J90M78j10n82m8O15J04o58l85M05K70l79l31M52N63K4k35
$$ -411 -117 275 178 -162 28 506 396 -186 -234 381 485 -173 -558 -153 117 -262 -593 -141 422 446 211
2561B11O8J15k50l23J5O3q0J31L90O6n33l96J53Jn07j53Q15R28P1k78J90K43n64
$$ 211 279 394 144 -179 -164 -101 -181 -50 340 406 -127 -523 -370 -369 -876 -1029 -214 714 785 507 697 940 376
2584C76r26k65M22L38K0K68M58K0n03n41l72l59j55N47Q05M63K63M21J46p00j165
$$ 376 -550 -815 -393 -55 -35 233 691 711 208 -333 -705 -1064 -1219 -672 133 596 859 1280 1426 726 -439
2605d39n22J83Mj57M51J031N30m29o39k15j80m41k63N58R32N60K45O7k93p30p31
$$ -439 -961 -778 -774 -931 -480 551 1081 652 13 -202 -382 -823 -1086 -528 404 964 1209 1276 983 253 -478
2626d78l74j86q1M84R05N39k39l71o4k06p26m93N53J008M45M6K41K77m84j061
$$ -478 -852 -1038 -1119 -635 270 809 570 199 135 -71 -797 -1290 -737 271 716 762 1003 1280 796 -265
2646b65p21o8J20J51N14O66M32l7j84l11o12m67J37M98K18M8M87M50l77q96m86
$$ -265 -986 -1054 -934 -783 -269 397 829 792 608 297 -315 -782 -645 -147 71 119 606 1056 679 -217 -703
2667g03J78L2k91J21Q22N93k03m06l7k9l11k32K48M17K04Q4O7k06n02l29P6M4
$$ -703 -525 -493 -784 -663 159 752 549 143 106 77 -234 -466 -218 199 403 487 554 348 -154 -483 -407 -363
$$ [...]
8191b8
##END NTUPLES=NMR FID
##END=
