##TITLE=1H_AM_NV_54
 CDCl3
 8 sc, 
 16.6.2023
##JCAMPDX= 6.0         $$ Bruker NMR JCAMP-DX V2.0
##DATA TYPE= NMR FID
##DATA CLASS= NTUPLES
##ORIGIN= UXNMR, Bruker Analytische Messtechnik GmbH
##OWNER= root
$$ XWIN-NMR		Version 3.5
$$ Fri Jun 16 15:18:44 2023 Russian Standard Time (UT+4h)  she@DPX200
##.OBSERVE FREQUENCY= 200.13135
##.OBSERVE NUCLEUS= ^1H
##.DELAY= (6, 6)
##.ACQUISITION MODE= SIMULTANEOUS
##.ACQUISITION SCHEME= undefined
##.AVERAGES= 8
##.DIGITISER RES= 18
##SPECTROMETER/DATA SYSTEM= spect
##.PULSE SEQUENCE= zg30
##.SOLVENT NAME= CDCl3
##.SHIFT REFERENCE= (INTERNAL, CDCl3, 0, 15.7039)
##AUDIT TRAIL= $$ (NUMBER, WHEN, WHO, WHERE, WHAT)
$$ ##TITLE= Audit trail, XWIN-NMR		Version 3.5
$$ ##JCAMPDX= 5.01
$$ ##ORIGIN= Bruker BioSpin GmbH
$$ ##OWNER= she
$$ F:/spectra/data/she/nmr/H-F/1/audita.txt
$$ ##AUDIT TRAIL=  $$ (NUMBER, WHEN, WHO, WHERE, WHAT)
(   1,<2023-06-16 15:17:13.01 +0400>,<she>,<DPX200>,
      <created by zg, POWCHK disabled, PULCHK disabled
       configuration hash MD5:
       00 E9 B6 7A A2 85 ED C7 34 08 36 98 17 FE 4E 26
       data hash MD5: 16K
       88 62 10 A6 B5 23 22 3F 55 FD 56 7F 74 0B 76 3A>)
$$ ##END=
$$ 
$$ hash MD5
$$ 60 E2 C8 AD 9F 2F 1E 2D DF D9 3D 23 71 DD F3 01
##$RELAX= 
##$RELAX= 
##$RELAX= 
##$RELAX= 
##$RELAX= 
##$RELAX= 
$$ Bruker specific parameters
$$ --------------------------
##$DU= <F:/spectra>
##$EXPNO= 1
##$NAME= <H-F>
##$PROCNO= 1
##$TYPE= <nmr>
##$USER= <she>
##$AMP= (0..31)
100 100 100 100 100 100 100 100 100 100 100 100 100 100 100 100 100 100 
100 100 100 100 100 100 100 100 100 100 100 100 100 100 
##$AQSEQ= 0
##$AQ_mod= 1
##$AUNM= <au_zg>
##$AUTOPOS= <>
##$BF1= 200.13
##$BF2= 200.13
##$BF3= 200.13
##$BF4= 200.13
##$BF5= 200.13
##$BF6= 200.13
##$BF7= 200.13
##$BF8= 200.13
##$BYTORDA= 1
##$CFDGTYP= 0
##$CFRGTYP= 5
##$CHEMSTR= <none>
##$CNST= (0..31)
1 1 145 1 1 1 1 1 1 1 1 1 1 1 1 1 1 1 1 1 1 1 1 1 1 1 1 1 1 1 1 1 
##$CPDPRG= <>
##$CPDPRG1= <>
##$CPDPRG2= <>
##$CPDPRG3= <>
##$CPDPRG4= <mlev>
##$CPDPRG5= <mlev>
##$CPDPRG6= <mlev>
##$CPDPRG7= <mlev>
##$CPDPRG8= <mlev>
##$CPDPRGB= <>
##$CPDPRGT= <>
##$D= (0..31)
0 1.2 0 0 0 0 0 0 0 0.06 0 0.03 0 0 0 0 0.0002 0 0 0 0 0 0 0 0 0 0 0 0 
0 0 0 
##$DATE= 1686914232
##$DBL= (0..7)
120 120 120 120 120 120 120 120 
##$DBP= (0..7)
150 150 150 150 150 150 150 150 
##$DBP07= 0
##$DBPNAM0= <>
##$DBPNAM1= <>
##$DBPNAM2= <>
##$DBPNAM3= <>
##$DBPNAM4= <>
##$DBPNAM5= <>
##$DBPNAM6= <>
##$DBPNAM7= <>
##$DBPOAL= (0..7)
0.5 0.5 0.5 0.5 0.5 0.5 0.5 0.5 
##$DBPOFFS= (0..7)
0 0 0 0 0 0 0 0 
##$DE= 6
##$DECBNUC= <off>
##$DECIM= 32
##$DECNUC= <off>
##$DECSTAT= 4
##$DIGMOD= 1
##$DIGTYP= 9
##$DL= (0..7)
0 120 120 120 120 120 120 120 
##$DP= (0..7)
150 150 150 150 150 150 150 150 
##$DP07= 0
##$DPNAME0= <>
##$DPNAME1= <>
##$DPNAME2= <>
##$DPNAME3= <>
##$DPNAME4= <>
##$DPNAME5= <>
##$DPNAME6= <>
##$DPNAME7= <>
##$DPOAL= (0..7)
0.5 0.5 0.5 0.5 0.5 0.5 0.5 0.5 
##$DPOFFS= (0..7)
0 0 0 0 0 0 0 0 
##$DQDMODE= 0
##$DR= 18
##$DS= 0
##$DSLIST= <SSSSSSSSSSSSSSS>
$$ [...]
##$SUBNAM2= <"">
##$SUBNAM3= <"">
##$SUBNAM4= <"">
##$SUBNAM5= <"">
##$SUBNAM6= <"">
##$SUBNAM7= <"">
##$SUBNAM8= <"">
##$SUBNAM9= <"">
##$SW= 18.05172834244
##$SWIBOX= (0..15)
0 0 2 0 0 0 0 0 0 0 0 0 0 0 0 0 
##$SW_h= 3612.71676300578
##$TD= 16384
##$TD0= 1
##$TE= 0
##$TE2= 300
##$TE3= 300
##$TEG= 300
##$TL= (0..7)
0 120 120 120 120 120 120 120 
##$TP= (0..7)
150 150 150 150 150 150 150 150 
##$TP07= 0
##$TPNAME0= <>
##$TPNAME1= <>
##$TPNAME2= <>
##$TPNAME3= <>
##$TPNAME4= <>
##$TPNAME5= <>
##$TPNAME6= <>
##$TPNAME7= <>
##$TPOAL= (0..7)
0.5 0.5 0.5 0.5 0.5 0.5 0.5 0.5 
##$TPOFFS= (0..7)
0 0 0 0 0 0 0 0 
##$TUNHIN= 0
##$TUNHOUT= 0
##$TUNXOUT= 0
##$USERA1= <user>
##$USERA2= <user>
##$USERA3= <user>
##$USERA4= <user>
##$USERA5= <user>
##$V9= 5
##$VALIST= <valist>
##$VCLIST= <CCCCCCCCCCCCCCC>
##$VD= 0
##$VDLIST= <DDDDDDDDDDDDDDD>
##$VPLIST= <PPPPPPPPPPPPPPP>
##$VTLIST= <TTTTTTTTTTTTTTT>
##$WBST= 1024
##$WBSW= 4
##$XGAIN= (0..3)
0 0 0 0 
##$XL= 0
##$YL= 0
##$YMAX_a= 200928
##$YMIN_a= -187593
##$ZGOPTNS= <>
##$ZL1= 120
##$ZL2= 120
##$ZL3= 120
##$ZL4= 120
##$ABSF1= 10
##$ABSF2= 0
##$ABSG= 5
##$ABSL= 3
##$ALPHA= 0
##$AQORDER= 0
##$ASSFAC= 0
##$ASSFACI= 0
##$ASSFACX= 0
##$ASSWID= 0
##$AUNMP= <proc_1d>
##$AZFE= 0.1
##$AZFW= 0.1
##$BCFW= 1
##$BC_mod= 2
##$BYTORDP= 1
##$COROFFS= 0
##$CY= 11.3945322036743
##$DATMOD= 1
##$DC= 2
##$DFILT= <>
##$DTYPP= 0
##$F1P= 15.7292609196834
##$F2P= 12.9074282941183
##$FCOR= 0.5
##$FTSIZE= 0
##$FT_mod= 4
##$GAMMA= 1
##$GB= 0.15
##$INTBC= 1
##$INTSCL= 1
##$ISEN= 128
##$LB= 0.24
##$LEV0= 0
##$LPBIN= 0
##$MAXI= 10000
##$MC2= 0
##$MEAN= 0
##$ME_mod= 0
##$MI= 1.114404
##$NCOEF= 0
##$NC_proc= 0
##$NLEV= 6
##$NOISF1= 3.799351
##$NOISF2= 2.8
##$NSP= 1
##$NTH_PI= 0
##$NZP= 0
##$OFFSET= 15.70392
##$PC= 1
##$PHC0= -20783.04
##$PHC1= 9.852719
##$PH_mod= 1
##$PKNL= yes
##$PPARMOD= 0
##$PSCAL= 0
##$PSIGN= 0
##$REVERSE= no
##$SF= 200.130013532006
##$SI= 16384
##$SIGF1= 3
##$SIGF2= 2
##$SINO= 400
##$SIOLD= 16384
##$SREGLST= <1H.CDCl3>
##$SSB= 0
##$STSI= 0
##$STSR= 0
##$SW_p= 3612.71676300578
##$SYMM= 0
##$S_DEV= 0
##$TDeff= 0
##$TDoff= 0
##$TI= <>
##$TILT= no
##$TM1= 0
##$TM2= 0
##$TOPLEV= 0
##$USERP1= <user>
##$USERP2= <user>
##$USERP3= <user>
##$USERP4= <user>
##$USERP5= <user>
##$WDW= 1
##$XDIM= 8192
##$YMAX_p= 0
##$YMIN_p= 0
$$ End of Bruker specific parameters
$$ ---------------------------------
##NTUPLES= NMR FID
##VAR_NAME=  TIME,          FID/REAL,        FID/IMAG
##SYMBOL=    X,             R,               I
##VAR_TYPE=  INDEPENDENT,   DEPENDENT,       DEPENDENT
##VAR_FORM=  AFFN,          ASDF,            ASDF
##VAR_DIM=   8192,          8192,            8192
##UNITS=     SECONDS,       ARBITRARY UNITS, ARBITRARY UNITS
##FACTOR=    0.0002768,     1,               1
##FIRST=     0,             0,               0
##LAST=      2.2672688,     0,               0
##MIN=       0,             -187593,         0
##MAX=       2.2672688,     200928,          0
$$ Real data points
##PAGE= N=1
##DATA TABLE= (X++(R..R)), XYDATA
0@%%%%%%%%%%%%%%%%%%Qj6J6j6J6j8K6l2L3m1M9n7O5p3Q6r7J09j24J40j57J77
39I4j98K21k47K75l06L39l75M16m59N06n59O17o79P46q21R05r99J102j217J349
59G10j500J673j877K115k399K745l165L669m187M067M031J95046j47896j82556
73a29524J90796r576j96575Q7770J76985o1630o6138j5137l9005M8523M6236o6154
85c3429P2275R4382j99298j12059K44608M2380k07694J04393J63507k27474j24775
96a83184K29908N4969j42494M8681O1115j06614l6464N6444L1363N8101j9320
107E2505j26682L2696R7908j10103k0018K10443m0255k39618Q1823J61699j35846
118c5448m3305J88729k6378j79186L4702R1710k7435M063K5406k5593j699k9964
$$ plain form
0 0 0 0 0 0 0 0 0 0 0 0 0 0 0 0 0 0 0 0 8 -8 8 -8 8 -10 16 -16 17 -24 25 -32 33 -40 46 -51 58 -66 74 -83 94
39 94 -104 117 -130 145 -161 178 -197 219 -240 266 -293 324 -355 391 -430 475 -524 578 -639 710
59 710 -790 883 -994 1121 -1278 1467 -1698 1971 -2216 1851 5882 200928 53032 -129524
73 -129524 61272 51696 -144879 -57109 119876 58246 -7892 -23029 -62034 -13511 32725 -33429
85 -33429 38846 133228 -66070 -178129 66479 108859 -98835 5558 169065 -58409 -183184
96 -183184 46724 101693 -40801 7880 68995 -37619 -74083 -17639 13724 71825 52505
107 52505 -74177 -41481 56427 -53676 -73694 136749 96494 -143124 -61301 100398 -35448
118 -35448 -78753 109976 83598 -95588 -60886 30824 3389 7452 32858 7265 5566 -24398
130b4398n3988R6671R1063j28162n4481J35986m4094j43493J29683J33152j50888
141a2949p5180J25185j3429r7280O9451P7714n3842m6511j983R502L9615m683
153A5610l7974N3509K0741j19670m393J46401k5113j17331P8277O6283j29141
164e2801k8896J35401M274r2337K0483M0265l8455j9534K6527K9657J2066m6033
176i383m0962N8844K9427p6422J4392R8540n6543j02252P8780P1546q6808k0573
188d1414R0151j6747q2762K3743N7820j2902k7972L094J7353Q89l5082n227O2468
201C3412N585p6723R018P2340m0440n9271P0964M4114q1586k4195P1480O1n4413
214b9654J8291M3350j9330l8021P179L5007L558l5961j050M4562j2166n6524K7464
$$ plain form
130 -24398 -78386 18285 109348 -18814 -73295 62691 18597 -124896 4787 137939 -12949
141 -12949 -88129 37056 23627 -73653 -4202 73512 19670 -26841 -28824 -19322 20293 15610
153 15610 -22364 31145 51886 -67784 -72177 74224 49111 -68220 10057 76340 -52801
164 -52801 -81697 53704 57978 -34359 -13876 26389 -12066 -31600 -5073 24584 36650 -9383
176 -9383 -50345 8499 37926 -38496 -24104 74436 17893 -84359 -5579 65967 -20841 -41414
188 -41414 48737 31990 -50772 -27029 30791 17889 -10083 -6989 10364 11253 -23829 -29056 33412
201 33412 38997 -37726 -28708 43632 3192 -56079 14885 58999 -22587 -46782 24698 24759 -29654
214 -29654 -11363 31987 12657 -25364 -18185 16822 20380 -15581 -16631 27931 15765 -40759 -13295
227a3295N9772m1044m8631N2925K8274o1913j0018O2171j492n2894P382M0381
239B1618j0739l3094J1403L4294r841l8967J0153M2192j6313m1338K8285L8085
251C5738m0254l1446M7198K1124m8283q711M6063j927m2662P521L8379r506l4736
264b1502J0542L2236j3240l2235J7456L2759k2758l1357K8353K6870l3691k0019
276b6586L8066J2813l9615n665L8877m22l6563N773L4337r792l2353J3196L0462
289B2528j6569k8491K0253K5694k4271k2432K7574J8154l0466j3297L1821Q081
301A8579l2397l140L2193j620l1142N956K9786r865k7738J3645K5552j6862k2573
314a9626J9984J9575k2455j5935K4332J2228k5608q513K6392M606k6764r67K6407
$$ plain form
227 -13295 46477 5433 -43198 9727 38001 -23912 -33930 28241 26749 -26145 -18763 21618
239 21618 10879 -22215 -10812 23482 13641 -25326 -15173 27019 10706 -30632 -2347 35738
251 35738 -4516 -35962 11236 32360 -15923 -24634 21429 19502 -23160 -15639 22740 13234 -21502
264 -21502 -10960 21276 8036 -24199 -6743 26016 3258 -28099 254 27124 -6567 -26586
276 -26586 11480 24293 -15322 -20987 17890 17468 -19095 -13322 21015 11223 -21130 -7934 22528
289 22528 5959 -22532 -2279 23415 -856 -23288 4286 22440 -8026 -21323 10498 18579
301 18579 -13818 -16958 15235 13615 -17527 -11571 18215 8350 -19388 -5743 19809 2947 -19626
314 -19626 358 19933 -2522 -18457 5875 18103 -7505 -16018 10374 14980 -11784 -12751 13656
327A3656k943k5770O353K4374r784k2780J2830K0524j5451j8203J7862J5558j9728
340c502j2599K1459R630k2604o050K3305K651k3140J058K2540m427k1165P152
353e692J9448r312j7584J0893J5811j2725j4460J4298J2892j6224j1100J7937
365D182Q155j9592m611K0577Q77k0169K646J8465n394j5903P517J3867q225j2599
379a0207Q570J1886q585j1417J0124J0863j2819j0025J5597Q011j7599m372J8008
392H035n99j7658M782J5709o899j2859P174R368o701p472O449Q140o341r892O878
407a886J0829q743r491J2771O899j6568l391J7617n00j5249M969J1373q228q374
421g972Q139O441n428n116K290M727k280o507M498R432p509j0613R982P917j2503
$$ plain form
327 13656 10713 -15057 -8704 15670 5886 -16894 -4064 16460 1009 -17194 668 16226 -3502
340 -3502 -16101 5358 14988 -7616 -13666 9639 12290 -10850 -9792 12748 8321 -12844 -5692
353 -5692 13756 4444 -13140 -2247 13564 839 -13621 677 13569 -2655 -13755 4182
365 4182 12337 -7255 -11866 8711 9588 -10581 -7935 10530 5136 -10767 -3250 10617 2392 -10207
379 -10207 -1637 10249 1664 -9753 371 11234 -1585 -11610 3987 11998 -5601 -9973 8035
392 8035 7436 -10222 -5440 10269 3370 -9489 -2315 7053 352 -7120 -671 7469 1128 -8764 -1886
407 -1886 8943 200 -9291 3480 10379 -6189 -9580 8037 7537 -7712 -2743 8630 402 -7972
421 -7972 167 6608 1180 -3936 -1646 3081 801 -5706 -1208 8224 715 -9898 84 8001 -4502
436d502k272J4702k632j4244N274J0466o085m772O361J604n285k193K411M765
450C598N19o638j31P430m552q218R813P833j2487m667J1738j422j0174O658Q202
465G502p487n247M654J287j537J148K50J164P6n836k02R149r12q505N104N595
481F203r990l044J1965N46r409K733M834n999k035N788J176k048r56k365P77L466
497A642k655j019O463j876r246L824Q122n558l490Q374o84r419K371O848k455
512A242j902K830j223k533M44j73K124L671m019m577M904J122o517L482Q004o188
528F91o868O266K448o125K322O050l561m356J796R49K90J948j030p28J942l294
544a260l420O566L685p143n77O306m556o005P537M941o939j791M427k458l074
$$ plain form
436 -4502 -6774 7928 5296 -8948 -3674 6792 707 -4065 2296 3900 -1385 -3578 -1167 3598
450 3598 4117 -2521 -2652 4778 226 -7992 1821 9654 -2833 -7500 4238 2816 -7358 -700 7502
465 7502 15 -5232 -578 709 -828 320 570 1734 1810 -4026 -4228 4921 4009 -4496 608 6203
481 6203 -3787 -6831 5134 5680 -3729 -996 3838 -2161 -4196 1592 2768 720 -236 -2601 -1824 1642
497 1642 -1013 -2032 4431 2555 -6691 -2867 5255 -303 -3793 4581 3897 -5522 -3151 3697 1242
512 1242 -660 2170 947 -1586 -1142 -1315 809 4480 461 -4116 788 1910 -4607 -1125 6879 691
528 691 -6177 89 2537 -3588 -1266 4784 1223 -3133 -1337 -388 -98 1850 820 92 2034 -1260
544 -1260 -4680 1886 5571 -1572 -2149 4157 -399 -6404 1133 6074 -865 -2656 1771 -687 -3761
559c761L758K469j153r68k819n21M329m18l156M686K016q798j000R420j167o524
575c607N403L515q415j948P569M41l477J552J31k520r6K2J328M224k389o238L308
592a197L939o066J48R401k970r701M243N886n467q19P230j600o341R18K582M62
608F48J196p41j260J744k507l980O129N192p434k926P449k567p780O774P117p464
624d10m018N696o46m276L174L514j453j969k106J40M294m11l755M272K491q596
640d059j386J0135p55p908M601M632q137k549Q151J051m895M52J414j695n65K51
656a262J880K970l362n044M412L745o191J08Q484l370q878N072O251n797j869
671b851O456p28n971P77L838L58j181j281P01J558l045k365O061K446p647p67
$$ plain form
559 -3761 -3 2466 1313 345 -2474 -2995 1334 916 -2240 2446 4462 -4336 -5336 4084 2917 -3607
575 -3607 1796 5311 -3104 -5052 2517 2958 -519 1033 1164 -1356 -1452 -1430 -102 4122 1733 -4505 -1197
592 -1197 2742 -3324 -3176 6225 3255 -6446 -2203 3683 -1784 -2603 4627 3027 -3314 -2396 186 648
608 648 1844 1103 -157 1587 -920 -4900 1229 6421 -1013 -3939 3510 943 -6837 -63 7054 -410
624 -410 -4428 1268 622 -3654 -480 3034 1581 -388 -2494 -2354 1940 1529 -2226 2046 4537 -4059
640 -4059 -5445 4690 3935 -3973 628 5260 -2877 -5426 2725 3776 -1119 -667 747 -948 -1513 -1262
656 -1262 618 3588 226 -4818 -406 3339 -2852 -2744 5740 2370 -6508 -1436 4815 -982 -2851
671 -2851 3605 2877 -3094 -2317 1521 1879 698 -583 118 1676 -1369 -3734 2327 4773 -2874 -3641
687c641P223k832o325O086N145p165l089N920N50m196J372L326q24k923r46K753
703D34K418l075k063M706M35o682J298P342k859o166M571L655o013j791O093O93
719B996m918j90L144r8k560j03L303P43m387r17N187J25n416J828N534l733n009
736d471M920L735n109j874M992L34m604J17M041k8l515l18L393ol996M79M742
753B832j357n070K285M588l389l618M417K653m855j580M690Q28m171j14L950k58
769A831l722L97L877o09l958J102L995j917l957K595L606l439k994L824K141m199
785a427j345M194O95m174j39M013l51l825Q21L881j277l645J864L499k286l089
801b591K770K773l224k218L504J666l736j096L750M68l801k1L697n78l594R43
$$ plain form
687 -3641 3582 750 -5575 511 5656 -1509 -4598 1322 1872 -2324 -952 2374 1550 -1373 -2319 434
703 434 2852 -223 -2286 2420 2855 -3827 -2529 4813 1954 -4212 359 4014 -1999 -3790 2303 2996
719 2996 -1922 -2112 1032 934 -1626 -1729 1574 2317 -2070 -2987 2200 2325 -3091 -1263 4271 538 -4471
736 -4471 449 4184 -925 -2799 2193 2527 -2077 -1960 2081 2053 -1462 -1780 1613 1607 -2389 -1910 2832
753 2832 1475 -3595 -1310 3278 -111 -3729 688 3341 -1514 -3094 1596 2424 -1747 -1861 2089 1831
769 1831 -1891 -1494 2383 1774 -2184 -1082 2913 996 -2961 -366 3240 -199 -3193 631 2772 -1427
785 -1427 -2772 1422 2117 -2057 -2196 1817 1466 -2359 -1538 2343 1066 -2579 -715 2784 498 -2591
801 -2591 179 2952 -272 -2490 1014 2680 -1056 -2152 1598 2066 -1735 -1756 1941 1363 -2231 -1288
817a288L381j433l290J949K958k331k543K730K169k956j664L236J249l264p72
832a869L454K97l447K99L356o55l262J125L069j719k826J985K473k357k202K517
848B38J873k972j348L054Q78l219l21L177q3l081N27K978q09k743J191K640j371
865F09k408J747K254k119j998K527J615k863j107K931M63k979L1K744m79k501
881a533O29K246q56k122R84K120j196k156J435K171j814j915K501J472k866p78
897a678L096K04k800M37K348q55k040R16J801p80j650N07J630p09j964J170K127
914A760j812k120K298J526k742n67K977k75k691P43K122q64j206Q99Q55o07j091
931g95K99J665q8j953M71J983j456j954K394J554k890p90K602l13k346J188J802
$$ plain form
817 -1288 2093 660 -2630 -681 2277 -54 -2597 133 2302 -654 -2318 918 2167 -1097 -1869
832 -1869 1585 1882 -1565 -1266 2090 1435 -1827 -702 2367 648 -2178 -193 2280 -77 -2279 238
848 238 2111 -861 -2209 845 1723 -1496 -1817 1360 1277 -1804 -1277 1701 892 -1851 -660 1980 609
865 609 -1799 -52 2202 83 -1915 612 2227 -636 -1743 1188 1651 -1328 -1297 1447 968 -1533
881 -1533 -904 1342 486 -1636 -652 1468 272 -1884 -449 1722 -92 -2007 494 1966 -900 -1678
897 -1678 1418 1622 -1178 -741 1607 752 -1288 -372 1429 649 -1001 -494 1136 427 -1537 -367 1760
914 1760 -52 -2172 126 1652 -1090 -1657 1320 1045 -1646 -903 1219 355 -851 48 903 296 -795
931 -795 -496 1169 1081 -872 -401 1582 126 -1828 566 2120 -770 -1560 1042 729 -1617 -429 1373
948A373j319j251P21O19j04l78k9J030q5j985M33K657r78k159J926J309k819m83
966a522L080j41k386Q68J116j303n27J027M58j22q07q09J016P04j543J64K323
983A596j231k785K089J962k268n09K652p46k476J126J685p24m24M42k92o1l19
1000b83l78J448R02k189q67K367o45k312K298K033l030j376K588j3j963J386J438
1017A404j454j004M39M31O10J76r76O44O58k140k83L282j41l035J323J953k920
1034a033r69L531L16k721L93J055j202k80J250K81k7p48j451R84J743j428p11
1051a017K744q10l696J786L342k211j452K832l40l208J032K445o76p26L23m41
1067g3j72J3n82J480J457k710j562K863M4k972K221L070l562k496L383P10k491
$$ plain form
948 1373 54 -1197 -476 143 39 -339 -368 662 577 -1408 -975 1682 704 -1455 471 1780 -1039 -1522
966 -1522 1558 1417 -969 -101 1015 -288 -815 212 670 548 -259 -1068 -52 652 -891 -727 1596
983 1596 365 -2420 -331 1631 -637 -1146 1506 760 -1716 -590 1095 371 -53 389 97 36 -283
1000 -283 -661 787 1689 -500 -1367 1000 355 -1957 341 2374 -656 -2032 556 543 -1420 -34 1404
1017 1404 -50 -1054 -615 -184 426 602 -374 270 928 -1212 -1495 1787 1646 -1389 -66 1887 -1033
1034 -1033 -2002 1529 1845 -876 -483 572 -630 -910 340 621 594 -154 -1605 -621 1122 -306 -1017
1051 -1017 1727 917 -2779 -993 2349 138 -1314 1518 1178 -2030 -998 1447 771 45 368 -73
1067 -73 -245 -232 -814 666 2123 -587 -2149 714 758 -2214 7 3077 -485 -2981 402 1112 -1379
1084a379J302K018j900j542P53P13Q92J12j329M49R69k310n74M175j7m277J173
1101g72K875l117j446M272O01l800J54J869j125n56J478M60l34j064j470J540
1117d35K127j947q84L133j018m222K337M130k831k199L343n0l820J173L245q59
1133A223j649L14p9rj45m04J733J008l356j282L816Pl536K446L187m218k441M229
1151H44J004l156Q83K430j850j852J095J413M87q41j294J150P81k640J29M163
1167B746r57m481J882L146l369j466M492K82m361L45K796q09j337J169J021o39
1183D60j622l59K392J005k847j68L332j580l682L085L445l737k012L700J20l655
1199b123J049L209j126k308M48J387j63j302L2K313k51l251M53L677j364l168
$$ plain form
1084 -1379 -77 1941 41 -1501 -748 -35 857 969 -360 89 1058 -1252 -1826 2349 2332 -1945 -772
1101 -772 2103 -1014 -2460 1812 2413 -1387 -1233 636 -489 -1045 433 893 559 -505 -1975 -435
1117 -435 1692 -255 -1139 1994 976 -3246 -909 3221 390 -1809 1534 1484 -2336 -1163 2082 1223
1133 1223 -426 -112 -191 -200 -345 -749 984 1992 -1364 -2646 1170 1177 -2359 87 3274 -944 -3385 844
1151 844 1848 -1308 -425 2005 155 -1697 -602 811 1298 457 -837 313 1094 -1546 -1417 2746
1167 2746 1789 -2692 -810 2336 -1033 -2499 1993 2275 -2086 -1741 1055 246 -1091 78 1099 460
1183 460 -1162 -1521 871 1876 -971 -1139 2193 613 -3069 16 3461 -276 -2288 1412 1532 -2123
1199 -2123 -1074 2135 1009 -1299 -851 536 373 -929 -897 1416 1165 -2086 -1633 2044 680 -2488
1215b488K868K265l876j424M189N57l498M67K717j136k193R78K110m28k160J27
1231i25K245m98k715J297L104k268l015K917K200l459j039L713J05l636M80L112
1247A618p38k387Q74K212r65k274R64K632j094k649J551K580k348k305L085J704
1263B460l465j011L447J70l290L86L026q27k758Q81K537j013k433J259K461j617
1279B13k386K097K269k526j758K916J296l190o62L267J69l230L66K981q01k784
1295a763J050K644j410k521J654K331k024k102K286J806k613j462K881R86k976
1310a233m66L069K7k908L21K925p38k805J179K686j483k463J856K080k052j878
1326a883K290J566k603j181K693P84k889l80K866j15k769M20K789q32k707J283
$$ plain form
1215 -2488 380 2645 -1231 -2655 1534 2091 -1407 -940 1777 641 -1552 -574 1536 1108 -1052 -925
1231 -925 1320 822 -1893 -596 2508 240 -2775 142 2342 -1117 -2156 1557 1662 -1974 -1494 1618
1247 1618 880 -1507 -633 1579 614 -1660 -696 1936 842 -1807 -256 2324 -24 -2329 756 2460
1263 2460 -1005 -2016 1431 1601 -1689 -1303 1723 896 -1862 -981 1556 543 -1890 -631 1830 213
1279 213 -2173 -76 2193 -333 -2091 825 2121 -1069 -1731 1536 1705 -1525 -1159 1822 1021 -1763
1295 -1763 -713 1931 521 -2000 -346 1985 -39 -2141 145 1951 -662 -2124 757 1743 -1233
1310 -1233 -1699 1370 1397 -1511 -1190 1735 997 -1808 -629 2057 574 -1889 -33 2047 -5 -1883
1326 -1883 407 1973 -630 -1811 882 1666 -1223 -1603 1263 1148 -1621 -1201 1588 756 -1951 -668
1342f68K487j547k301J982J967k102j661K451J329k621r59K786N55k816j38K819
1358A563l53k754P75K494j104k360J320K091j563j898J696J745j985j595K273
1373C45J354k576q77K795L51k739J00K775n58k427R79K116j222j822J320J691
1389A605j323j622J346J576j702j497K099J258k588r21K768K44k760M84K601j108
1405D60k175J289J786j278j265J170J128j139j212J172J641j319j719J848J315
1420A702k465p83K995M9k946N21K407j255j703J563J250j461r53P72R05l88r99
1437g89M52J466j152j778J837J846k330j031K654m4k830J077K531j402j584J302
1453B25N88j207n8Q16M31l43j227o5J663m30j689J485J526k572j224K984K49k493
$$ plain form
1342 -668 1819 272 -2029 -47 1920 -182 -1843 608 1937 -684 -1643 1143 1698 -1118 -1256 1563
1358 1563 1210 -1544 -769 1725 621 -1739 -419 1672 109 -1789 -93 1652 -333 -1928 345
1373 345 1699 -877 -1754 1041 1392 -1347 -1247 1528 970 -1457 -478 1638 416 -1406 -86 1605
1389 1605 282 -1340 6 1582 -120 -1617 482 1740 -848 -1769 999 1243 -1517 -1033 1568 460
1405 460 -1715 -426 1360 82 -1183 -13 1115 -24 -1236 -64 1577 258 -1461 387 1702
1420 1702 -763 -1546 1449 1498 -1448 -927 1480 225 -1478 85 1335 -126 -1079 -307 598 210 -789
1437 -789 -337 1129 -23 -1801 36 1882 -448 -1479 1175 1131 -1699 -622 1909 507 -1077 225
1453 225 813 -394 -452 364 795 452 -775 -840 823 393 -1296 189 1715 -857 -2081 903 1152 -1341
1471a341R71J890j828j284J730P44q41M3k7j16L05o56j0J804l66k433R63J877
1489A425j871r31K812Kk939O48J819j139o20J507j78j178J30l0L45J046o83r21
1507g56J252j03j943J238K328j809j565K049J70k250J016K041j254j138Q47j77
1523e4m18P04J4j37N80j078j079J772P61j853M05J802j788j636K374R14j820J94
1541c43J327j236p96J165L56o8J57q10l82J080l63q88J615O47k466k35K240p00
1559C00j560J812Q68k273l88J600j65n77N93Q5m12p5m80K72J432m27j492R52R34
1578I99j954j07K677l70k454R08J367j580m94J939J02j397k09M11P2J66k12K6
1596a10Q89p95j592J235J797j661q90K229k17k708R88K476j173j408J463L46j677
$$ plain form
1471 -1341 -370 1520 -308 -1592 138 882 41 84 57 -59 246 -410 -420 1384 1018 -1415 -452 1425
1489 1425 -446 -1377 1435 1437 -1502 -854 965 -174 -794 713 535 -643 -513 -543 -198 848 165 -756
1507 -756 496 393 -1550 -312 2016 207 -1358 691 861 -1389 -373 1668 414 -724 123 -54
1523 -54 -472 232 246 109 689 -389 -1468 304 1065 -788 -383 1419 -369 -2005 369 1283 -537 -343
1541 -343 984 -252 -1048 117 473 405 562 -248 -630 450 87 -801 814 1461 -1005 -1240 1000 300
1559 300 -1260 552 1420 -853 -1241 359 194 -383 210 295 -117 -192 -672 -400 1032 605 -887 65 999
1578 999 -955 -1062 1615 1245 -1209 -301 1066 -514 -1008 931 1033 -364 -573 -162 -90 76 -136 -110
1596 -110 779 -16 -1608 -373 1424 -237 -1127 1102 885 -1823 -835 1641 468 -940 523 869 -808
1613h08Q8J179L68k80q51k36R47j82j260J289J687k357j652K577P17k634P34K634
1631A960j733k332J892J355j446k20J205j56q93m52N16J483k93j778O86J658k041
1648e89j251L208Q59l499k9K852j419k101K376J527k254r33J067M16m00j50M53
1665A33Q22q26j992J334K378j766j712K782M93l630M97L760j148k850J826J450
1681A551k274p02K033P34j242r00M29J065n90j482J594J869k682j889L177J025
1697A716l343M64L471j654l144K106K304j885j162J731M78j484p95J240J513j062
1713D94j966J423J801k459j362L496P02l977K07L539j347k705K082K159k349j565
1729a827J884J144j366r71J370J218j709j574K170J746k622j293L233L36l649
$$ plain form
1613 -808 -720 459 827 547 -304 -540 407 225 -1035 254 1941 -416 -2068 509 1226 -1408 -674 1960
1631 1960 227 -2105 -213 1142 -304 -524 681 525 -368 -820 -304 1179 886 -892 -206 1452 -589
1648 -589 -1840 1368 2227 -1272 -1301 1551 132 -1969 407 1934 -320 -1253 -186 230 -170 -320 133
1665 133 955 129 -1863 -529 1849 83 -1629 1153 1646 -1984 -1487 2273 1125 -1725 101 1551
1681 1551 -723 -1425 608 1342 100 -800 -371 694 104 -1378 216 2085 -597 -2486 691 1716
1697 1716 -1627 -1163 2308 654 -2490 -384 1920 35 -1127 604 1082 -402 -1197 43 1556 494
1713 494 -1472 -49 1752 -707 -2069 1427 2129 -1848 -1641 1898 551 -2154 -72 2087 -262 -1827
1729 -1827 57 1201 -165 -1136 234 1452 -257 -1831 339 2085 -537 -1830 1403 1739 -1910
1744a910O69L599j308l197J855K255k164j634K182J393k029j404J788J390j893
1759d08j346K391J179k984q47L381L02l461N87L317j307l014J870K571j973k054
1775a796K043J621k146j403K192J407k463j254K634R31l002m80L257j35l351P57
1791a188L097j210k893J748K528k079k137K315J801k375j564K571J337k721r70
1806a740K989O08l175j96L208k61l227P61L112j364k807J676K469j936k338K318
1822I7J913k529j580K764J227k921p99L024M63l160N6L138m00l113R07K975j333
1839G29k727J669K522k087k207K364J893k659j518K805J096l000p15L094L24l188
1855a605J02L170n90l140J132K985j566k665J906K412k208j932K430J604k585
$$ plain form
1744 -1910 -1241 2358 1050 -2147 -292 1963 -201 -1835 347 1740 -289 -1693 95 1485 -408
1759 -408 -1754 637 1816 -1168 -2015 1366 1668 -1793 -1206 2111 804 -2210 -340 2231 258 -1796
1775 -1796 247 1868 -278 -1681 511 1918 -545 -1799 835 1766 -1236 -1716 1541 1406 -1945 -1188
1791 -1188 1909 699 -2194 -446 2082 3 -2134 181 1982 -393 -1957 614 1951 -770 -1740
1806 -1740 1249 1857 -1318 -1514 1694 1433 -1794 -1033 2079 715 -2092 -416 2053 117 -2221 97
1822 97 2010 -519 -2099 665 1892 -1029 -1828 1196 1659 -1501 -1445 1693 1293 -1820 -913 2062 729
1839 729 -1998 -329 2193 106 -2101 263 2156 -503 -2021 784 1880 -1120 -1835 1259 1583 -1605
1855 -1605 -1503 1667 1077 -2063 -931 2054 488 -2177 -271 2141 -67 -1999 431 2035 -550
1870e50j243K692R70k779p73K971L81l127L9L277o94l223J197L011j778k562K155
1887c6K080k373j730K469J330k389j078K407R40k547q22K933N85l165k9L353p29
1904A199l362J503L096k072k563K454J667k537j079K489Q05k194r42J922J002
1919A388k124q70K628P01l396j54L674n40l568J713L059k670k286K915J560k522
1935d92q17K018L45j669n01J673J166j972j583K402J159l160k29L987r34m190
1951b797J834L378k684j858L249O00l008j81K089K32r42m54P53P90j503j390K715
1968H23J724l591r00L903r66l840K691L367l461k203L172M04k490P71J903p15
1984E92j181n75N39J703n96j881J991J450l937o00M873m40m246K188K744l901
$$ plain form
1870 -550 -1793 899 1869 -910 -1683 1288 1669 -1458 -1419 1858 1164 -2059 -862 2149 371 -2191 -36
1887 -36 2044 -329 -2059 410 1740 -649 -1727 680 1620 -927 -1749 1184 1769 -1396 -1425 1928 1199
1904 1199 -2163 -660 2436 364 -2199 255 1922 -615 -1694 795 1600 -594 -1536 386 1388
1919 1388 -736 -1606 1022 1723 -1673 -1827 1847 1307 -2261 -548 2511 -159 -2445 470 2030 -492
1935 -492 -1309 709 1054 -615 -1116 557 1723 -249 -1832 570 1729 -1431 -1660 2327 1393 -2797
1951 -2797 -963 2415 -269 -2127 1122 1722 -1286 -1467 622 854 -88 -542 211 1001 -502 -1892 823
1968 823 2547 -1044 -1944 1959 993 -2847 -156 3211 -250 -2453 719 1123 -1367 -596 1307 592
1984 592 -589 -1164 -625 1078 482 -1399 592 2042 -1895 -2495 2378 1938 -2308 -120 2624 -1277
2000a277j240M160L61k802L94Q90r29k3L25M06J397j376k785K100K514l145n05
2017a535M314j588m870K793L631l301j010L539j000l179J348J753l54J70n48r70
2033h07J160l05j863K715K256m201j568M312p39l788L433K939m566j676L471k27
2049E46j813J887Q16j678k90m68J1K462l7k831J502J658l853l22N329p29m631
2066b441K237K285l760m06M387n44k868P66L22q35J024L27n14J283j096k917K274
2083d76K978l122q61L952j728m438L223L431l255r01K872j415k392J791J411n14
2099E56K60r46j131J649Nj766K301J870m175j398M310n67l244K916K204m113j193
2116b462L270q2j484J367K35j365J1k00J92K149n28k676J500J610l094j56M463
$$ plain form
2000 -1277 -2517 1643 2004 -798 -404 486 -443 -466 -141 265 1662 286 -2499 -399 2115 -1030 -1535
2017 -1535 2779 1191 -3679 -886 2745 -556 -1566 1973 973 -2206 -858 895 541 711 163 -807
2033 -807 353 48 -1815 900 3156 -1045 -2613 1699 960 -2828 605 3544 -1022 -2698 773 546
2049 546 -1267 620 1436 -242 -532 -1000 -989 1473 1436 -1395 107 1765 -2088 -2410 2919 2190 -2441
2066 -2441 -204 2081 -1679 -2085 2302 1758 -1110 -344 -22 -857 167 494 -20 1263 167 -2750 -476
2083 -476 2502 -620 -1481 2471 743 -3695 -472 2959 -296 -1197 1675 260 -2132 -341 1070 556
2099 556 816 -130 -1261 388 393 -1373 928 2798 -1377 -2775 1535 968 -2276 640 2844 -1269 -2462
2116 -2462 808 726 -758 609 844 -521 -510 -710 -518 1631 1103 -1573 -73 1537 -1557 -1713 2750
2133B750r79m156J885K180k830l01L272m90k482M58O25k33O28p1l40J021j094
2150a57k050K271K241k903q18L191j165l407K634K718k674j218K232m80j710J067
2166b28J167k52l75r14k03J563m98j420J910J113l212p13L500m32k847K019J804
2183A982k812j098K529M67j554L24O33l93m11l03P06J308j075j678J510J208k447
2200a104l9L065q52l032J468K091k012q72K173J74j878k8R92L79m56n58N71P70
2218H52j183j124K037J074k461l56K603q07k373J553K027j814j406J782N01j511
2234f06j03J291K35j049p42R48R29j239p88J773M69k313n5K547n42k226J173J787
2252A489j694j295J824R33j509n71J225M56j205m84J257P13j605o21J736M12k043
$$ plain form
2133 2750 1771 -2385 -500 1680 -1150 -1451 1821 1331 -1151 -693 -68 -301 327 256 -84 937 -157
2150 -157 -2207 64 2305 -598 -1416 1775 610 -2797 -163 2555 -119 -1337 895 415 -1295 -228
2166 -228 939 687 312 -602 -805 758 260 -1160 750 1863 -1349 -2062 1438 1006 -1841 178 1982
2183 1982 -830 -1928 601 1068 -486 -162 471 78 -333 -636 70 1378 303 -1375 135 1343 -1104
2200 -1104 -1143 1922 1070 -1962 -494 1597 -415 -1287 886 1060 -818 -846 146 525 69 -489 82 852
2218 852 -331 -1455 582 1656 -805 -1161 1442 635 -1738 -185 1842 28 -1378 404 905 -606
2234 -606 -709 582 817 -232 -974 -26 903 -336 -1124 649 1118 -1195 -1250 1297 755 -1471 -298 1489
2252 1489 -205 -1500 324 1257 -252 -823 402 858 -347 -831 426 1139 -466 -1087 649 1061 -982
2269i82J72K054o70k087J092J732j322j241J418R32j501p13J419O58j355n51J421
2286D76M65j556k80J820kj884K55J956p35j692R47J628j341j348J454J024j533
2303c46p87J535O33j623m85J713K84j691j76J787j12j851M53J754o50j646R75
2320b33J547j243j238J332J102j537q95J638O85j676n11J743K39j756k2J749k27
2337F97j776M76J711p77j625J030J544j258j257J339J065j510q20J622O58j731
2353f12l81J772J61j768R4J783k77j850N77J656p52j624J048J404j301j147J460
2370B43Q95j549p21J604M46j586l36J685J57j673n6J868k55j784O08J674q90j549
2388a219J176J403j452j020J481P13j464n32J501L27j507l44J539K47j705L8J721
$$ plain form
2269 -982 -810 1244 574 -1513 -421 1311 -11 -1252 166 1098 -403 -1116 303 961 -394 -945 476
2286 476 941 -615 -895 925 923 -961 -706 1250 515 -1177 -230 1398 57 -1291 163 1187 -346
2303 -346 -1133 402 1035 -588 -1073 640 924 -767 -943 844 732 -1119 -666 1088 438 -1208 -233
2320 -233 1314 71 -1167 165 1267 -270 -1165 473 1158 -518 -1029 714 953 -803 -825 924 697
2337 697 -1079 -603 1108 331 -1294 -264 1280 22 -1235 104 1169 -341 -1161 461 1119 -612
2353 -612 -993 779 940 -828 -734 1049 772 -1078 -501 1155 403 -1221 -173 1231 -70 -1217 243
2370 243 1138 -411 -1132 472 918 -668 -1004 681 838 -835 -891 977 722 -1062 -454 1220 330 -1219
2388 -1219 -43 1360 -92 -1112 369 1082 -382 -914 587 914 -593 -937 602 849 -856 -818 903
2405I03k20j959O42J898r74j665J489J201j672q43J725N10j488l23J271K58j273
2422e20j32J286K97j592k45J777l9k027P36J937j271j762J604J253j827n23J698
2439F50J35j585N5J163K15r21l37R84L73j421l63K071P6k324O00K084j404j656
2457a605K150J010k213m60J836k13j200M20Q95j95q45l72Q87Q34j294n39J863
2474I59j80k456R62K515j519j799K045P21k381J33K230m63j332L59M05j33j74
2491a08k22O81P81j673r47K159L81k353R12K325k217j885K603J024k290K95J695
2508A161j233j081R63O13N2r1r22K82R29j199n36K492Nl081P51K514j907j287
2526a575K874L26k999L36J856q51n21J124j53n90j29o32P41J573j300j269J950
$$ plain form
2405 903 683 -1276 -634 1264 290 -1375 114 1315 -357 -1200 525 1035 -453 -776 495 753 -520
2422 -520 -652 634 931 -661 -906 871 832 -1195 -459 1478 207 -1555 49 1302 -525 -1048 650
2439 650 785 -800 -745 418 633 -288 -625 359 732 -689 -1052 1019 1095 -1229 -629 1455 51 -1605
2457 -1605 545 1555 -658 -1118 718 505 -695 -275 620 425 -420 -792 95 929 -365 -904 959
2474 959 779 -1677 -715 1800 281 -1518 527 1248 -1133 -1000 1230 767 -565 -206 199 66 -108
2491 -108 -330 351 1132 -541 -1488 671 1052 -1301 -389 1936 -281 -2166 437 1461 -829 -534 1161
2508 1161 -72 -1153 -190 423 475 384 -538 -256 673 -526 -1062 1430 1435 -1646 -895 1619 -288 -1575
2526 -1575 1299 1625 -1374 -1038 818 -33 -554 570 417 -173 -302 -934 -193 1380 80 -1189 761
2543G61p1k672J481K967k268k006K579P3k497J361J965j336r65N28k68K12P31
2560E75o59K29R85j925j153K900N10k791J092K182k758j522L300O10k505P23J240
2577A033j678m02J368J67O1K0j441J80J526j049p41K579l79l339J173K681j969
2594b10j129K862l50k960R13J777r31j62Q56p18l67L17p36Q67J703j757j422K201
2612G54r1k506J782K513k621j689K549Lj985J353J417j396q29N43j87N47N34j014
2630c23L70Q28j837n98K850M4k671J084J860k515q28K981J48k302N39J043j127
2647d54j12R91N5nl35j141O74J378j316n69K202o13k736J394K286j930r60K206
2665A015k57k228Q34J494o08m03K54k38Q1q5m94J097Q95j879o95K072k66j969
$$ plain form
2543 761 690 -1982 -501 2466 198 -1808 771 844 -1653 -292 1673 337 -628 -100 -368 -156 575
2560 575 -84 145 1130 -795 -1948 952 1462 -1329 -237 1945 -813 -2335 965 1575 -930 -207 1033
2577 1033 -645 -1047 321 488 549 569 -872 -692 834 -215 -956 1623 1244 -2095 -922 1759 -210
2594 -210 -1339 1523 1173 -1787 -874 903 -28 -190 666 -52 -419 -102 -838 29 1732 -25 -1447 754
2612 754 663 -1843 -61 2452 -169 -1858 691 694 -1291 62 1479 83 -746 -203 -390 157 691 -323
2630 -323 47 875 -962 -1560 1290 1334 -1337 -253 1607 -908 -1736 1245 1393 -909 -370 673 -454
2647 -454 -566 425 480 475 140 -1001 -327 1051 -265 -834 1368 755 -1981 -587 1699 -231 -1191 1015
2665 1015 758 -1470 -636 858 250 -153 101 -137 -56 -141 -635 462 1357 -522 -1217 855 589 -1380
2683a380J531J758k282j199K201J66j612O45J133q89p74L59M20M16m22o55Q01
2700B17M13j473p0K162m75k069J045J518j726p96K149K42j824P2J160l39o32L71
2718e5N26j2p83m81J114N56j450j08J709n85j895J259J606j623r29J684L03j675
2736h39K14J331j79r42l2Q11O5q77o8J206J14j568P8J718o07j541J140J304j636
2755c08q65J640M44j471j21J341j58j184J18J114N5j139r3J292j64j368L59J619
2773A111p64j502J028J293j344q95J607M39j496l13J466P4j339J9J327j34j302
2790g25J63J321k90j444N07J457q41j334J180J056j214r72J522N80j514k88J525
2807F89J38j457k1J470j78j445L46J482n80j412P25J314r45j237J154J045j329
$$ plain form
2683 -1380 151 1909 -373 -1572 629 795 -817 -172 961 72 -702 -343 77 493 71 -584 217
2700 217 630 -843 -913 1249 774 -1295 -250 1268 -458 -1254 895 1137 -687 -615 545 206 -426 -55
2718 -55 471 459 -324 -805 309 865 -585 -693 1016 431 -1464 -205 1401 -222 -1151 533 836 -839
2736 -839 -625 706 527 -415 -447 364 429 -448 -516 690 804 -764 -686 1032 425 -1116 24 1328 -308
2755 -308 -1173 467 911 -560 -681 660 502 -682 -564 550 605 -534 -627 665 501 -867 -508 1111
2773 1111 347 -1155 -127 1166 -178 -1073 534 973 -523 -836 630 704 -635 -616 711 577 -725
2790 -725 -562 759 469 -975 -468 989 148 -1186 -6 1050 -164 -1136 386 966 -548 -836 689
2807 689 827 -630 -651 819 641 -804 -458 1024 444 -968 -243 1071 126 -1111 43 1088 -241
2824b41q98J578N28j548l99J625J53j585J6J581j78j601M83J461o26j329P60J395
2842A175j056j226J244J053j468p90J539N74j608l60J605J13j647R2J712l63j626
2859a037N23J592p58j410Q87J370j196j164J339J031j519p90J723M92j698l48
2875i63J756L0j684K47J561l08j624N31J535p39j515R63J406j244j319J578J097
2892A308j759p27J804L46j782p6J809k49j589L35J495m00j484N44J535p44j606
2909a240J053J520j336j281J675R79k073n46K094O1j893L07J681n04j568N68J367
2926H64m12j369M30J493o96j587J080J738j574j504J937J029k229l15K295k20
2942I60k117N23J653p10j150O29J028m67j228K50J644l86j863R01J777j744j574
$$ plain form
2824 -241 -1139 439 967 -581 -980 645 798 -787 -771 810 632 -969 -486 975 349 -980 -220 1175
2842 1175 119 -1107 137 1190 -278 -1068 471 1045 -563 -923 682 795 -852 -760 952 589 -1037
2859 -1037 -514 1078 320 -1090 -203 1167 -29 -1193 146 1177 -342 -1132 591 1083 -615 -963
2875 -963 793 823 -861 -614 947 639 -985 -454 1081 342 -1173 -210 1196 -48 -1367 211 1308
2892 1308 -451 -1178 626 972 -810 -886 923 674 -915 -580 915 515 -969 -425 1110 366 -1240
2909 -1240 -187 1333 -3 -1284 391 1370 -703 -1249 845 906 -987 -680 1001 497 -1071 -503 864
2926 864 452 -917 -487 1006 310 -1277 -197 1541 -33 -1537 400 1429 -800 -1115 1180 960
2942 960 -1157 -634 1019 309 -841 -212 816 349 -879 -629 1015 629 -1234 -333 1444 -300 -1874
2959a874K480J104k656k93K381n50k016J201J562j123j014N00Q43j99r05J91J477
2976A109n31k158R79K360j789j647K598O98l219K07K988q93j973J303J053j481
2992c96n50R83O87j74j033l61J520l6k099J323K377k336k158K984R02l116P26
3009g57K853j798k176J780J179j323j8O64j97j97p78j50K087P3k701Q80K310k427
3027f96j578L776P12l913N78K834j927j463K545O31j891l34N75M8N43l34n82J468
3045I92m56k726J513L106k347k014L317m3l975J555L563k100j897K147n0j825
3061a240Q14J093j52J90j105j007J966M57k475J643K399l443j984M147M52l632
3077a877J745K586l133j641K885M69j423P46k0q47M26m40k66K322j34l310J165
$$ plain form
2959 -1874 606 1710 -946 -1239 1142 592 -1424 -223 1339 216 -798 -298 545 346 -559 -368 1109
2976 1109 578 -1580 -601 1759 -30 -1677 921 1619 -1600 -1393 1595 702 -1271 32 1085 -396
2992 -396 -946 37 724 550 -483 -844 676 640 -1459 -136 2241 -95 -2253 731 1633 -1483 -757
3009 -757 2096 298 -1878 -98 1081 -242 -260 404 207 10 -768 -918 1169 1242 -1459 -579 1731 -696
3027 -696 -2274 1502 2214 -1699 -1121 1713 -214 -1677 868 1499 -392 -726 -151 -103 440 106 -476 992
3045 992 536 -2190 -677 2429 82 -1932 1385 1342 -2633 -1078 2485 385 -1512 635 585 -1240
3061 -1240 -426 667 515 705 -400 -1407 559 1016 -1459 184 2583 -860 -2844 1303 1755 -1877
3077 -1877 -132 2454 -679 -2320 565 1034 -389 357 337 -510 -84 -524 -790 1532 1398 -1912 -747
3094g47K606k826j000M351m71m406J552K822k552o53K894m88k159N27L57O0J098
3111I65o36j065J527m02k742K172L042l251j726L564n90l579K492L037k945j382
3127a519K255n76j223J271N62m59K01j194p54K397N9k396J759J799l656r70M240
3144A796k82l390K008J825l179o39K928j21j385O04k77l59O78n32r6K012r20k827
3162b156J896K126k836m00L693j257l561K100K232k339m04K191p40j602N87M71
3178AK23N57j059m39J570q31j866K379J696l218o66L065q61k612K334J776k604
3195e55p54J907k71q72O58K66o4j29j035L09J757q16j732J765J014k786n1L116
3213A727q49k519J644J274k012l89J972o3j152j0L09K86k9p28M67J219j235j450
$$ plain form
3094 -747 1859 -967 -1967 2384 1913 -2493 -941 1881 -671 -1324 1570 1082 -1077 -550 -193 -133 965
3111 965 329 -736 791 389 -2353 -181 2861 -390 -2116 1448 858 -2721 -229 2808 -137 -1519
3127 -1519 736 160 -1063 208 770 311 512 -682 -1436 961 1020 -1376 383 2182 -1474 -2444 1796
3144 1796 1514 -1876 132 1957 -1222 -1861 1067 946 -439 165 -112 -471 207 -325 -421 1591 671 -2156
3162 -2156 -260 1866 -970 -1370 2323 1066 -2495 -395 1837 -502 -906 1285 545 -1057 -470 1
3178 1 224 781 -278 -717 853 22 -1844 535 2231 -987 -1653 1412 551 -2061 273 2049 -555
3195 -555 -1309 598 327 -545 113 379 315 186 -849 -540 1217 401 -1331 434 1448 -1338 -1389 1727
3213 1727 878 -1641 3 1277 -735 -1124 848 785 -367 -377 -68 218 189 -539 -72 1147 -88 -1538
3231a538J932J005k272J7K379j053k165J651J406j625n42J334Mj025m3O92M04
3248E61m58q13N76J007j066r04J770M92k151J33K033p66j679J307J173j483p12
3265i80J290L69q93k90P24L42p20o25Q83Q58j220o80J471L06j782J88J872p37
3283C76j469R43J142j122o94R93O34r91m85P98N06p87m91R28M61j114m68J491
3301F51Q9j506K34J429n89j265Q31R96r20q27R03P53r88m93Q71N72j040m21J055
3320C35L00j074k29J304J4j321J38J275k98j243O01J097q12q95R03P21r40n65
3338f89Q18N86r88m17J008L58j181j46J178K3j198J43J256m16j098N85R76p39
3356E9q09P90P21q47o42R57M83r76l46R55K94j060j90J129j2j107J45J141m00
$$ plain form
3231 -1538 394 1399 -873 -856 1523 470 -1695 -44 1362 -263 -805 529 533 -492 -535 157 561
3248 561 103 -710 -134 873 -193 -1097 673 1165 -986 -853 1180 414 -1265 42 1215 -268 -980
3265 -980 310 679 -214 -504 220 562 -158 -783 100 958 -262 -942 529 835 -947 -759 1113 376
3283 376 -1093 -150 992 -130 -824 169 803 -188 -673 125 631 -156 -647 281 742 -372 -840 651
3301 651 740 -766 -532 897 308 -957 -126 870 -50 -877 26 779 -209 -702 169 741 -299 -720 335
3320 335 635 -439 -668 636 650 -671 -533 742 444 -799 -198 899 87 -808 95 816 -124 -689
3338 -689 129 715 -273 -690 318 676 -505 -651 527 550 -648 -505 751 335 -763 -178 798 59
3356 59 -750 40 761 -86 -728 229 712 -264 -610 345 639 -421 -611 518 506 -601 -456 685 285
3375B85j009M84R35o05q13P17O66p25n91Q06N24q52m31Q49L97j017k12J105L7
3394E50j090J13J214m58j045N52Q75o70p25P17N37o51m61O14N25p49m93P47N20
3413F22r38m13J206J01j260K35J198m72r92P25O96p83n20O95M23n30m05M26N12
3432E26n56o03P56O56j055m88J236J62j385K61J337n16j170P95O95p93l85P17
3450A90J84m39l44K45N58k22p10N72Q05j090o91J433L92j556K04J324o65j103
3468i13R87O79q88k04M31P0k87j10R9O64j74j031L98J073q56q12J426L03j735
3487h80J84J609p30r57R95M52j001j63O80O2j17j09k64M79Mj013N76J248j021
3506C4j102J432L99j679L66J742r64j190J106L31q63K05O05k74j40k12k41P74
$$ plain form
3375 285 -724 -240 695 90 -723 -6 660 -65 -656 150 674 -178 -609 240 637 -380 -592 513 550
3394 550 -540 -427 787 329 -716 -164 711 41 -684 33 570 -81 -542 72 597 -152 -645 102 622
3413 622 -316 -729 477 578 -682 -447 751 279 -713 12 708 -75 -595 100 523 -7 -412 14 526
3432 526 -30 -633 123 779 -276 -764 472 634 -751 -490 847 331 -839 -44 651 -142 -527 190
3450 190 374 -65 -409 -164 394 172 -538 34 839 -251 -942 491 883 -673 -469 855 190 -913
3468 -913 74 753 -135 -339 92 162 -125 -235 -136 528 354 -677 -279 794 -62 -874 552 855 -880
3487 -880 -696 913 183 -774 221 673 -328 -491 189 251 134 25 -239 240 244 -769 -193 1055 34
3506 34 -1068 364 763 -916 -550 1192 228 -962 144 475 -388 -183 422 148 8 -204 -445 329
3524C29K38j051K14J194j088j063J770N80j854K08J448r59j054J391N13j078J5
3541b47M34l70J59J22k85N59J13j273K50J469p88j044J533L60k106L26J835p85
3559B62j047J274J32j263J85P60j96J32j05n80M32L62r96L87J501j159j378J539
3577B42O17j767M31J813j230j228J208M46r48M60N54n99j22j1l00P23M79j174
3595d06k0J325j060j027J763O34k000J76J470j003r13J472M24j216R9L97l36J65
3613e6K92l65M00J58j213J64J623p47j228J515L47j937L16J876q54j035J087J45
3631D88j151L53O76k31K4o3n61M70L89q45K63J226j014j256J523N79j571L57J502
3650A158j082j110J145M53q44K45L92m48o8K1k18P18J84j072R2J175q42r10J530
$$ plain form
3524 329 567 -484 -270 924 -164 -1227 543 1123 -731 -523 925 -34 -1088 303 816 -262 -247
3541 -247 187 -183 -24 98 -187 372 485 -788 -538 931 143 -901 632 992 -1114 -788 1047 262
3559 262 -785 489 621 -642 -457 303 107 239 134 -446 -14 348 -648 -261 1240 81 -1297 242
3577 242 859 -908 -477 1336 106 -1122 86 532 -416 44 598 -1 -123 -134 -434 289 768 -406
3595 -406 -426 899 -161 -1188 575 1209 -791 -615 855 -148 -1061 411 835 -381 -282 115 -221 -56
3613 -56 236 -129 271 429 -784 -620 1003 256 -972 543 890 -1047 -731 1145 291 -744 343 488
3631 488 -663 -310 366 135 159 96 -465 5 394 -451 -188 1038 24 -1232 291 870 -701 -344 1158
3650 1158 76 -1034 111 564 -280 -35 357 -91 -159 -138 -356 362 546 -526 -434 741 -101 -1011 519
3669E19M47j721J91J309o96q64J197L12j071n0N81j92J27P5l28M28k3r21L51J185
3689H56p49r03J199K42j530L63J460p26r28Q62K44p18N3N49p8k05o9k21M46J00
3709B47o62L10Q41q58p38J182L55j139J59J052p27p45Q40M13o25j03L82r8j91
3728a05o7Q1M27n3p75L06P67p00m90R74K52j195J38J063n30o96O92M03o70j78
3748c56M09J87j96j71P1L77k53n17L87O35o27n57Q86J94r92J63R25l52p53M64
3768g6M39m71k53M37K17l05l47K37M27k16m39M12M45p09k89P34K42p98j1P75k88
3789A63o39L93M82l98l58L40K76k65k63K89M11m80l35M33L82o06j82O23J43p07
3809b98j7O84j10o62K79N16l07m16L08M25l77k92K57L75m37k90M53K20m42k76
$$ plain form
3669 519 966 -755 -564 745 49 -815 382 694 -377 -427 154 -38 89 164 -164 264 241 -680 -329 856
3689 856 107 -796 403 645 -885 -522 938 212 -716 146 390 -328 -275 274 196 -9 -78 -299 147 247
3709 247 -415 -105 736 -122 -860 322 677 -462 -303 749 22 -723 117 530 -95 -198 184 86 -105
3728 -105 -172 -91 336 283 -492 -186 581 -119 -609 365 617 -578 -440 623 93 -603 89 492 -178 -356
3748 -356 53 240 44 -127 -56 321 68 -449 -62 573 -54 -611 275 469 -523 -360 565 213 -540 -76
3768 -76 363 -108 -361 76 293 -12 -359 -122 305 89 -350 62 507 -202 -491 243 485 -313 -324 451 163
3789 163 -476 -83 399 1 -357 -17 259 -6 -269 20 431 -49 -384 49 431 -175 -357 266 409 -298
3809 -298 -315 369 259 -403 -124 392 85 -331 -23 402 25 -267 -10 365 -72 -362 91 311 -131 -407
3829d07O38R1o19k6O61p8o09K06M93k98m17K87M78l94l41L00L39k90l14M20K44
3850C64m68k69N87O8n18p2N40K5n99J77N23l11l90L25L58l26l26K93L92l92k93
3871c12M02J85m14j77M13K09n05q0N55o8n48K47M18k20m34K93L13k65l33L20K88
3892B87l01k97L41K98m55k04N54O0n85N2O13j36n46J82N13k83l79K39L29k31l67
3913c16L01L74l69l50L95L56n30k31N29J01n13RN19p6n27J93L86k21l20K29L03
3934B42k23k45J62L98l06k77K78M12n30l52O83J65p27Q1O07k61m38K88L84k73
3954F8l24J99J73q8k59J81L09j54n36L73M85n44l03O57K02q16R3O50k32m68L74
3975D0L34m15j61K14J73j09j70K4K91o6n35L25N43n53l88O51J78q44J90Q08m33
$$ plain form
3829 -407 231 322 -297 -323 338 260 -349 -143 350 52 -365 -78 400 6 -335 -35 304 14 -300 120 364
3850 364 -104 -373 214 282 -236 -308 232 257 -342 -165 358 47 -343 -18 340 14 -312 -19 373 -19 -312
3871 -312 90 275 -139 -316 97 306 -199 -279 276 208 -340 -93 325 105 -329 -36 277 12 -321 -1 287
3892 287 -14 -311 30 328 -127 -331 223 283 -302 -250 363 227 -319 -137 376 93 -286 -47 282 51 -316
3913 -316 -15 359 -10 -360 35 391 -139 -370 159 260 -253 -244 275 199 -328 -135 251 30 -290 -61 242
3934 242 19 -226 -64 334 28 -249 29 441 -89 -441 242 407 -320 -239 368 107 -331 -43 341 68
3954 68 -256 -57 116 28 -231 -50 259 105 -431 -58 427 -117 -420 237 439 -377 -284 366 134 -334 40
3975 40 374 -41 -202 12 185 76 -94 -70 221 155 -380 -55 488 -65 -453 198 376 -468 -278 530 97
3996I7n40M61J54l11kK86k2m3k17p3M77j5n79K56N49o22m50Q68K19q62J35P08
4018D74m71n35O55K25m92P5J46q3l9l6kL33k2o98K48P22m89m65P78Q4r30K38Q11
4041E27m62m78O54K1n69J27K17K4P5j20k01K58Q1n10K96O82o74n86Q34K45r10
4062d69K94P49n57n58O55J26m66K16K63k37j4l6k39M53J64o03Q0O16n78m50R50
4083C59K27j013J49P55o49l90Q07J39n94J71J38k98K14O8k01K75Q5o92K02Q02
4103E54m91n29P74R8j020L21Q90n74l91O73o4o14K65L39k61J33l1l62L24J35m85
4124c16K18O88o69n40Q53J54q73L65P95p87m29P38M1m34L16J31m11Q3P1j56L36
4145A74J74n64ON94n03l18Q82K0r46L06O23n76k12O30j0n20J86J19k38K08M2j51
$$ plain form
3996 97 -443 18 172 -139 -141 145 123 80 -137 -210 267 252 -327 -71 478 -144 -594 274 493 -369 -234 474
4018 474 3 -532 123 348 -144 -69 77 -6 -45 -81 -83 250 228 -470 -222 500 11 -454 324 408 -522 -284 527
4041 527 65 -413 241 262 -307 -180 37 61 136 16 -185 73 154 -356 -60 622 -52 -638 196 441 -469
4062 -469 -175 574 17 -541 114 240 -226 -10 253 16 2 -34 -273 180 344 -259 -179 437 -141 -591 359
4083 359 586 -427 -278 477 -172 -562 245 384 -210 -39 99 -199 15 83 -118 157 242 -450 -248 554
4103 554 63 -466 308 406 -614 -293 597 23 -368 305 241 -373 -108 231 -30 103 72 -290 34 169 -316
4124 -316 -98 590 -79 -619 234 388 -485 -120 675 -112 -541 197 238 -196 120 251 -160 -77 -6 -162 174
4145 174 348 -216 -210 384 -119 -437 445 465 -481 -175 448 -128 -340 290 280 -240 -54 65 -173 35 77 -74
4167g4J65N1n38K66O14m88l55O99j18p77M21O50n39k99N82j38m72L00K45j71m2
4188a8L0j89J91J10l89K68L76n24k85O58O4o46L29M88n83k40N99k5l97K49P8k49
4210a05P3L2m9J96L9m34J95M09n47j01O26j14n90K97L94m70q5M86o9l59J41J50
4232A15j83L8L4p3J62r2k01J97K07l29r8M70n0n16L12L33l55j98L87j6k93J35
4254a4J29j34o6L6J6J41p1j74K14O5l13kL49%m12L00J91l29j48L07Q3k73N9J02
4278E6m0r6M8K0J16j43j26K00Q0j92k3K37r3k14K15J27j80p2J93j0j39OJ01K2
4302I3j36J4M1L5j02l8J77L0j87M1J33n1j97J67M8n0o8J27lj42M3M6J5r5K1O6
4328B8K9m2p0J23%q2l5J06J5j13M8P9j39j2J02K7m5oK6k4j21J18MK3q4J9J42r8
$$ plain form
4167 -74 91 142 -396 -130 484 -4 -359 340 222 -555 -134 516 -23 -322 260 122 -350 -50 195 24 -18
4188 -18 12 -177 14 124 -265 3 379 -145 -430 228 292 -354 -25 463 -120 -360 239 214 -183 66 144 -105
4210 -105 -32 0 -49 147 186 -248 -53 356 -191 -292 334 220 -370 -73 321 -149 -234 252 183 -176 -35 115
4232 115 -68 -30 4 -69 93 1 -200 -3 204 -125 -223 247 197 -319 -7 326 -29 -227 160 144 -149 -14
4254 -14 115 -19 -85 -49 -33 108 37 -137 77 142 -171 -173 176 176 -236 64 255 -74 -222 85 168 -105 -46 56
4278 56 16 -80 -32 -12 104 -39 -165 35 115 -77 -100 137 44 -170 45 172 -8 -80 113 103 -36 -30 71 93
4302 93 -43 -29 12 47 -55 -93 84 114 -73 -32 101 50 -147 20 68 18 -50 77 74 -68 -25 21 36 -59 -38 28
4328 28 57 15 -55 68 68 -14 -49 57 72 -41 7 86 -53 -65 37 64 19 13 39 15 -106 12 16 39 -45 -26 116 18
4356A8r0L9J27p1l4J5P0j15n1J84K6q6l7K5L9p6rO5Mm1l1P5l8o4M1M6j1p8N8N6
4386E6j20M9RL1l6j8mN7o1RM3l1jLO7K0r0k6J01l6j13J78o0k0M1K2l1o3L1Jj7
4417iP4p6NK2n4M0mO6l3n1RRm2M5J43j76M3Mj20Q3l0Q4l4L1m1NN7m1n7N8M8j04
4449d6J0K8J4p5P7n2L8K4Mj14M6J01o0p7J34J2j45J33Lj15Q1L1j12OJ22m4m0L3
4477A7J6j10J24q5j8J18J2j49L0J49j23n7J26K5j09M2N7p0NL4J4q0j4K1j5N3k7
4504a4n1P8J0j00P5J26j60k7J10J3j92R1J42j42nL8O3n6m5J8J6JNk1J04n4j61
4531a38J21J32j22j14K02l5j35R6J24j42n3N1J16r9k7J1L9k1p8L1J18r6r4J27
4555A4J13j83l7K40q8j61N3J88j01j33Q8J13o8j49J43Jl8q4R4J07r3r1J85l0j38
$$ plain form
4356 18 -72 -33 94 23 -11 4 74 -41 -92 92 118 32 -5 20 59 -17 -26 39 43 2 -29 46 8 -56 -15 31 20 -58 0 56
4386 56 -64 -15 -6 25 -11 -29 -33 24 -37 -28 15 -16 -17 -14 53 73 -17 -43 58 22 -91 87 27 7 48 70 39 -24 7 8 -9
4417 -9 65 -11 -6 16 -38 2 -2 64 31 -20 -11 -2 -44 1 144 -32 11 15 -105 -22 -52 32 -2 29 -12 -7 50 9 -48 10 58 -46
4449 -46 -36 -8 6 -69 8 -44 -6 18 22 -92 -46 55 -5 -82 52 64 -81 52 55 -60 21 52 -60 -54 68 24 -16 17
4477 17 33 -77 47 -38 -56 62 74 -75 -45 104 -19 -76 50 75 -34 8 65 -5 0 34 48 -32 -46 -25 -40 13 -14
4504 -14 -65 13 23 -77 -2 124 -36 -63 47 60 -132 -41 101 -41 -46 -8 55 -1 -46 -28 -12 -11 -6 -27 77 23 -138
4531 -138 -17 115 -7 -121 81 46 -89 7 131 -11 -64 -13 103 4 -23 -12 27 6 -72 -41 77 -19 -113 14
4555 14 127 -56 -93 147 59 -102 -49 139 38 -95 -7 106 38 -111 32 33 -5 -89 5 112 19 -72 113 83 -55
4580e5K1J30nk32J13J70j14j36J30J14j07j04J18P6j31p0J25j3j04J6J46J5j61
4603e8n6J91q5j21L8J87q8j81J31K00j75j02J78J39k83j1J93n9j06K5J10kj10
4626d5%J75l0k22M9K56j73j70J78J83k02j39K28L5k17PJ43Q7j95MN2O9j20m4J52
4651F1M2k50MK79o1k35J53J64l02l5K93Mk41J00J15l1k11J16J61o5j32KQ8J07
4675A26l03O7L53j79l59K60K25l32rK86J3l71J84J55m5j90P2Q6m4o6l7K30j6k69
4699a63L7L42j63k78K66K21l92j02M07j09k65J59K51k49j12Q8J29lj89K2K33q
4721A22l12J60L18l17k09K67J77l72o4M12m5l76K28J61j12j71J23J52r5j49j9
4742a21K18M1l19J25L09k48k96L32J86l19n0K80N1m15J73K41j32j72P1J32m5j04
$$ plain form
4580 -55 -34 96 91 -141 -28 142 28 -108 22 136 29 -75 43 119 -12 -82 43 30 -74 -58 88 103 -58
4603 -58 -114 77 -8 -129 -91 96 8 -173 -42 158 -17 -119 59 198 -85 -96 97 38 -68 -43 67 65 -45
4626 -45 -45 130 100 -122 -73 183 10 -160 18 201 -1 -140 88 123 -94 -87 56 143 -52 -48 4 73 -47 -91 61
4651 61 103 -147 -143 136 75 -160 -7 157 -145 -180 113 117 -124 -24 91 60 -151 -35 126 61 -71 -69 19 126
4675 126 -177 -110 243 64 -295 -35 190 -142 -151 135 148 -223 -39 116 71 -119 -47 39 -5 -71 -108 122 106 -163
4699 -163 -126 216 53 -225 41 262 -130 -232 175 66 -199 -40 211 -38 -150 -62 67 64 -125 -103 130 122
4721 122 -190 -30 288 -29 -238 29 206 -166 -230 182 137 -239 -11 150 38 -133 -10 142 47 -102 -121
4742 -121 97 138 -181 -56 253 5 -291 41 227 -92 -142 138 189 -226 -53 188 56 -116 -45 87 42 -62
4764f2J4J94o6l00J44L16k93j50K59J53m06J4L51l6l24J02K58j62j22O4K16j49
4786A5j94J47K32j35k77K34J67k07k37L78J06l91%L48ql50J09K67j27k02J20J24
4808A19j26j53J5L37j28k73L01J24l37p9L06R9l08r5L34jk62O4K89j86k25J62
4830b3J86j32k07J19K63k72j41J93J94k60j15L55N5l58l5L82q2l17J08K51r7k64
4852a97J74J91j35k40K26J70k20j42K04K01l16j06K78O5k88k3L31n0l29J28K51
4873A73j00k71J44K89j76k36J40K32j08l00L19R1k73n5L12%k78p4L83j08k96R3
4895i9L15j30l04J85K79k31j48J13K49k51k08K93J74l34j20L94Pl02j9L20r8k70
4917a85R1L28j88j95J06K14j26k15J73J85j92k52L05J30l53m5M35Km43k6M99j26
$$ plain form
4764 -62 -48 146 80 -220 -76 240 -53 -203 56 209 -197 -183 168 132 -192 -90 168 6 -116 -52 164 15
4786 15 -179 -32 200 65 -212 22 189 -18 -255 123 229 -162 -162 186 178 -172 -63 204 77 -125 -5 119
4808 119 -7 -160 -145 192 64 -209 92 216 -121 -200 106 205 -103 -198 136 135 -127 -63 226 40 -185 -23
4830 -23 163 31 -176 -57 206 -66 -207 -14 180 -80 -195 160 215 -143 -178 204 122 -195 -87 164 67 -197
4852 -197 -23 168 33 -207 19 189 -31 -173 31 232 -84 -190 88 153 -135 -158 173 123 -206 -78 173
4873 173 73 -198 -54 235 59 -177 -37 195 87 -213 106 197 -76 -131 181 181 -97 -171 212 104 -192 -99
4895 -99 216 86 -218 -33 246 15 -133 -20 229 -22 -230 63 237 -97 -217 177 184 -118 -137 183 85 -185
4917 -185 -94 234 46 -149 -43 171 45 -170 3 188 -4 -256 49 179 -174 -219 216 218 -225 -251 248 122
4939A22l02J40K20j28k31Q8K86o6l39J84J86j78k48L71K03n16r2M78L2m44J19
4960a15L34j16l19K35J06j33j10Q4J87j14k04R0L24j37m12L36K32m26j74N66L0
4981B64m82N9M16k61j72K73O6j12j05n4J53K3k15L1L59j25m57L00M43n99j22O41
5003C24j08n33K21L89l17j41K15N8j35l1N7J06J12l78J1L86j25m40L35M55n94
5024a33k19O44j57n36M14K92l70j24L15j30l6R5o3J7J51l14p3N79j14n99L75M19
5046D33p24o5Q02k32o10L92K97m54o8L89p4q6J7j39J14K21l19r8N27j45o89N19
5068HN03p08j60P73k46o64M82M03n06lK57j79j33K31j50J20K87m16k22O68j80
5089A65o38N74M90q99j48Q93k49o16N64K49n65o2L75j78K7K05k81N2K51m01j07
$$ plain form
4939 122 -180 -40 180 52 -179 -91 195 129 -210 -26 160 -18 -266 105 308 -208 -300 178 210 -234 -115
4960 -115 219 103 -216 19 125 -8 -118 -34 153 39 -165 -75 249 112 -300 36 268 -158 -332 234 264
4981 264 -218 -159 257 -4 -176 97 163 51 -54 -108 45 68 -147 -116 243 118 -339 -39 404 -195 -317 324
5003 324 216 -317 -96 293 -24 -165 50 108 -27 -58 -1 105 217 -161 -150 236 111 -329 6 461 -133
5024 -133 -352 292 135 -401 13 305 -65 -189 126 -4 -40 55 -8 9 160 -154 -227 352 238 -361 14 433
5046 433 -291 -356 446 214 -396 -4 293 -161 -229 160 86 0 17 -122 -8 213 -106 -204 323 178 -511 8
5068 8 511 -197 -357 416 170 -494 -12 391 -115 -118 139 -40 -173 58 -92 28 315 -101 -323 345 165
5089 165 -473 101 591 -308 -456 437 188 -428 136 385 -180 -242 133 -45 -18 187 -94 -42 209 -192 -299
5110b99P33j99o99M69M75q09o7Q77k30p31M58L00n28O8M21k23j46J67k15J28L44
5131B94l53j86O09k36p39O63N38p62j65Q66m82o13O24L55n64N3K87k61k3J93k60
5152a62J84K55m83j87P47j00p18N74M16q34j60R02l09n10M48L22n97M4L21j47
5172FL9R9l03J02K88l95o0O47k52o71N15M21p85j9Q17k21o84M60L06m56j4L21
5194A61k09jN3j34J77K13m24n7N54k68m87M77M06p75p4P57k56n57M46L60m77m1
5216a56K53j11oM8j42K21O4m41K3N51k04m64M47L26o84MO63j72n53L34L15m23
5238a07r8K67O7j26Kp5P8J19l02lN25k26n18M56L05n43r0N65j44m80K91L09l03
5261c1j26K36k9p0p7j0K02R1l54O2L82k57l52M27K79n10j47N80j06m70K22L09
$$ plain form
5110 -299 434 235 -464 5 480 -329 -396 481 251 -480 -22 278 -250 -182 239 16 -130 37 -178 -50 294
5131 294 -59 -245 364 128 -611 52 590 -172 -337 529 47 -566 58 413 -151 -98 189 -72 -95 98 -162
5152 -162 22 277 -206 -393 354 254 -464 110 526 -308 -468 434 125 -385 63 385 -212 -168 153 6
5172 6 45 144 -159 -57 231 -164 -224 423 171 -500 15 436 -349 -368 449 228 -456 4 310 -146 -160 161
5194 161 -48 -49 4 -130 47 260 -164 -221 333 65 -422 55 461 -314 -388 369 113 -444 2 362 -115 -156
5216 -156 97 -14 -20 28 -114 107 171 -270 -247 304 100 -364 83 409 -275 -271 392 220 -333 1 316 -107
5238 -107 -205 62 129 3 5 -70 8 127 -175 -178 347 121 -397 59 364 -179 -269 296 152 -328 -37 272 -31
5261 -31 -157 79 50 -20 -97 -107 95 186 -168 -106 276 19 -333 94 373 -137 -284 296 190 -280 -58 251
5283B51k57j26J18J43j16j60R5K09n9l23J85K55k23l06L73K22m70o6N29q6m48
5304b60J39L38j33k91K02J98j38k21J53J72j58j89J66K50k33k36L62J24m04q4
5324b43M30l0l93J37K99j69k46J62K19j36j97J19K43j30k69J93J95k25j70L08
5344I7J04k98r1L48M2m10P1L47j59k48K04K05j17k59J80Q9j14k38K46K30k17j99
5366a87K87J10l59m3L60j0l69P0L56j57l14K03K12j84j33J58K14k53k00K62J58
5387A81k27j56L09L8k99m3L55rl19Q1K75r8k85K03J48r5k19J13K68k29j73J64
5409a7J94k62k06L12J85l14o2L73r9k84O7K72r6k15J15J62q4j50M2K06p1k93J82
5432d3K22k24k26L52J82l82r3L90p9k97J33K84j99j55J43Q0p3j19N7J56p7k77
$$ plain form
5283 251 -6 -132 -14 129 13 -147 -52 157 98 -225 -40 215 -8 -314 59 281 -189 -255 274 188 -260
5304 -260 -121 217 84 -207 -5 193 55 -166 -13 159 1 -188 -22 228 -5 -241 121 245 -159 -243
5324 -243 187 157 -236 -99 200 31 -215 -53 166 30 -167 -48 195 65 -204 -11 184 -41 -211 97
5344 97 201 -97 -188 160 202 -208 -137 210 51 -197 7 212 95 -164 16 105 -9 -247 -1 229 12 -187
5366 -187 100 210 -149 -192 168 158 -211 -141 215 58 -256 -53 159 -25 -158 0 214 -39 -239 23 181
5387 181 -46 -202 107 145 -154 -197 158 149 -170 -89 186 88 -197 6 154 59 -160 -47 221 -8 -181 -17
5409 -17 177 -85 -291 21 206 -108 -170 203 104 -180 -113 159 63 -152 -37 125 41 -109 -67 139 68 -225 -43
5432 -43 179 -45 -271 81 263 -119 -212 178 99 -198 -65 219 20 -135 8 88 15 -104 -47 109 32 -245
5454b45K08K99k96k30L57J28m29K8M55k07l14K11J75j87m0J58k0j3j19MJ89j4
5476I8l06J25L51k84l29M56J90n23j2N29k22l12K48J70k18l9J37r2O3l5p9J65
5498H1J09m45O2M96l12l76N81P1n75P6M89k29k39L17O1k98N8J04k8L1k0j35J80
5521E9R7m10J01N38l43l69M60J79o59J30N84l57l38M21M7l05J38J62k02J62l6
5542E9k41K94J56n03L4N83l56n11O48J77o65J63N45m63l30N53M6l82K30P3k19
5563a09J65K2j97K27J70n70oO44l59l74O71Q3p94J57O26l79k84M97K0m03J77J35
5585A19k61K00J07m16K43K48n47R2O69m15m62O14J06o67K09O14n62k59N23n9k44
5606a48K86L0l19K15L4l82L10K90m82k1N56m20m33P19J35p59K55N87n37k46N37
$$ plain form
5454 -245 -37 262 -34 -264 93 221 -208 -180 275 68 -246 -35 140 -47 -87 71 51 38 -81 -77 112 98
5476 98 -208 -83 268 -16 -345 111 301 -222 -234 295 73 -239 9 179 -39 -78 59 -33 30 -5 -84 81
5498 81 190 -255 -193 303 -9 -385 196 267 -308 -232 257 28 -211 106 167 -131 -73 31 3 34 14 -121 59
5521 59 156 -254 -153 385 42 -327 133 312 -347 -217 367 10 -328 93 140 -165 -27 135 -67 95 59
5542 59 -182 112 268 -235 -201 382 26 -485 163 340 -325 -162 383 -80 -410 143 189 -193 37 110 -109
5563 -109 56 78 -119 108 278 -292 -298 346 -13 -387 284 367 -427 -270 356 -23 -307 190 210 -193 -16 119
5585 119 -142 58 165 -251 -8 240 -307 -215 454 39 -423 191 297 -370 -161 453 -109 -368 155 96 -148
5606 -148 138 168 -151 64 98 -284 26 316 -166 -187 369 -51 -484 235 370 -389 -134 453 -84 -330 207
5627B07m0l38K85l1l04K97Q1l52K59J82n35L4O72m10m53O88L1o76K03O08m61j87
5649b40M83j37l17K89J7j78J76L5l96K69K69m74L3O40m35m53N53J81o66K42N13
5670D04m84j86M73j05k85K89Jk72K28j0l32L57J69m80J7O02m94k58N57J70p08
5691c47K84L68l69k26M63k8l25K24Qk24K15%j95K46J17m45Q9N11m14l03N13P6
5713B38o01K14M65l14k12L80j04k46J57M7p7N3l1j37K21J24l75J11M02l61k86
5734c32N44j3m25J33L58l05k21L67J2j97O0R3j29O7j8p1J30M8k39N7K97k67k06
5757b57M21M7m25J30L04k54j53K13R3k01L6Q1k9L0j03KJ61k1k71J43K94k92j63
5780b14L50Ll56J49K39j55j72J55O2j38L0J16nk1o8n7J41jj45J07J79k70r7L11
$$ plain form
5627 207 167 -171 114 83 -221 76 157 -195 64 246 -289 -255 417 7 -446 242 273 -403 -200 408 -53 -240
5649 -240 243 106 -211 78 95 -83 93 128 -268 1 270 -204 -171 469 34 -419 134 315 -351 -109 404
5670 404 -80 -266 207 102 -183 106 107 -165 63 53 -279 78 247 -233 -216 386 -108 -366 191 361 -347
5691 -347 -63 305 -64 -290 173 145 -180 44 52 -172 43 43 -152 94 211 -234 -145 366 -48 -351 162 238
5713 238 -363 -149 316 2 -210 170 66 -180 -23 24 -53 0 -31 -168 53 177 -198 -87 315 -46 -332
5734 -332 212 199 -226 -93 265 -40 -261 106 118 -79 -19 74 -55 12 -6 -77 53 101 -138 -81 216 -51 -257
5757 -257 164 211 -214 -84 220 -34 -187 26 119 -82 -46 35 6 36 -67 -65 96 75 -196 -53 241 -51 -214
5780 -214 136 139 -217 -68 171 16 -156 -1 61 -77 -47 69 64 43 -25 -82 59 58 -87 20 199 -71 -168 143
5804A43j7l18R6K21j27j41J39J21j37p7J06K2jj17R1J20r3j05R3J42j66j69K04
5827C0Q3k17M1J92rk88J27J86r1k09J73O6j21l5K5J70j51n3J56Mj10j05K33k4
5851G3j90P1J53q6j69J56N8r6p5R6R1j29j3R1O9j50q3J16J31j49r1K00Q2k70Q
5876a06J76oj67J18Q4o8j57J09J38j11r0P9L0p1k9P7Q9j21r2K30l0k03J01Q1m0
5901B1j60J24L2L9j26O7N7m7p8P3R4k20N2J41L6j87K1J48lj78J5K08j36j04J33
5926B2Q7r0o9R2M6j17q1J54J4p6j34J66J21j70j01J96qj65O0J31q5j48K08k7m0
5951a4p3P9M5n3Oo5J63j20m1Q7J43k20o8K41l5k57K07J10j80p1J57j1j03L6j6
5976e3O9J0Po5J27o6j01M2J88k39q6L36j34k27J80J69k45J1J60j02j9Q8m5l3Q1
$$ plain form
5804 143 126 -192 -96 125 -2 -143 -4 117 -20 -97 9 31 30 -87 4 124 31 -74 19 161 -5 -174 30
5827 30 113 -104 -63 129 120 -168 -41 145 54 -155 18 84 -37 -72 -47 123 -28 -81 75 79 -31 -136 97 73
5851 73 -117 -46 107 21 -148 8 66 -30 -105 -9 82 -47 -60 31 100 -50 -133 -17 114 -35 -126 74 156 -114 -106
5876 -106 70 64 -103 15 99 31 -126 -17 121 10 -80 -1 29 -42 -71 6 95 -26 -118 112 82 -121 -20 61 21
5901 21 -139 -15 17 56 -70 -3 54 7 -71 2 96 -124 -72 69 105 -82 -61 87 84 -94 -79 129 -7 -111 22
5926 22 109 19 -50 42 88 -29 -110 44 58 -18 -152 14 135 -35 -136 60 52 -113 -53 78 -7 -155 53 26 -14
5951 -14 -87 -8 37 -16 -10 -75 88 -32 -73 14 157 -63 -131 110 75 -182 25 135 -45 -116 41 30 -73 -37 -53
5976 -53 16 26 33 -32 95 29 -72 -30 158 -81 -167 169 35 -192 -12 157 -88 -77 83 -19 -38 50 5 -28 53
6001E3jj06P4Nj18Q7J41j91p3K78m2k94K01J66k98K2J79q9j00J50o0o3Q4k5j17
6026a37K05J7k47J30K35k89j22L74j17j92K54P3l05L5K03j30r2J74p9r5K01m3
6048E3j16J46Pk69J75K47l47q1M45j99l54L07J61k77Q3K27k09j46K50j34r0K43
6070A22j23j24J80j2k16K02K42l68j03L76j59k84L34J91m08R5K48k75J9K19j87
6091c1j11K56j24j50K53Q1l69K47J47l18r2M32j86k55K77J54l61O9K86k41o8K19
6113A15j21j34K35j05j03K27j5l16J94K89l54q4M70k30k93L25Q9k95J06J35j62
6134b7p6J97j40o2K91j44k32K85j5k49K27J49l33j3L63j34k94K93O9l41J72K00
6156A86k59L0J93j87k3J65j03j42L18o0k53J70J62l42J0L98k19k68L33O8l04O4
$$ plain form
6001 53 52 -54 20 25 -93 -6 135 -56 -129 149 107 -187 14 180 -118 -96 83 -6 -106 44 -16 -79 5 -20 -137
6026 -137 68 85 -162 -32 203 -86 -208 166 49 -143 111 184 -121 -86 117 -13 -105 69 -10 -105 96 53
6048 53 -63 83 90 -179 -4 243 -104 -185 260 61 -293 14 175 -102 -19 208 -1 -147 103 -31 -121 122
6070 122 -1 -125 55 43 -173 29 271 -97 -200 176 17 -267 67 258 -150 -55 193 -82 -63 156 -31
6091 -31 -142 114 -10 -160 93 174 -195 52 199 -119 -211 221 35 -220 57 211 -150 -81 205 -36 -104 115
6113 115 -6 -140 95 -10 -113 114 99 -217 -23 266 -88 -172 298 68 -225 100 189 -106 0 135 -27
6134 -27 -103 94 -46 -108 183 39 -193 92 77 -172 55 204 -129 -142 221 87 -207 86 155 -186 -14 186
6156 186 -73 -43 150 -37 -60 105 2 -140 178 118 -135 35 197 -145 -135 263 44 -224 109 177 -127 -63
6178f3J70j38l3J32r3o3J63m6j61K27k2k27K09R9k67k5L14j95j27K03M9j75M1
6201b8J31j76O5N5j21Q2J04j47l9J63k0j90J64J50k57p7L26j48k03K34K7k32R6
6224d1Q3l6j0J12r7o4J63j37o2K15m4j96J83P6k79R1J92j67j25K49k2j83N4J56
6248A11j12rjJ9pL0j29J04P4k6j45J39O9j97N8J11n4k23K86Qj61L1N0Lk7qO5n5
6276Dl6k4J1J50p7j14J14R4k29N9J37n1j80J34N6j04MN9O7j35N1L4L1k3k8O7N7
6303A28j39m0J33Oj71L7J28o1o5NJ17j03qR8l0n5k7J01Kn4l5O4Mq3j6J22no9n6
6332g2J99p1j01P9j4k8n5R0L0o4m7N5J14j23k5M4Q3j49j8J18J0j10k5J42o3o3
6358f4O1J33j33o1O9P9o7o3O0k3ko1J37l1j17M8N7O9j58M1J06l6j29R4J21j62
$$ plain form
6178 -63 107 -31 -64 68 -25 -88 75 29 -132 95 73 -154 55 154 -113 -138 176 -19 -146 57 106 -69 -28
6201 -28 103 -73 -8 47 -74 8 112 -35 -74 89 69 -121 43 193 -64 -141 185 37 -166 68 95 -137 -41
6224 -41 42 6 -4 108 11 -53 110 -27 -89 126 82 -114 69 145 -134 -43 149 -18 -143 106 84 -99 -45 111
6248 111 -1 -10 -11 8 1 31 -98 6 80 54 -91 48 117 -80 -22 89 35 -188 98 106 -55 -24 26 29 2 -6 59 4
6276 4 -32 -56 -45 105 28 -86 28 122 -107 -48 89 38 -142 -8 48 -56 -52 7 74 -61 -10 24 55 32 4 71 128
6303 128 -11 -51 82 88 -83 -46 82 21 -44 -39 78 -25 -33 65 35 -20 -47 54 56 2 -33 31 35 -48 -64 58 53 -16 -72
6332 -72 127 56 -45 34 20 -8 -63 27 57 -7 -54 1 115 -8 -33 11 94 -55 -73 45 55 -55 -80 62 -1 -64
6358 -64 -3 130 -3 -64 5 84 17 -46 14 -9 -11 -72 65 34 -83 -35 22 91 -67 -26 80 44 -85 9 130 -32
6384c2j11J80Mq2j4J47K3j38o3J41K7j05jO2j8p4JJ61r4j09J32O3j00p4J04N6
6410H6j83Q9N5j1j3m7O4L3j28PJ01K0j61P2J19j05p4Q1J49j68o3J73n9j05J2J05
6436D9J9m0p6L0P3j09j0J46j8j41K1J33p5j30K13m6j18K5R6K6q7n1N3O9j21M4
6462b5N4O4j39k0J51k9j62J18J54j88r6J73Jj58J09M4M2j04k0K8K7Mo4M5J04j15
6488bq0J97o2j74R5J48j34j03K25j7j46L0P9l9k5K5NJ5j9q7N3J54j70p1K35p5
6514E7k63K09J78k44o6J90k7j31J38N7j05j6Q2j20K8O5o7M4R9k05m1K59l8k35
6538a52J37K10k45o0J94l8j34R6P0j56N4N2r1P4K9j70M2K24j98j07K99l8k89J56
6562d1K21k47m6L18j22k04J75k1j10J37K3j98Q6J08j86LK57k05j04K72m8l40L29
$$ plain form
6384 -32 -143 37 41 -41 -55 92 115 -23 -86 55 82 -23 -24 38 20 -54 -53 108 14 -95 37 100 0 -74 30 86
6410 86 -97 -8 47 36 23 -24 40 73 -55 -48 53 73 -88 -16 103 -2 -76 5 154 -14 -77 96 37 -68 -56 49
6436 49 68 28 -48 -18 55 -54 -64 82 64 -77 -56 77 2 -128 85 39 -79 -54 42 68 -19 -70 -17 52 -69 -25
6462 -25 29 93 -46 -66 85 56 -106 12 166 -22 -118 55 56 -102 7 51 93 -11 -31 -3 24 28 -36 9 113 -2
6488 -2 -82 115 53 -121 -26 122 -12 -115 110 93 -53 -23 56 17 -8 17 22 37 18 -69 -16 138 -32 -103 132 57
6514 57 -206 3 181 -63 -129 61 34 -97 41 98 -7 -23 59 -61 -33 32 -35 9 108 -97 -138 121 83 -152
6538 -152 -15 195 -50 -110 84 46 -88 8 78 -78 -24 28 -63 11 40 -130 -88 136 -62 -169 130 92 -197 -41
6562 -41 180 -67 -113 205 83 -121 54 33 -77 60 83 -115 -29 79 -107 -104 153 -52 -156 116 68 -272 57
6585E7J20k44q3L43j75j98K87k9j70J40L8j94J29J40k42K9J80k28l4K79p7l29
6607b61L39J58l39m0L45j82j89K84Mk04J35L3j70J19R7k57P5K15k55j20L86p0
6629A03l36K78J60l07k7L15j82j65K32%k22K03M9j85N9J35k42P3L12k93j43L23
6651A40n1k89K50N5k78J73K01k40j25K74j15q8J27J2j90J92Q6k83J19J82j75j06
6673a29K98j37k39K47J34l05PL11k01p8J99m8j77J70K0j45J09P7k22K4K27k02
6695f0n0K58q3k40K22J31l13L1K54j85r1K31r8j12J53ok03J99J7k29J49K00k57
6718h2q5K87o0k21K31R7l10O5K08j31j14K11q6p8J16m1r7J18N0j83Q9J82k18l3
6742h5K20j00k06K03N2k04P5R7n3p3Q7L4j25R4K7j39J24N3j84J62O3j48l2J91
$$ plain form
6585 57 177 -67 -150 193 18 -180 107 78 -92 48 86 -108 21 161 -81 -52 128 -100 -134 145 68 -261
6607 -261 78 236 -103 -143 202 20 -169 115 119 -85 50 83 -87 32 129 -128 -53 162 -93 -213 173 103
6629 103 -233 45 205 -102 -129 186 4 -161 71 71 -151 52 101 -84 -25 110 -132 -59 253 -40 -183 140
6651 140 89 -200 50 105 -173 0 201 -39 -164 110 -5 -93 34 46 -144 48 134 -149 -30 152 -23 -129
6673 -129 169 32 -207 40 174 -131 -124 187 -14 -92 107 59 -118 52 72 -73 36 113 -109 -85 142 -60
6695 -60 -110 148 65 -175 47 178 -135 -104 150 -35 -126 105 7 -105 48 42 -161 38 55 -174 -25 175 -82
6718 -82 -167 120 60 -161 70 167 -143 -78 130 -1 -115 96 10 -68 48 7 -90 28 78 -105 -16 166 -52 -85
6742 -85 135 35 -171 32 84 -120 -45 52 -1 -74 13 47 -78 16 43 -96 28 81 -103 59 122 -26 -58 133
6766A33j36r9J13J44k08nJ54j25l3Q8j7j6QK0q7J11k2p1M8M2j00j1J73j49NO7
6792B7O0j08l6J13o2o2J16mo0L3L6o1L9j8q1N1N9q3l0J01m4q7J07J08j17k5P5
6819D7p0L1l4K0K2lj9L2l3K8j23J46J9j30P5O5m2n7J2P7q4m1J21o0nj3J1pM1J5
6849D1p0Q3m4J9k3rj4l6Q2n8K2K8K3k7m8R6k2m3M2p1J7jM8%n0Jk4O6L3q3M9J5
6881D2l6k9M9L1k1p8P5k9jm1O9J4k8ll9K4On4O1O6m8o2P9k4o1RR0q5jL6L1p8O4
6914B8J7n3Nl3K0K1l1nL2N4r2k5J29p0r3R4M7p3NL5k4m7Q8J4k9j8k2j0O3Om6O0
6946D7Pq6K2J2jl3M1Mj0j5N3mn3N2n0K4m1J6J2N7p3J6mL9o1lR9jj45P1L8o2m1
6979g3J05Nr9O9k8pM6J3j8L1n3r5R9N1p8OQ1l5p1J08n7n5M8n8N0O2p3L4jK6k1
$$ plain form
6766 133 -3 -102 11 155 -53 -58 96 -29 -62 26 9 -7 1 21 -66 45 23 -48 0 42 -58 -69 104 -45 -40 27
6792 27 87 -21 -57 56 -6 -68 48 44 -16 17 53 -8 31 13 -68 -17 42 -41 -71 30 -14 -101 6 114 -3 -28 47
6819 47 -23 8 -26 -6 16 13 -6 26 -7 21 -102 44 63 -67 8 73 31 -26 -14 63 -21 -62 59 -1 -6 -19 -8 -15 26 41
6849 41 -29 54 10 29 6 -3 -17 -53 29 -29 -7 21 44 17 -31 65 43 0 42 -29 -12 -13 35 35 -15 -14 -38 28 61 -22 27 42
6881 42 6 -23 26 57 36 -42 33 4 3 -38 31 45 17 14 -25 -1 5 -49 12 78 30 -32 47 23 -38 -29 61 -24 -25 11 42 -36 28
6914 28 45 -8 -3 -36 -16 5 -26 -31 1 55 -37 -62 67 -3 -96 -2 45 -28 -23 12 -12 -59 29 43 14 -4 -26 -36 27 33 -13 47
6946 47 54 -32 -10 2 1 -32 9 13 3 -12 41 37 -16 36 -14 10 -31 -15 -3 54 -19 -3 -7 32 -29 -32 67 66 -79 -8 30 -32 -73
6979 -73 32 37 -62 7 -21 -28 18 31 13 44 -9 -104 -5 46 -32 -26 55 20 -51 57 0 -55 -7 -65 -15 47 -26 8 7 33 12
7010A2n2Q2k4r3M0J05r4K8N9m9q0J5J42j31j3O1m4N8J9m3K2J6j7p8J45k9j71R6
7038a8J38j77K3J38r3o2Q6jj30J08j3j4l7O1p3O0N7j9q1R5j5j22M5O8m3q2J66
7065F5j7r9P0P1j70R9O4j28N2K3l2j8N8k8n5Q1j2r5N5J17j78Q5M5n8n9J50j2j39
7093f5Q7O5j99M7J14k5k8R8j00n0Q6jr2N3R6j21j4J05L4j35M6M8j24N7J2l0jJ10
7121G3q6l4Q9m7n1J05K0j53O0Q9j13lJ31p2j28J50K7o2m1O9o2K2J5J9l1Q6j37
7148f5n1J11L3j54R2J06p6p4J42m2l7O7k2j10K4J45j23K3Q9q1m6O4j9pR2k4r3
7175c6J4J12o4j27J54j0r4L5P7n4m4O8n8M9m6nm2N4lk5R1N7j79Q7Lk0p1J50j6
7204E7j00O9j3lm8Q5q8m0J38l3j7N4o0l5N5K3n0lL5r4j5O5J4n8M4N0l5n7N1pM2
$$ plain form
7010 12 -40 42 18 -75 -35 70 -24 4 63 14 -66 -51 91 -40 -53 8 -36 22 41 -2 20 36 19 -59 86 57 -114 -18
7038 -18 120 -57 -34 104 11 -51 35 34 -96 12 -1 -15 -52 9 -64 -4 53 34 -47 48 33 -89 -44 24 -19 -101 65
7065 65 48 -51 19 90 -80 19 83 -45 7 30 -2 -20 38 10 -45 36 24 -71 -16 101 -77 8 53 -5 -64 86 74 -65
7093 -65 22 87 -112 -65 49 24 -4 94 -6 -56 30 29 -63 -10 86 -35 -49 56 90 -45 1 49 -75 -18 -6 -36 -37 73
7121 73 -13 -47 42 -5 -56 49 69 -84 -24 65 -48 -51 80 8 -120 30 57 -5 -46 23 -39 -17 -2 17 -14 72 -65
7148 -65 -116 -5 28 -126 -34 72 -4 -78 64 22 -15 52 30 -80 -56 89 -34 -11 78 -3 -49 15 -4 -11 81 57 -36
7175 -36 -22 90 26 -101 53 43 -51 -16 61 7 -37 31 -27 22 -24 -29 -71 -17 -20 -45 46 103 -76 11 14 -6 -77 73 57
7204 57 -43 26 13 10 -38 47 -41 -81 57 24 7 61 1 -34 21 44 -6 -9 26 -68 -83 -18 -4 -62 -18 32 -3 -60 -9 -16 26
7235B6%k5K0m7l0L3M5K7q6N9L4j10o0J77mj01M0N3l0l6M0k8m4J8k4L0N0l9l8O5
7265A5M4r3L2O1j0j01O1k2o8J14J4k0Nl4j3k5R8j9qpn4LJ08o2p1J3O3n0l5J5R2
7296D6o3k7J15m5j8M1k1o0J6K3m1K8Pl0J27q9J9k5O6r6kO2k1n3k6P6m8j1M7M3
7326D0o0J9K1O0m3k5l0J16m2m3j1M6r6L7K2L0m3KQrnJ8N0m8l0J2Jo6K1L4J6m1
7358c9j8P0Jo7l0J04%k6m1P2j3n6L4K5n0J9Q7m8o6LN7n1N5n1N6k2k9L7L0J2or6
7390d7J02n3k7K4O1K0p2p1J28k2n5RL0K5j77J09k2K2k5pP6n2pL1n4l0J20K4J9
7419G9p7l5M5o3M7L9L9n7p6J01J3p7K7k0P3n2n2K1J4k6k0M6Kj3O2m9rm7J29k9
7449C5p0Pj2N3n9n3J28j7m2N0M0r3l6O1P7q5j9K2L3jRl3oP2p7nP3p4j5J02o6m1
$$ plain form
7235 26 26 1 21 -26 -56 -23 22 49 -37 22 56 -54 -114 63 59 -42 -2 51 21 -15 25 -3 -47 -29 -53 -23 27 -12 -50 15
7265 15 59 -34 -2 59 49 -52 9 -13 -81 33 47 27 32 -2 -15 -40 58 39 31 24 -30 -27 81 19 -52 -39 24 -26 -61 -46 46
7296 46 -17 -44 71 26 8 49 28 -32 -16 7 -34 -6 1 -29 98 9 28 3 69 -27 -29 33 12 -41 -67 9 -39 -50 -3 40
7326 40 -20 -1 20 80 37 12 -18 98 56 13 2 48 -48 -11 11 41 -2 0 8 -1 -6 12 62 14 -16 -4 -3 -69 -48 -14 2 -39
7358 -39 -57 13 14 -53 -83 21 21 -5 -46 26 13 -43 -9 16 -34 -15 72 24 -42 -39 18 -33 22 -29 27 5 -24 13 43 55 49 -47
7390 -47 55 2 -25 -1 60 80 8 -63 65 43 -12 -3 27 52 -125 -16 -38 -16 -41 -48 28 -24 -31 0 -54 -84 36 60 79
7419 79 2 -33 12 -51 -4 35 74 17 -59 42 55 -22 5 -15 58 6 -46 -25 -11 -37 -57 -11 -9 -22 40 -9 -18 -65 64 35
7449 35 -35 -28 -40 13 -46 -99 29 12 -30 20 60 -33 -69 -8 69 -16 -35 -13 20 19 28 -5 -11 61 -16 -21 52 -22 -37 65 -1 -42
7481d2k4J47q6j08J19Ko5N5J5K6lo3PK0K3o5L8J23m9j38J36rj42M9J15j37RN8
7509A1k6l6J8J04j00KM5J4r6R6j18N8R3q1m1O5O9j04K2Q7j26j7J58q3r7L9N4n0
7537d0P5K1j03KQ7j35J5J37m3r5J09J4j64J06O4j4j20K02r5j00R5J9j04R8K9j63
7563a03J42J3j13K5J22q1j33J95l8j74J31K15k37l5J95j03j25J45L2j38J03Qj12
7586f6O9R6k15Q4J60j42j24K61n4j73J08J35j95J0J94j47j18J50j0j54J40J02
7608A11j98N1P6j18LJ86j12j52J91P5k86K07J30k17l1J54p5j22K02o9j28J30M0
7631D8j42Q4R6j30o5K68k14o4K63l9k77J90J02k22N2J92j48r2K44r6j58P0O8j76
7655a46J54J04j98L8K10j53j58K34J9k34J76O6k19M5J66j22p2J67Qj59J36ok07
$$ plain form
7481 -42 -66 81 -5 -113 6 8 -57 -2 13 39 36 -27 -20 0 23 -42 -4 119 70 -68 68 59 -83 -34 81 -56 -47 11
7509 11 -15 -51 -33 71 -29 -27 18 32 -64 32 -86 -28 65 -16 -57 8 77 -27 -5 82 -44 -61 97 14 -83 -44 10 -40
7537 -40 35 56 -47 -45 42 -93 -78 59 16 -79 30 44 -120 -14 50 36 -84 118 23 -77 18 37 -67 31 60 -103
7563 -103 39 52 -61 -36 86 5 -128 67 29 -145 -14 201 -36 -71 124 21 -104 41 73 -65 38 46 -66
7586 -66 3 99 -116 -32 128 -14 -138 123 69 -104 4 139 -56 -46 148 1 -117 33 23 -131 9 111
7608 111 -87 -36 40 -78 -75 111 -1 -153 38 113 -173 34 164 -53 -84 70 -5 -127 75 6 -122 8 48
7631 48 -94 -10 86 -44 -109 159 -55 -119 144 105 -172 18 120 -102 -50 142 -6 -98 146 50 -108 -38 30 -146
7655 -146 8 112 -86 -48 162 9 -149 85 104 -130 46 112 -107 -62 104 -18 -90 77 85 -74 62 56 -151
7678a51J50J08j97N1J66j59n7K13o5j66J19J55k42L5J64j52j02K14j13j11K17
7699G7o3j52J52Q1k37N9J54q6j42K53k8k39K08M9j58N4J45j70m0J47k5r8J52j1
7723H2j66J51J03k71L6K00j81n0J78k3j95J58N4j24N9M6m6q1J37j27m0J58k2j60
7747a24J00J10k08J23J53j92n6J28L5j92J21J36j96j7K07j95R9M0J2j31R1q8p0
7770a14J27Q2k03R2Q9j26JJ14%j40J47l2p5L8P3m2k8Nk1l9J16j16j4J21o2o0P1
7797Dom9O7L9p2m8P8J1q2O2O2j02j8J28r0j6Q2m0j02J44K0q2L8j4noL5L1j21O8
7827A6P1j50NJ08n5k5M3o9L4O5k3o6M6L4r6J05Oj04kJ41n5o3N1M8m8j2J3rmm3
7857c8M0k9N3j4q1J04J5o4K1J6m8nL0N4j74J22k6rP9o0K2l6J7n2O7j1M8j4kj1
$$ plain form
7678 -151 -1 107 -90 -39 127 -32 -89 124 59 -107 12 167 -75 -40 124 -28 -130 84 -29 -140 77
7699 77 14 -138 14 95 -142 -83 71 -15 -157 96 68 -171 37 86 -72 -18 127 -43 -83 64 39 -59 93 82
7723 82 -84 67 170 -101 -65 135 -46 -96 82 59 -136 22 76 -48 11 57 11 -70 67 -60 -100 58 36 -124
7747 -124 -24 86 -122 1 154 -38 -94 34 69 -123 -2 134 -62 -79 128 -67 32 72 84 -47 44 -44 -114
7770 -114 13 95 -108 -16 73 -53 -52 62 62 -78 69 37 -38 0 73 31 3 8 -13 -52 64 -52 -66 55 -7 -67 4
7797 4 -2 -51 16 55 -17 -65 13 24 -58 4 66 -36 -54 74 -16 -32 50 10 -92 52 72 -10 28 14 9 3 38 69 -52 16
7827 16 87 -63 -58 50 -5 -30 13 -56 -22 43 20 -46 0 34 -62 43 49 -55 -57 84 29 -34 17 65 17 5 18 9 5 -38
7857 -38 2 -27 26 12 -69 35 50 -14 7 23 -25 -30 0 54 -120 2 -24 -33 46 -14 8 -28 -11 -63 4 -7 41 27 25 14
7887A4k0nM0l4j4M4K6q3R8m1q1K5P1M1r0k3Q2k3r2Q2OPo0m2O5O6n0p4J35j13K7
7918a6j2M4k6k6k6Q8ol7L6k3K1m0Qm5Q4n0K1K6q0L8R8k5m4m0L9nm1j5M4l2M0m
7950fj1O0n1RJ7K7n2J0kLMK9m6l3K7Q0n0k1l3N0l0L1n0K6K1l8MM1M4m7J3k2l6
7983c2k9J14n7n4J19Lq3oNj3N5L0n3m3Q5l4l4R5m6m9K2M4r8j7J30o3m7P1k9k3
8013c7Q6Qr8J6M1j4n3O8m9QM2J9j48J29O6j34nJ15l6j07R2l9m8L5M3n0k2J42j00
8042c0kR1r7j0J14r1m9Q7P1j35k2J70o7j49J54qj05J18K0n3o1P0k5l1J25m5m4
8069dP9p6m5O6N4k00J17J15o5j21J65n7j00O1M8m5k0N2p7m3J25j7j30J40j4n3
8095d5L9M1j24R9Rk8m1J24m1j18J05N5j36N5K0m8m1R1Jm8N2K6r6K6J02j26J1J34
$$ plain form
7887 14 -6 -11 29 -5 -19 25 51 -32 66 25 -56 -31 40 81 -9 -32 50 27 -65 17 23 30 -30 -72 -7 59 9 -65 70 -43 -16
7918 -16 -28 16 -10 -36 -62 26 20 -17 19 -4 17 -23 -15 -60 24 -26 -5 21 -59 -21 77 52 8 -32 7 2 -39 -54 -10 -42 -2 -6
7950 -6 -17 43 -8 1 18 45 -7 3 1 4 8 37 -9 -42 -15 65 15 -6 -39 11 -19 12 -38 -12 9 -29 -25 16 60 13 26 4 -32
7983 -32 -61 53 -4 -58 61 64 -19 -25 -20 -33 22 52 -1 -44 41 7 -27 68 22 -27 -5 39 -59 -76 54 -9 -56 15 -14 -37
8013 -37 49 57 -41 -25 16 2 -51 17 -32 -24 18 37 -111 18 84 -50 -55 60 24 -83 9 -30 -78 -43 0 -50 -72 70 -30
8042 -30 -32 59 -38 -48 66 -25 -74 13 84 -51 -73 97 30 -119 35 27 -78 40 60 7 -54 16 -9 -40 85 40 -4
8069 -4 75 -1 -46 20 74 -126 -9 106 41 -80 85 28 -72 -11 37 -8 -28 24 -53 -96 29 12 -118 22 8 -45
8095 -45 -6 35 -89 10 19 -9 -50 74 33 -85 20 75 -61 -6 14 -34 -75 16 17 -31 21 47 -49 -23 79 -47 -36 98
8123I8j54k9J58k8j43Q1J00j49O6O5j30J3P7q1K7P6Qj23J41O5k44J12M1j5r9J43
8149G6K6j84J28K5j59J38K5r0o3J10l7r0J24M1j49J00O7j65M4J63j38l9J07q4
8173b4m3N1J02j41R3j9k5o2J29l0j32J51r3n9Q1J01j75N8
$$ plain form
8123 98 -56 -85 73 45 -98 -17 83 -66 0 65 -65 -52 25 -56 -29 47 55 -68 73 138 -106 6 47 32 -67 76
8149 76 102 -82 46 71 -88 50 75 -15 -78 32 -5 -95 29 70 -79 21 88 -77 -33 130 -8 -47 60 -24
8173 -24 -67 -16 86 -55 38 19 -6 -68 61 31 -101 50 -43 -102 -21 80 -95 -37
8191c7
$$ Imaginary data points
##PAGE= N=2
##DATA TABLE= (X++(I..I)), XYDATA
0@%%%%%%%%%%%Qj6J6j6J6k4L2l3M1n1N9p2Q8j04J20j37J61j86K12k44K78l18L59
34A89m03M57n14N74o44P21q03Q94r91J097j213J339j478J629j797J983k184K404
52A260k650K924l229L572l960M406m924N530o253P135q234R651j1557J4269j8459
67a0519K5827m2456J44153k1333k83265J98155O3337j80242N2932K06318r4889
78E8018j22089J5260J1811L2248O4449o0954O570P4973j39248j12288K37526Q8255
90A54531k29513K4469J85513j78390j43754K43758R7281j92485k697R4853q8427
101c4861m3614R5659L3839L1k6112j03690J8707J23396o4071n9971J62954j4121
113H8146k39037O1289K11782j06410j01103J66180n14j94846L5925J42654l0211
$$ plain form
0 0 0 0 0 0 0 0 0 0 0 0 0 8 -8 8 -8 8 -16 16 -17 24 -27 32 -40 48 -56 64 -73 88 -98 114 -130 148 -170 189
34 189 -214 243 -271 303 -341 380 -423 471 -520 577 -636 703 -775 854 -943 1040 -1144 1260
52 1260 -1390 1534 -1695 1877 -2083 2323 -2601 2929 -3324 3811 -4423 5228 -6329 7940 -10519
67 -10519 15308 -27148 117005 95672 -187593 10562 73899 -106343 -53411 152907 58018
78 58018 -64071 -48811 -37000 -4752 59697 -1257 5313 80286 -58962 -171250 66276 154531
90 154531 -74982 -50513 135000 -43390 -187144 56614 153895 -38590 -41287 53566 -34861
101 -34861 -78475 17184 51023 51054 24942 -78748 -60041 63355 -716 -60687 102267 88146
113 88146 -150891 -89602 122180 15770 -85333 80847 80333 -114513 -78588 64066 33855
124C3855l8380K6985k6454j8123M067k3943O6277P9249j17223q3270J32863Q698
136D4601j39754R3061J42766j48907j10759J40695L0899j09801M9404Q7562p0264
147I503o4353K7104K6639K5794m71m2583K3484K9635q8200j2601J40576p297j37351
160g0121M9592R1740j06875m4988J39367J6023j18185P794O4105l2022k5083L6899
172H246K2069q898l8467l0521N2365M0723o6558r580Q8033l7522j04223P0184
184a4149R1230q3578m6425Q9288j469q8443K3997P2329j9118m1787P229J8983
196H087p25k3382k920M9186O559p2202r14P6348k3552o6401N7161N1947p9488
209b0296l5035P8380J2139o2718J0691M7953k1050m0222J4129L6372m08l4578
$$ plain form
124 33855 -4525 22460 -3994 -22117 -18050 -41993 24284 103533 -13690 -96960 35903 44601
136 44601 -95153 -2092 140674 -8233 -118992 21703 52602 -57199 -7795 79767 9503
147 9503 -54850 -27746 -1107 24687 24216 -18367 5117 34752 -53448 -66049 74527 67230 -70121
160 -70121 -20529 71211 -35664 -80652 58715 74738 -43447 -35653 28452 -3570 -28653 8246
172 8246 30315 21417 -17050 -47571 4794 45517 -21041 -30621 57412 19890 -84333 -14149
184 -14149 77081 -6497 -52922 36366 34897 -53546 -29549 42780 23662 -18125 -10896 8087
196 8087 7362 -16020 -18940 30246 36805 -35397 -36311 40037 16485 -49916 7245 59192 -20296
209 -20296 -55331 23049 35188 -27530 -16839 31114 10064 -30158 -16029 20343 19935 -14643
221a4643m037L9474m665n0809K0125N9910l4398n5896M7147L8868n8169j8387
233c5480O3186L424n8689M803M6345r473l5749J1291L2764j0821l6588R454M0951
246B5418j2323m2083K1842M0107l4575l5202M4606K6950m8287j4871M7503L002
258B2087m4399N373M0651q833l6427R906L3180j1650l2160J5068L2490k0041l2529
271b7284K5470K9409l1246k3700L6133J6344l9246r139L9547K561l7808L301L5524
284A9866p837l3192J1609L1440j4691k9502J8462K7240k2179k4169K5999K0327
296B3373k9167j5789L1203J0635l2311n653L2361N91l1832L767L0392q053k8800
309a9283J1819K6676j5331k4119J8549K1148k1192j7652K3542J4118k4925j0294
$$ plain form
221 -14643 -18680 20794 16129 -34680 -14555 45355 10957 -44939 2208 41076 -17093 -35480
233 -35480 27706 31130 -27559 -22756 23589 14116 -21633 -10342 22422 11601 -24987 -15533 25418
246 25418 13095 -28988 -7146 32961 -1614 -36816 7790 34740 -13547 -28418 19085 22087
258 22087 -22312 -16939 23712 14879 -21548 -11642 21538 9888 -22272 -7204 25286 5245 -27284
271 -27284 -1814 27595 -3651 -27351 8782 25126 -14120 -23259 16288 18849 -18959 -15658 19866
284 19866 12029 -21163 -9554 21886 7195 -22307 -3845 23395 1216 -22953 3046 23373
296 23373 -5794 -21583 9620 20255 -12056 -17709 14652 15243 -16589 -12822 17570 9517 -19283
309 -19283 -7464 19212 3881 -20238 -1689 19459 -1733 -19385 4157 18275 -6650 -16944
321a6944K6133O644k6547k768K6622r31k6114M544K5148q231k3635J1313K1647
334A6881j4295j9518J6647J6840j8931j4195K0635J1119k2090p889K3043M336
346A2583k3285o07K2982k703k1890N918K0453q182j8494J0196J6762j1755j5183
359a3205J3587J3665j5208j2268J7039R666j8862o478K0096K595k0539Q17J9453
372A0358m122j7306O564J4867q114j3095Q549J2218q413j1519R183J1173j1224
385h81j0458J4321R340j6738o406J8019J932j8029K852J6839o100j4523P171J0904
399H243p011q238O573P372o381r003O405J0577p554j0453J0636Q329j4828n146
413a0479J7586J671j6756K835J3437o817r714Q746P251o937n673L663M701j934
$$ plain form
321 -16944 9189 15833 -10714 -13482 13140 12209 -13905 -9361 15787 7556 -16079 -4766 16881
334 16881 2586 -16932 -285 16555 -2376 -16571 4064 15183 -6907 -14796 8247 12583
346 12583 -10702 -11309 11673 8970 -12920 -7002 13451 5269 -13225 -3029 13733 1978 -13205
359 -13205 382 14047 -1161 -13429 3610 13276 -5586 -12064 8032 10627 -9912 -9095 10358
372 10358 6236 -11070 -4506 10361 2247 -10848 -2299 9919 1506 -10013 -830 10343 -881
385 -881 -11339 2982 12322 -4416 -10822 7197 9129 -8900 -6048 10791 4691 -9832 -2661 8243
399 8243 1232 -7006 -433 6939 558 -8445 -2040 8537 983 -9470 1166 9495 -5333 -10479
413 -10479 7107 8778 -7978 -5143 8294 1477 -8237 509 7760 823 -4850 -1187 3514 1580
427A580n374L110P929o118j0528Q760R715j1341n263J3716m92j4988M206J2828
441G740n775p583O377K793o031j371M109L428o52n818q00P178j806p758P309Q276
457I616j1630o705J2331J758j1042M390R192p735p020O349L145k985L23O42n75
472E4p2l435j13P973J0r270K743P186p608m137J1701J821j1104J037P138m566
488f42l035O399J386m271j170m37P18L365j389k563M290n65q267K885R202m595
504A311o110O997J115r096J818Q671k429m340K667o0k866J389J520P77K174l271
520B67m611M465L265n673J283P333n276p881O270M894o240J33O100l390n558K789
536a830K762n57Q17p93j697J397j133k604N327L944p093k555O866j987o023O495
$$ plain form
427 1580 -3794 -684 7245 1127 -9401 -641 9074 -2267 -7530 6186 5694 -9294 -5088 7740
441 7740 1965 -5618 759 3552 -2479 -3850 259 3687 3035 -2783 -3583 3595 1789 -5969 1340 9616
457 9616 -2014 -8719 3612 5370 -5672 -1282 7910 175 -6845 -496 2649 -336 -13 629 54
472 54 -18 -3453 -3566 4407 4417 -4853 -2110 5076 -2532 -6669 5032 6853 -4251 -3214 3924 -642
488 -642 -3677 2722 4108 -163 -1333 -1770 -1052 2313 924 -1639 2651 2086 -6181 -3296 5906 1311
504 1311 -4799 2198 3313 -5783 -3965 4706 2277 -2063 604 544 -2322 -933 587 1364 3538 267
520 267 -4344 121 3386 -2287 -1004 6329 1053 -6828 -558 4336 -1904 -1771 4329 939 -4619 -1830
536 -1830 932 375 1192 399 -1298 99 -1034 -3638 1689 5633 -1460 -4015 2851 864 -5159 1336
552A336N735p652l643N588m25l565L635K625k977j953r55M0L885N78l989K284
568E47K430o992j586R672K41q190L216M961p316k447Q566J292n540M93J545k331
584a439K36J773P10K054k013n670K625N493m523j941P817j936j0134L652Q174
599D878m881l159O504r04p137J478M768o6m71n28j719J084l15k725M594M928p074
616g45m471P533K73p625N064P673p616n944O550J688m887K307L819k862k861l87
632b491R22L564J19m220K009L215o699j889R996N70r345K594O305o588l390Q627
648C299J961o838l02K887j278o69J339J045J160k697m396L777M815n214j993P370
664D266j943r034M302P967n407m105O208L07o453J199N128j95k376q24O71J419
$$ plain form
552 1336 7071 -581 -4224 1364 939 -2626 1009 3634 657 -1296 -2251 -2211 1674 2252 -1737 547
568 547 2977 -4015 -5601 4071 4312 -3878 -662 4299 -3017 -5464 3102 4394 -1146 -653 892 -1439
584 -1439 -1203 570 1280 3334 1321 -4349 -1724 3769 -754 -2695 5122 3186 -6948 -3296 4878
599 4878 -3 -3162 3342 2438 -4699 -3221 1547 1481 1010 482 -1237 -153 -468 -3193 1401 6329 -745
616 -745 -5216 2317 2590 -5035 29 7702 86 -5858 692 2380 -2507 -200 3619 757 -2104 -2491
632 -2491 -1569 1995 2114 -2106 -97 3118 -3581 -5470 4526 5096 -4249 -1655 4650 -1938 -5328 3299
648 3299 5260 -1578 -1880 1007 -271 -940 399 1444 2604 -93 -4489 -712 4103 -1111 -3104 4266
664 4266 2323 -6711 -2409 5558 151 -3954 2254 2561 -3892 -2693 2435 2240 -136 -960 -289 1130
680A130j636j918M697K453p085j952P662r35o910M669N723p044m249O634J776
695C015m995O17L572j412l069J5K872J905k756k480L840J380n703M95P376k107
711B565o949L803M937n419k595O299J081n704m20L955mk771K1K738L09l821r54
728b929M753O67n354P54N621k873n334M528M448n046k792N147J062m793M9M421
744B329n1l800j99L436J94l636J90M293q87m955J689M855k827m237L852L142m673
761a285k133M710J190m343m53L994o5l757L26L822m23l869Q62M069j473l981K375
778d34L785l130l209L660K466m018j794M272R10m220m34M099j91m033N46L823
794B098j078l726J559L576k008l409K628L048l045k404L428J951l546j381L801
$$ plain form
680 1130 -506 -2424 2273 4726 -2359 -4311 3351 2416 -4494 175 5898 -1146 -5395 1239 3015
695 3015 -1980 -1363 2209 797 -2272 -2257 615 2520 -236 -2716 1124 2504 -3199 -2704 4672 2565
711 2565 -4384 -581 4356 -1063 -3658 2641 3722 -1982 -2402 1553 1549 -1222 -1201 1537 1846 -1975 -2929
728 -2929 1824 2491 -2863 -2109 3512 639 -4695 -167 4281 -765 -3557 1590 2652 -2141 -2092 2329
744 2329 2278 -1522 -1721 1715 1909 -1727 -1537 2756 1869 -3086 -1397 3458 631 -3606 246 3388 -1285
761 -1285 -3418 1292 2482 -1861 -2314 1680 1615 -2142 -1816 2006 1583 -2286 -1424 2645 1172 -2809 -434
778 -434 3351 221 -2988 672 3138 -880 -2674 1598 2508 -1712 -2146 1953 1762 -2271 -1725 2098
794 2098 1020 -2706 -1147 2429 421 -2988 -360 2688 -357 -2761 667 2618 -928 -2309 1492
809A492Q03l731k77L749k18l747P93L547j315l446J752L057k260k693K467K354
825B327k951j936L112J491l314r81L441M35l345L6L435l91l404J062L233j447
841H03k829J812K658k143k374K459J969k799j548K971J075l190o49L123Q9l101
857a674K60K912o74k855J022K695j325k393J552K341j864k099K388J869k676j332
873a853K992P29k935j43K891l46k710O04K324p16k135P98K025j116k201J210K221
890A639j547k121K084J645k597j169L032N89k968J76K625p82k015J018J905q49
906F65j708O01J659n91j732Q95K032j459k204J909J895k534j121K840M0k886N16
923a183K435q03j671Q17J039p70q82N09J379j26j734J51K081q14j971J884J943
$$ plain form
809 1492 2295 -1436 -1713 2036 1818 -1929 -1136 2411 1096 -2350 -598 2459 199 -2494 -27 2327
825 2327 -624 -2560 552 2043 -1271 -2252 1189 1624 -1721 -1685 1750 1359 -2045 -983 2250 803
841 803 -2026 -214 2444 301 -2073 386 2355 -444 -1992 979 2054 -1136 -1785 1338 1427 -1674
857 -1674 -1414 1498 824 -2031 -1009 1686 361 -2032 -480 1861 -3 -2102 286 2155 -521 -1853
873 -1853 1139 1868 -1067 -1210 1681 1335 -1375 -771 1553 837 -1298 -500 1525 409 -1792 -582 1639
890 1639 92 -2029 55 1700 -897 -2066 966 1555 -1413 -1237 1388 606 -1409 -391 1514 665
906 665 -1043 -442 1217 626 -1106 -211 1821 362 -1842 67 1962 -572 -1693 1147 1187 -1699 -1183
923 -1183 1252 449 -1222 -405 634 -136 -1018 -509 870 744 -990 -839 1242 428 -1543 341 2284
940B284k731j304K827K13k476Q68K004j419j531J044Q61l63m84q4O26r5j486K17
958a029K426o54k505J445J753k374q55L189J31k808N98J716j064p08J310L93o32
975C32o14l87P72R62j302l81J940q38k636J639K494k152j403K488j59k675J013
992i07K277j008j026O22o2l03K26o9Q96P31j915r86K383K49k318J442K185k767
1010c50j901K911P78k386P93J664j672j302J066O20J76K3r75R2R16j437n09K985
1028A492J49l299O37K652k138j323L431O01l301l2J997q81n30J321K14p73n56
1045c39q78Q92J776j201j379K087j99l328J377L700j978k498K560M69l135Q56
1061a218K952p77j565L90O5k03M41l7O74J047k235j703K885R62k925J014L052
$$ plain form
940 2284 -447 -1751 1076 1289 -1187 -319 1685 266 -1265 -221 640 277 -207 -291 335 240 -1246 -1029
958 -1029 1397 743 -1762 -317 1436 -938 -1793 1396 1527 -1281 -683 1033 -31 -739 571 964 332
975 332 -282 -669 103 1065 -237 -618 1322 484 -2152 -513 1981 -171 -1574 914 755 -1920 -907
992 -907 1370 362 -664 -42 -104 -407 -181 -250 646 1377 -538 -1524 859 1108 -1210 232 2417 -350
1010 -350 -2251 660 1438 -948 -155 1509 -163 -1465 -399 221 397 420 -555 -463 453 -984 -1493 1492
1028 1492 1641 -1658 -1021 1631 -507 -1830 1601 2202 -1099 -1131 866 -15 -545 776 990 217 -339
1045 -339 -1217 -325 1451 250 -1129 958 759 -2569 -1192 2508 530 -1968 592 1061 -2074 -1218
1061 -1218 1734 957 -608 -218 -153 -356 85 48 722 1769 -466 -2169 716 1678 -1247 -233 2819
1078B819l158k913L551J807l004K78K260j890j786J389J185K12k16j262lJ275
1094E44j277o96L387L41m305L70L718k063k134L919R57m316k85K899o28j122J402
1111G11L31j068q05n52J240J933j624j701K432n5l751J756M481k621l276L136
1127E67R25l619R18L714j136k492N52P22j53J86j55R09N92k686j251L732P13l694
1145a656J196L233l503k902M419J795l761N8K592j580k045J728J638l15r77r97
1161a077R05J125j701l86L578n65m489J379L935k673k281M076P87m655j1L620
1177A567o18j989J009J005j056j247J28K054Q03k696n90L022p09l458K513L702
1193C440l601k759L795J111l727O46L539j252k812Q37J771l26j200J25J568j81
$$ plain form
1078 2819 -339 -3252 299 2106 -898 -620 1640 -250 -2036 -647 538 750 534 -728 -731 544
1094 544 -733 -1429 1958 2299 -2006 -1636 2082 19 -2115 1804 2761 -1555 -1840 1059 431 -691 711
1111 711 1042 -26 -831 -1383 -143 1790 166 -1535 897 842 -2909 -1153 3328 707 -2569 567
1127 567 1492 -2127 -1209 2505 1369 -1123 -571 151 -2 184 29 938 1530 -1156 -2407 1325 2038 -1656
1145 -1656 -460 2773 -730 -3632 787 2582 -1179 -1121 1471 -109 -2154 -426 1212 897 -80 -1077
1161 -1077 -172 953 -748 -1134 2444 1879 -2610 -1231 2704 31 -2250 1826 2613 -2042 -2053 1567
1177 1567 949 -1040 -31 974 -82 -1329 -1201 853 1656 -1040 -1630 1392 683 -2775 -262 3440
1193 3440 -161 -2920 875 1986 -1741 -1095 2444 1192 -1620 -783 988 662 -538 -413 1155 974
1209I74k808L20L581r09l493K002K793l486j952M245J018l828M0L054r52k312
1225a713J210K176p85k077K45K215k66k328Q14K904j815l188K606K694l275j640
1241b223L653M22l769K50L427o83k742P76K224q54k202R08K456q92k698J260K755
1258B068j963k384K795K087l380j372L503N65l336J82L107o74k913R16K508r20
1274G89k460J042K377j470k392J810K325k265k065K647J710l111r73L328L59l251
1290a600J45L194n51k918R42K781j255k609J565K420j817k280K156K001k594j586
1306b006K695J223k944p96L028K56l023M0L023n42k835R51K722j292k496J662
1322c34K337j931k052K266J730k455j299K628R62k800m89K830J27k907K43K767
$$ plain form
1209 974 -1834 -1514 2067 1158 -2335 -333 2460 -1026 -2978 1267 2285 -1543 -1503 1551 599 -1713
1225 -1713 -503 1673 888 -1189 -944 1271 1005 -1323 -509 2395 580 -2608 -2 2692 -583 -2223
1241 -2223 1430 1852 -1917 -1667 1760 1077 -1665 -889 1335 481 -1721 -813 1643 751 -1947 -687 2068
1258 2068 105 -2279 516 2603 -777 -2149 1354 1919 -1417 -1235 1872 1198 -1715 -799 1709 789
1274 789 -1671 -629 1748 278 -2114 -304 2021 -244 -2309 338 2048 -1063 -2036 1292 1651 -1600
1290 -1600 -1455 1739 1188 -1730 -788 1993 738 -1871 -306 2114 297 -1983 173 2174 -420 -2006
1306 -2006 689 1912 -1032 -1828 1200 1456 -1567 -1527 1496 954 -1881 -930 1792 500 -1996 -334
1322 -334 2003 72 -1980 286 2016 -439 -1738 890 1852 -948 -1437 1393 1520 -1387 -1144 1623
1338A623o69k768J042K621j532k372J732K164k048j842K342J425k409j176K732
1353H65P90k810k84K860q7k772N16K638q62k439J206K187j470j998J611J773j877
1370a53j621K090J411k422j074K589O74k823j77K893l89k647Q63K257j093j893
1386a515J204J785j161j757J374J610j504j503J886J414k323j196K664O41k856
1401a237J16K653p45k533J231J984j324j519J199J163j117j196J115J506j212
1416H4j655J532J599k094j062K800M06l018K95K721r65k011J517J301j497j067
1432a114J111Q67o27q29L15J165q23j635J445J917k080j559K528M57k718O47K742
1449A809j232k148J452J063j227k68J029K60o31p75M3J495l3j741Q63J643k112
$$ plain form
1338 1623 954 -1814 -772 1849 317 -2055 -323 1841 -207 -2049 293 1718 -691 -1867 865
1353 865 1655 -1155 -1439 1421 1334 -1438 -922 1716 854 -1585 -379 1808 338 -1660 -49 1724 -153
1370 -153 -1774 316 1727 -695 -1769 820 1494 -1329 -1506 1387 998 -1649 -786 1471 378 -1515
1386 -1515 -311 1474 313 -1444 -70 1540 36 -1467 419 1833 -490 -1686 978 1619 -1237
1401 -1237 -1121 1532 787 -1746 -515 1469 145 -1374 -175 988 -129 -1325 -210 1296 84
1416 84 -1571 -39 1560 -534 -1596 1204 1610 -1408 -1113 1608 643 -1368 149 1450 -47 -1114
1432 -1114 -3 864 237 -592 -277 888 65 -1570 -125 1792 -288 -1847 681 1138 -1580 -933 1809
1449 1809 577 -1571 -119 944 -283 -551 478 738 107 -668 -625 870 837 -904 -41 1602 -510
1466e10j447K813P73k747L30K179j566j546J911R79j313l52M50k75K79j52j61
1483c55J328j56k195N50K285j319j374K409L49l041L90K514r10j213J309J92j505
1500g42J73N64J04O19n61j106R51M83j651O56K270j508k118J954R47k186O81K137
1518A667j284j579J115N34o32N30K55n73K46m57q73J453J044j899l25J891j210
1535i7j755K218J292k140n00J550p29j009J338O30p51q1k84m16J042J88r89R41
1553D48P91k101m95K453j39j947J277J179k125p20J978J60j151M50K92p82%J03
1571c29K07R31l24j564N98J285j458m05K405j36k661O27J984j168r10J826K88
1588A196j805j47R09J48J9j69j76M63m35j270J021J801j471j401J914K92k573
$$ plain form
1466 -510 -1957 856 1629 -1118 -788 1391 -175 -1721 190 1169 -144 -496 -46 -321 -42 -194 -355
1483 -355 973 817 -1378 -828 1457 138 -1236 1173 1522 -1519 -1129 1385 475 -738 571 763 -742
1500 -742 -569 -5 99 718 157 -949 2 485 -1166 -510 1760 252 -1866 88 1035 -1151 -470 1667
1518 1667 383 -1196 -81 453 -179 351 606 33 279 -178 -1051 402 1446 -453 -778 1113 -97
1535 -97 -1852 366 1658 -482 -982 568 -161 -1170 168 798 47 -34 -318 -734 308 496 -493 448
1553 448 1239 -862 -1357 1096 957 -990 287 1466 -659 -1379 599 759 -392 58 350 -432 -432 -329
1571 -329 -122 809 485 -1079 -481 804 -654 -1059 1346 1210 -1451 -824 1160 -8 -918 908 1196
1588 1196 -609 -756 153 301 320 151 -25 438 3 -1267 -246 1555 84 -1317 597 889 -1684
1605a684O48K802j153k043J414P34j523J1J506J41p60n92o3Q86K04j024O77J443
1623A624j866j751K495J263k636jK660j470k538J890J927j694p47J256j10j057
1639g55m0P44J049l55j755L73J779j242j479K807J128l532n63L288o79k427K004
1656C45J746k414j296J671P05p50k58L96L64o05j436J078K311j592k128K257J088
1673A482l258J22L872q94l357J533K111k084j002K329O55j616q83P87R91l58j253
1690h23J025J603k171k091L041J553l337k52L359j107l401K044K799k131j686
1705a575J849O37j550n24J407J172j102j751J136J930j829j542K998R65l746l19
1721a844L772p67l140J752K430k345j898K228J319j720r72J314R80j466j351J889
$$ plain form
1605 -1684 -1036 1766 613 -1430 -16 718 -805 -794 712 853 93 -499 -562 324 528 -496 181 1624
1623 1624 -242 -1993 502 1765 -871 -872 1788 318 -2220 -330 1597 -97 -844 412 302 -755
1639 -755 -795 -51 998 643 -1112 -739 1040 -202 -1681 1126 2254 -1278 -1841 1447 768 -1659 345
1656 345 2091 -323 -1619 52 757 7 -251 145 509 -96 -1532 -454 1857 265 -1863 394 1482
1673 1482 -1776 -1654 2218 1324 -2033 -500 1611 -473 -1475 854 1509 -107 -990 -203 788 430 -823
1690 -823 202 1805 -366 -2457 584 2137 -1200 -1452 1907 800 -2601 -557 2242 111 -1575
1705 -1575 274 911 -639 -1163 244 1416 314 -1437 -301 1629 -200 -1742 1256 2221 -1525 -1844
1721 -1844 1928 1161 -1979 -227 2203 -142 -2040 188 1507 -213 -1185 129 1109 -357 -1708 181
1737A81J715k370j563K960P95l421K10L747j057l398J669K648k006j899K279J411
1753A901k135j384J903J310j824j361K056J279k701j037L141O37l473J86L401
1768A899j036l101J595K775j948k241K122J809k140j479K201J411k231j448K570
1783G58J188k868p21L066K72l408M18L252r34l116J480K686j920k401K245J953
1799A950k343j695K478J441k616j101K858P85l058m02L223n3l180O00L157j079
1815I65k925J387K745j857k337K051K137k434j838K647J420k830j085K985O68
1830A699l082k73L203k85l102P18K968j055k856J550K670j994k247K205K085k551
1846c47j617K713J292k845r62L066L75l043j29L179l92l164P87L028j290k847
$$ plain form
1737 181 1896 -474 -2037 923 1718 -1703 -1493 2254 1197 -2201 -532 2116 110 -1789 490 1901
1753 1901 -234 -1618 285 1595 -229 -1590 466 1745 -956 -1993 1148 1785 -1688 -1502 1899
1768 1899 863 -2238 -643 2132 184 -2057 65 1874 -266 -1745 456 1867 -364 -1812 758
1783 758 1946 -922 -1643 1423 1695 -1713 -1295 1957 1023 -2093 -613 2073 153 -2248 -3 1950
1799 1950 -393 -2088 390 1831 -785 -1886 972 1757 -1301 -1703 1520 1467 -1713 -1113 2044 965
1815 965 -1960 -573 2172 315 -2022 29 2166 -268 -2106 541 1961 -869 -1954 1031 1699
1830 1699 -1383 -1656 1547 1262 -1840 -1122 1846 791 -2065 -515 2155 161 -2086 119 2204 -347
1846 -347 -1964 749 2041 -804 -1766 1300 1675 -1368 -1497 1682 1290 -1874 -1087 1941 651 -2196
1862b196J786K494k045k225K346J784k470j429K612J168k722r11K915N46l020
1877a367l4L092k58l311Q65L179j522k725J876K384k271j981K413J490k289j306
1893a765K380R27k437r10K786O56l010k79L242k80l417J166L324j832k851K302
1909BK132k420j415K518Q51k339q39K095R60k004r82K351P53l031n12L607j84
1926A543l685J113L288k204k623K898J900k819j112K363M28j787l22J652Q56j829
1942c40j369K147J389k705p19L594l59m229J445L877k401k589L006J154l276l20
1958a695K687J47j593k29P82M37r63j065K160J635l185j509L786J63l969J995
1974d16L681l257k986L507J304k810L53K191j017j576R8Q31J190m45j899J153
$$ plain form
1862 -2196 -410 2084 39 -2186 160 1944 -526 -1955 657 1825 -897 -1808 1107 1653 -1367
1877 -1367 -1401 1691 1433 -1878 -1013 2166 644 -2081 -205 2179 -92 -2073 340 1830 -459 -1765
1893 -1765 615 1542 -895 -1805 981 1637 -1373 -1652 1590 1310 -2107 -941 2383 551 -2300 2
1909 2 2134 -286 -1701 817 1668 -671 -1510 585 1545 -459 -1441 910 1663 -1368 -1880 1727 1543
1926 1543 -2142 -1029 2259 55 -2568 330 2230 -589 -1701 662 1090 -697 -1019 633 1489 -340
1942 -340 -1709 438 1827 -878 -1597 1997 1638 -2591 -1146 2731 330 -2259 747 1901 -1375 -1695
1958 -1695 992 1139 -454 -683 99 536 -427 -1492 668 2303 -882 -2391 1395 1558 -2411 -416
1974 -416 3265 8 -2978 529 1833 -977 -624 1567 550 -1026 -928 -97 1093 648 -1251 -98
1990i8J699k960j083M610J51m755J242L568l080j928M225Q29l654N1J818q03k05
2007c73P66J14M15q11k221J689K856k588j660L830o96m764K340M506l139k446
2023b182L428j84l433J397K618r56p87q2q03R71M64j500J598K155l667k116M454
2040A375N38m054K188L401m236k537M194Q24k652J181J224k127m88P33J36J569
2056A269J48k906N14K399k575j002M765j43n235J429L572l084j166M289k48l752
2072a726O36J562q17O47O42q85K63l03k173J743L233k724k088L466m95m331K698
2089f52M085l248k407L159l70k731J819K137j297n98l01q72J392Q64j692J159
2105D47J853l533j704M409N49l729J691K678l809j710L875O36k403P92O79j556
$$ plain form
1990 -98 1601 -1359 -2442 2168 2319 -2436 -1194 2374 -706 -2634 1591 2420 -1234 -1183 635 -168 -373
2007 -373 393 507 922 111 -2110 -421 2435 -153 -1813 2017 1321 -3443 -1103 3403 264 -2182
2023 -2182 1246 1062 -2371 -974 1644 688 -99 -181 -984 -13 451 -1049 549 2704 -963 -3079 1375
2040 1375 1913 -2141 47 3448 -788 -3325 869 1693 -959 222 1446 -681 -1169 -436 -300 1269
2056 1269 1417 -1489 -975 1424 -1151 -2153 2612 2469 -2766 -1337 2235 -849 -2015 2274 2026 -1726
2072 -1726 -1090 472 -345 302 944 59 322 19 -2154 -411 2822 98 -1990 1476 981 -3350 -652
2089 -652 3433 185 -2222 937 567 -2164 -345 1792 495 -103 -404 -1276 116 980 -712 447
2105 447 2300 -1233 -2937 1472 2021 -1708 -17 2661 -1148 -2858 1017 1653 -750 42 721 -835
2121h35rO62J30J276k91k662Q53K301k108r87L968m42m500J427L288k428j164
2138a521L283k27l109N21J564l05J39M7o17M46k99j602J743K282k630j714L006
2155A007j27l324K054L164k779k005K502K60j974R82J465p04p71l61k6J388K3
2172G74j639J188J247k681r96L602J40l226J148K361k526j520K895O82k087m6
2188f84J065m65m46J44N74Q38q39j628J278J548k012n53K798m40l134J197K586
2205A827j727j455K087M63k075j54J541K26o91m86L83O26q04j000J610J166k200
2222f63q51K539j80k506J204K304j789j707J861Q96j564k72J350J97j159m94J043
2239B09P63j041r29J433O40k057j60K399k85k386Q64J920j480j414J741J069j618
$$ plain form
2121 -835 -844 -182 -52 1224 933 -1729 -876 1425 -683 -1670 2298 1856 -2644 -1217 2071 -357 -1521
2138 -1521 1762 1535 -1574 -1053 511 206 345 392 -225 221 -78 -1680 63 2345 -285 -1999 1007
2155 1007 880 -2444 -390 2774 -5 -2010 492 752 -1222 -240 1225 521 -250 -611 -637 751 774
2172 774 -865 323 1570 -1111 -2107 1495 1635 -1591 -443 1918 -608 -2128 767 1449 -638 -684
2188 -684 381 -84 -530 -386 188 1026 187 -1441 -163 1385 -627 -1180 1618 1178 -1956 -759 1827
2205 1827 100 -1355 732 1195 -880 -1034 507 733 42 -444 -61 565 -239 -1239 371 1537 -663
2222 -663 -1514 1025 845 -1661 -457 1847 58 -1649 212 1108 -456 -728 622 819 -340 -834 209
2239 209 972 -69 -998 435 1075 -982 -1142 1257 972 -1414 -550 1370 -110 -1524 217 1286 -332
2256c32p00J372M63j229l51J186N56j374o77J618N85j914j09K143m67k142R40
2273d32J885j218j504J432J054j570p86J466P08j470n77J363N70j537m01J725
2289G08K22j862R8J948m49j866Q10J796j172j528J386J217j474r36J549P06j636
2306d83n26J587M42j729k09J761k6j840K61J802n64j714Q31J573r94j482J255
2323e5J293j450r54J575P69j621n46J681L57j780j05J746o0j861M16J722o41j718
2341a232R17J576j187j363J323J132j452r34J617P25j696n14J693L08j753k7J818
2358I51k32j691L38J764o97j625R96J480j142j331J348J069j530q27J557O28j575
2375e19m63J612K46j664n4J680j19j757L89J755p07j670J041J495j287j236J516
$$ plain form
2256 -332 -1032 340 803 -426 -777 409 965 -409 -1086 532 1117 -797 -906 1237 770 -1372 -432
2273 -432 1453 235 -1269 163 1217 -353 -1139 327 1035 -435 -1012 351 921 -616 -1017 708
2289 708 930 -932 -834 1114 665 -1201 -391 1405 233 -1295 91 1308 -166 -1102 447 1153 -483
2306 -483 -1009 578 1020 -709 -918 843 817 -1023 -762 1040 476 -1238 -407 1166 172 -1310 -55
2323 -55 1238 -212 -1166 409 1178 -443 -989 692 1049 -731 -836 910 850 -1011 -595 1127 486 -1232
2341 -1232 -315 1261 74 -1289 34 1166 -286 -1220 397 1122 -574 -1088 605 913 -840 -867 951
2358 951 719 -972 -634 1130 433 -1192 -196 1284 142 -1189 159 1228 -302 -1129 428 1056 -519
2375 -519 -982 630 876 -788 -842 838 719 -1038 -649 1106 399 -1271 -230 1265 -22 -1258 258
2392B58R21j546n86J489M12j470l74J562K23j556j02J611p6j874M87J919q69j864
2410a435J340J398j613j007J721P07j689l54J349K49j210r9J275K02j486k97J713
2427G64J64j882L31J974r68j905J485J556j775q88J760K51j691J2J426N2j014
2444c48l23Q97L60j162l11J714K74k330K52K249r00j955J826J419k319p65K173
2461G51Q3j471L76R86l90q32j09R03O67j098q02J536K07k168N38K573j285k214
2479a749J801J293k275j99K347l59j795M54Q16k12j58l0L67M96j214q98K001P35
2497A421k407L30K347j673k152K453J600k514l71J995q71j382J134Q86n00l00
2513do03J35J044o50p95J870L67k928K62K945j201k056K520P63l065L0K570o28
$$ plain form
2392 258 1179 -367 -953 536 948 -522 -896 666 889 -667 -769 842 766 -1108 -621 1298 429 -1435
2410 -1435 -95 1303 -310 -1317 404 1111 -578 -932 417 666 -544 -643 632 834 -652 -949 764
2427 764 928 -954 -623 1351 383 -1522 -37 1519 -256 -1144 616 867 -824 -812 614 666 -348
2444 -348 -671 226 586 -576 -887 827 1101 -1229 -977 1272 372 -1583 243 1662 -657 -1422 751
2461 751 834 -637 -261 725 335 -497 -606 297 964 -134 -936 600 807 -1361 -823 1750 465 -1749
2479 -1749 52 1345 -930 -1129 1218 859 -936 -482 334 122 -36 -66 301 797 -417 -1315 686 1421
2497 1421 -986 -656 1691 18 -2134 319 1919 -595 -966 1029 158 -1224 -90 796 296 -4
2513 -4 -607 -472 572 -78 -873 997 1364 -1564 -1302 1643 442 -1614 906 1669 -1396 -1366 1204 576
2531E76j149J039k2r42J40mM27J179j068j613J680O89k421R09K901j977k588K374
2549A30J090k427O49K368j505j511R71L25r7O14m41l45Q08j078j132K498R90k976
2567a069J61K537k025j798L239R71k944P9J782j372o47J647K73p22j01p81JJ693
2585I24n91j141J806K04l142P16L242j527k037K565K12l010P74K400q32r70Q12
2602D05m58n44N59j74L74J156j442j628K025P99k366J038K501k263k260K655Q90
2619A267k178P74J710j633j152J089L23M5M21q06k59R62j034q32K497M57l018
2636a367M40K340j861j310K957M48k806K06J718r10n03J209pn30k10o23N26J325
$$ plain form
2531 576 -573 466 444 -498 -358 -362 65 1244 176 -1437 243 932 -1489 -580 2321 344 -2244 130
2549 130 1220 -1207 -558 1810 305 -1206 -235 90 -7 607 166 -179 629 -449 -1581 917 1907 -1069
2567 -1069 -908 1629 -396 -2194 1045 2016 -928 -849 933 -439 -1086 561 834 112 11 -770 -769 924
2585 924 333 -808 998 1202 -1940 -1224 2018 491 -1546 1019 1231 -1779 -1005 1395 563 -407 405
2602 405 -53 -597 -38 -212 162 1318 -124 -1752 273 1072 -1294 -256 2245 -18 -2278 377 1267
2619 1267 -911 -137 1573 -60 -1212 -123 200 245 666 -140 -399 563 -471 -1303 1194 1651 -1367
2636 -1367 -927 1413 -448 -1758 1199 1647 -1159 -953 765 -145 -648 561 554 24 -186 -809 -283 1042
$$ [...]
8191G0
##END NTUPLES=NMR FID
##END=
