##TITLE=1H_AM_NV_53
 CDCl3
 8 sc, 
 15.6.2023
##JCAMPDX= 6.0         $$ Bruker NMR JCAMP-DX V2.0
##DATA TYPE= NMR FID
##DATA CLASS= NTUPLES
##ORIGIN= UXNMR, Bruker Analytische Messtechnik GmbH
##OWNER= root
$$ XWIN-NMR		Version 3.5
$$ Thu Jun 15 15:28:25 2023 Russian Standard Time (UT+4h)  she@DPX200
##.OBSERVE FREQUENCY= 200.13135
##.OBSERVE NUCLEUS= ^1H
##.DELAY= (6, 6)
##.ACQUISITION MODE= SIMULTANEOUS
##.ACQUISITION SCHEME= undefined
##.AVERAGES= 8
##.DIGITISER RES= 18
##SPECTROMETER/DATA SYSTEM= spect
##.PULSE SEQUENCE= zg30
##.SOLVENT NAME= CDCl3
##.SHIFT REFERENCE= (INTERNAL, CDCl3, 0, 15.7039)
##AUDIT TRAIL= $$ (NUMBER, WHEN, WHO, WHERE, WHAT)
$$ ##TITLE= Audit trail, XWIN-NMR		Version 3.5
$$ ##JCAMPDX= 5.01
$$ ##ORIGIN= Bruker BioSpin GmbH
$$ ##OWNER= she
$$ F:/spectra/data/she/nmr/H-F/1/audita.txt
$$ ##AUDIT TRAIL=  $$ (NUMBER, WHEN, WHO, WHERE, WHAT)
(   1,<2023-06-15 15:27:18.75 +0400>,<she>,<DPX200>,
      <created by zg, POWCHK disabled, PULCHK disabled
       configuration hash MD5:
       00 E9 B6 7A A2 85 ED C7 34 08 36 98 17 FE 4E 26
       data hash MD5: 16K
       41 00 56 2C 16 86 2D 1C 99 01 1B 22 C3 C0 55 CF>)
$$ ##END=
$$ 
$$ hash MD5
$$ 60 75 EA 2C 6A 9F 0A 0A 05 0F 0F 41 3C B4 26 A3
##$RELAX= 
##$RELAX= 
##$RELAX= 
##$RELAX= 
##$RELAX= 
##$RELAX= 
$$ Bruker specific parameters
$$ --------------------------
##$DU= <F:/spectra>
##$EXPNO= 1
##$NAME= <H-F>
##$PROCNO= 1
##$TYPE= <nmr>
##$USER= <she>
##$AMP= (0..31)
100 100 100 100 100 100 100 100 100 100 100 100 100 100 100 100 100 100 
100 100 100 100 100 100 100 100 100 100 100 100 100 100 
##$AQSEQ= 0
##$AQ_mod= 1
##$AUNM= <au_zg>
##$AUTOPOS= <>
##$BF1= 200.13
##$BF2= 200.13
##$BF3= 200.13
##$BF4= 200.13
##$BF5= 200.13
##$BF6= 200.13
##$BF7= 200.13
##$BF8= 200.13
##$BYTORDA= 1
##$CFDGTYP= 0
##$CFRGTYP= 5
##$CHEMSTR= <none>
##$CNST= (0..31)
1 1 145 1 1 1 1 1 1 1 1 1 1 1 1 1 1 1 1 1 1 1 1 1 1 1 1 1 1 1 1 1 
##$CPDPRG= <>
##$CPDPRG1= <>
##$CPDPRG2= <>
##$CPDPRG3= <>
##$CPDPRG4= <mlev>
##$CPDPRG5= <mlev>
##$CPDPRG6= <mlev>
##$CPDPRG7= <mlev>
##$CPDPRG8= <mlev>
##$CPDPRGB= <>
##$CPDPRGT= <>
##$D= (0..31)
0 1.2 0 0 0 0 0 0 0 0.06 0 0.03 0 0 0 0 0.0002 0 0 0 0 0 0 0 0 0 0 0 0 
0 0 0 
##$DATE= 1686828438
##$DBL= (0..7)
120 120 120 120 120 120 120 120 
##$DBP= (0..7)
150 150 150 150 150 150 150 150 
##$DBP07= 0
##$DBPNAM0= <>
##$DBPNAM1= <>
##$DBPNAM2= <>
##$DBPNAM3= <>
##$DBPNAM4= <>
##$DBPNAM5= <>
##$DBPNAM6= <>
##$DBPNAM7= <>
##$DBPOAL= (0..7)
0.5 0.5 0.5 0.5 0.5 0.5 0.5 0.5 
##$DBPOFFS= (0..7)
0 0 0 0 0 0 0 0 
##$DE= 6
##$DECBNUC= <off>
##$DECIM= 32
##$DECNUC= <off>
##$DECSTAT= 4
##$DIGMOD= 1
##$DIGTYP= 9
##$DL= (0..7)
0 120 120 120 120 120 120 120 
##$DP= (0..7)
150 150 150 150 150 150 150 150 
##$DP07= 0
##$DPNAME0= <>
##$DPNAME1= <>
##$DPNAME2= <>
##$DPNAME3= <>
##$DPNAME4= <>
##$DPNAME5= <>
##$DPNAME6= <>
##$DPNAME7= <>
##$DPOAL= (0..7)
0.5 0.5 0.5 0.5 0.5 0.5 0.5 0.5 
##$DPOFFS= (0..7)
0 0 0 0 0 0 0 0 
##$DQDMODE= 0
##$DR= 18
##$DS= 0
##$DSLIST= <SSSSSSSSSSSSSSS>
$$ [...]
##$SUBNAM2= <"">
##$SUBNAM3= <"">
##$SUBNAM4= <"">
##$SUBNAM5= <"">
##$SUBNAM6= <"">
##$SUBNAM7= <"">
##$SUBNAM8= <"">
##$SUBNAM9= <"">
##$SW= 18.05172834244
##$SWIBOX= (0..15)
0 0 2 0 0 0 0 0 0 0 0 0 0 0 0 0 
##$SW_h= 3612.71676300578
##$TD= 16384
##$TD0= 1
##$TE= 0
##$TE2= 300
##$TE3= 300
##$TEG= 300
##$TL= (0..7)
0 120 120 120 120 120 120 120 
##$TP= (0..7)
150 150 150 150 150 150 150 150 
##$TP07= 0
##$TPNAME0= <>
##$TPNAME1= <>
##$TPNAME2= <>
##$TPNAME3= <>
##$TPNAME4= <>
##$TPNAME5= <>
##$TPNAME6= <>
##$TPNAME7= <>
##$TPOAL= (0..7)
0.5 0.5 0.5 0.5 0.5 0.5 0.5 0.5 
##$TPOFFS= (0..7)
0 0 0 0 0 0 0 0 
##$TUNHIN= 0
##$TUNHOUT= 0
##$TUNXOUT= 0
##$USERA1= <user>
##$USERA2= <user>
##$USERA3= <user>
##$USERA4= <user>
##$USERA5= <user>
##$V9= 5
##$VALIST= <valist>
##$VCLIST= <CCCCCCCCCCCCCCC>
##$VD= 0
##$VDLIST= <DDDDDDDDDDDDDDD>
##$VPLIST= <PPPPPPPPPPPPPPP>
##$VTLIST= <TTTTTTTTTTTTTTT>
##$WBST= 1024
##$WBSW= 4
##$XGAIN= (0..3)
0 0 0 0 
##$XL= 0
##$YL= 0
##$YMAX_a= 320578
##$YMIN_a= -332271
##$ZGOPTNS= <>
##$ZL1= 120
##$ZL2= 120
##$ZL3= 120
##$ZL4= 120
##$ABSF1= 10
##$ABSF2= 0
##$ABSG= 5
##$ABSL= 3
##$ALPHA= 0
##$AQORDER= 0
##$ASSFAC= 0
##$ASSFACI= 0
##$ASSFACX= 0
##$ASSWID= 0
##$AUNMP= <proc_1d>
##$AZFE= 0.1
##$AZFW= 0.1
##$BCFW= 1
##$BC_mod= 2
##$BYTORDP= 1
##$COROFFS= 0
##$CY= 11.3945322036743
##$DATMOD= 1
##$DC= 2
##$DFILT= <>
##$DTYPP= 0
##$F1P= 15.7292609196834
##$F2P= 12.9074282941183
##$FCOR= 0.5
##$FTSIZE= 0
##$FT_mod= 4
##$GAMMA= 1
##$GB= 0.15
##$INTBC= 1
##$INTSCL= 1
##$ISEN= 128
##$LB= 0.24
##$LEV0= 0
##$LPBIN= 0
##$MAXI= 10000
##$MC2= 0
##$MEAN= 0
##$ME_mod= 0
##$MI= 1.114404
##$NCOEF= 0
##$NC_proc= 0
##$NLEV= 6
##$NOISF1= 3.799351
##$NOISF2= 2.8
##$NSP= 1
##$NTH_PI= 0
##$NZP= 0
##$OFFSET= 15.70392
##$PC= 1
##$PHC0= -20780.55
##$PHC1= 7.252721
##$PH_mod= 1
##$PKNL= yes
##$PPARMOD= 0
##$PSCAL= 0
##$PSIGN= 0
##$REVERSE= no
##$SF= 200.130013532006
##$SI= 16384
##$SIGF1= 3
##$SIGF2= 2
##$SINO= 400
##$SIOLD= 16384
##$SREGLST= <1H.CDCl3>
##$SSB= 0
##$STSI= 0
##$STSR= 0
##$SW_p= 3612.71676300578
##$SYMM= 0
##$S_DEV= 0
##$TDeff= 0
##$TDoff= 0
##$TI= <>
##$TILT= no
##$TM1= 0
##$TM2= 0
##$TOPLEV= 0
##$USERP1= <user>
##$USERP2= <user>
##$USERP3= <user>
##$USERP4= <user>
##$USERP5= <user>
##$WDW= 1
##$XDIM= 8192
##$YMAX_p= 0
##$YMIN_p= 0
$$ End of Bruker specific parameters
$$ ---------------------------------
##NTUPLES= NMR FID
##VAR_NAME=  TIME,          FID/REAL,        FID/IMAG
##SYMBOL=    X,             R,               I
##VAR_TYPE=  INDEPENDENT,   DEPENDENT,       DEPENDENT
##VAR_FORM=  AFFN,          ASDF,            ASDF
##VAR_DIM=   8192,          8192,            8192
##UNITS=     SECONDS,       ARBITRARY UNITS, ARBITRARY UNITS
##FACTOR=    0.0002768,     1,               1
##FIRST=     0,             0,               0
##LAST=      2.2672688,     0,               0
##MIN=       0,             -332271,         0
##MAX=       2.2672688,     320578,          0
$$ Real data points
##PAGE= N=1
##DATA TABLE= (X++(R..R)), XYDATA
0@%%%%%%%%%%%%%%%%JrJ6j6J6j7J8k5L2l7M5m9N7o5P4q7R9j11J24j41J61j81K00
39A05k24K48k75L08l43L80m19M61n07N60o18O83p52Q27r12J008j114J234j371
58g21J530j721J944k215K552k986L569m399N694q008J3501n3768r8365j00664
72b44057q8214L3775j265j9064P0812J10958M8113P6277J24432Q1738L2766N5323
84B81594L8984k0739m6506l7455o1776r7275r3653o3635p1007p9036l1833R738
96b72599n791J6171P9439P6089M8315R0399J04524M6092L5986O0671R784m1553
108B47527k3628l5723q8597q4131n8402p5696p7502l9043j7783j1820J3038M3106
120b08654N8887O3086O7736P9890P4771M5937L6209L6660j381l6614k7806m0445
$$ plain form
0 0 0 0 0 0 0 0 0 0 0 0 0 0 0 0 0 0 1 -8 8 -8 8 -9 9 -16 16 -21 24 -25 32 -33 41 -46 53 -58 66 -75 86 -95 105
39 105 -119 129 -146 162 -181 199 -220 241 -266 294 -324 359 -393 434 -478 530 -584 650 -721
58 -721 809 -912 1032 -1183 1369 -1617 1952 -2447 3247 -4761 8740 -45028 -143393 -244057
72 -244057 -332271 -298496 -299761 -318825 -248013 -137055 -88942 -12665 111767 193505 226271 281594
84 281594 320578 299839 253333 215878 154102 56827 -36826 -100461 -171468 -250504 -282337 -272599
96 -272599 -278390 -262219 -182780 -106691 -58376 32023 136547 182639 218625 279296 289080 247527
108 247527 223899 188176 99579 15448 -42954 -118650 -196152 -235195 -252978 -264798 -251760 -208654
120 -208654 -149767 -86681 -18945 60945 135716 181653 217862 254522 253141 216527 188721 148276
132A48276q2283p4383m7866o7765o9912k2335o245j6041J8090N5885M7999M7998
144f8582P4911P4802M8475M1658M3397J8125j5975k3360k5451n4794p4954n5387
156a7135m9329p0774n1634q068j2297j5132L5603N7283L1122N0145Q5989N5865
168I1638K7777N3064M1557j2522j6433k824m2088p0382m6062m3213p0137n5740
180a45365j8559j9107k2775J4395M2404L0457L5500O8491O4567L4120M1951N2727
192A78806J2902j4917J334j4682n9089n2403l2013n9419o8393k7829j8317l4477
204a88497m174L2847K3544K4463N8189O1590L8628M2951N1939K6607J677K789
216A72553n729l5580m7171l7688m4852o0091m6121k3721k7031k2675J0282K6068
$$ plain form
132 148276 65993 -8390 -56256 -124021 -193933 -216268 -222513 -238554 -220464 -164579 -116580 -68582
144 -68582 6329 81131 129606 171264 214661 232786 216811 193451 168000 113206 38252 -17135
156 -17135 -66464 -137238 -188872 -196940 -209237 -224369 -188766 -131483 -100361 -50216 35773 91638
168 91638 119415 172479 214036 201514 185081 182257 140169 69787 23725 -19488 -89625 -145365
180 -145365 -163924 -183031 -205806 -191411 -149007 -118550 -83050 -14559 50008 84128 126079 178806
192 178806 191708 176791 178125 163443 104354 51951 19938 -39481 -107874 -135703 -154020 -188497
204 -188497 -192671 -159824 -136280 -111817 -53628 7962 46590 89541 141480 168087 169764 172553
216 172553 166824 131244 84073 46385 1533 -58558 -104679 -128400 -155431 -178106 -167824 -141756
228a41756J8051L4391N9045M7571L4228M8127M3315J1940L250O660j7379m1157
240A06286l6003l5795n3165n2122l2224k6733k8273q368J6108J8660K1310M3352
252f6967N3226L8511L6996M8309L1647M771O488L970k8005m1206k7407l8413n8774
265c6854m1165k1464l3000k6492Q431J6811P888L0303N2970L8451L0775M8941
277G5595M2240J2063R139J4547j2500l5735k5646k7522n2298m8751k4934k9587
289a03389l6480p237J3855L622J4056M4975M2411K6419M2075N0108K2129R317
301A21861K0586L135k7705k4469j8836m2969n1146k9493k7439l9331k0373N486
313a30693J644L998L1827M0906K7494L4686M8721L3035J4539K0182J4582j3145
$$ plain form
228 -141756 -123705 -89314 -30269 17302 51530 99657 142972 154912 158162 164822 147443 106286
240 106286 70283 34488 -18677 -70799 -103023 -129756 -158029 -166397 -150289 -131629 -110319 -66967
252 -66967 -13741 24770 61766 110075 141722 146493 152981 156951 128946 87740 60333 21920 -36854
265 -36854 -78019 -99483 -132483 -158975 -150544 -133733 -125845 -95542 -42572 -4121 26654 75595
277 75595 117835 129898 139037 153584 141084 105349 79703 52181 -117 -48868 -73802 -103389
289 -103389 -139869 -147106 -133251 -129629 -115573 -70598 -28187 -1768 40307 90415 112544 121861
301 121861 142447 145582 117877 93408 74572 31603 -19543 -49036 -76475 -115806 -136179 -130693
313 -130693 -129049 -125051 -93224 -52318 -24824 9862 58583 91618 106157 126339 140921 127776
325A27776k2588j6025k9940m7113l6879k6536l6114l1467o911R27k069J5865L5342
338g5732L0387K7822M2229M1370K2291J8456K1406K860j6848j5362j8486l7800
350D2593m1428k8540l0358l6704k0560k492m122J762K4551L1968K4191L2378M4103
363C7342L1408J7592K3029J7151p588j5440j0241k5351m1897l2137k4910l6714
375f7756l2005q593m285q261J1820L0200K2979K3342M1283L8773J9846K1650K6317
388A15310M447j2962o440j3188l6335l5859k2406l2286l9275j7888n154j3370
400a15406j738K3991K2915J6268L4214M2613K4252K0073L0641J6091o883m027
412A03004m052k6927l5473k2871k7291l9857k6655r752j4451j1170J2591K0972
$$ plain form
325 127776 105188 89163 59223 12110 -24769 -51305 -87419 -118886 -125797 -124870 -126939 -111074 -75732
338 -75732 -45345 -17523 24706 66076 88367 106823 128229 131089 114241 98879 80393 42593
350 42593 1165 -27375 -57733 -94437 -114997 -117489 -121611 -119849 -95298 -63330 -39139 -6761 37342
363 37342 68750 86342 109371 126522 118934 103494 93253 67902 26005 -6132 -31042 -67756
375 -67756 -99761 -108354 -112639 -120900 -109080 -78880 -55901 -32559 8724 47497 67343 88993 115310
388 115310 119757 106795 100355 87167 50832 14973 -7433 -39719 -78994 -96882 -102036 -115406
400 -115406 -117144 -93153 -70238 -53970 -19756 22857 47109 67182 97823 113914 107031 103004
412 103004 98952 72025 36552 13681 -13610 -53467 -80122 -89874 -104325 -115495 -102904 -81932
424h1932J3947K4711L9910L0514K0036K8654K5488L233l445J203j4418l1839k5319
437C0743k2064l5820l3871j5760j3947j7202M59J6642J3003J6502L3492L3904
449F081K2526K5654K9526J4149N46K465m149k2579k6869k1025k8101l6060k4743
462f2579j4159j7760j1673P988J3874J0626K2785L5007K6868K1299K9639K4790
474H6705O171K411M316j1617k5762k0612k0908l3919l1403j6665j6937j9279k211
487i9710J1649P962J2934L0407L0281J9791K5932L0709J4274K971Q085m97k0587
500G4201k1207j5423k7991l5050k0845j5266k2805j2270P105O713N384K2715L1176
513b3563K0445K1624L2266K2085O200R180P873j1989k0456j2959k0818l4287k5836
$$ plain form
424 -81932 -67985 -43274 -3364 27150 47186 75840 101328 104561 101116 102319 87901 56062 30743
437 30743 8679 -27141 -61012 -76772 -90719 -107921 -107462 -90820 -77817 -61315 -27823 6081
449 6081 28607 54261 83787 97936 98482 100947 96798 74219 47350 26325 -1776 -37836 -62579
462 -62579 -76738 -94498 -106171 -98183 -84309 -73683 -50898 -15891 10977 32276 61915 86705
474 86705 92876 95287 99603 87986 62224 41612 20704 -13215 -44618 -61283 -78220 -97499 -99710
487 -99710 -88061 -80099 -67165 -36758 -6477 13314 39246 69955 84229 87200 95285 94788 74201
500 74201 52994 37571 9580 -25470 -46315 -61581 -84386 -96656 -89551 -82838 -77454 -54739 -23563
513 -23563 -3118 18506 50772 72857 79057 88237 96110 84121 63665 50706 29888 -4399 -30235
526c0235j5238k2683k0497m03N490K85J3546K8711K1966J8122L0018K8130J1393
539F8605R809J3101k306j6237j2212j4648k8967k8834j8156k0390k3812j0228
551h4275J763m32M763K0875K3768J7586K3692L0299J9325R979J3850Q009r479
564G9723j3082r700k0925l0126k1458j7445k4726j8496k699j177j642J2827K2399
577d6527J7480J9284K8438K4537J3591J3396J3149r8j0555r242j3079k5245k6037
590i08j7923k0430k3978j1734q63l814J654J8301K0134J4034K3292K9855J7247
603D4867J1443J7944Q945p974p166n940k0834k6659j7434j8743k6241j7080m602
616f9474o267m017J1216J7782J3270J8371K7684K2320J3206J6282J5712N34p184
$$ plain form
526 -30235 -45473 -68156 -88653 -89056 -83566 -83281 -69735 -41024 -19058 -936 29082 57212 68605
539 68605 78414 91515 89209 72972 60760 46112 17145 -11689 -29845 -50235 -74047 -84275
551 -84275 -82512 -82944 -78181 -57306 -33538 -15952 7740 38039 57364 67343 81193 89202 79723
564 79723 66641 56941 36016 5890 -15568 -33013 -57739 -76235 -78934 -80111 -81753 -68926 -46527
577 -46527 -29047 -9763 18675 43212 56803 70199 83348 83250 72695 63453 50374 25129 -908
590 -908 -18831 -39261 -63239 -74973 -75836 -79650 -77996 -59695 -39561 -25527 -2235 27620 44867
603 44867 56310 74254 83199 75225 68059 62119 41285 14626 -2808 -21551 -47792 -64872 -69474
616 -69474 -75741 -79758 -68542 -50760 -37490 -19119 8565 30885 44091 60373 76085 76619 69435
629F9435l298j1046k4958k1050j4624k3719k4373q654n158j0051K674J6697J1891
642d6234J2219K5835K5223J3836J6473J9762O235l623n48o115j9539k0600j5507
655G417k0695k4734j5190p731r873m653R214J2770J0012J8230K5852J8732J4006
668C3357J9566J4898P84j287J53j1966k0843j5283j6201k4740k0001r743j0701
681f2007r942K678J0227Q066J3104K2451K0897J5114J7823J8222P882N61J531
694F6607m166j5873j7207j3622j9648k3719j4563r130j2581o059P263Q159O901
707d7638J7464K2975J5678J4876K0734J3973K544L103K045j0384j6530j2390j5519
720A0931k3339j8754j0296j2586j1867R70P386M214J0661K1371J8225J2807J9301
$$ plain form
629 69435 66137 55091 30133 9083 -5541 -29260 -53633 -62287 -67445 -77496 -74822 -58125 -46234
642 -46234 -34015 -8180 17043 30879 47352 67114 73349 69726 69178 63063 43524 22924 7417
655 7417 -13278 -38012 -53202 -60933 -70806 -75459 -66245 -53475 -43463 -25233 619 19351 33357
668 33357 52923 67821 68605 67318 67471 55505 34662 19379 3178 -21562 -41563 -51306 -62007
681 -62007 -71949 -69271 -59044 -50978 -37874 -15423 5474 20588 38411 56633 64515 65076 66607
694 66607 62441 46568 29361 15739 -3909 -27628 -42191 -51321 -63902 -69961 -62698 -54539 -47638
707 -47638 -30174 -7199 8479 23355 44089 58062 60606 63709 65754 55370 38840 26450 10931
720 10931 -12408 -31162 -41458 -54044 -65911 -64941 -57555 -53341 -42680 -21309 -3084 9723 29024
733B9024J9517O887L260O294l154j4569j1739j1166k1136k1497j1954j2411j5461
746e8105m999M477K368N517J7034J8607J2959J6649K0935J2261M775P394L280
759F3152r440j1885q436j6029k2281j5020j1117j6265j1351R67J672P91J1666
772d3576J8050J2927J4077K0725J6105P426Q333P146l531r563p794j1902j9430
785H993j7724j2527j4623j4666n561O54l16M693J4513J5045J1920J7029J9685
798B7115J1482P291R839L470p035p447p032j5777j9222j3192j3092j6664j0471
811e0735j770j788L3R677J4218J1427J3921J9064J5359Q823R476Q295j310p091
825D7599n402r717j8063j5972j1253j5216j5557n527j233l728L426J3399J1256
$$ plain form
733 29024 48541 55428 58688 64982 61828 47259 35520 24354 3218 -18279 -30233 -42644 -58105
746 -58105 -63104 -58627 -56259 -50742 -33708 -15101 -2142 14507 35442 47703 52478 59872 63152
759 63152 53712 41827 33391 17362 -4919 -19939 -31056 -47321 -58672 -57705 -56033 -55242 -43576
772 -43576 -25526 -12599 1478 22203 38308 45734 54067 61213 57682 48119 40325 28423 8993
785 8993 -8731 -21258 -35881 -50547 -56108 -55454 -55770 -51077 -36564 -21519 -9599 7430 27115
798 27115 38597 45888 55727 59197 52162 44715 37683 21906 2684 -10508 -23600 -40264 -50735
811 -50735 -52505 -54293 -54260 -44583 -30365 -18938 -5017 14047 29406 38229 47705 56000 54690 47599
825 47599 42197 32480 14417 -1555 -12808 -28024 -43581 -49108 -50341 -54069 -50643 -37244 -25988
838b5988R906J7657J8391R827R288J1835L431n223l598n565j5190j6483j1289
851c001j3802j7064r778l106m701j431Q871J1235Q489J3657J8913J3140Q827J2400
865D2649Q929j598l317j849j0201j6480j1839j1342j7290j3759n081n539n488
878e2205M030R833P099J0354J7295J4961R791J1979J1843L192j583m48n315j3261
892B7565j2735j0472j4667j5944q986n641p132j619O957P148P034J3794J6323
905A625J1196J0750J3367P906N42M67j264r267j2756j0097j2176j6140j2363o883
919c5093p499n810K530O595N504R566J5366J3541J0034J2468J1961M128M77J537
933D5305m016j1539j0596r266j4645j5202q506p064q757k203N040M462N538J3041
$$ plain form
838 -25988 -16082 1575 19966 29793 39081 50916 54347 49124 45526 39961 24771 8288 -3001
851 -3001 -16803 -33867 -43645 -46751 -51452 -52883 -44012 -32777 -24288 -10631 8282 21422 30249 42649
865 42649 51578 49980 46663 44814 34613 18133 6294 -5048 -22338 -36097 -41178 -46717 -52205
878 -52205 -48175 -38342 -31243 -20889 -3594 11367 21158 33137 44980 48172 46589 46141 40826 27565
892 27565 14830 4358 -10309 -26253 -35239 -40880 -48012 -49631 -42674 -35526 -28492 -14698 1625
905 1625 12821 23571 36938 44844 45386 45853 44589 35322 22566 12469 293 -15847 -28210 -35093
919 -35093 -42592 -48402 -45872 -39277 -33773 -24207 -8841 4700 14734 27202 39163 43291 43768 45305
933 45305 41289 29750 19154 9888 -4757 -19959 -28465 -35529 -44286 -46489 -41449 -36987 -31449 -18408
947a8408J4550R886J1311J3862P870J784K730K66q096j0523q016j1603j5873j1263
961b1523o883r376o810K019M222K653R097J4484J0725R373J4102J1417L494L433
975D0427L853m376r522o809r065j5101j2823p804r662r425j731K450J292N359
989c2937J2047J1546R053J2422J3336P165L990N195N40o891p073o512j2158j4317
1003d594r372q673j1015o071P08L63J655Q941J1430Q682J0590J3827R729N255
1017C1455N944L827l144o075n318q978j3136j1173q605j0280r168k894J14k23
1031c7654M371J0089R410Q411J2275J2516P013N561O523J076n056m486n604j1348
1045A3097j2428q640r489j1096o120j182j419P88P325R334P510J0094J3172R474
$$ plain form
947 -18408 -3858 6028 17339 31201 39071 40855 43585 43851 35755 25232 17216 5613 -10260 -21523
961 -21523 -28406 -37782 -44592 -42573 -38351 -35698 -26601 -12117 -1392 7981 22083 33500 36994 40427
975 40427 44280 39904 30382 23573 14508 -593 -13416 -21220 -30882 -40307 -42038 -39588 -38296 -32937
989 -32937 -20890 -9344 -291 12131 25467 32632 36622 41817 42357 35466 28393 21881 9723 -4594
1003 -4594 -13966 -22639 -33654 -39725 -39017 -38654 -36999 -28058 -16628 -7946 2644 16471 26200 31455
1017 31455 37399 41226 38082 32007 26689 17711 4575 -6598 -15203 -25483 -34651 -37545 -37431 -37654
1031 -37654 -33283 -23194 -13784 -5373 6902 19418 26431 31992 38515 39591 34535 30049 24445 13097
1045 13097 669 -7971 -17460 -28556 -34676 -35858 -37277 -36489 -29164 -19830 -12320 -2226 10946 20420
1059B0420N749P312N026k171m156l116p986j2545r472q031j1544r325k782k189
1073c4810k450L988Q457O488P965J2549J0980O678P523P373J316k760j901m775
1087B6621j0452j0311p617j0131j1284n724k598l859r8O546O612N539J0638J2289
1101F171P537P093R069M397j293o66k114q210r892p395r367j1388p798m171m560
1116c2587k517L242N684N070P958J1306R626P029Q461P544J825p59k21m170r271
1131A8220q114p197j0743j0449n355m490n200J6M688L860N547J0063J0065P389
1145H300Q263Q765M418R78O08j570o364p998o994q664j0525q001m763n306l555
1160c2408J984M213L416O809J0671Q288O636R351P531J945J102J411l978p573
$$ plain form
1059 20420 26169 33481 38507 36336 32180 29064 21078 8533 -939 -8970 -20514 -29839 -32621 -34810
1073 -34810 -37260 -33272 -24815 -18327 -10362 2187 13167 19845 27368 34741 36057 33297 31396 26621
1087 26621 16169 5858 -1759 -11890 -23174 -28898 -31496 -35355 -35453 -28907 -22295 -16756 -6118 6171
1101 6171 13708 20801 29870 34267 32974 32308 30194 21984 12092 4697 -4670 -16058 -23856 -28027 -32587
1116 -32587 -35104 -31862 -26178 -21108 -13150 -1844 7782 14811 23272 30816 32641 31882 31661 27491 18220
1131 18220 10106 2909 -7834 -18283 -23638 -28128 -33328 -33312 -28624 -24764 -19217 -9154 911 8300
1145 8300 16563 25328 29746 30724 31332 29762 23398 15400 8406 -258 -10783 -18784 -23547 -28853 -32408
1160 -32408 -30424 -26211 -22795 -15986 -5315 2973 9609 18960 26491 28436 29538 30949 26971 19398
1174A9398n950o962j0585r131n433n904n558n16K838K313M656R032Q843O797Q335
1189A2173R014M622J680K472m57n920o159n191q824j0394o599n336p213l468J676
1204b7924J424J992P299Q806O244P524R752O356K701L448J862l454n309m421o950
1219I350r788p699n705p013n634q33R03O82M265P971O839O290Q937Q134M218L519
1235B4436L510o19m240l839n041q568q499o114o613o881l293j65l1J814O013P073
1251a1057N841P412Q909O154L641M190K330k420l686l359o367q759o837n847p444
1266a7299n521j587o35k83L617O339N517O087Q469P631M500M367M078L10k842
1281B2748k608m010p688p597n532o692p259l469r45j590Q22N303N449M550P438
$$ plain form
1174 19398 13448 6486 -4099 -13230 -18663 -24567 -30125 -30641 -27803 -25490 -20834 -11802 -2959 3838 12173
1189 12173 21187 25809 27489 29961 29504 23584 17425 12234 3410 -6984 -13583 -18919 -26132 -29600 -27924
1204 -27924 -26500 -24508 -17209 -8403 -2159 5365 15117 21473 24174 27622 29484 26030 20721 16300 9350
1219 9350 -438 -8137 -13842 -20855 -26489 -27322 -26419 -25737 -21472 -13501 -6662 -372 8565 16699 20917 24436
1235 24436 27946 27327 23087 19248 14207 5639 -2860 -8974 -15587 -22468 -25761 -25926 -25957 -24143 -18130 -11057
1251 -11057 -5216 2196 11105 17259 20900 25090 27420 25000 21314 17955 11588 2829 -4008 -9855 -17299
1266 -17299 -22820 -24407 -25042 -25325 -21708 -15369 -9852 -3765 4704 12335 16835 21202 25280 25590 22748
1281 22748 20140 16130 8442 845 -4687 -11379 -18638 -22107 -23052 -24642 -23820 -18517 -13068 -8518 -1080
1296a080Q484N193M322N428K439j732j713k232o186p503n484o173p664n154k046
1311b1101k135j070L134M869M094N891Q228O530M489N426M573K61j396q35l861
1326A7097p006n855n189p473o785l035k602k732R76L961L318M436P422O965M960
1341H458N460N593K131j71j44j960n350n743n074o308p125m816k942l130j340
1356b2461K248L193L240N510P163N643M884N784M288R73K40k50l380n480m804
1371F791n130p043o034l530l427k947L33K560K408L940O384O215M784N421N599
1386A6324K645P35O56j227m403m742m341o027o842m435l362l938j766J557K019
1401a7147K138N152O482M706M877O166M131J306J315O50k921m514l462m865o828
$$ plain form
1296 -1080 7404 12597 16919 22347 24786 23054 21341 19109 12923 5420 -64 -6237 -13901 -19055 -21101
1311 -21101 -23236 -24306 -21172 -16303 -12209 -6318 1910 8440 12929 18355 22928 23189 21793 20958 17097
1326 17097 10091 4236 -953 -8426 -15211 -18246 -20848 -23580 -22604 -18643 -15325 -10889 -3467 3498 8458
1341 8458 13918 19511 21642 21471 21327 19367 14017 8274 3200 -3108 -10233 -15049 -17991 -21121 -22461
1356 -22461 -20213 -17020 -13780 -8270 -1107 4536 9420 15204 19492 20465 20705 20455 17075 11595 6791
1371 6791 1661 -5382 -11416 -14946 -18373 -21320 -20987 -18427 -16019 -12079 -5695 520 5304 10725 16324
1386 16324 18969 19704 20360 19133 14730 9988 5647 -380 -7222 -11657 -15019 -18957 -20723 -19166 -17147
1401 -17147 -15009 -9857 -3375 1331 6208 12374 16505 17811 19126 19776 16855 12341 8879 4014 -2814
1416b814n273l511m131l344J47J521J066L514N936M910M361N802N234K339J657
1431A7414J684j103l671l169l757o097n801l857m115m298j427O97N33J908M734
1446a0325N061M046N250N763L611K064K370N26k270k970k839m846n935m462l914
1461h870m604l082m35J37O72L111M640L975M458N635M656K688K520J981o82k345
1477A4455k285l558n253m985l936m321m029j845k66r9J488L680M073L716M887
1492A722N271L518K471K655R97j536k049k206m285n212l964l836m620l054p74
1507a4902o15P0K595L847L223M070N353M268K685K894K249l12j573j496l015m873
1523D468m193l482m475m139j679q48r88J090L351K941L123M851M817L025K876
$$ plain form
1416 -2814 -8087 -11598 -15729 -19073 -18926 -17405 -16339 -12825 -6889 -1979 2382 8184 13418 15757 17414
1431 17414 19098 17995 14324 11155 7398 1301 -4500 -8357 -12472 -16770 -18197 -17500 -16967 -15059 -10325
1446 -10325 -5264 -1218 4032 9795 13406 15470 17840 18366 16096 13126 10287 5441 -494 -4956 -8870
1461 -8870 -13474 -16556 -16991 -16854 -16182 -13071 -8431 -4456 2 5637 10293 12981 15501 17482 16800 14455
1477 14455 12170 8612 3359 -1626 -5562 -9883 -13912 -15757 -16023 -16122 -14634 -10954 -6881 -3165 1722
1492 1722 6993 10511 12982 15637 16634 15098 13049 10843 6558 1346 -2618 -6454 -11074 -14128 -14902
1507 -14902 -15517 -15447 -12852 -9005 -5782 -1712 3641 7909 10594 13488 15737 15425 13852 12356 9341 4468
1523 4468 275 -3207 -7682 -11821 -13500 -14348 -15336 -14246 -10895 -7954 -4831 20 4837 7862 10738
1538A0738L181R35r87q36j781m070m201l250m096m534k570j289j526j41K304K661
1554i462K520L955M802L466K899L382K084j22n30q18k861l991l214l577m454l428
1570i349j906j718j041J009K167K157L096M396L902L040L282K939J020n8k87j634
1586A1015l264l393l086m017l979k563j898j765k80J431J870K119L630M085L226
1601C131L093L311K094N93J00m41k261l127k822l389m002l315k049j932j507M02
1617a2121J607J463K527L833L522K761L275L055J230L25L69j172k631k652k570
1632B821l906l670k360k152k154n68J046J008J622L364L475K705L104L479K064
1647I878P77Q59m4j989k445k087l263l875k776k226k528j584K47O30P78K486L312
$$ plain form
1538 10738 13919 14854 13867 13031 11250 7180 2979 -271 -4367 -8901 -11471 -12760 -14286 -14427 -12123 -9462
1554 -9462 -6942 -2987 1815 5281 8180 11562 13646 13524 12994 12176 9315 5324 2110 -1467 -5921 -9349
1570 -9349 -11255 -12973 -14014 -13005 -10838 -8681 -5585 -1189 2713 5753 9035 11974 12994 12936 12649 11015
1586 11015 7751 4358 1272 -2745 -6724 -9287 -11185 -12950 -13230 -11799 -9929 -7810 -4180 -95 3131
1601 3131 6224 9535 11629 12222 12322 11881 9620 6493 3671 282 -3720 -7035 -9084 -11016 -12523 -12121
1617 -12121 -10514 -9051 -6524 -2691 831 3592 6867 9922 11152 11477 11846 10674 8043 5391 2821
1632 2821 -1085 -4755 -7115 -9267 -11421 -11989 -10943 -9935 -8313 -4949 -1474 1231 4335 7814 9878
1647 9878 10655 11514 11470 9481 7036 4949 1686 -2189 -4965 -7191 -9719 -11303 -11056 -10426 -9648 -7162 -3850
1664c850K647K908L526K625J418J253P77j016j879j817k529l554l052k345k738
1679g626k158o39J20L52J498K727K609K595L219L072K003J415J222k3j237j551
1695G598j931k957l160k682k426k554j520l25K7O80J967K534K345K852L127K554
1711F129J759J437R33n41j223j444k237l019k844k407k526k236r95m04O3R75K169
1728f411K296K197L010K984K035J584J589M58q73j090j301k657k844k257k535
1743c815k579j613p00m99K01J608J955J714K686L068K235J725J901J095k00o29
1759H153q91j919k627k194k334k757k089r67q67m91R11J722J427K054K975K479
1775B585J854K064J599L50j76l31j377k305k095k121k646k447j400j200q97K14
$$ plain form
1664 -3850 -1203 1705 5231 7856 9274 10527 11304 10288 8409 6592 4063 509 -2543 -4888 -7626
1679 -7626 -9784 -10423 -10303 -9951 -8453 -5726 -3117 -522 2697 5769 7772 9187 10409 10386 9149 7598
1695 7598 5667 2710 -450 -3132 -5558 -8112 -9632 -9957 -9930 -9250 -7283 -4749 -2404 448 3575 6129
1711 6129 7888 9325 10258 9717 8494 7050 4813 1794 -1050 -3457 -5983 -8219 -9214 -9618 -9555 -8580 -6411
1728 -6411 -4115 -1918 1092 4076 6111 7695 9284 9742 8869 7779 6478 3821 977 -1280 -3815
1743 -3815 -6394 -8007 -8707 -9206 -9005 -7397 -5442 -3728 -1042 2026 4261 5986 7887 8982 8782 8153
1759 8153 7262 5343 2716 522 -1812 -4569 -6658 -7625 -8492 -8983 -8072 -6350 -4923 -2869 106 2585
1775 2585 4439 6503 8102 8452 8276 7945 6568 4263 2168 47 -2599 -5046 -6446 -7646 -8543 -8329
1791h329J064J227J749K341K583J974K093J905J055K94j0o95j631j962j850k354
1807e46k520j883j289j174n74M52R56J223J894K267K168J985K022J504P43K44
1823G472j98r17j597j854j876k353k189j566j274r77j49N94R14J367J947K220
1839d36J985J884J907J201M85J93l43j167j689j611j971k354j822j290j316q41
1855g185J88O76Q02J580K077J863J785K012J677O75N11K99p41j357j352j578k279
1872c47j934j448j483j126k05K86L31J131J808J686J592K067J769J050P21O21
1888F519l00r29j024j329j907j985j538j519j367o06o4J37O29J399J503J501J875
1905I95J852J297R48Q84K08n71p36j096j573j804j589j574j473j011m87j71K51
$$ plain form
1791 -8329 -7265 -6038 -4289 -1948 635 2609 4702 6607 7662 7956 7946 7251 5620 3658 1808 -546
1807 -546 -3066 -4949 -6238 -7412 -7986 -7534 -6578 -5355 -3461 -1194 974 2959 4981 6485 7228 7472
1823 7472 7274 6357 4760 2906 1030 -1323 -3512 -5078 -6352 -7329 -7478 -6884 -5970 -4603 -2656 -436
1839 -436 1549 3433 5340 6541 7026 7219 6876 5709 4020 2409 438 -1916 -3738 -5028 -6344 -7185
1855 -7185 -6997 -6321 -5519 -3939 -1862 1 1786 3798 5475 6150 6661 6960 6219 4862 3510 1932 -347
1872 -347 -2281 -3729 -5212 -6338 -6543 -6257 -5926 -4795 -2987 -1301 291 2358 4127 5177 5898 6519
1888 6519 6219 5290 4266 2937 1030 -955 -2493 -4012 -5379 -5985 -6049 -5912 -5283 -3884 -2381 -880 995
1905 995 2847 4144 5092 5976 6184 5613 4877 3781 2208 404 -1185 -2759 -4232 -5243 -5730 -5901 -5650
1922e650R57J276J334J668J762J579J232Q77O91J1n11p50j173j504j737j525j422
1939b885j297p64l81j44M92R58J189J334J539J632J361J029P52M54j82m70q64
1956C753j169j517j514j338j322j075n94k64RN63J067J128J289J616J443J108
1972C183R34P91O3k64m77q17j374j416j254j404j330p38m98l26K51P58Q70J002
1990b046J508J510J104J063J028M14o1p8n84j113j165j046j440j363q82o79o12
2007d442q0M79N64P77J285J330J112J164J048P08J90R4k28p86r51j030j232j307
2025a305r80q50p28k58J07L38N58J040J164J095J189J152P45M87K41Kn22o94q41
2044A940j102j178j089r35q58n62j11O1M61P08R01J009J133J122Q44P41N68Q3
$$ plain form
1922 -5650 -4693 -3417 -2083 -415 1347 2926 4158 5035 5726 5737 5226 4476 3303 1799 62 -1463 -2885
1939 -2885 -4182 -4946 -5327 -5471 -4979 -4021 -2832 -1498 41 1673 3034 4063 4815 5269 5087 4617 3753
1956 3753 2584 1067 -447 -1785 -3107 -4182 -4776 -5040 -5031 -4468 -3401 -2273 -984 632 2075 3183
1972 3183 4117 4908 4971 4707 4230 3413 2039 623 -631 -2035 -3365 -4103 -4601 -4927 -4676 -3918 -3048 -2046
1990 -2046 -538 972 2076 3139 4167 4581 4520 4442 3858 2745 1580 534 -906 -2269 -3151 -3830 -4442
2007 -4442 -4522 -4043 -3479 -2702 -1417 -87 1025 2189 3237 3945 4135 4229 4001 3215 2264 1234 2 -1305
2025 -1305 -2285 -3135 -3863 -4121 -4014 -3676 -3118 -2078 -914 181 1370 2522 3267 3754 3995 3997 3475 2781 1940
2044 1940 838 -340 -1429 -2364 -3222 -3784 -3895 -3834 -3373 -2665 -1764 -755 378 1500 2344 3085 3653 3736
2062C736j02m15o92q82r83j137r98q81o43m78j59K04M15O81Q86J043R23R96Q03
2081B317N72L21J56j33n59o10p91r97j058p89p51n62l94P0J74L69P78Q60Q02R91
2101G66R52O58L95M54k6l66m17o06q92r58p85p20q07m37j30j40K33O32O42O36
2121i16Q93R13O84N39N90K25j32k07l47p38q86o22q34p97n19l10l20K8L96L94
2141a966M72Q48Q21O80O64O14L25R3q5j55n21o31n69p66p84n92m05l59k10J91
2161b335K68L27O80P13O27O28O86M37K38O3k8l35n18m08o63p95n56n65l59l72
2181b267m4J46J94M96N46O92O20O19N15M30J87P3q5l24l85n02n69o72n88m56l84
2202a758k85j0J34K37L95N46N99M04N69N29K73J53K03k06k84m21l44o48n82l77
$$ plain form
2062 3736 3634 3219 2527 1645 662 -475 -1473 -2354 -2997 -3475 -3634 -3430 -3015 -2334 -1448 -405 518 1514 2317
2081 2317 2889 3210 3366 3233 2674 2064 1273 276 -782 -1571 -2322 -2884 -3278 -3208 -3034 -2665 -1887 -1027 -225 766
2101 766 1718 2376 2771 3225 3199 2833 2416 1810 918 -40 -825 -1545 -2352 -2789 -2919 -3059 -2826 -2194 -1552 -916
2121 -916 -23 890 1574 2113 2703 2928 2796 2589 2242 1504 618 -4 -838 -1635 -2154 -2464 -2784 -2756 -2360 -1966
2141 -1966 -1494 -646 175 855 1519 2133 2458 2551 2466 2311 1790 1159 590 -176 -960 -1552 -1957 -2316 -2526 -2335
2161 -2335 -2067 -1740 -1060 -347 280 908 1594 2031 2269 2332 2304 1969 1451 1043 380 -415 -971 -1536 -1895 -2267
2181 -2267 -2311 -2165 -1971 -1475 -929 -237 383 1002 1517 1947 2134 2207 2122 1798 1413 911 342 -330 -918 -1374 -1758
2202 -1758 -2043 -2053 -1919 -1682 -1287 -741 -142 262 831 1360 1633 1786 1989 1783 1499 1078 734 86 -496 -873
2222h73l79m39j75J50Q2J45N25M47L77N99N52L54J25K72N7k53l15k27n28o47l17
2243d68l60n14k54Jk1pL12N23K69M07O33L78J69L34K37j10j59r2l55n50l10m28
2265c65m93m32J0j06j29K10K92K00L13N59L73K25L16L40J6j04J9k27m00k69k53
2286I5m58m59r1j83j89O8K27J08J44M98L83J95K78L41J56j7L3n5k33k89k29l73
2308e0l83l43r1j95j10K6J59J40K26L49L25K37L28K92Q4O5L8l2k98k14j60l41
2330E2m25j09j91k63j39J01J12o0L40L30J16J92L95L17p6O6K41k07j87pj38m74
2352a4k09n0l44k19N9K3j15R9L28J76M9M08K77L3J05K93j0k30jj5l65l01n1j84
2376b58l56j06N5j90qK73J41m0K86L66J01J12L00J42j04O6Q6k80k77k6j86m36
$$ plain form
2222 -873 -1252 -1691 -1866 -1716 -1634 -1489 -964 -517 -140 459 1011 1365 1490 1762 1819 1566 1251 1024 496 -151 -468
2243 -468 -828 -1342 -1596 -1595 -1616 -1623 -1311 -788 -519 -112 521 899 1068 1402 1639 1529 1370 1278 923 373 63 -365
2265 -365 -858 -1290 -1280 -1386 -1515 -1305 -1013 -813 -500 59 432 657 973 1313 1329 1225 1244 1017 617 348 95
2286 95 -363 -822 -913 -1096 -1285 -1217 -990 -882 -738 -240 143 338 616 957 1113 1096 1129 1074 841 552 323 -50
2308 -50 -433 -776 -867 -1062 -1172 -1146 -987 -847 -621 -272 53 290 618 910 994 1059 1097 1065 767 553 393 52
2330 52 -373 -482 -673 -936 -1075 -974 -862 -922 -582 -252 -136 56 451 768 692 758 999 792 605 598 460 -14
2352 -14 -223 -273 -617 -836 -777 -754 -869 -770 -442 -266 -217 191 468 501 606 899 889 659 658 643 278 -23 -74 -258
2376 -258 -614 -720 -665 -855 -863 -590 -449 -489 -203 163 264 376 676 818 714 780 866 586 309 283 97 -339
2398c39j16%k43j37J21L5J1J65L14J08Q6L40K36K3J4J75k2k55j4r6k99k14j19
2421b26j66k38o3O6o3n2K03K27O1J69L63J76j7J90J48j05j29nj40k64j81l3l26
2444d05k63QJ7j10JL07J26O2K84K44J29M3L59N7j66J6N1k84k80j00j34l94j80
2467f12jj84j50J50J91r0J91M15J70L9M49K51j66Q1K49j36l54j0j39m78l23R1
2489c66k73k51L9J52j01L2L90K16N9L38M09m6O4L38Ql13j18J6l46m18n0k22l95
2512h38j10J76r9j78L73K65J79J65M43K38K7K93J28p5j55k2k59m17j57k43l34
2533f00l10m7j8j15P3L40J55K05L84L37J32J98K94Q1j42M6o8m18k82j71l02m98
2555g26j87l1j72j00K34J91J25K88M31K94J18L74L29l7j18J08k00m07k33k12m50
$$ plain form
2398 -339 -455 -455 -698 -835 -714 -679 -668 -503 -189 -81 5 345 581 604 618 793 771 516 502 406 107 -107 -226
2421 -226 -392 -630 -693 -627 -690 -742 -539 -312 -251 -82 281 457 440 630 778 673 544 539 399 135 -46 -79 -405
2444 -405 -668 -660 -643 -753 -752 -445 -319 -257 27 271 400 443 802 859 693 709 760 476 196 96 -38 -432 -612
2467 -612 -613 -797 -947 -797 -606 -696 -505 -90 80 119 568 819 653 734 983 847 493 483 344 -134 -457 -366
2489 -366 -639 -890 -851 -699 -800 -768 -378 -162 -103 235 644 598 662 1000 1008 695 577 593 247 -171 -221 -443 -838
2512 -838 -948 -772 -871 -1049 -676 -411 -232 -67 376 614 641 934 1062 987 832 810 551 134 -23 -266 -600
2533 -600 -910 -957 -975 -1090 -1017 -677 -522 -317 67 404 536 734 1028 1109 967 1013 945 527 245 74 -228 -726
2555 -726 -913 -944 -1116 -1216 -982 -791 -666 -378 53 347 465 839 1168 1131 1013 1121 921 514 281 69 -381
2576c81l87lk65k65N0K77R7K09M35M87Q9K56N41N4j06J32l3m05l30j27m30n13
2598f18j41j73m07j35L13J60q2M22N60J82L11N26K42n5K03J16k94l74q5k98o44
2619b71k60j44m07k83O3J63n0J90N61L15K01M43M55Q1J41K32r8l29j71k14m82
2640A36m63k13l46l89j03R4n1R0M11M22K63M35M91K65R4K73J26k22k43j46l63
2661E61n62l86k28m43l98jO8o8K25M25L71L11N55M98J76J64L22j2k93j05k31n42
2683D07n14j85m92n42j81O0j70J13M36L38K39M83O58K32K22L67J42j68j08r5m50
2704G92n61l03m03n35l58Lo5k69L17M69K03L41O39M94J28M36L98j06j38M9l40
2725A191o10m51k75o28n45p2j42l00J06M68K03K25O81N68L18L88N33M6m0K1j50
$$ plain form
2576 -381 -768 -771 -1036 -1301 -1251 -974 -877 -668 -233 254 343 599 1140 1194 1088 1220 1187 782 452 325 -105 -618
2598 -618 -759 -932 -1339 -1474 -1161 -1001 -1083 -661 -101 81 392 918 1160 1105 1308 1424 1130 756 671 373 -271
2619 -271 -531 -675 -1082 -1365 -1302 -1139 -1189 -999 -438 -123 78 521 976 1057 1198 1430 1332 1003 832 618 136
2640 136 -327 -540 -886 -1275 -1378 -1284 -1335 -1245 -834 -412 -149 286 777 1042 1136 1409 1535 1313 1070 924 561
2661 561 -1 -387 -615 -1058 -1456 -1457 -1389 -1457 -1232 -807 -436 -125 430 928 1104 1268 1590 1578 1285 1180 949 407
2683 407 -107 -292 -784 -1326 -1507 -1447 -1617 -1504 -1068 -730 -491 -8 650 882 1104 1471 1613 1445 1337 1242 792
2704 792 231 -72 -475 -1010 -1368 -1365 -1430 -1699 -1382 -913 -710 -369 270 764 892 1328 1726 1620 1482 1531 1191
2725 1191 581 130 -145 -773 -1318 -1390 -1532 -1832 -1726 -1258 -1055 -830 -149 419 737 1125 1658 1704 1664 1685 1535
2746A535n28m46l37m99o14l81j40l42j23L13K64J91M95O66L98K84N97M15p3k8
2766A647M6l22m82m12l90o05n63k61k03l64R9L15J10L41O10N29L58N42N75J46
2786A716J9Q2j04m63m70l54n32p09l56k27m28j49K60J59J10N88O59L82M37P13
2806A333M10o6J81Q9k78n57l09m23p61n00k57m82l75J4K21M0L55P09M94L67O16
2827H21N87K43J26J81L1n45k63l76o97o56l96l31n67r7J81o3J56O33N90L33O04
2848D95P01L01J62L12R4l48k72l09o01o92m27m31n47m21m8Q7K4L61O15M10M83
2869e1P51N39L51K84K73o1l92j66l86p29o11m05n82n95j21o6o3J26N63M24L93
2890e24O36P26L85L50L88J85k70j93k02o09o66n22l75p16m72j1j00j0K82N32L30
$$ plain form
2746 1535 1007 561 224 -275 -889 -1270 -1410 -1752 -1875 -1562 -1298 -1107 -612 54 452 736 1333 1748 1675 1647
2766 1647 1693 1371 889 477 87 -518 -1081 -1342 -1545 -1909 -1810 -1495 -1385 -1044 -434 95 453 995 1570 1716
2786 1716 1735 1817 1713 1250 780 426 -106 -815 -1171 -1398 -1826 -1975 -1715 -1556 -1446 -858 -199 183 620 1333
2806 1333 1743 1677 1858 1947 1669 1112 803 380 -381 -881 -1138 -1620 -1995 -1981 -1760 -1720 -1365 -656 -162 205 821
2827 821 1408 1651 1777 1958 1989 1444 1181 805 108 -548 -944 -1275 -1842 -1939 -1758 -1821 -1665 -1032 -442 -109 495
2848 495 1196 1497 1659 1971 2065 1717 1445 1136 535 -157 -584 -1015 -1562 -1983 -2031 -1944 -1920 -1559 -944 -534 -51
2869 -51 700 1239 1590 1874 2147 2086 1694 1528 1142 413 -198 -603 -1185 -1780 -1901 -1967 -2030 -1904 -1341 -917 -524
2890 -524 112 838 1223 1573 1961 2146 1876 1683 1481 872 206 -316 -691 -1407 -1879 -1890 -1990 -2000 -1718 -1186 -856
2911h56M98Q16N28L50M41M09j10k11q7l68p81n18m48o42o24k23r1l13J49N73K86
2932a222L51P58P53M27L99O17P0k24K7k50o24n86l53o46p45l58k65k41j17L07
2952a922L51L13O65P69M62M55O13L83p2o8Q5m97n68m44n04q04n75k23l65k61J65
2973b042L19K50L97P06N81M68O25O08Q0J8R2k29m89n43m58o93p19m46k65m08q6
2994b234K46K73K63O21P12M92N21O62L76Q6J06P1m35n53m07n46p96n89l02m47
3014a880l43J30J84J39M31O88N81M57P03O20J62J09K05j53n04l72l68p64p42m40
3034a157l58n14j93K26N8J85O86N85M85N97P51L52J40L17P2l84m47k38n99q60
3054b96m83m28o10l06M4M5K9N21N74M89M89Q21O20K09K97K24j56l48l00m06p66
$$ plain form
2911 -856 -358 458 986 1336 1777 2186 2076 1865 1778 1410 629 111 -337 -979 -1603 -1826 -1917 -2230 -2081 -1508 -1222
2932 -1222 -871 -113 640 1067 1466 2083 2153 1929 1956 1706 1082 496 143 -503 -1248 -1606 -1871 -2112 -2229 -1922
2952 -1922 -1571 -1258 -593 176 638 1093 1706 2089 2017 1949 2034 1537 969 525 21 -783 -1358 -1581 -1946 -2207 -2042
2973 -2042 -1723 -1473 -1076 -370 211 679 1304 1912 1992 2010 2102 1873 1384 841 383 -310 -1029 -1475 -1740 -2148 -2234
2994 -2234 -1988 -1715 -1452 -831 -119 373 894 1556 1932 2018 2124 2195 1760 1207 800 254 -542 -1131 -1433 -1880
3014 -1880 -2223 -2093 -1909 -1770 -1339 -651 -70 387 1090 1710 1872 1981 2186 2033 1529 1157 789 25 -717 -1157
3034 -1157 -1515 -2029 -2222 -1996 -1938 -1753 -1067 -482 3 600 1351 1703 1843 2160 2232 1848 1401 1163 564 -296
3054 -296 -779 -1207 -1817 -2123 -2079 -2034 -2005 -1484 -910 -421 68 889 1509 1718 2015 2239 2083 1735 1435 1029 263
3075B63n89n09n78n15j25p6q8L00N82M75M15Q04O63L49M04M18O6k65k54k58o82
3096H00o87m98n17o31m32q9r3M5M03M52M86N91P65N62K88M76L16j13k40j48m87
3117A249p15n79m42o91n63k32j24j38J64N48L72M21P46Q21L54M42N00J27k14j42
3137A904k15o01o93l64o65p27m22j53j79j44L50M74L27N99Q03N19L81N30M13m2
3157B095n0r9m45o58m99m71p49n87k40k95l02J39M76K11M81P66O86L35O53N08
3177A955Q0lJ5j83o40m47m98o49p25l25l83l56rK50J93K99O57P85M29N02O73L32
3199A952P2J35o8l84n43l96n98q17m79l90m16l17J16J55J96M99P60N53M37O54
3219A121N99J75J97R4k21m52l55m63o89p29m36m33m75p7R3K26K25N59O37M54N73
$$ plain form
3075 263 -326 -835 -1413 -1928 -2053 -2129 -2217 -1917 -1335 -860 -445 359 1022 1371 1775 2193 2259 1994 1740 1482 800
3096 800 113 -385 -902 -1533 -1965 -2054 -2147 -2102 -1699 -1247 -761 -170 595 1157 1445 1921 2237 2124 1884 1736 1249
3117 1249 534 -45 -487 -1178 -1741 -1973 -2097 -2235 -2071 -1523 -1151 -730 16 837 1191 1633 2133 2260 2046 1904
3137 1904 1689 1088 395 31 -634 -1361 -1783 -1936 -2115 -2259 -1909 -1435 -1108 -509 294 813 1194 1724 2137 2095
3157 2095 2045 1946 1501 843 344 -127 -876 -1463 -1703 -1998 -2300 -2161 -1685 -1474 -993 -227 459 794 1447 1955
3177 1955 2035 2032 2047 1864 1224 777 279 -370 -1095 -1420 -1803 -2159 -2168 -1918 -1725 -1426 -769 16 445 947 1620 1952
3199 1952 2024 2159 2091 1707 1164 768 170 -647 -1126 -1516 -1932 -2249 -2133 -1978 -1782 -1283 -523 30 467 1121
3219 1121 1720 1895 2092 2186 1965 1513 1158 695 6 -723 -1159 -1592 -2067 -2144 -2051 -1825 -1600 -1041 -404 50 623
3240F23P23L10K31K71ll76m01l30o08p81m83m00n47l39L3L2J18L94P15M44N19
3261A45P74N63K54L16J74j77l22k92n00p12n89m43o01n12j58R7p3J75O38M89L95
3282c59P29O94L61L65L37K7k80j82k31p25p25l60o14o89k98J6k04P6M49M27M86
3303g00O00P67M39L37M49K71j70o7k98m21p14m96n01p52m44j95j42j34K30M64
3323a477M18M91O85O20L67N47M13M2j57m0k31p53n58m97o30o62k95j91k93RM50
3344a742L00L73O14P86M46M76N31K94k2k1j06n18n35n24n60o91n87k17k51k81
3364b235K11L26L18L81Q25O04L82N10O30jM9J7j77o23m84n24p06o37l53l13l78
3385b178J2K39K68K79O80O76N19N11O39L14N6J17k9m83m96m30n98p64n41l52l90
$$ plain form
3240 623 1346 1656 1887 2158 2155 1779 1378 1048 440 -341 -824 -1224 -1771 -2110 -2077 -2045 -1927 -1533 -818 -374 145
3261 145 919 1482 1736 2052 2226 2049 1727 1435 935 223 -366 -809 -1410 -1922 -2080 -1983 -2056 -1881 -1243 -754 -359
3282 -359 370 1064 1425 1790 2127 2154 1874 1692 1461 736 11 -349 -963 -1652 -1950 -1934 -2138 -2062 -1613 -1186 -700
3303 -700 -100 667 1106 1443 1892 2163 1993 1926 1628 1207 493 -3 -504 -1256 -1700 -1895 -2037 -2171 -1941 -1477
3323 -1477 -1059 -568 117 737 1104 1651 2064 2106 1949 1909 1678 925 367 -130 -760 -1422 -1717 -1908 -2201 -2192 -1742
3344 -1742 -1442 -1069 -455 331 777 1253 1784 2078 2056 2035 1929 1411 876 352 -208 -899 -1486 -1703 -1954 -2235
3364 -2235 -2024 -1698 -1380 -999 -174 430 812 1322 1952 1951 2000 2017 1840 1217 733 209 -497 -1134 -1487 -1800 -2178
3385 -2178 -2166 -1927 -1659 -1380 -700 -24 495 1006 1645 1959 2015 2132 2103 1620 1124 694 96 -668 -1209 -1561 -1951
3406a951k95J60K48J02N27P21N31N16O45N51R2K08J05j98m41l42n89p63o03m50
3426a226m26m12o1J03O2L13O70O03N22N89O86L18K15K21J6l76l73m32o01p62m95
3447h46m24n16m00P5L8J56M75O23N19N89P17N20J74L42K12j94l41l91m45p34o26
3468d77m86n14n17j49L6k1K96N39N67M76P00O48M38K84L66J10l39k66l82o07p04
3489bm94n22o66l16r0m2M1M56N27L99O11P61N46K98M70L16j85k26k32m92p07n38
3511h7n16o97m87j59j75n3K07N54L26N56P76N67M62M23N35j9j61p7l60o97n35
3532C83n01o41o87l41j93k86K7M38L44L64O97P70M55M72N56K51l7J6j84m57o22
3553H24m47n98p52n36k62l02k07J89L64K77N78O97O73M22N10N63J12m1oj93o27
$$ plain form
3406 -1951 -2246 -2086 -1838 -1736 -1209 -488 43 559 1204 1755 1847 2055 2160 1962 1521 1179 590 -173 -776 -1226
3426 -1226 -1652 -2064 -2125 -2022 -1960 -1647 -977 -374 148 737 1423 1741 1956 2177 2193 1817 1444 1012 411 -351 -846
3447 -846 -1270 -1786 -2186 -2111 -2073 -1917 -1442 -819 -300 289 1006 1526 1700 2042 2254 2060 1719 1328 883 149 -477
3468 -477 -963 -1477 -1994 -2143 -2107 -2128 -1832 -1293 -726 -250 450 1098 1536 1820 2186 2296 1957 1691 1309 702 -2
3489 -2 -496 -1018 -1684 -2000 -2090 -2132 -2091 -1635 -1108 -709 -98 663 1209 1507 1977 2293 2108 1882 1650 1158 451 -87
3511 -87 -603 -1300 -1787 -1946 -2121 -2174 -1967 -1413 -1087 -531 245 812 1274 1697 2232 2213 2052 1975 1615 918 383
3532 383 -118 -759 -1446 -1787 -1980 -2266 -2239 -1801 -1457 -1093 -396 374 829 1301 1857 2108 2071 2087 1903 1446 824
3553 824 377 -221 -973 -1509 -1771 -2073 -2280 -2091 -1727 -1450 -872 -175 498 920 1430 1993 2105 2064 2058 1865 1238
3574A238m85n30o81p24k98l50l65n5K73K61L56O81O12N59O32N70K86J12N6n1m80
3595A617m69m38o04q22m84l40m82k09Q7K12K21M31P80N44M85P82N25J27J91Q2
3615B236k16m54m13n52p36o37m17m79m62q6J70J46L16O06N79M80O67O51K71L10
3635A980K31l7l80l47l75o90p40m69m86n54k64J31r4J90N07N59N28N99O93N22
3655A504K85K32K57k52k39l76n05o91n99n41n34m88j08j8nK30O47M35N13P32O32
3676A111M20L07L40n2k79j43l85o54o58m84n69o12l11r4n3J6M37N64M49N73P64
3697F87M91L55M61J86p2k53k31m73o98n04n10o98m78k18j10r9K36N07L68N33P42
3718B22N43M50N00L82Q7j52j36l68o28o23m42o49o21l55j84k25M3M41L06L70P03
$$ plain form
3574 1238 753 223 -458 -1182 -1480 -1830 -2195 -2250 -1977 -1716 -1360 -679 -67 492 1124 1694 1980 2092 2148 2097 1617
3595 1617 1148 710 106 -716 -1200 -1540 -2022 -2231 -2144 -1932 -1711 -1280 -500 44 529 1311 1836 1963 2154 2236
3615 2236 2020 1566 1153 601 -135 -772 -1189 -1668 -2130 -2216 -2046 -1900 -1584 -978 -399 81 748 1399 1670 1980
3635 1980 2211 2174 1794 1447 1072 382 -358 -827 -1313 -1867 -2131 -2000 -2094 -1904 -1397 -838 -310 289 982 1504
3655 1504 1789 2021 2278 2026 1787 1411 906 215 -384 -925 -1459 -1947 -2055 -2073 -2078 -1848 -1201 -766 -253 479 1111
3676 1111 1531 1838 2178 2126 1847 1704 1319 665 7 -477 -1046 -1658 -1969 -2063 -2116 -2100 -1663 -1099 -650 -77 687
3697 687 1178 1533 1994 2180 2108 1855 1624 1151 453 -51 -561 -1259 -1737 -1955 -2065 -2164 -1928 -1421 -1053 -520 222
3718 222 765 1215 1715 2097 2184 2032 1896 1528 900 277 -165 -814 -1435 -1790 -1974 -2199 -2156 -1715 -1409 -1039 -336
3739c36P09N18M48N98K19j72K6j28n12n84m50n69p82m35k84l29j18K36K37K64
3759a444N72P92N36M35N72M68J19ml4l29n22m69n14p05o29l85k89l12nK66K42
3780a639L92O63O31N29N96M77K87J24R2j55m35m41m95o29p41m65l53m32k09R9
3800b104K13K45M84O89N97M26P32M25K60J53rj92n04l59n75p28o00m02m17l81
3820b047n5J41R5L51O11N89M57O66N99L40J61K28n7l76l54l52o90o95m85m46n36
3841a855k14K3O9J37M96O04M97N03P48M26K86L14J31k38l19k62o27o58n48m84
3861i71n01m52j35M2J3K94O22M52M69O79O76L47K84M04p3l03k03l71p04o04m82
3882e17n91n23k90n9j32J62L85N20M09N93P05M71L38M27J62q2r9l34m92o79m92
$$ plain form
3739 -336 373 891 1339 1937 2156 1984 2010 1882 1370 786 336 -233 -1015 -1450 -1734 -2063 -2181 -1945 -1708 -1444
3759 -1444 -872 -80 456 891 1463 1931 2050 2046 2012 1683 1161 692 178 -527 -1156 -1541 -1830 -2142 -2147 -1881 -1639
3780 -1639 -1247 -584 47 576 1172 1649 1936 2060 2152 1997 1562 1121 626 -3 -744 -1209 -1562 -1994 -2203 -2104
3800 -2104 -1891 -1646 -1162 -473 124 550 1282 1707 1967 2120 2111 1919 1415 1056 481 -247 -847 -1249 -1666 -2047
3820 -2047 -2102 -1961 -1866 -1515 -904 -315 142 808 1407 1747 1908 2136 2079 1703 1349 997 307 -388 -873 -1319 -1855
3841 -1855 -2069 -2046 -1977 -1840 -1344 -740 -243 260 1008 1434 1720 2034 2165 1927 1608 1346 719 61 -487 -971
3861 -971 -1472 -1924 -2059 -2017 -2004 -1710 -1088 -636 -167 512 1188 1535 1819 2223 2150 1847 1644 1273 569 -35 -517
3882 -517 -1108 -1631 -1921 -1980 -2112 -1950 -1565 -1045 -636 -43 662 1133 1471 1898 2060 1978 1879 1545 1053 374 -118
3903a18n49n89m28j86j25j44L58L48M56N22O91N73M14M83L45L2j48j40l26n61
3923I08n61m75o74o03l22j45k36P1L67L65L51N83P23M41M58N62K59j12l1q7n20
3944A322n76m28o28p18l91k86k75j62K18L68K60N48O93N12M40N86M11N8Jpk49
3965A697n77m50m64p62n78l38k68l49K8K72J93L54O28O48M08O35N65J99L8J61
3985B040j43m54m24m35p30o00m05m44l10k23J48J96K02N77O49M13O08N89M29K02
4005A885J65O4l22m22l90m86p06o35l71m25l57l5J59K3L91O21N62M44O57N47K89
4026A658K23J82j08l38l29l78p28o39l90m76n02j74J10lJ23M84N94N02N23P49
4046A083L78K30L10Q9k07l10l25n29o78n11m49o10l77p6O5m5L45N19M73M36P46
$$ plain form
3903 -118 -667 -1256 -1684 -1870 -1995 -2139 -1781 -1433 -977 -455 236 809 1223 1706 2051 2083 1935 1795 1469 908
3923 908 347 -128 -802 -1405 -1727 -1872 -2108 -2037 -1670 -1305 -954 -371 352 793 1251 1813 2072 1960 1929 1842 1322
3944 1322 746 318 -310 -1028 -1419 -1705 -1980 -2142 -1924 -1556 -1296 -748 -55 457 897 1483 1894 1952 1953 1946 1697
3965 1697 1120 670 206 -556 -1134 -1472 -1740 -2089 -2061 -1789 -1596 -1242 -614 34 442 1077 1642 1841 1879 2040
3985 2040 1897 1443 1019 584 -146 -746 -1151 -1595 -1905 -2128 -1980 -1784 -1582 -1005 -356 57 665 1254 1683 1885
4005 1885 2050 2114 1792 1370 980 494 -212 -847 -1218 -1643 -2000 -2035 -1876 -1853 -1462 -841 -279 165 822 1369 1658
4026 1658 1881 2063 1955 1617 1288 910 182 -457 -847 -1323 -1825 -1999 -1889 -1892 -1769 -1285 -691 -189 334 1083
4046 1083 1461 1691 2001 2090 1883 1573 1248 719 41 -470 -919 -1529 -1906 -1982 -1917 -1962 -1617 -1098 -625 -189 557
4067E57O00K89M03L01j06k79k93k95o27o77m09n45n53k30k3j17P1N50M22L83O54
4088G6O84M38L48M04J32j84j59k42n58o24m55m93o25m13j52j56n2K71M15L88N91
4109c66O73N40M19L43L62L6j20j37m05n49n53m77o52n23k40k05j86P6L38L03M48
4130h75O75O50M17M83M82J18M7n6k11n06n82m29n98o43m39k36k84j19L15K28L15
4151a248N08P10M33N19N54L33J31p0M2l55n03m52m94o93n47k98l86k73J53J68
4171a768K73M05O37N81M33N41N16J83J19Q3j13n03m10m72n89p26l52l73l81j04
4191b020O5K42K58N11O15N32M38O42L82J63J50nk17m57l52n80o73n56m27l71l28
4212a988O8Q5R7M20N88N29N24N87M74K68K27J90j62k91l71m83o07n90m79m08m99
$$ plain form
4067 557 1157 1446 1849 2150 2044 1765 1472 1177 550 -127 -536 -1081 -1634 -1864 -1887 -2004 -1933 -1383 -961 -578 76
4088 76 760 1198 1546 1950 2082 1898 1739 1497 939 315 -140 -633 -1258 -1671 -1823 -1979 -2031 -1760 -1345 -957 -366
4109 -366 307 847 1266 1609 1971 2007 1887 1750 1345 796 243 -234 -886 -1409 -1649 -1854 -2040 -1964 -1626 -1323 -875
4130 -875 -200 450 867 1350 1832 1950 1997 1941 1730 1224 642 213 -385 -1028 -1467 -1703 -1987 -2106 -1791 -1563 -1248
4151 -1248 -740 -30 403 922 1476 1809 1940 1870 1912 1557 1054 602 108 -585 -1132 -1430 -1816 -2089 -1936 -1768
4171 -1768 -1495 -1090 -453 128 561 1102 1618 1801 1920 2003 1890 1387 977 505 -84 -810 -1162 -1535 -1916 -2020
4191 -2020 -1955 -1713 -1455 -944 -329 203 641 1283 1665 1828 1978 1973 1756 1299 947 367 -306 -862 -1289 -1660 -1988
4212 -1988 -1920 -1835 -1738 -1318 -730 -201 323 910 1384 1652 1879 2069 1907 1616 1245 762 155 -435 -914 -1322 -1821
4233a821j70L6Q8K14N04N25M20N89O68M27J74K70J08k51k93l31n23o69n15m11
4253i61n24m34j0MP2L85M55M91N19O11N54K95L15K57n1k98k14m14n72o17m61n05
4275a103n75j52q9J1O3M89M37L69O59O28M66L43L02J69j94k00k47n10n65n07m36
4296f42n89m32j31q4m5L06M07L48N44P33M41L94L41L40n2j12j39l80o05m66m99
4317c22n32o18j48k29j05P4L47L34M89N84O63M06M09L94J12J2j71j48n11n23m15
4338A02n32o28l75j80k78o7L01K90K72N93N80N02M15M50L97rL2p7m11m90l92n42
4360d7o01n72k30l25j35N3K23K59M42N89N81L97M26N26K12K5kj31m57m48l93o33
4382b41n58l47l94k87j06K03J89K73N05O09M17N08N69L74J9J54l2k65m52l79n06
$$ plain form
4233 -1821 -1991 -1955 -1867 -1653 -1149 -624 -204 385 1053 1480 1654 1924 2032 1781 1488 1157 634 -35 -550 -961
4253 -961 -1485 -1919 -1929 -1925 -1853 -1468 -1013 -522 -3 608 1162 1457 1772 2029 1978 1680 1466 1052 480 -137 -598 -1103
4275 -1103 -1678 -1830 -1919 -1908 -1845 -1356 -919 -550 109 737 1203 1546 1848 2017 1823 1623 1376 866 301 -206 -642
4296 -642 -1231 -1663 -1794 -1878 -1923 -1617 -1210 -862 -318 415 856 1250 1591 1931 1879 1767 1628 1248 643 177 -322
4317 -322 -854 -1472 -1620 -1849 -1954 -1880 -1533 -1199 -710 -126 537 943 1352 1746 1858 1870 1699 1551 1040 517 102
4338 102 -430 -1058 -1433 -1613 -1891 -1958 -1657 -1367 -1095 -502 78 580 995 1445 1842 1833 1865 1788 1377 887 495 -47
4360 -47 -648 -1220 -1450 -1775 -1910 -1857 -1634 -1375 -933 -344 237 634 1060 1586 1798 1823 1821 1690 1233 785 392 -241
4382 -241 -799 -1146 -1540 -1827 -1933 -1730 -1541 -1268 -763 -154 263 771 1340 1714 1733 1887 1855 1590 1138 759 253
4403B53o87m91l35l97k73Q5J89J04M09N53M74M42N83N55J42J27J69j66l62l30
4423A044m63n62n28m45l78l74j24M5R9K47M80N00M43N32O49K21K64J61Q6l10k88
4444A299k95n53o31m17m44m83k60n7O2J13L56N04L78N40O30M43L43K00K07j47
4464A788k17k77m65n68m95m75m60m51j42P6o4K07M08L86N37N68M94L62K77K98
4484A787J17k25k40k57n23n86m14m87m84l04p0r4mL26M14L74M98O13N08L20L62
4505A631J92j4j98k55l03o22m56l84n82m56j44q7j26J76L69L24M56N60M89M13
4525I83L89L61Q6j60l5k71n08m61m15n67n55l16j81j27j07L33L57L05M84O44M39
4546F78L74M14K32L0o5q7l84n29l60m93n19n03k35k14j93J59K98K30M76N66M57
$$ plain form
4403 253 -434 -925 -1260 -1657 -1930 -1845 -1656 -1552 -1143 -590 -116 326 909 1464 1606 1733 1902 1736 1374 1044
4423 1044 581 19 -509 -954 -1332 -1706 -1830 -1785 -1686 -1439 -959 -459 -16 516 1165 1386 1650 1811 1897 1587 1299
4444 1299 1004 451 -180 -597 -1041 -1524 -1784 -1841 -1779 -1666 -1310 -806 -428 112 742 1185 1528 1728 1935 1788
4464 1788 1571 1294 829 261 -234 -709 -1169 -1620 -1762 -1686 -1750 -1543 -1135 -749 -212 356 850 1212 1489 1787
4484 1787 1904 1679 1439 1182 659 73 -341 -828 -1312 -1616 -1686 -1780 -1784 -1458 -1044 -670 -172 441 949 1269 1631
4505 1631 1823 1809 1611 1356 1053 431 -25 -409 -991 -1447 -1591 -1678 -1804 -1628 -1259 -935 -479 81 570 983
4525 983 1372 1733 1819 1659 1624 1353 845 384 -31 -598 -1153 -1469 -1650 -1777 -1884 -1551 -1194 -889 -405 239 678
4546 678 1052 1466 1698 1728 1663 1576 1192 663 303 -190 -709 -1212 -1447 -1661 -1854 -1695 -1397 -1167 -691 -125 332
4567C32M13M27M66J05k8j4j98m20m52m09n79n77k93k99l08qJ67K08L66M57N51
4588i3N24L90N24K56P1M8p1k15n31l01n39o21m27k65l78k22J31J49K31L55N99
4609c85M35M07N45L95K12P7J22k73l18l84m08n38n19l77l49l44q4J10J31K82M50
4630h13N80L60M99N71K25J68J70j8k87l72k87n01o48l95l33m08j94K8J16L1M08
4651a100M65M43N02N36L59K31K04J14j06k78k69l98n95n21l62m26l76r8K1J3K29
4672a412M64M03M09N36N64K35K46K94J8k61k23l36m38n99l52m57m00k22j05k8
4692a664J18L01M47L71M73O21L08K90L64J06j58j57j88l74n56m41m26m36l83k11
4712a595p9l9J85M36L98K86O10M92L18L76K78K1j57j01k84n20m04m12m63n62j82
$$ plain form
4567 332 745 1172 1638 1743 1715 1701 1503 1083 631 222 -357 -934 -1227 -1526 -1834 -1842 -1675 -1467 -1101 -644 -93
4588 -93 431 821 1345 1601 1672 1720 1649 1434 903 602 63 -558 -985 -1250 -1628 -1850 -1719 -1570 -1339 -984 -385
4609 -385 50 457 1002 1397 1609 1686 1808 1535 1217 833 425 -113 -632 -1009 -1358 -1702 -1786 -1676 -1545 -1263 -813
4630 -813 -233 127 626 1197 1422 1590 1760 1742 1455 1083 796 295 -353 -748 -1081 -1489 -1683 -1655 -1539 -1508 -1100
4651 -1100 -635 -192 310 846 1205 1436 1640 1754 1648 1370 1101 703 108 -413 -775 -1201 -1577 -1675 -1654 -1641 -1412
4672 -1412 -948 -545 -136 400 964 1199 1445 1739 1757 1496 1273 937 499 -100 -452 -909 -1309 -1531 -1636 -1664
4692 -1664 -1546 -1245 -798 -427 46 667 975 1265 1629 1735 1577 1420 1232 858 302 -139 -565 -1001 -1384 -1595
4712 -1595 -1674 -1713 -1528 -1092 -694 -408 202 694 1012 1388 1666 1687 1530 1429 1145 625 221 -191 -654 -1216 -1398
4733a398j43q3J8K86K99K69N32O34M24K40M06J92l7j31p6m03m84m24m18n33l85
4754a215k32j83r8J52L32K88L22O17M49M00L62L68O3k4q2k49m06m52k98o40m67
4775i93k93j55j61l5K03K66L16M74M98M07M09M27J43L5N2j02l81l89l72m72n46
4796f69l56k70k48j39P7K21K36M15M80M83L21N22L05J36R0J7k62l71l20m25m97
4817b54n40k25l19k25o8J61J37L31M17M78L86L65N36K34R5Q7n0k75l60l05m92
4838A14n79l15l49k72k15L5J41J11M35M34M30M18M87L13J78J41P7j53l26k71l62
4859D72n41m47l32l38l02m3N0K4K87M49M09L35N73L96K60J44J57J5k32k72l06
4880G58m38n05m00l37l67k17%J3Q8L77M44K85M62N43L19J94K52J03j52k02k06
$$ plain form
4733 -1398 -1541 -1624 -1606 -1320 -1021 -752 -220 414 838 1078 1484 1676 1639 1508 1432 1029 545 121 -297 -830 -1215
4754 -1215 -1447 -1630 -1728 -1576 -1244 -956 -634 -17 432 832 1194 1562 1625 1601 1519 1270 864 412 114 -526 -993
4775 -993 -1286 -1441 -1602 -1637 -1434 -1168 -852 -378 120 527 936 1363 1506 1541 1593 1491 1110 721 349 -123 -669
4796 -669 -1025 -1295 -1543 -1682 -1605 -1384 -1148 -733 -253 230 551 1073 1378 1514 1604 1621 1359 988 668 243 -254
4817 -254 -794 -1019 -1338 -1563 -1631 -1470 -1333 -1002 -585 -107 279 644 1180 1414 1509 1596 1546 1271 911 606 114
4838 114 -465 -780 -1129 -1401 -1616 -1581 -1440 -1329 -894 -460 -30 388 875 1188 1366 1507 1584 1431 1105 834 472
4859 472 -69 -516 -848 -1186 -1488 -1531 -1481 -1457 -1170 -721 -312 23 596 992 1252 1396 1553 1568 1336 1064 758
4880 758 320 -185 -585 -922 -1289 -1506 -1506 -1493 -1405 -1028 -584 -299 163 706 1025 1219 1471 1574 1422 1220 1014
4901A014l76n05l86l41m38l21j10m3L4K51L59L25L56N19M31K78K54J71P2j09k05
4922A230l24m09m43m28l61m46j89m0j00R6K47L35L48M69M63L45L01L40Q8p5j47
4943A300j15l49n17l13m76l91k95j70j06l8J60K73K63M23M60M29L43K89K37k2
4963A385L0j28k43m24l55l45m42m82k08q8j99Q0K34J79L22M68M98K90L56L12J98
4984A438m4J8j54l65l68l57m05m73k89j69j88r4J06J75K60L49M96L74L39L63K46
5005A258J32N4j39j81l27l67l46m31m71j86k61k29L6K20R6L11M27M06L11M38K91
5026A042K69K1Q0p1k72l48l20m10m56l11k71k55j16J07M4K53L83L99L43L14M50
5047H75K57J50J04l4j39l25k07l83m88l21l64l00k01n3Q3J32K35M15M03L33L96
$$ plain form
4901 1014 638 133 -253 -594 -1032 -1353 -1463 -1506 -1472 -1221 -862 -537 -181 338 769 1047 1301 1472 1544 1435 1230
4922 1230 906 497 54 -374 -735 -1181 -1370 -1410 -1510 -1414 -1167 -832 -484 -15 448 793 1094 1434 1522 1447 1300
4943 1300 1185 836 319 6 -470 -861 -1156 -1326 -1432 -1470 -1310 -1037 -774 -351 109 538 881 1170 1407 1385
4963 1385 1415 1287 1044 620 265 -80 -522 -1004 -1212 -1300 -1499 -1419 -1185 -1006 -684 -216 282 572 928 1240 1438
4984 1438 1394 1412 1258 893 525 168 -237 -710 -999 -1168 -1356 -1450 -1344 -1169 -909 -560 -64 310 649 1012 1258
5005 1258 1390 1444 1305 1124 797 430 84 -347 -818 -1004 -1265 -1494 -1458 -1238 -1142 -831 -404 2 313 751 1042
5026 1042 1311 1332 1412 1341 1069 721 401 -9 -465 -776 -1047 -1302 -1418 -1311 -1267 -1014 -631 -232 111 425 875
5047 875 1132 1282 1386 1352 1213 888 681 298 -190 -511 -875 -1175 -1376 -1429 -1346 -1214 -979 -564 -161 172 568
5068E68M04K35J16J49j45k16k92k50l82m51l67k59l56r8JO9J52L14L90L19L58
5089B59L93K87K28J45Mr0k15k37l80l95l40l34l51k44l8L9l3K51L61K85L65M72
5111D32L05K48K44J26j5k08j13k79l95m37k61m24l15j59L5p4J21K39L00L45L45
5132F0M45L06K79K07P6r6r0k40l56m46l14l40l01l61j51rj8K15K83K50M13M11
5154B23L38L04K74J93m2p4n1l48l46l16k92l97l89k05j01j16M6L11K16K75M73
5175b4L52K75L22K38J97p2m4j27m08l60k45m10m04k94j51r9q2J94K12K18K89M75
5197E2L44K84K92K24O0m5j9j61m05k84l13m61l52k23j86j42J1K18J90K69L13M52
5219A18L45K58L59J06M1K8j09l10k67l44m06l45l47k00j69j30J29J23K51K92M20
$$ plain form
5068 568 972 1207 1323 1472 1327 1111 819 569 187 -264 -631 -890 -1246 -1344 -1343 -1274 -1122 -808 -418 -99 259
5089 259 652 939 1167 1312 1316 1226 1011 774 394 -1 -341 -675 -1026 -1270 -1308 -1269 -1302 -1051 -690 -405 -40 432
5111 432 737 985 1229 1355 1340 1132 1019 740 345 -92 -353 -777 -1092 -1251 -1216 -1290 -1169 -930 -630 -285 60
5132 60 505 811 1090 1297 1373 1277 1187 947 591 145 -169 -509 -810 -1171 -1322 -1331 -1349 -1134 -851 -601 -188 223
5154 223 561 865 1139 1332 1290 1216 1165 817 471 155 -137 -534 -923 -1128 -1229 -1345 -1299 -988 -772 -497 -24
5175 -24 328 603 925 1163 1360 1288 1244 1117 709 349 104 -306 -710 -1004 -1155 -1254 -1336 -1142 -930 -712 -423 52
5197 52 396 680 972 1196 1256 1211 1192 1031 626 342 29 -432 -784 -1007 -1193 -1335 -1324 -1106 -916 -647 -334 118
5219 118 463 721 1080 1186 1227 1255 1146 836 569 225 -181 -526 -873 -1073 -1242 -1372 -1243 -1120 -869 -577 -157
5240a57L80K44L69K68Q4O8jj91k88k56l46m46l10k18k81j58L5MJ24K67L63L85
5262f1K99L85L07J62J32J03p5l11k87k68m15l67k52k55k87p8N9P1J39L30L25K96
5284d8M13L97K09J29K11oj70k68j91l17m58k83l07l31j61j4L3J3K32L63L60K78
5306H4L93L44J22K07R5p2j36k32k39l35m13l10k74l38j22oj5J41L58K94K34M11
5328A91L65K29K10K10P9j54r3j79m05l68k60l82l59j98Lj18N3K33K87J79L30M49
5350C02L84J77K14J42j7j00j50k54l67l38l71k71k89j71p2k6M6K49K60L36L40
5371B4M07K60K47K20M9r7n9j41k92l74l33l26l79k01j47k0k4J26K63K39L22M11
5393A75K77K81L20J83q1n6k6k49l39l80k07m76k54j54j29k01J26K58J69K65L66
$$ plain form
5240 -157 223 467 836 1104 1188 1256 1255 1064 776 520 174 -272 -582 -800 -1081 -1239 -1204 -1200 -1076 -809 -446 -61
5262 -61 238 623 930 1092 1224 1327 1252 941 654 386 -29 -396 -648 -903 -1190 -1268 -1209 -1138 -999 -669 -344 -48
5284 -48 365 762 971 1100 1311 1305 1135 867 676 359 -99 -382 -689 -1020 -1181 -1195 -1162 -1149 -917 -554 -194 84
5306 84 477 821 943 1150 1245 1173 1037 805 566 231 -182 -492 -766 -1104 -1226 -1232 -1247 -1106 -748 -454 -220 191
5328 191 556 785 995 1205 1284 1130 1037 858 453 85 -175 -557 -916 -1114 -1111 -1229 -1176 -943 -656 -477 -147 302
5350 302 686 863 1077 1219 1202 1102 952 698 331 -7 -378 -649 -938 -1109 -1181 -1207 -1161 -912 -652 -316 24
5371 24 431 691 938 1158 1207 1110 1051 910 618 244 -89 -415 -794 -995 -1142 -1162 -1186 -1060 -797 -558 -236 175
5393 175 452 733 1053 1236 1155 1099 1073 824 485 105 -102 -578 -832 -986 -1115 -1316 -1190 -932 -763 -498 -132
5414a32L80L11K33L06P4j9k6p6l59l03k87l24m23k56r0j55m5J42J80J13L94L47
5436a5K90L29K64K34N3Jjl20l05k38k99m15k42k53j99j05R8J13J55K41L67L65
5458A18K63L43K37R4P6M7j73k15k65k67m20l27k90j25j81r1P7J39J27L27L15L40
5480A49L50K80K26N1R0lj77j98l14l71l77k74j86k27j64k5M8K11K45L11K49L25
5502B19K88L45J14J24J03j12k09k59k40l70k78k62l00j98j45Q8N9J32L60K76K93
5523B8K88L43K18Q5R7P3j47j89k06k97l71l25k35k84j71k1J9N5K68L31K39K89
5545H7L28L64J26J97Q0j35j13j99k46l00l20k46l57k09r8K6nN7K81K85K50L50
5567B03L04K01J70K15M7r2j83j16l78k78l22l05l30j24l8r5M0J80K94K56L03L60
$$ plain form
5414 -132 248 559 792 1098 1172 1153 1127 1051 692 389 102 -222 -645 -901 -991 -1146 -1191 -1049 -869 -756 -362 -15
5436 -15 275 604 868 1102 1155 1156 1155 835 530 292 -7 -422 -664 -917 -1116 -1221 -1123 -1010 -855 -614 -247 118
5458 118 381 724 961 1055 1131 1178 1005 790 525 258 -162 -489 -779 -904 -1085 -1176 -1099 -960 -833 -506 -191 149
5480 149 499 779 1005 1056 1146 1143 966 768 454 83 -294 -568 -754 -981 -1145 -1170 -1122 -911 -666 -355 -106 219
5502 219 507 852 966 1090 1193 1081 872 613 373 3 -275 -537 -837 -1035 -1180 -1092 -1033 -901 -541 -265 28
5523 28 316 659 877 962 1059 1132 985 796 590 293 -78 -403 -638 -922 -1093 -1114 -1095 -1040 -772 -441 -202 87
5545 87 415 779 905 1102 1182 1047 934 735 489 189 -131 -377 -734 -943 -1041 -1015 -1020 -963 -682 -397 -147 203
5567 203 507 708 878 1093 1140 1048 865 749 371 93 -229 -534 -864 -988 -1026 -1121 -1081 -901 -607 -351 -48 312
5589C12K76K04K29M8Pq4j48k55k55k94l31l23j97j97o1n2J60K05J80L43L29K42
5611C38L04J90J96P4j1j49j99k38l19k56l29l32j38j19r9P9J35J67J72L46L30
5632A42K47K75K98Q3%m3j34j69k94k55l06l67k01k05q0o6O8J70J89K78K89K95
5654B14K31K75K06R1m5m4j13j99k97k99l06k74j89j57k20J7K13Q4K03K86L96K40
5676C13K65L09Q3M6N2j23j69l02k16l38l13j82k36j61p3Q8J22J01K22K94L14K74
5698C70K37K70Q6J0K8j32j94k39k95k61l55k12k10j55N0N1P3K29K86K24L42K35
5720D38K76J73N3R8nj89k18k57k68l32k43k15k16j01K8mJ46K20L32K44K58L55
5742E73J69J56O4M8j20j82k18k32k84k49k96k01j69k1k2Q6J72K22K64K52L77K31
$$ plain form
5589 312 588 792 1021 1069 1076 992 844 589 334 40 -291 -614 -811 -1008 -1069 -1121 -961 -756 -576 -233 96 338
5611 338 642 832 1028 1102 1091 942 743 505 186 -70 -399 -731 -869 -988 -1087 -1008 -873 -706 -534 -188 142
5632 142 389 664 962 1045 1045 1002 868 699 405 150 -156 -523 -724 -929 -1009 -1075 -1007 -837 -648 -370 -81 214
5654 214 445 720 926 1017 972 928 815 616 319 20 -286 -560 -749 -906 -1126 -1109 -896 -812 -609 -323 73 313
5676 313 578 887 970 1016 1068 945 776 474 258 -80 -393 -575 -811 -972 -1045 -957 -835 -734 -512 -218 96 370
5698 370 607 877 963 973 1001 869 675 436 141 -120 -475 -687 -897 -1052 -1002 -951 -878 -649 -363 -139 203 438
5720 438 714 887 940 1038 1033 844 626 369 101 -231 -474 -689 -905 -1006 -978 -982 -836 -616 -284 -40 218 573
5742 573 742 898 962 1010 890 708 490 258 -26 -275 -571 -772 -941 -962 -984 -898 -726 -504 -240 12 389 620
5764F20J68J76Q4m5j10k21j87k57l52k44k33k48j65k7J02Q6J90K14K87K83L30
5785D51K17J47J41P4j37j07j18k71l85j79k89k10k53o4k1LK21J97K07K94L42K59
5807E19J99J17J62J8j14r9k38k44k87k77k29k75j82l4m6O9K39J95K30K81L36J21
5829D61K76J82J02m2j26j33k59k60k71k69k66j58j17r6L6J55J06K52K48K97K89
5850D07J99K28J50J4n9q2k48k09k77k82k42k79j46p3n4P9J10K04J54L21K91K07
5872D13J95K80P9m2k0j50j72l46j83k58l28j71o9j61m6N2J99K00K46K92K38K25
5894D73J95K05L8K0q3j10k64k20k49k73k27k28q6j56Q8P7J28J85L05K62K01K79
5916E60K09J01K3R1j63j90k19k37k88l12j76j16j51p1O0P3K60K18K31K36K04K21
$$ plain form
5764 620 788 964 1048 1003 893 672 485 228 -124 -368 -601 -849 -1014 -1041 -939 -853 -663 -449 -162 121 451
5785 451 668 815 956 1030 893 786 668 397 12 -167 -456 -666 -919 -983 -1004 -1001 -780 -583 -376 -82 260 519
5807 519 718 835 997 1015 901 802 564 320 33 -244 -473 -748 -930 -964 -1010 -941 -702 -507 -277 4 340 461
5829 461 737 919 1021 979 853 720 461 201 -70 -339 -605 -763 -880 -976 -940 -785 -679 -427 -179 118 407
5850 407 606 834 984 998 939 857 609 400 123 -159 -401 -680 -826 -899 -953 -874 -764 -560 -406 -85 206 413
5872 413 608 888 967 925 905 755 583 237 54 -204 -532 -703 -772 -933 -979 -927 -728 -528 -282 10 248 473
5894 473 668 873 911 931 848 738 474 254 5 -268 -495 -723 -809 -965 -877 -800 -672 -487 -182 80 281 560
5916 560 769 870 893 984 821 631 412 175 -113 -425 -601 -717 -868 -939 -879 -806 -546 -328 -97 139 343 564
5938E64J71J69O0p1r0j90k40l23l01j95j39j95j39L3L9J31J64K79K28K59K63K19
5960F96J18J14Rj05j64k12k39k33l29j92j23j73r8JJ30Q1K97K56J98L32J37K04
5982G05J13J21q7r2j22j93k63k80k15k14k13j85L6NR4J43L11K17J97K93K08J96
6004G75O9P4j12j03j79j59l09k71k21k16j22q9l5Q0O6K31K69J82L06K28J84J19
6026G67J37J7j16j46j77j49k94k61k50j46k18n0J8N3J78J98K56J85L20K02R7J44
6048G65J77j41j02l8k16k28k55k86k45j25j02p0mJ11J79K19J62K90K95J95J49
6069G30J01J11q8o9j65k72k16k75k21j71k22o0q5rJ67K03K34K25K84J97J29K68
6091G96KJ3l4j13j84k31k77j18l25k28q0o8m4Q2J53J94K03K71L06J64J75J74J24
$$ plain form
5938 564 735 904 964 893 803 613 373 50 -251 -446 -585 -780 -919 -886 -847 -716 -552 -273 -45 214 477 696
5960 696 814 928 937 832 668 456 217 -16 -345 -537 -660 -833 -931 -930 -800 -719 -422 -166 32 364 501 705
5982 705 818 939 852 760 638 445 182 -98 -313 -527 -740 -925 -889 -884 -790 -647 -336 -119 78 371 579 775
6004 775 844 918 806 703 524 365 56 -215 -436 -652 -774 -863 -898 -818 -752 -521 -252 -70 236 464 648 767
6026 767 904 921 805 659 482 333 39 -222 -472 -618 -836 -886 -868 -815 -637 -439 -183 2 322 524 621 765
6048 765 942 801 699 661 445 217 -38 -324 -569 -694 -796 -866 -870 -759 -580 -361 -199 91 386 581 730
6069 730 831 942 854 785 620 348 132 -143 -364 -535 -757 -817 -902 -911 -744 -541 -307 -82 202 399 528 796
6091 796 798 811 777 664 480 249 -28 -146 -471 -699 -779 -847 -891 -809 -656 -462 -259 12 318 482 657 831 955
6114I55j25q7o7k33k67j95k93k01k01q3p6K7J38Q9K03K36K39K86J94J23J41O3
6136H66l7j23j44k38j93l20j82k05j71l8p7P0J04J50J84K62K31K12K71J45M7K5
6158H39k0j84j88j50k31k24k95r0j56j37jQ8R5J51K38K52K74J31K17J77k5P0o3
6181G68j10k53j79k36k65k14k10o6j03N4Q5J17J94K13K68K22K07J63J51J8n3j3
6203G58k12j05k73k86j32k27j95k00P5l4J14R0K53K15K70J87K90R2J38l7j3j08
6225F60k05j59k59k52k19j04j72o2o2N9J28J00K15L25J83K56K30P7L2J00j23j08
6247F40j68j82k86k64j39k08j70k9J9K9J26K17J97K31J94K30K28J19L7l0r8j12
6269E81k09k63k31k17j81j93o1lm2Q2J64K35K07J80L28J36J10J56O5m8r4j83j97
$$ plain form
6114 955 830 743 676 443 176 -19 -312 -513 -714 -797 -873 -846 -708 -619 -416 -180 59 345 539 662 803 866
6136 866 829 706 562 324 131 -189 -371 -576 -747 -785 -862 -792 -688 -538 -354 -92 139 351 622 767 814 839
6158 839 819 635 447 297 66 -158 -453 -543 -699 -836 -837 -749 -654 -503 -265 -13 261 392 609 786 761 831 768
6181 768 658 405 226 -10 -275 -489 -699 -765 -868 -814 -729 -612 -418 -205 63 285 492 655 806 824 771 758
6203 758 546 441 168 -118 -250 -477 -672 -872 -797 -831 -717 -627 -374 -159 111 298 588 680 818 781 768 660
6225 660 455 296 37 -215 -434 -538 -710 -772 -834 -775 -647 -547 -332 -7 176 432 662 739 771 871 748 640
6247 640 472 290 4 -260 -399 -607 -777 -806 -787 -758 -632 -415 -218 13 207 437 665 784 821 791 693 581
6269 581 372 109 -122 -339 -520 -713 -774 -777 -819 -737 -573 -338 -131 49 377 513 623 779 844 796 702 519 322
6292C22k23k48k08j75j83o0n3J7J06K05K03J96K26K49J82J42N1J4o9j40r4k29
6314B31j76k28k24j93j86l6M7K6R6K33J54K92J70K88J10J45R3l1q0j32k20k02
6336A77j99k08j69k69p1j0q7J07J44K17J94K17K90J06J26J64N4m4n2j61k39j93
6358I4k02k24k23j49p3o6R3Q7J15J55L10K36J83J99K25K3l2n3q0j26k75j55k27
6381a65k63j11j08p9n2O1J68P1K29K46J99K62J20R1J00m4m9o0k36k41j78k50j86
6404d75j47o1j17J8J01J03J50K35K67K61J75R9J62J7Lj23p3k43k27k26k04k15
6426e20j08j45p9P8J85N2J81K63J81K49J91J62M2L5m3j06j24k31j76k65k13j15
6448e06j79p4l4Q7J14J25J99K19K48K01K08N9Q2J2m5j57j48j56k10l07j79j76
$$ plain form
6292 322 99 -149 -357 -532 -715 -775 -828 -811 -705 -500 -297 -101 125 374 556 698 749 763 694 554 460 231
6314 231 55 -173 -397 -590 -776 -812 -765 -739 -643 -410 -256 36 206 494 604 749 842 811 731 599 379 177
6336 177 -22 -230 -399 -668 -739 -749 -836 -729 -585 -368 -174 43 333 439 565 729 783 739 687 526 287 94
6358 94 -108 -332 -555 -704 -777 -843 -750 -663 -548 -393 -83 153 336 535 760 783 751 698 618 492 217 62 -165
6381 -165 -428 -539 -647 -726 -778 -717 -549 -478 -249 -3 196 458 578 669 769 725 676 616 380 139 -39 -289 -475
6404 -475 -622 -683 -800 -782 -681 -578 -428 -193 74 335 510 609 771 788 791 668 595 352 125 -101 -305 -520
6426 -520 -628 -773 -852 -774 -589 -537 -356 -93 88 337 528 690 732 767 724 618 494 263 87 -178 -391 -506
6448 -506 -685 -759 -793 -706 -592 -467 -268 -49 199 400 608 667 749 761 716 559 411 255 45 -262 -441 -617
6470f17j14OrP2R7J50K46K26J66K03J66J35j3J1o8j28k01j73k18k13k06j84n7
6493g23m6J13J4R3K80J64K19J81K48J14M2O6o0j27m2k39k42j42k77j47j48j17
6515g76K4M7Q2K22J41K09K38J85J88J37N2n7J8j42j32j91k19k38j79j90j05q5
6537g71O2O4M2K26K16J89J39K82J42J03M4j6jj51j92k18j53k31j49k44j44O0p
6560g08M3J93J44J78J96K51J67J64J30j1p0o0j17k21j84k33j74j95j36p4n8N7
6582g18Q1J85J47K51K23J89K14R2O9O4j43p4j29j89j86k98j73j44j95J6j8M7J35
6605e54J56J58J91K79J89J60O1R8m0l7j91j23k08k14k07j49k27ko7j7N2K03J49
6628c40J97J91K13K06J30J10J7m6l3j32j91k49j93j98j33j52j11j7M6Q0J85J42
$$ plain form
6470 -617 -731 -725 -734 -662 -565 -415 -169 57 223 426 592 727 714 725 657 529 328 155 -63 -276 -482 -666 -723
6493 -723 -769 -656 -642 -549 -269 -105 114 295 543 657 699 765 705 578 536 297 55 -87 -364 -511 -659 -776
6515 -776 -752 -705 -623 -401 -260 -51 187 372 560 697 749 692 710 568 436 245 26 -212 -391 -581 -686 -771
6537 -771 -709 -645 -603 -377 -161 28 167 449 591 694 738 722 721 570 378 160 7 -224 -373 -617 -761 -701 -708
6560 -708 -665 -472 -328 -150 46 297 464 628 758 747 677 617 500 279 95 -138 -312 -507 -643 -717 -775 -718
6582 -718 -637 -452 -305 -54 169 358 572 664 733 797 654 580 451 262 76 -222 -395 -539 -734 -718 -736 -689 -554
6605 -554 -398 -240 -49 230 419 579 640 738 698 661 470 347 139 -75 -282 -431 -658 -660 -727 -744 -692 -489 -340
6628 -340 -143 48 261 467 597 707 724 678 645 513 322 73 -120 -318 -451 -603 -714 -731 -685 -605 -420 -278
6650b78J34L04J77J32J15J47Pj78r9o6j92k10j27j95k55k8r3nJ02M7J59J53K91
6673D2K18J84P8J36O0l9l5r2k37j70j31k52k03j35l9j05J5J8J70J33K98J66J43
6696B23J75J93P6L2nr8j38j33k45k25j62j87p1j35j7LJ37J31J74K06J74J99J57
6719D64K40l8K1J1j31j71j17k39k38k14j04j57l1oL2J21J44K59J04K67J34J46
6741D97J25O8r3P8j59j73j55k14j88j11k58j47K6l5J26M6K16J98K23J91K18Q8
6763E67J32j7L7o7j71k04j41k63j46j49j98n1q1J62l8J76K10R6L00J68J51R2R1
6786F56Rmp6j30j94j82j76k91j05j42n0L8mR3K32O3K95J64J77K11O5P4l1q5j09
6811D98j20k28j82j86k06j48m8l6k1M4J18J58J93J88J82J94J53J06M5m9r4m9k34
$$ plain form
6650 -278 -144 160 337 469 584 731 738 560 461 395 203 -7 -134 -329 -584 -612 -705 -710 -608 -561 -402 -249 42
6673 42 260 444 522 658 718 679 644 552 315 145 14 -238 -441 -576 -615 -720 -705 -687 -517 -384 -86 80 223
6696 223 398 591 667 699 694 596 458 325 80 -145 -307 -494 -565 -700 -717 -714 -577 -446 -272 -66 108 307 464
6719 464 704 666 687 698 567 396 279 40 -198 -412 -516 -673 -704 -710 -678 -557 -413 -154 -50 217 351 497
6741 497 622 690 597 675 516 343 188 -26 -214 -325 -583 -730 -704 -739 -613 -567 -351 -153 70 261 479 567
6763 567 699 682 719 652 481 277 136 -127 -273 -422 -620 -671 -752 -590 -628 -452 -242 -146 154 322 473 565 656
6786 656 665 661 585 455 261 79 -97 -388 -493 -635 -685 -647 -651 -558 -326 -263 32 196 373 584 649 723 692 607 498
6811 498 378 150 -32 -218 -424 -572 -620 -656 -677 -633 -515 -357 -164 24 206 400 553 659 704 655 561 512 278
6834B78j82j58k41j36j85q0J4j3J36J12J82K51J76J52K18J12J19o8n2q6j26j88
6856B35k27j82k03j31j28l1n2O7N7J88K08J73J98J90J08J46M1j7p7j20j15j89
6878A39k05j89j49j65l1p4qM9K08M5K51J26K39J87J18J07O4m0r9j30j67j89j52
6901f5j64k18j83p8K2K4P6J66J70J25K08K39J04J41P8L0o5n3j35j43k54j84j96
6924c55r8j50r8P6l9J23J57J94J45K18K18J30M5P8K1qj51j68j31k00k20j90j18
6947e21r1o1N5l1J20J76J69J66K38J52J77R1K5k6l3j78j46j17k42j69k03p5j20
6970f44K5RR8J01J39J39K69J47J35R5J11J3J3j13j44j99j12j90k19j22j38r0j
6993f78M8J00J70J61J96J53J61J39K00o2RJ3j23j80j19j71j62j90j45r0p1J6N2
$$ plain form
6834 278 96 -62 -303 -439 -624 -704 -690 -703 -567 -455 -273 -22 154 306 524 636 755 687 635 549 423 235
6856 235 8 -174 -377 -508 -636 -667 -719 -652 -595 -407 -199 -26 172 362 470 616 657 640 563 443 328 139
6878 139 -66 -255 -404 -569 -600 -674 -682 -633 -425 -380 -129 -3 236 423 541 648 712 672 573 443 276 87 -65
6901 -65 -229 -447 -630 -708 -686 -662 -586 -420 -250 -125 83 322 426 567 645 675 610 557 422 279 25 -159 -355
6924 -355 -453 -603 -701 -625 -664 -541 -384 -190 -45 173 391 521 566 644 665 657 506 338 207 7 -213 -403 -521
6947 -521 -612 -673 -618 -649 -529 -353 -184 -18 220 372 549 640 665 639 606 428 282 165 -77 -246 -449 -524 -644
6970 -644 -619 -610 -512 -411 -272 -133 136 283 418 513 624 637 650 537 393 194 82 -108 -327 -449 -587 -677 -678
6993 -678 -630 -530 -360 -199 -3 150 311 450 650 588 597 610 487 307 188 17 -145 -335 -480 -570 -641 -625 -573
7016e73R4J11K60J76J39K03J54L5m7O1l1j47r8j90k34j77j27j19j56L3P2k5J83
7039d03J59J64J20J85K11O9K8N0O2j77p1j74j84k09j07j73n6j03Qk6J44J18J48
7062b17K04J54K06J61L9P9K1o8n6k23j63j36j65j60j41j27k2n5R7L8J37K29J65
7085cJ61K13J44OJ19j2j17r6q5j88k05k16j21j05q5oK7M0R7J92J41K05J82J40
7109D28R6Q0K1j0j57j30l4j97k14j31j44j44n3j6P1j2K27J05J45K16J50J55K6
7132D78K00o1n4j23j16j75j16j76j70j50o1p1L9JL0K06J68J42J87J79J02J59m9
7155E69M7n0j05j79j55j91j32j69k12M2j7n8Q2J47R1J18K55K09J42J2J11N0m3
7178E64p8j21r4k29j58k04j01j02q5j4N3O9J63J75O9K85R9J24J60L5k0l8r8o4
$$ plain form
7016 -573 -479 -368 -108 68 207 410 564 599 552 613 582 435 337 147 -87 -264 -391 -510 -666 -633 -561 -586 -403
7039 -403 -244 -80 40 225 436 505 533 583 645 468 397 223 39 -170 -277 -450 -506 -609 -601 -627 -483 -365 -217
7062 -217 -13 141 347 508 547 626 647 579 523 300 137 1 -164 -324 -465 -592 -614 -669 -572 -534 -397 -168 -3
7085 -3 158 371 515 521 640 628 511 415 330 142 -63 -279 -400 -505 -590 -596 -569 -529 -432 -240 -99 106 288 428
7109 428 524 604 625 615 458 328 294 97 -117 -248 -392 -536 -589 -605 -534 -546 -319 -214 -69 147 297 452 478
7132 478 678 617 563 440 324 149 33 -143 -313 -463 -524 -595 -556 -555 -525 -319 -151 -9 178 357 459 618 569
7155 569 616 566 461 282 127 -64 -196 -365 -577 -535 -552 -610 -528 -381 -290 -172 83 292 434 446 557 607 564
7178 564 486 365 271 42 -116 -320 -421 -523 -608 -622 -569 -500 -337 -162 -93 192 291 415 575 610 590 552 454 390
7202C90k16j68j03k48j19k1j33M8J7R6J27J03K51J58J63Q1J17O7j6n9j25j44j05
7225A61k14j31j92j25l3m7k1K6J91J11K06K12Q7J13J75Q2j9k4q8q5j69j29j66
7248g9k52p3j22n2n8R8N9Q6J86J12J87J44J86P9N9k2L9q0j78j70r8j67k08j27
7272d51j01m8n2J06J12J04J74J97R0K19J07J14L3n5Oj06j45j77j68k47p3j25m5
7295e31j14Q1L7J12J23K12J79J32Q2J89M9K5J4j05j05j23j30k46j29j20j17j32
7317f17K9j8J85P5J41J66J86J43J78J35n6N5Kj51j36j22j83j51j57j63p3o3k3
7340f18J06M0J41J88K05J23R2K26L3M0Lj6j95j09j59j47j68j62p7j05l2K9M6R4
7364d22J81K07J20J84J82J7P8lK9j29o9j58j62j46j60j56j26p8M7PO1J42J65J47
$$ plain form
7202 390 174 6 -97 -345 -464 -485 -618 -570 -553 -457 -330 -227 24 182 345 426 543 610 594 535 410 266 161
7225 161 -53 -184 -376 -501 -534 -581 -602 -576 -385 -274 -68 144 231 344 519 601 582 558 470 385 216 87 -79
7248 -79 -331 -404 -526 -578 -636 -538 -479 -393 -207 -95 92 236 422 501 560 538 577 497 319 149 51 -116 -324 -451
7272 -451 -552 -600 -652 -546 -434 -330 -156 41 131 350 457 571 604 549 555 449 304 127 -41 -288 -361 -486 -531
7295 -531 -645 -564 -527 -415 -292 -80 99 231 313 502 551 576 590 485 380 257 127 -119 -248 -368 -485 -617
7317 -617 -588 -606 -421 -346 -205 -39 147 290 468 603 547 602 604 453 317 195 12 -139 -296 -459 -532 -595 -618
7340 -618 -512 -472 -331 -143 62 185 277 503 536 576 579 563 368 259 100 -47 -215 -377 -454 -559 -591 -562 -516 -422
7364 -422 -241 -34 86 270 452 469 547 544 573 444 375 217 55 -91 -251 -407 -533 -611 -564 -557 -496 -354 -189 -42
7388d2J77J46J35Q1L3O5m9j10j16j51j80j70j59j09j19m8O2O2l4K27J44K25J40
7411B10J23Q1J34N3lq2j12l4k73j09j73j91j73r6P5k4J31P1J44K15R5K30Q9J23
7435E04J9R6j13j8r3j88j67j34j34j60j35j6ok3O9K19O8J50J96J61J44Q3J16r9
7459E39n1j3j51j61j44j90j45j68l2k9q8P3J11J31J42J62J78J16J13J50L9m0j2
7482E30o8j40k13j19k13j51j28l5m2oJ23N3J60J79J46K08J42R8Q0m2or9r4j74
7506A89j46j98j32j71o6j2r6N6R7J27J00J90J68J77P2J53Q5L6j46m3j00k44p5
7529B1j87j94n9j11l0k5P0R6J06K02J37J40J63J88M0QL7o1j37j58j23k27q2j80
7553c66p4j21rp1J87N0J90J25J66J41Q1K49pk9L8l4j47j73j31j73j34j64m1j18
$$ plain form
7388 -42 135 281 416 497 530 595 546 436 320 169 -11 -181 -340 -449 -568 -616 -554 -492 -526 -299 -155 70 210
7411 210 333 414 548 601 598 516 404 370 97 -12 -185 -376 -549 -645 -570 -594 -463 -392 -248 -33 62 292 381 504
7435 504 523 619 506 488 395 207 40 -94 -228 -388 -523 -539 -545 -568 -499 -280 -212 -62 134 295 439 522 638 539
7459 539 488 475 324 163 19 -171 -316 -484 -516 -545 -633 -560 -449 -318 -176 -14 164 280 393 543 582 542 530
7482 530 462 322 109 -10 -223 -374 -502 -537 -579 -585 -462 -409 -249 -70 76 284 426 524 604 562 556 457 363 189
7506 189 43 -155 -287 -458 -524 -536 -632 -576 -479 -352 -252 -62 106 283 355 508 593 629 483 440 340 96 21
7529 21 -166 -360 -419 -530 -560 -585 -515 -419 -313 -111 26 166 329 517 557 565 602 541 404 246 123 -104 -186 -366
7553 -366 -440 -561 -570 -641 -454 -404 -214 -89 77 218 299 548 541 512 550 516 369 196 65 -108 -242 -406 -447 -565
7577e65p9J29J20R3J24J62J53J30J13J32oM7L1j30j49j67r5k22j49j10j19m2N4
7600e45M5J8J81J52J46J30J58J82J8O0pj21m3p4j63j71j46k10o8p9n9R5L5J01
7624c65J30J96J75J26J53J11L1L7J5j50j01j51j15k23j20j72j16o0j4J34k6K22
7646b83Q4K03O4J97J45O9P0M3o3q8j28r8k21j61j18j00j30m0OL8J11J45J54R1
7670a0K49J04Q8J35MJn5r1j49j59j93j60j34j35p1j1N1l2J95J22J75J22J56J91
7694C93Q7O5l0J5q1o4j52j78j88j89j00p7j6j1M8RJ31J42J57J91J94P4O1O4k6
7719E19k0q4q7j60j45k45j01j38p3l9oP1J18J09J25J74J56J51P7J16M7M3j03q3
7743D22j53j75j23j73j29j36lj17N7N8N6J81J12K93P6J71L8R9J4mp4j65j31j91
$$ plain form
7577 -565 -644 -515 -395 -302 -178 -16 137 267 380 512 506 553 584 454 305 138 43 -179 -328 -438 -557 -599 -545
7600 -545 -500 -482 -301 -149 -3 127 285 467 485 545 538 417 374 300 137 -34 -180 -390 -458 -537 -596 -501 -466 -365
7624 -365 -235 -39 136 262 415 526 557 594 609 459 358 207 92 -131 -251 -423 -539 -599 -613 -479 -505 -283
7646 -283 -199 4 68 265 410 479 549 592 529 441 313 215 -6 -167 -285 -385 -515 -555 -549 -511 -400 -255 -101 -10
7670 -10 239 343 431 566 570 571 516 425 276 117 -76 -236 -370 -505 -576 -587 -536 -568 -373 -251 -76 46 202 393
7694 393 480 545 515 530 449 385 233 55 -133 -322 -422 -499 -515 -526 -478 -469 -338 -196 -39 152 346 420 481 545 519
7719 519 499 415 328 168 23 -222 -323 -461 -534 -573 -579 -508 -390 -281 -156 18 174 325 402 518 565 608 505 422
7743 422 269 94 -29 -202 -331 -467 -470 -587 -530 -472 -416 -235 -123 170 246 417 455 554 568 564 490 325 194 3
7767Cq5j90j77m3q6Pj8J42Q9J37J58J51K15P1K15o9Jl9k7j22k32o7j82j94o3p6
7793d81j02N2K5M5J44K31J41J13J39J24O7J12j00K1r8j70j77n5k24j76j18o5k1
7816e73K5P9N6J68J41J89O2K27O8P3J1l9K5j98q4r8k03k25r1p6j20J2K8O8Q7J79
7842b09J55K32J11J13R5P5n0M2j28r9j82j55j76j62o0j56j6L8l1M9K39J07J74
7865FJ25J49J80P4k1L9j3j09j97j02j25k82n8j09j45J0L3N8J42O2K64N1J90K03
7889D25k2J43nM2j07r8j64j41j80j21j62j37o3K6K6M8J14K05J51J49J36J76L8
7912D79MO3J6j02j94q5j20k25p0k13o9l6j9P5Q4Q6J44J78J57J52O8J71K5j1j14
7937D44p0j32j56j36j64j52j52j4o9J11K4J9K53Q8J32J78J75P2O6J5L4j33j24
$$ plain form
7767 3 -82 -272 -449 -492 -578 -571 -589 -447 -358 -221 -63 88 303 374 589 520 521 482 455 333 101 34 -148 -342 -405 -481
7793 -481 -583 -531 -506 -461 -317 -86 55 168 307 431 498 610 510 531 433 263 86 31 -193 -369 -487 -552 -573
7816 -573 -548 -469 -413 -245 -104 85 147 374 442 515 526 487 512 314 230 132 -71 -296 -387 -463 -583 -571 -543 -475 -388 -209
7842 -209 -54 178 289 402 497 572 522 564 436 337 155 0 -176 -338 -398 -554 -570 -532 -563 -514 -275 -168 6
7865 6 131 280 460 534 513 552 539 430 233 131 6 -276 -334 -443 -588 -578 -545 -487 -345 -283 -19 32 222 425
7889 425 403 546 541 583 476 378 214 73 -107 -228 -390 -527 -590 -564 -538 -490 -376 -171 -20 129 265 441 479
7912 479 483 546 562 460 266 181 61 -164 -234 -447 -516 -552 -571 -496 -412 -326 -182 -4 153 305 373 544 569 558 444
7937 444 374 242 86 -50 -214 -366 -518 -532 -601 -490 -466 -447 -194 -106 26 204 379 451 517 532 566 433 309
7960C09j03j99j61r3j13q0p5J3k6P7J29J32J49J44K07N4R9J00k4l6m7j15j63j64
7984A4j37k10o9j25%j6J8P8J39J58R7K61Q9M8J73L7M1p8j56j05q5j96j52k07l2
8009d15r1k8KL5J67R3J69J46J32J62J23K0j0K1j12m3j38j67j11j72k02n8p2n2
8033f01L3J16J00J38J51J09K33J09P9O6M7o7j5j76j54r3j83k26o4p2l0j11R7P5
8057d39J51J10J50K18Q0J71K2J33n3k7r8j24j57j56j73j86q9k1q5K2P1P7J19J68
8081a16J87J18R4K01M8k0J6l3r7j54j19j97j58j53q1k7l2l9J08O4J53J89J53J12
8105B17J51J09L6P1j08m2j00j34j64k13p5j40q7o8j2K7J13R8J47J63J35J32J75
8128D31L8J7O7k2j24j52q2j70k06q1j23j45k1Q4O2Q0Q8J47J48J72R5J61L5MJm
$$ plain form
7960 309 206 7 -154 -247 -360 -440 -515 -502 -528 -451 -322 -190 -41 103 310 364 463 563 539 503 456 341 178 14
7984 14 -123 -333 -402 -527 -527 -543 -525 -447 -308 -150 -53 208 297 345 518 555 596 518 362 257 172 -24 -176 -383 -415
8009 -415 -506 -534 -532 -497 -330 -237 -68 78 210 372 495 515 505 526 414 371 233 66 -45 -217 -419 -477 -549 -601
8033 -601 -568 -452 -352 -214 -63 46 279 388 467 533 580 513 498 322 168 75 -108 -334 -398 -470 -500 -611 -514 -439
8057 -439 -288 -178 -28 190 270 441 463 596 543 516 418 294 137 -19 -192 -378 -467 -488 -573 -551 -480 -403 -284 -116
8081 -116 71 189 283 484 532 512 528 495 398 244 125 -72 -230 -383 -464 -491 -523 -562 -454 -390 -237 -48 105 217
8105 217 368 477 513 584 476 434 334 200 36 -177 -252 -392 -479 -547 -559 -532 -419 -321 -174 -11 124 256 431
8128 431 469 486 553 531 407 255 173 3 -203 -284 -407 -552 -573 -489 -427 -347 -259 -112 36 208 303 464 499 503 504 500
8154E00j29j39j48j96j46p7j37l2l7J2R1Q7J26J41J75R7K06L2R6J0qq9j01j35
8178A99j01j59k10j26o4j00M1N3P6J18P7J53J53
$$ plain form
8154 500 371 232 84 -112 -258 -335 -472 -504 -541 -529 -438 -351 -225 -84 91 188 394 426 522 532 524 435 334 199
8178 199 98 -61 -271 -397 -461 -561 -520 -467 -391 -273 -196 -43 110
8191A10
$$ Imaginary data points
##PAGE= N=2
##DATA TABLE= (X++(I..I)), XYDATA
0@%%%%%%%%%%%Qj6J6j6K4l2L3m1M9n7P2q8R9j16J38j57J82k12K44k78L19l61M06
34B16m62N24n89O58p33Q20r16J017j127J250j384J529j689J863k054K262k491
51a306K744l024L337l686M078m524N033n619O310p134Q137r389J1001j3174J6280
66I064k1113K9744m9968J87684J59502j52800l31r5823j31609r1453k1302r7365
78b75770n3705K0994L1638K435P4551R9769P7817O7527J00818P7812L7988J7267
90B79141K3059j7947o2413o3222n1224r4846j02841n5797m9073p4711k1349K9324
102b61899Q932K2539Q9040Q2187N1049Q4731R5509M0487K6475L8651k393m4918
114B30390m1053n0467q0236q2826o7945o2083n6247l8857q573J4944K0827M0707
$$ plain form
0 0 0 0 0 0 0 0 0 0 0 0 0 8 -8 8 -8 16 -16 17 -24 25 -32 40 -48 51 -65 73 -84 98 -114 130 -148 171 -190 216
34 216 -246 278 -311 347 -386 434 -482 535 -592 658 -726 803 -886 977 -1077 1185 -1306
51 -1306 1438 -1586 1751 -1935 2143 -2381 2652 -2967 3343 -3791 4346 -5043 5958 -7216 9064
66 9064 -12049 17695 -32273 155411 314913 162113 161782 65959 -65650 -157103 -178405 -275770
78 -275770 -329475 -308481 -276843 -274408 -199857 -100088 -22271 45256 146074 223886 261874 279141
90 279141 302200 284253 221840 158618 107394 12548 -90293 -146090 -195163 -269874 -291223 -261899
102 -261899 -252967 -230428 -141388 -59201 -8152 76579 172088 212575 239050 277701 275308 230390
114 230390 189337 138870 58634 -24192 -92137 -154220 -210467 -249324 -257897 -242953 -222126 -181419
126a81419P3886P1049N5559P5270P5664L1659J9442K9653j0711n0071l6442m3208
138A10331q2415p5103m6283n6500n8189j8649N075K650K2895N6455O1716N2532
150b5485O2959P3688N1251K4590K7802J7941k6650m2555k7614n2597q3822n6274
162e6766l7130o4112m8276M834K297q104M1100O6306L7224M7090Q0963N5667K1932
175A43025L7474L2733j5092k9922j6439l9528p0521n6001l8795n6222n5432j5930
187a80650q11j2428J3483N2789M2762L2362O4952O9212L0268K9132M5920Q933
199A95924k6219j0753j8570o0925n8646l4282n2077o2047k6997r316j9414P30
211a82592L5488L6014L1261N2062O2184M3113L2992L9752K5717m915j2848j1290
$$ plain form
126 -181419 -107533 -36484 19075 94345 170009 201668 221110 250763 240052 189981 153539 110331
138 110331 27916 -47187 -93470 -149970 -208159 -226808 -221733 -219083 -196188 -139733 -78017 -25485
150 -25485 37474 111162 162413 187003 214805 232746 206096 163541 135927 83330 -492 -56766
162 -56766 -93896 -158008 -206284 -201450 -199153 -207257 -166157 -99851 -62627 -15537 65426 121093 143025
175 143025 180499 213232 198140 168218 151779 112251 41730 -14271 -53066 -109288 -164720 -180650
187 -180650 -181461 -193889 -180406 -127617 -84855 -52493 12459 81671 111939 141071 186991 195924
199 195924 169705 158952 140382 79457 20811 -13471 -65548 -127595 -154592 -163908 -183322 -182592
211 -182592 -147104 -111090 -79829 -27767 34417 77530 110522 150274 175991 171076 158228 146938
223A46938l4900n5156m3119l8528n5544m6343j6554j4738j6470J4497L5506K6511
235i7900L4683N8152N0683L2381L8239L7037R723p153n605j9439m3453m5484l7178
248D686m5607n1484l2267j5121j7863o825K3149L0955K3791M1418N7984L9794
260E2610K8710M2089K9906l272n233q97l0341m8611l2465l4692n5609m2180j5984
273a15969k1512k1470J1263K7192J6391K9120N3980M4234K7499L9973M0472R376
285A40549l033O052j3043m1909l4627k6416m8170n0990k3060j9076k9767n422
297a48912K2107J4209J5882M5191M8025K7543L4875M6163K1433J139R692J88l0733
310A06802l3681k2851l9182n1387l1558k0404l0566j8129J0101J2694R483L1372
$$ plain form
223 146938 112038 56882 13763 -24765 -80309 -126652 -143206 -157944 -174414 -159917 -124411 -97900
235 -97900 -63217 -5065 45618 77999 116238 153275 162998 155845 150240 130801 87348 41864 4686
248 4686 -40921 -92405 -124672 -139793 -157656 -164481 -141332 -110377 -86586 -45168 12816 52610
260 52610 81320 123409 153315 150043 144810 143913 113572 64961 32496 -2196 -57805 -99985 -115969
273 -115969 -137481 -158951 -147688 -120496 -104105 -74985 -21005 23229 50728 90701 131173 140549
285 140549 137516 143568 130525 88616 53989 27573 -20597 -71587 -94647 -113723 -143490 -148912
297 -148912 -126805 -112596 -96714 -51523 -3498 24045 58920 105083 126516 127655 137347 137535 106802
310 106802 73121 50270 11088 -40299 -71857 -92261 -122827 -140956 -130855 -118161 -108678 -77306
322g7306M5453L2410L0208M3566L3117J0061R402R173j4799l0255k3164k8652
334C9214m5943m0047k3939k7494k7510m731R820O356J6882L7791L6744K7759L6784
347D1686M0361K1231R904J3489R40k1890k4141k0776l5791m3971k9956k3738l0837
360a03489j9361L353N836N334K5618L8163K7954K8604M1597L2380J2402J3894
372A12285J3565j0298k3784j6307k4405m2898l5913k1890k9784l0070o112M882
384a10729j522J2499L4529K9757K2590L7478M0039J8622J3239K0631L232j9436
396A00929j4887j4216l6224m0330k3079k6113l6102j7162J703n021N81K6381L0073
409e3467J9034L1129M2429K5627J4464K3264J4177j0369j2986q543k6182l8840
$$ plain form
322 -77306 -31853 557 30765 74331 107448 117509 126911 136084 121285 91030 67866 39214
334 39214 -6729 -46776 -70715 -98209 -125719 -130450 -120630 -114274 -97392 -59601 -22857 4902 41686
347 41686 82047 103278 113182 126671 127611 105721 81580 60804 25013 -18958 -48914 -72652 -103489
360 -103489 -122850 -119497 -113661 -108327 -82709 -44546 -16592 12012 53609 85989 98391 112285
372 112285 125850 115552 91768 75461 51056 8158 -27755 -49645 -79429 -109499 -115611 -110729
384 -110729 -112251 -99752 -65223 -35466 -12876 24602 64641 83263 96502 117133 120365 100929
396 100929 86042 71826 35602 -4728 -27807 -53920 -90022 -107184 -105481 -110502 -109921 -83540 -53467
409 -53467 -34433 -3304 39125 64752 79216 102480 116657 106288 93302 84759 58577 19737
421A9737k6816k3551l4993k6779o042n370o727J3677K7495J9669K3147L8837L3026
434D5310J7363K1393K2388J145j0831n597j5309l3687l0239k1903l1161l2839
446g3967j4738o836j0416K084K0572K0288J8450L1355L5995K3658J9648K4516
458I0609J3319m494n913o837k3188l2033k3816k4614l3905k5259r629j0273q675
471a04708J0281K0702J5294K1902L5545K9558J8574K3773K2865L931n130j369
483I1218j2408k8999k5744k0177l0520l1983j5158r794j4300q78J6961J4648J3930
496e3204K9878L3542J9997K0613K7666J3450k732R34k587k2401k6899j7754k4987
509d484l4572k1622j0394j6421j0579J0218J3978Q860K2067L3698K3253J8328
$$ plain form
421 19737 -7079 -30630 -65623 -92402 -98444 -103814 -110541 -96864 -69369 -49700 -26553 12284 45310
434 45310 62673 84066 106454 107599 96768 91171 75862 42175 11936 -9967 -41128 -73967
446 -73967 -88705 -95541 -105957 -103873 -83301 -63013 -44563 -13208 22787 46445 66093 90609
458 90609 103928 99434 93521 86684 63496 31463 7647 -16967 -50872 -76131 -85760 -96033 -104708
471 -104708 -94427 -73725 -58431 -36529 -984 28574 47148 70921 93786 97717 92587 91218
483 91218 78810 49811 24067 3890 -26630 -58613 -73771 -83565 -97865 -98743 -81782 -67134 -53204
496 -53204 -23326 10216 30213 50826 78492 91942 89210 90144 87557 65156 38257 20503 -4484
509 -4484 -39056 -60678 -71072 -87493 -98072 -87854 -73876 -65016 -42949 -9251 14002 32330
521C2330K8066K1908K787J692M369j3074k5415j7545j9267l3127k7528j2913j6323
534g4040j7631J208J1570O003J3854K9876K5931J7659K5665K6830J0693L689P138
547H8445l357j9220j8404j5860k6791l0322j8822j5053j9380r469O142O619O787
560f8685K1285K7842J9530K0421K8397J9312N812P645N395j1642j8486j3267k0137
573B3422l0299k3240j5161j9606j6461p90N095L426J3026K4644K1989J8415K4944
586B9404K4938J2614O852Q867o97j5062j5004j3341k4726k8760j7564j5709k1686
599f9874j0611M155J591L384K0242K4135J5395K1207K8998J7177P697J2648O686
612H2830j0264j2636r327j9901k7949j9890j6027k1796j6690k345O59o39J1198
$$ plain form
521 32330 60396 82304 85091 86783 91152 78078 52663 35118 15851 -17276 -44804 -57717 -74040
534 -74040 -91671 -90463 -78893 -72890 -59036 -29160 -3229 14430 40095 66925 77618 81307 88445
547 88445 85088 65868 47464 31604 4813 -25509 -44331 -59384 -78764 -88233 -82091 -75472 -68685
560 -68685 -47400 -19558 -28 20393 48790 68102 73914 81559 86954 75312 56826 43559 23422
573 23422 -6877 -30117 -45278 -64884 -81345 -82135 -77040 -73614 -60588 -35944 -13955 4460 29404
586 29404 54342 66956 73808 82675 81978 66916 51912 38571 13845 -14915 -32479 -48188 -69874
599 -69874 -80485 -76330 -74739 -71355 -51113 -26978 -11583 9624 38622 55799 63496 76144 82830
612 82830 72566 59930 50603 30702 2753 -17137 -33164 -54960 -71650 -73995 -73336 -73975 -62777
625f2777K2024J7468J6304K6124K4092J0728J0563J3518j074j2715p479j1325
637D5451k6275k3597j3842k0431k2960p226l11n251M348J8890J6361J3587K3919
650B663K5598J4381J2125J5277N553o785o815p942j9147k3913j7282j7148k2714
663d6149j5574l841m207k964J0970J7542J2564J6989K6211J9716J1397J5519J3093
676G1266j453o091l615j2755k2334j8168j5610k1700j9528q688n613o050L505
689f6834J3484J2804J3353K1438K2795J4838J3379J5985P149l891l307n159j7188
702C8846k0776j4349j7440k3011j4293n513q067m349R349J2671R280J6832K3803
715B983J7210J2501J7110J3253N50k324q27j0673j9571j5402j4090k1777j9601
$$ plain form
625 -62777 -40753 -23285 -6981 19143 43235 53963 64526 78044 76970 64255 56776 45451
637 45451 19176 -4421 -18263 -38694 -61654 -68880 -69191 -74442 -70094 -51204 -34843 -21256 2663
650 2663 28261 42642 54767 70044 75597 68812 61997 54055 34908 10995 -6287 -23435 -46149
663 -46149 -61723 -65564 -69771 -72735 -61765 -44223 -31659 -14670 11541 31257 42654 58173 71266
676 71266 69813 63722 60107 47352 25018 6850 -8760 -30460 -49988 -58676 -64289 -70339 -66834
689 -66834 -53350 -40546 -27193 -5755 17040 31878 45257 61242 68391 64500 61193 56034 38846
702 38846 18070 3721 -13719 -36730 -51023 -56536 -64603 -68952 -59603 -46932 -37652 -20820 2983
715 2983 20193 32694 49804 63057 63607 61283 60456 49783 30212 14810 720 -21057 -40658
728d0658q486p814r594K084J1664P870J0685K1982K0285J2138J6105J8033N855
741F0149r21K321m244j6453j5415j1827j9380k1709j2080q542j1762m278P311
754e6830P326O821J6747K1111J4003J3743J9142J2120J512K820J701j0899j5522
767C3795j0502j5048k2266j5751q990j2578r742K726N873L964J1937J9358J5390
780a834J3249J8124J5732O368L768L933m156j2469j1582j1785j8602j9184j2026
793c0464j0804j2697m759M367L576N617J5627J7618J2403J5051J8890J1002M241
806D9668O147J901q858j0989r132j5045j9632j4369j0912j3475r624K7K791K656
820d8846R717J6597J3919J2413J7532J5926P015N247O372k439j0685q392r669
$$ plain form
728 -40658 -49144 -56958 -66552 -64468 -52804 -44934 -34249 -12267 8018 20156 36261 54294 60149
741 60149 59228 61549 57305 40852 25437 13610 -5770 -27479 -39559 -48101 -59863 -64141 -56830
754 -56830 -49504 -42683 -25936 -4825 9178 22921 42063 54183 55695 58515 60216 49317 33795
767 33795 23293 8245 -14021 -29772 -38762 -51340 -61082 -58356 -52483 -48519 -36582 -17224 -1834
780 -1834 11415 29539 45271 51639 55407 59340 55184 42715 31133 19348 746 -18438 -30464
793 -30464 -41268 -53965 -58724 -54357 -50781 -45164 -29537 -11919 484 15535 34425 45427 49668
806 49668 55815 57716 48858 37869 28737 13692 -5940 -20309 -31221 -44696 -54320 -54293 -51502 -48846
820 -48846 -39129 -22532 -8613 3800 21332 37258 44273 49520 55892 53453 42768 34376 24707
833B4707j8362j7536j0329j2394j4246m360K408l07M431J4748J4176J0398J6041
846I375J8072R815O131Q530K563p385p593o910j4739j8112j2260j1209j5226r559
860d8507m70o34q1R783J4326J0171J2524J8521J3788O663R219P552l105o878m262
875C8610j0351j7491j3528j0419j5030j3085l936j867k817M796J1863J0125J0298
888a2832J6224J5909R329Q760R833K467m645l734o014j3905j4957j0789j2757
901a7111j5093q515k838l927m36Q452J0226Q435J3147J6667J1931Q672J0722P097
915D7429j178l294l184r561j4498j1894j1038j4668j2544n311l911l943L275R500
929c4820Q072R372J5450J4654R089R976J0753L085k672j237m757j2692j2752r488
$$ plain form
833 24707 6345 -11191 -21520 -33914 -48160 -52520 -50112 -50419 -45988 -31240 -17064 -6666 9375
846 9375 27447 37262 43393 51923 54486 47101 39508 32598 17859 -253 -12513 -23722 -38948 -48507
860 -48507 -48977 -49611 -49692 -39909 -25583 -15412 -2888 15633 29421 36084 45303 52855 49750 42872 38610
875 38610 28259 10768 -2760 -13179 -28209 -41294 -45230 -47097 -49914 -45118 -33255 -23130 -12832
888 -12832 3392 19301 28630 37390 47223 49690 45045 41311 35297 21392 6435 -4354 -17111
901 -17111 -32204 -40719 -43557 -47484 -47920 -39468 -29242 -20807 -7660 9007 20938 29610 40332 47429
915 47429 46251 42957 39773 30212 15714 3820 -7218 -21886 -34430 -39741 -43652 -47595 -44320 -34820
929 -34820 -26748 -17376 -1926 12728 21817 31793 42546 45631 42959 41722 36965 24273 11521 2033
943B033j3149j5024q147m337o012j370O983P546O713J2619J5566J0522R156J1937
957C5036P498l43p56j014q771j2929r309j0506j5420j1522n080o466n598L424
971d1756P163M654R031J5324J1864Q413J2192J0765K357L77J534m935j1138r220
985A6625r056j4063j3329p462o846p586j171M923M215N821J2424J3252R185J0623
999A7555J2559O689J408K466l27q203r525p414j1569j4451r604o858q796n058
1013d1128K189L261L376R181J2615R874R627J2318R651L995K908K180l897q264
1027B7886p475q659j3024j2063p716p936q176j993K809K029M945J1101J1107Q482
1041A317J1042J2190O526L187M203K62o485p051o518j0950j3068r096p673r365
$$ plain form
943 2033 -11116 -26140 -34287 -38624 -44636 -46006 -39023 -31477 -24764 -12145 3421 13943 23099 35036
957 35036 42534 42191 41435 40421 31650 18721 9412 -1094 -16514 -28036 -33116 -39582 -45180 -41756
971 -41756 -34593 -29939 -20908 -5584 6280 14693 26885 37650 40007 40384 41918 36983 25845 16625
985 16625 7569 -6494 -19823 -27285 -34131 -41717 -42888 -37965 -33750 -27929 -15505 -2253 6932 17555
999 17555 30114 36803 38211 40677 40350 32147 22622 15208 3639 -10812 -20416 -27274 -36070 -41128
1013 -41128 -38939 -35678 -32302 -23121 -10506 -632 8995 21313 30964 34959 37867 40047 36150 27886
1027 27886 20411 11752 -1272 -13335 -21051 -28987 -37163 -39156 -36347 -34318 -29373 -18272 -7165 1317
1041 1317 12359 24549 31075 34262 38465 38727 32242 25191 18673 7723 -5345 -14441 -22114 -31479
1055c1479n712O31J443J818P851J1266Q433R065J2663R703M076M808M004l292
1069C5278o600m746p947j2925j0297p297r748q583j931L89m41M463R752Q417P805
1084d411J1611J1371O131N011N924P11m969m248n090j0690j1618p672q585j0506
1098b7030n105m34j672Q44P706Q423O422J0056J2277P640N508P081L574k505l245
1113B9540l554q239j0816q613q226j0107p709l044j852j197L654P821O658P465
1127h219J1311J0304O066O470O735Q50k997j951m793j0076r207p156r709r847
1141b2219m854k661l118R10N702N949O293R552J0493P699O545P090M202o43j861
1156B9079k450o685r628p665p560j0188p918l270l188k778L170O192M474P024
$$ plain form
1055 -31479 -37191 -36560 -35117 -33299 -25448 -14182 -5749 3316 15979 25682 29758 34566 38570 35278
1069 35278 28678 23932 15985 3060 -7237 -14534 -24282 -32865 -34796 -34407 -34848 -30385 -20633 -12216 -4411
1084 -4411 7200 18571 24702 29713 35637 36348 31379 27131 22041 11351 -267 -7939 -16524 -27030
1098 -27030 -32135 -32569 -34241 -33397 -25691 -17268 -10846 -790 11487 19127 24635 31716 35290 32785 29540
1113 29540 25986 17747 6931 -1682 -9908 -20015 -27724 -30768 -32620 -33817 -30163 -22342 -15684 -8219
1127 -8219 3092 13396 19462 25932 32667 33517 30520 28569 23776 13700 4493 -2663 -12372 -22219
1141 -22219 -27073 -29734 -32852 -31942 -26240 -20291 -13998 -4446 6047 13746 20291 27381 31583 30940 29079
1156 29079 26629 19944 10316 2651 -4909 -15097 -23015 -26285 -29473 -32251 -29081 -22889 -18415 -11391
1170a1391J0964Q757N935P812O764J029q58l39m397q577p440o885r719r141n085
1185b2571l778m152p3M490M379M903R121R894O648O816Q389M149k25N81j167o660
1201B0744p779n616q317j0338o484l980n473k798K839L360L024P259R654O965
1215C060O562Q629O143J672J245O80l913o817n648o529r671q117m897n234m819
1230b7654j07K770K190M671Q509P756O169P945P733L709J769J904j184n364n533
1245A5283n407q153q972o127n144n648k828J268J883K420O365Q146O346O645Q408
1260A4485O049K415K426J409l063n272m370o263q894p246n151o029m927q63J165
1275b4129J090L875P213O600N775P711P703L975K581K930k65m174m117m241p679
$$ plain form
1170 -11391 -427 8330 14265 22077 28841 29870 29012 28673 24276 15699 8259 1374 -8345 -17486 -22571
1185 -22571 -26349 -30501 -30574 -26084 -21705 -16802 -7681 2213 8861 15677 24066 28215 27990 28571 27404 20744
1201 20744 12965 7349 -968 -11306 -17790 -21770 -27243 -30041 -27202 -23842 -20818 -13559 -3905 3060
1215 3060 9622 18251 24394 26066 27311 27991 24078 17261 11613 5084 -4587 -12704 -17601 -22835 -27654
1230 -27654 -27761 -24991 -22801 -18130 -9621 -1865 4304 12249 19982 23691 25460 27364 26180 20816 15283
1245 15283 9876 1723 -7249 -13376 -18520 -24168 -26996 -25728 -23845 -21425 -15060 -6914 -568 6077 14485
1260 14485 20534 22949 25375 26784 23721 18449 14079 7816 -1078 -8324 -13475 -19504 -24431 -25294 -24129
1275 -24129 -23039 -19164 -11951 -5351 424 8135 15838 19813 22394 25324 25059 20885 16768 12527 4848
1290D848q323n409n395o602k918M72K6J489N939O626N021O813Q352N198L090L962
1306B3189J735k579l384l096o047q052o180n283o675m967j068l82k21L595O155
1321a3260N001N513P985O852L690M063L827m33k851k005m112p418o548n073o541
1336a1310o326k625j221j285J505M780M649M673O987P244M826M265M446J791j294
1351B1105j764k505n529o646n370n635o581m660j875j665o11K831M543L922N435
1366e005P305N836M188M752L677K10j262j229l664o175n520m915o466n864l078
1381a7210k016j914P61L626L713L966O402O700M613M433M924K182n53n93j684
1396A7350m926n705m513n583o552m381k277k707j313K438L295K803N063O823N035
$$ plain form
1290 4848 -3475 -8884 -14279 -20881 -23799 -23327 -23301 -21812 -15873 -9247 -4226 2587 10939 16137 19227 23189
1306 23189 24924 22345 18961 15865 9818 1766 -4414 -9697 -16372 -21339 -22407 -22789 -23010 -19415 -13260
1321 -13260 -8259 -2746 5239 12091 15781 19844 23671 23238 20387 18382 14270 6852 304 -4769 -11310
1336 -11310 -17636 -20261 -21482 -22767 -21262 -16482 -11833 -7160 -173 7071 11897 16162 20608 22399 21105
1351 21105 19341 16836 11307 4661 -709 -6344 -12925 -17585 -19460 -21125 -21736 -18905 -14362 -10440 -5005
1366 -5005 2300 8136 12324 17076 20753 20963 19701 18472 14808 8633 3113 -1802 -8268 -14132 -17210
1381 -17210 -19226 -21140 -20379 -16753 -13040 -9074 -2672 4028 8641 13074 17998 20180 19627 19034 17350
1396 17350 12424 6719 2206 -3377 -9929 -14310 -16587 -19294 -20607 -18169 -14874 -12071 -7008 -185 4850
1411D850M086N401L752M94m3k14l289n276m273m612o463n379k936k900k592O47
1427a8747K733K180L618O066N582L983N088M866J910L46P44j587m426m197l786
1442D373n720o055l690l070l387j081J686J713K382M918N617M238M614N350L338
1457A5226J253J105J1k808l858l531m610n926m705l273l580k625K43J272J384
1472a4422L414N106M528M115N128M414K306J370J069j089l112l237l584n176n251
1487d421l687l381l494j409P07R42J867M070M760L804M399N075L335J593J628
1502A5788N08k205k967k740m197n441m123l303l834k678k04N89O97K824M444L832
1518c010L780M975M274K196J915J718p69k559k229l068n055m592l213l725l784
$$ plain form
1411 4850 8936 14337 18089 18583 18540 18326 15037 9761 5488 876 -5587 -10966 -13902 -16802 -19394 -18747
1427 -18747 -16014 -13834 -10216 -4150 1432 5415 10503 15369 17279 17625 18369 16782 12356 8159 4373
1442 4373 -1347 -7402 -11092 -14162 -17549 -18630 -16944 -15231 -12849 -7931 -2314 1924 6538 11888 15226
1457 15226 16479 17584 17595 14787 10929 7398 2788 -3138 -7843 -11116 -14696 -17321 -17078 -15806 -14422
1472 -14422 -11008 -5902 -1374 2741 7869 12283 14589 15959 17028 15939 12827 9590 6006 830 -4421
1487 -4421 -8108 -11489 -14983 -16392 -15685 -14743 -12876 -8806 -4046 -242 4157 9232 12567 14160 15788
1502 15788 16296 14091 11124 8384 4187 -1254 -5377 -8680 -12514 -15192 -15396 -14807 -14110 -11286 -6842 -3010
1518 -3010 770 5745 10019 12215 14130 15848 15079 12520 10291 7223 2168 -2424 -5637 -9362 -13146
1533a3146j225P0o8J440L824L624L232M582M666K848K128K326M89j701j707k150
$$ plain form
1533 -13146 -14371 -14301 -14369 -12929 -9105 -5481 -2249 2333 6999 9847 11975 14301 14790 13089 11382 9232
$$ [...]
8191e62
##END NTUPLES=NMR FID
##END=
