##TITLE=1H_AM_NV_52
 CDCl3
 8 sc, 
 13.6.2023
##JCAMPDX= 6.0         $$ Bruker NMR JCAMP-DX V2.0
##DATA TYPE= NMR FID
##DATA CLASS= NTUPLES
##ORIGIN= UXNMR, Bruker Analytische Messtechnik GmbH
##OWNER= root
$$ XWIN-NMR		Version 3.5
$$ Tue Jun 13 18:16:59 2023 Russian Standard Time (UT+4h)  she@DPX200
##.OBSERVE FREQUENCY= 200.13135
##.OBSERVE NUCLEUS= ^1H
##.DELAY= (6, 6)
##.ACQUISITION MODE= SIMULTANEOUS
##.ACQUISITION SCHEME= undefined
##.AVERAGES= 8
##.DIGITISER RES= 18
##SPECTROMETER/DATA SYSTEM= spect
##.PULSE SEQUENCE= zg30
##.SOLVENT NAME= CDCl3
##.SHIFT REFERENCE= (INTERNAL, CDCl3, 0, 15.7039)
##AUDIT TRAIL= $$ (NUMBER, WHEN, WHO, WHERE, WHAT)
$$ ##TITLE= Audit trail, XWIN-NMR		Version 3.5
$$ ##JCAMPDX= 5.01
$$ ##ORIGIN= Bruker BioSpin GmbH
$$ ##OWNER= she
$$ F:/spectra/data/she/nmr/H-F/1/audita.txt
$$ ##AUDIT TRAIL=  $$ (NUMBER, WHEN, WHO, WHERE, WHAT)
(   1,<2023-06-13 18:15:43.92 +0400>,<she>,<DPX200>,
      <created by zg, POWCHK disabled, PULCHK disabled
       configuration hash MD5:
       00 E9 B6 7A A2 85 ED C7 34 08 36 98 17 FE 4E 26
       data hash MD5: 16K
       05 BF 2F BA C6 B0 23 F9 C7 7C 9B AC D4 F0 19 A3>)
$$ ##END=
$$ 
$$ hash MD5
$$ 8D 55 71 05 56 10 84 A7 9C CD EE 64 8B 42 F6 04
##$RELAX= 
##$RELAX= 
##$RELAX= 
##$RELAX= 
##$RELAX= 
##$RELAX= 
$$ Bruker specific parameters
$$ --------------------------
##$DU= <F:/spectra>
##$EXPNO= 1
##$NAME= <H-F>
##$PROCNO= 1
##$TYPE= <nmr>
##$USER= <she>
##$AMP= (0..31)
100 100 100 100 100 100 100 100 100 100 100 100 100 100 100 100 100 100 
100 100 100 100 100 100 100 100 100 100 100 100 100 100 
##$AQSEQ= 0
##$AQ_mod= 1
##$AUNM= <au_zg>
##$AUTOPOS= <>
##$BF1= 200.13
##$BF2= 200.13
##$BF3= 200.13
##$BF4= 200.13
##$BF5= 200.13
##$BF6= 200.13
##$BF7= 200.13
##$BF8= 200.13
##$BYTORDA= 1
##$CFDGTYP= 0
##$CFRGTYP= 5
##$CHEMSTR= <none>
##$CNST= (0..31)
1 1 145 1 1 1 1 1 1 1 1 1 1 1 1 1 1 1 1 1 1 1 1 1 1 1 1 1 1 1 1 1 
##$CPDPRG= <>
##$CPDPRG1= <>
##$CPDPRG2= <>
##$CPDPRG3= <>
##$CPDPRG4= <mlev>
##$CPDPRG5= <mlev>
##$CPDPRG6= <mlev>
##$CPDPRG7= <mlev>
##$CPDPRG8= <mlev>
##$CPDPRGB= <>
##$CPDPRGT= <>
##$D= (0..31)
0 1.2 0 0 0 0 0 0 0 0.06 0 0.03 0 0 0 0 0.0002 0 0 0 0 0 0 0 0 0 0 0 0 
0 0 0 
##$DATE= 1686665743
##$DBL= (0..7)
120 120 120 120 120 120 120 120 
##$DBP= (0..7)
150 150 150 150 150 150 150 150 
##$DBP07= 0
##$DBPNAM0= <>
##$DBPNAM1= <>
##$DBPNAM2= <>
##$DBPNAM3= <>
##$DBPNAM4= <>
##$DBPNAM5= <>
##$DBPNAM6= <>
##$DBPNAM7= <>
##$DBPOAL= (0..7)
0.5 0.5 0.5 0.5 0.5 0.5 0.5 0.5 
##$DBPOFFS= (0..7)
0 0 0 0 0 0 0 0 
##$DE= 6
##$DECBNUC= <off>
##$DECIM= 32
##$DECNUC= <off>
##$DECSTAT= 4
##$DIGMOD= 1
##$DIGTYP= 9
##$DL= (0..7)
0 120 120 120 120 120 120 120 
##$DP= (0..7)
150 150 150 150 150 150 150 150 
##$DP07= 0
##$DPNAME0= <>
##$DPNAME1= <>
##$DPNAME2= <>
##$DPNAME3= <>
##$DPNAME4= <>
##$DPNAME5= <>
##$DPNAME6= <>
##$DPNAME7= <>
##$DPOAL= (0..7)
0.5 0.5 0.5 0.5 0.5 0.5 0.5 0.5 
##$DPOFFS= (0..7)
0 0 0 0 0 0 0 0 
##$DQDMODE= 0
##$DR= 18
##$DS= 0
##$DSLIST= <SSSSSSSSSSSSSSS>
$$ [...]
##$SUBNAM2= <"">
##$SUBNAM3= <"">
##$SUBNAM4= <"">
##$SUBNAM5= <"">
##$SUBNAM6= <"">
##$SUBNAM7= <"">
##$SUBNAM8= <"">
##$SUBNAM9= <"">
##$SW= 18.05172834244
##$SWIBOX= (0..15)
0 0 2 0 0 0 0 0 0 0 0 0 0 0 0 0 
##$SW_h= 3612.71676300578
##$TD= 16384
##$TD0= 1
##$TE= 0
##$TE2= 300
##$TE3= 300
##$TEG= 300
##$TL= (0..7)
0 120 120 120 120 120 120 120 
##$TP= (0..7)
150 150 150 150 150 150 150 150 
##$TP07= 0
##$TPNAME0= <>
##$TPNAME1= <>
##$TPNAME2= <>
##$TPNAME3= <>
##$TPNAME4= <>
##$TPNAME5= <>
##$TPNAME6= <>
##$TPNAME7= <>
##$TPOAL= (0..7)
0.5 0.5 0.5 0.5 0.5 0.5 0.5 0.5 
##$TPOFFS= (0..7)
0 0 0 0 0 0 0 0 
##$TUNHIN= 0
##$TUNHOUT= 0
##$TUNXOUT= 0
##$USERA1= <user>
##$USERA2= <user>
##$USERA3= <user>
##$USERA4= <user>
##$USERA5= <user>
##$V9= 5
##$VALIST= <valist>
##$VCLIST= <CCCCCCCCCCCCCCC>
##$VD= 0
##$VDLIST= <DDDDDDDDDDDDDDD>
##$VPLIST= <PPPPPPPPPPPPPPP>
##$VTLIST= <TTTTTTTTTTTTTTT>
##$WBST= 1024
##$WBSW= 4
##$XGAIN= (0..3)
0 0 0 0 
##$XL= 0
##$YL= 0
##$YMAX_a= 268214
##$YMIN_a= -142136
##$ZGOPTNS= <>
##$ZL1= 120
##$ZL2= 120
##$ZL3= 120
##$ZL4= 120
##$ABSF1= 10
##$ABSF2= 0
##$ABSG= 5
##$ABSL= 3
##$ALPHA= 0
##$AQORDER= 0
##$ASSFAC= 0
##$ASSFACI= 0
##$ASSFACX= 0
##$ASSWID= 0
##$AUNMP= <proc_1d>
##$AZFE= 0.1
##$AZFW= 0.1
##$BCFW= 1
##$BC_mod= 2
##$BYTORDP= 1
##$COROFFS= 0
##$CY= 11.3945322036743
##$DATMOD= 1
##$DC= 2
##$DFILT= <>
##$DTYPP= 0
##$F1P= 15.7292609196834
##$F2P= 12.9074282941183
##$FCOR= 0.5
##$FTSIZE= 0
##$FT_mod= 4
##$GAMMA= 1
##$GB= 0.15
##$INTBC= 1
##$INTSCL= 1
##$ISEN= 128
##$LB= 0.24
##$LEV0= 0
##$LPBIN= 0
##$MAXI= 10000
##$MC2= 0
##$MEAN= 0
##$ME_mod= 0
##$MI= 1.114404
##$NCOEF= 0
##$NC_proc= 0
##$NLEV= 6
##$NOISF1= 3.799351
##$NOISF2= 2.8
##$NSP= 1
##$NTH_PI= 0
##$NZP= 0
##$OFFSET= 15.70392
##$PC= 1
##$PHC0= -20421.08
##$PHC1= 8.25272
##$PH_mod= 1
##$PKNL= yes
##$PPARMOD= 0
##$PSCAL= 0
##$PSIGN= 0
##$REVERSE= no
##$SF= 200.130013532006
##$SI= 16384
##$SIGF1= 3
##$SIGF2= 2
##$SINO= 400
##$SIOLD= 16384
##$SREGLST= <1H.CDCl3>
##$SSB= 0
##$STSI= 0
##$STSR= 0
##$SW_p= 3612.71676300578
##$SYMM= 0
##$S_DEV= 0
##$TDeff= 0
##$TDoff= 0
##$TI= <>
##$TILT= no
##$TM1= 0
##$TM2= 0
##$TOPLEV= 0
##$USERP1= <user>
##$USERP2= <user>
##$USERP3= <user>
##$USERP4= <user>
##$USERP5= <user>
##$WDW= 1
##$XDIM= 8192
##$YMAX_p= 0
##$YMIN_p= 0
$$ End of Bruker specific parameters
$$ ---------------------------------
##NTUPLES= NMR FID
##VAR_NAME=  TIME,          FID/REAL,        FID/IMAG
##SYMBOL=    X,             R,               I
##VAR_TYPE=  INDEPENDENT,   DEPENDENT,       DEPENDENT
##VAR_FORM=  AFFN,          ASDF,            ASDF
##VAR_DIM=   8192,          8192,            8192
##UNITS=     SECONDS,       ARBITRARY UNITS, ARBITRARY UNITS
##FACTOR=    0.0002768,     1,               1
##FIRST=     0,             0,               0
##LAST=      2.2672688,     0,               0
##MIN=       0,             -142136,         0
##MAX=       2.2672688,     268214,          0
$$ Real data points
##PAGE= N=1
##DATA TABLE= (X++(R..R)), XYDATA
0@%%%%%%%%%%%%%%%%%oJ4j6J6j6J7k3L0l2L6m4M9n6O6p6Q8r8J11j26J41j58J78
39I5k00K23k49K76l06L38l73M13m57N05n55O11o74P42q16R00r96J102j221J360
59G18j524J713j938K216k568L023l645M549o004Q859k5366P3338Q885j4437J27701
74A75520M3316m5864K805J3038m5590k3790m2732o5505M452P766q3431j4411P4676
87B50k5456o6967N2853L2089o5083r482L0895l9000j6432L0272k2162m776P0282
100c2717J5357j7882P4760O5951k5563J5319N5796j8992l3636L108l6954m2965
112B1582k213m5986n7511L0982J1546o3895J6568P8711j7620l0036O3324L3234
124C8686l4676N603K2345j4802l252l336k7323J2421K3221l9177j2431N5342l502
$$ y = [0, 0, 0, 0, 0, 0, 0, 0, 0, 0, 0, 0, 0, 0, 0, 0, 0, 0, -6, 8, -8, 8, -8, 9, -14, 16, -16, 20, -24, 25, -31, 35, -41, 47, -51, 60, -66, 75, -83, 95, -105, 118, -131, 145, -161, 177, -196, 217, -240, 265, -290, 321, -353, 389, -427, 473, -523, 579, -642, 718, -806, 907, -1031, 1185, -1383, 1640, -2005, 2544, -3460, 5399, -19967, 53371, 62256, 47819, 175520, 218836, 172972, 175777, 188815, 143225, 119435, 76703, 11198, 15650, 23416, -60015, -74426, 250, -25206, -92173, -39320, -7231, -72314, -81796, -50901, -89901, -106333, -76061, -98223, -102999, -32717, -17360, -35242, 39518, 105469, 79906, 95225, 151021, 132029, 98393, 101501, 64547, 21582, 19369, -26617, -84128, -53146, -41600, -105495, -88927, -10216, -27836, -57872, 5452, 38686, 4010, 9613, 31958, 17156, 13904, 10568, -16755, -4334, 18887, -20290, -32721, 22621, 19119]
137A9119m7579K9290L5238l8699j4175K9041j3166j9842J5301p235j2485K6094
149I02K663k2780K6471K8508k5335k114L3556r066k1897J3099l370k0253N784
162F168p172k5857J2176J0549l3685k333L6089j2140k6026K8912K0965k0951K644
175a0661K3302r09k284O627m589M144Q896j8511j0287K0800p156l0209J1937J8836
189I936k2713q564K5319J053j2960J3275J0661o811M453N435p571J257K904j2851
203B823m496N617j1569j0620P606m235j3568P227N738j2774K733J5247n617n149
217b1037J6950P454o794Q109J3779K93J015P171K901K165M13n759L14L463j1827
232A8610j1767M607m674k0232n325M353j2919j4269L214J598p646K05Q557O499
$$ y = [19119, -28460, 830, 36068, -2631, -16806, 12235, -931, -20773, -5472, -12707, -25192, 902, 3565, -19215, 7256, 35764, 10429, 8315, 41871, 32805, 10908, 24007, 20637, 384, 6168, -1004, -26861, -14685, -4136, -37821, -40154, -4065, -16205, -42231, -13319, 7646, -13305, -10661, 12641, 11732, 9448, 16075, 11486, 15630, 24526, 6015, -4272, 16528, 9372, -20837, -8900, 9936, -12777, -21341, 3978, 5031, -7929, 5346, 16007, 9196, 13649, 19084, 11513, 12770, 15674, 2823, -1673, 3944, -7625, -18245, -10639, -14874, -28442, -21215, -15477, -28251, -25518, -10271, -15888, -21037, -4087, 3367, -3427, 4682, 18461, 18754, 19769, 26940, 29841, 32006, 32419, 26660, 26974, 30437, 18610, 6843, 11450, 6776, -13456, -18781, -14428, -27347, -41616, -38402, -36804, -44450, -44245, -35688, -29189]
246b9189O202Q761J1498J3845R260M404R309Q676l568n123K041n058j3886o433
260A0739j734q800p881J112J518j919J284M369J877j105j662j694l401o904o911
275b1112l213k755l959Q67O516N746N717J0337J0962O342M982N248J317l444m196
290A9355l856n647o124l259j47O82K137N385O267M195K841K208j807o580q708
305F942j0022j2883j3724j0875p858n615j411N017R088J0785J3573J6228J4729
318A3974J1237R572P765K674k161l164l745o859q223n152l549n495m684q90j481
333a81n096m317k236n426p844n235l313m302k566J872N062O845Q456J1127J3822
348F668J1962Q599R611Q794R78l188p69n082j2709j0350o920j1810j2597o018
$$ y = [-29189, -22987, -14226, -2728, 11117, 20377, 24781, 34090, 42766, 39198, 34075, 36116, 31058, 17172, 10739, 9005, 205, -7676, -6564, -5046, -6965, -5681, -1312, 565, -540, -2202, -3896, -7297, -14201, -21112, -24325, -27080, -31039, -30172, -23656, -17910, -12193, -1856, 9106, 15448, 20430, 25678, 26995, 23551, 19355, 15499, 9852, 3728, 469, 322, 1004, 3141, 8526, 14793, 18988, 21829, 24037, 22230, 15650, 6942, -3080, -15963, -29687, -40562, -48420, -54035, -55446, -50429, -41341, -30556, -16983, -755, 13974, 25211, 34783, 42548, 45222, 43061, 39897, 36152, 29293, 21070, 15918, 12369, 6874, 2190, 1300, -181, -5277, -9594, -11830, -17256, -25100, -30335, -33648, -37950, -40516, -38644, -33582, -26737, -18281, -7154, 6668, 18630, 27229, 36840, 45634, 46612, 43424, 42655, 37573, 24864, 14514, 7594, -4216, -16813, -22831]
362b2831m526o050k481J293K450M201M580N415R778Q590L443P493J1443K470j303
377B3965O291K927p609m448Pp216r887m618n299o544l580m448l455K499m57m631
393b6503M076O565l136J71J0146L930j92R461R688L126Q072R292J344L124M552
408D3716o640q527k738j1633j8109r052q621j5355o778J24l887K920J1521N031
422b8028P066J7844R202j83J0747R611o706l465N297m575p700J276o50k092M924
437A2568N15l331P716L320j2373l044N703j2848j6652J274k173j3221j532O004
451b8074Q73O337R649L862J0848J4271k466k041J2444j650j7013p50M169j3124
465b665q990N115p74j740O570K288L032J2244J589p550Q060O329j5549q263P287
$$ y = [-22831, -27357, -33407, -35888, -34595, -32145, -27944, -23364, -17949, -8171, 419, 3862, 11355, 22798, 25268, 23965, 30256, 33183, 25574, 21126, 21133, 13917, 4030, -588, -5887, -12431, -16011, -20459, -23914, -21415, -21872, -26503, -22427, -15862, -18998, -18827, -8681, -4751, -4943, 4518, 14206, 17332, 25404, 34696, 36040, 39164, 43716, 37076, 28549, 25811, 14178, -3931, -12983, -21604, -36959, -43737, -43613, -47500, -44580, -33059, -28028, -20962, -3118, 6084, 5901, 16648, 26259, 19553, 16088, 21385, 16810, 9110, 10386, 9736, 7644, 12568, 13083, 9752, 17468, 20788, 8415, 5371, 11074, -1774, -18426, -17152, -19325, -32546, -34078, -28074, -27201, -20864, -11215, -7353, 3495, 17766, 15300, 13259, 25703, 24053, 7040, 6290, 10459, -2665, -11655, -6540, -7314, -9054, -2484, -196, 2836, 15080, 16669, 9119, 17179, 23508, 7959, -304, 6983]
480F983p420j5117J039J958n802J443K570j213Q190O171p685L118J4018o128j0874
495h749J0977O123j1657J1J0382j011q44N553q3K785P185o513o284R890j950j7979
511b164j38P521j2998j1033O236q39p108K789J458o51Q473K409n558R940J1924
526A0261q270k189J5213P20j0698M510N888o325k483L41m885J420J085j0436j098
541f946J1046n989j1742J0152Q084j1158k218J0558n01m923K203L38Q62L382n451
556b303l633J0398Q16j2809L922J2198p975q548R365L407p971J09L495j198J656
571I29k65m129N339N807q056k132J1260j025j0012M463O312o621l120L642k097
586B95j864J291m512j800N530l184p568N810N518p194o94R111Q70k401M704K961
$$ y = [6983, -437, -15554, -14515, -12557, -18359, -16916, -14346, -15559, -7369, -1198, -8883, -5765, 8253, 2125, -8749, 2228, 8351, -3306, -3295, 7087, 6076, 5232, 10785, 10702, 13487, 20672, 14159, 7875, 17765, 15815, -2164, -2302, 5219, -7779, -18812, -12576, -13415, -20523, -17734, -16276, -16927, -8454, -6045, -11603, -1663, 10261, 1991, -198, 15015, 15735, 5037, 9547, 15435, 9110, 6627, 6968, 2083, 3503, 4588, -5848, -6946, 4100, -1889, -13631, -3479, 4605, -6553, -8771, 1787, 1286, -3637, -1434, -1096, -234, 3148, -2303, -5936, 4462, 5278, -7531, -3609, 8589, 614, -7934, 1431, 4838, -3133, -3024, 471, -727, 929, 664, -3465, 1874, 7681, -375, -2507, 8753, 7728, -2284, 2179, 8491, 1870, -1250, 2392, 295, -1569, -278, -4790, -6590, -1060, -4244, -11812, -6002, -484, -7678, -8372, 739, 1609, -792, 3912, 6873]
602F873K24L026j556m181L505n16j0696k215N204o194p773N356M345l392K335
617e655O628K737L257K685j049K296K584p024n368L528l188r748L99M470l801
632g249j806N370K194N1K189l82j195J247l479o253P65J060n142M5P554L610K248
649H27Q372P832L679M242J977k116j955m734j0546q234m821r696r231r87K38k119
665b7272L095P277N223N299O275M074L243K677j535k076P69j719l988R99L206
680E547R1J698N361L092M96J354p31m211m758o465q361o955n828o192l040J065
696b7837J909L911P585P915O878P868O468L072K071Q77k979m257l252m451n232
711E46l015j234j250RJ552J727J775J146J64Lp12k626k829j331j674k211P5K232
$$ y = [6873, 7097, 10123, 8567, 4386, 7891, 7375, -3321, -5536, -332, -6526, -14299, -8943, -4598, -7990, -5655, 973, 3710, 6967, 9652, 8603, 10899, 13483, 6459, 1091, 4619, 1431, -8317, -7918, -3448, -7249, -9055, -3685, -1491, -1440, 749, 367, -828, 419, -3060, -9313, -8548, -7488, -12630, -12585, -5031, -1421, 827, 9199, 17031, 20710, 24952, 26929, 24813, 22858, 18124, 7578, -656, -5477, -15173, -24404, -25391, -25153, -27272, -24177, -16900, -11677, -6378, -103, 3971, 7214, 9891, 8356, 6280, 7049, 5330, 1342, 2341, 5547, 5638, 7336, 12697, 15789, 16285, 17639, 16908, 12697, 7939, 1474, -6887, -13842, -19670, -25862, -28902, -27837, -25928, -22017, -14432, -6517, 361, 8229, 14697, 17769, 19840, 20717, 17738, 13481, 10229, 5778, 546, -2469, -3703, -4953, -4944, -3392, -1665, 110, 1256, 1420, 1423, 711, -1915, -4744, -6075, -7749, -9960, -9885, -7653]
729g653J806K142M178M215K578K091J849M34j491k536k657k959l738l505j896
744g142j056r03K86K137K202J747K451K911J629O41Q54M93q68j311q07q49j417
761I98j384n08k94q02m10J99J08l77j54L87J54l04J50O92M78nO71Q27M00J84O47
782A657M43oj29K47Ol16k90r3k20n21m91k28m46p55l69j97m24k13J99K96M61N63
804h26Q80Q06N47N12M25j16k67o53p36q98j236q54n20n01k47N55O10O02J159J407
824F49R76R09J137N27J31J39r9p25o49p55j185r85p68j132q27m49n83l53K05N0
844c787j9Q28Q37J6P03J372L09n4R64N78k75J30O44J74Q1K47K62N27K06n33k77
865B933L52j165k066m97p10k353j598K08m32q43Q37J454J177J585J609J350J653
$$ y = [-7653, -5847, -3705, 473, 4688, 7266, 9357, 11206, 11640, 10149, 7613, 4956, 1997, -1741, -5246, -7142, -8198, -9101, -8815, -6678, -4476, -2729, -278, 2633, 4262, 4903, 5757, 6250, 5382, 4071, 3264, 2415, 998, -386, -894, -1188, -1990, -2400, -2201, -2093, -2470, -2624, -2237, -2083, -2387, -2237, -1545, -1067, -1072, -401, 426, 826, 1010, 1657, 2100, 2094, 1965, 2212, 2218, 1902, 1612, 1519, 1299, 778, 287, 59, -387, -1142, -1511, -1708, -2132, -2345, -2146, -1850, -1389, -826, 54, 860, 1407, 1919, 2344, 2228, 1961, 1308, 572, -326, -1562, -2416, -2936, -3437, -3684, -3129, -2519, -1917, -758, 649, 1625, 2534, 3671, 4198, 4329, 4468, 4369, 3644, 2995, 2240, 1055, 70, -698, -1830, -2657, -3106, -3689, -4042, -3837, -3787, -3806, -2978, -2141, -2125, -1422, -50, 259, 205, 1169, 1747, 1472, 1602, 2246, 2420, 2501, 2748, 3010, 3537, 3743, 3210, 2933, 3285, 2120, 54, -443, -1153, -3506, -5104, -4896, -5328, -6171, -5334, -3880, -2703, -1118, 491, 1841, 3494]
882C494O79p23k15Oj964k254l53p02j516J37J327P57J461K144J311J294J445l08
900F020j271k76j306l284k077q24j948j424K98N21Q38J744J155J167K340O81j199
917A155M72P07k249k151P29n5j364O84K004J477J621J598J156J821N98k121j365
934D717n2l074m596j244p92l077j616J259J006P72J969J948K457K785N67J26K215
951E370O97k606n38J461j528k315N32O12r58l63J15r5M36n92k004L44R14k420
969b938j908J885N04k071N67K517M97K03J441J279J204R92o86J08J797q32k844
986A715N89R04l006k291P13q45k197o08r1j12O32R7K01K701K474m91J281L765
1004E431N47j581J162R13k025j595r20j515j107r51j928J30J845j017j137K786
$$ y = [3494, 4173, 3450, 3235, 3241, 1277, -977, -1330, -2032, -3548, -3411, -2084, -1327, 134, 2278, 3589, 4883, 6328, 6020, 4749, 4473, 3167, -117, -2194, -3018, -4966, -6390, -6092, -5571, -4733, -2989, -1834, -667, 1673, 2354, 1155, 1627, 2334, 85, -2066, -1337, -1392, -2756, -2072, -68, 1409, 3030, 4628, 5784, 7605, 8203, 6082, 4717, 4665, 1591, -3005, -4249, -5041, -8118, -9734, -8475, -7469, -6697, -4728, -2780, -323, 2462, 3029, 3155, 5370, 6067, 3461, 2923, 4384, 2856, 541, 1073, 1685, 727, 364, 479, 384, 820, 228, -1776, -1432, -518, -2938, -4846, -2961, -2457, -4528, -3961, -1444, -947, -744, 697, 1976, 3180, 4172, 3486, 3594, 5391, 4559, 1715, 2304, 3208, 202, -2089, -1376, -2221, -4418, -5026, -5117, -5229, -4597, -4500, -4299, -1598, 876, 385, 1666, 5431, 5978, 4397, 5559, 6472, 4447, 2852, 1932, 417, -690, -1641, -3569, -3439, -1594, -2611, -3748, -962]
1020i62J610k162k35J874p97k020j43L1j04M62n8J070L207J543m12K498L094j309
1038G187j809J029r34l849k453j341k104j648j115n52J694J939oJ697M149J103
1054B987j067J574J335k067j870j85j246j559m23m21N03J951L64K29K696J734
1070D535j284j54J241j443k667o77q38j844o34j89r0J490J310N6J724K589j81
1087B944q44J274o9k358j232m09j596j126j39l67P06J510L08P23K673J103o85
1104B416Q90J156j149j353j1p69j303n55o65m16N38j35p06J142R92r27j67J325
1122C03l09j267L82M52o92j00M27J18N28M90o8P24J093l08m98R22J89j279k76
1141H31L34p65r43J4l34l97l0k47k10O60J16l30N68Q12k47J03Q49P3l41M36J26
$$ y = [-962, 648, -1514, -1749, 125, -672, -2692, -2835, -2804, -2908, -2446, -2504, -1434, 1773, 3316, 2904, 5402, 8496, 7187, 5378, 6407, 5473, 1624, -829, -2170, -4274, -5922, -7037, -7589, -5895, -3956, -3962, -2265, 1884, 2987, 1920, 3494, 4829, 2762, 892, 707, -539, -2098, -2521, -2942, -2439, -488, -124, 105, 2801, 4535, 3251, 3097, 4338, 2895, 228, -449, -1287, -3131, -3765, -3954, -4044, -2554, -1244, -1188, 536, 3125, 2944, 2100, 3374, 3305, 947, -285, -694, -2290, -3416, -3555, -3922, -3216, -1706, -1398, -675, 1998, 3101, 2416, 3306, 4462, 3313, 1960, 1949, 1180, -123, -678, -1343, -1759, -1221, -1356, -2062, -920, 72, -855, -1022, 303, -6, -1273, -891, -439, -1131, -1231, -804, -686, -158, 332, 264, 988, 2081, 1773, 1275, 2197, 2386, 1107, 831, 1165, 400, -543, -529, -863, -1260, -1290, -1537, -1747, -1087, -971, -1301, -733, 79, -168, -65, 784, 857, 516, 952, 1078]
1162A078m52j1rn71j29R6m69k25L47l2l10L70K87j32L04K04l2K8L31k39k16L36
1184E54j94l38MO0l68j98J91j61j91K34jK1K92J59l0L16K31j78j50J25j91l94
1206b07j18q5j86p5J41K14K32L81K64K98L56j74j93j39l13p47l93k85k69k31K96
1227a233M84M87O91Q04O39L00J83k41m17q72j205j002r24r57n38M5L34O23J104
1246a695J519J317J114J052P05O7l34p39r15j227j301r24n10k77l8O21R18P68
1264A21O83O88L02l85o82q56j253j286j081o67j40K51Q89J504J862J782J803J675
1282E210J060J19j24q32j573j951j905j842j617r94m40J13P26J068J373J356J151
1299H98N98M18L1p24q92q39q45q94p5K65N24J006J429J240J083R69M05k61n70
$$ y = [1078, 626, 615, 606, 35, -94, 2, -467, -692, -345, -377, -687, -317, -30, -162, 142, 346, 314, 342, 673, 434, 218, 554, 360, 22, 26, 86, -282, -480, -289, -450, -641, -407, -408, -387, -95, 64, 34, 350, 581, 403, 253, 378, 187, -207, -325, -410, -596, -671, -530, -316, -84, 297, 561, 859, 1215, 1041, 848, 709, 396, -351, -744, -1029, -1298, -1529, -1233, -749, -262, 429, 1233, 1872, 2172, 2355, 2114, 1697, 825, -380, -1382, -2306, -3263, -3801, -3756, -3422, -2799, -1695, -176, 1141, 2255, 3307, 4012, 4079, 3745, 3006, 2091, 864, -437, -1361, -1871, -2148, -2186, -1565, -647, 121, 804, 1492, 1794, 1409, 727, -129, -1382, -2668, -3749, -4416, -4556, -4305, -3416, -1912, -50, 1732, 3535, 5210, 6270, 6389, 6265, 5433, 3860, 1909, 4, -1838, -3455, -4449, -4889, -4776, -4050, -2982, -1609, -253, 898, 1496, 1914, 1945, 1221, 329, -510, -1355, -2249, -2324, -2059, -1535, -529, 900, 2140, 3223, 4192, 4597, 4336, 3766]
1318C766j074j557j462j560j614q14j27r6L93J397J355J049J499J300M75J58N2
1335C140o64p99p79j180j031p1m52l85O96R14J18N62J071K61k45J22k08o50m27
1354gn07o45L9J36l86M38J179J9m2J150M33n64m8K56q42o31j88p29l98J38m70
1375a669k94Q66K91l98O82J016k07K5Q79M3k55M42j42n36L82j18j163K07M57j087
1395e79o36Q31j25q41M79M68k87M17L07k84N79N56r06j77J228o01j334P74N52
1414D21j013j84R72j48q6L33q6J52P11p58p31J033N9j773J94J412r11q76J164
1433a15N93n54L92M00j24N99j72j077M67O46j598q95J354k83j680N24J037o19
1451a105j28P39J30M41O41n31J90J514n17j300J228Q22j710n12J134n36j062J85
$$ y = [3766, 2692, 1135, -327, -1887, -3501, -4315, -4442, -4538, -4145, -2748, -1393, -344, 1155, 2455, 2930, 3088, 3140, 2476, 1677, 898, -282, -1313, -1384, -1836, -2221, -1525, -611, -493, 69, 1140, 1401, 1156, 1278, 1070, 420, -7, -514, -1159, -1120, -984, -1370, -932, 247, 266, 224, 1374, 1807, 1243, 1195, 1451, 609, -22, -210, -939, -1337, -1199, -1669, -1963, -1097, -806, -1204, -522, 494, 287, 312, 1191, 1234, 979, 1421, 1279, 743, 1125, 1007, -156, 51, 508, -579, -1215, -384, -509, -1350, -871, -403, -690, -273, 34, -250, 329, 885, -21, -198, 1030, 429, -905, -131, 421, -592, -776, 196, 48, -38, 295, 209, 361, 1072, 314, -417, 616, 675, -1098, -904, 508, -403, -1279, -115, 478, -76, 316, 716, 592, 1191, 1019, -58, 409, 1055, -543, -1438, -84, -367, -2047, -1523, -486, -1105, -1233, -494, -364, 77, 718, 187, 377, 1891, 1374, 74, 1302, 2124, 414, -98, 1036, 500, -562, -377]
1469c77Km68M21l12n65J141N56j350L35J642p34j290J013L65j247r1M54l22L62
1488d65L43n00Q10J471p49m36J726L30j855J1Q27j361j140O1l28l63L55m26J99
1507a490J770Q5q25J462J380j507q42J229n41j778k89J57o16OJ78N3J357J080
1525H69o35P91K033m75j326P49L18j907r83K95q11p30M1j30M88J043q8p0J624
1544A096M84j321K13R43j142j286L57o6p43K07K27J71J038N86k81R58J098p88
1562A751o41P74m49j481l41j6r12m87J49j78L30O60j67K15J418J11o36P70P95
1581A665p18m48M95j73n08j6j89k69L06l84n36N08K91q94r7R64j60o41N50M17
1601A63k77PJ51o2J15k4m44K09N90l55k45R31M23n01L14P30l23n27j23m50p42
$$ y = [-377, -375, -843, -422, -734, -1299, -158, 398, -952, -617, 1025, 291, -999, 14, 379, -868, -959, -505, -827, -465, -122, -622, 188, 1659, 910, 474, 2200, 2530, 675, 686, 1513, 152, -988, -927, -1255, -1618, -1263, -1689, -1490, 280, 365, -460, 1002, 2382, 875, 33, 1262, 721, -1057, -1346, -1189, -1805, -1799, -1621, -1568, -211, 869, 234, 1025, 3058, 2583, 1257, 2006, 2324, 417, -566, -271, -1082, -1812, -1771, -1901, -1413, -370, -458, -528, 1096, 1580, 259, 472, 1415, 273, -1013, -656, -722, -1465, -1258, -1031, -860, 178, 764, 483, 1441, 2539, 1751, 1110, 1884, 1435, -46, -387, -403, -1315, -1802, -1653, -1831, -1501, -841, -1008, -793, 625, 736, 100, 870, 1665, 947, 499, 994, 821, 313, 297, 108, -161, 145, -239, -775, -267, 24, -870, -967, -3, -163, -804, -254, 163, -114, -107, 44, -18, 97, 73, -371, -162, 428, 73, -172, 759, 1182, 681, 995, 1725, 1402, 875, 752, 302, -440]
1622d40n70p15n04L4j53j17O68J003K84P85J216N70n2L93j2o54o00n74q63n73
1642h74k70l83N2N72L69M29P47O47KKm5o33p16n23p98p40j61K8N0O48R58P99Q76
1665A036J032N12K00N5m40p66q60r10j039o48l09l14L09O27P15P48Q68P12L55
1684A883J20p6n10o48q01p45o41l95k13K4M84N51O26P31P35L32J92P8k37n57n58
1705C75n66n24m03k46KL01L73M83N40O24L54N9O0r9m78n23m99m41n24l49q6R7
1727a470J71K66M47N08L67L09K81K56j71j30j01k02l39j75r0j14o1j1K16m0Q9
1748FJ5J26p5q0QNj50j58p1O2o3kP5J34OJ17J67Q6K3Q3J19%oq1j3K4k45j05j4
1777gj36j84o2O9j19J4J71l7J65P1J43RP1J18r3N4J0k4m7%j58j11Kk2j91P7J5
$$ y = [-440, -1010, -1725, -2229, -2195, -2348, -2465, -1797, -794, -510, 275, 1491, 2061, 2009, 2402, 2390, 1736, 1136, 562, -301, -874, -1144, -1527, -1475, -903, -534, -105, 642, 1289, 1291, 1293, 1248, 615, -101, -624, -1422, -2162, -2323, -2295, -2245, -1597, -639, 160, 1036, 2068, 2580, 2780, 2835, 2395, 1629, 769, -141, -1180, -1828, -2137, -2451, -2142, -1515, -800, -52, 816, 1528, 1883, 2003, 1927, 1417, 769, -32, -777, -1418, -1813, -2026, -2002, -1518, -967, -341, 390, 1125, 1457, 1649, 1727, 1490, 933, 375, -191, -715, -1118, -1364, -1362, -1061, -688, -205, 335, 959, 1313, 1372, 1432, 1333, 855, 332, -167, -608, -1132, -1481, -1567, -1470, -1299, -1033, -586, -78, 289, 598, 879, 1135, 964, 834, 733, 531, 192, 17, -73, -187, -248, -259, -43, -83, 6, 21, 147, 72, -8, 0, 5, -145, -303, -374, -312, -375, -377, -302, -168, -162, -45, 122, 208, 231, 314, 433, 433, 427, 346, 333, 357, 112, 7, -7, -143, -327, -389, -320, -439, -425, -254, -291, -126, -55, 88, 97, 168, 286, 193, 247, 257, 233, 186, 186, 28, -83, -81, -103, -294, -217, -202]
1804b02j15N9J35O8m7J84J49KQ7L6j09pl5l32j10J36k76l05K70J29q5J40N59L4
1828C65J57J97oo5o1m67l87p2l11n51M2M29j48J94Q20O02M6M01L19j17k06l81
1850H00o76l71l85q69l44M93qq1R01R87K53N08P36J6k15j90p61q31m44r07q11
1871b199K16K63k89P35J292O45M00R72L64k04j72o74j052n19q40j233k39M74j34
1890b194K00J369J144M55Q19Q01j3j80m68j153o92o49j339q62M80O1l62J117J606
1909A40M95N13J189M19l14k82o92r59n83j209j202J68L97o07M58J715P74O0J103
1928A583Q94k19k58l29r11n25p62j278l67P05m36k93J369J179j29O25J181J4l79
1947A664l6n64p11m12r58p74L83K5p06O56J327Nj0J234M13m03N9K2n89k13m34
$$ y = [-202, -317, -258, -123, -55, -102, 82, 231, 233, 320, 356, 247, 240, 205, -127, -237, -101, -377, -682, -412, -283, -368, -228, 331, 365, 522, 719, 713, 648, 587, 120, -267, -339, -650, -1201, -1159, -730, -878, -684, 136, 738, 784, 1185, 1504, 1387, 1181, 800, 124, -247, -632, -1501, -1845, -1352, -1360, -1441, -540, 447, 700, 1208, 1944, 1960, 1745, 1555, 794, -37, -481, -1388, -2199, -1983, -1720, -2009, -1274, 18, 663, 1063, 2035, 2399, 2195, 2023, 1349, 297, -222, -1062, -2295, -2534, -2060, -2194, -1994, -625, 519, 974, 1793, 2594, 2581, 2401, 1933, 780, 88, -561, -1900, -2762, -2282, -2221, -2583, -1466, 140, 635, 1148, 2337, 2756, 2442, 2160, 1468, 509, -74, -1283, -2485, -2317, -1920, -2527, -2069, -354, 420, 480, 1583, 2477, 2258, 2000, 1671, 760, 235, -527, -1805, -2172, -1467, -1903, -2196, -827, 352, 223, 848, 2029, 2043, 1664, 1628, 1064, 353, -59, -1017, -1791, -1408, -1383, -2089, -1433, -106, -101, -111, 1123, 1536, 1133, 1192, 1214, 625, 412, -22]
1968b2q10N1M10p21j44J099L08m96N54P37l47j75K41k91l02N8n67l10N59k21p49
1989a138O61O95o50j10R19k8k91L17R5j27K23j34m40M48J39r49p3P95n02p75M45
2010d80M86n85J03M27%J41L43k22J52N72n98n18N41l2r79J21N29m07l68N98J13
2031f3n5L78J91j32M34q9n85O3L48q06m96N20j09m85K97M41j46L16L21m7K45L02
2053H43m29j80L36l01o56K09J04m53k4L01j17K4L67Ol9M61m7l13K86J90n22%J97
2076B43l17l33J79k1l00J36M4m9K58K17j66J95N31o9j86L63K3m59q6M3m29k52
2098d35J5k11K0K54l7P1N27J80j44K62K59l25k71K9l46m72j57n0j27J84K71K22
2120b81N35N43J30K22L88j48m44j19l79o71n40k85k74k15J14K63L73N39M45L54
$$ y = [-22, -832, -781, -371, -1092, -1236, -137, 171, -325, 229, 966, 619, 444, 685, 394, 92, 150, -417, -727, -168, -389, -1138, -477, 218, -432, -542, 377, 349, 58, 375, 470, 343, 566, 432, -8, 440, 579, -370, -443, 352, -150, -925, -480, 6, -579, -476, -49, -49, 92, 435, 213, 365, 937, 339, -179, 362, 330, -649, -528, 1, -406, -774, -176, -63, -118, 260, 451, 319, 753, 664, 79, 142, 490, -316, -812, -292, -401, -886, -589, -148, -294, 22, 343, 296, 541, 843, 414, 234, 570, 269, -387, -178, -74, -527, -551, -250, -367, -343, 24, 30, -9, 452, 405, 92, 378, 568, 46, 46, 243, -74, -407, -228, -249, -549, -413, -369, -418, -160, 57, -109, 86, 617, 548, 362, 725, 748, 289, 203, 246, -183, -435, -420, -631, -611, -357, -394, -323, 204, 384, 240, 502, 761, 436, 165, 194, -152, -624, -781, -831, -958, -774, -503, -281, 254, 797, 927, 1149, 1537, 1389, 945, 826, 447, -224, -764, -1049, -1323, -1538, -1424, -1161, -788, -249, 196, 550]
2140E50M10J90j31m3k39m70m38j78l35k22J10J60K39K95O19K49K43J20l7k64k92
2161E36m77m26l49l85k48M1J81J74L42N38M24K38M38J95o5j31j99l02l44l39k74
2182d32k36m9p0P7J95K06R3K08K36J9Q2K4n0o3m5l4o5q3M4j21mN3j59K7J36o6
2208g7Q4Q1J1%R0Q5j56l7j08j60k24j16r3o7L7J15K25K97L74K77L31K57Q7r3j56
2233A064l14m73m51m71n15k74j02J07K06L94N09N01N68L75J38J06j08m99m21m67
2253a27n33m06k62K9J74L68N02N63N44N04J66L8q8n00o38n81n52o49k31n7L7L84
2275a315P27N39P19O47L85J80Jk32o81o22p27p46m72k86j14K42N67N59N65Q11
2295G47N57K05J85j0l92n83m04o00n62k85j35j3L83L67L35O16N81N9J13Q6k97
$$ y = [550, 960, 1150, 1019, 976, 737, 267, -171, -349, -684, -906, -796, -636, -397, -102, 517, 766, 1009, 1129, 1092, 828, 536, 59, -367, -716, -1101, -1349, -1308, -1127, -953, -611, -73, 351, 589, 1027, 1222, 1157, 1026, 827, 525, 181, -158, -432, -668, -717, -787, -710, -515, -309, -216, -8, 228, 247, 329, 353, 303, 240, 195, 161, 96, 13, 57, -64, -68, -15, -174, -147, -11, -77, 7, 88, 99, 99, 189, 274, 118, 81, -27, -187, -411, -527, -620, -687, -650, -535, -310, -13, 361, 638, 969, 1226, 1313, 1220, 1064, 750, 277, -174, -645, -1160, -1434, -1536, -1429, -1223, -829, -320, 181, 749, 1124, 1262, 1368, 1260, 761, 340, -127, -660, -1066, -1328, -1299, -1125, -757, -255, 308, 852, 1356, 1522, 1560, 1472, 972, 334, -247, -799, -1448, -1679, -1736, -1699, -1315, -588, -49, 670, 1317, 1702, 1882, 1883, 1651, 970, 348, -379, -1125, -1597, -1883, -1997, -1755, -1188, -629, -64, 747, 1304, 1509, 1694, 1684, 1292, 709, 305, -295, -857, -1142, -1277, -1290, -907, -540, -205, 411, 992, 1051, 1164, 1250, 953]
2316I53o34l66l50o50k95m9mJ44N02L32N00P20K22J16L03l4m32l56j52n37m62
2337e29q7j67r1J52J84R2L52L56q4J27K91l04k77J70j58l36m8Q3j63O8K04MJ70
2360IK97m1o7M12K0m61J16M9k53k04M0j18j02J05m5l8K15P4k84K13L44l02j12
2383a33L18L4l25Q1J08j24m5J15j49N5J52k13p2L96o3l20K81K67l19o3K63o0j26
2406E8N6j01q5J52j93k44K84O9l73mM64k06k29K90K86j85J14J90q2K43j5k76O2
2429B75J80m13m91K61k8n37K6L65j28J4L42J29J90L24l7j16K48r4n31m2J01l45
2451c07k65L77N8kL83K38J31K43Q2k81p7j70n90o06j5l98m68N8L37R9M78O91L95
2474C91O03M95L3j3J27l99p53k49k80q28l08J75L1O6M98M24L80N05J46j41L1k87
$$ y = [953, 319, -47, -397, -1047, -1342, -1391, -1395, -1251, -749, -417, 83, 803, 1025, 1141, 1444, 1410, 978, 622, 470, -67, -529, -616, -783, -874, -722, -538, -446, -94, 262, 178, 305, 596, 292, 15, 185, 27, -309, -357, -274, -437, -369, -165, -161, 9, 306, 265, 198, 610, 630, 169, 285, 334, 81, -123, -83, -201, -303, -198, -243, -281, -66, 8, -276, -63, 281, -21, -133, 185, 219, -106, -25, 83, -41, -86, 29, -120, -65, 87, -126, -198, 198, 135, -185, 96, 363, 44, -19, 244, 184, 58, 114, 13, -72, 80, -113, -357, -73, -4, -377, -381, 83, -123, -352, -62, 224, 39, 153, 343, 261, 504, 489, 213, 275, 455, 42, -449, -188, -216, -753, -727, -362, -490, -476, -134, -5, 185, 509, 472, 356, 604, 510, -21, -63, 38, -307, -572, -195, -137, -139, 244, 482, 613, 856, 938, 657, 580, 410, -180, -786, -801, -1199, -1667, -1609, -1272, -1173, -695, -4, 391, 994, 1489, 1522, 1509, 1636, 1237, 484, 235, -45, -873, -1181, -1006, -975, -909, -411, 13, 393, 898, 1044, 903, 934, 647]
2496F47q05m68j49o62m23K46L66J08O29R08N01N56M83O6p6j82p10p65m75n66q22
2517a593j98K62r4K67P60N93M52O73K91l9L3k68o57m25l85p69l44J12P4N8N99
2538e98O05L90M75M01j0j2j78n03n23l21n17m30l9J33O4L89O09L41L90M97J10
2559A273K9j31l00m82l76l11o29k37N1q3J08L92K92K82L90L12kJ59M3j93k22j01
2581B64k51k73Q9K5j67J08K94l7P7R7mnl4j46j52j6j02k43L4J35o5p3K14J28p8
2606a81K55J55M8M6P3J7J8pj10p1j0j49j58o9j47j72o1J27j01P5J21J47P1K25
2630A42K02j2J19Lp0j3j95j31k07J1j71mJ01L3J3J45J58M9M6L4m1j86l2j04j90
2655c00k0n5qQ4J37J37R6K08J64OK2L1j00j53m9j46k73m1p3l8m3J0R9J44P0L9
$$ y = [647, -158, -626, -775, -1437, -1860, -1614, -1248, -1140, -511, 397, 898, 1454, 1937, 2003, 1927, 1745, 1035, 270, -205, -771, -1593, -1791, -1529, -1623, -1356, -596, -3, 449, 1122, 1413, 1374, 1407, 1139, 482, 57, -328, -1097, -1441, -1329, -1255, -1197, -598, 7, 397, 872, 1273, 1263, 1251, 1073, 570, 47, -274, -791, -1221, -1260, -1127, -1063, -674, -65, 276, 666, 1163, 1273, 1302, 1171, 871, 389, 13, -298, -927, -1164, -1113, -1196, -1088, -696, -404, -122, 268, 580, 578, 737, 780, 587, 365, 264, 13, -260, -171, -146, -313, -205, 89, 52, 129, 226, 222, 217, 183, 37, -115, -131, -233, -476, -442, -307, -372, -445, -231, -103, -181, 74, 229, 277, 323, 396, 413, 431, 424, 314, 243, 233, 84, -74, -143, -290, -462, -523, -396, -497, -422, -301, -154, -83, 142, 344, 332, 451, 454, 384, 371, 176, 45, -162, -151, -322, -326, -225, -192, -179, -34, 124, 173, 219, 253, 212, 26, -6, -110, -300, -320, -375, -383, -299, -162, -25, 71, 279, 443, 449, 471, 502, 402, 249, 200, 54, -219, -260, -333, -371, -414, -404, -305, -161, -91, -52]
2681e2R1J33n1O1Prj24j0M1j81jJ4p6O5K9j9J25K8O2PR8L0l0K2J4j08r2j10j23
2710a59j60Rq4k4J9O2J01Q0J78O7R5J52nj04N6j26j90l1o7j74J6J51K4J58J24
2735A68J32J93R1r0j54N1k36l88j43j26k64j11J80P5R6L11K88J67K61J64j8L5
2757F82o5k38k83o3k37k53J4oo2J72L25j3J03L08l5r5P1p5l25o4k1k70M0J47j02
2782c45J35L08R5l2L63M6k54N2J8l54j36M7k98j62J16o2l1J60K34j09J94K55j29
2805A11O9L19j55j44K33j4k94N8R9l30o6J12k79j36K57j39j32K09J25j49K09L34
2827B97j86j9L37k12k53J90q8l56J69P7k70J30L57j37P8M80j25k18L16j48m62
2848d3n1M8n63j29K34k33m3N05J02rN91L88k42K22K75n48k13N8o12m46J17j26
$$ y = [-52, 39, 172, 121, 182, 189, 180, 56, 46, 87, -94, -95, -81, -157, -92, -63, -82, 43, 71, 133, 140, 238, 268, 238, 260, 274, 166, 74, -36, -159, -319, -310, -394, -418, -399, -337, -236, -156, 22, 89, 184, 336, 331, 227, 283, 157, -33, -64, -131, -305, -289, -138, -114, 44, 168, 300, 493, 584, 494, 340, 391, 155, -233, -376, -502, -766, -877, -697, -622, -526, -215, 73, 240, 501, 665, 647, 682, 617, 379, 96, 33, -204, -457, -443, -449, -511, -339, -14, -27, 76, 384, 349, 254, 325, 250, -75, -139, -160, -430, -390, -243, -345, -210, 98, 193, 161, 524, 570, 316, 368, 386, 32, -104, -57, -355, -517, -401, -463, -494, -334, -100, -209, -15, 240, 111, 180, 499, 344, 200, 433, 419, 125, 183, 282, -48, -114, -2, -281, -417, -160, -299, -431, -222, -97, -246, -37, 297, 111, 92, 429, 217, -36, 154, 66, -290, -121, -44, -314, -184, 173, 36, 114, 594, 469, 251, 567, 419, -43, -94, -46, -609, -738, -504, -737, -780, -275, -173, -182, 409, 797, 555, 777, 1052, 504, 291, 349, -263, -709, -592, -718]
2870g18m31L91L62l5L65O49j42R8M60k57m29J41k52o71O4M2m97J38O62j67P7P23
2892E73J73k48L54k4n93j15l3p26k38J97m13j63N92K72j46P48N02r3J75M89m09
2913H74l37J56l76o32J80j67n40K90L58k97K33O07j28j15N18j55n44K03l6o36
2933e44LK71m46k3N40o9m6N80K40j80L48J47m05nJ36m51l08L17k91n16M53J66
2955h3l79K10M35j97Q1K97k31j86K50j38m10L43K5m84J41L58k51o2N02q9j90L03
2977B45O6k72K17R2m05J08K17l32j56L55j44l24L59R6l66J40L05l17q8L44k36
2998i6j56L75n6k62K07J98l80J49K37k42n7K85j46k66L54k1k81J57J27k52j8K33
3020H9j27j12J76Nj84J93Q1l23K25K22k48n5L22k49j47L45%k16J01J84k06p0P0
$$ y = [-718, -1149, -758, -396, -431, -66, 583, 441, 539, 999, 742, 313, 454, 202, -469, -405, -363, -860, -722, -60, -227, -150, 573, 746, 498, 852, 828, 235, 120, 87, -639, -877, -680, -1093, -1256, -664, -392, -538, 210, 712, 619, 794, 1283, 874, 537, 693, 317, -315, -135, -302, -842, -552, -194, -491, -258, 349, 221, 106, 624, 469, -75, 128, 92, -544, -541, -270, -716, -739, -199, -268, -314, 266, 506, 326, 674, 821, 416, 411, 547, 96, -212, 105, -186, -702, -249, -83, -462, -252, 183, -14, 67, 364, 133, -53, 197, 59, -351, -8, 17, -467, -326, 32, -219, -281, 221, 132, -58, 245, 311, 39, 256, 348, -57, 51, 268, -64, -220, 135, -9, -333, 26, 122, -244, -104, 201, -116, -204, 140, -96, -252, 123, 67, -195, 12, 210, -170, -21, 216, -26, -83, 202, 56, -210, 144, 123, -158, -1, 126, -126, -144, 89, -38, -150, 26, 31, -153, 40, 121, -202, 23, 245, -3, -58, 264, 15, -132, 213, 213, -3, 98, 282, 76, 6, 76]
3043G6k34o1J06j82k04K31%j25J64K23r8R4L20k7n4J71M7k78Q0o7k30oP2k18R2
3068a08J86p1K1K46K3j75N1L7k70j12r0k21j39L5j9KJ72K22Q3L81K21mJ13J23
3092G07j38k19L4j66l48q3L8k31J16J77J06J21J87J31l9K1j49k01j46k05l60j95
3114h42K3p5J1K73K70K14K90L11J40J69K6o4q5j78k66k33n8j66j50J41J10N5J43
3137E9K56qm2km7k53k08k00k30j67QoJ51J80J87L05L13K61J45J35P2j42j74j05
3161D88k28k41j39o7j17J3K6R4J11Q0OK8O7q9q6l4j71j44rQ3m4N1Q1J98J10J38
3187B05P8N5J02l9r8O6k07j26n1J7j51n0R5o1J8M6P5MO5L3oM4K3j31m2J11r7j38
3215a60J45Mj26N9M3p1J5O4K4n8J27l7m8J31J6j36O9L3j54M9P8j67l2J48J5j44
$$ y = [76, -158, -219, -113, -295, -499, -268, -268, -393, -229, -6, -104, -10, 310, 283, 229, 400, 447, 169, 249, 182, -48, -54, 18, -200, -108, 78, 7, 28, 274, 297, 122, 173, 210, -60, -172, -262, -483, -622, -587, -606, -604, -432, -210, -127, 254, 475, 471, 584, 707, 569, 350, 384, 218, -130, -213, -175, -406, -290, -113, -7, 114, 301, 432, 393, 414, 265, 64, -82, -287, -647, -842, -819, -894, -883, -610, -340, -126, 164, 475, 615, 784, 810, 746, 661, 483, 217, -16, -74, -240, -390, -249, -139, -84, 59, 315, 307, 265, 263, 216, -37, -245, -445, -675, -842, -834, -840, -689, -509, -322, -17, 296, 557, 702, 837, 909, 767, 593, 488, 260, 19, -120, -187, -304, -291, -265, -171, -60, 20, 26, 54, 121, 32, -54, -88, -259, -403, -412, -329, -373, -322, -241, -43, 67, 205, 283, 338, 440, 401, 303, 369, 162, 36, -15, 2, -149, -199, -104, -165, -147, -101, -26, -22, 43, 76, 70, 114, 137, 6, -36, 75, -22, -160, -15, -11, -137, -78, -35, -106, -91, -27, -3, -61, 66, 29, -19, 112, 128, -8, 61, 94, -60, -11, 67, -100, -132, 16, 31, -113]
3241a13J95R6o7M3J62j23q1Q2j52r9R2j12k72J90j1j59N0K10j07l7L12r2j65J63
3265EM4k06Q7J14k54J10J93j10K8L39p5o8K57O3k64L9J65k91j77P9k12j59M2j10
3289c61j88J24J14k40J38K81j54JK92l8j02K47J50k00J46K26k31P5K70j67k00
3310A83K73j12j99N1Q4l52O6P0l20n2J79l10j77L28o0l04K47K34k04J20K77N7
3332G9p5L60mj37L21p6l16K07K06m39j23L61j80l14K53M0k17M9J09k66R0Q4l15
3355c03q2K97l18k83L34J32l59K14M17j88R3L60m5RL22k37j35L04k8m33R7K64
3377D32m63k2K78j59k39K20K6l29K43p6l07R0J70l83j7L17p2j88M39J22j54K59
3399A87K76k20J45K31k80j16K61j78m10K39ml62k8K29k37j39J85m6j59L40j4j67
$$ y = [-113, 82, 178, 111, 154, 316, 193, 112, 194, 42, -57, 35, -77, -349, -159, -170, -329, -279, -69, -176, -213, 99, 7, -158, 5, 49, -157, -70, 44, -210, -100, 93, -17, 11, 350, 275, 207, 464, 527, 263, 302, 467, 176, -1, 78, -134, -293, -251, -361, -549, -425, -311, -551, -413, -132, -286, -285, 7, -31, -133, 114, 264, 64, 210, 436, 205, 280, 550, 383, 183, 456, 344, 145, 196, 280, -72, -6, 64, -256, -308, -129, -439, -616, -288, -348, -652, -405, -171, -375, -255, 22, 79, 4, 364, 360, 223, 544, 468, 152, 359, 565, 126, 3, 364, 184, -130, 123, 163, -54, -5, 104, -162, -72, 12, -303, -385, -88, -406, -689, -355, -223, -582, -368, 49, -139, -46, 314, 269, 278, 600, 363, 228, 532, 504, 71, 168, 432, -31, -53, 225, 66, -173, 47, 73, -256, -13, -89, -396, -306, -136, -519, -536, -219, -291, -479, -40, 82, -72, 187, 463, 243, 388, 619, 339, 223, 484, 306, -104, 135, 131, -231, -259, -30, -267, -406, -221, -267, -426, -86, -100, -267]
3421b67L56J44l29J90L45k48j52L28Mk61J4J14l03NP8l21R0J68k53j31L00j3l74
3444e16J92K47k63O6K59m1L6K93L3QL50j8j71K36jl42j42J64m21l93J42j90l48
3467h20J32N1j45K31L02j70J28L56m0q3L24L0j96J67J08j98P6K09j43RK72j14
3489D86j88K10mm42p3j7l51k47R3j92j7J23N8k8K84K10j0K38L56j92n0J98j34
3512C11k32O1k3k04L5J37j03J67K08j45K6K18j32k04R3p8l22r8J14k25r4J05K6
3535c59n0J73J01MJ54Q4j68R9Q7q0j28R3l3j8R1J61K3J8J85p6R8J7q1q6l4k31
3561D4j50q5q8k27M0M9n7m4J17J11k9J47J09k2P7J13O8k1M2J11j4J10n8j9L5k9
3587C30j32J2M9k37l9o0n3j29j7J8l7k0J13j03O6J29L7K1J15O9j35J56J4k8p4
$$ y = [-267, 89, 233, -96, 94, 439, 191, 39, 367, 371, 110, 124, 238, -65, -60, 18, -303, -213, -45, -298, -429, -129, -142, -516, -324, -77, -340, -274, -15, -56, -20, 273, 306, 314, 664, 646, 475, 711, 710, 368, 226, 390, -31, -424, -282, -472, -820, -688, -637, -782, -551, -249, -419, -291, 65, 25, -58, 266, 296, 100, 267, 375, 177, 253, 462, 319, 328, 600, 486, 298, 508, 504, 62, -11, -28, -379, -626, -533, -725, -742, -619, -561, -589, -305, -95, -105, 133, 489, 297, 247, 445, 311, 79, 140, 117, -87, -52, 85, -18, 149, 357, 212, 238, 456, 324, 120, 213, 135, -187, -285, -171, -396, -490, -385, -359, -409, -236, -135, -131, 23, 107, -61, 38, 125, 45, -83, 10, -23, -41, 50, 211, 234, 252, 437, 361, 459, 476, 395, 309, 275, 44, -106, -191, -279, -506, -466, -417, -474, -518, -401, -290, -319, -172, -63, -85, -8, 105, 173, 152, 194, 305, 291, 401, 343, 324, 359, 330, 198, 210, 259, 22, -17, -77, -130, -259, -276, -258, -295, -315, -202, -305, -239, -110, -73, -52, 63, 132, -3, 153, 167, 139, 65]
3612F5J49l5r7L2m2l9n3k1j4kK8j05R5N1p2QP3k9L0R1J7k7l0P8k7p9Qj8j18Q0
3642cj00k4M7m9mN1ml7L3R7j2r2J40P5j55P2Op5M4MLK8P8m3m8J39k5r6P4O2n2
3673A34j30K8n7r5Jm5nM4l0o0Q1Q6j01j4J29r9r8J32l9j15J39P5l2J86J15O7J55
3700D52J14pm7R7j03k03r9j35l06j10K8k22m1O7mp5K03J13j26J83J41j2J2K00
3724A20r4M7J72K7m7K82J33j05R8J86j87j88pk31l43o9j68l65m6N6j95J09K02
3747f13J1J07M00R2K4K99J73j53QK84j99j46J89r1k07J73o5k05J20N1l86J09R8
3770G3m02j44K12j63k35J89N5p4K04K72l5J59L43p6o0K98j22l53K00p2l50jJ46
3793F4l06q2K59j01j75L01J2k35L23J73k91P7K14k46j1L49k15j54L02m4k86J48
$$ y = [65, 214, 179, 82, 114, 72, 33, -20, -41, -55, -57, -29, -134, -39, 12, -60, -52, 21, -8, 22, 113, 130, 103, 73, 151, 124, 45, 53, 35, -83, -3, -103, -127, -80, -129, -133, -82, -86, -123, -90, 7, -5, -97, 43, 118, -37, 35, 41, -34, 10, 14, 17, 45, 123, 80, 32, 171, 146, 50, 124, 186, 134, 4, 32, -25, -120, -119, -164, -169, -125, -155, -215, -134, -48, -149, -163, -34, -133, -231, -99, -138, -253, -114, -39, -71, 115, 230, 297, 452, 566, 559, 512, 609, 506, 303, 204, 69, -237, -347, -319, -541, -582, -515, -519, -594, -391, -278, -404, -221, -80, -92, -80, 120, 26, 73, 245, 272, 225, 507, 640, 535, 633, 819, 632, 444, 437, 206, -137, -206, -374, -739, -785, -729, -924, -815, -613, -602, -495, -95, -3, 21, 320, 493, 340, 348, 632, 433, 287, 476, 385, 178, 351, 286, 81, 201, 252, -134, -25, 73, -329, -473, -261, -424, -659, -470, -415, -489, -285, -13, -48, 111, 454, 378, 318, 616, 494, 141, 341, 269, -81, -82, 64, -242, -324, -65, -166, -341, -40, -28, -263, 60, 233, -58, 19, 233, -13, -24, 325, 110, -44, 258, 214, -72, 76]
3815G6K01m04n3L12k28k86K78K4l62K40J46l08J72K50k49N4M83k53j41L93J11
3836D56l52R9L17l11j45K61k03k04J80j17k37J86j5l27J78L06l45k1M88j61k18
3857a85K85J27l75K06J22l51Q1J71k20o2L48j29l49N01M4l40K33K49l60L2L33
3878C61k44k56M47j67l10K84J18l68Q9K73l30o8K28j47l11L19j48k87K58J19l71
3899e11J69M74k85p2M51Q0k30L29J64k45J27J24l07k9J94l21k71L56k03m50J94
3920b62K53m35p3L00j72j52L12k9j26L22Q2k85L00K22l05J06L83j42k37M07m3
3941D26k65J37Q5k52k8J78k82j06J67k41k00K38o6l39K70J54k77M7L26j32r9L08
3963D9rj32J76R7k41O8K10j83j9K32j21n3K76N1k90J56J97l63j9J36k45k30K10
$$ y = [76, 277, -127, -180, 132, -96, -382, -104, -80, -442, -202, -56, -364, -192, 58, -191, -137, 346, 93, -48, 345, 456, 104, 203, 520, 209, 64, 325, 122, -82, 98, -19, -256, -70, -85, -412, -234, 72, -273, -294, 194, 33, -185, 100, 227, -148, 58, 180, -171, -90, 81, -139, -201, 147, 18, -331, 170, 214, -126, 107, 356, -4, 28, 361, 117, -139, 308, 141, -169, 115, 233, -135, -46, 227, -103, -171, 57, -90, -401, -82, -230, -517, -259, -140, -511, -342, 132, -153, -225, 226, 306, 76, 405, 569, 324, 451, 575, 268, 239, 433, 112, -159, 197, -6, -456, -262, -9, -444, -517, -217, -389, -541, -229, -258, -384, -62, 20, -265, 35, 257, -48, 58, 441, 299, 62, 469, 426, 161, 298, 383, 131, 103, 281, -1, -107, 60, -181, -381, -143, -209, -548, -278, -124, -401, -354, -28, -160, -259, 49, 40, -92, 84, 181, -60, 8, 218, 35, 16, 248, 127, 74, 350, 401, 111, 267, 464, 101, 82, 218, -27, -257, -47]
3986d7j14k69Q3P4j82J16J97j81Q9K58j19o4L16q0j39K39R6j71N6K06j16r2J47
4009C03j5j09N3p8j59K5k7k77j3J67k25j50K51jj05J81J45j01R7K05jL4J16q4
4033B32k8J41%k59R1n7k17n1J05k22j45J42oj32N4J81k9J04J59j0R4J64k4pQ0
4058C60k9j71J01K1k15l1J50j53o8on5j20p1J0j94j9k7n0N5J17n8J74L38J34P1
4083B64K32K42l9m1J31j50r6j95j68j50j64m5j60M5q6r2Q3J69n7o9J25j0j62J5
4107c78J54p7j1J15J34M7K39J17J50J56No3R0j08k38j04o6l14j47P5j42r6M1J12
4131c09K3R0J08Q0l7R8j24ll3p1j81J85K6r8J43J58M7R3J93M0l7L5j6r0J4k00
4157A34j25M4q9j38JJ58j24r6K12M0j61l4Q1j07j07OL8p1Q3j2N2J81J04r2K83
$$ y = [-47, -161, -430, -347, -273, -455, -339, -142, -323, -234, 24, -95, -159, 157, 77, -62, 177, 273, 102, 158, 364, 248, 156, 303, 288, 179, 232, 154, -5, 20, -7, -284, -297, -130, -355, -505, -254, -255, -360, -179, -34, -135, -38, 167, 166, 200, 316, 232, 204, 345, 345, 86, 177, 120, -97, -148, -43, -265, -410, -268, -274, -406, -352, -171, -200, -96, 63, 53, 147, 311, 287, 280, 360, 331, 160, 261, 282, 67, 36, 186, 33, -35, -41, -96, -216, -287, -277, -471, -490, -517, -567, -512, -395, -453, -279, 59, 193, 264, 496, 738, 699, 658, 789, 639, 543, 348, 180, 30, -134, -179, -339, -294, -380, -472, -389, -220, -277, -346, -221, -231, -393, -378, -224, -301, -312, -197, -63, -16, 223, 340, 490, 646, 651, 588, 678, 570, 332, 228, 162, -152, -299, -224, -366, -462, -421, -309, -286, -196, -88, -8, -45, 53, -71, -74, -107, -178, -359, -174, -148, -246, -103, 55, 102, 195, 388, 428, 391, 426, 410, 320, 334, 134, 9, 53, -36, -174, -173, -15, -139, -235, -23, 17, -144, -178, -97, -204, -311, -305, -267, -338, -255, -267, -215, -34, 70, -22, 261]
4182B61K14j29J9K76j27j90L8m2j90m0Mk54K6Pj00n3J34j06j00J89m8j31J27K17
4206Bk48O9K38j00n0K91l3r5J57K1j45J02Q0k60M0Q2j97o6K85j82l38K76N2k52
4230b71J06K11j12n3J83p5JJ81n2j79K20J2k51J16K51l81j32L24j09l42K93P1
4252A2k61K0K16k28P9K59j98M3L05o1k31L37J15l30J53K00k81q5K18j79k26J97
4274G4o8k23J62P0l15J14K07k49r5K93k00l14L91k4k88J76L36k90J28L89j45p3
4296E6M36K1k25K78l1l15N8J72m10J5J88l14k84M12pl90J45K99l87q4J66j70j86
4319e57J50j63j14L32L4k39M93L80k12J80O15r7l01M12o1k92j9o0l46j03J1l63
4341c20p5L05l47j75M40n4m71K44K78l86j18L53j36j64L69J25j17M99K15o3K91
$$ y = [261, 475, 346, 365, 641, 514, 324, 362, 320, 130, 90, 94, -160, -134, -127, -227, -280, -146, -252, -352, -163, -211, -342, -215, 2, -246, -177, 61, -39, -89, 202, 169, 74, 231, 252, 107, 209, 289, 29, 69, 151, -46, -112, 173, -9, -347, -71, -19, -271, -165, 46, -66, -119, 64, -11, -10, 171, 119, -60, 160, 172, -79, 37, 288, -93, -225, 99, -10, -352, -59, 12, -249, -229, -13, -241, -162, 97, -101, -58, 247, 186, -45, 292, 407, 77, 230, 430, 149, 64, 282, 103, -123, 74, 6, -217, -55, 15, -300, -186, 21, -228, -323, -30, -230, -544, -153, -177, -465, -289, 47, -243, -115, 274, 129, 56, 492, 513, 288, 566, 535, 220, 278, 450, 40, 55, 243, -71, -355, 57, 50, -340, -195, 104, -283, -367, -201, -371, -557, -407, -570, -684, -352, -318, -557, -64, 316, 104, 284, 899, 802, 501, 913, 852, 560, 541, 481, 135, 32, 43, -320, -395, -90, -437, -612, -172, -226, -697, -453, -175, -561, -679, -326, -462, -626, -257, -132, -249, 250, 465, 402, 693]
4362F93L66k81m4L09l37l95J61k33m99K9M3m73J4L28k99q1M56n8j82L50Q5k57
4384c05J44J56k51J12L87k46k8M57Kl03L43K29l78L5J55k79k55J28k39j67J39
4405a64j01k65L12R8l25K01M57k21k02M28K4l00J54J21k54L1J38k78O0J79k43
4426a50n3L31o2l19K52J82l48kL89j42j74K33r2o9J56k1j90J67J26l22J31K31
4448B54k36j06L02j7l31K02O4j81o0J36j90r2J50q4j12J59k1r9J45K10j91J55
4470E7K38k13MJ56l2k14J18J67k85Q4J87n5n5P8O2j34J22j31j64O5j36k61p5J33
4494b84l07r2K59N0j84J36K24j0Q8J81R2N9P7N6MJ65j12j22K39N1k35RJ49k08
4518B85j79O9m7k85p4o0k59mr2j02N1J29q8J3L06Q5m1L04K28JP2K41J3o9J56j5
$$ y = [693, 1059, 778, 734, 1043, 706, 311, 472, 239, -260, -231, -188, -661, -647, -319, -618, -699, -243, -301, -483, -133, -48, -305, -161, -5, -256, -144, 243, -3, -31, 426, 428, 125, 468, 697, 319, 354, 509, 230, -25, 103, -136, -303, -164, -265, -530, -218, -120, -445, -244, 213, -8, -210, 218, 242, -58, 96, 217, -37, -6, 132, -146, -86, 93, -150, -203, 128, 66, -253, -1, 181, -167, -169, 220, 78, -96, 137, 45, -24, 132, 111, -79, 88, 214, -108, 23, 254, 18, -88, 214, 197, -134, 68, 132, -49, -109, 27, -163, -255, -105, -189, -301, -142, -163, -262, -117, 93, -98, 57, 295, 82, 86, 242, 210, -4, 114, 281, -4, 80, 267, 212, 157, 235, 297, 163, 285, 154, -10, 55, -81, -342, -417, -284, -591, -683, -424, -374, -558, -422, -198, -208, -120, 61, 153, 212, 289, 345, 349, 514, 402, 280, 519, 570, 335, 344, 493, 285, 106, 175, 128, -157, -231, -291, -550, -554, -646, -748, -697, -568, -656, -643, -337, -252, -293, 11, 239, 240, 312, 553, 566, 497, 653, 638]
4544F38j21J08j08k06L3j05k08p5M5k73j14P9j01j19J9J46j73OJ51J2K3J16R9
4567a28L1P8J04N1K29M6j4J53J15j63m5J47r4k48m7qk17j30k4p0j8m9q7nQ7p9
4593c85J2P5O2j01J04J44r0L1J11J43k2J09J65QJ3J04m3k3p0r7j4m2j59k23M2
4618a46K7k11oJ06j23j2J44O4j6O4N8N4Q0N7J2Q3Kj33O8J10j46j60J63m4j70m5
4644a20j9M4o1k8k7Q1L2r7K2K86j13j04K64R7p8kJ77j8o2J01k2n3l6j20j28q8
4670g2m1l47l9J11k49o3J34O1m7K46K65l5K55J72l7R3J91n4j00P5J7k18l6N2j83
4695A51L2P6j31j30J51k34l20J28j18l27J6Po9m0J86J35J64K72J65J72K77J24
4717F87k27K50O7l12k10K34j77l18J28qp2kL6o9J25J7k93L2J00l47k27K19r6l21
$$ y = [638, 517, 625, 517, 311, 344, 239, 31, -44, 1, -272, -386, -307, -408, -527, -508, -362, -535, -529, -378, -366, -343, -227, -128, -97, -19, 85, 136, 365, 411, 397, 550, 665, 502, 457, 604, 510, 262, 215, 207, -10, -140, -164, -234, -252, -301, -388, -393, -306, -385, -373, -298, -236, -337, -233, -89, -179, -148, -37, 106, 84, 193, 358, 366, 379, 483, 440, 417, 347, 250, 236, 194, 35, -188, -146, -119, -330, -336, -230, -353, -365, -221, -157, -173, -109, -51, 3, 83, 140, 152, 235, 237, 104, 172, 282, 136, -24, 139, 95, -75, -120, -139, -95, -156, -184, -211, -130, -98, -195, -173, 113, 0, -104, 160, 257, 179, 177, 354, 336, 274, 375, 353, 300, 264, 144, 16, -72, -113, -460, -499, -388, -637, -700, -566, -505, -552, -306, -41, -76, 179, 351, 314, 407, 598, 544, 444, 519, 536, 318, 282, 334, 151, 183, 259, 128, -2, 149, -85, -405, -277, -395, -722, -706, -699, -768, -808, -622, -487, -323, -51, 114, 286, 563, 687, 460, 710, 777, 465, 255, 489, 312, -6, 122, 114, 42, 40, 76, 7, 132, 149, -144, -112, -12, -359, -586, -367, -463, -784]
4741g84J03K63k0P6L41L9J48J70R5m9J59K5l16J78P2l10j55K33r1k03J67J42j75
4764A08O4J14l00m5M8l68j71J09j02k94K48J05p4J70K23LJ99L40q1RL46k7l23
4787C01J95J45k99j29J71j60j70Q7j20j03J09j37l06K28k0l04nL15k11k13L73
4808b53J23j01J21K07k3J96M2j19J71K08l48q4K88j30m07J55J26k28j24J24m7
4829a03j63J14j15O7J48o5j28K83J09k93P2L59j46k12K64j6j63R3mk01P3P1k06
4852a62j7K19k23j37K53lk17J50J78j71K1K56j50P2J90j13q3K02P3k75O6J61j44
4875A46r0J33r5j34M3j06j29J75r0k59Q6J74k72n2K64K0o1J26J38M5N6Q3l1J49
4899C19N8j73M5J61j15k48L16M2k52j7J93k8k63K4j02o0m8l05q5N1m7k81J00K66
$$ y = [-784, -681, -418, -438, -362, -21, 18, 166, 336, 431, 382, 541, 566, 250, 428, 500, 190, 35, 268, 177, -26, 141, 283, 108, 172, 286, -14, -59, -11, -379, -550, -441, -543, -837, -589, -484, -558, -388, -165, -162, 37, 377, 296, 305, 651, 624, 301, 496, 641, 342, 213, 384, 224, 54, 141, 21, -82, 27, -110, -416, -188, -208, -512, -517, -202, -413, -626, -253, -130, -231, -110, 97, 74, 270, 312, 193, 364, 572, 224, 140, 428, 298, -109, 46, 172, -56, -180, -56, -103, -266, -152, -267, -200, -52, -117, -245, 38, 147, -146, -74, 285, 139, -73, 191, 175, 12, 105, 101, -100, -27, 44, -162, -179, 40, -183, -320, -67, -70, -287, -137, 41, -130, -109, 147, -3, 69, 259, 146, 63, 265, 338, 63, 129, 290, 146, 56, 189, 94, -40, 3, -103, -232, -57, -147, -406, -320, -146, -418, -470, -206, -186, -247, -121, 17, 62, 118, 201, 170, 319, 377, 204, 249, 410, 295, 47, 363, 405, 153, 136, 329, 301, 38, 62, -40, -100, -148, -453, -538, -487, -534, -815, -715, -449]
4923d49j00M7M11J63n1K14K87qN4P8o9p2O2k49n0R9q1k58Q4R6j98l2rj80j19K5
4949c05k01j72l1J1j29J03K05J33J84K90J47K10K08J07m8P4m8k74Nn9l14j57L5
4972b6j14j52J6J20j05O5J4L5j3j9j92L2O6j35j6J74J42q4K15K68N5p1K27j9m0
4997D43n0j27m5j79o0k00ml1n6j1K35J1l7J75Q9j9RL1j14jr3q3rL8r5l5J54l7
5025a01j4N2Q5j0j17J96j0j05lJ08k3m9Q0j7L6L0r5M1Q8l8j46J13l9j20N0N7j25
5052g6j00J07l1n2J3J2l2K8L7O0K3R2l7N1N3m9MJ04p7j38j5O3j26m9nPm2J23N8
5081FJ9R5Q4j6Q8J3q9k0l7j10j53M1o7j11Pnk9L3J93p6k4Q3j16J50r0l4jJ79p
5110Fn1J12K57m6J5K57M5j09j21Q7j01j45j46j36j09j41j53l6Q0r0j5J75J59j06
$$ y = [-449, -549, -502, -91, 72, 21, 235, 522, 514, 568, 646, 577, 505, 567, 318, 268, 367, 286, 28, 112, 208, 10, -22, -31, -211, -330, -305, -506, -678, -709, -698, -827, -724, -519, -386, -202, 88, 235, 445, 653, 760, 712, 786, 738, 464, 469, 410, 96, -61, -26, -140, -292, -276, -156, -261, -196, -182, -147, -160, -179, -371, -339, -273, -408, -424, -250, -108, -192, 23, 291, 346, 275, 502, 483, 443, 393, 266, 221, 42, -18, -218, -222, -253, -309, -320, -85, -74, -111, 64, 153, 134, 143, 174, 60, 59, -34, -117, -126, -88, -183, -218, -64, -101, -115, -63, 22, 12, -105, 91, 81, -24, -27, 81, 58, 9, 89, 72, 108, 138, 43, 84, 172, 134, -12, 101, 62, -58, -8, 49, -76, -176, -69, -100, -152, -139, -127, -159, -131, -94, -34, -11, 81, 44, 95, 148, 99, 103, 207, 130, -8, -23, 40, -86, -135, -140, -133, -175, -52, 6, 25, 120, 204, 188, 276, 289, 200, 180, 143, 33, -120, -79, -146, -257, -250, -255, -284, -251, -58, -134, -158, -75, -191, -41, -131, -165, -166, 13, 6, -45, 67, 324, 278, 293, 550, 595, 486, 365, 452, 351, 206, 60, -76, -185, -326, -479, -515, -435, -525, -540, -365, -206, -312]
5134c12L7J32J22M1L9N6J11L9p4J10J05j9j75J35Q5q9j13K0%k39q7j3m4r9n9l7
5160c28qK4r8O9J40m2o3J68Q2PR9K0O6J27N7j08L7Q9n6j68Q2Lq1o3k3J0n1mp6
5189h9M7N1j86n8K17r8j71l6J46l2j29J73J05K4lJ4K62Nm2k6J22Q3k04j26J95
5214B44p0k67N3Q8p2j19J0K2M6o6p4J08J07j86o6J42J38k32M2K35k3p7J57O4l3
5239A71P4p5L0Mk8k24N2O0j75j12J34J9j78N3K3L4P7J8k6Q7J88j41M5J34Q0j55
5265A69j9Q3p3m0o6j36m2L3j85l3J62q1j70K34K35k12k2K61mj07j2O1Qnl0N9J73
5292B41P8j87J00K98k06k00J08P0l44j36Kj22j04r7m4J45J69q9P8L88J15k25J55
5315A93J94j43j26Q6n0j98j5n4J7J08k0K6J34J54j39J0J65j55k35Rj05j54o9J8
$$ y = [-312, -275, -143, -21, 20, 59, 115, 226, 265, 191, 301, 406, 387, 212, 347, 432, 343, 230, 250, 250, 11, -76, -89, -133, -232, -291, -328, -336, -312, -410, -341, -201, -243, -306, -138, -56, -49, 50, 70, 136, 263, 320, 212, 249, 338, 282, 114, 196, 199, 118, 55, 32, 42, -9, -13, -89, -42, 9, -177, -235, -18, -116, -287, -323, -177, -209, -338, -165, -60, -36, -39, -25, 237, 242, 200, 174, 296, 379, 175, 49, 244, 174, -93, -40, 48, -24, -143, -133, -111, -65, -131, -205, -97, 10, -176, -242, -100, 38, -194, -152, 83, 60, -17, 140, 204, 171, 245, 170, 200, 204, 176, -48, 4, 64, -111, -223, -89, -70, -248, -195, -172, -138, -61, -43, -69, 18, 206, 65, 110, 244, 324, 169, 150, 233, 160, 120, 54, -82, -124, -91, -276, -309, -147, -228, -398, -164, 71, -141, -163, 98, 94, -13, -25, 36, 44, 39, 9, 68, 241, 319, 132, 232, 530, 324, 124, 232, 302, -42, -178, -176, -298, -402, -499, -543, -398, -229, -318, -240, 148, 263, 38, 193, 387, 244, 118, 204, 154, -44, -59, -113, -96, 12, -8, 18, 152, 306, 167, 177, 342, 187, -48, -39, -144, -298, -367, -349]
5339c49o1P9J29K1J22K32J0o2J58qj70j02l4j13q7mj03R4J29K8O4K88Q7j29R0
5364C09J27j32k11j8n7j63q0j06K3J16k1q0K25J35j02nK21j1j93m0Q5r7j29J17
5388h7P9O4L2j14K07J42r0n3J10N4k76r3K7q0j45o9P7r5N3QP4J58m2K0Q4J43p6
5415A12p7J81nj85O2j1k7k9M6q0N9O0o9r0L0M3j11Pj5Jn9R6n6N6P8k7l6N7Q3m0
5445E4O7Q2j06n4K9j7n7J7Kn7J6n9q5J03K1o2n3J15O2j04N3J31p5n0J29pJ8l9
5473G4l3R7np5o8L5N7j55j6M7q1J5N4Jl9M4N8KK1j7l5K5M2o0qQ1n7MM1O6l1j1
5505G3L2K0r2N3P0j21l1kq5n8K1l9K5on1R0J28m6K5J52M5j09J2O8j17j18M3k4
5533d2m1J5K0j5N3R5k1JJ36m8l3l5l7n8r7q1okL4nJ0J53O0O8K0M1k4k6k0q3r8
$$ y = [-349, -410, -331, -202, -181, -59, 173, 183, 121, 279, 271, 101, -1, -35, -148, -235, -239, -342, -248, -119, -91, -27, 261, 348, 219, 309, 436, 304, 93, 75, 18, -145, -225, -331, -308, -192, -213, -293, -68, 67, -35, -40, 181, 170, -23, -63, 22, -75, -204, -87, -8, 56, 88, -26, 181, 323, 233, 180, 290, 344, 68, -25, 2, -78, -223, -292, -215, -310, -257, -249, -175, -17, -59, -39, 45, 188, 112, 35, 216, 211, 26, 88, 77, 50, 21, 67, -13, 46, 106, 37, -53, -23, 20, -91, -84, -99, -98, -157, -61, -117, -61, 17, -10, -46, 11, 94, 54, 121, 203, 97, 43, 72, 55, -2, 15, 17, -40, -24, -83, -168, -65, -44, -106, -159, -44, 18, -86, -33, 98, 23, -27, 102, 95, 113, 74, 41, 138, 133, 58, -10, 25, 82, -73, -89, -42, -123, -108, -54, -53, -92, -48, 10, 12, 33, 16, -19, 6, 48, -12, -20, 61, 4, 8, 49, 115, 84, 73, 105, 125, 33, 86, 156, 35, 4, 2, -83, -141, -120, -159, -134, -140, -191, -101, 27, -19, 6, 158, 203, 94, 106, 174, 57, -61, -18, -42, -83, -68, -48, -63, -10, 85, 64, 65, 201, 153, 120, 85, 48, -10, -107, -188, -194, -196, -162, -167, -157, -4, 56, 124, 144, 185, 161, 135, 115, 32, -66]
5564f6l2r4pK0O9n3J42P3j9Q4O3N5p8m8k8p4j21p0o8J14n2n4J96R3o7J18J55O
5592B57q3l9k9l1j32j16K0L1l6j27J90J14pj1J94M8k08M2K7M1j51j65K4L6op6
5618a93O2J90l4l2J44Q5q8m8J16r2j09k2Ok2p7l1N0J00r2L1J0J51p2r8P9M0r7
5645d3N7q3K4Q4n3r3R7R8q7pL0O6p7J2N8m6j7k6l0J14n9j04N4N8k8k14J07J16
5673Hl9j43J81M9J5m5J0Q6N6j33r2J04k3j63m3K10r2j34J60J21p4l0%J11n2K3
5699G1o1P4Kj60j4R3K8j64Q4J55l1o2P8J6l4jq5j8L3j61j39J50M4j40M7J96l4
5726c3j5J17Q2L8l6J3o7Q6kj98j2Q7j16r3R0O3n5PL5nQ6r9j05P7P0j51n0P2Q2
5755c2j35PJ81Mj4J1Q3O8km2rM4l5j57J70N5k01j62K20L3j67J3P9j9j23J3J8M5
$$ y = [-66, -98, -192, -199, -179, -110, -163, -21, 52, 33, 117, 180, 235, 157, 109, 81, 7, -114, -184, -252, -138, -190, -244, -48, 45, -22, 96, 251, 257, 174, 135, 106, 75, -57, -173, -153, -122, -158, -285, -95, 19, 12, 1, 195, 243, 35, 77, 104, 145, -6, -171, -147, -111, -117, -193, -131, 59, 25, -7, 137, 222, 134, 86, 202, 110, 1, -21, -15, -37, -114, -145, -95, 5, -87, -56, -46, 105, 33, -65, 14, 54, -43, 14, -69, -45, 39, -14, -107, -10, 88, 1, -6, 24, 90, 13, 25, 83, 37, 20, -6, -36, 78, 19, -85, -31, 27, -1, -215, -108, 8, -31, -174, 7, 56, 71, 26, 36, 122, 178, 45, -47, 57, 34, -129, -172, 38, -54, -188, -28, 93, 19, -11, -11, 100, 48, 71, 10, 84, 86, -74, -88, 5, 33, -131, -47, 108, 77, 15, 93, 109, 75, 74, -11, -29, 4, -157, -296, -146, -102, -242, -195, 1, -33, -48, 69, 151, 189, 153, 166, 99, 185, 183, -15, -27, 60, -56, -149, -59, 4, -51, -44, -9, -14, 72, -27, -132, -55, 15, -136, -186, -114, -32, -167, -160, 21, 25, 11, 22, 105, 173, 171, 129, 120, 164, 129, -28, 142, 197, -4, -166, 54, 87, -80, -67, 12, -7, -130, -117, -99, -54]
5783e4J1j69P4J85j89NO9J54j71L1Q7Q7m7o3J57L6oj9o7J92j25k09oK20j60k00
5809a77J8L5m8p6P2rN5l5m9J35M4j8j3J84Oq5P7k1K3l5P5j8P5k9j05K1J2o1j72
5838a19L5L1q6j21N3M3l1n6J34QR1RK1J98p7l4QJ51m4j38j1K8o1j22k0K4n8Pj19
5867b56Q4J39j75k2J82J38j42Q5J14Jl2J6K4J4jj2m3K1l9j56M0J03j42j11J40
5892c0p0j36O9m6n5MK9J0R1P4QJ47J35L9N1M2K8n3p2oj56l4p0j76r0M3M5p1N7
5921a93J33k5lJ34L6r3J3o2nL6p2p2R7R0k8J04R0R3p1Q3j0n5j34pj26n9j94K1
5949b79LM8L8L1K45Q1q5J45R1r5r7o8j9j54j44j7r3L0O7J9J07R5M7J08J59L4r8
5976A99R2m0j49J7j5m0o4O0l0M8L0J6Rl1q7r2n3o1j35q5N4pj8J7J85N2Q8J58J49
$$ y = [-54, -43, -212, -138, 47, -142, -137, -68, 86, -85, -54, 33, 120, 73, 10, 167, 203, 197, 178, 111, 303, 178, -31, -37, 183, 23, -177, -159, -124, -172, -248, -176, -185, -130, -165, -214, -79, -35, -53, -66, 118, 124, 39, 116, 95, 118, 83, 158, 140, 215, 186, 81, 102, 114, 53, -119, -84, -53, -139, -260, -207, -164, -195, -251, -117, -109, -18, -9, 12, 210, 133, 99, 107, 258, 214, 76, 65, 93, 32, -90, -110, -86, -144, -137, -256, -172, -33, -208, -230, -48, 90, -52, 33, 147, 148, 116, 132, 156, 170, 169, 157, 114, 135, 96, -60, -20, 83, -59, -170, -30, -100, -236, -167, -213, -268, -264, -235, -225, -134, -60, -52, 95, 230, 269, 320, 362, 390, 337, 265, 259, 103, 69, -1, -177, -267, -224, -179, -250, -193, -60, -85, -88, 46, 82, -11, 2, -60, -65, -29, -101, -173, -76, 14, -14, 90, 180, 273, 202, 285, 275, 220, 86, 79, -47, -106, -300, -279, -276, -228, -190, -159, 86, 167, 82, 227, 318, 223, 126, 58, 39, -115, -259, -276, -369, -339, -272, -253, -146, -51, -4, 104, 263, 297, 199, 291, 251, 102, 119, 104, 64, 0, 60, 30, 78, 108, 124, 133, 102, 15, -77, -130, -191, -326, -411, -357, -364, -382, -365, -180, -128, -40, 118, 267]
6005B67O8L0N3L5q7q7Nj17q5j39LJ7q0k8j9L5n1N3m1l6l1J5j3M6Q5k9R8N7M8K9
6035A01J01j1L6O2J6j05j5j0j18j4k6o1o6k9K9k0j4nO2M8pL0P3l6J0lO5Pp5l8
6065a3J01j9p2m7Q0n7Ol4k3N1ro9J15j3NJ5L4K5j02L3J27j6j18N0M5m9k3n8O8
6094C3J04j15p1P0L9q7oJ00n3o5J1k5j0p9K3O1K5j46Q0N0%j8L4J75K1n6J6L7L2
6123A80N9r8k2M7Lp7MO9l4q8n2K6p6j03o6j9Qj84k1j4O6pJ7J56K38N8R3J80J66
6152E09m3L9QK0l7j72j06K4j69k47K7L3j55j08M8O8r2m2M3M5j06m0N4J13RR0J70
6179a7K73O0L6J80K05l1j19k3q5j60k90l6p7j93k31k6R4pm9J43J58N0L9J05O9
6204F8Lm8J2L3O8o1RN2J12p1k9J30l5j37m5Q3o4k13p6J9o4j5r6R6K21K0P6J18
$$ y = [267, 335, 365, 418, 453, 366, 279, 284, 167, 82, -57, -54, -37, -117, -145, -164, -129, -180, -127, -168, -204, -235, -220, -233, -187, -102, -131, -33, 24, 72, 101, 202, 191, 227, 289, 305, 200, 185, 175, 57, 43, 17, -44, -110, -139, -110, -130, -144, -149, -87, -39, -46, -16, 57, 21, 31, 28, 93, 100, 25, -13, 88, 69, -3, -50, 30, -27, -21, -55, -78, -27, -36, -105, 10, -3, 2, 17, 51, 76, -26, 7, 134, 118, 0, 50, 95, 46, 23, -35, 33, 137, 22, -49, 21, 60, -27, -33, 67, 14, -51, -40, -65, -75, -154, -131, -70, -45, -191, -111, -61, -61, -79, -45, 130, 151, 95, 111, 148, 180, 239, 141, 119, 166, 169, 92, 96, 165, 131, 43, -9, 17, -59, -162, -228, -247, -239, -423, -444, -458, -392, -399, -382, -226, 12, 70, 163, 343, 509, 466, 505, 513, 533, 496, 324, 218, 242, 73, -174, -147, -114, -269, -377, -329, -261, -353, -395, -352, -307, -413, -453, -399, -286, -277, -187, -17, 256, 316, 352, 532, 737, 706, 587, 564, 479, 319, 29, -7, -84, -277, -508, -534, -440, -447, -496, -353, -195, -145, -106, -1, 68, 71, 23, 35, 68, 136, 75, 84, 136, 248, 177, 148, 278, 243, 106, 61, 144, 80, -133, -209, -190, -254, -269, -365, -269, -48, -28, 48, 166]
6232A66R2O3q0L3L1n8j57j18n9k3j56o0P9K2j11N6Q0Q3k6J28J17QO6n8J83Mq0
6259B25m7J17Kj10j11J04lk11o8L9m2p7j49Q3Q7j32j8J09J50o9n8K06O2q6L9J49
6285A91P2m7nK1Rp7Oj19j8j13j09p4Q8q9p4M1J47K1P3J67J16P6n4K0P0p4j16q9
6313F0Jn6j80j00R0p1o5J04J7K0jM4N4R7j28J8Q1J26k3mJ66Q2K2j7J34M0n8j12
6341C41j31n3q6k66j40K2j93j09j4M9Q6P4R5J76J02K7J36J42P5L3j0O0Lq2o9P6
6367C44p4o9k9K5r1k8r8j6j15q8p9K4j07K2o8Q8P1n8J44J38M6M1M7O6R3J9J9m4
6395B23L3K1k5JM3r1l6k5j01N3m7j05j0L2p6q6J3J5j39N6j4K9o4L1l1R6J16j1
6423i9M8J64L7KK11K6J9q2M8K4j00j24M6j52p4j04j08%k4p0j1PK6k2N7J11m6P1
$$ y = [166, 258, 321, 241, 274, 305, 247, 90, -28, -87, -110, -266, -326, -247, -225, -336, -280, -200, -117, -143, -15, 102, 110, 176, 118, 301, 305, 225, 178, 295, 297, 187, 76, 180, 177, -34, -102, -63, -105, -182, -331, -248, -161, -293, -311, -202, -52, -121, -179, 27, 89, 3, 42, 191, 263, 216, 211, 232, 241, 164, 170, 51, 33, -80, -189, -263, -175, -264, -338, -297, -150, -129, -56, 111, 227, 303, 249, 269, 339, 265, 149, 60, 61, 5, -175, -275, -185, -256, -321, -217, -200, -180, -181, -137, -83, 14, -114, -96, -15, 111, 88, 84, 250, 332, 354, 337, 471, 511, 453, 341, 210, 157, 71, -195, -335, -313, -506, -615, -629, -580, -494, -420, -325, -149, -47, -20, 116, 258, 333, 366, 356, 416, 419, 337, 268, 344, 270, 201, 172, 197, 106, 78, -20, -36, -151, -239, -318, -294, -401, -379, -447, -359, -288, -346, -202, -64, -18, 23, 70, 136, 229, 248, 267, 223, 256, 277, 252, 253, 296, 205, 169, 144, 43, 96, 49, -56, -66, -34, -110, -196, -183, -168, -307, -251, -265, -236, -300, -269, -300, -204, -88, -99, -51, 113, 150, 152, 363, 389, 408, 326, 374, 398, 298, 174, 220, 68, -6, -110, -218, -218, -242, -312, -323, -316, -290, -312, -255, -144, -190, -119]
6451a19J21Q3o5J53L5Q8k9P3k1qn6l9r2n2j37j21j2p4l7n8K7mnJ18J83m4J20R3
6479A21J04P8N0J15l6K1n4o7l2j34j11j44j20j62j13l7r7O9pO8J47J31N5J23J64
6504A32J47L3L8J01k6L7j2j2q2n8N2j19m5o8j00q7q7j24j22j31j08n1k4P6Q5J71
6530c84J07K34K65J02R6J57J17n0p3o7n9k58q7j30j10j11j2K3J19P3m1K3J33l1
6554C6o4J8n6j04n0m8M7K7J0P3J66Q4J1L3J14l3j38k9n5j38j50J6QN3kN1K38J86
6582C04P7Q0R2K3r4o9j15j87k79j69m6r9k04P6O0P7J7J13J70J51P1J1J39J13p7
6607B35L6MK8L5L9N1O6l1k9o7m4j06j77j54q0j91k29n4j8k3lJ02J40J49J58J06
6633e7K33J98k2R4J29o7m6l3L1j09j70n9n3Qj80p8MJ15j98q3P8j2m0J1J68j3J9
$$ y = [-119, 2, 85, 20, 173, 208, 296, 267, 340, 319, 311, 255, 216, 124, 72, -65, -186, -198, -272, -309, -367, -340, -344, -349, -231, -48, -92, 28, 121, 225, 303, 353, 468, 432, 453, 399, 332, 300, 166, 55, -89, -209, -371, -484, -521, -618, -549, -556, -488, -341, -210, -155, -32, 132, 279, 312, 350, 451, 425, 462, 450, 438, 356, 298, 350, 231, 186, 118, 18, -69, -156, -280, -402, -533, -641, -692, -716, -640, -555, -384, -277, -43, 222, 324, 420, 577, 694, 644, 571, 504, 445, 187, 100, -30, -140, -251, -263, -240, -121, -48, -89, -66, 67, 36, -28, -10, -66, -170, -220, -268, -221, -194, -184, -111, 55, 139, 150, 183, 297, 264, 126, 97, 42, -96, -246, -230, -222, -169, -171, -120, 118, 304, 381, 461, 553, 576, 482, 413, 298, 111, -168, -337, -383, -482, -686, -610, -550, -473, -456, -343, -173, -22, 49, 60, 199, 312, 235, 271, 275, 303, 338, 377, 428, 494, 463, 434, 367, 323, 217, 40, -114, -194, -385, -614, -668, -686, -709, -712, -610, -470, -321, -163, -57, 176, 374, 352, 446, 575, 508, 462, 429, 460, 351, 181, 122, 69, 77, -103, -181, -177, -62, -260, -343, -265, -277, -317, -306, -138, -151, -132]
6660a32j4K02L9L6J9N9J00p4j05M3Q8j77p9k4j5j43j2O3Lm9n0Q0O7P2j14J34J65
6687A82o2n4J02Q5m3j9J7l9l7r1k5l4k4n7l9M0M5j73L7R0j4q8P0J01oo0O0nJ19
6716G8pj24J23R4l4j06J16O9p4KJ17L9J4j07MnMk55mM5j44j72m3J03j66j15Q2
6743d66J08kP4J03Q6J47lR4J04N3K6K3R9J1j5l8P7oj9j19j7r0j39k49j08j45k44
6770f55j46M9m4n1M9J78K13R9L02J90K21J30P6R2K3m8j24q9n0j23j65m8j2p5q2
6795i0r0N0k9j38j15K8o3j45NJ16R5K5J14K11J28J69R6J65J13m4m1j24k4k01k52
6820d1k6r4j78q0J18K1K4J55N1J13P4K8OO8n1o4j9Rj18j19J12p8K0o1K7L8j9o0
6848a44j0M1l8l6o7J30KJJ16J78l3J36R7O2M4o2j5o9r6j41j42j15o1j04j22l7
$$ y = [-132, -146, 56, 95, 131, 150, 209, 309, 235, 130, 173, 261, 84, 5, -19, -34, -177, -189, -126, -123, -172, -222, -142, -75, -3, -117, 17, 182, 120, 66, 168, 253, 210, 191, 208, 169, 132, 41, 16, -18, -42, -99, -138, -98, -53, -226, -189, -99, -113, -201, -131, -30, -36, -96, -36, -41, 78, 71, -53, 70, 164, 130, 24, 140, 209, 135, 137, 254, 293, 307, 200, 204, 199, 203, -52, -56, -11, -155, -327, -370, -267, -433, -548, -466, -358, -360, -286, -183, -97, 50, 47, 141, 245, 298, 324, 347, 446, 457, 442, 404, 481, 475, 456, 337, 320, 230, 91, -158, -266, -411, -655, -801, -752, -796, -847, -798, -620, -407, -308, -6, 184, 405, 535, 611, 703, 726, 678, 554, 465, 415, 292, 127, 79, 67, -8, -90, -180, -130, -159, -297, -412, -384, -447, -592, -587, -471, -376, -351, -237, -26, 102, 271, 367, 532, 645, 601, 560, 436, 412, 211, -41, -67, -161, -339, -419, -301, -280, -256, -101, -50, 63, 137, 165, 171, 239, 188, 124, 105, 114, -4, -123, -11, -89, -69, -130, -103, -65, -84, -144, -154, -113, -151, -187, -254, -124, -122, -121, -5, 173, 140, 276, 373, 435, 479, 417, 402, 333, 237, 96, -46, -161, -222, -326, -448, -485]
6874d85Q1q8K7O7N8R3O3J31J58M6J42L1J40kn6l7M0j70j38k4j25o5p0j03L8Kj7
6901b63N7P1P5n2L4J60l0O5nK0K3M0l0OM6k0K5r1o6j08m1o8j82j16n4K9q8Q0J02
6930c81J52R3J80K59J44J60R0O8m3m5j26j29j21k45j50j01j42j02q7L7j4k4K7
6953e00k0J08j5N5J22KQ8J15J56P5Q0J64J66J8R8M7k1j53j13p4j56k15j55j87
6977c15n5j66r1l0J13lL9J08Q9P3P9J04K6N7J37j7M0L2L7N1o9J44k9J3k0jo8l0
7005B48j08n4K7j37j19m3k7m8q7L1M4j08n6J03N5P4ML4J33N2qR9J43l0L0P5N0
7032C77j0n8L0q9J5r9J2o5q3j22n6J6r5j88M4L7q5N3M1Q6N5N3J06J48P2J3Q7J27
7060D22l0q7N9n5q2j06k0j10j00j06J8j01j6L7p0Q9R3O5kJ86Q6j1P4J38l8j6m8
$$ y = [-485, -404, -492, -465, -398, -340, -247, -184, -53, 105, 151, 293, 324, 464, 462, 406, 369, 409, 239, 101, 77, -48, -113, -183, -286, -248, -246, -263, -206, -135, -60, -112, -78, 82, 52, 117, 112, 132, 155, 195, 165, 171, 217, 197, 222, 131, 65, -43, -84, -152, -334, -450, -504, -475, -563, -483, -381, -229, -136, 44, 303, 447, 607, 697, 765, 722, 677, 551, 422, 301, 56, -94, -195, -337, -439, -526, -489, -503, -527, -500, -520, -412, -427, -372, -250, -248, -160, -45, 111, 186, 266, 430, 596, 614, 712, 759, 738, 585, 472, 398, 242, 27, -128, -315, -370, -536, -627, -657, -544, -547, -508, -400, -311, -238, -159, -55, -29, 28, 165, 148, 188, 220, 257, 308, 239, 383, 354, 367, 347, 346, 278, 248, 140, 86, 113, -24, -143, -186, -213, -261, -348, -317, -273, -381, -437, -334, -279, -205, -201, -167, -34, 18, 10, 109, 252, 222, 252, 327, 377, 367, 309, 339, 250, 265, 166, 178, 113, 30, -92, -148, -132, -227, -415, -371, -334, -419, -366, -325, -239, -184, -131, -25, 123, 195, 208, 295, 422, 392, 305, 364, 309, 227, 121, 101, -9, -109, -215, -197, -298, -314, -277, -347, -258, -165, -100, -102, 84, 170, 159, 233, 371, 333, 317, 269]
7087B69KM2j14j34l7l2q8j35j44M1m4n2JJ11pLP9J63oK1J12J84J09M2J18J23J4
7114F41o9o0L6j65k01j41j40j73k01j80m7J0n0O9K18J39M9K08J77Q4k0J07J04
7137C95k4j51k4J9rp8M2J08N4j22m9J08o5j55o4q1j20j41q2pk1Q0J3K67J92J05
7163A90J2J67J15j22j07o0j06j85k38j01j2L1o8J58J81K00Q3J93J49J40o2L3k9
7186E62k07j14j70p6m1j20j46J20M9o6n5J11K4j57j28Q1o1j06K0J21J00M7J15
7209i7L30K59J40R6J94M9j40j08q5j23l08l07j15j47j74k13PP4k2oJ43K12P6l0
7233b95J81J27O5N2L7J38J0J5M1J39J4m3j1k3j18j65o8j00j65j87q0k5j02LM1
7258e19O2J43M5J42Q0J97L5O4O3N0k5n3J6l6q4j03j4n6M0k04n1Q5m4q0k5Q9R0
$$ y = [269, 271, 313, 199, 65, 28, -4, -92, -227, -371, -330, -374, -426, -425, -314, -321, -318, -239, -76, -82, -61, 51, 235, 344, 386, 504, 627, 641, 572, 512, 548, 383, 182, 41, -99, -272, -473, -653, -700, -690, -740, -671, -453, -314, -265, -57, 120, 204, 184, 291, 395, 371, 220, 196, 215, 206, 128, 170, 278, 332, 210, 161, 269, 204, 49, -15, -96, -216, -357, -439, -446, -467, -387, -374, -107, 85, 190, 202, 369, 484, 362, 255, 195, 89, -96, -334, -435, -447, -416, -484, -326, -145, 55, 138, 331, 480, 620, 558, 591, 562, 355, 241, 71, -5, -46, -166, -312, -192, -143, -209, -264, -153, -129, -286, -414, -333, -394, -500, -480, -359, -259, -212, -97, 233, 492, 632, 728, 922, 971, 831, 723, 638, 515, 207, -100, -215, -362, -536, -749, -742, -668, -690, -696, -553, -341, -265, -295, -114, 13, 78, 130, 167, 305, 315, 330, 371, 510, 524, 481, 470, 447, 329, 164, 96, -4, -169, -356, -436, -461, -563, -560, -519, -457, -314, -269, -127, -47, 150, 185, 249, 312, 362, 337, 284, 300, 264, 180, 77, 63, 7, 47, -157, -208, -123, -167, -247, -272, -183, -93]
7285i3j8L6R3J03p1O1P6L0o3J0O8Mj29l3o9O4j01n5n3P3j13n3M0O7p0k0L2N8p
7314a33P9j2R7j9L7M3J08n9K2J4K6ol1l5K9p2l4J1l8m5m0m4n2j8k0J4J8l9n8K4
7344b33rP7m3k1Q0MqJ04M2R7O3P4J34R0P5o3k9N2q6j11l0j31j69j67j02j27m1
7371d78p3k9L5O6Q5M5J16J62k0J20J01jJ12J3j0M3J12K3l8J51l5k9r4j0j96j15
7397E6j79k20j68j23j30Pj7J53J45J05K65J15K21J00J38M8J4m8j03rj24k21m2
7420a7K4k6q2M9Kj9OL6j10M4n5p7j1jN3k5J17J10M8J81R1r3J47Lj23o4j13j54
7448e9j11n6j62k7J7J3RJ50J52N8J31P8J35R5J9l1j5o3n4n1j40J0j10j10o3Mn7
7475b38m6l4r1J07l8K7O4J06JP6J21Q5J02O6L9K8j9Po5on1j31o9J9j65j32j3l
$$ y = [-93, -111, -75, 18, 121, 50, 111, 187, 217, 154, 164, 232, 236, 107, 74, 5, 69, -32, -87, -140, -67, -180, -233, -193, -126, -196, -216, -184, -126, -133, -54, -66, 31, 12, 49, 92, 200, 141, 163, 177, 203, 197, 166, 131, 160, 88, 54, 65, 27, -18, -58, -102, -154, -172, -192, -178, -160, -199, -257, -233, -242, -165, -208, -229, -149, -145, -153, -49, -7, 90, 153, 227, 361, 451, 526, 463, 434, 486, 400, 289, 259, 128, -41, -208, -310, -437, -478, -551, -580, -545, -479, -394, -349, -233, -71, -91, 29, 130, 129, 241, 254, 244, 287, 399, 422, 384, 535, 500, 471, 377, 367, 171, 56, -123, -343, -511, -634, -764, -757, -774, -621, -476, -371, -106, 9, 230, 330, 468, 516, 530, 482, 379, 370, 246, 25, -17, 7, -19, -101, -52, -50, -69, -63, -27, -137, -93, -148, -225, -236, -237, -184, -209, -92, 18, 66, 247, 338, 245, 392, 395, 272, 208, 95, -59, -170, -226, -388, -415, -398, -385, -376, -226, -74, -16, 115, 193, 328, 423, 442, 411, 396, 333, 279, 228, 88, 98, -12, -122, -185, -181, -238, -284, -318, -409, -302, -340, -313, -249, -143, -142, -66, 55, 140, 242, 308, 347, 375, 356, 363, 298, 292, 241, 110, 41, 60, -105, -237, -250, -253]
7503b53j68J1K6QMJ66j0J58J51M8J48J39lj8oK4j54j43q6l8k00j47rl5l0M6P5
7530b96N7J97j7R1J10J5K0Q3K4j16l5M4O7rm3QJ7n5l6j55q1r0k12q1Pj08n9P5
7558e78P6R0R3K83J50J89J39J22R9N1k9o7j47j02j62j61p5j06j34j29R6n7j4k
7582c75N1O0k3j8lJ00k7K6J14J74k1J4J97J35RnN5N9j02r3j38K5k07j37p5L6p7
7609b46q3NO1l7P0j2J46L7q7M2R2J2m8P9R1o8k8O9O2j6n7J31n8M6j3p8L7K2j02
7638F9l6K3k9j13M2q1j5l0j08L2J7jJ2L6J06RpR3P7mj7J32m2O8o9nJ01r8o6k6
7668G0M2l2j29j9l7m6r5j5O7j1q4J03O5K5J4P4R0P0K7N1R2j7k8o6K1q7j05l2o7
7697e9l2j50j19L3P8q1l4R0J11LO0J35J87N9K9Q5K6K9n8m8Rj54j35r0o7o9j29
$$ y = [-253, -421, -410, -384, -376, -372, -206, -216, -58, 93, 141, 289, 428, 425, 407, 401, 425, 271, 128, 42, 4, -196, -343, -352, -387, -417, -371, -296, -239, -42, -59, 32, 142, 157, 177, 260, 284, 168, 133, 177, 244, 235, 192, 200, 217, 162, 126, -29, -110, -200, -412, -493, -486, -594, -653, -578, -502, -412, -319, -36, 114, 303, 442, 564, 663, 714, 685, 618, 471, 369, 207, 46, -29, -135, -269, -398, -302, -359, -373, -375, -324, -264, -287, -305, -308, -208, -235, -209, -95, 79, 58, 72, 269, 404, 413, 408, 463, 522, 420, 327, 189, 214, 7, -130, -205, -169, -246, -329, -324, -263, -300, -230, -242, -96, -59, -146, -104, -12, 0, -48, 31, 122, 54, 26, 95, 157, 141, 84, 215, 157, 203, 190, 112, 149, 171, 69, 33, 56, 27, -86, -44, -125, -140, -170, -278, -246, -229, -230, -218, -182, -76, -67, -74, 19, 96, 92, 75, 207, 165, 233, 164, 159, 260, 162, 96, 70, 112, 80, -49, -68, -105, -151, -246, -261, -194, -205, -289, -186, -121, -96, -82, -8, 82, 152, 179, 230, 322, 305, 277, 211, 232, 145, 40, 8, -59, -91, -241, -360, -327, -249, -330, -364, -274, -163, -160, -100, 35, 222, 281, 310, 395, 421, 450, 392, 344, 353, 199, 64, -26, -93, -162, -291]
7724b91k4L5q3n3M1K9NMR3P6Q4qN4J66J31M6N7K11J6L8K8j16o5j53k08j77j25
7751a89k35j07j19J1n4J16J28J32J41J94J12Q2J00l7j7j7j4r9jm8O4o3n9R7K6
7776A44k7kMp0r3j37j02n8p9j0P3R4j0J95J71J93Q9M5R3n8j15j15j66j74j32k20
7802d67L1q8l5J07J26J69J53J49J21R1n0O4n3Mo2j27k0q5J8o4K9l9N0m8j5k1j13
7829a75k0j20j53R0j12N9MJ89L8J74J91J15J48J66P9p9M9j15j96q3j05j95j30
7852a81q8j01q1L2rnO3M7M7Q0O2O9J49jL8N5L0J4R4J0P1j14jl8m6j01l7r1q6o2
7882a81q4m0j5K9j3N5j2J57N2O7N0O6M1N1QLJ2l4n5m3n5q6l0j24l4J6k2q7O3O6
7912a79K1J9M3J39L1k2J03j3L7KlQ7l7r9k1q5ro5L6j1o2k9j6J6J4J8o3Lj8L1m
$$ y = [-291, -315, -280, -363, -416, -375, -346, -341, -337, -244, -168, -84, -92, -38, 128, 259, 305, 362, 573, 589, 627, 655, 539, 474, 321, 113, -64, -189, -424, -531, -650, -639, -693, -577, -449, -317, -176, 18, 130, 212, 312, 275, 258, 241, 227, 128, 127, 79, 143, 80, 21, 118, 144, 117, 115, 119, 49, -44, -181, -283, -341, -420, -430, -357, -263, -273, -78, 93, 286, 375, 420, 513, 455, 340, 225, 59, -115, -247, -467, -436, -524, -559, -452, -326, -157, -4, 145, 266, 357, 307, 371, 318, 322, 260, 133, 113, 28, 46, -18, 11, -28, 22, -26, -41, -62, -175, -195, -315, -468, -378, -490, -431, -427, -238, -200, -26, 165, 280, 428, 594, 673, 594, 643, 528, 332, 249, 144, -51, -181, -269, -370, -451, -419, -428, -433, -370, -323, -276, -196, -134, -65, 84, 83, 121, 176, 206, 220, 314, 324, 395, 281, 280, 242, 196, 95, 58, -33, -119, -181, -265, -305, -320, -291, -304, -249, -261, -104, -52, 15, 65, 131, 172, 223, 231, 234, 246, 212, 157, 114, 59, -27, -57, -181, -215, -199, -221, -308, -245, -179, -158, -139, -96, 43, 74, 52, 155, 142, 179, 181, 178, 265, 228, 129, 108, 23, 14, -51, -15, -26, -88, -117, -133, -117, -103, -85, -148, -145, -163, -132, -136]
7943a36J1J22k5n6J04J6k9M3Q3j00L5J35o7jL9k7m1l8m0qNn3m2L5n9l6L2k6k2
7972a46N6j3m9o6P3k7l9OQ3nO5J26K0J03K04k4P5L5k3o0j1r8j44j79j12m1j87
7999c78j6K0r1P7L9L7R9N2K4P4L9J4nL4M9O0L4R0P0j9Q3N2l0q4k4j16j06j61k23
8028c06n1j68J4j2K6M0O8J74J36J68Q3J18O3K8Rj13l0n5k7j16qn7j4r5L5m7P5
8055f2n3k7N9r9M0p8P8j2L7P7M2J7J03J17O7J1O8j43l7n3o4j58q2j4j18n2l7M6
8083c27k6j2J95M8N1J14J30Q9LO7RK5j5j16k7J3j06p6m4o8j15l0n6k2l5L6l0J84
8111a41p0P8R6J21o8Q1J4N0pj3M2J9j0k3J8mnj07n1pj40p4q0K4o6kK6Q4J29M9
8141c7P7J46J35j0L7K2pp7k00j7j47r1r9r7N0J3MP9R6M9LJ14J02q8rJ16n7j1q
$$ y = [-136, -125, -3, -28, -84, 20, 36, 7, 50, 133, 33, 68, 203, 136, 135, 174, 147, 106, 68, 28, 20, 25, -28, -70, -35, -94, -130, -98, -124, -146, -90, -103, -152, -218, -145, -172, -211, -205, -122, -127, -62, 64, 84, 187, 391, 367, 442, 477, 454, 394, 383, 285, 141, -38, -150, -191, -378, -394, -374, -465, -388, -349, -312, -213, -161, -137, -63, -24, -10, -15, 19, 68, 128, 162, 252, 322, 303, 386, 438, 408, 324, 300, 184, 78, -83, -306, -357, -525, -511, -523, -497, -457, -389, -215, -79, 89, 172, 290, 353, 381, 390, 277, 247, 192, 165, 49, 41, -16, -30, -125, -90, -137, -62, -115, -142, -83, -182, -142, -220, -142, -154, -117, -40, 2, 19, 122, 239, 306, 317, 385, 242, 205, 152, 88, -70, -152, -166, -284, -336, -373, -327, -353, -365, -170, -122, -71, 43, 173, 262, 265, 332, 341, 366, 351, 235, 208, 221, 115, 39, -5, -73, -188, -218, -274, -296, -331, -295, -325, -141, -211, -133, -37, 84, 16, 97, 111, 161, 154, 141, 183, 202, 192, 169, 187, 183, 178, 71, 20, 13, -127, -201, -281, -257, -323, -325, -299, -215, -86, -37, 40, 186, 321, 311, 348, 370, 363, 286, 86, 69, -78, -169, -268, -365, -315, -302, -298, -219, -123, -74, -71, 43, 145, 57, 48, 164, 107, 96, 88]
8170H8J3P5j1kK9O4l9n8jj18o4j32j45m1j10m6n9J53j7J32R4
$$ y = [88, 101, 176, 165, 163, 192, 256, 217, 159, 158, 40, -24, -156, -301, -342, -452, -498, -557, -404, -421, -289, -195]
8191a95
$$ Imaginary data points
##PAGE= N=2
##DATA TABLE= (X++(I..I)), XYDATA
0@%%%%%%%%%%%JrJ6j6J6k1K9l3M1n0N9p3Q8j04J21j38J57j82K12k44K77l12L54
34A89m02M52n09N70o36P09p90Q80r75J081j197J322j460J611j776J958k156K373
52A244k616K887l187L525l911M351m861N459o171P041q128R529j1419J4118j8321
67a0460K5833m3398J61912J34327j28628P4180j9045j09167o7672K927p0265l8836
79h8292k3171l0673J2907M5808m2996m18Q9047P519o8113M9867N3957n5647j7379
92f7584N8911r336j1626N1047J4488k783O6782K4521l6264L3962M1360o3160m1746
105E8572K1140m3331p2293j0386k2355l9828J1035j303k4892N0218N1404l2639
117e4658J8546Q8771o410m8175M6518L2086n4331j7894K3531j8395j7763M132
$$ y = [0, 0, 0, 0, 0, 0, 0, 0, 0, 0, 0, 0, 1, -8, 8, -8, 8, -13, 16, -17, 24, -26, 33, -40, 48, -56, 65, -73, 84, -98, 114, -130, 147, -165, 189, -213, 239, -270, 300, -336, 373, -417, 463, -512, 569, -628, 694, -766, 845, -931, 1027, -1129, 1244, -1372, 1515, -1672, 1853, -2058, 2293, -2568, 2891, -3280, 3761, -4367, 5162, -6257, 7861, -10460, 15373, -28025, 133887, 268214, 139586, 213766, 194721, 85554, 17882, 20809, -49456, -88292, -111463, -142136, -129229, -83421, -126417, -126835, -37788, -30269, -98382, -48515, 5442, -50205, -67584, -8673, -18009, -29635, 21412, 35900, 33117, 99899, 124420, 88156, 122118, 163478, 100318, 58572, 79712, 36381, -35912, -46298, -68653, -108481, -97446, -98749, -123641, -73423, -22019, -54658, -36112, 52659, 46249, -1926, 44592, 76678, 22347, 4453, 27984, 9589, -8174, -4042]
129d042j5431O592K8442k4290j7410N0807O216n3386J6312M1178l7619k6882L4224
142D711j074k5286J7397Q814j2314K1311J1694k3759J3506K7052k8588j8653K6921
155B1732q895l3966P408N229k1536L169O702j6648J1524K2646j9912k828M0707
168A5332p25k8055K5082K6807k4367p878K2894l749j4933K329m767n270M358j4268
182g210j2863J8720J349k6430J0779K7130j5650j1385K7342O611j8345P417J1813
195A9278j1988m790L966r933n416K864j0135o278Q605m215q490J1395N468q738
209a8407Q991J3489o949K061J8275j039p561J4342Q421j1003J176J0286n703q437
223A7942Q35l042o938n514r161n379Q6j0549j1891N249J545j4002m33J3962j405
$$ y = [-4042, -19473, -12881, 15561, -8729, -26139, 24668, 30884, -22502, -6190, 34988, -2631, -29513, 4711, 3637, -21649, -4252, 4562, -7752, 13559, 25253, 1494, 15000, 42052, 13464, -5189, 21732, 12837, -21129, -13721, -8492, -30028, -26859, -20157, -36805, -25281, -2635, -22547, -25375, 15332, 14607, -13448, 11634, 38441, 14074, 6196, 29090, 25341, 10408, 12737, 7970, 2700, 7058, -7210, -20073, -1353, -4, -26434, -15655, 11475, -4175, -15560, 11782, 18393, 48, 7465, 19278, 7290, 2500, 6466, -3467, -8883, -6019, -16154, -22432, -13827, -18042, -26532, -15137, -9669, -18407, -9416, 4073, -2876, -815, 17460, 16421, 8860, 23202, 31623, 20620, 21796, 32082, 26379, 17942, 18777, 15735, 8797, 3283, -5878, -11257, -11171, -21720, -33611, -28362, -26817, -40819, -41252, -27290, -28695]
238b8695n727J3339J3892J052O703J5478R878N032O163N627L799j624p654m616
252C2647l687j3443j4296m079o031j3088m164M407j556k011P149P006N78J864
266h704M301L23l288k966j817j914k874r89L903N609M198P125J0983P835M046
281B5771N258L766k790n640m504o566r482p553m112l258k166J445M372L769K943
296A253L477K036k072m738n578p816j0130q772n777m209j360M315Q903J0870J3237
311f361J5967J5629J2166R456P234K126l969o742q035j1106j3225j0989q125q194
325a4168o930k523K14j293j170K088J576k228j426J780K51j308K659O203N514
340a0761O651R987J1059R506P698O781N421R01m687n663o111j2052j4693r589
$$ y = [-28695, -34422, -21083, -7191, -6139, 564, 16042, 25920, 30952, 37115, 42742, 46541, 44917, 37263, 32647, 28960, 15517, 1221, -2858, -8889, -21977, -26141, -21734, -23290, -25301, -18152, -11146, -10568, -8704, -4403, -4080, -7368, -10334, -12151, -14065, -16939, -17928, -14025, -8416, -4218, 2907, 13890, 21725, 25771, 31029, 34795, 32005, 26365, 21861, 15295, 5813, -1740, -5852, -9110, -11276, -9831, -5459, -1690, 1253, 4730, 6766, 4694, -44, -5622, -13438, -23568, -32340, -38117, -42326, -43686, -39371, -30468, -19598, -6361, 9606, 25235, 37401, 46857, 54091, 56217, 52248, 45506, 37471, 26365, 13140, 2151, -5974, -14168, -21098, -23621, -23407, -24700, -25870, -23782, -22206, -24434, -25860, -24080, -23829, -25137, -22478, -16275, -10761, -4110, 5877, 16936, 26442, 34140, 40921, 46342, 47243, 42556, 36893, 30782, 18730, 4037, -5552]
354e552r188j3289q301p06k373k556N398P959N024P229J0263Q768P686O602N043
369B2007O009L800k442j328K066n660j0866k922l096j2598r032n53n240p763J30
384b7488J908j63L029L889L253P298N544J93N884R421k80j78R791M249l480M205
400B7075N450m231l046j70q560r575n344j2604j4485m820p001j1733K6O303K90
415d2425O834J5688J0131J0283J6635Q485L176J0204K481j0076j776J388j3565
428A7463j1308K164m149r290J639K756k608K576P78n629J649R92j3342o555O710
443a6154o823j2301Q353J0151l591O005J6147P027N796R578J699J676M985r157
457B3391j2350L217m395j9603l109Q688p500o286J1376O492q91O708M132j281
$$ y = [-5552, -14740, -28029, -36330, -37036, -39409, -41965, -36567, -28608, -23584, -16355, -6092, 2676, 10362, 16964, 22007, 28016, 31816, 29374, 28046, 30112, 24452, 13586, 10664, 7568, -5030, -14062, -14615, -19855, -27618, -27488, -25580, -25743, -22714, -18825, -15572, -8274, -2730, -2537, 3347, 12768, 12488, 12310, 22101, 26350, 22870, 27075, 32525, 28294, 25248, 25078, 16518, 6943, 1599, -11005, -25490, -30310, -37311, -49044, -49018, -42715, -42425, -35591, -19903, -9772, 511, 17146, 25631, 28807, 39011, 41492, 31416, 29640, 31028, 17463, 6155, 8319, 4170, -5120, -3481, -725, -3333, -757, 21, -5608, -3959, -2967, -16309, -22864, -16154, -22977, -35278, -26925, -16774, -20365, -14360, 1787, 8814, 14610, 24188, 25887, 27563, 32548, 23391, 11041, 14258, 9863, -9740, -12849, -4161, -11661, -17947, -6571, -79, -970, 5738, 9870, 8589]
471H589N060j787j2883j2L897j5631j0621J0041n18j1372O181J1207q06L198P917
486B460J151M988N797p323j645J1182n171j3575Q440Q584j1930k827J1737q22
500A1046n999L245q65l370J898p115r984N587r4j6614n51J2635o528q537J2070
515a3176P649m137N470P679Q87O309M211n870M503R579r819q345J0813m00j5421
530f8J6O336p848n832K222k638l01L156o001r79J1852j505j0762R209J1173j0252
546b222m473J1874R09p784J884K547j054J805l062m165Q086K398j2075J390J2822
561H880o325j0824Q965N939q979j343O075q16o09J119k992K841N353o896m531
576d143R642K38j1618K299P837o462n206N080p5l059J964j275j448N749J10o063
$$ y = [8589, 13649, 11862, -1021, -1033, 2864, -12767, -23388, -13347, -13865, -25237, -19056, -7849, -8655, -5457, 2460, 3611, 8599, 14396, 7073, 5428, 16610, 11439, -2136, 6304, 14888, 2958, 131, 11868, 11046, 5047, 8292, 7427, 4057, 5955, -1160, -11144, -5557, -5651, -22265, -22816, -10181, -16709, -25246, -13176, -5527, -9664, -4194, 3485, 4372, 10681, 14892, 9022, 13525, 23104, 13285, 4940, 15753, 15353, -68, -52, 6284, -1564, -7396, -5174, -7812, -8113, -4957, -10958, -11937, -85, -1590, -12352, -3143, 8030, -2222, -6695, 5179, 6088, -1696, 188, 2735, 1681, 3486, 424, -3741, 4345, 6743, -5332, -3942, 8880, 2555, -8269, 696, 6635, -2344, -3687, 2388, 1572, 963, 2082, -910, 1931, 7284, 388, -4143, 5499, 5737, -5881, -3582, 4255, -2207, -7413, -2333, -2408, -5467, -3503, -4778, -6226, -477, -367, -6430]
592f430N581P821n538k128R314J366n653K066K129l582j257k466n589P70O24q209
608a1181j403Q601j021n219Q174Q371k454J016O494M86j998r04m059k535m00p105
624e137o196M081M57o902K617Q623p63j552O176K829k363J66p17k656K23j463
640b577l741K937N449p72K045R456M263j035L302K249m570n180n325q724p512
655i735o237q736m747J766n3J16Q325R661M749O784R529M822J491J817q00k883
671A5869k521m405m539l85q20k900J450M100j34p32K264p33m863l835m160o609
687a2953n504l797l333l31K938L586N917R016Q176O839P695N546J562K48j488
702B4117n136n959n313o774o361l189k016k036Q40K923K303K163K901K002O97
$$ y = [-6430, -849, 6972, 1434, -694, 8620, 9986, 4333, 6399, 8528, 4946, 3689, 1223, -4366, -3596, -2972, -11181, -12584, -3983, -5004, -10223, -2049, 6322, 3868, 4884, 11378, 11864, 9866, 8962, 4903, 2368, 1968, -5137, -11333, -7252, -6795, -13697, -11080, -2457, -3220, -4772, 1404, 4233, 1870, 2036, 1319, -1337, -1114, -2577, -6318, -3381, 2068, 1296, 3341, 12797, 17060, 16025, 19327, 21576, 17006, 11826, 6501, -2223, -9735, -15972, -24708, -29455, -27689, -27742, -27626, -19301, -9640, -4891, 1893, 11422, 16244, 17735, 19552, 18752, 15869, 13348, 8943, 4404, 4019, 3199, 299, 1749, 5849, 5715, 4983, 7247, 6514, 1651, -2184, -6344, -12953, -18457, -22254, -25587, -25918, -22980, -19394, -13477, -4461, 3715, 10554, 18249, 23795, 25357, 25605, 24117, 18981, 13022, 7709, 935, -5426, -8615, -10631, -12667, -11827, -8904, -6601, -4438, -1537, 465, 1162]
717A162k27j252j372j339j940j437Q83J283Q51K676M324K682J617K339J303j109
733A0444k299k253l097m033l722k553j477j159pJ803K733K300K713L492K635R82
749F502Q20P76q14j977j623j277k188k206j006n33p53m00M20P23K48L23Q59P73
767a333J7L75P86O17Q8M31Q78M36M9K92M98j41m73j06j06o61p13l04l93o41n73
788i77j85k61n75l42M9o2j46J27M58M35M11P98Q11O30M99N24J51r3m06n20p27
809E99r01q74o29m21l16J62N66O85P84J268J095O58O94O99p5m64k26p85j289r56
829B74r70j264r38n68o15l04J87R0K98P73N87O87J140R04N03R82R88n9K07P09
849C611j48p97J62J08r50m99L24l14o14k33k83j99n20j073r00j03r83j674R5O31
$$ y = [1162, 935, -317, -1689, -3028, -4968, -6405, -5522, -4239, -3388, -712, 3612, 6294, 7911, 10250, 11553, 10444, 8145, 5892, 2795, -1238, -4960, -7513, -8990, -10149, -10156, -8353, -5620, -3320, -607, 2885, 5520, 6502, 7322, 8098, 7284, 5307, 3684, 2407, 219, -1987, -2993, -3526, -4279, -4679, -4259, -3536, -3288, -2965, -2106, -1333, -1316, -941, -155, 462, 550, 981, 1859, 2295, 2344, 2636, 3134, 2993, 2520, 2414, 2308, 1647, 934, 630, 237, -404, -977, -1162, -1423, -1998, -2340, -2291, -2353, -2499, -2372, -1914, -1479, -1068, -270, 541, 1171, 1670, 2194, 2345, 2252, 1846, 1326, 599, -302, -1176, -1805, -2226, -2542, -2380, -1814, -1129, -345, 923, 2018, 2676, 3370, 4069, 3994, 3530, 3304, 2519, 1230, 274, -696, -1960, -2898, -3466, -4081, -4385, -4198, -4108, -3810, -3037, -2450, -1763, -623, 281, 784, 1766, 2754, 2695, 2902, 3611, 3463, 2666, 2828, 2936, 1986, 1487, 1811, 1497, 883, 650, 367, 168, -352, -1425, -2325, -2428, -3411, -5085, -4990, -4359]
869d359p22K8K009J613O27J775K323R98O90M91k88m72r81k181j544n93j599j628
887c813P30J026q0J291K362J112O54J076j94q91o66j981k677j248r71k278n55
904g103J382O25O61K382K311J388J771P87r5N58o29k420r19M54j968j642J552
921i05J441m88J073K415Q51p%q72r49j489l440k530k82j824k928R48K557J64J055
940e210L931L117J346J932J594P46M40j246k048q1p76l475j691J316j037k334
956c476Q46J417p90m17N56K1J80k68j370M20J740j113j053K794J897j371P89L065
974C867L79p40P06L54n10n60j603j355M69j342l208n0J253k188j867J882R85j105
992d633Q32J964J141J591J310O03K192J713j345n89J896j108l688p35J20k880
$$ y = [-4359, -5081, -5053, -3044, -1431, -804, 971, 3294, 4292, 4982, 5473, 5185, 4713, 3732, 1551, 7, -586, -2185, -3813, -3083, -2057, -2137, -846, 1516, 2628, 3282, 4358, 4164, 3273, 2607, 626, -2051, -3299, -4270, -6548, -7103, -5721, -5096, -4435, -2053, 258, 1646, 3417, 4204, 4109, 4667, 4038, 1618, 699, 1153, -815, -2457, -905, 536, 48, 1121, 3536, 4387, 4380, 4380, 3508, 2559, 1070, -2370, -4900, -5182, -7006, -9934, -8986, -6429, -6265, -5210, -1279, 1838, 3184, 5116, 6710, 7456, 7896, 6650, 4602, 4521, 3745, 270, -1421, -105, -1142, -3476, -2630, -1213, -2003, -2420, -1864, -1843, -1663, -1931, -3301, -2881, -1141, -2254, -3307, -513, 1384, 13, 802, 3867, 4246, 3506, 4212, 4566, 4056, 3496, 1893, 538, 1007, -335, -3543, -3593, -2340, -4528, -6395, -4513, -3528, -4633, -3801, -1837, -696, 895, 2205, 2808, 5000, 6713, 5368, 4779, 6675, 5567, 1879, 1144, 1264, -1616]
1008a616k285j22m13k77M58j39J110K562rj033K332J575k485r61J955m06j881
1025a635O26J479O04R30Q52R39K121N03j996l1R84l230l953l77q83l621j416J055
1043g049K77O06J738J809K916K673K63N41K372l94l103n46L07k813k466N70Q9
1060b210n39R38J228J193J971N63o44J144N05k730j826N36j619k719M0Q17l49
1077c701N79J506J103J782J396j97L65J183j464k367O5m75k553r71Q31j68R3J451
1095a542J151J301J853N93q6J352O7k158o96K59j965k062N2k14r75R6M81K64R34
1114a295N47l34R25J025j039n48J297j86j263L50J040l76m8Q30L31L53M07l14
1132A702J7M93n66j263K56k5j505n75N34n81p50M21L20q3L03L74J52O20N21k32
$$ y = [-1616, -3901, -4023, -4436, -4713, -4255, -4394, -3284, -722, -731, -1764, 568, 2143, -342, -1303, 652, 246, -1635, -1009, 470, 1074, 2004, 2856, 3795, 5916, 6419, 4423, 4392, 5376, 2146, -1807, -2184, -3067, -6688, -8104, -7049, -6772, -6166, -4428, -2619, 297, 2970, 3233, 3774, 6146, 5752, 2649, 2103, 2410, -403, -2869, -2299, -2210, -2749, -1811, -583, 610, 2581, 3144, 2500, 3644, 4149, 1419, -407, 129, -1490, -4209, -4169, -3352, -3701, -3122, -1616, -513, 1269, 2665, 2468, 2833, 4016, 2552, 185, 250, -225, -2778, -3749, -2918, -3086, -2993, -1542, -391, 910, 2763, 3356, 3270, 4622, 4689, 2531, 1835, 2094, 129, -1933, -1881, -2095, -3070, -2974, -2493, -2229, -1295, -748, -1082, -157, 868, -171, -719, 578, 392, -871, -521, 519, 143, 95, 925, 1256, 1609, 2016, 1702, 1719, 2212, 1646, 383, 639, 614, -891, -1466, -932, -1513, -2263, -1842, -1522, -1605, -1302, -928, -776, -156, 365, 133]
1152A33M56O86l31k99N83n8p35L4R0n35k71J37l77n2L48j31k24N90J96k13K35
1173B62L91k87q7J93k19k26J00k74l73K00n9l92l5L72j88p6L65J13N2K22L34O
1195C94J52K32j45N2Qk80m47J83k88l15P5J06m5Q9L32K55R6J56J4j35j36m53m57
1218e57j53l39k87NL56L00L75P62O83L51K73J79j53n09p69q03r19q85o50k37J12
1239b865L69O92J218J317J064J084Q96L36k79m79q19j238j436j215r56o88m09
1256c408K64P49P56Q68J111Q96L37l8k76o10j089j037p10n30k92M21Q29J337J425
1275A003J581J514J069M74l5n98j251j907j964j847j888j474o44PL75J168J536
1292b881J723J727J456R17N15J1o17q81r29j146j023l39mJ31P59J265Q36Q97Q62
$$ y = [133, 589, 1275, 944, 645, 1228, 1170, 435, 469, 559, 24, -247, -110, -487, -539, -191, -322, -546, 44, 240, 27, 262, 653, 366, 279, 472, 253, 27, 127, -147, -520, -320, -379, -771, -806, -434, -622, -698, -333, -220, -168, 54, 388, 394, 546, 778, 633, 685, 693, 413, -34, 149, -139, -454, -379, -273, -318, -229, 103, 358, 454, 610, 624, 489, 353, -100, -557, -710, -1049, -1336, -1331, -975, -675, -300, 462, 1145, 1496, 1769, 1948, 1795, 1286, 517, -286, -1205, -2090, -2740, -2977, -2865, -2496, -1804, -586, 731, 1795, 2879, 3775, 4111, 3832, 3353, 2534, 1296, -140, -1355, -2311, -2999, -3408, -3144, -2395, -1639, -771, 340, 1236, 1573, 1535, 1259, 649, -440, -1477, -2187, -2717, -3009, -2588, -1759, -422, 1003, 2584, 4098, 5167, 5641, 5606, 5008, 3757, 1850, -114, -1961, -3849, -5323, -5967, -5960, -5585, -4417, -2881, -1158, 569, 2025, 2942, 3457, 3468, 2851, 1970, 1041, -105, -1128, -1467, -1471, -1340, -581, 684, 1520, 2417, 3279]
1311C279K20m88o13j061j619j466j348j070o05K5K59Q96J601J417J329J750J194
1328C700K58J56m2j026j255j027j189j136n06m63j64O49O83L07J108J031L4m3
1346A075M45k80r63l47k49n75l03P5k7N41O79J08M35J028k0o20L94M9j109o85
1366c49J11p86o48Q8m3m4O31K98K0J009O56m69L88R94n62m78M90j57p71Q0j51
1387C07p21J11M6q50R9P08n86n01J101K81p35N48Q03l18O5L37l51O1L02q66n34
1408f93R84k88j256O72J100r48k81J259P7m88L19J06l12M23n17q68Q84L48j462
1427i41R0J643m36j112J119Q38q17j02L06l97j4k92j052J33P46j102q69J662M70
1446a27j444P69J607k62l58R32K07m8L97n07l25Q73n03j638O07R23j744q43J226
$$ y = [3279, 3499, 3011, 2398, 1337, -282, -1748, -3096, -4166, -4771, -4746, -4487, -3591, -1990, -573, 756, 2506, 3700, 3958, 4114, 4072, 3046, 1791, 764, -425, -1561, -2067, -2530, -2694, -2045, -1362, -1055, 53, 1084, 1118, 1075, 1520, 1240, 277, -70, -319, -894, -1197, -1122, -1149, -608, 71, 179, 614, 1642, 1622, 1002, 1396, 1445, 336, -349, -238, -1024, -1672, -1584, -1627, -1671, -1040, -742, -722, 287, 943, 474, 862, 1856, 1294, 816, 1306, 1149, 378, 458, 307, -414, -303, -257, -1107, -1008, -300, -886, -1387, -286, -5, -740, -192, 611, 293, 358, 695, 344, 405, 707, -159, -693, 291, 3, -1253, -581, 519, -429, -710, 549, 626, 138, 457, 563, 251, 674, 157, -711, 173, 521, -941, -851, 792, 356, -756, 363, 1201, 384, 282, 588, 191, 177, -115, -1167, -1034, -288, -1390, -2259, -597, -127, -1571, -802, 805, 543, 185, 1117, 1324, 1276, 1673, 1166, 841, 1714, 1211, -427, 180, 1103, -641, -1484, -258]
1465b58j72j189L53N80k71L50K59m17Q59O68j196j60J642o18j517R58Q05j062
1483c86j92R96K9J97N52l47L36J036q86j210J003N0k210m85J031r10j170P85N88
1502a193l5P21L48L11J266J98j330N77R98j778j428J038o6j656K66J144J49L28
1520a42Q30L52J040P16r26k41Q84r49k318J03M17j774r13R99J72k34P77O38N67
1539bJ013l9m77Q85K90j772l89Q50p45j256Q29P19l89M99Q24K88N22L96o63l2
1559A351M29j261j406M07k89j497r0P86k61k2R05M63M69R01n0m6R00pj036K22
1579H68M87r65p26N19j02o78J50M9k34K96lm92N86M77o55j40J018p1p13M29N48
1600F48m91k48L05q5p2N6k30J85O03j75m41P74L29q69k45M41n85q71j58k08n08
$$ y = [-258, -430, -1619, -1266, -686, -957, -607, -348, -765, 94, 762, -434, -594, 1048, 430, -1087, -129, 676, -386, -578, 418, 447, 644, 1196, 849, 1185, 2221, 1335, 125, 1128, 1178, -1032, -1517, -486, -1396, -2566, -1781, -1193, -1228, -507, -159, 152, 1418, 1616, 286, 863, 1861, 83, -1345, -307, -373, -2029, -1763, -619, -470, -142, 688, 1040, 2080, 2796, 1870, 1629, 2513, 1564, -754, -651, -234, -2008, -2921, -1922, -1750, -1984, -1207, -569, -2, 1011, 972, 495, 1380, 1670, -102, -491, 359, -386, -1642, -813, -94, -483, 16, 840, 1128, 1650, 2046, 1383, 1351, 1780, 519, -887, -480, -769, -2266, -2356, -1570, -1831, -1853, -948, -485, -16, 885, 835, 789, 1689, 1682, 646, 868, 1355, 390, -336, 183, 81, -597, -447, -398, -632, -336, -339, -831, -245, 232, -423, -563, 455, 384, -329, 100, 648, 157, -91, 214, 129, 57, 113, -117, 68, 671, 496, 55, 829, 1158, 289, 44, 485, -100, -971, -1129, -1337, -1845]
1621a845l5J40J52P45O80L98Q88J025R5n3M13k91r71o44m78j011p53j98k67K0
1641a990M92M38O35Q93M71J64J90N0o11n42m56o67p03r4P6N6O51Q16O08Q72Q21
1662B170M02J0j00n08q66q63r94r71n94k57j86M03O71Q30Q60J042P20K58K20j19
1682B128n19p45p67p54p05m72j53J41M61N27O07Q04O68L35J96ll64n08n83o31
1702c37n83n27r7K6K90M57M51O78N90K86K01R1k29n17m39m78o05m78j49j40P7
1723a432K85M16N61M23L41L42K82K2j29j98k38m25l95q8k29k10L9J54Q6O8K22
1744a03J76Q0M6J7K5j69j73J2j0j16j9O9R3pJ4J59J59l9n6J06K3j10K8m1m5j30
1770a1j85M4Kj30j20J06K0jO7J77J2J39K01j0j6J13M2j51Oj18j10j05p3r1q8r
$$ y = [-1845, -1880, -1740, -1588, -843, -163, 235, 1123, 2148, 2243, 2190, 2603, 2312, 1341, 697, 219, -792, -1545, -1743, -2010, -1990, -1498, -1060, -425, 468, 939, 1103, 1293, 1343, 732, 190, -266, -933, -1636, -1730, -1654, -1598, -947, -131, 477, 1349, 2170, 2572, 2582, 2482, 1974, 1108, 245, -749, -1720, -2314, -2571, -2757, -2354, -1683, -853, 7, 1049, 1769, 2027, 2247, 2128, 1609, 864, 97, -657, -1362, -1834, -1987, -1846, -1385, -858, -251, 553, 1221, 1556, 1752, 1749, 1385, 877, 294, -337, -920, -1447, -1544, -1518, -1228, -771, -320, 358, 948, 1234, 1435, 1526, 1297, 780, 341, -137, -742, -1220, -1369, -1509, -1432, -1147, -731, -170, 253, 594, 936, 1218, 1240, 1111, 913, 675, 250, -145, -233, -462, -672, -633, -479, -393, -325, -103, 73, 153, 199, 216, 241, 72, -101, -89, -99, -215, -234, -165, -72, -79, -65, 94, 253, 214, 158, 264, 287, 177, 205, 164, 119, -11, -196, -152, -150, -280, -400, -294, -274, -275, -208, -31, -19, 120, 321, 311, 295, 408, 450, 299, 305, 187, 77, -28, -101, -192, -280, -289]
1796b89q9m2R8Q6j14J14K16n7Q7K96J5o2J23J22j60lr6j90j21m5k92m6K35m5j94
1821d53L75L52j43J29M19k59j42n9k51k84k20l02k26K31J40j22M52Q36R5J26N79
1842A273L32m05j87j76n74o23m35n10j62J75j72K65R73N84J4Q21P54l15l74pn91
1863F60q92n75p30m73M6P3L8J018J060K85P39J042J78m38n8m40j140q09p41r93
1883b150r1J74k44N49J517O00K81J248Q18m79k90j64q80j147q15r41m91J29k11
1902b587K45J472J117J97J085J400j01o25J41n27j310j001q24q68j61r7k07J010
1920a641J408J81N25J702M17p48O1K6j167j066n63p80l79L3k69M69J380N04RJ375
1940A477J113o62l64M48o41j287n03n03o46j70j95r7J030P28k32P90J393k38n49
$$ y = [-289, -378, -420, -322, -236, -350, -236, -20, -77, 10, 306, 321, 259, 382, 504, 344, 341, 245, 55, -66, -111, -403, -449, -214, -259, -453, -78, 274, 131, 260, 679, 420, 278, 219, -32, -316, -536, -838, -1064, -833, -693, -815, -363, 473, 568, 694, 1273, 1605, 1200, 1013, 837, 263, -360, -795, -1305, -1467, -1292, -1464, -1199, -226, 358, 372, 1193, 1947, 1632, 1258, 1251, 660, -232, -807, -1537, -2010, -1964, -1891, -1853, -835, 225, 510, 1249, 2291, 2469, 2031, 1973, 1533, 393, -416, -1157, -2150, -2241, -2067, -2311, -1762, -245, 355, 636, 1884, 2702, 2223, 1933, 1769, 889, -258, -1073, -2014, -2505, -2376, -2587, -2342, -870, 247, 444, 1529, 2929, 2828, 2203, 2344, 1817, 507, -494, -1318, -2186, -2347, -2444, -2651, -1641, -233, -52, 473, 2175, 2592, 1844, 1905, 1931, 764, -302, -865, -1645, -2024, -1991, -2260, -1791, -411, 93, 102, 1477, 2590, 1928, 1564, 2012, 1371, 84, -419, -922, -1568, -1738, -1933, -2030, -1000, -272, -504, 286, 1679, 1441, 892]
1959H92N54J04j112m73q8o28k18K4l00K94Q99j84j06J121L97p61J43N84o33o30
1979a21K07l40l46Q0j97j85P13Q2n67N60Q75n82l24P88O8o67J04K59l54l3L4m32
2001c78K12L05p40o6Q41k29p14N77P37n14n4P00r0j84J29l10j06K64n06o81M83
2022c24K37q64J10R19j83k64O05M37l04J44N4k65M5j11o19L8L05n03l11P14J83
2043D3m20L99O10j56J6K54k76k53J37m35m08K87j37o25L17M73l22j1O33J08j37
2064I7L80N6k16K18p1m42P9J89n20j49L47k02l46K60K22k22J81K48l3J65K81k74
2086B48J4L26j87m46J20L7n35j79J76j72j15K95J40J18L74J73J1L31R1m36l2M2
2108C94m71m04K1r9k40J43L16J52L94L16K32K89J88k91k69j89m47o89k84k09l78
$$ y = [892, 1446, 1550, 438, -35, -123, -751, -969, -945, -1245, -951, -52, -236, -342, 779, 1176, 415, 558, 1142, 509, -121, 86, -254, -600, -520, -717, -902, -189, -107, -674, -114, 761, 179, -145, 643, 711, 44, 148, 407, 53, 20, 54, -378, -166, 139, -601, -667, 174, -55, -769, -192, 545, 31, -23, 677, 587, 403, 532, 222, 116, 380, -126, -807, -324, -87, -951, -841, 78, -105, -369, 236, 673, 369, 513, 567, 302, 347, 236, -383, -345, -40, -543, -854, -140, 43, -377, 22, 632, 476, 492, 746, 470, 217, 354, -81, -489, -202, -339, -964, -647, -174, -496, -507, 126, 234, 97, 477, 533, 317, 535, 464, 22, 101, 290, -230, -379, -32, -234, -580, -320, -98, -320, -139, 109, 76, 241, 522, 248, 262, 588, 401, -45, 75, 112, -423, -602, -426, -598, -713, -418, -278, -160, 214, 387, 398, 729, 820, 384, 352, 394, -77, -481, -460, -559, -799, -656, -340, -188, 206, 522, 754, 1043, 1231, 940, 671, 482, 35, -654, -938, -1147, -1525]
2129a525j1K58L12L76O16M85L98M25J00r5j49l20n53l25l20m35k77J57R4J52M63
2150a74L96K12K21J98l3k53k14l79m64l52k74j29K7K41K42N05N48L52K94L89M7
2171A400j83j72k40m35m40l25l91j86p8Q4J41K13J71K90L31R5J51P4L3j56r1o4
2193B22l5j77r4Q8p6J5J6J2rM6p5J03oP2q8K1N4j34K4o5j39j13q2J1m9K8J55J65
2221a10K80K44K32K93J28m9q1j51l73l73m43l54m34j31l4Q7K90L82M83N40M07
2242H33L95J70M1k19m79m13n11n85l98j52KJ25M12N45M73N42M28K28N9j74m72
2263H50m60n42o37n97j73k4m2N37N95N99O65O08L40O5j39l15o43o01p30o80m86
2284a810j93o0L03O30O43O34Q26N12K76K13m6n44o24m16o84o76k59j04m1L30M07
$$ y = [-1525, -1536, -1278, -966, -590, 26, 511, 909, 1334, 1434, 1339, 1190, 870, 317, -8, -328, -763, -1040, -883, -789, -637, -174, 222, 434, 655, 853, 820, 567, 353, -26, -490, -842, -1116, -1245, -1218, -977, -735, -230, 318, 670, 964, 1353, 1400, 1217, 1045, 805, 370, -70, -395, -786, -972, -1050, -966, -825, -612, -441, -151, 180, 275, 426, 500, 533, 377, 286, 222, 187, 10, -84, 4, -72, -57, -41, -29, -38, 8, -67, 36, 30, 102, 14, 35, 89, -45, -21, -86, -225, -338, -420, -409, -458, -430, -275, -110, 170, 414, 646, 939, 1067, 1018, 937, 786, 413, 40, -403, -757, -1191, -1322, -1356, -1269, -979, -597, -114, 426, 833, 1228, 1398, 1439, 1220, 741, 328, -183, -768, -1166, -1318, -1316, -1191, -779, -234, 239, 781, 1209, 1437, 1496, 1322, 850, 390, -152, -789, -1386, -1559, -1583, -1625, -1088, -493, 106, 771, 1379, 1719, 1784, 1645, 1330, 687, 86, -644, -1324, -1810, -2003, -2063, -1760, -1130, -487, 147, 973, 1485, 1761, 1974, 1928, 1384, 760, 344, -340, -1016, -1275, -1379, -1420, -1090, -683]
2305f83M73N77M83N8J94L1l87n58j97m70o54j69Q9j10J89N60M63M90N42M07J31
2326A459J49j95m35k73l29o88m92j0k20j49K87K58J42L14L03J69J97J01k82q6
2346B20M5k89m11J62m3k16J58K70N0J81K67K4Q3J09o5k99Q2k0m24j60K28k66k24
2369e38K71J20j57J37J04j16J91J13k37J16K16k25k09K69R6l65R9K29j00o0P6
2390C0n9Q2J71j96p4L94n1l86K00K53l17j86K71n6k54%J2p2Q3rk40K61J86l00
2414b57qN20j8l18L03L02k11m9J36j15p6j7l41q3J51l33k88L29J16k40P4N28K2
2437A27J6K85J71j48Q7j28l36k8j19m31j6L68j73r9N39K60k3J60K00j91j59j76
2459A86n03k98j15m17k86L69K45m4N68P63L53K72N34J32k74p3m89o24l35m93p80
$$ y = [-683, -210, 367, 850, 908, 1102, 1133, 746, 188, -9, -479, -1133, -1302, -1213, -1323, -1134, -574, -111, 379, 921, 1328, 1459, 1608, 1413, 978, 705, 376, -312, -804, -814, -1034, -1183, -896, -638, -496, -182, 121, 290, 487, 588, 306, 220, 265, -24, -435, -273, -316, -532, -374, -104, -54, 127, 394, 418, 501, 610, 545, 246, 328, 308, -116, -276, -48, -314, -538, -267, -147, -304, -167, -63, -179, 12, 125, -112, 4, 220, -5, -214, 55, 151, -214, -115, 114, 14, -46, 30, -29, 53, 224, 28, -46, 348, 297, -89, 111, 364, 47, -139, 132, 76, -178, -178, -166, -238, -155, -164, -404, -143, 43, -257, -265, 255, 237, -81, 222, 524, 313, 264, 400, 285, 209, 192, -149, -232, -81, -414, -702, -373, -257, -497, -423, 105, 127, 143, 428, 599, 451, 538, 410, 74, 46, -73, -504, -520, -152, -325, -424, 115, 375, 352, 512, 712, 521, 362, 186, -317, -615, -730, -1147, -1433, -1064, -819, -863, -295, 468, 821, 1093, 1627, 1759, 1485, 1412, 923, 299, -36, -529, -1309]
2480a309q4J78k40J90P59M72K16N69L50o0j40k21o08l06l12o12k07K59J21M8P89
2501a48P66L07M05N68k1j72l65o36p43m73p51o49K4O8j8N56Q18O05M24P06L76
2522A647n6k7l31n95n02n17o72k61J2p5J22P29N43K60N61M65J0j50j71n12n25
2543d5l31m93l94K1J16M2M79O06L80L91M26J73j80o2l52n35l82m25n26j65Q4j05
2565a277J86N08L85K67M46L78j3O2Lk66k16k09l61j97J6j21j34J77K55J8P6K70
2587B53L6j28K5m3k23o3n0j65J6K0q7J48K24K9L7K36Q2n6M7Q1p3n1k7j36n9o5
2613Hj45p7p2n1j51Q2J19j02J51K16J18O1J80J89l0%%j63j32j21k35j06k8j81
2637d70J2P9J7N9J56J85Q8J4J07Jq4m8o4j47n9j4k7P2P6J01J23J74oL5N6j07j11
$$ y = [-1309, -1393, -1215, -1455, -1265, -506, -34, 182, 751, 1101, 1041, 901, 680, 72, -234, -546, -1158, -1365, -1106, -985, -937, -148, 618, 925, 1330, 1898, 1877, 1705, 1340, 704, -39, -512, -1263, -1912, -1888, -1820, -1838, -1282, -464, 141, 565, 1271, 1647, 1591, 1564, 1233, 638, 136, -381, -1053, -1314, -1302, -1377, -1255, -526, 17, 277, 838, 1303, 1313, 1163, 992, 480, -45, -376, -869, -1263, -1242, -1126, -1084, -605, 1, 381, 772, 1198, 1371, 1191, 1129, 777, 242, -140, -565, -1091, -1256, -1172, -1277, -1091, -583, -198, 69, 515, 893, 880, 942, 945, 679, 463, 254, -107, -304, -288, -409, -543, -366, -111, -93, -17, 253, 289, 161, 186, 143, -80, -143, -193, -358, -342, -322, -409, -261, -37, -8, 29, 265, 347, 291, 338, 419, 346, 295, 268, 132, 73, 8, -137, -214, -286, -337, -488, -406, -287, -389, -238, -22, 96, 157, 337, 526, 496, 496, 496, 333, 201, 80, -155, -261, -289, -470, -458, -379, -362, -303, -147, 38, 126, 140, 247, 248, 164, 116, 52, -95, -154, -168, -195, -123, -47, 54, 177, 351, 345, 380, 436, 329, 218]
2664B18j16j33k73p4o3j15k8M0R2J50J63J43J04J25N1P7Ln0j05r2K8q2j14j3N0
2689a4j05M8K8P4J5m6Q3oQ1j9p4K0l5j13n3k9j60j17R2m7m5J53N0J24J36J94N8
2716B93Q2R1o7k6M5j89k32nj33j53J1Q8L9L5K00O1P5J37kj94l1k06k92jj34j84
2742f92K2J64L9J18L85K61J94K05J32k3r8n2l01l20q4l45j82M6j9r3K18K16J02
2765a07J19L54n9o7P4r1k33n2j02k08N9L9L9J12K95MR7K45Lj77M9m0l61j90Q8
2790a10l25j35J53j3r6K35K09n2K64J87j17R8K12j93j11K03j36l78Q9J54l26n6
2812b44J54k19j18K68j03o6K43J15j73K96K26l01J07K97l36j98K80j86l52K06
2832a04P6l44J20L34j34N1M63k04j16L11j85l53K3l3n00P9J90l12N6N63N6l6O00
$$ y = [218, 102, -31, -304, -378, -441, -556, -584, -544, -452, -302, -139, 4, 108, 233, 284, 361, 364, 314, 209, 117, 145, 63, -51, -64, -14, -119, -71, -43, 31, 46, 0, 83, 77, 158, 139, 65, 85, 50, -63, -116, -145, -305, -422, -330, -377, -422, -269, -219, -95, 41, 235, 293, 375, 466, 399, 373, 418, 229, -3, -8, -141, -294, -283, -195, -156, -121, 79, 140, 215, 352, 350, 156, 125, -81, -373, -374, -508, -692, -670, -506, -467, -349, 36, 297, 491, 696, 828, 805, 707, 655, 354, 34, -50, -395, -577, -531, -550, -643, -425, -209, -107, 12, 366, 307, 240, 314, 223, -10, -62, -164, -372, -313, -274, -235, -123, 172, 176, 273, 518, 521, 344, 393, 353, -8, -198, -110, -435, -570, -417, -430, -526, -291, -82, -134, 130, 317, 200, 298, 510, 317, 206, 409, 273, -105, -16, 138, -188, -244, -90, -309, -427, -159, -262, -328, -85, 30, -143, 153, 379, 78, 185, 482, 146, -52, 228, 42, -310, -104, -28, -372, -252, 82, -52, -1, 462, 258, 142, 453, 268, -85, -62, -95, -595, -516, -326, -638, -582, -19, 37, 1, 601]
2855F01J31j80K11Q8m38k81L2n69m82K55k54l34N36L64r4M86N87p2O2M80k71m08
2877D50O1k86o40P2n1m90K81M18k06J39P52rk16M72n3n74n0m5o63k02J13l44k3
2900a094O32J89l1P99M16j98L40M02n71l02J61n78o46J93k70m46K15L67j95K61
2920c56N76j39M4N13k42l91K16q3o30Q0K27n54O3N99j02L0O82J33l12M12J64n42
2942C88L9O4n63k46K79l92l12M20k2k51M22L75l22J73L74k43j97K40j40l62K73
2963cn4l73K42K47k99P6N23k44j54M44P1m12K07J24m24N5J91l92p3L26k01k50
2985c73L92j3l41K68K42l92M0L17j74j79L52k3l32L25J04l46J64J89k42o2K84
3006B00j33k14K81k0k89K50R7k95j4L24k66j01K59m7k09K70K2k57J54J89k80K7
$$ y = [601, 732, 552, 763, 851, 413, 132, 164, -405, -887, -632, -886, -1220, -684, -320, -414, 72, 659, 587, 649, 1129, 858, 450, 511, 225, -415, -343, -394, -884, -603, -185, -391, -252, 500, 491, 275, 747, 694, 120, 70, 25, -638, -840, -727, -1071, -1094, -462, -273, -304, 495, 911, 713, 1053, 1455, 884, 582, 743, 165, -481, -288, -558, -1004, -789, -422, -617, -356, 220, 81, 125, 638, 396, 5, 221, 138, -492, -412, -185, -739, -676, -77, -179, -149, 533, 666, 354, 766, 930, 388, 427, 491, -72, -318, -39, -431, -743, -323, -345, -596, -174, 201, -121, 52, 426, 183, -14, 226, 86, -276, -3, -57, -430, -188, 59, -240, -164, 359, 115, -39, 405, 476, 64, 271, 395, -29, 26, 217, -175, -248, 78, -123, -373, 19, 6, -335, -67, 175, -217, -177, 140, -34, -213, 139, 116, -216, 109, 213, -133, 31, 220, -22, -84, 200, 67, -147, 134, 114, -175, 75, 172, -123, -137, 187, -79, -180, 79, 32, -177, 93, 115, -142, 12, 201, -79, -52]
3028e2K49j27j57L05o1l56K97J55l27K0J24k71l8J60q5j33J16J2q9K33K24k36
3050c7J85L29j93q7K03k2l07pO7k72r0O0j05K3J33m7L9L06J0j98J76L1l03q0N6
3075a30k14j60J08L3NJ82J86J45K34J50O2J03K8j69k69Lk90k83or3j77Q9J64Q8
3099b11J46K54M2Q2j5j6l08p5k19k40o5j0r6R4L91J36K06K92L15J27N0K8j11k53
3123E44j96l13k21k23l1j24P8J5J42K11J69N1P9jNk81q2r7k02j03j0J1J29J87
3147b63K60L03K64J83L9J40q1k04j96r4k85l30o5j11k04J10Q0R1K09J09J04Q0
3169A39M6r0r9J5j33p2j6k3m9J23J30J07P2J81L2K0J4j4q5m7j55j68n9m1j98J0
3195c60J50m1J7K15O3J1M7J36j22rql5k9n9J3p1Q5r1r7J63Qj28P2J11r6QJ11k6
$$ y = [-52, 197, 70, -87, 218, 157, -199, 98, 253, -74, -54, 70, -201, -239, -79, -164, -297, -181, -169, -258, -25, 199, -37, 148, 477, 284, 197, 400, 378, 71, 64, 131, -141, -231, -171, -276, -253, -120, -167, -128, 178, 188, -10, 166, 197, -106, -186, -130, -344, -504, -396, -363, -358, -176, 10, 155, 389, 539, 601, 704, 732, 563, 294, 297, 7, -276, -282, -375, -552, -463, -299, -211, -65, 189, 231, 313, 298, 282, -26, -101, -320, -560, -625, -635, -731, -637, -246, -110, 96, 388, 703, 830, 880, 908, 797, 544, 348, 35, -186, -409, -440, -564, -486, -471, -329, -118, 51, 102, 181, 180, 185, -96, -178, -275, -477, -580, -590, -579, -450, -263, -3, 300, 564, 747, 786, 926, 845, 641, 445, 351, 66, -264, -329, -440, -644, -534, -454, -363, -154, -45, 59, 139, 185, 95, -4, 11, -122, -194, -210, -233, -282, -159, -29, 78, 150, 331, 363, 383, 397, 383, 298, 251, 96, -72, -131, -172, -370, -360, -210, -251, -234, -19, 44, 55, 102, 238, 116, 107, 99, 64, 35, -24, -11, -82, 3, -88, -185, -22, -14, -142, -70, 41, -55, -47, 64, 38]
3223C8o7R8K9j09J43m4j29L5Jn1j6J42n7j00K80m2j07R3J20j54j58J55j49j60
$$ y = [38, -29, 69, 98, -11, 132, 88, -41, -6, -5, -56, -72, 70, 13, -87, 193, 151, 44, 137, 257, 103, -55, 100, -49, -209]
$$ [...]
8191D70
##END NTUPLES=NMR FID
##END=
